##TITLE=1H_Pr NCS-Hex2
 200.13MHz, CDCl3,
 8 sc
 
 18.8.2025
##JCAMPDX= 6.0         $$ Bruker NMR JCAMP-DX V2.0
##DATA TYPE= NMR FID
##DATA CLASS= NTUPLES
##ORIGIN= UXNMR, Bruker Analytische Messtechnik GmbH
##OWNER= pz
$$ XWIN-NMR		Version 3.5
$$ Mon Aug 18 14:08:06 2025 Russian Standard Time (UT+4h)  she@DPX200
##.OBSERVE FREQUENCY= 200.1308
##.OBSERVE NUCLEUS= ^1H
##.DELAY= (6, 6)
##.ACQUISITION MODE= SIMULTANEOUS
##.ACQUISITION SCHEME= undefined
##.AVERAGES= 8
##.DIGITISER RES= 18
##SPECTROMETER/DATA SYSTEM= spect
##.PULSE SEQUENCE= zg30
##.SOLVENT NAME= CDCl3
##.SHIFT REFERENCE= (INTERNAL, CDCl3, 0, 14.3821)
##AUDIT TRAIL= $$ (NUMBER, WHEN, WHO, WHERE, WHAT)
$$ ##TITLE= Audit trail, XWIN-NMR		Version 3.5
$$ ##JCAMPDX= 5.01
$$ ##ORIGIN= Bruker BioSpin GmbH
$$ ##OWNER= she
$$ F:/spectra/data/she/nmr/H-C/1/audita.txt
$$ ##AUDIT TRAIL=  $$ (NUMBER, WHEN, WHO, WHERE, WHAT)
(   1,<2025-08-18 14:06:56.87 +0400>,<she>,<DPX200>,
      <created by zg, POWCHK disabled, PULCHK disabled
       configuration hash MD5:
       00 E9 B6 7A A2 85 ED C7 34 08 36 98 17 FE 4E 26
       data hash MD5: 16K
       F4 AA 92 73 10 36 D9 AA 7A A1 3F 86 15 22 8E D3>)
$$ ##END=
$$ 
$$ hash MD5
$$ 64 83 91 DA 5B A7 3C 29 5D B8 64 88 7E B5 90 35
##$RELAX= 
##$RELAX= 
##$RELAX= 
##$RELAX= 
##$RELAX= 
##$RELAX= 
$$ Bruker specific parameters
$$ --------------------------
##$DU= <F:/spectra>
##$EXPNO= 1
##$NAME= <H-C>
##$PROCNO= 1
##$TYPE= <nmr>
##$USER= <she>
##$AMP= (0..31)
100 100 100 100 100 100 100 100 100 100 100 100 100 100 100 100 100 100 
100 100 100 100 100 100 100 100 100 100 100 100 100 100 
##$AQSEQ= 0
##$AQ_mod= 1
##$AUNM= <au_zg>
##$AUTOPOS= <>
##$BF1= 200.13
##$BF2= 200.13
##$BF3= 200.13
##$BF4= 200.13
##$BF5= 200.13
##$BF6= 200.13
##$BF7= 200.13
##$BF8= 200.13
##$BYTORDA= 1
##$CFDGTYP= 0
##$CFRGTYP= 5
##$CHEMSTR= <none>
##$CNST= (0..31)
1 1 145 1 1 1 1 1 1 1 1 1 1 1 1 1 1 1 1 1 1 1 1 1 1 1 1 1 1 1 1 1 
##$CPDPRG= <>
##$CPDPRG1= <>
##$CPDPRG2= <>
##$CPDPRG3= <>
##$CPDPRG4= <mlev>
##$CPDPRG5= <mlev>
##$CPDPRG6= <mlev>
##$CPDPRG7= <mlev>
##$CPDPRG8= <mlev>
##$CPDPRGB= <>
##$CPDPRGT= <>
##$D= (0..31)
0 0.7 0 0 0 0 0 0 0 0 0 0.03 0 0 0 0 0 0 0 0 0 0 0 0 0 0 0 0 0 0 0 0 
##$DATE= 1755511616
##$DBL= (0..7)
120 120 120 120 120 120 120 120 
##$DBP= (0..7)
150 150 150 150 150 150 150 150 
##$DBP07= 0
##$DBPNAM0= <>
##$DBPNAM1= <>
##$DBPNAM2= <>
##$DBPNAM3= <>
##$DBPNAM4= <>
##$DBPNAM5= <>
##$DBPNAM6= <>
##$DBPNAM7= <>
##$DBPOAL= (0..7)
0.5 0.5 0.5 0.5 0.5 0.5 0.5 0.5 
##$DBPOFFS= (0..7)
0 0 0 0 0 0 0 0 
##$DE= 6
##$DECBNUC= <off>
##$DECIM= 32
##$DECNUC= <off>
##$DECSTAT= 4
##$DIGMOD= 1
##$DIGTYP= 9
##$DL= (0..7)
0 120 120 120 120 120 120 120 
##$DP= (0..7)
150 150 150 150 150 150 150 150 
##$DP07= 0
##$DPNAME0= <>
##$DPNAME1= <>
##$DPNAME2= <>
##$DPNAME3= <>
##$DPNAME4= <>
##$DPNAME5= <>
##$DPNAME6= <>
##$DPNAME7= <>
##$DPOAL= (0..7)
0.5 0.5 0.5 0.5 0.5 0.5 0.5 0.5 
##$DPOFFS= (0..7)
0 0 0 0 0 0 0 0 
##$DQDMODE= 0
##$DR= 18
##$DS= 0
##$DSLIST= <SSSSSSSSSSSSSSS>
$$ [...]
##$SUBNAM0= <"">
##$SUBNAM1= <"">
##$SUBNAM2= <"">
##$SUBNAM3= <"">
##$SUBNAM4= <"">
##$SUBNAM5= <"">
##$SUBNAM6= <"">
##$SUBNAM7= <"">
##$SUBNAM8= <"">
##$SUBNAM9= <"">
##$SW= 18.0517779522481
##$SWIBOX= (0..15)
0 0 2 0 0 0 0 0 0 0 0 0 0 0 0 0 
##$SW_h= 3612.71676300578
##$TD= 16384
##$TD0= 1
##$TE= 0
##$TE2= 300
##$TE3= 300
##$TEG= 300
##$TL= (0..7)
0 120 120 120 120 120 120 120 
##$TP= (0..7)
150 150 150 150 150 150 150 150 
##$TP07= 0
##$TPNAME0= <>
##$TPNAME1= <>
##$TPNAME2= <>
##$TPNAME3= <>
##$TPNAME4= <>
##$TPNAME5= <>
##$TPNAME6= <>
##$TPNAME7= <>
##$TPOAL= (0..7)
0.5 0.5 0.5 0.5 0.5 0.5 0.5 0.5 
##$TPOFFS= (0..7)
0 0 0 0 0 0 0 0 
##$TUNHIN= 0
##$TUNHOUT= 0
##$TUNXOUT= 0
##$USERA1= <user>
##$USERA2= <user>
##$USERA3= <user>
##$USERA4= <user>
##$USERA5= <user>
##$V9= 5
##$VALIST= <valist>
##$VCLIST= <CCCCCCCCCCCCCCC>
##$VD= 0
##$VDLIST= <DDDDDDDDDDDDDDD>
##$VPLIST= <PPPPPPPPPPPPPPP>
##$VTLIST= <TTTTTTTTTTTTTTT>
##$WBST= 1024
##$WBSW= 4
##$XGAIN= (0..3)
0 0 0 0 
##$XL= 0
##$YL= 0
##$YMAX_a= 355645
##$YMIN_a= -391718
##$ZGOPTNS= <>
##$ZL1= 120
##$ZL2= 120
##$ZL3= 120
##$ZL4= 120
##$ABSF1= 10
##$ABSF2= 0
##$ABSG= 5
##$ABSL= 3
##$ALPHA= 0
##$AQORDER= 0
##$ASSFAC= 0
##$ASSFACI= 0
##$ASSFACX= 0
##$ASSWID= 0
##$AUNMP= <proc_1d>
##$AZFE= 0.1
##$AZFW= 0.1
##$BCFW= 1
##$BC_mod= 2
##$BYTORDP= 1
##$COROFFS= 0
##$CY= -3
##$DATMOD= 1
##$DC= 2
##$DFILT= <>
##$DTYPP= 0
##$F1P= 0
##$F2P= 0
##$FCOR= 0.5
##$FTSIZE= 0
##$FT_mod= 4
##$GAMMA= 1
##$GB= 0.15
##$INTBC= 1
##$INTSCL= 1
##$ISEN= 128
##$LB= 0.25
##$LEV0= 0
##$LPBIN= 0
##$MAXI= 10000
##$MC2= 0
##$MEAN= 0
##$ME_mod= 0
##$MI= 1.114404
##$NCOEF= 0
##$NC_proc= 0
##$NLEV= 6
##$NOISF1= 3.799351
##$NOISF2= 2.8
##$NSP= 1
##$NTH_PI= 0
##$NZP= 0
##$OFFSET= 14.38212
##$PC= 1
##$PHC0= -1556.569
##$PHC1= 6.592279
##$PH_mod= 1
##$PKNL= yes
##$PPARMOD= 0
##$PSCAL= 0
##$PSIGN= 0
##$REVERSE= no
##$SF= 200.129724274929
##$SI= 16384
##$SIGF1= 3
##$SIGF2= 2
##$SINO= 400
##$SIOLD= 16384
##$SREGLST= <1H.CDCl3>
##$SSB= 0
##$STSI= 0
##$STSR= 0
##$SW_p= 3205.1282051282
##$SYMM= 0
##$S_DEV= 0
##$TDeff= 0
##$TDoff= 0
##$TI= <>
##$TILT= no
##$TM1= 0
##$TM2= 0
##$TOPLEV= 0
##$USERP1= <user>
##$USERP2= <user>
##$USERP3= <user>
##$USERP4= <user>
##$USERP5= <user>
##$WDW= 1
##$XDIM= 8192
##$YMAX_p= 0
##$YMIN_p= 0
$$ End of Bruker specific parameters
$$ ---------------------------------
##NTUPLES= NMR FID
##VAR_NAME=  TIME,          FID/REAL,        FID/IMAG
##SYMBOL=    X,             R,               I
##VAR_TYPE=  INDEPENDENT,   DEPENDENT,       DEPENDENT
##VAR_FORM=  AFFN,          ASDF,            ASDF
##VAR_DIM=   8192,          8192,            8192
##UNITS=     SECONDS,       ARBITRARY UNITS, ARBITRARY UNITS
##FACTOR=    0.0002768,     1,               1
##FIRST=     0,             0,               0
##LAST=      2.2672688,     0,               0
##MIN=       0,             -391718,         0
##MAX=       2.2672688,     355645,          0
$$ Real data points
##PAGE= N=1
##DATA TABLE= (X++(R..R)), XYDATA
0 0 0 0 0 0 0 0 0 0 0 0 0 0 0 -8 8 -8 8 -8 11 -16 16 -19 24 -28 32 -40 44 -48 56 -66 75 -86 98 -110 124 -139
36 -139 156 -173 195 -216 240 -267 294 -325 360 -398 439 -484 533 -587 647 -714 786 -869 963
55 963 -1066 1186 -1327 1492 -1689 1929 -2228 2615 -3136 3875 -5002 6913 -10786 21638 -117501
70 -117501 -391718 -32772 283610 105885 -192687 -130307 81230 110772 23069 -888 -57543
81 -57543 -117481 -14488 151839 86900 -136004 -147243 100733 192085 -19024 -172133 -62392
92 -62392 74086 64539 -1759 -21257 -23698 -12936 55275 83236 -38435 -132714 -26102 107335
104 107335 53428 -68375 -45201 50887 32651 -28457 -3511 6139 -51513 -34335 63612 70783
116 70783 -34520 -66727 34061 73591 -27593 -73933 9275 45611 -23756 -38435 53464
127 53464 67630 -59491 -91438 48738 94462 -43813 -111928 11025 112026 32519 -68856
138 -68856 -25265 42476 9757 -27389 -4519 5463 -19008 -7660 43916 34352 -40171 -46697 20733
151 20733 32642 -18554 -33665 5866 31667 8967 -4900 13175 834 -30433 -9617 27695
163 27695 8560 -32121 -13306 39578 25690 -31524 -23378 17806 3639 -24869 -6877 23238
175 23238 13440 -13695 -67 25522 2015 -25578 -6675 11846 -3484 -12563 11624 26041
187 26041 -9674 -32009 9647 31653 -14951 -45222 -4259 44078 22330 -28226 -16434 25974
199 25974 16304 -15223 -13497 86 104 -1570 11089 14403 -11091 -18076 8724 13481 -11596 -20750
213 -20750 -2307 16348 10531 -3582 3259 6044 -7935 -4853 9174 2174 -15768 -10144 19210
226 19210 22147 -12905 -21942 6141 12506 -7873 -16102 -1569 12434 4939 -1879 7062 4477 -7765
240 -7765 -2736 4631 -297 -6311 -1851 10101 6741 -7964 -3695 6115 -3242 -12510 -5188 8167
254 8167 7886 -6671 -3631 14579 7979 -9812 -7056 3572 3537 -3742 -2665 6840 3922 -5443 244
269 244 3247 -5685 -8225 -2956 4063 4605 -2135 686 7252 1373 -2665 418 -721 -2891 -2247 4186
285 4186 8450 -2741 -8857 3654 7278 -5517 -12355 -4169 8168 5827 -5156 -956 6470 2152
299 2152 314 -581 -3901 -2470 1569 5552 3990 -5002 -3908 5387 2597 -6296 -8297 -2721 5826
314 5826 3067 -3620 1438 4474 304 387 869 -1475 -2888 -1203 5770 5777 -4754 -4190 3788 1818 -3887
331 -3887 -6472 -3198 3514 2420 -686 1608 804 277 2811 -268 -2679 -980 339 4703 2514 -4104
347 -4104 -1098 3103 103 -3950 -5575 -1057 3625 -528 -1243 2771 874 451 2240 -458 -1692 -968
363 -968 1299 4156 682 -2638 910 965 -1026 -1558 -3831 -2309 1173 182 1806 1875 -1876 -218 2947
380 2947 1981 -681 -4017 -739 6382 2895 -2717 -1870 -909 875 677 -3096 -3648 -2113 601 5225
396 5225 2039 -4093 -1508 2146 3171 1820 -3203 -2842 3068 4314 2465 -1610 -4777 -1198 2108
411 2108 772 -1360 -4881 -2799 5208 4696 -1510 -2966 -1846 2107 4138 262 -1355 -1377 -119 4604
427 4604 3365 -3355 -4897 -2069 1568 3049 -2289 -4788 -106 2574 3609 1210 -3818 -2412 1324
442 1324 2930 4342 -546 -5461 -279 5386 3913 -2664 -8349 -3174 5701 4257 -2331 -6191 -3018
457 -3018 5941 6511 -2427 -5380 -1753 3569 5991 648 -3654 -1859 993 3954 2376 -5049 -5936 -517
473 -517 4002 3754 -3137 -6432 1024 6038 2017 -3199 -3922 1886 5210 180 -1162 1016 -346 -690
489 -690 320 135 -579 -3007 -1945 2463 1198 -1629 -773 -551 865 1390 -519 1111 1556 -2060 -213
506 -213 4085 2626 -2213 -5216 -410 5085 57 -5477 -2890 1308 3844 1451 -4296 -2611 1902
521 1902 3027 1937 -1573 -2300 1884 2894 980 -397 -2888 -1879 1929 1272 -1220 -2829 -1744 2529
537 2529 2018 -1807 -1465 -173 1915 2790 -1354 -1573 2503 2236 -972 -1542 -438 1788 150 -2978 -1391
554 -1391 504 514 1428 -1813 -3176 1406 3235 1410 -1362 -3351 1462 5439 1414 -3445 -3259 1088
570 1088 5022 908 -5642 -3661 1254 3377 988 -3312 -2990 986 2526 3018 -594 -4533 -19 4937
586 4937 2951 -1315 -3657 -1303 3404 1866 -1981 -3010 -1770 1433 2155 -1118 -1644 -913 -217 3010
602 3010 1964 -1738 -1300 984 2473 1770 -1615 -1267 1027 -302 -588 -166 -964 -1076 -827 -68 1829
619 1829 506 -2059 -766 232 2011 2511 -1376 -2290 1507 2904 1536 -2125 -3650 431 3122 247
635 247 -2418 -2851 -61 2324 210 -1228 -147 -688 556 2849 604 -1477 -1287 842 3282 615
651 615 -3211 -1676 771 945 -132 -1896 -844 222 162 945 462 -2015 -662 1854 1936 869 -1413
668 -1413 -1259 1782 1147 -983 -713 -938 -136 373 -232 -68 -755 -1637 540 1265 31 -80 -511 170 2245
687 2245 1121 -760 -655 -597 1167 1439 -1777 -2261 -330 1031 890 -1500 -1853 647 767 63 777 -279
705 -279 -119 1271 882 734 -199 -1390 124 1080 41 -617 -1223 -730 676 27 -597 -460 -1119 411
723 411 1737 87 -600 71 639 1932 175 -1850 -148 870 162 -439 -1150 -765 658 -338 -105 -334
741 -334 -918 626 1174 28 222 170 -29 1478 690 -829 -215 -301 211 345 -983 -696 194 -291 302
760 302 -515 -1159 461 845 261 205 -668 361 1622 52 -672 69 90 468 121 -1383 -492 282 -209
779 -209 -182 -1384 -433 910 270 14 403 -66 782 961 -413 143 448 -244 253 -15 -715 -2 -314 -505
799 -505 369 -785 -605 397 292 212 293 -40 616 797 -110 140 219 -171 571 -339 -393 -133 -564 -99 75
820 75 -794 -164 267 -75 530 64 -211 871 648 -346 374 -98 34 187 -605 -116 11 -875 -379 -57
840 -57 -281 326 -362 -309 704 336 -58 526 -200 381 795 -256 -15 -202 -167 239 -305 -1003 -67 24 -228
861 -228 138 -416 -201 555 128 430 576 -197 79 783 -14 205 -64 -707 148 167 -175 -195 -835 -441 599
882 599 -247 -54 -74 -132 843 690 -216 313 156 -357 566 221 -409 -382 -981 84 791 -964 -899 -485 558
903 558 826 -409 -725 609 740 154 573 -95 -231 294 141 300 25 -1009 -418 594 281 -323 -1138
922 -1138 -251 1090 282 -423 -105 -166 435 1110 -33 103 -40 -120 633 639 -456 -595 -837 -268 1131 -236
942 -236 -1425 -961 444 1560 317 -1426 -259 1194 457 71 -427 -591 411 42 106 446 -1300 -1399
960 -1399 425 1370 259 -1548 -1568 1525 2162 -676 -1480 -279 1362 1190 -623 -928 288 7 -25 551
978 551 -279 -1108 -1113 -95 1427 144 -1791 -725 1149 1276 312 -1554 -592 1756 910 -134 -552 -499
996 -499 527 198 -381 213 -498 -1099 -295 1078 634 -540 -1641 232 2170 488 -1303 -1092 812
1013 812 1996 -84 -1779 133 515 -30 5 -27 -658 -1022 -796 1291 1380 -1149 -1566 953 1996 838
1031 838 -1622 -1070 1801 1701 -338 -1345 -580 373 404 -510 -302 58 -1035 125 1086 40 -782 -879
1049 -879 615 1443 358 -1131 -403 355 1141 474 -1118 -371 686 140 -403 -496 -354 -24 -145 -145 891
1068 891 -53 -647 44 702 1160 -127 -1321 -55 1335 188 -945 -748 245 455 -740 -408 323 -404
1086 -404 -587 430 817 56 -621 -441 1450 1067 -854 -620 430 842 267 -978 -633 373 -170 -366
1104 -366 63 -294 -27 -27 243 638 -286 -712 724 844 56 -113 -207 36 521 -238 -396 -231 -425 389 53
1125 53 -616 -38 263 -97 344 -100 224 358 -193 203 859 -135 -508 -176 14 122 -295 -703 173 219 -487
1146 -487 27 91 226 -11 -292 501 742 -278 251 558 226 -87 -628 60 376 -219 -734 53 -84 -397
1166 -397 6 -60 195 52 -226 618 659 -390 -43 478 304 228 -277 -187 232 -234 -369 514 47 -470 15
1187 15 60 208 -184 -147 544 129 19 420 -134 137 151 -227 142 -61 -806 34 261 -454 -307 -56 68
1208 68 -83 -290 77 687 -129 -100 647 379 -4 27 -66 318 -346 -582 382 255 -453 -156 112 -54 91
1229 91 -376 330 765 -424 -63 555 254 188 -169 149 353 -312 -362 207 -112 -261 -210 31 70 192 -367
1250 -367 504 265 -166 174 419 236 313 -8 -115 319 -385 -124 198 -194 -166 103 -146 218 -317 -320 378
1271 378 -35 -223 257 232 106 46 -260 393 196 -452 6 32 -388 -413 -54 -189 34 -396 -74 551 -112
1292 -112 -182 451 39 52 296 94 361 -14 -359 26 -91 -480 -113 98 -103 61 -460 56 362 -277 17
1313 17 356 167 362 -19 121 391 -271 -265 87 -198 -246 90 -273 -253 -95 -482 4 204 -189 223 202 144
1335 144 240 103 -83 209 -160 -145 261 -410 -137 -89 -329 27 -94 -111 236 -118 -205 140 234 41 64 118 115
1358 115 357 -235 -105 239 -261 9 -30 -378 -7 -194 -252 353 -144 -24 213 -182 -68 49 -141 189 87
1379 87 49 240 110 -62 125 58 -363 -79 -79 -20 88 -325 -195 411 30 405 -12 -75 375 149 56 208 -38
1402 -38 -221 -27 -194 -151 232 -476 24 199 -433 52 -167 -119 125 -94 156 182 28 335 67 37 -51 28
1424 28 -151 49 -248 -356 -73 14 -91 191 -84 -112 200 231 9 174 -62 133 180 -163 -72 -110 -136 -32 -47
1447 -47 -147 213 -165 -349 47 182 136 79 80 148 76 60 51 -1 141 157 -115 -159 -24 -133 -149 -61 -215 68 20
1472 20 -262 352 158 -87 65 -81 -26 318 -108 41 285 9 -114 -189 -282 -84 160 -448 10 -90 -148 115
1494 115 94 68 75 -138 237 298 249 16 208 -60 -165 92 -454 36 -193 -81 190 -322 1 177 -388 -21
1516 -21 340 172 -66 156 134 376 -47 -226 130 -72 78 -208 -72 14 -97 -181 -58 66 -161 -71 44 300
1538 300 97 -151 -71 304 233 -127 10 98 141 36 -403 -77 135 45 38 -45 -97 3 62 -56 302 52 110 163
1562 163 -56 20 21 -104 -116 204 -260 -104 -223 -52 -40 -70 -294 143 128 -78 168 83 376 189 59 20 44
1585 44 -93 -105 -203 -86 116 -197 -149 -100 -9 -122 130 46 63 9 -270 437 168 -264 70 107 116 -2 -153 167
1609 167 -4 -229 -164 361 -208 -216 -58 19 121 31 -24 428 23 -164 160 49 34 77 -178 33 -12 -207 -76
1632 -76 235 -219 12 126 58 61 -69 -20 353 -122 -114 -78 107 116 35 -20 139 -106 -395 -24 -95 -42 -53 16 78 -56
1658 -56 202 222 -19 113 -16 145 3 20 -43 -189 179 -96 -129 100 -337 -502 16 99 106 -44 -178 112 114
1681 114 20 83 172 -4 50 -33 -128 -140 -353 77 247 28 -186 81 217 131 -131 -51 269 121 -69 20 179
1704 179 -23 38 66 162 230 -166 -99 50 -82 -132 -15 -84 92 -130 235 27 -266 -20 329 166 91 -28 -79
1727 -79 -90 -8 -154 305 11 -226 -99 -194 190 40 -13 86 65 -43 -38 60 -9 67 62 105 174 -61 -146 342 -81 -246
1753 -246 60 -212 35 -140 -108 190 138 -201 -7 100 93 -10 104 211 89 -135 24 -75 -31 3 156 71 10
1776 10 -61 -104 58 -138 36 329 -79 1 230 91 -34 -129 -56 -40 146 -30 -144 -11 -46 -119 -321 -55 147
1799 147 -173 -33 117 -70 -255 -20 -40 204 -6 -70 82 -106 -105 -12 -12 -167 33 -186 77 146 -80 -46 156
1822 156 -73 107 180 123 66 39 -18 50 -344 191 -69 -287 -10 -56 -115 121 -105 -125 206 149 33 106 108 134 109
1847 109 -113 88 83 -149 -102 -70 14 116 -196 -202 156 -68 -330 -96 62 -171 33 -98 163 -78 -212 215
1869 215 23 -111 -42 -85 -137 -58 -123 -112 -122 -168 64 -7 -21 146 -117 93 41 -167 336 261 -55 8 65 86 147
1894 147 -28 -220 -30 -222 -119 -255 54 -186 -33 32 126 193 -101 -117 -117 -81 -20 160 39 320 112 -327 -214
1917 -214 -108 -104 217 -70 11 -40 -86 -90 190 -167 -114 70 90 4 118 17 41 154 -133 43 -184 -152 47 72
1941 72 -140 116 24 -103 8 -30 342 170 -216 103 -18 2 -15 -295 -35 -19 -103 -94 50 31 135 59 174 33
1965 33 156 12 14 -50 63 38 -94 -92 -15 -140 29 34 -61 101 148 -57 109 -48 -98 21 21 -68 -194 102 69 177
1991 177 41 -79 -49 109 2 -159 -124 121 -223 -174 163 63 -45 -78 -127 129 161 146 -66 59 -143 -243
2013 -243 151 -133 234 166 108 246 -213 -141 122 -125 111 170 -63 -8 -32 78 114 -54 -123 130 18 -11 131
2036 131 -127 11 -90 -94 -107 -94 8 16 82 -65 181 -61 214 -169 23 -14 -134 -29 42 -110 -103 -27 -174 -139
2060 -139 -170 -62 19 -109 60 -45 -90 31 17 -165 -36 -21 73 -142 66 -34 -133 -92 -140 -57 -120 -47 2 -163
2084 -163 -168 342 -123 151 120 5 -206 51 155 -97 -12 111 -47 -14 54 16 104 -99 -52 71 129 -10 -26 147
2108 147 76 21 36 -5 -60 -59 -196 -94 115 -34 -15 -58 33 -164 87 -20 75 -116 -36 193 106 17 -53 -20 -5 83
2134 83 165 -32 73 -94 -151 -54 23 -63 -19 -69 -88 -1 55 -25 32 -303 -7 61 -146 -142 -47 45 113 -126 -4 5 31
2161 31 -86 -59 106 -71 10 25 161 30 -69 240 115 6 170 -297 -54 38 -84 -132 -8 -23 36 -14 145
2184 145 -130 -55 54 47 -105 97 120 -41 -162 250 20 -70 128 -111 51 -32 -173 -86 -64 -75 -130 76 -71
2207 -71 11 -202 118 86 189 -68 152 137 8 -19 -113 107 -89 -108 -123 -177 -37 -188 -15 -30 -31 -210 63 88
2231 88 -24 -81 -187 84 -59 160 4 -115 -84 -109 -78 -92 -163 -3 57 -19 72 83 116 78 72 -12 40 130 84 -32
2257 -32 181 138 68 -164 -128 119 72 -156 -44 33 45 -82 -214 -151 157 2 88 -28 57 -20 98 -43 -15 -125
2281 -125 -211 -128 -86 -71 21 -54 -77 222 -1 234 -26 130 57 74 56 131 184 -76 -202 -22 -76 -108 -49 -135 20
2306 20 -70 65 -84 64 -180 14 -174 128 -41 -175 -32 -16 -187 57 -26 49 161 -97 54 68 -89 -19
2328 -19 126 22 -165 114 -51 153 48 -29 10 123 61 28 107 -9 187 -6 118 30 -50 -240 -139 -64 -77
2351 -77 142 -178 80 -110 -75 117 -3 -126 77 -151 16 -79 52 -92 37 -17 -178 -7 -18 130 100 181
2373 181 187 -65 113 3 55 202 116 53 -45 74 -83 -9 -61 -174 34 -214 -124 -99 -58 199 64 -217 79 113
2397 113 -56 -42 87 -130 54 -38 -157 285 140 33 -157 -225 60 88 -79 48 122 142 -26 234 -89 -78
2419 -78 -60 170 -231 56 -48 157 151 -78 -58 -224 -69 -41 49 99 98 23 2 -110 128 87 55 -91 24 -32 -235
2444 -235 -85 -77 -62 29 -13 59 -22 -185 -72 212 -18 -31 -36 -82 -19 157 69 -77 -152 147 86 -16 -24 19 139 -2
2470 -2 -88 -36 -290 -179 -20 160 33 81 -32 83 49 8 98 116 -170 -159 16 -47 69 106 -38 47 39 191 47
2495 47 60 6 -64 118 -178 35 -27 -3 -44 80 73 126 -161 -149 66 -237 41 -180 21 0 29 -107 290 -203
2519 -203 -95 123 -69 -28 120 -13 -129 -151 182 246 -151 84 -30 88 84 116 59 45 115 -12 -11 -127 -63 107
2543 107 184 -12 105 64 24 39 70 -134 -31 -196 83 -53 -186 213 122 18 -180 204 96 20 99 -104 -95
2566 -95 -164 -43 -47 -65 -50 28 53 -26 253 131 20 243 -88 -19 16 -104 -17 213 -86 -6 -13 126 12 24 -211
2591 -211 -116 -4 119 -136 -181 122 88 -227 85 -17 -40 21 28 175 -94 -1 -80 -66 -161 -122 18 -106 0 -32
2615 -32 -24 217 -62 -97 150 151 -60 84 -149 89 -153 -100 -141 94 -74 -68 27 -149 -66 -186 6 78 -225 -41
2639 -41 -85 86 297 -73 70 45 -109 -126 104 -52 142 -103 -61 -169 107 101 202 93 -29 92 41 198 182
2662 182 184 252 199 127 153 -77 -183 259 -183 -98 166 69 -202 115 -21 154 61 123 127 45 32 48 265 -144 55
2687 55 -43 -33 -90 -44 -42 -162 -167 -2 -136 -70 34 94 -156 39 32 112 154 -48 -243 195 -62 -177 -215 42 151
2712 151 30 -125 -92 -19 -38 50 47 93 -57 77 -45 133 -40 -17 -188 -3 -89 -115 -133 64 -35 -153 20 134
2736 134 121 97 -83 250 85 153 46 -50 -19 -69 212 27 58 -48 68 -73 -60 115 -106 -40 -43 106 63 97
2760 97 -24 -215 228 29 49 180 85 56 -130 -158 39 81 -109 -165 -56 -156 -95 93 -46 -12 13 161 29
2783 29 130 81 185 -170 -135 68 -35 -5 -67 -149 -8 -161 -329 76 14 -84 140 -84 18 -103 25 -31 144
2806 144 -81 173 -37 32 1 -60 -351 -173 66 -60 119 42 -56 107 -172 168 24 -35 -12 -4 -23 41 -57 -118
2830 -118 0 81 -133 -136 -88 -70 283 -134 44 -141 -209 32 13 -78 118 -130 182 48 -95 37 -112 -157 -30
2853 -30 110 -31 34 -17 -80 11 194 -132 -84 67 -147 -1 -112 -67 -97 -207 164 6 -118 46 -175 -96 -64
2876 -64 -133 2 128 142 60 137 99 93 -28 13 157 101 -25 82 100 -43 -69 97 46 233 -60 -20 -81 56 -107
2901 -107 -65 -84 111 191 133 31 -59 -143 -90 12 -46 42 -10 60 44 -22 22 -19 -178 -23 -128 -149 141 346 42
2926 42 142 -62 -179 101 -74 -116 201 -97 -92 -17 -181 24 48 -254 75 -96 -40 -22 147 60 -81 -47 221
2949 221 -91 -51 -66 -103 -113 -49 -95 -58 -105 55 -7 208 204 213 11 35 47 -167 -108 139 -141 -53 294 81 -116 -127
2975 -127 -83 -83 2 -266 26 -14 -72 -6 -87 -129 -65 110 85 62 -81 -3 62 -99 -104 -14 37 85 32 -79 -84 99 -214
3002 -214 164 -233 -124 258 -46 -170 132 -203 -32 1 20 18 0 -193 -216 -116 -49 73 118 81 -98 -159 51
3025 51 9 -124 -3 149 -16 168 15 122 -106 -114 58 -117 20 -22 -233 -13 131 145 -122 46 150 -8
3047 -8 221 -135 -73 -77 -41 147 104 -79 -176 192 28 112 -159 -71 3 85 122 190 172 -169 141 91 -157 47 -195
3072 -195 -71 54 23 -131 119 89 116 -56 17 -80 73 39 -72 -51 121 34 -175 73 -168 53 114 -72 -154
3095 -154 207 -276 -91 26 -40 -162 136 -93 58 -140 -31 59 179 -16 -59 -185 -3 112 68 42 90 -29
3117 -29 -108 107 -130 99 98 27 -93 -14 -17 35 11 -98 276 264 -8 255 143 -133 -101 131 -161 113 208 -95
3141 -95 161 -25 -42 -37 -68 198 -45 -61 146 32 22 257 -129 -173 -33 -132 -199 -114 2 159 -128 163 513 -10
3165 -10 195 199 174 155 124 -108 57 111 -72 -34 145 -51 21 165 -64 36 119 37 76 -25 -97 47 58 212 -93
3190 -93 -48 -59 27 -41 293 -184 63 242 148 -51 109 -44 132 50 -141 -62 142 63 99 2 141 -24 131 -17
3214 -17 236 75 53 -66 156 12 -96 -115 40 -31 -94 -169 125 -112 54 -211 44 122 208 -222 40 217 -10
3237 -10 131 -17 48 7 -6 58 26 -39 65 178 116 150 -114 267 53 -72 94 13 -101 19 -14 -12 204 66
3261 66 100 -193 -216 -84 22 -3 17 204 101 58 144 -18 7 -68 -23 -82 -298 -87 31 -116 55 29 -59 32 167
3286 167 18 83 52 114 23 182 102 116 -132 -140 -64 120 24 96 53 231 153 -171 -52 -5 27 80 183 -194 210
3311 210 231 117 152 -58 82 28 -186 13 -85 -143 -15 -65 -242 66 -24 90 115 -71 19 -95 -70 160 -221
3334 -221 72 1 265 -117 -88 -113 -88 -98 -62 -5 21 47 -87 213 23 -165 171 26 17 50 86 113 -107 -71 48
3359 48 -71 102 -75 -120 123 264 -120 -53 30 82 17 -94 -132 -11 -211 73 161 28 -25 64 -76 98 -159
3382 -159 54 40 -109 68 40 -232 52 -81 23 77 -26 -51 -120 198 -108 45 -117 61 -107 -176 -138 -11
3404 -11 -101 41 81 -69 50 53 -146 28 -15 -82 184 233 8 55 -151 -79 -17 30 -118 105 -258 14 -10 -56 98
3429 98 -1 -125 -97 -107 -246 15 -21 -114 144 153 -87 50 -155 -86 102 -107 -28 29 121 41 -125 -185 -33 -121 -101
3454 -101 -134 39 153 21 -34 51 133 222 27 -67 244 149 67 100 44 34 50 99 -96 40 -183 -42 -28 -74 -24
3479 -24 102 -99 -12 199 -27 35 10 -260 159 101 60 -4 55 36 94 222 -222 39 -21 95 96 -13 -276 25
3503 25 -98 52 -87 73 -28 -315 -12 56 28 -64 82 -112 192 -3 -85 0 -11 227 -19 101 74 -2 9
3526 9 -3 39 228 -48 147 -63 143 -74 -14 -117 -31 -136 108 81 15 -46 -195 -1 212 -67 123 38 -67
3549 -67 78 122 34 184 -20 -226 -61 32 -25 55 23 -12 -48 45 -179 -92 -138 -18 21 -162 12 -51 47 -173 -111
3574 -111 78 -152 276 -9 154 83 47 -11 122 -82 -59 -104 -43 -134 11 39 107 208 -8 18 -188 77 129 127
3598 127 144 99 -41 -58 49 136 -89 -23 -145 -5 -106 -42 126 -117 -119 -148 -235 -115 -173 48 -7 190 137 72 -120
3623 -120 -128 12 -57 -113 -121 -147 32 114 46 83 -28 106 -103 -34 -75 -149 -18 115 22 -140 134 54 -92 87 49
3648 49 -96 -154 -21 -243 -53 46 18 -32 43 138 -232 14 -25 71 -97 269 97 205 -153 -56 117 156 -199 -87
3672 -87 116 -20 -100 -36 -40 163 -160 -75 25 32 -35 161 119 51 -141 -83 -117 -16 48 -117 -35 153 -95 -94 136 -133
3698 -133 -110 67 -62 -48 40 198 -126 94 -88 141 133 179 -120 92 49 -22 169 -91 86 39 -145 -203 -118 -64
3722 -64 88 63 32 -175 46 -123 -41 -21 -65 75 -159 -46 70 287 -25 -18 -19 -66 60 -144 91 26 98 -8
3746 -8 -35 241 -83 42 25 -206 -143 -16 -181 -61 -33 -140 -214 -137 -55 153 -183 66 26 58 -238 21 26 3 214
3771 214 -131 -81 -283 -117 -33 -73 -91 23 -14 -9 146 43 -115 -8 -126 95 -59 -105 38 -15 85 264 -134
3794 -134 136 204 283 167 206 -95 9 104 -179 12 -203 -56 -34 103 -165 -200 -3 -48 109 -24 55 269 92
3817 92 38 -177 -209 193 147 58 -164 24 58 187 101 91 -75 -21 -37 48 -227 6 -176 121 53 -145 59 133
3841 133 -25 7 23 -48 31 -25 -18 -130 -10 -130 86 19 -149 -40 -48 -123 26 -186 127 91 -21 -204 33 -32
3865 -32 -73 -13 -26 -84 44 20 -14 17 -21 31 2 -75 297 -86 14 -77 41 122 -31 115 209 145 98 -104 -147 96
3891 96 96 114 63 17 31 132 -142 -98 -37 80 16 60 -40 59 175 -30 93 6 22 -82 -19 -199 -24 89 10
3916 10 48 184 -24 60 -90 -37 166 -35 93 57 157 -140 118 83 -34 8 150 59 127 -26 -8 -124 -54 118
3940 118 59 -144 142 150 6 31 42 -104 -9 114 11 161 -65 -27 6 -65 166 307 61 -153 -188 23 -26 -111
3964 -111 -155 -93 74 -29 45 39 -21 -8 -60 -13 3 136 -43 -12 151 -157 -158 -106 -19 -144 158 85 -3 -13 57 123 107
3991 107 51 115 75 51 31 -70 40 25 -7 -58 145 173 157 49 -20 188 -18 193 78 133 -174 -200 71 188
4015 188 160 -57 31 19 -124 -246 -33 18 78 7 -89 12 -23 -9 48 -49 -237 56 -6 32 262 79 92 -25 -130
4040 -130 -137 18 255 174 101 41 -55 97 -95 -38 68 -9 73 -15 24 -231 15 -233 -5 0 219 -102 -122 11 -152
4065 -152 -97 -11 209 -13 -153 -53 -95 11 81 -138 62 13 -52 127 99 140 -16 -23 64 68 -20 -23 -222 -255 -4 62
4091 62 -18 65 -38 18 -1 8 -14 116 78 140 30 172 -118 -16 80 147 -129 50 -62 41 6 109 -86 88
4115 88 162 37 62 -43 11 167 14 69 -85 -136 268 147 -116 -50 26 -90 46 -41 162 -157 -65 -58 -179 -88
4139 -88 145 152 146 281 -67 151 184 -14 -38 -41 -148 -147 -81 -199 -203 -42 3 19 -102 65 -20 32 -85 -211 96 -173
4165 -173 214 -23 -48 -53 -91 -105 106 28 33 39 -30 136 65 -91 72 -136 -146 22 35 29 -6 -215 -65 -5 -49 104
4191 104 -4 118 -357 27 1 -20 189 24 -61 -18 -45 6 160 138 -31 147 45 73 43 95 48 52 32 -29 -185
4216 -185 -74 -111 -85 -28 41 -57 79 -63 72 -110 42 47 -102 260 213 -79 -71 131 103 -10 -82 3 201 286 -55
4241 -55 67 299 -74 46 27 61 -84 -303 30 -205 -103 85 46 74 -23 -220 -256 -54 -228 83 101 -88 -27
4264 -27 -111 -203 31 46 121 -30 -193 136 -44 -162 -13 -103 42 4 18 29 -181 90 60 28 84 -246 1 149
4288 149 69 208 47 -129 -182 -98 136 -24 -7 -10 -204 -15 34 2 46 187 15 79 -119 163 -78 62 52 -27
4312 -27 -130 83 54 169 -97 -35 -245 15 29 -115 -119 128 104 -152 -162 -187 -67 -119 -87 -156 -91 -6 -132 212 49
4337 49 153 18 188 90 62 190 49 -21 127 50 -114 -159 175 120 -33 -131 19 73 -52 198 -7 67 8 284
4361 284 68 2 87 95 -117 55 88 15 89 75 -182 145 -62 -129 210 37 -158 -165 153 -189 57 45 26 -95
4385 -95 -54 -50 4 35 0 -79 88 -158 -265 75 -330 -115 -172 40 -150 86 10 -17 -26 -39 -91 -48 -55 60 -110 26
4411 26 32 142 -223 156 18 132 -42 50 -16 -215 57 155 71 143 -47 -92 -33 -41 -157 -90 12 -99 -123 78 104
4436 104 -249 -16 55 89 -122 11 121 50 23 101 -45 -48 82 105 136 214 24 127 72 85 89 117 38 32 -41 56 -5
4463 -5 -87 156 -10 14 -3 -288 -66 -124 -28 90 -11 177 -23 43 140 181 214 37 -84 -57 100 131 7 -117
4487 -117 9 79 -111 -49 23 -98 -44 66 65 -27 67 -194 -51 -172 117 21 -109 43 121 113 -182 -74 -155 49
4511 49 193 -100 -8 -147 11 -18 195 -48 -183 15 -68 -5 -20 -11 113 111 152 -116 14 -53 -89 112 -60 -73 -127
4536 -127 -13 -172 -137 -220 67 52 -10 2 10 120 76 -46 110 -181 -21 150 -19 -151 36 -24 34 -68 55
4559 55 101 -76 -49 97 157 46 38 -109 47 -62 -140 35 161 -42 -123 71 -104 106 -140 104 1 18 -16
4582 -16 80 19 10 82 50 107 -51 -14 131 65 75 46 -25 -39 95 -60 -91 41 -97 70 -48 24 -55 -58 86 -261
4608 -261 94 -80 -152 -159 -2 -59 16 63 196 -114 -163 165 -32 104 -49 24 4 129 14 -61 -35 -98 179 37
4632 37 -246 114 76 126 -63 -34 -15 328 -189 -42 -9 -15 118 -43 157 -77 -196 -92 -49 -144 327 -109 52
4655 52 53 46 -191 -29 -33 -88 26 8 101 -153 -83 -98 234 -267 -117 -45 93 77 16 77 -12 190 244 -66 27 -58 -123
4682 -123 -155 124 40 -33 -89 -112 -79 -113 -207 -141 259 0 -63 -66 46 123 -26 137 -28 32 -18 -82 163 81 -107 -151
4708 -151 -83 141 79 131 155 227 204 48 -41 10 54 5 23 10 156 -33 59 51 30 -8 -59 -158 -310 -71 -98 -163 97
4735 97 90 7 -87 -140 -37 129 -48 -78 -129 -48 -40 -54 76 149 -31 286 207 -179 -29 70 321 77 138 47 93 5
4761 5 -148 144 127 -132 98 -205 -89 14 156 -47 -50 40 28 -153 -77 -35 -106 -41 113 166 -52 127 -95 37
4785 37 46 -118 10 72 -136 -267 -135 -108 230 155 148 -155 -66 197 -33 -48 -146 146 -11 7 239 -64 -74 -39 -35
4810 -35 -23 106 -35 -99 -120 227 129 -218 -84 122 186 79 80 -148 28 -157 -10 -56 -331 40 83 -240 -80
4833 -80 -143 92 -43 104 65 36 6 -145 18 175 90 -245 61 -119 -136 -100 136 -198 -117 -105 -2 57 -101 33
4857 33 33 -59 -85 -90 -54 -24 30 -163 -34 119 77 -15 -135 -135 127 -67 60 29 -169 37 -103 132 91 -40 -72 43
4883 43 79 89 -57 75 -71 66 -75 -208 -14 12 -217 -58 234 -8 -2 228 -187 3 -5 -117 -137 -128 -37 20
4907 20 -17 -236 -59 51 45 -2 102 -7 -135 69 -85 50 -78 93 95 -142 24 -4 -10 8 267 -59 42 145
4931 145 109 -14 14 69 42 262 63 161 50 60 87 38 -148 67 13 6 -40 -44 52 -15 158 41 -255 -73 13 202
4957 202 -17 53 48 20 -152 92 -10 -34 -46 -38 -63 -154 -55 -92 31 98 -70 -92 29 -135 -212 133 -98 0 -82 22
4983 22 -113 150 -79 -128 -60 -111 -57 65 70 -107 -128 44 203 56 347 97 49 -38 79 98 46 99 -21 -181
5007 -181 -83 230 -52 -99 8 144 -56 51 -171 153 1 -68 216 -67 162 -13 26 40 -44 -44 -79 -18 -114 15
5031 15 199 56 -40 60 -174 -98 105 -63 -9 144 -206 -22 39 -104 152 -54 185 -32 -18 111 175 -98
5053 -98 107 -87 -24 -146 -32 68 50 139 29 65 71 60 112 161 93 -26 -47 -9 83 -101 32 -171 -26 139 -216
5078 -216 241 -25 73 158 76 26 133 -99 75 88 53 11 105 33 -150 -56 42 -171 -113 124 38 -174 -62 -93 -80
5103 -80 -307 -160 -22 37 61 67 127 83 -208 -108 25 97 99 -124 -196 -145 -67 102 278 41 39 26 -96 -17 152 -30
5129 -30 40 -118 -22 -43 -61 31 40 -185 17 138 -32 173 -51 -1 -142 41 97 -128 -265 -161 69 84 -329 130
5153 130 74 -44 -119 146 -282 107 -102 69 -67 -219 -135 -50 -77 133 26 152 10 -253 -56 134 93 103
5175 103 44 126 243 23 55 96 72 235 7 -99 111 -32 -27 -176 261 11 115 -93 -140 147 70 -79 -140
5198 -140 59 268 -51 -125 0 1 23 126 9 6 -228 -23 115 -30 -53 -73 -83 -64 108 -24 258 77 -1 104
5222 104 -151 49 -224 -11 189 -1 141 -46 19 -119 11 -78 -21 13 -172 -52 -164 -12 -11 -35 -60 -32 -59
5245 -59 6 -152 -67 -8 -131 56 -51 -58 151 106 -7 199 -42 -48 32 -157 22 24 -59 -212 -72 -162 51 -148 -10
5270 -10 -6 -230 127 -183 -134 12 -69 -39 101 14 -191 -114 0 -136 92 127 231 -24 115 21 79 -9 116 54
5294 54 84 -20 101 150 -217 -70 -87 -141 -53 -187 -69 -222 -125 -21 82 165 310 218 -80 -85 -2 -87 170 66
5318 66 115 92 -85 -4 199 -23 -106 20 254 -95 95 -25 83 -180 108 72 60 -131 -16 54 -10 212 -92
5341 -92 -99 166 18 -57 -162 38 -25 -57 -39 45 65 -76 110 -11 -110 -222 253 -26 -160 -7 142 -189 181
5364 181 55 -121 -169 80 -52 132 59 54 77 -30 32 -50 28 -223 7 176 25 223 -72 -15 70 -9 -48 52
5388 52 75 -126 149 57 153 -132 20 -122 -134 130 -48 -76 30 -126 76 75 149 -24 161 -47 -92 42 -35 -67
5412 -67 -97 12 19 14 -25 -70 -57 -262 53 -19 -5 18 148 -37 23 -13 -50 36 96 90 -50 47 119 -79 -41 -48 73 44
5440 44 -97 -116 -9 -57 46 112 -63 -37 138 9 -97 74 31 -123 124 68 7 43 159 -75 -95 -233 -290 45
5464 45 -8 163 -31 -59 -3 -123 86 -27 -113 37 31 -41 -35 -36 60 -14 -265 -24 -12 105 -30 109 30 -190 45
5489 45 75 -3 -43 74 -208 -82 -39 -47 -179 -24 -38 71 -21 -72 117 50 -72 89 28 113 35 24 -135 75 -54
5514 -54 78 95 -109 64 -14 60 57 118 182 38 -26 -260 3 26 -55 -22 126 114 -21 203 24 109 12 -60 10 -62
5540 -62 91 -131 88 -96 -112 3 28 6 27 -41 -103 -54 -12 -142 64 -171 -151 -27 141 -77 -153 -183 -38 127
5564 127 -112 -109 -209 125 -21 -18 -31 135 117 178 -32 -120 114 -213 100 203 -71 315 -33 58 238 -62 83
5587 83 78 -228 -16 -100 276 212 147 -7 -117 77 -73 -122 62 -67 172 -40 -141 66 -91 -156 9 -132 85
5610 85 -84 -54 39 12 -139 -59 -25 0 99 100 286 57 12 -66 -77 -175 102 127 -105 4 70 117 75 26 6 -79 -105
5637 -105 -8 -297 74 94 -12 -23 104 45 -188 -140 -9 88 -192 172 -21 -49 -56 137 109 -117 -59 -44 -129 -37 -107
5662 -107 -44 38 -210 104 -242 41 -25 43 19 -9 71 25 67 235 100 12 -170 -235 -63 -87 -71 -44 20 20 -132 -127
5688 -127 105 -204 28 -7 -59 -59 26 -185 36 88 0 41 76 -98 -50 116 180 92 -167 -83 121 -9 85 -142 52
5713 52 -75 85 60 12 -48 88 -131 -110 -159 6 64 33 85 -129 -184 -72 44 32 55 123 79 -197 -112 -49 -9 -133
5739 -133 -22 173 99 92 -210 -110 66 72 86 -59 -150 24 -27 159 67 -37 -154 21 115 -77 -62 -157 44 -77
5763 -77 -56 -53 44 84 35 -59 -101 -105 74 -40 -31 -230 -37 18 -129 43 2 36 23 -91 76 158 8 29 41 16 239
5790 239 42 -44 84 -85 79 105 -11 163 163 64 179 -43 60 208 -2 -33 1 44 -15 -37 165 84 -2 -28
5814 -28 90 105 204 8 82 -5 248 81 -48 57 -35 -5 -122 -3 -110 118 -108 93 -27 92 91 182 25
5837 25 -81 -34 -202 142 36 -36 3 128 -20 -117 -160 -13 -69 46 78 -10 -34 -160 -23 37 59 -25 -215 -183 -42
5862 -42 61 91 -85 115 32 38 67 116 232 3 57 40 -257 -133 21 -59 -1 65 -62 -30 170 96 78 83 -23 -142
5888 -142 32 -37 52 12 -47 -68 27 95 94 -168 -27 69 -129 -92 93 150 -60 152 137 -32 -61 219 104 103 51 87
5914 87 -142 -67 180 1 -141 257 74 -10 1 151 -57 35 117 -116 -153 -84 -105 26 -76 -195 -8 -3 30 -100
5938 -100 -168 -288 20 129 -209 64 44 94 169 -336 -127 9 -203 -116 -131 -246 41 96 105 -26 130 -213 -7
5961 -7 57 -75 56 -40 222 -56 106 81 42 175 -167 -60 -42 -27 -141 -143 -242 38 57 14 114 26 -147 -20 -49
5986 -49 -112 -10 7 158 91 37 -70 83 -81 -94 237 59 -49 -171 -113 32 -66 235 1 133 14 -43 -6
6009 -6 37 -270 103 -38 -13 -4 116 230 -147 -52 49 -209 42 -20 11 -97 -109 68 -74 44 -190 -49 -164
6032 -164 -21 -96 -182 -53 108 82 167 155 24 -19 43 -186 67 121 100 25 -9 88 -23 15 124 54 -6 -49 40 -171
6058 -171 -105 152 156 126 -72 -94 -70 -13 93 -118 -55 22 -187 -43 -74 -111 6 53 -68 23 82 114 126 -48 31 -81
6084 -81 78 -18 301 81 -193 69 -159 146 103 -112 -169 -42 -52 161 44 91 12 92 20 91 -101 -55 -192 -131
6108 -131 31 -140 3 6 18 2 116 89 -218 -35 -82 -44 -22 -44 20 -63 98 121 -4 18 87 -112 -37 65 -58
6133 -58 32 13 21 -128 36 138 191 -71 -17 101 135 -2 164 -41 176 231 -41 -50 119 9 -71 -48 73 75 -4
6158 -4 -145 19 129 -24 124 27 119 57 -61 54 32 3 17 -98 -90 -78 39 -118 73 24 -139 -120 5 -15 213
6183 213 75 94 21 -97 -34 97 108 -233 -66 13 -261 -247 54 -221 -63 32 -108 -21 -204 184 54 64 -32
6206 -32 24 -44 45 -105 82 -41 -125 131 -61 -116 -76 -22 -149 2 -54 94 -141 19 139 -86 105 -100 -308
6229 -308 37 -53 -7 -169 94 67 32 -6 -158 -65 78 137 -69 54 -20 -63 -143 39 -52 -43 -105 236 -28 -44 -83
6254 -83 -105 -164 139 373 181 -205 24 82 -152 -123 80 -63 -110 -145 -30 -46 -42 -66 -11 -40 -100 127 -58 43 -207
6279 -207 -101 210 38 -117 -8 27 -68 -91 138 101 -47 -228 -46 -22 118 24 130 -52 -144 88 -116 -290
6301 -290 -213 257 -18 -261 8 72 26 -25 -63 24 -101 -126 -46 -89 113 -300 -69 88 -17 -32 31 3 -39 52 -125
6326 -125 166 -61 -146 -154 -210 -79 86 34 -55 147 112 -93 -119 -44 64 80 2 14 -48 -129 54 186 140 195 -6
6351 -6 80 -84 -24 111 83 243 30 -77 26 133 -127 28 118 227 7 86 -58 -38 -144 -39 -9 28 132
6374 132 -68 139 140 25 17 -17 91 -166 -88 167 112 -21 190 47 -44 -41 -21 -144 -157 -115 91 157 70 -225 -19
6399 -19 -53 -152 -259 -178 -27 128 104 40 -119 46 -119 84 20 173 227 -78 -65 -48 -132 11 -31 100 93 -59 -168
6424 -168 5 24 -143 79 225 -200 -165 31 21 -12 -201 265 -139 124 -71 144 53 -24 -11 -49 66 -111 -204
6447 -204 -12 -23 -270 17 21 -56 -148 3 -37 76 -74 72 49 102 -59 43 -145 -30 -85 -101 151 44 2 89
6471 89 84 75 112 41 51 -83 -71 -90 -26 -105 -125 -181 48 6 2 116 3 -88 -21 -22 51 -112 -4 -260 -13 34 69 58
6499 58 184 88 -16 -23 -123 76 -78 5 140 71 180 -121 -2 -55 42 -14 13 231 218 12 -87 -56 -79 151 51
6524 51 -129 -16 70 -71 157 20 9 222 97 -33 -104 48 38 36 -78 -27 75 -9 13 62 24 110 45 -2 -38
6549 -38 -106 -31 -111 -3 -4 -72 -58 -48 -31 101 -6 -98 -17 -62 -79 27 -207 -79 -151 -251 84 144 -124 35 -211
6574 -211 125 -17 -23 -67 -28 21 -72 -65 201 180 73 -8 217 35 7 -133 -26 -45 -76 -180 59 8 -64 -20 -122
6599 -122 -33 311 86 138 242 -181 19 32 46 45 -133 -30 142 -15 173 -168 40 -7 -31 112 22 209 44
6622 44 -23 -14 195 -44 102 58 -112 8 -72 -30 -151 -3 -56 -67 204 -180 177 -214 -216 -100 -278 119 75 86
6646 86 -45 -150 61 103 -27 -30 124 88 86 115 -196 0 141 244 -44 102 -79 -38 69 185 97 -152 109
6669 109 -16 -26 -180 80 -37 86 57 118 -27 -156 -123 -253 131 -9 -13 -14 -24 -170 -44 -7 74 79 31 102 53
6694 53 1 -129 293 -34 -125 -13 -87 -34 19 253 -34 -31 -129 -106 -52 60 19 20 84 -89 182 93 71 3 9 32 108
6721 108 -4 22 150 52 15 53 0 63 -17 104 -17 7 40 261 -116 -29 53 -168 29 266 1 -157 -17 195
6745 195 4 65 -54 63 135 37 46 44 -64 27 22 -79 -99 -93 78 110 127 106 91 -20 113 -177 -73 -104 37 185
6771 185 -48 17 -47 8 24 29 -2 106 -123 -56 -83 4 -104 -83 149 -109 78 69 34 -4 116 89 -157 -84 -145 76
6797 76 18 -103 87 -96 93 -21 25 58 38 -173 10 43 -97 -146 -6 -297 -62 133 150 12 -101 37 47
6820 47 79 -292 40 -137 -154 87 19 78 18 -47 40 47 66 0 122 -90 -45 -162 98 -82 -18 -19 69 -115 -187 70
6846 70 -111 -35 120 113 72 -103 -151 -130 -57 183 54 -37 100 114 49 8 -133 -51 -24 16 -211 119 119 36 184 133
6872 133 65 67 15 -9 166 41 116 -95 99 -40 58 149 103 -94 150 -5 64 32 -56 -63 45 173 -112 82 -56
6897 -56 120 97 244 -54 54 -34 -36 135 -72 7 51 -91 -139 -177 163 -188 -62 46 180 6 131 138 40 -70
6921 -70 135 156 1 -17 91 88 307 107 -40 78 -172 37 -123 111 199 35 -69 35 8 -21 -162 -39 -39
6944 -39 -33 55 35 -73 -13 162 -90 -4 -101 -177 55 5 4 62 -101 -27 140 -254 -105 -194 -138 14 -26 245 -119 -140
6970 -140 94 31 -16 93 170 49 10 26 -32 51 190 129 -97 -64 3 -100 -79 -119 21 -121 160 -116 9 98
6994 98 58 -73 -17 -223 82 -33 184 -96 -46 157 63 -96 -11 31 118 122 -93 -153 -61 -218 8 171 -62 82
7018 82 64 -130 -32 69 103 -305 201 165 47 -51 -150 -94 -31 -35 -15 93 -111 -46 32 38 73 -3 -78 -116 -1 -125 -17
7045 -17 -75 79 -26 -27 35 71 -251 59 -41 134 8 122 -73 -143 99 47 -46 -87 -176 -159 211 179 89 -45 164
7070 164 -95 145 96 -32 -137 -221 -80 168 12 68 77 48 -70 59 15 34 93 126 -19 -68 42 254 -32 -182
7094 -182 -24 137 4 -70 -85 49 71 -219 100 -109 14 38 -28 -175 17 -100 68 5 -106 133 194 -68
7116 -68 -57 -105 -32 -110 43 29 23 -98 267 216 18 -10 -205 119 -191 185 0 -54 102 181 -48 69 226 188
7140 188 -28 -111 23 -121 58 -187 81 72 -125 -50 3 -136 29 -101 37 -9 80 130 8 -3 -76 -63 72 52
7164 52 -64 27 45 106 -140 172 41 94 69 79 -184 23 288 52 187 214 70 -61 -5 -131 -99 -47 204 -5
7188 -5 -12 -68 -55 -76 -91 33 2 59 -146 15 47 23 116 148 -43 -14 53 12 -80 -100 -233 -35 313 0 -103 -140 59
7215 59 -146 69 41 149 110 86 15 -212 129 -84 148 4 -29 72 -375 -81 -207 -104 -40 -137 -122 -52 161
7238 161 20 -183 202 -118 31 -87 85 151 -267 118 -155 -64 18 61 247 -117 -71 -19 14 112 -144 23 160
7261 160 -208 -219 20 168 -16 180 -238 -100 39 15 -50 166 5 -179 100 -14 -272 300 -143 -63 19 -110
7283 -110 52 65 55 -49 -23 57 60 35 39 37 18 270 84 112 -5 105 53 -215 152 -170 -206 127 -112 -43 -196
7308 -196 149 60 14 -112 6 -189 79 -85 140 48 -50 17 -46 126 23 -172 68 44 -69 -137 59 -53 26
7331 26 124 101 101 -39 -36 -55 -21 69 114 -21 102 -58 -43 -1 -32 27 1 -33 134 84 -229 -11 20 18 -124 -101 77
7358 77 109 21 17 109 52 78 -75 97 56 -58 -3 -6 194 -2 -31 49 -187 115 153 19 -9 -90 152 -75 -5 -86
7384 -86 -14 75 209 111 -50 31 -178 56 69 -72 -121 233 -60 -46 -2 97 49 8 16 -118 -165 -51 135 -102 -38
7409 -38 28 -15 156 -52 -75 31 20 -126 -86 71 -132 -107 -32 0 38 80 -157 133 166 73 81 87 133 -85 -12 -17 140
7436 140 -51 133 89 -176 -131 -70 -132 159 -49 -28 88 -21 -27 185 236 25 -23 -55 208 -22 -40 -42 -36 -97 35
7461 35 -42 207 -76 -130 86 56 49 331 74 -25 12 102 -108 73 133 -27 210 34 193 -47 -42 4 -203 -156 -36
7486 -36 -136 -67 -8 66 86 -100 -247 101 -4 47 57 -25 150 -41 -201 12 163 21 70 42 -73 59 67 -121
7510 -121 41 129 49 5 -78 -31 70 -75 -28 -104 -43 -187 34 156 128 90 -246 65 106 -15 167 -42 -124 5
7534 5 109 -206 55 73 -35 77 -58 -103 49 -88 83 61 235 33 -4 84 -118 -75 -170 -37 4 -98 48
7557 48 5 -209 -132 177 3 -163 56 160 -112 -48 -183 54 69 34 10 -8 136 -162 8 -80 -111 94 116 -18
7581 -18 9 90 117 137 -12 130 76 -141 118 -348 -42 48 -22 99 49 65 -78 -44 -2 42 -91 -44 198 -31 -53
7606 -53 47 -54 -43 -159 -127 22 -45 -42 147 -121 20 35 43 63 154 -143 -59 31 -101 -101 92 140 -127 30 31 24 90
7633 90 63 30 34 -36 -27 -35 87 76 -17 -110 -20 -9 38 -33 -123 -107 36 96 -25 -56 43 -131 135 151 31 -148 -167 -203
7661 -203 72 110 -120 -66 -96 -96 -101 250 -23 167 -82 285 -40 96 -50 128 24 17 65 62 -50 92 131 60 10
7686 10 -48 99 -29 -70 95 39 165 -97 31 14 -42 -3 43 -181 -131 -23 -34 48 50 6 -5 -30 111 -112 43
7711 43 -81 -61 -126 -21 74 88 32 21 -19 -71 144 -95 -4 41 115 -209 46 -185 -151 27 -19 145 -159 -180 68
7736 68 52 58 -129 88 -74 -77 -39 -3 -165 -202 34 94 -1 -47 -35 37 -60 -2 -127 -8 219 89 12 -82 -121 -45 -19
7763 -19 208 59 -208 231 110 -195 -1 123 -26 157 134 -19 112 -127 47 -162 207 174 -117 -4 97
7784 97 86 -121 -47 -17 224 34 65 216 87 140 39 18 -108 -248 28 -60 2 79 66 154 -131 -345 214 108
7808 108 17 -202 -194 -80 127 25 72 102 -23 -87 2 63 9 71 118 -138 -50 310 135 -42 -171 81 336 -89
7832 -89 -12 160 82 117 -12 -5 -150 234 5 -156 88 21 -64 96 -32 30 -24 -226 -198 41 -127 -262 -190 -110
7856 -110 -124 -86 -79 -41 56 -38 -22 -147 -199 160 -135 125 110 162 -92 85 -201 -56 -83 142 -137 -67 40 -5 212
7881 212 -105 -41 -60 -201 -37 -1 38 -198 74 168 52 94 161 82 -11 -133 -29 54 -127 -50 -106 -127 24 -104
7905 -104 69 -21 -106 -98 -117 74 5 -14 65 -16 157 -14 63 -136 60 16 11 -4 -51 205 11 80 2 100 17 -126
7931 -126 179 -39 -75 -18 94 47 -55 -3 -107 -19 -44 -194 48 102 25 -98 -347 63 94 -47 12 -120 91
7954 91 4 23 -10 -325 56 -51 26 -16 191 -66 -21 82 -154 94 -43 -76 132 69 99 -109 -146 123 35 122
7978 122 -40 74 -74 36 8 130 -41 -54 61 -27 220 95 64 -31 7 -140 70 9 -94 211 -61 -17 -34
8001 -34 -38 53 201 -50 -36 -29 -118 28 -208 -7 128 -164 -214 -133 -59 -34 -110 -40 -66 147 -59 -82 -184 30 10 -113
8027 -113 -37 29 -35 -77 -115 29 -42 13 144 -44 -65 -8 -41 -82 80 24 208 -119 21 -78 138 -42 -251 81
8051 81 -120 103 39 143 17 99 24 -2 -40 98 17 15 -94 64 -165 17 -24 -78 -7 -57 -15 45 62 -94 212
8076 212 -150 -157 -7 -72 -124 -13 151 115 -99 27 -215 -58 136 -137 -42 -125 125 -38 27 -43 1 -90 -138 -60
8100 -60 -4 -57 -11 90 81 90 -41 -109 -215 69 139 -135 120 4 19 -116 -138 16 -125 -246 1 205 45 124
8124 124 -73 -61 -82 169 33 106 -79 104 89 98 14 68 36 58 -44 69 -88 -73 -140 -1 126 -118 113 -89
8148 -89 -6 -130 57 -71 43 93 1 -5 47 -49 -169 160 -69 -18 43 -189 118 -172 -72 -8 -82 22 47 -45 124
8173 124 67 -346 173 -41 -116 -7 -71 127 -16 30 -57 -233 82 29 -83 44 -58 6
8191F
$$ Imaginary data points
##PAGE= N=2
##DATA TABLE= (X++(I..I)), XYDATA
0 0 0 0 0 0 0 0 0 0 0 0 8 -8 8 -8 16 -16 16 -24 31 -32 40 -48 56 -72 80 -96 112 -128 148 -169 194 -223 253
33 253 -286 323 -363 408 -458 512 -570 635 -706 782 -868 960 -1061 1168 -1289 1423 -1568
50 -1568 1726 -1901 2096 -2312 2555 -2829 3139 -3494 3908 -4395 4980 -5697 6595 -7765 9356
65 9356 -11656 15295 -21943 38014 -162699 -23787 355645 56727 -227381 -131574 147839
76 147839 122709 -21570 -70684 -48531 -64754 37609 148904 61560 -146625 -116813 117688
87 117688 173049 -69601 -194584 -31325 126421 69808 -33510 -47133 -13201 5247 42927
98 42927 47277 -51053 -113844 9144 128762 49330 -83090 -49162 59070 39422 -44050 -26593
110 -26593 8341 -28424 -17572 63955 56270 -48537 -71121 30687 68437 -32656 -75289 20050
122 20050 65167 -7354 -34250 40689 50287 -61573 -84692 50896 90848 -49482 -103945 29299
134 29299 115420 13193 -93609 -34159 53491 18276 -32826 -5367 18634 -2148 83 35352
146 35352 21123 -45822 -45893 27581 37395 -21683 -33755 12218 34503 3987 -19303 -1350 -360
159 -360 -23497 -4117 32144 12783 -25017 -6480 38619 20551 -38065 -29049 20781 10780 -21962
172 -21962 -4712 24450 10561 -18471 -8358 17884 -909 -27372 -3732 20944 5704 -6919
184 -6919 10782 20813 -10417 -30536 7731 29374 -15323 -40412 5455 45475 14360 -37257
196 -37257 -22244 25648 15348 -21514 -14829 8630 10343 4424 9322 9702 -10898 -17764 8287
209 8287 14161 -12523 -18341 3936 19098 7408 -10893 -5967 2892 -7381 -6181 9263 4816
222 4816 -9782 -2175 20850 18609 -15614 -23738 8141 15899 -8410 -15185 2123 13806 3481
235 3481 -8049 -607 1429 -9389 -4083 6899 2275 -2677 2417 10683 6746 -8165 -6005 6010
249 6010 -1383 -10577 -1419 9778 6318 -7777 -7212 9382 4367 -14313 -8386 6762 6721 -840 -550
264 -550 7793 5371 -5436 -1948 3812 -4212 -6731 987 5586 3447 -3962 -3432 3409 -1212 -6555
279 -6555 -1347 747 -531 1693 5879 7490 -1682 -7977 3642 7906 -5888 -10365 239 9536
293 9536 5130 -7538 -4751 4473 143 -4400 -2087 -2480 -63 4763 5775 3443 -3599 -3305 6096
308 6096 3133 -6709 -5736 1118 6715 2867 -5720 -2327 2822 -2256 -3370 -506 -1274 -942 1820 6109
324 6109 5520 -4161 -4119 5030 2865 -4299 -4558 -104 4726 2706 -3203 -1599 -650 -2028 -150 -1556
340 -1556 -3025 399 2776 4515 3222 -3041 -941 4408 686 -3693 -3051 1193 4572 -215 -3478
355 -3478 630 -387 -2645 -641 -1763 -2386 692 2249 4250 1385 -2506 1075 2736 -838 -1124 -1666
371 -1666 -380 2832 854 -626 -292 -3344 -2390 1398 93 -2350 -2719 639 7056 3571 -3656 -1698
387 -1698 1422 1691 1436 -2012 -2669 577 1851 3147 -216 -6460 -3044 2342 1473 -338 -3366 -1961
403 -1961 4662 5117 690 -2006 -3303 387 4325 1338 -1722 -3101 -1165 4835 2886 -4529 -5174 -1495
419 -1495 1643 3029 -1034 -2229 203 1658 4384 3125 -3567 -3812 1220 3831 3047 -2194 -4601 828
435 828 3157 808 -1905 -5217 -3027 2235 3084 2081 -1259 -4510 1280 6701 2967 -3563 -6238 510
451 510 7976 3689 -4307 -5698 -1369 5444 4019 -5777 -7221 -149 4544 4225 -971 -4555 -454 3178
467 3178 4212 1453 -4195 -3978 2786 5381 2057 -3901 -6346 1164 5224 -794 -5254 -3536 2149
482 2149 5039 -273 -2917 969 1050 1 1488 1217 219 -1274 -600 2773 1238 -2759 -1855 -656 -241
499 -241 450 -1345 -443 982 -1438 -244 3894 1747 -2735 -2949 1800 6086 452 -5142 -1355 3257
515 3257 2967 -606 -5070 -3255 2158 2113 -441 -2381 -2203 2305 3210 218 -714 -1205 -6 3315 2219
532 2219 -1270 -1968 -783 2226 1416 -3105 -2789 -113 741 1140 -1493 -2532 2109 2954 -1091 -1285 1128
549 1128 2377 1007 -1678 -496 1825 807 56 -1958 -3162 867 2366 -833 -2979 -2949 1343 4954
565 4954 260 -4016 -1781 2698 5229 813 -5020 -2005 3755 3624 -496 -3928 -2921 1217 2067 55
581 55 -2099 -4074 290 5348 1678 -2645 -2695 584 4496 2342 -2221 -2111 206 2391 1968 -1624 -2715
598 -2715 -819 34 1362 785 -3099 -1892 1738 2161 872 -1554 -1169 1927 1167 -259 608 -32 -470
615 -470 -173 -73 836 -444 -3003 -1224 876 920 804 -1674 -2135 2030 3016 503 -1822 -2085 1972 4082
633 4082 30 -2595 -1807 782 2442 -559 -2528 -582 -428 214 1851 -129 -2033 -711 1478 3023
649 3023 653 -3060 -586 2458 1740 200 -1182 -907 608 -45 -297 -248 -2357 -888 2082 1063 -341
666 -341 -1497 -850 2028 1518 -934 -346 593 466 1082 139 -616 -501 -1420 428 1010 -963 -1142 -424 -127
685 -127 1665 634 -1500 -403 659 1569 1825 -864 -1713 1187 1675 438 -1339 -1879 439 825 -1044
702 -1044 -622 -875 -928 1092 593 -26 -210 -699 692 2125 145 -417 -244 256 983 313 -1213 -787 -789
721 -789 -197 1060 -799 -1607 -124 510 1166 196 -1220 61 1870 564 72 -575 -158 1190 -147
738 -147 -630 -689 -945 -222 590 -695 -544 -13 -479 856 406 -707 330 900 579 835 -333 -328 968
757 968 62 -33 -315 -1345 -82 669 -640 -704 -678 -182 1267 185 -724 497 847 861 621 -439 -12
776 -12 797 11 -382 -889 -651 579 174 -1168 -437 -60 217 890 -349 -120 812 301 475 582 -305 402
796 402 353 -271 172 -812 -826 286 -407 -621 -105 -653 20 651 -512 -85 628 -38 726 439 -103 730
816 730 243 -154 371 -642 -562 165 -542 -282 -372 -820 285 218 -440 127 569 73 842 69 84 863 -294
837 -294 -214 480 -455 -457 -532 -625 26 22 -706 -121 -153 -231 795 -220 -3 676 343 317 763 -503 190 541 -174
860 -174 -31 -124 -836 67 -171 -418 210 -580 -394 673 87 162 502 -132 646 700 7 187 -368 -342 587
881 587 -282 -738 -234 -658 -30 416 -739 -415 340 129 787 674 -101 71 -41 422 853 -435 -1113 65
901 65 332 50 -716 -1441 5 763 -437 -106 -82 -458 425 499 383 266 -690 111 1226 332 -548 -867
921 -867 -381 903 224 -1417 -688 -200 68 218 -283 -334 209 77 657 853 -272 -316 176 417 855 -213
941 -213 -1640 -425 877 813 -393 -1874 -542 1241 565 -298 -380 -178 825 754 551 498 -683 -898 949
960 949 1152 -234 -1645 -1258 1268 1760 -1302 -2009 48 1287 912 -651 -1231 876 641 141 682 -105
978 -105 -661 -329 400 1102 -144 -1860 -527 1229 704 -731 -1841 -593 1799 824 -689 -264 238
995 238 710 703 -120 258 265 -822 318 1023 6 -1125 -1543 155 1829 181 -1869 -964 1139 1532 -147
1014 -147 -1615 195 1348 139 -110 127 -222 -616 -151 850 727 -1738 -1836 820 1545 22 -1810
1031 -1810 -1117 1728 1985 -883 -1359 187 1185 659 -383 -247 421 -654 145 902 -543 -1528 -818 411
1049 411 1133 -19 -1554 -167 1009 971 72 -880 -58 1496 469 -629 -162 -80 221 -50 -586 154
1067 154 -326 -997 -66 553 621 -480 -994 413 1817 190 -1167 -210 838 792 -101 -709 395 -71
1085 -71 -801 234 362 -368 -1019 -365 1092 790 -1177 -512 962 792 100 -726 -405 970 631 -411
1103 -411 -96 -143 -403 -101 -78 89 -441 -710 533 707 -191 20 11 269 665 115 -507 166 53 157 -63
1124 -63 -759 -276 303 -483 -262 102 -88 -53 -289 -21 624 363 -519 178 503 504 -140 -547 461 442 -743
1145 -743 -193 55 -207 -220 -437 165 523 -875 -321 855 346 -173 -134 151 730 200 -422 432 61 -448
1165 -448 -188 47 -161 -116 -698 200 316 -483 -273 380 147 208 56 -21 421 -108 -340 351 55 -482 -50
1186 -50 -281 -65 -390 -445 119 60 -430 -34 203 -80 237 313 469 369 -130 -16 319 -193 -278 231 -194 -213
1208 -213 -380 -583 145 -409 -456 225 282 -193 16 366 439 161 -424 251 446 -372 -265 213 -24 -230 -372
1229 -372 -79 355 -428 -513 464 68 -146 142 174 413 172 -326 413 516 -453 -44 86 77 11 -255 -193 -12
1251 -12 -411 -268 236 -142 -38 233 16 474 -124 134 485 47 -177 39 -175 92 -94 -259 -88 -130 -601
1272 -601 -144 38 -106 183 -131 34 157 16 103 482 -54 -10 202 144 -205 -273 -303 327 15 -656 238 -333
1294 -333 -292 38 -57 82 272 -165 266 511 -283 -15 122 -152 -92 -385 -157 352 -365 -337 65 -69 -104 17
1316 17 -119 157 136 -186 148 282 -157 88 121 99 47 -289 -118 217 -157 -296 -5 -324 26 -63 -26 129
1338 129 -123 -67 344 309 -110 286 -238 5 185 -382 37 -365 -319 73 21 -397 -130 -86 54 -48 -153 93
1360 93 254 218 60 170 -234 186 17 -342 -282 -23 -312 103 -197 -414 -145 -423 44 260 -252 4 196
1381 196 -41 229 335 -260 45 18 -25 187 -104 -179 -74 -66 -48 -80 -102 60 94 -112 198 75 78 211 188 63
1405 63 283 -183 174 129 -97 -40 -148 -247 -10 -58 -308 82 208 -90 23 -63 -108 221 63 103 197 -151 66
1428 66 157 -71 -23 -128 -328 -132 5 -111 163 -182 -46 176 -92 36 138 -64 366 42 -251 240 -99
1449 -99 -387 -83 -295 -210 -151 -353 -130 16 -292 -15 136 342 378 245 -186 114 97 -15 13 88 -242 -384
1471 -384 -199 -104 1 -263 -271 -79 93 91 -170 66 733 125 -10 61 23 41 241 -88 -17 216 -432 -205 -11
1494 -11 -179 -20 -159 -142 459 -169 17 104 209 167 301 -83 163 -32 -65 74 -154 -31 177 -316 -291 109
1516 109 -134 -68 -101 12 61 42 -358 109 305 124 37 -136 -62 197 -46 -43 -86 -212 -265 196 159 184 -221 -136
1540 -136 257 127 -285 57 359 100 40 -136 -47 133 -109 -267 68 -295 -88 82 -195 15 9 -308 141
1561 141 130 -90 252 373 191 119 79 68 32 -177 -132 70 -188 57 114 1 38 7 -179 257 -253 47 281
1584 281 -137 -138 157 -131 216 171 -221 -26 -156 -162 -39 -11 -3 11 -193 126 49 -177 -129 263 138 29 67 116
1608 116 219 -16 -243 117 9 -205 353 -123 -49 -59 -156 241 25 -61 128 160 53 180 -47 -21 -65 -210
1630 -210 141 -22 16 -120 -195 -112 -59 -354 -162 139 -169 -160 77 -17 198 81 137 216 169 -88 77 48 -19 157
1654 157 9 29 -108 -220 46 69 -259 19 179 82 52 120 78 424 -176 -298 209 39 -138 -122 -6 40 -47
1677 -47 -204 46 39 -330 -8 186 60 -310 -27 22 178 -234 141 376 -105 -162 85 -226 82 -57 -114 25
1699 25 89 -78 109 330 -82 138 78 11 48 61 17 169 -121 6 144 -111 -226 -220 -124 115 -21 -43 -68 74
1723 74 -74 -60 -29 64 118 -28 19 121 10 55 141 -64 -87 24 -4 -85 -385 -29 117 61 -63 5 -22 281 -126
1748 -126 -56 59 101 -40 -25 -198 19 -72 -83 182 -83 -297 -250 79 -113 -191 13 23 82 -107 99 87 -88
1771 -88 -12 231 -39 -84 -84 -152 209 -189 -166 31 -52 -135 70 -236 134 -121 -6 -44 106 43 64 32 -61 76 -260
1796 -260 -88 175 -54 -504 -138 -235 -71 -147 -180 230 62 201 4 -36 108 -133 -112 -213 105 -257 -164 22
1818 22 -114 75 -150 -247 76 58 3 100 -68 -123 100 -54 -95 -55 179 83 -94 0 132 -18 -140 -54 6 -86
1842 -86 -64 83 6 15 -4 89 246 34 -89 0 -111 199 60 -81 61 -23 -40 165 -134 -144 -63 -98 170 33
1866 33 -198 38 146 -43 -24 173 -67 21 -182 -26 -127 -221 97 180 -211 -227 -201 -407 -9 -86 -133 72 244
1889 244 -60 133 -6 83 -29 -61 172 -136 -291 -31 95 -21 -65 -66 20 -85 -123 -76 19 -7 -23 34 115 -31
1913 -31 70 -23 256 -26 149 -241 -197 -242 128 -138 -44 8 -97 -41 13 113 -90 195 13 20 -17 -32 117 -89
1937 -89 105 -88 146 -3 76 -179 -45 -32 -145 208 68 -1 93 68 176 57 40 -112 113 -353 -15 225
1959 225 72 -36 -213 54 103 6 -47 -94 145 102 163 -145 -93 271 -104 140 -7 -76 -33 21 -77 104 -36 -14
1983 -14 150 -31 -11 -247 112 91 148 -89 -64 124 -38 -12 73 -6 137 145 -13 -124 114 -8 -68 -83 -98 163
2007 163 184 -174 134 -97 -31 -127 -84 85 -42 -379 155 30 -145 69 -228 68 -92 54 -162 0 -161
2028 -161 118 -160 -122 130 -61 51 239 166 49 -256 -31 168 -56 -51 -1 -121 -104 -157 -106 -89 219 219 89 192
2052 192 319 65 105 103 52 41 20 18 -59 -39 7 -31 37 -31 51 66 176 151 17 99 -41 278 1 -17 -99 260 -131
2079 -131 23 14 -248 -66 -51 -59 -31 9 -46 110 -56 -6 -27 163 179 -5 150 277 75 -45 184 0 -125 -139
2103 -139 -25 -175 -203 155 -26 -79 -8 -51 137 84 12 52 -42 -41 102 84 -60 -101 -13 52 -38 -110 -213 -50 -3 -110
2129 -110 85 41 -131 33 102 -39 -115 4 -160 129 -163 22 160 -100 24 -51 -94 -82 97 -112 160 8
2151 8 254 -73 -57 244 193 -9 183 140 13 -69 110 -54 -149 20 -31 90 142 -22 -62 -43 -97 -154 -106 -12 217
2176 217 -49 1 119 46 -14 40 76 -215 -55 -218 82 26 -126 134 -196 10 57 82 -108 260 -76 205 52
2199 52 -77 -24 -60 191 -40 202 -43 7 -153 -104 287 145 -87 -156 6 -36 2 -88 57 49 41 -91 -62 -144 -146 -11
2225 -11 116 26 29 21 -86 161 -88 -221 -225 66 -59 -51 226 73 103 -3 13 198 -102 -64 69 268 -251 139
2249 139 26 -43 -43 71 5 19 -239 -89 192 86 128 91 150 114 -16 17 -124 -290 -162 94 -45 37 -77 92
2273 92 54 92 44 -131 178 -62 -38 95 136 -172 32 -8 170 -173 -81 -233 -94 67 -116 -222 -200 -114 -187 124
2297 124 -90 -54 155 -13 46 -200 -87 -34 90 -31 -18 36 -38 -193 28 -286 -67 -121 -74 -52 -67 135 33
2320 33 0 121 33 13 341 -114 10 -81 -60 6 55 9 -74 -161 -298 89 103 -110 32 68 48 52 71 187 202 -54
2346 -54 -23 157 -205 14 -5 -102 34 22 13 155 -12 24 -27 94 -31 25 -58 68 72 -168 -66 -26 -97 67 17
2371 17 -181 40 -68 -118 119 -3 -130 -146 195 -56 -82 158 -81 95 -109 10 -63 -43 168 17 -8 -16 -154
2394 -154 170 28 15 -43 -57 -37 31 -139 224 -171 -160 -76 68 157 126 68 -74 -15 32 -106 33 52 -213 -5
2418 -5 -12 44 19 91 -8 137 -185 23 4 -210 -20 -18 -182 91 -196 -118 69 -38 -106 156 -150 -91 18 -79 -27
2443 -27 -133 67 -93 179 -38 -32 190 123 70 -190 -24 -208 -85 138 260 -32 -61 207 -127 142 -117 2
2465 2 139 -171 -154 26 -121 -14 122 150 -36 147 -22 -55 337 -83 40 201 97 173 0 4 62 -80 -75 126
2489 126 58 -142 241 -31 -174 -91 34 275 46 84 173 -76 -90 9 11 294 67 45 -36 85 -112 -174 -117 133
2513 133 -86 -152 -125 60 26 99 -186 -75 60 230 61 95 80 -118 69 37 -185 24 158 -46 21 24 -36 122
2537 122 -21 24 94 72 90 29 -155 58 68 95 2 -100 -157 -377 -52 -124 -27 -173 -149 25 -37 -43 -73 -137 -24 206
2563 206 -72 272 -93 -8 -21 76 -75 201 96 112 -80 -108 -104 -130 -140 -126 -10 10 50 105 49 -26 -67 185 194 86
2589 86 32 -161 72 -179 -119 -212 47 -45 217 -114 -151 47 86 -50 145 116 -17 -97 131 -107 -230 -87 46
2612 46 173 55 22 5 -51 -18 -10 88 157 -95 -119 -102 50 12 -47 61 -37 23 130 -3 -158 -148 3 -62 -236 95
2638 95 26 137 51 -55 37 70 218 93 90 -86 -143 30 126 -125 19 -109 -14 134 -211 22 51 -44 166 -217
2662 -217 139 165 -105 108 136 36 -18 -91 30 -154 -21 73 28 13 -40 68 -138 -176 95 66 -28 31 -14 179
2686 179 150 80 162 58 -131 -11 -75 77 3 -79 61 -65 -69 5 -96 -115 154 -71 -65 -139 -1 -101 64 -46
2710 -46 73 -150 -59 55 -38 -169 44 90 10 -286 100 176 207 78 31 -21 -183 115 108 1 160 140 -173 16
2734 16 -30 -181 -81 -172 62 -1 1 -14 179 195 -117 112 -26 -73 -6 -130 -170 -89 1 -77 -225 -222 -43 -16 -71 210
2760 210 -85 -128 99 40 130 135 7 -111 -319 136 67 -70 141 385 68 21 -39 66 -11 6 -98 -15 -121 -184
2784 -184 125 -79 16 290 -10 12 -331 -51 -159 32 10 62 163 -211 19 -2 -57 40 190 141 10 -2 28
2807 28 92 87 121 -219 96 -62 105 -201 -62 39 45 -273 -86 -299 -282 -297 -28 221 -127 -78 -84 8 76 -94 -191
2832 -191 117 47 -26 -65 -18 15 120 50 -83 -28 -216 21 -51 119 75 80 52 -81 23 49 214 120 -69 76 32
2857 32 -62 0 -67 10 -98 -113 47 -156 126 39 39 113 -28 -43 55 -138 -26 148 99 -93 34 80 -171 91 -10
2882 -10 -53 8 86 -29 -152 -23 -20 146 113 227 -125 110 -40 -89 -103 239 -93 6 -29 -132 173 18 15 -82 28
2907 28 60 50 -67 86 4 18 -23 163 -1 53 1 -226 -209 -59 -47 99 197 -27 -30 -65 86 133 69 9 76 -170
2933 -170 -149 -178 38 194 234 -61 294 -19 38 -14 -11 -90 145 237 66 239 -83 62 186 8 255 22 -27
2956 -27 48 -3 -117 -61 65 -129 64 -28 92 63 -173 -43 -90 33 39 -21 -18 -67 129 -35 93 -124 -69 -10 73
2981 73 -45 31 -42 -29 -25 13 87 -58 114 294 -5 -81 -88 -77 37 111 26 -72 33 58 -90 92 69 41 136 4
3007 4 28 -164 158 -81 163 193 -172 -184 76 -50 137 35 3 -84 22 141 11 114 -206 213 -39 -60 90
3030 90 141 114 17 126 9 20 9 -11 45 68 82 -173 -67 10 -6 -9 -25 -136 95 -282 -72 73 194 102 -2
3055 -2 -69 -126 56 -411 -17 77 113 -33 30 -122 175 217 -31 -35 283 -29 90 78 -36 -100 21 -29 84 -70
3079 -70 96 -76 29 77 183 -32 188 185 54 -77 -84 -42 33 202 39 54 263 186 -197 34 -112 33 -63 -76
3103 -76 2 -12 -47 69 127 40 113 -41 -32 158 14 -113 -265 50 -91 148 0 -22 -3 198 48 16 130 133 -42
3128 -42 -118 123 152 85 39 -79 -32 -5 60 -39 85 9 -133 27 44 -32 -221 16 139 150 -156 76 -36 -84 -35
3153 -35 -54 -26 179 0 -10 124 50 11 -67 109 82 -11 22 29 -95 -129 -105 -195 16 -45 21 99 -23 -82 -14 36 42 -21
3181 -21 -21 -73 -33 -50 245 126 307 -58 13 -114 0 -17 134 140 145 139 7 -34 -101 34 9 128 59 -29 -58 42 -9
3208 -9 214 -79 191 106 -38 199 -53 -183 22 -80 101 -154 -149 -75 -12 -180 80 8 -163 -138 -132 -13 69 -45
3232 -45 -91 -10 -96 11 352 141 18 12 80 -12 14 76 -52 288 -141 -129 36 180 48 120 -28 16 174 -115
3256 -115 -59 53 60 94 -111 202 47 77 77 -83 -14 -126 -92 22 -4 64 -95 211 18 -97 58 112 230 -112
3280 -112 -57 166 103 172 56 -88 22 -192 36 261 -57 -106 202 -19 -195 -172 -27 -101 -214 39 -84 -17
3302 -17 54 -224 87 -200 -50 -22 -7 64 -134 -124 -15 71 -18 139 6 116 107 -105 165 -80 -137 -13 -36 -93
3326 -93 162 115 61 29 -105 -10 -69 -263 20 197 -158 70 29 -69 -74 82 11 -98 -118 102 53 225 -89 -120 -40
3351 -40 -43 -140 -136 -47 -35 95 118 82 -85 39 -108 147 151 -55 -64 -89 -56 64 -57 -18 181 5 -11 192 143 33
3377 33 113 -2 -86 108 -49 -162 217 27 -60 -10 -140 22 -194 76 187 5 123 69 249 202 206 173 48
3400 48 54 234 -294 -83 -32 2 -66 -17 -136 275 -116 -16 26 3 30 88 -5 -72 36 -137 -223 173 -59 -238 57
3425 57 -105 115 -118 -67 -109 6 24 174 -26 -43 54 29 54 46 -239 -171 82 156 -62 -83 -132 0 192 -87 -333
3450 -333 -78 47 -71 79 12 116 114 -52 110 103 -73 -26 162 -123 -1 -180 -50 4 75 -137 128 14 -125
3473 -125 285 -126 -98 142 -203 46 67 -101 158 -64 127 80 -2 -39 109 -206 215 -98 34 -210 -137 61
3495 61 26 -5 -98 -89 9 5 -260 -63 237 275 -298 50 -42 59 167 -54 -14 21 -139 -42 33 -103 -16 -202 -18
3520 -18 -87 -55 11 94 26 -33 118 148 -81 -48 -231 -112 101 -43 67 83 60 -126 -30 -29 -77 42 67 -177 146
3545 146 -94 80 161 192 -33 -170 -6 -124 23 -62 -156 105 46 73 221 -121 2 -94 52 156 -14 59 41
3568 41 82 23 -17 81 185 -20 219 -110 87 98 38 -129 -180 117 156 180 182 34 -31 110 -76 47 -88 66
3592 66 -127 157 216 -4 73 -162 -188 68 60 -35 68 12 54 -23 77 63 65 163 55 97 76 -78 -8 -66 126 57
3618 57 -39 104 -67 -72 -120 12 -55 91 254 4 -54 -155 -123 130 29 95 1 -20 110 -50 47 72 160 6 -55
3643 -55 114 -149 115 85 183 149 -163 -28 132 -185 -35 -63 51 99 41 73 -62 -200 -23 323 165 -55 -12
3666 -12 40 -70 83 -76 20 -53 97 -149 41 -129 80 5 31 -5 -111 77 -46 93 10 -67 62 16 -124
3689 -124 161 156 99 -111 125 85 -9 -221 -96 49 -1 -95 10 9 145 -48 -64 120 75 -35 -58 -97 138 66 -42
3714 -42 -218 108 61 -205 29 -174 21 80 -169 -272 -31 43 -112 -119 -206 -115 -17 -36 91 72 -262 142 -70 -168
3738 -168 67 20 -86 -103 210 -44 -20 183 -5 -47 45 122 -31 188 -19 -123 -164 -90 134 37 -80 -204 -209 20
3762 20 211 -17 32 103 -42 53 -78 -154 38 -39 -46 127 167 80 32 54 -111 177 -188 53 -20 24 -148 43 147
3787 147 -124 -69 -134 -143 -52 144 -78 -103 -127 -94 13 -94 -15 -76 -77 94 23 116 -8 80 169 -76 -101 -149 34 77
3813 77 -212 116 -85 30 -44 184 -125 -248 1 -8 -198 -41 -42 20 -20 28 -51 48 96 -92 49 13 -86 127 139
3838 139 207 33 -204 164 -124 112 -257 81 255 146 -48 235 56 103 38 152 -122 -200 -81 11 48 -93
3860 -93 145 -141 34 24 105 -22 32 55 31 24 64 133 66 -167 -107 -15 117 151 129 44 206 -38 -59 -83 -12 -5 -82
3887 -82 43 -23 -110 -17 1 84 60 -94 -23 -91 36 -140 150 -134 -114 -78 -105 5 -34 30 13 130 91 -1 -30 125
3913 125 -20 21 156 103 -149 -151 -326 -42 -113 72 -6 4 -4 31 170 47 -22 183 -191 -118 -111 65 25 -2 -33 353
3939 353 -44 159 185 -174 51 69 -90 -57 94 75 -53 17 -81 -21 -61 -200 -19 85 -106 171 32 144 -128
3962 -128 -53 136 -179 -1 132 229 -133 -84 142 -113 260 -77 -93 -53 -126 -5 21 -328 -44 -71 -179 -32 59
3985 59 -71 -149 177 -27 81 -163 147 123 105 3 -95 -17 -19 65 -77 98 -12 6 147 34 83 67 -29 -114 40
4010 40 109 120 137 -76 -22 -65 29 41 61 24 -57 -270 -7 32 -260 35 41 11 31 -27 -7 -48 -49 -9 214 -127 -64 -234
4038 -234 -203 115 -3 95 -12 13 -167 176 -53 -15 20 -78 -102 217 -17 62 -199 -142 -149 -113 -110 94 -86 117 118
4063 118 97 145 -54 -81 105 -66 -195 72 72 -22 201 -101 78 -31 108 125 -53 -155 -39 -105 10 -64 -227
4086 -227 32 -12 3 83 55 -71 -169 -61 144 58 -22 -69 -225 49 41 -220 -49 26 141 -80 -60 153 13 -60
4110 -60 59 -8 38 57 -3 303 -34 -8 115 62 -200 -69 55 12 28 110 -101 12 80 -38 198 142 33 -10
4134 -10 49 -44 153 -47 101 -54 85 -74 -128 -23 -116 -132 110 -30 110 -98 -70 1 -64 -84 -222 80 291
4157 291 17 0 -127 90 -50 100 98 -275 -40 -157 -59 10 100 -119 16 106 72 -161 -174 -63 -291 -113 3
4180 3 246 -67 163 40 48 -60 49 132 74 31 -100 -38 -78 97 -79 -115 -70 -55 0 80 266 -70 -267 -112 -108
4205 -108 36 -148 2 2 -40 -50 -52 -12 4 21 161 -150 -57 42 -14 -19 -39 -103 -10 59 1 -54 -14 109 -59 -175 -77
4232 -77 69 -48 140 -122 12 40 40 -16 15 29 -80 -151 -52 -37 42 147 -44 -182 44 -11 -226 66 -257 57
4256 57 66 160 -75 132 -96 -116 28 4 -93 -203 111 14 -39 -19 -100 75 -12 22 36 10 -46 -89 120 49 100 -78
4282 -78 4 -68 -147 1 124 -49 -71 84 -89 -245 -50 -7 145 198 51 49 -48 164 -48 -63 -28 -41 82 2 -61
4307 -61 37 184 36 -167 195 141 1 110 1 98 12 -116 220 149 69 122 225 5 85 -71 150 203 146 -185
4331 -185 -91 46 34 -131 -21 40 -145 -189 102 -93 -39 -82 133 19 -103 -97 -24 74 28 216 -55 41 208 105
4355 105 297 91 20 -121 -6 -72 232 -77 -81 100 120 -189 98 43 -82 -64 86 12 16 -9 52 -69 -124 236
4379 236 165 -31 -156 -83 -16 -103 99 -66 -87 -26 12 -100 -196 -68 -49 55 53 -10 -125 49 65 247 75 -15 52
4404 52 200 59 119 170 92 -81 -108 155 -80 -111 137 -6 -113 92 67 21 -59 13 151 219 -58 144 186 -56
4428 -56 -45 74 -71 13 -164 -58 240 99 93 -177 32 123 134 222 88 -48 0 85 137 -48 -112 -143 -285 -150
4452 -150 3 116 -37 -30 102 -24 -145 218 49 41 -142 -104 -61 30 -55 2 89 5 -270 -21 -121 -45 -104 46
4476 46 -98 -276 151 35 10 169 16 211 -50 51 40 2 93 116 45 76 -48 -166 37 72 -13 -167 129
4499 129 150 -135 42 102 134 -2 -145 -14 -34 -166 306 19 18 -218 -33 -15 91 -99 -16 -4 -116 127 -36
4522 -36 110 37 -197 47 119 -37 0 -146 182 -10 148 317 160 86 104 -96 -25 -16 -28 -29 112 -105 -189 -198 -177
4547 -177 56 -6 -140 53 47 -5 151 89 -133 -8 -94 18 54 -30 -105 245 113 -3 -18 -22 -121 0 3 181 -151
4572 -151 -115 -180 -168 -47 -90 62 33 104 53 236 143 90 193 -79 -236 20 13 -94 209 -203 20 7 -51 64
4596 64 -118 -90 180 38 -59 -62 64 51 23 165 -160 7 -25 -101 -96 -41 99 37 -86 20 103 150 54 5 77 -84
4622 -84 -183 42 -144 -251 -40 -71 -263 54 208 -85 -81 -59 -40 -192 59 24 134 -101 -124 38 0 119 46 188
4646 188 50 -35 309 -205 -188 -21 -44 -7 -11 -71 -12 119 98 118 -279 34 -141 144 43 -55 54 -82 -204 -31
4670 -31 -77 -89 -15 91 -134 -205 56 47 -8 -75 11 70 -97 -85 18 40 -182 82 -88 67 42 30 -102 -175 145
4695 145 -61 -203 -23 -113 86 -111 21 12 3 -65 34 -8 -81 -191 -191 -99 -159 -1 -121 160 -195 -180 90 -174 -144
4720 -144 -134 -87 22 -122 185 -73 -35 -41 76 67 -180 -86 -29 -2 -121 5 101 -73 91 2 153 -88 -46 193
4744 193 -26 -126 13 -93 53 31 -48 -43 -132 -61 -114 116 59 -65 1 11 46 126 -131 -54 114 99 -46 -153 -48
4769 -48 61 -152 33 65 103 -11 174 111 -33 2 -32 12 71 120 -13 146 -113 188 12 121 -13 -85 -130 81
4793 81 58 -225 117 -233 -214 -14 -87 -182 20 -153 -160 -109 -86 -59 -132 1 -138 51 -105 -193 243 344 -73 -94
4817 -94 89 170 -61 118 108 79 112 -34 -95 5 -79 63 197 -20 177 19 -94 86 -156 -11 -200 22
4839 22 47 31 132 15 -99 -198 2 177 -168 281 41 -26 -143 145 -85 -54 -121 -1 -129 -82 -166 -197 -75
4862 -75 69 198 104 135 101 58 -66 -59 134 -143 -216 -205 -12 88 -27 -139 80 175 -103 -205 47 -90 -49 -51
4886 -51 -2 -32 -56 -80 -42 -42 -236 -380 25 -165 -86 36 25 87 99 6 158 140 -157 121 27 -58 151 64 -70 149
4912 149 8 -18 -213 -125 -198 -179 43 120 -55 2 127 102 83 -172 -145 -94 -143 -27 128 -269 -36 117 6 -77
4936 -77 -38 170 -104 223 45 -62 -5 120 89 51 246 -137 -3 -119 287 -223 128 42 -176 57 -114 31
4958 31 68 148 -42 -85 248 244 -42 174 37 87 49 48 -68 63 130 -188 56 9 24 85 -4 208 7 136 -46
4983 -46 -243 103 -54 10 73 -52 18 -6 62 171 -96 -226 38 -106 42 275 38 95 41 84 33 -121 225
5006 225 -145 34 -37 -65 -171 -51 -10 93 -135 83 86 152 -84 18 196 68 -67 86 -23 117 33 150
5028 150 88 162 207 -72 -68 95 -123 2 -254 -10 -127 -130 -18 93 180 -75 -93 31 -93 -110 -190 89 133 -73
5052 -73 131 95 79 -14 -264 -114 -20 -164 141 -28 -51 -6 -12 -208 -60 -25 73 143 184 -46 -65 1 43 -108 -16 -300
5078 -300 1 -40 53 126 6 -9 -54 -59 52 202 -44 -9 45 -40 83 1 -72 52 2 -102 225 2 -28 184 9
5103 9 118 51 4 80 60 70 60 130 -14 43 -191 -55 33 -123 118 68 -80 111 -186 -29 61 -38 7 -69 -123 133
5129 133 43 42 -148 -80 16 -41 134 4 52 -24 -5 97 70 -55 -169 271 113 110 -256 256 261 0 84 -135 5
5154 5 61 -170 13 -7 104 8 108 -301 -120 230 46 88 187 45 -110 -110 -21 12 -186 26 -94 224 -192 20
5178 20 166 -99 -141 -61 -119 -198 -53 6 -22 68 54 -99 -18 -15 -102 3 -113 -30 58 6 -58 35 62 7 -149 -37 -204
5205 -204 -47 119 -173 115 -73 -189 333 102 -18 -12 -6 123 -87 -78 70 -126 -223 122 233 -56 -120 33 -53
5228 -53 -55 38 75 50 -238 97 70 37 149 11 78 -225 139 -27 -7 78 -5 92 -11 -4 -51 203 67 121 -35 -298
5254 -298 28 -123 -70 -74 -68 179 -200 -121 7 28 6 225 -137 -55 -65 -183 -95 133 -114 -211 48 6 -38 36 88
5279 88 -261 156 22 232 -30 -78 -81 4 -104 -107 41 -70 -183 -93 -9 51 50 -126 174 101 -218 -105 208 -9
5303 -9 119 -112 246 25 -135 -9 -198 -109 -265 160 -111 7 -145 83 100 127 -192 -132 41 38 132 -115 -103
5326 -103 208 5 145 -2 -122 -83 38 44 62 -106 -1 124 -129 72 145 22 -44 -100 -44 125 23 -71 157
5349 157 14 -11 106 -35 50 -84 30 -107 9 -142 -7 12 -25 34 -75 -222 -8 15 -47 -108 -180 73 64 68
5373 68 -231 96 151 -151 -49 -10 -32 126 -93 -131 35 -199 72 127 -70 -114 51 -260 -39 -38 47 -73 9 -4
5397 -4 -111 -19 -182 -270 -48 16 106 43 -63 185 -208 -31 -146 30 84 23 158 48 -9 197 202 -90 145 58
5421 58 -163 -45 -54 -14 -29 -105 -3 132 -127 84 -184 -74 69 -136 170 -117 -6 53 -26 -40 -105 207 252 -52
5445 -52 90 -88 30 223 106 19 -181 21 -8 79 -176 -62 -261 181 97 -109 -6 -11 101 -49 -106 -35 -6
5468 -6 -10 -75 116 -69 102 94 13 131 -48 10 60 127 48 120 -142 -260 96 -216 -100 -179 -83 106 47 -56 -46 -68
5494 -68 -116 17 3 61 89 132 144 -143 -26 4 2 -96 96 165 -223 59 121 -36 -227 -35 -78 -150 9 -136 -229
5519 -229 -94 -74 210 -21 79 42 -76 71 -165 60 -18 118 -153 -135 156 17 138 91 -45 104 187 -63
5541 -63 -197 58 123 132 17 69 -108 -204 -114 45 -2 158 29 -98 113 -81 74 110 49 34 -37 25 -68 124 -72
5566 -72 38 -22 -123 186 -167 40 154 32 -4 6 46 -54 -36 36 -117 -69 148 -28 85 165 1 -124 -112
5589 -112 -199 -145 -31 -76 288 20 61 110 159 -7 -114 165 -23 -110 45 106 281 -168 161 -26 104 106 -13
5612 -13 -41 14 -109 -24 44 -35 -53 -115 30 -33 -34 -159 157 95 -129 -5 174 134 98 -17 -68 15 -62 2 -40 -1 142
5639 142 15 50 -108 -267 -190 -20 61 17 -197 54 -6 100 158 -6 -53 144 -33 -107 -11 -66 -62 -125 23 -141
5663 -141 34 -137 4 -37 -85 -53 0 54 -11 117 7 17 29 220 -60 27 117 -28 -132 127 -131 4 167
5686 167 81 70 -10 95 -146 102 -154 -22 -106 -95 -37 -27 106 42 121 87 -79 41 -30 67 -3 -317 -46 117
5710 117 -9 -161 8 -150 65 159 152 -59 90 -51 -100 16 16 54 41 262 -30 103 112 75 -38 -12 181 129
5734 129 -141 122 -129 156 -15 -202 46 -137 -176 128 23 -398 27 167 26 -8 49 -164 25 -163 65
5755 65 -29 81 -23 -182 164 -101 144 85 -138 -239 96 -98 50 118 -78 31 -80 3 -40 -39 99 135 -62
5778 -62 77 -67 -1 -17 -24 -3 -224 -264 103 -34 -52 5 101 213 97 115 -66 89 140 206 -110 -57 -45 -256 110
5803 110 21 -55 -42 -38 85 -20 -64 -63 114 102 -215 -13 68 -31 -24 53 -78 -114 -33 135 -47 50 143 -29 -93 -179 291
5830 291 61 53 -69 76 -52 113 -47 44 88 86 -80 234 4 -91 203 21 22 93 80 11 -209 34 -115 -39
5854 -39 6 -220 62 -134 -74 -68 -140 122 -108 -55 155 13 -281 178 -63 -30 148 -21 -8 -45 134 55 -86 -17
5878 -17 201 85 23 -174 -148 40 116 -71 296 -49 -169 -56 6 -112 14 25 41 95 60 159 11 165 -155
5901 -155 231 151 63 208 309 -183 65 -110 72 -78 -59 38 -48 177 19 -94 -89 -126 -282 54 102 -116 36
5924 36 -72 -29 -9 -17 201 123 194 -38 -53 10 10 68 -183 203 137 47 -8 -132 70 -25 -53 -87 -15 -237 15 -51 -73
5951 -73 34 -49 -32 267 -23 148 98 -149 -222 -223 123 -79 -69 -38 155 38 94 116 -134 -260 -33 -8 -137 -118
5975 -118 -84 -238 118 141 40 53 -7 20 -154 -28 106 -14 -155 185 -35 35 35 164 -58 34 265 -38 -112
5998 -112 -45 14 -160 -170 30 -260 88 120 68 90 -83 -116 13 -198 70 -51 96 65 -185 -13 -61 -103 23
6021 23 74 -7 98 73 117 18 -71 67 22 145 -18 207 -134 149 -85 14 4 -136 107 243 -142 113 220
6044 220 74 249 123 -73 -48 154 28 60 -90 54 71 -140 -106 -9 104 -261 25 113 -203 -120 37 -47 -164
6067 -164 -195 -56 16 -35 39 -117 57 201 97 106 -250 76 -147 -37 152 -48 -105 -128 -18 134 -8 94 -20
6090 -20 -38 47 144 -44 -12 -154 -96 81 9 46 -134 31 93 140 -118 -61 69 215 -2 24 -169 151 15 175
6114 175 -122 -54 99 109 26 65 111 90 149 152 109 -42 175 -7 30 -43 39 -43 -154 26 89 96 16 -86 -4 94 -36
6141 -36 18 47 -38 -6 130 29 101 28 169 16 -108 -181 156 -132 35 35 -31 -60 -32 69 92 70 170 -68 177
6166 177 -57 125 93 -178 -16 -26 44 58 -144 -15 -199 -160 -86 -58 255 -103 0 120 183 -119 -162 -166 96 -33
6190 -33 208 43 -130 -68 -57 -101 63 174 -193 -95 139 57 -23 -17 -223 -22 -29 71 -43 -178 -151 45 -88 -201
6214 -201 47 -96 -93 123 99 -32 -58 -188 -26 -106 36 -94 -134 120 -149 211 -62 241 -98 -238 -83 4
6236 4 -208 46 -83 56 85 -5 53 129 53 -40 70 -90 223 113 -68 10 32 -142 204 -88 127 210 58 -2
6260 -2 -9 36 103 -22 -15 -75 225 36 -32 19 -4 24 4 56 118 66 -179 -52 123 103 -165 133 -35 19 68 -60 -48
6287 -48 91 141 84 113 35 52 130 81 -135 92 -170 -108 -156 -210 46 158 60 -40 115 -270 63 -90 -117 64
6311 64 -53 -100 126 66 -51 -271 111 116 201 -96 -105 45 -113 201 119 46 174 139 229 -46 29 17 -58 39 -151
6336 -151 -67 -252 -149 -61 -18 83 117 -132 110 74 -37 138 -76 -61 60 76 33 -2 133 32 -121 32 -63
6359 -63 -42 -28 -41 -85 71 148 -271 168 -81 -225 -65 54 33 -203 143 -109 -232 -29 89 73 65 -63 104
6382 104 65 187 55 -141 -178 8 -240 81 121 58 52 23 -68 141 -43 3 -42 -31 19 111 -3 -150 -169 89 -8
6407 -8 143 3 -56 -289 131 135 -34 58 144 100 0 -101 -103 -29 -223 -13 -82 -174 -53 323 -33 26 110 141 -214
6432 -214 -100 -114 -68 63 -23 -22 -25 -180 -18 -5 -52 -129 94 -64 18 62 48 -239 46 -37 9 131 -39 -105 -41 -86
6458 -86 47 96 -186 -80 -37 -25 -224 -112 83 -16 -48 86 -21 25 48 -143 68 96 123 -2 45 272 -53 -67
6482 -67 -134 -249 50 18 -50 23 150 -101 -52 43 -94 -123 47 -29 113 -111 -187 -27 -64 238 11 65 -101 -66
6506 -66 -51 2 0 -6 11 -150 -104 32 -55 -52 -175 147 -49 2 22 -332 11 50 84 -118 96 128 -50 -12 -20 -83 166
6533 166 25 43 -285 -148 251 251 -2 168 77 -261 146 -96 -74 -65 46 -168 -43 52 93 -53 -71 -15 -104 -178
6557 -178 -79 -47 -9 -10 -26 172 71 -169 -47 -47 133 129 -48 83 107 234 -55 11 119 -126 21 -146 57 -79
6581 -79 5 11 -113 -52 115 61 73 -36 -28 -35 -53 -57 -19 -213 -17 122 -184 66 175 4 46 -41 -43 -64 231 116 -38
6608 -38 61 -77 -44 -107 20 75 7 94 -71 -103 7 89 25 -89 102 -55 43 123 -186 12 -60 25 40 30 97 -52
6634 -52 -53 92 -164 -83 -50 -34 -3 79 -70 -96 -17 -106 -50 -118 60 178 -140 11 -238 -87 55 91 58 -261 -71
6659 -71 51 148 42 17 114 69 -58 102 69 103 173 28 -12 -147 -29 -2 -31 -66 2 -93 48 -62 -53 62 5 -57
6685 -57 102 144 53 18 -137 63 -264 -35 -17 -32 -117 28 58 18 7 -6 -48 -212 109 63 -84 -79 -148 29 161
6710 161 -133 24 102 -193 30 70 214 -130 198 24 182 3 -81 -240 -178 314 -62 -101 235 257 24 23 -121
6733 -121 -91 139 -126 59 38 14 -48 -121 -3 -184 243 -5 39 92 68 -8 -127 -22 -173 -166 41 40 111 51 -167
6758 -167 35 -105 7 -85 5 204 -67 -21 25 -324 19 43 30 37 -95 94 64 78 -34 14 33 19 61 67 34 129
6784 129 213 4 125 257 32 246 61 154 -190 -139 -92 48 73 -63 -2 -120 166 -42 73 9 133 232 -38
6807 -38 -41 79 -189 -61 -118 -147 -103 -291 -78 -73 126 164 -14 193 42 -94 -57 136 -138 -98 -13 -45 141 90 78
6832 78 -179 59 -19 -114 -82 99 -3 24 79 117 -64 -19 -94 8 -22 96 -67 -227 121 132 124 -101 88 65 3
6857 3 110 39 -115 -96 111 22 5 98 1 -16 -94 74 39 -68 -24 -51 79 121 -133 6 176 30 103 54 188
6882 188 -50 -44 -123 -135 -247 -108 -33 12 -309 223 181 91 51 106 56 107 31 -192 16 46 195 29 -36 -88 -126 -86
6908 -86 13 -29 -101 -39 -272 -251 61 -85 -235 41 29 -43 -76 72 43 130 -119 85 -167 61 -29 193 138 103 36
6933 36 -30 -202 -71 94 53 36 -16 -13 121 144 6 81 -175 -20 54 -50 -30 73 -16 91 -1 33 150 9 64
6958 64 173 -111 -70 -45 -89 -59 12 -139 -182 272 112 -130 -92 47 -17 -108 -54 98 -143 -60 0 -31 99 52 74
6983 74 -121 35 -104 -199 30 43 208 -104 -100 -3 -28 101 -1 155 -234 150 153 -35 -16 -263 -75 -86 4 -150
7007 -150 41 -24 -126 -84 -64 7 -3 34 114 103 57 -114 252 191 -130 171 -170 -132 106 -4 70 -124 46 73
7031 73 15 27 -37 -2 -1 58 92 53 -15 -32 -17 -78 35 -94 82 47 -24 -111 -154 146 128 -2 221 -12 -29 129 58
7058 58 0 -58 -33 -38 -159 98 21 -25 -47 -70 -43 -1 -25 -29 -23 -11 17 66 -121 -39 -39 145 2 -3 -1 38 91 -91 90 -54
7088 -54 27 -58 45 -113 122 58 -80 15 -138 36 43 31 -17 53 -64 -173 56 115 133 90 16 124 -36 22 -134
7113 -134 49 -82 -92 -117 -120 -53 104 127 15 202 128 45 8 173 190 -72 -95 -54 65 -166 -123 -210 -73 34 -90
7138 -90 159 3 -3 44 -107 295 170 -163 -88 196 228 31 74 -359 -57 128 31 147 -13 -102 -119 -32 27 -72
7162 -72 97 -32 63 73 290 -161 -173 -186 5 -131 -71 -35 182 -187 102 264 9 -102 -68 -7 110 19 -146
7185 -146 -170 46 -50 126 -88 -31 -20 -249 -107 -170 76 -5 203 91 95 43 -113 29 -69 113 87 -112 98 21
7209 21 -144 -8 -130 -3 -12 206 -61 65 -18 -24 161 161 -211 -259 -108 -116 170 -35 17 -180 8 -165 -3 239
7233 239 -233 15 114 -117 -79 25 43 20 -62 -30 -205 -81 33 97 22 -216 -179 -58 -18 -49 -7 -53 6 -21 53
7258 53 -96 -58 -74 77 -108 -51 91 -2 104 55 46 85 -65 -84 -24 34 -157 -48 -77 -1 -32 -109 -88 -110 -248 95
7284 95 122 -24 77 3 102 -115 22 -39 -210 -20 217 113 -63 -8 -97 -104 98 33 92 -190 -24 50 24 -124
7308 -124 -56 -82 -41 116 172 -32 -107 -215 -51 19 35 -207 -80 -24 -141 -101 49 9 -250 120 -22 -117 -6 -211
7332 -211 -129 56 -47 -49 -95 12 113 150 -90 -8 -208 43 -203 83 -153 -86 -114 -141 -186 -4 57 74 102 148 80
7357 80 -183 -78 -122 290 -43 38 85 1 -172 157 -23 -237 -38 147 165 -109 49 -86 -25 127 -7 -105 -91
7380 -91 32 83 152 98 -50 27 20 65 46 -175 -62 116 142 -189 123 57 -185 -48 -63 -78 -77 -37 53 -174 -15 -86
7406 -86 -234 24 -295 62 -94 -130 74 -235 47 -1 -121 -9 45 -18 64 -133 2 -131 -96 -323 -249 101 -36
7429 -36 -8 -3 80 165 130 219 -144 -158 15 -50 95 -87 -73 58 13 138 2 101 -4 12 92 -114 9 -91 -171
7454 -171 104 91 83 51 -71 -210 54 -24 -39 -6 88 -66 -67 173 7 -105 96 31 114 11 -79 -85 -229 171 190
7479 190 137 40 11 -11 -116 -40 91 -50 12 151 53 -86 44 -83 29 41 78 12 -62 128 60 4 73 -11 -184
7504 -184 498 53 -103 251 -26 -75 91 -58 -42 10 67 -4 32 -158 -107 75 152 -157 138 44 -159 26 -45
7527 -45 -152 -22 36 21 -28 1 24 -94 33 53 -25 85 -71 28 -1 -149 -57 -28 -76 73 -56 -148 32 -73 192
7552 192 -114 64 35 -122 -138 200 -129 8 -176 -88 108 16 -52 -44 -36 -210 -68 9 5 -12 55 64 -57 38 -101 -166
7578 -166 -94 313 282 -86 24 -36 10 -71 154 -9 246 127 125 48 111 -26 -3 92 -99 -43 13 21 -17 24 220 -47
7604 -47 102 -120 54 29 24 -11 148 -57 -18 -128 66 74 237 70 107 184 -208 -217 -58 -1 -38 91 -66 68 -102
7629 -102 -37 11 -132 27 -61 3 62 -4 -60 -264 148 -85 -10 85 92 -105 -15 -112 -38 -271 -47 -80 16 79 90 192
7655 192 206 -138 -220 -10 -42 22 -14 23 -34 -1 -24 11 -326 -94 147 75 -60 24 -128 -31 -56 63 34 -157 -91
7680 -91 3 138 -30 91 -9 -13 129 15 -109 44 186 340 195 106 156 -22 -39 -26 -200 76 121 14 -165
7703 -165 -83 -28 2 -101 -34 116 -79 124 -65 99 -142 -152 -16 30 -60 11 -291 -13 -42 113 -63 -54 60 8
7727 8 148 2 13 -149 208 122 18 51 -160 -206 -114 96 -30 10 45 108 -11 -83 -158 12 -30 46 44 112 -159 -30
7753 -30 -68 21 22 22 50 -24 -88 91 -40 -139 -93 60 -73 -149 211 -88 -67 -111 16 172 -53 -51 106 -74 -36 131
7779 131 -5 -31 -7 8 130 269 -11 -148 -9 8 269 13 -45 -107 -184 6 -15 -58 -154 75 -32 -133 -159 -109
7803 -109 -108 238 -251 -116 -30 -154 80 -233 175 136 74 -198 142 43 -41 127 330 -5 -22 -184 -12 37 117
7826 117 -182 -73 118 51 96 61 129 56 -100 -171 -119 136 152 131 117 97 83 -83 -121 -240 -120 -195 -88 -93 208
7851 208 -177 12 17 -181 -149 74 101 2 -55 -40 23 40 -122 45 -36 -103 90 -113 216 -6 36 -124 38 -252
7875 -252 67 74 -129 142 61 -231 -148 -117 158 52 -72 63 20 -228 -135 34 24 -96 -63 39 12 -68 -102 -110 127
7900 127 3 110 -39 14 154 38 -82 81 -33 -8 -55 -82 127 -28 -208 258 -80 -85 112 -27 72 -53
7922 -53 87 142 132 174 4 154 -214 24 -14 -23 -28 -46 38 152 168 -101 -120 48 -68 -61 -24 -111 -5 103 94 27 -21
7949 -21 -120 -77 -6 102 -32 -12 19 -155 92 -5 -39 -148 -5 45 -71 -130 128 30 -256 -306 -58 57 -35 -70 -2
7974 -2 -65 2 -54 -104 18 66 -77 150 -66 74 -130 -109 63 -125 -116 150 -60 136 257 58 70 8 -46 88
7998 88 -100 187 -70 26 100 -84 -11 257 102 -86 62 125 75 -68 -51 -109 -9 3 4 -43 -69 219 32 -144
8022 -144 143 -99 199 -73 93 64 -70 -22 -56 144 -204 43 -175 -33 175 17 180 224 -91 88 141 -54
8044 -54 78 195 112 9 142 -42 53 -37 -50 -92 33 -14 189 22 -44 119 29 49 11 -98 87 279 92 80
8068 80 184 -81 -164 166 65 53 93 -6 125 -34 96 98 162 27 -127 90 43 90 120 -105 150 -103 -62 -143
8092 -143 -182 -26 -153 107 22 -206 -50 -16 33 -41 -56 89 -51 -17 126 -33 93 141 30 12 -22 105 188 -88
8116 -88 49 125 -144 -91 57 -34 3 -95 131 69 -200 13 -4 -110 0 248 49 -46 21 113 38 53 -34 161 -142
8141 -142 -94 1 100 -150 179 21 -86 -86 183 -34 -131 -58 185 48 -83 82 19 -21 -185 88 100 -35 -222
8164 -222 -144 -142 167 -79 -1 57 186 29 -102 25 31 -13 55 -88 -129 -174 7 -121 -50 -84 92 -63 -80 10 -75
8189 -75 91 68
8191F8
##END NTUPLES=NMR FID
##END=
