##TITLE=1H_Pr NCS-Hex
 200.13MHz, CDCl3,
 8 sc
 
 6.8.2025
##JCAMPDX= 6.0         $$ Bruker NMR JCAMP-DX V2.0
##DATA TYPE= NMR FID
##DATA CLASS= NTUPLES
##ORIGIN= UXNMR, Bruker Analytische Messtechnik GmbH
##OWNER= pz
$$ XWIN-NMR		Version 3.5
$$ Wed Aug  6 15:31:15 2025 Russian Standard Time (UT+4h)  she@DPX200
##.OBSERVE FREQUENCY= 200.1313
##.OBSERVE NUCLEUS= ^1H
##.DELAY= (6, 6)
##.ACQUISITION MODE= SIMULTANEOUS
##.ACQUISITION SCHEME= undefined
##.AVERAGES= 8
##.DIGITISER RES= 18
##SPECTROMETER/DATA SYSTEM= spect
##.PULSE SEQUENCE= zg30
##.SOLVENT NAME= CDCl3
##.SHIFT REFERENCE= (INTERNAL, CDCl3, 0, 14.3821)
##AUDIT TRAIL= $$ (NUMBER, WHEN, WHO, WHERE, WHAT)
$$ ##TITLE= Audit trail, XWIN-NMR		Version 3.5
$$ ##JCAMPDX= 5.01
$$ ##ORIGIN= Bruker BioSpin GmbH
$$ ##OWNER= she
$$ F:/spectra/data/she/nmr/H-C/1/audita.txt
$$ ##AUDIT TRAIL=  $$ (NUMBER, WHEN, WHO, WHERE, WHAT)
(   1,<2025-08-06 15:29:42.87 +0400>,<she>,<DPX200>,
      <created by zg, POWCHK disabled, PULCHK disabled
       configuration hash MD5:
       00 E9 B6 7A A2 85 ED C7 34 08 36 98 17 FE 4E 26
       data hash MD5: 16K
       02 D5 05 C0 F2 B6 1F 34 90 96 85 4E F6 B8 D9 E6>)
$$ ##END=
$$ 
$$ hash MD5
$$ 1F 94 1D 35 F7 81 F1 3B 93 5C B6 30 34 7B A9 25
##$RELAX= 
##$RELAX= 
##$RELAX= 
##$RELAX= 
##$RELAX= 
##$RELAX= 
$$ Bruker specific parameters
$$ --------------------------
##$DU= <F:/spectra>
##$EXPNO= 1
##$NAME= <H-C>
##$PROCNO= 1
##$TYPE= <nmr>
##$USER= <she>
##$AMP= (0..31)
100 100 100 100 100 100 100 100 100 100 100 100 100 100 100 100 100 100 
100 100 100 100 100 100 100 100 100 100 100 100 100 100 
##$AQSEQ= 0
##$AQ_mod= 1
##$AUNM= <au_zg>
##$AUTOPOS= <>
##$BF1= 200.13
##$BF2= 200.13
##$BF3= 200.13
##$BF4= 200.13
##$BF5= 200.13
##$BF6= 200.13
##$BF7= 200.13
##$BF8= 200.13
##$BYTORDA= 1
##$CFDGTYP= 0
##$CFRGTYP= 5
##$CHEMSTR= <none>
##$CNST= (0..31)
1 1 145 1 1 1 1 1 1 1 1 1 1 1 1 1 1 1 1 1 1 1 1 1 1 1 1 1 1 1 1 1 
##$CPDPRG= <>
##$CPDPRG1= <>
##$CPDPRG2= <>
##$CPDPRG3= <>
##$CPDPRG4= <mlev>
##$CPDPRG5= <mlev>
##$CPDPRG6= <mlev>
##$CPDPRG7= <mlev>
##$CPDPRG8= <mlev>
##$CPDPRGB= <>
##$CPDPRGT= <>
##$D= (0..31)
0 0.7 0 0 0 0 0 0 0 0 0 0.03 0 0 0 0 0 0 0 0 0 0 0 0 0 0 0 0 0 0 0 0 
##$DATE= 1754479782
##$DBL= (0..7)
120 120 120 120 120 120 120 120 
##$DBP= (0..7)
150 150 150 150 150 150 150 150 
##$DBP07= 0
##$DBPNAM0= <>
##$DBPNAM1= <>
##$DBPNAM2= <>
##$DBPNAM3= <>
##$DBPNAM4= <>
##$DBPNAM5= <>
##$DBPNAM6= <>
##$DBPNAM7= <>
##$DBPOAL= (0..7)
0.5 0.5 0.5 0.5 0.5 0.5 0.5 0.5 
##$DBPOFFS= (0..7)
0 0 0 0 0 0 0 0 
##$DE= 6
##$DECBNUC= <off>
##$DECIM= 32
##$DECNUC= <off>
##$DECSTAT= 4
##$DIGMOD= 1
##$DIGTYP= 9
##$DL= (0..7)
0 120 120 120 120 120 120 120 
##$DP= (0..7)
150 150 150 150 150 150 150 150 
##$DP07= 0
##$DPNAME0= <>
##$DPNAME1= <>
##$DPNAME2= <>
##$DPNAME3= <>
##$DPNAME4= <>
##$DPNAME5= <>
##$DPNAME6= <>
##$DPNAME7= <>
##$DPOAL= (0..7)
0.5 0.5 0.5 0.5 0.5 0.5 0.5 0.5 
##$DPOFFS= (0..7)
0 0 0 0 0 0 0 0 
##$DQDMODE= 0
##$DR= 18
##$DS= 0
##$DSLIST= <SSSSSSSSSSSSSSS>
$$ [...]
##$SUBNAM0= <"">
##$SUBNAM1= <"">
##$SUBNAM2= <"">
##$SUBNAM3= <"">
##$SUBNAM4= <"">
##$SUBNAM5= <"">
##$SUBNAM6= <"">
##$SUBNAM7= <"">
##$SUBNAM8= <"">
##$SUBNAM9= <"">
##$SW= 18.0517328524113
##$SWIBOX= (0..15)
0 0 2 0 0 0 0 0 0 0 0 0 0 0 0 0 
##$SW_h= 3612.71676300578
##$TD= 16384
##$TD0= 1
##$TE= 0
##$TE2= 300
##$TE3= 300
##$TEG= 300
##$TL= (0..7)
0 120 120 120 120 120 120 120 
##$TP= (0..7)
150 150 150 150 150 150 150 150 
##$TP07= 0
##$TPNAME0= <>
##$TPNAME1= <>
##$TPNAME2= <>
##$TPNAME3= <>
##$TPNAME4= <>
##$TPNAME5= <>
##$TPNAME6= <>
##$TPNAME7= <>
##$TPOAL= (0..7)
0.5 0.5 0.5 0.5 0.5 0.5 0.5 0.5 
##$TPOFFS= (0..7)
0 0 0 0 0 0 0 0 
##$TUNHIN= 0
##$TUNHOUT= 0
##$TUNXOUT= 0
##$USERA1= <user>
##$USERA2= <user>
##$USERA3= <user>
##$USERA4= <user>
##$USERA5= <user>
##$V9= 5
##$VALIST= <valist>
##$VCLIST= <CCCCCCCCCCCCCCC>
##$VD= 0
##$VDLIST= <DDDDDDDDDDDDDDD>
##$VPLIST= <PPPPPPPPPPPPPPP>
##$VTLIST= <TTTTTTTTTTTTTTT>
##$WBST= 1024
##$WBSW= 4
##$XGAIN= (0..3)
0 0 0 0 
##$XL= 0
##$YL= 0
##$YMAX_a= 545892
##$YMIN_a= -553697
##$ZGOPTNS= <>
##$ZL1= 120
##$ZL2= 120
##$ZL3= 120
##$ZL4= 120
##$ABSF1= 10
##$ABSF2= 0
##$ABSG= 5
##$ABSL= 3
##$ALPHA= 0
##$AQORDER= 0
##$ASSFAC= 0
##$ASSFACI= 0
##$ASSFACX= 0
##$ASSWID= 0
##$AUNMP= <proc_1d>
##$AZFE= 0.1
##$AZFW= 0.1
##$BCFW= 1
##$BC_mod= 2
##$BYTORDP= 1
##$COROFFS= 0
##$CY= -3
##$DATMOD= 1
##$DC= 2
##$DFILT= <>
##$DTYPP= 0
##$F1P= 0
##$F2P= 0
##$FCOR= 0.5
##$FTSIZE= 0
##$FT_mod= 4
##$GAMMA= 1
##$GB= 0.15
##$INTBC= 1
##$INTSCL= 1
##$ISEN= 128
##$LB= 0.25
##$LEV0= 0
##$LPBIN= 0
##$MAXI= 10000
##$MC2= 0
##$MEAN= 0
##$ME_mod= 0
##$MI= 1.114404
##$NCOEF= 0
##$NC_proc= 0
##$NLEV= 6
##$NOISF1= 3.799351
##$NOISF2= 2.8
##$NSP= 1
##$NTH_PI= 0
##$NZP= 0
##$OFFSET= 14.38212
##$PC= 1
##$PHC0= -1196.906
##$PHC1= 11.1923
##$PH_mod= 1
##$PKNL= yes
##$PPARMOD= 0
##$PSCAL= 0
##$PSIGN= 0
##$REVERSE= no
##$SF= 200.129724274929
##$SI= 16384
##$SIGF1= 3
##$SIGF2= 2
##$SINO= 400
##$SIOLD= 16384
##$SREGLST= <1H.CDCl3>
##$SSB= 0
##$STSI= 0
##$STSR= 0
##$SW_p= 3205.1282051282
##$SYMM= 0
##$S_DEV= 0
##$TDeff= 0
##$TDoff= 0
##$TI= <>
##$TILT= no
##$TM1= 0
##$TM2= 0
##$TOPLEV= 0
##$USERP1= <user>
##$USERP2= <user>
##$USERP3= <user>
##$USERP4= <user>
##$USERP5= <user>
##$WDW= 1
##$XDIM= 8192
##$YMAX_p= 0
##$YMIN_p= 0
$$ End of Bruker specific parameters
$$ ---------------------------------
##NTUPLES= NMR FID
##VAR_NAME=  TIME,          FID/REAL,        FID/IMAG
##SYMBOL=    X,             R,               I
##VAR_TYPE=  INDEPENDENT,   DEPENDENT,       DEPENDENT
##VAR_FORM=  AFFN,          ASDF,            ASDF
##VAR_DIM=   8192,          8192,            8192
##UNITS=     SECONDS,       ARBITRARY UNITS, ARBITRARY UNITS
##FACTOR=    0.0002768,     1,               1
##FIRST=     0,             0,               0
##LAST=      2.2672688,     0,               0
##MIN=       0,             -553697,         0
##MAX=       2.2672688,     545892,          0
$$ Real data points
##PAGE= N=1
##DATA TABLE= (X++(R..R)), XYDATA
0 0 0 0 0 0 0 0 0 0 0 0 0 0 3 -8 8 -8 8 -8 16 -16 20 -24 32 -32 40 -46 53 -60 69 -80 91 -101 116 -132 147
35 147 -165 184 -205 230 -257 282 -313 348 -385 426 -467 516 -568 627 -690 760 -838 924 -1021
54 -1021 1131 -1256 1398 -1564 1762 -1997 2286 -2650 3120 -3759 4672 -6077 8500 -13464 27622
69 27622 -153059 -553697 -37350 450150 194870 -272172 -225418 87865 151574 47230 23625
80 23625 -88448 -183541 25716 277466 104418 -280707 -247790 198558 304097 -78203 -272680
91 -272680 -49256 159819 118479 -28036 -94780 -79517 8440 147895 101804 -142610 -162243
102 -162243 90489 175047 -20501 -142901 -14385 81494 -15220 -24607 71221 -13363 -135216
113 -135216 -7507 168198 61290 -173728 -109409 152671 123608 -101679 -87402 63366
123 63366 40570 -54277 11436 96476 -47458 -160382 50293 200573 -21463 -213071 -40784
134 -40784 184754 83039 -138682 -86659 77122 48881 -19914 11099 4166 -58352 -24290
145 -24290 98096 75047 -106979 -112271 85509 122299 -41578 -113075 -6158 79797 17865
156 17865 -41522 -6460 -5605 -20845 33868 45219 -33130 -59649 22000 73634 -9122 -67055
168 -67055 18088 53303 -29135 -38007 38268 37972 -47281 -55687 49284 62455 -50720 -59531 34625
181 34625 40446 -22305 -21685 27762 7210 -50978 8594 85910 -4553 -101000 -13875 104110
193 104110 49440 -90211 -74556 61329 69713 -24354 -47137 -15793 8063 26337 26977 -9801
205 -9801 -60127 -25448 77253 59313 -62338 -75195 29746 81819 10245 -65371 -27947 31414
217 31414 24569 9888 -8115 -41828 -21867 42065 50968 -27056 -79693 2881 85325 16818
229 16818 -65489 -30150 38620 38283 -12998 -23896 4838 193 568 25108 1590 -35568 -14108
242 -14108 30628 28435 -27855 -40683 20609 32391 -16156 -20302 7755 11424 -5689 -5795 18416
255 18416 5085 -26461 3451 31509 -3059 -24873 -1888 21364 4660 -23787 -2350 20579
267 20579 -9552 -18342 11184 13159 -10420 -18413 8387 26438 -8989 -23816 12578 19375 -4565
280 -4565 -10197 1501 10318 -2862 -7536 11456 -1528 -19747 5340 17813 -6498 -21227 -3976
293 -3976 23035 7567 -25028 -5491 19586 4693 -5864 -2775 2872 3783 -2806 6446 7077 -16776
307 -16776 -7941 18774 7759 -16021 -17578 7702 21392 -8860 -21263 5992 11360 -314 -1298
320 -1298 -2270 794 938 3607 11318 -5752 -15361 9869 14448 -5531 -13259 -4510 12152 5399 -14889
335 -14889 -4666 7682 -878 -1359 272 -589 948 -1612 6077 7452 -10014 -3154 13780 3876
349 3876 -7632 -6500 3758 10120 -6164 -10773 3854 920 -2565 1575 -3870 -2839 1089 2267
363 2267 6863 -3901 -9064 7693 9631 -1213 -4327 -4210 5961 6466 -5572 -1759 309 -5696
377 -5696 2375 4855 -3472 -6931 -5922 6559 10967 -7524 -9354 3023 5915 8023 -415 -9147
391 -9147 36 5778 6937 3564 -11020 -8803 7198 8094 2067 -9527 -13956 4959 12921 1399
405 1399 -7758 -13059 -12 18522 8161 -10443 -13922 466 21142 11165 -15974 -13258 3454
418 3454 12757 10160 -9328 -16289 -2802 8752 14212 -1208 -22974 -9513 16241 19051 -1006
431 -1006 -24171 -10873 22934 19079 -6930 -17844 -7671 14826 16056 -3345 -11826 -12028 800
444 800 18751 8105 -16025 -18946 -1396 22943 15709 -19529 -23103 5112 24481 14140 -17352
457 -17352 -20847 8628 18963 7088 -7479 -15099 -2935 10177 9300 3222 -14088 -19168 6427
470 6427 22748 6967 -20651 -25110 11947 33748 985 -27095 -13061 15947 22299 -2032 -16176
483 -16176 -3626 1674 5210 12256 -26 -17204 -15691 8668 29461 1449 -36847 -16755 27043
496 27043 29083 -9608 -34514 -4885 29085 14954 -9486 -14011 -5729 9050 12828 5139 -6339
509 -6339 -20726 -7290 23774 19050 -15752 -31600 -5680 34068 21683 -26044 -30462 7534 30984
522 30984 12805 -21537 -18852 9579 15523 6455 -2804 -11881 -8411 3448 16030 12899 -19225
535 -19225 -29668 9374 33837 6697 -32118 -24462 22560 31429 -8106 -24189 -4023 13204
547 13204 12224 -160 -4125 -5285 -10305 6169 23315 891 -27445 -17825 19600 30879 -9969
560 -9969 -36895 -4872 27183 17680 -11660 -22362 -870 16979 9934 59 -9320 -11972 3611
573 3611 16148 10164 -9852 -24093 -2294 26966 13770 -19788 -27151 2455 30826 10456 -25371
586 -25371 -18242 10736 21468 4988 -15749 -9242 6814 7492 7251 1274 -11904 -10048 6678 18362
600 18362 3544 -24694 -15700 19970 19933 -10063 -22734 -3187 20198 9259 -11934 -7605 3058
613 3058 4685 4488 1204 -1322 -4566 -5066 8558 10668 -7889 -13052 -888 10653 7065 -9664
627 -9664 -10926 3827 7118 2383 -2647 -5569 1077 4549 1841 2725 -1117 -4971 553 4550 5139
642 5139 -1473 -10685 -2392 9331 4514 -6046 -9605 -1009 10512 3002 -7620 -4002 1416 4737
656 4737 4181 -1860 -2286 -1676 407 7845 2779 -9071 -5369 4267 7376 115 -10214 -4109 6723
671 6723 3312 -1675 -4567 -3470 3958 3491 -502 -522 -2649 433 5656 1074 -1966 -2254 -1311 4143
687 4143 2079 -4228 -1548 -700 86 2504 -1727 -3024 -297 -180 2574 1443 -2656 -99 1143 1029
703 1029 3483 -1080 -2778 940 1564 2341 199 -4738 -1181 2945 462 -446 -3559 -2663 3450 1604
719 1604 -1362 -1185 -2397 2122 4527 -1154 -2439 -679 2050 4795 -855 -4695 61 1774 1769 -248
735 -248 -4936 -1410 2850 819 -486 -2931 -1977 3824 1898 -1079 -656 -1043 2793 3929 -2017 -1845
751 -1845 930 988 2556 -1207 -3505 1118 1060 106 -748 -3360 -80 2596 -1017 -864 -603 -528 3204 426
769 426 -1655 701 379 1741 1935 -2425 -432 1785 -348 136 -1578 -2210 1350 224 -1743 109
785 109 -1416 703 2079 -1429 253 1106 172 2393 364 -1468 1531 411 138 483 -2242 23
801 23 1403 -1468 -247 -564 -1566 1208 -394 -1845 1186 -274 193 1347 -781 803 1049 -382
817 -382 1749 258 -1602 1155 390 -842 221 -1687 -424 949 -1662 -42 -129 -1790 1190 809
833 809 -641 1200 -751 432 2534 -410 -793 905 -316 1470 394 -1914 424 -845 -218 1963
849 1963 -2194 -2469 1196 690 661 -1151 -2224 2239 2106 -446 563 -980 184 2629 442 -441 -789
866 -789 -1971 2230 2192 -3082 -1997 -424 1306 1714 -2318 -2175 1154 221 1606 1197 -2931 -405 2609
883 2609 2085 777 -3155 -858 3564 570 -1728 -713 -1738 83 1164 -434 -19 -3042 -2117 4422
899 4422 2350 -3615 -2563 1128 4613 1319 -4142 90 2576 -232 496 139 -1269 -1185 -1292 2565
915 2565 2040 -5330 -3453 3216 3153 -287 -3929 -2014 4324 2310 -1249 -635 -1439 1244 3149 49
931 49 -1594 -1728 -1034 3051 1104 -2838 -1691 -1551 879 3625 -1364 -4513 -1203 3661 5006 -2189
947 -2189 -6490 2359 5937 247 -2983 -1503 2207 1527 -2538 1237 2165 -5006 -2879 3835 4005 -3304
963 -3304 -7889 1401 9234 -492 -7516 -755 5075 3430 -2990 -2623 3397 442 -2818 2495 2370 -2665
979 -2665 -3612 211 5071 618 -7254 -2188 4736 2765 -1394 -4450 -857 4780 1688 -1924 -1479 -753
995 -753 2440 2028 -1353 11 117 -1912 671 2047 372 -3548 -4838 2984 6687 -3692 -7642 999
1011 999 7229 2295 -6410 -3057 7159 2413 -4196 230 3233 -295 -3896 189 6534 -921 -9019
1026 -9019 611 7852 632 -7228 -4167 5774 4933 -5583 -3618 3662 1817 -1168 -457 1646 1168
1041 1168 -3123 -248 4673 -36 -4133 -1423 1698 2953 -1369 -4753 -417 2258 1150 -209 -3422
1056 -3422 -1240 3924 1485 -1967 -897 775 2178 -469 -1212 3062 -364 -4298 1063 4194 -161
1071 -161 -5625 -2843 6267 3386 -6873 -3526 4869 3061 -2567 -3246 2593 3197 -3450 -768 5111
1086 5111 59 -4698 -624 4672 2455 -5838 -3869 5172 2265 -4345 -2149 1338 1882 -932 -1526
1101 -1526 1605 27 -2485 1854 2309 -1385 -1588 748 2533 962 -2653 -113 1235 -1225 466
1116 466 720 -1952 -1531 510 2167 50 -4051 36 4206 -641 -2116 789 1947 273 -1513 1400
1132 1400 2824 -2253 -2709 3087 1760 -2851 -2588 1110 2941 -1927 -3876 2647 2007 -2608 -397 2028
1148 2028 1204 -1631 -1267 3615 1975 -4116 -506 3725 652 -2363 -1164 1808 1012 -3284 -361 2645
1164 2645 -1700 -2408 1333 1838 -343 -3058 653 4001 -804 -2642 1947 1778 -902 -1029 547 1717
1180 1717 -1671 -1946 2547 603 -3471 -107 1499 447 -1840 -1468 2502 1311 -2930 908 2135
1195 2135 -917 -942 918 1696 -427 -2845 1096 2803 -2273 -2206 1439 1014 -1184 -1742 897 2106 -2485
1212 -2485 -1662 3001 874 -1953 -67 1772 1771 -1860 -1534 2983 672 -2745 186 1414 -365 -1568
1228 -1568 -912 2426 152 -3082 660 2171 -1150 -1321 302 1579 203 -1801 1080 2245 -1398
1243 -1398 -1020 1774 378 -1077 -1138 770 1651 -2556 -1447 2024 -416 -1755 292 770 576 -1036
1259 -1036 -699 2581 -77 -2183 1290 1381 -553 -883 31 1538 -424 -2560 1113 1119 -2010 -791 635
1276 635 662 -580 -1625 1333 1703 -1899 -361 2121 16 -390 -89 997 1180 -1799 -622 2202 -910
1293 -910 -1759 170 407 117 -1637 -688 1753 -368 -1561 1329 893 -672 -81 345 1205 225 -1626
1310 -1626 1250 1176 -1168 -69 52 158 -317 -909 360 488 -1705 -84 1012 -906 -424 -44 550
1327 550 1004 -858 -58 1679 -737 -1 1014 -120 -273 -465 -304 1038 -1310 -1569 1055 164 -1237
1344 -1237 -300 -302 892 85 -916 1067 385 -850 874 865 49 72 -838 472 1009 -1378 -530 318 -304
1363 -304 122 -391 -885 339 -213 16 785 -819 -256 944 261 393 451 -503 1046 -49 -444 780
1381 780 -901 -408 896 -282 -313 -707 -707 961 143 -974 409 367 391 885 -509 197 772 -523 641
1400 641 618 -764 134 50 155 775 -1135 -1441 927 106 91 -705 -1310 1079 1046 -734 160 444 491 816
1420 816 -606 120 1054 -820 -41 713 -357 -369 -769 -318 1441 -477 -1812 366 620 394 -86 -1216
1438 -1216 852 971 -338 278 387 -31 118 -117 363 696 -1330 -861 764 205 -252 -1355 -891 1987
1456 1987 312 -1679 -335 642 1008 -264 -1281 1140 1053 -979 -280 1283 262 -687 -1114 793 1699
1473 1699 -1911 -1972 1395 1129 -757 -1714 -359 2518 156 -1839 315 1207 219 40 -18 1360 428
1490 428 -1618 359 1583 -136 -1315 -1028 630 1391 -1747 -1638 908 549 53 -807 -556 1185 787
1507 787 -1278 511 735 174 -413 -132 1375 940 -2203 -921 1302 410 -1127 -1812 446 2363 -1138
1524 -1138 -2009 628 1129 -147 -666 -188 1986 21 -1695 1375 1264 -958 -1445 -128 1766 177
1540 177 -2763 -13 1874 -112 -1232 -704 283 792 -1142 -92 1464 -347 -277 213 424 757 -523
1557 -523 -657 1120 391 -644 -141 -439 132 700 -1165 -924 451 127 91 -933 -491 1082 141 -880
1575 -880 620 628 -8 -345 179 1287 -218 -2052 262 1431 -587 -1255 -576 1211 455 -1511 -279
1592 -279 1475 -596 -605 682 932 465 -1436 274 2155 -326 -1462 709 851 16 -802 -400 884
1609 884 -214 -1208 507 312 -1043 -217 303 705 -111 -1024 847 1174 -808 291 576 -253 314 -291
1627 -291 -176 -264 -1219 199 740 -891 -634 498 284 76 -311 113 909 -504 -33 1337 82 -733
1645 -733 287 635 675 -688 -687 1426 -192 -1658 234 522 -121 -771 -615 1228 147 -1583 478 1546
1663 1546 -437 -289 242 1114 467 -1300 260 1216 -699 -378 72 112 -154 -1004 149 898 -710 -955
1681 -955 784 8 -314 138 160 639 -267 -284 1289 26 -722 466 238 -302 -394 -604 506 -323 -1278
1700 -1278 470 285 -943 -127 458 379 177 -762 1298 1156 -1149 -126 1395 436 -470 -514 274 551
1718 551 -1233 -511 939 -207 -886 97 237 218 -521 -49 1369 42 -741 630 777 43 -447 -9
1736 -9 713 108 -980 737 253 -965 -319 214 337 -217 -808 644 688 -924 12 933 -48 -114 -108 672
1756 672 870 -664 -96 1193 -368 -695 163 -90 -330 -604 -217 918 -520 -873 895 255 -464 -124
1774 -124 161 756 -207 -696 1069 360 -896 242 438 -185 -427 -714 621 251 -1497 -131 981 -393
1792 -393 -701 58 605 601 -916 288 1344 -595 -540 780 808 44 -583 186 1112 -589 -1197 621 369
1811 369 -582 -215 -246 288 -362 -916 1179 411 -596 353 666 339 -101 -388 462 324 -860 231 785
1830 785 -447 -303 -110 95 -232 -810 263 864 -716 -526 780 300 23 22 495 740 -746 -344 968
1849 968 109 -678 -249 124 575 -747 -1069 1057 206 -1000 66 490 -28 -286 -202 734 388 -943 614
1868 614 811 -357 -162 -184 52 62 -774 -116 313 -854 -199 310 -568 -492 -98 230 591 -473 -217 1175
1888 1175 121 -221 512 205 159 -77 93 1001 -275 -1020 588 236 -99 -617 -437 731 65 -777 521
1907 521 600 -261 122 473 172 237 -692 376 973 -378 -582 -124 -52 255 -289 -512 251 -19 -256 114
1927 114 -445 204 638 -384 -24 375 113 285 -130 -258 818 -162 -752 309 295 -308 -281 -430 464 248
1947 248 -1195 59 650 31 -80 -380 405 840 -489 49 604 -48 -183 -242 219 581 -928 -932 737
1966 737 -134 -337 -420 -329 398 229 -906 270 617 -305 6 -75 531 344 -869 -43 702 -36 -315 -122
1986 -122 -16 525 -554 -996 651 141 -439 -241 -124 479 -33 -638 797 871 -558 25 283 552 177
2005 177 -675 -154 705 -205 -496 -249 -105 349 -403 -606 479 214 -183 83 -519 265 193 -654 457 799
2025 799 -216 -152 -142 267 353 -920 -277 728 -50 -756 -315 166 338 -608 -815 621 346 -638 324 309
2045 309 303 -173 -925 630 568 -748 -397 495 404 -303 -852 203 619 -902 -272 521 54 -457 -69 -40
2065 -40 698 -231 24 702 -22 -184 48 -118 22 427 -376 196 -471 -538 504 -295 -664 220 30 -448
2085 -448 -85 -271 630 15 -591 678 763 -366 -34 33 533 -289 -986 223 557 -762 -576 83 245
2104 245 -329 -728 187 866 -462 -499 691 333 16 -59 225 930 -288 -653 741 189 -325 -164 -3
2123 -3 229 -334 -635 141 -65 -714 122 526 20 281 198 -87 346 -567 497 404 -496 -67 363 -154 -230
2144 -230 -583 234 524 -692 86 602 -261 -566 169 76 471 -462 -203 1186 -80 -753 244 297 276 -228
2164 -228 -520 565 -156 -817 225 169 -464 -44 93 130 85 -492 231 453 -327 -54 353 -122 -76 -190 -128
2185 -128 395 -549 -241 581 -461 -193 -140 -17 176 -325 -9 399 -106 -465 403 113 -272 -298 275 562
2205 562 -139 -396 464 351 -785 -223 22 28 -161 -704 386 -8 -832 -205 506 16 77 -51 524 626
2225 626 -226 28 489 -74 -170 60 -355 338 -320 -326 554 -549 -488 423 -123 54 116 -21 313 -68 -343
2246 -343 889 201 -481 338 519 62 27 -210 251 -34 -816 104 60 -455 -193 -17 2 322 -694 196
2266 196 635 -287 -272 200 110 26 -136 -199 639 -293 -185 351 -497 -149 -65 -246 271 -136 -480 426 -49 -709
2288 -709 74 315 -88 236 -115 356 238 -697 350 414 -479 -128 -186 145 -9 -470 -98 621 -482 -423
2308 -423 256 110 254 140 37 841 17 -257 848 -123 -292 95 50 238 -309 -331 390 -29 -429 242
2328 242 -61 -247 168 -304 409 157 -558 497 518 -275 29 182 173 147 -373 11 338 -622 -131 385 -462
2349 -462 -380 -269 -59 369 -365 -350 516 24 -253 161 71 369 -136 -330 333 181 -438 297 -88 -134 -296
2370 -296 -232 340 -193 -326 -25 57 -255 139 -177 -168 -35 -269 29 150 -493 185 126 -400 -101 142 -95 -172
2392 -172 -345 -166 120 -149 -202 449 -17 -249 -131 231 869 -251 -345 632 52 -82 13 143 153 15 -651
2413 -651 316 42 -154 83 -301 18 276 -309 61 379 -198 129 227 72 316 172 -27 250 203 -11 215
2434 215 -439 -34 299 -366 -65 210 -342 184 -16 -87 570 -215 -131 263 64 50 -98 -156 652 72 -470
2455 -470 -185 76 -211 -141 -167 70 192 -565 187 584 -141 32 -8 99 686 -274 -219 205 -143 -378 336
2476 336 14 362 -34 -324 -18 -156 -336 6 -24 185 0 -575 -121 236 173 -269 12 96 466 -142 -299
2497 -299 227 48 -172 -115 -126 326 -269 -576 -12 -148 -317 57 169 -18 166 -182 125 621 -54 52 388
2518 388 -11 322 -281 -145 358 -172 -148 242 -259 370 -316 -256 150 231 -43 104 -36 124 842 -474 -165
2539 -165 485 -110 -474 -221 -159 560 -244 -433 404 -91 -422 108 119 212 30 -366 305 -8 -45 -173 106
2560 106 199 171 -321 135 127 -239 39 285 -378 53 -119 -110 88 -98 -134 2 -238 -23 376 -140 61 278
2582 278 -14 204 93 -180 259 -150 -337 110 141 -221 -276 -422 53 -126 -523 155 449 -260 -210 92 79
2603 79 -19 -298 153 393 -306 -100 250 144 313 -558 -207 403 -469 -259 224 147 57 -50 90 373 -77
2624 -77 -116 210 34 -169 93 -247 59 290 -178 214 -54 -309 -62 -100 -585 118 80 -132 64 132 237 176
2646 176 -319 -111 145 162 102 -240 167 456 -557 -153 546 -190 -411 -16 -24 -45 -333 -124 327 -166 -466
2667 -466 185 159 4 -122 -137 812 -3 -560 23 328 -283 180 -165 -99 124 -189 -63 203 -425 -99 138
2688 138 -38 16 -154 1 240 -207 -326 354 -591 -32 510 54 73 -189 26 598 -77 -367 75 77 -328
2709 -328 -514 164 132 59 -289 419 268 -221 -143 189 250 75 -442 93 2 -321 46 92 10 140 -225 -110
2731 -110 372 -538 -55 293 -122 -84 223 -7 197 -267 21 424 -237 -260 229 -448 -68 -318 -64 333 -207
2752 -207 -243 579 -186 -502 123 258 -105 -152 -23 525 179 -376 289 367 -218 -90 65 -136 -35 -525 163
2773 163 157 -524 -403 310 18 -190 -325 96 155 90 -8 360 131 -243 -166 -41 278 -412 -341 465 -96 -294
2795 -294 133 77 -359 -98 -26 323 80 -669 212 181 -139 284 669 336 -12 -367 -105 322 -440 -20 44
2816 44 -504 -225 -283 130 185 -386 -145 182 -14 -106 54 158 334 -94 -209 212 -15 -261 153 -84 -270
2837 -270 -28 -159 -7 -314 -581 253 -256 -388 21 337 92 24 -139 339 580 -195 94 417 -17 -310
2857 -310 -101 235 209 -244 -41 252 -63 -326 -98 322 59 -60 -97 298 75 -269 364 276 -181 -87 -77 123
2879 123 -4 -454 273 164 -273 -200 -108 -139 -121 -319 87 162 -344 84 399 -166 262 408 0 113 -456 199
2901 199 -12 -188 -35 170 -62 112 -215 22 531 -158 -329 169 52 -66 80 -283 451 -40 -507 163
2921 163 48 -56 -136 137 13 -160 -411 123 166 -445 117 -54 -167 65 20 63 117 -46 -65 141 -203 -127
2943 -127 264 -66 -71 158 -206 204 -238 -152 242 -221 -530 162 -145 -84 7 -79 214 -348 -298 -15 135 -106
2965 -106 -186 35 441 59 -81 311 215 -255 -105 -97 99 7 -288 -256 81 -58 -228 113 -111 318 56 -393
2987 -393 346 269 -218 7 -415 -78 189 -168 -70 303 -277 245 272 -292 -98 -420 -351 -39 54 90 -133 -48
3009 -48 246 10 -374 163 -79 -20 84 -472 -210 -30 -364 -78 90 -219 -73 81 131 172 -176 -174 366 273
3031 273 -12 272 27 347 -94 -411 22 -196 -32 -189 -109 -106 30 -243 -141 270 -71 178 5 -139 334
3052 334 -108 145 255 89 -276 -170 -99 96 -32 -503 -41 103 -375 -176 -111 -311 -37 -137 -202 393 -340
3073 -340 68 -133 224 291 -225 -412 164 -35 -129 20 -357 103 177 -2 105 -55 -200 202 165 51 178
3094 178 -131 -144 280 -188 64 42 -114 96 162 -310 103 -15 -230 -180 -272 -55 -62 -372 309 294 -107 19 146
3117 146 -55 518 -119 193 306 -108 110 315 -10 319 -96 -296 51 -156 -40 10 -300 46 268 -353
3137 -353 -85 276 -180 39 -57 -81 333 176 -104 477 -103 -40 151 -94 234 8 -82 85 -35 33 -266 -83
3159 -83 97 87 -267 131 425 -220 -176 -52 106 547 -216 -264 320 93 -13 -203 -177 100 -75 26 160 29
3181 29 -66 -102 258 -152 34 -243 -10 235 -103 61 -94 -223 39 57 -136 305 -179 -303 172 -451 102
3202 102 344 -273 381 261 100 273 65 -70 14 -454 -60 193 -114 -284 -167 174 316 -185 -325 307
3222 307 26 -255 53 -96 245 180 -81 442 131 -224 -6 -4 -30 52 263 -62 103 -27 -278 -153 -385 89
3244 89 55 -101 -18 -178 -165 277 -188 243 39 -155 -59 56 297 184 62 -155 201 -37 -135 147 227 28
3266 28 -220 -79 -251 -50 -406 245 161 -257 7 -30 241 236 71 64 99 -182 121 184 19 30 -166 68 44 -364
3290 -364 -190 -99 32 219 236 -5 57 -151 -127 263 137 54 191 -107 -89 288 -61 222 -48 -288 -18 -118
3312 -118 -294 -81 -223 -36 -120 -347 -112 221 25 270 133 -240 -53 102 -60 -5 -233 -313 60 -135 -121
3333 -121 67 -216 110 -239 -184 123 46 76 234 -99 -43 247 50 -45 -354 -262 173 -67 -271 145 32 -122
3355 -122 47 -477 -33 -125 -410 235 36 0 46 -264 -154 316 -319 23 239 99 102 -112 -224 202 -275 -207
3377 -207 206 -74 -60 96 -111 200 -68 -227 202 -12 -257 413 -48 -144 282 157 -140 103 -139 -240 166
3398 166 -131 -2 -68 -146 143 -171 56 89 126 -22 59 -133 249 144 -33 203 -367 -100 353 -99 -431 424
3420 424 -181 -191 -81 -94 54 112 -50 229 -11 -131 256 -110 -118 112 -380 -37 241 -97 -83 120 176 117 -152
3443 -152 4 191 -241 -8 -164 -30 -57 -65 -175 -23 229 -16 188 142 26 497 -36 136 136 -74 103 -261
3465 -261 -120 -71 -209 -337 -55 -213 261 267 -131 285 -108 -104 -55 427 84 2 -316 8 153 -222 -1 -14 -223
3488 -223 -92 132 -253 185 -224 -61 129 75 -199 76 -242 308 199 -77 -36 -6 105 -84 136 -148 43
3509 43 -13 48 -50 -198 -96 -167 -331 -67 -156 -386 247 160 20 218 242 300 162 -55 214 44 12 263 -53
3532 -53 -170 -222 -63 34 65 -33 -280 125 75 324 128 -326 59 94 -40 155 149 114 -42 -101 132 226 52 6
3556 6 95 -207 230 -118 -44 206 282 -64 -116 -130 108 96 45 97 175 -161 -72 -53 174 331 -278 -46 124 54 121
3581 121 43 -205 67 143 -297 -183 -347 84 -20 -126 238 -22 -153 34 244 -40 -74 -40 -121 -54 -214 -2
3603 -2 -146 44 128 -85 -38 342 -91 -231 112 100 -160 190 -113 30 54 -79 104 182 -228 94 -153 5
3625 5 220 -17 -9 168 -107 48 -3 -25 258 55 -127 312 269 -206 63 223 88 47 -200 22 147 -141 220
3648 220 -57 11 225 55 -53 357 -68 -24 160 3 249 140 -138 119 2 -77 -68 37 67 -302 -102 18
3670 18 -68 -372 -210 30 -81 202 -133 45 31 226 -144 186 -6 -29 3 -367 79 -79 -615 192 57 -377
3692 -377 98 -212 -130 136 -297 31 -43 -105 229 54 -73 281 -208 232 -270 -107 -62 76 79 -44 149 -46
3714 -46 66 -35 73 -114 44 -55 167 59 60 218 -370 174 -187 -51 -69 53 -71 -33 144 125 98 -268 -46
3737 -46 -254 -262 273 -216 -30 -146 -244 -214 130 -7 78 54 5 -81 88 -131 -39 -186 -87 -20 -238 -13 312 -83
3761 -83 -98 -198 -14 -27 265 -3 -28 73 -86 383 42 -61 43 -134 47 -85 31 176 -77 -52 -92 -107
3783 -107 -109 75 -208 -92 119 -141 57 275 180 200 212 -76 294 -213 -36 94 -76 243 -119 -291 99 4
3805 4 -9 120 -121 -282 -252 -48 -203 -31 240 139 66 -175 232 13 101 -9 -184 118 -97 -180 149 2
3827 2 -135 -178 33 -84 172 -72 146 141 -428 268 31 -195 -48 34 -248 80 21 -144 210 -191 98 -74
3849 -74 -57 -175 42 197 50 176 141 -8 -29 -81 -19 -55 208 -84 -222 71 -283 34 -47 97 -220 -121 94
3872 94 230 146 -160 -3 191 175 150 74 -55 207 15 9 323 -220 -223 168 49 -3 81 2 223 -105 109 157
3896 157 -330 41 76 -74 -157 -76 22 -110 -11 -58 -184 100 37 -137 256 -194 57 125 207 -70 -255 -1 139
3919 139 60 -217 -23 207 302 -54 -132 74 56 -70 -233 -197 63 54 -32 -6 -227 -167 -10 -107 121 74 -80 101
3943 101 49 -171 5 238 -149 328 117 203 -57 -177 -156 39 -35 158 17 -75 -290 -231 -70 53 1 125
3965 125 41 -276 -148 -3 159 -34 184 -33 207 -8 -102 153 -26 89 166 -238 -30 202 -108 -149 -211 73
3987 73 -126 205 -64 -19 -54 -74 -50 -149 237 -72 46 -31 -66 -166 -107 -1 -78 -74 -57 147 2 61 -146 -59 116
4012 116 -140 -226 281 275 -12 -27 -21 -101 -67 118 -305 211 -70 -60 -7 175 -195 25 -13 14 543 -105 43 40 155
4037 155 105 159 100 48 -17 -234 -37 41 131 239 -66 -30 -51 102 -162 -230 -38 116 -186 113 -103 -259 137
4060 137 23 -350 71 115 -43 53 -22 5 271 -192 115 58 -248 106 -52 39 55 -56 -23 167 -158 -55 26
4083 26 -214 -34 91 50 -10 94 -20 -287 -217 -39 41 117 59 273 -155 -266 -291 183 -97 27 23 98 -98 152
4107 152 3 56 163 47 -37 213 121 -146 -109 -20 128 190 203 114 -84 53 21 83 -164 -51 133 -161 94
4130 94 -87 -53 60 -185 67 209 -183 15 94 -58 -169 -147 119 -100 -138 -299 302 -58 137 156 -285 135
4152 135 104 -238 109 100 115 -41 345 -107 66 -85 63 10 -73 176 -310 -93 155 -127 282 90 217 124
4174 124 -127 -152 327 95 44 -87 268 -113 -124 -158 -148 169 -307 -8 -80 152 87 82 -127 63 81 -168 -44
4197 -44 39 257 289 -146 -91 -22 -46 383 16 -145 56 -116 -66 54 48 60 -43 228 -56 -68 118 -16 43 -125
4221 -125 -48 114 -250 92 -151 -66 220 -11 -139 64 123 86 -71 -158 124 50 169 124 -84 24 -15 47 15
4244 15 -228 -142 94 -73 214 200 77 -44 156 -329 -14 -80 -170 96 -131 -364 -193 42 -5 47 -346 12
4266 12 180 -182 -81 -9 61 249 -285 -151 168 -141 -158 113 -90 44 175 -36 126 2 157 125 159 -46
4288 -46 -175 68 67 -116 -297 -77 -173 18 115 235 -129 161 -182 -130 132 -39 114 129 72 -50 45 42 340 -76
4312 -76 -1 -22 -102 -69 -47 -57 -61 -191 54 133 52 -26 102 -12 -77 134 17 431 37 -324 86 39 134 152 -18
4337 -18 -159 -6 -20 -10 109 -79 72 -67 95 -76 -103 100 -130 121 -17 58 -57 2 87 -255 -189 141 -416
4360 -416 -248 -91 -20 -39 100 -145 -173 -167 -233 65 -98 314 44 -126 56 152 -35 88 -71 90 171 146 -113
4383 -113 22 62 130 100 -27 8 -12 -145 162 -362 -292 219 -78 -230 134 -72 72 89 -108 -38 -196 -48 -3
4406 -3 23 39 -173 -38 -63 17 -19 245 10 -120 126 48 36 -46 -317 84 138 -264 27 215 -147 4 -245 125
4430 125 -5 76 -46 8 235 -395 -322 -366 157 -32 -295 160 -134 59 62 37 -244 -47 -14 31 0 -140 194
4453 194 263 185 199 -86 98 79 22 176 38 -150 -159 -100 -169 18 60 -133 -118 -62 -117 11 -202 6 104 74 -8
4478 -8 56 79 196 209 -99 147 39 33 71 97 -187 -38 47 127 335 8 45 18 157 115 -216 37 315 -310 101
4503 101 -45 -8 -37 -43 15 240 111 98 190 -158 163 114 76 -47 -200 -318 100 -322 -137 231 -18 35 -25 -42
4527 -42 291 275 -56 152 130 32 197 207 -297 -247 -229 -95 -5 -169 123 207 7 -42 -4 177 -19 128 141 366
4551 366 4 -35 -125 -98 -170 20 -56 49 30 -227 -111 -104 -75 -9 -170 -211 185 -62 210 28 -145 128 -146 75
4575 75 66 90 34 -16 93 -1 -24 -73 -158 -12 -8 -207 48 -222 -71 83 -18 139 -193 -92 169 15 109 -65
4599 -65 -97 183 -78 -32 255 70 -134 -44 -150 9 -179 21 -29 -113 -125 -7 247 -87 -90 28 215 149 -72
4622 -72 414 -190 -374 75 -27 -81 -179 -6 64 -75 -204 175 -67 157 -202 84 174 25 -310 -74 339 -103
4644 -103 18 -160 19 143 -190 -123 60 222 -80 -23 -50 -127 153 -105 5 92 -219 -88 42 -155 268 159
4666 159 74 71 8 202 261 22 46 53 -134 109 39 382 -17 -76 92 -225 -2 27 -42 -437 130 88 -55 -168
4690 -168 -96 -122 65 -47 -215 -51 -84 -163 -70 -120 33 122 -109 79 -86 91 -42 80 46 -41 -10 -151 -164 -39
4714 -39 -46 -31 -2 7 -296 -38 78 -351 -41 166 48 34 -123 137 201 20 -271 285 20 160 317 -320 106
4737 106 -134 -170 82 129 -95 71 -220 -34 -228 135 159 -222 -94 -41 -17 68 259 65 86 299 -80 -117 -70
4760 -70 -52 75 -4 244 -168 213 -116 254 -134 -172 370 108 -269 -39 -91 -253 138 84 66 85 166 -11 -164
4783 -164 190 158 -199 71 -188 -127 17 -139 -98 154 -55 10 -2 156 -226 104 59 203 45 3 107 -25
4805 -25 -50 40 -27 126 -146 46 198 93 -49 47 264 -59 23 -129 96 191 -253 -222 54 65 -53 111 11
4828 11 22 -70 -9 117 -9 -18 106 40 -9 158 -141 105 -139 16 172 -27 150 -179 44 -16 -84 -181 -177 -91 -61
4853 -61 -250 -1 -181 -10 161 -59 61 -217 -122 85 -119 34 41 -144 -58 -106 46 45 43 59 153 71 -126 91
4877 91 -73 68 -6 -130 1 209 136 311 -18 -68 174 127 -259 73 -188 75 -125 -74 -36 -175 -66 223
4899 223 -50 -90 -135 -100 -27 -168 -160 -47 81 -84 -201 -186 45 -305 15 -31 -32 -212 -54 1 130 -169 177 -178
4923 -178 114 -200 -46 123 -71 96 -83 -174 -35 120 157 142 246 -195 -25 -180 80 82 321 -97 104 -70
4945 -70 147 124 50 152 90 -108 110 30 -1 141 -302 76 1 -43 -59 -92 -211 274 125 57 -127 -65 -92 -68 -113
4970 -113 78 -238 13 45 -172 -23 -61 9 40 -137 -148 -198 124 67 -144 -2 -189 -7 -272 -365 25 -99 48
4993 48 119 -25 241 -43 -63 220 -203 102 69 0 11 79 131 -342 -8 17 -178 -49 -75 116 84 117 -160 -118
5017 -118 99 210 -24 -30 173 45 -95 158 -10 -29 -84 71 -56 -318 63 103 -230 36 -101 -104 -176 -141 -185
5040 -185 15 257 -50 -13 -195 174 -132 -191 172 -73 -21 -84 -36 -10 180 72 -64 127 150 193 -243 106 -124
5063 -124 283 205 135 -121 -67 181 255 -128 51 -41 148 58 41 171 -118 -97 145 35 -159 -236 -292 226 -24
5086 -24 17 120 48 213 -11 11 -268 -185 131 -71 -25 -280 -94 39 136 -251 -75 -70 43 -26 14 0 96 409
5110 409 80 -5 -98 38 -89 -206 -112 170 52 -38 -115 -120 -86 -37 131 -78 62 273 -33 -195 328 94 341
5133 341 -113 -149 151 255 127 -101 -33 -132 124 -244 -99 -277 -202 -268 -389 -174 -174 234 64 -41 -394 -72
5155 -72 193 102 -9 -102 -69 -76 -248 -130 -172 -184 116 -118 57 288 -109 -116 -34 -71 -1 207 -239 -77 36 -117
5179 -117 141 261 188 -49 77 -66 -56 15 -48 -39 -62 232 79 -96 41 -59 89 -159 21 82 -48 50 -151
5202 -151 70 102 16 62 105 -11 30 81 95 -224 134 -85 -70 57 23 -232 -20 173 -78 -135 -4 -181 56
5225 56 -128 -44 13 37 50 80 13 100 -123 20 167 -60 125 -88 -20 253 70 23 -55 253 -125 178 153 -167
5249 -167 89 -85 109 -248 110 104 -39 -105 -165 -174 -60 111 85 5 36 -160 246 -12 245 58 -150 119 285
5272 285 96 -34 218 -122 -222 -182 184 -106 -99 -258 -234 -118 -247 351 336 -283 -21 112 223 -245 141 -56
5294 -56 355 -100 233 119 115 257 -132 -111 2 51 -36 -221 43 -274 138 -64 217 53 92 24 129 -1 -45
5317 -45 -25 -272 330 -126 73 -59 69 49 13 -305 197 -39 360 3 -162 -7 -61 -13 250 -58 -108 227
5339 227 159 117 -2 112 404 87 -208 -120 106 -239 -120 171 121 -132 156 169 27 86 -1 127 -181 29
5361 29 274 12 89 19 -23 2 -101 -210 123 -323 152 -90 290 -69 -100 -264 -9 -78 26 -59 -146 -14 -196
5384 -196 124 10 17 -175 -16 -61 138 24 -67 138 363 90 51 197 -12 121 114 177 -242 65 434 10 -45
5407 -45 -322 18 -21 -69 99 -19 126 99 115 -79 102 136 -157 72 -207 -164 -120 144 -37 -101 388 -49 -16
5430 -16 -10 118 111 64 -141 -101 -76 -150 -11 -78 325 -46 -76 -95 176 -123 -76 122 -7 158 -270 196 238 -200 -116
5455 -116 102 -114 -167 34 215 168 12 -215 -16 45 -164 -55 29 -6 -18 14 140 77 57 -73 -72 18 198 -168
5479 -168 40 -25 61 -53 23 -116 116 -65 52 -266 -214 -76 -219 35 206 177 -153 -73 22 -161 22 193
5501 193 4 69 57 -8 -59 59 -21 -111 -171 -119 84 101 -66 -14 128 -150 -107 126 -34 -80 -31 -32 -110 -236 182
5526 182 91 143 94 -284 127 117 151 -108 -118 -94 -81 -80 99 336 166 -97 228 19 83 138 98 -96 87 277
5550 277 -51 -21 231 -126 -4 216 -42 5 52 176 78 233 146 7 36 13 112 95 -200 149 -15 7 174
5573 174 -381 93 -7 122 135 -114 -241 -188 -99 -213 -111 -77 -77 -25 -126 -127 59 -119 42 -185 -17 -157 -359
5596 -359 202 161 72 91 -186 40 111 -174 -458 160 -70 -82 -123 -185 -146 -239 177 62 144 -94 -24 186 -100 29
5620 29 190 -243 -147 -52 33 -148 25 147 -148 58 39 -10 -8 -185 116 71 124 -153 35 -82 -115 151 -58 -54
5644 -54 113 -17 -134 42 -96 -87 -24 112 23 53 61 184 -290 291 97 227 81 -116 -201 -10 326 -187 -67
5667 -67 182 -59 245 190 -72 318 206 -211 -141 122 -173 93 277 149 521 12 38 -27 -63 90 -14 37
5689 37 16 -94 -172 97 2 165 -5 -24 58 -40 237 201 -109 194 68 -16 -20 -51 86 -175 42 -194 -135 127
5713 127 95 195 -180 -37 183 -41 153 13 -274 183 46 -80 320 79 25 94 99 -12 318 -172 -296 186
5735 186 -187 24 -54 41 -165 -12 171 98 122 -143 271 -295 61 -25 152 -65 -156 10 163 -59 -43 348
5757 348 -161 -57 -116 -43 -165 16 131 92 -33 5 219 -380 39 304 -204 -26 -70 -87 -355 152 -129 -115
5779 -115 -66 -53 3 -214 153 9 -28 -240 161 -146 -37 58 -132 291 -40 120 -108 1 242 40 -268 -333
5801 -333 -68 149 118 -99 -123 8 -41 53 339 108 157 -247 -135 112 -94 51 -4 57 -30 -74 -51 -237 -3
5824 -3 -158 -69 107 -54 47 211 216 135 143 201 -19 -124 176 50 62 -138 -78 8 8 -308 75 204 -100 219 230
5849 230 195 108 249 -100 321 -42 -83 56 -419 196 91 2 51 170 -169 -45 70 61 184 179 -284 144 -139
5872 -139 -99 -38 -201 121 65 -102 -67 -90 -36 -1 -33 46 -73 93 -21 -78 23 -96 -105 111 80 69 -197 -184 -31
5897 -31 82 -153 -165 -45 -124 -132 232 -25 -45 102 1 104 -216 33 -119 -127 -224 -114 -256 -99 -128 -141 -154 -75
5921 -75 198 -224 -99 94 137 54 39 312 236 91 75 190 117 -76 82 123 78 -39 -28 -7 5 -126 246 -9
5945 -9 -35 -125 38 95 -415 -47 -13 -368 115 -165 -71 -83 -18 33 -89 -105 -125 189 -93 98 74 -222 -65 179
5969 179 66 169 -156 -179 318 25 11 7 -88 -47 175 102 -315 93 -33 -91 148 -82 -114 19 293 -6 54
5992 54 -179 -241 -20 -124 -122 146 227 113 46 -245 -107 98 80 232 26 -105 36 61 45 -208 75 192 210
6015 210 86 36 -55 33 -226 -21 53 -107 102 -43 6 33 -74 63 379 -267 128 -169 51 36 -145 -68 -93
6038 -93 -157 -83 -56 -150 110 163 43 132 -126 -54 4 -287 33 86 -31 -138 376 -28 -89 -191 -177 103 -203 -64
6062 -64 81 139 -24 -55 -20 -246 121 285 218 163 -165 -140 -2 14 214 53 -277 117 38 -42 79 384 -51
6085 -51 4 -283 172 -50 -319 179 34 40 18 -203 257 -37 -286 218 87 -148 -51 -5 109 -64 -273 -13
6107 -13 159 38 -141 8 -178 -184 -143 -194 107 101 169 -138 5 243 246 -293 64 187 -70 164 -7 74 24 64
6131 64 357 -43 211 -274 49 -161 4 -319 -24 35 -244 270 -151 180 -194 92 -147 -2 -325 -202 -9
6152 -9 -10 -158 -170 -36 -5 -408 -98 -114 -121 -95 -7 144 -76 298 307 103 32 -52 131 -45 25 190 306 -352 19
6177 19 -284 -107 128 -145 36 -64 -65 -233 -86 -4 59 57 226 84 7 205 89 33 -104 -52 147 213 116 -219
6201 -219 -160 -5 210 -83 108 -179 -152 -128 -236 194 98 284 -82 -100 113 246 -170 -90 -220 -18 -6 -53 -69
6224 -69 36 -14 90 38 -247 208 -13 14 -60 142 -138 8 -127 226 49 -67 289 61 -75 14 87 204
6246 204 163 -185 -87 -72 41 -14 196 -112 44 48 141 -66 -31 -4 -172 148 112 -134 -142 67 136 52 101 -62 49
6271 49 -95 21 -130 44 -55 82 184 18 87 23 29 -50 -118 10 65 -30 277 50 -117 79 -87 -88 -128 -87 182
6296 182 0 115 -47 151 10 36 85 -311 -89 -89 141 40 -301 313 365 226 43 77 8 11 -87 178 56
6319 56 149 156 -193 -171 -57 -77 -339 -18 75 -81 39 60 -44 -262 -169 63 102 171 120 -119 -62 -37 -160 15 178
6344 178 229 78 -48 6 70 -183 154 237 -112 -35 30 -152 -91 -35 22 -152 -256 -65 -57 -101 -49 -145 -194 106 87
6369 87 -139 14 53 -254 33 218 -63 -86 -295 -253 -63 209 51 -93 160 41 41 -181 100 83 211 68
6391 68 105 -128 16 -138 -133 28 -25 15 180 -198 -269 -18 11 -51 -99 58 51 -37 48 115 -197 121 -244 -16 -135
6416 -135 -28 139 -166 138 41 -50 -197 10 363 40 3 -31 122 16 -172 -36 48 78 -121 5 35 330
6438 330 -37 -99 191 -249 -124 74 -83 -110 43 67 147 26 46 -287 261 -291 26 283 24 -4 -224 28
6460 28 6 -170 56 52 39 -307 -207 -208 -21 182 -183 59 255 5 284 -6 189 163 125 6 -88 105 -147
6483 -147 58 -147 -10 -62 -112 -84 -149 93 -158 -89 -177 363 83 56 -282 58 3 -33 197 -2 -182 39 81
6506 81 194 -76 368 57 -89 93 34 -51 101 -281 -3 -28 235 -26 -472 241 -115 71 143 -75 -215 114
6528 114 124 -41 -232 -40 232 -88 159 17 -7 -17 26 174 -115 -17 -284 -105 267 30 169 252 -453 94
6550 94 -328 -218 230 32 -231 -140 -1 -185 -8 14 140 222 36 -209 -121 142 111 -86 190 -166 214 79
6572 79 75 -56 8 -214 161 38 31 -178 -212 14 -73 57 -77 -116 -3 89 -319 261 -12 -228 -62 30 -36 16
6596 16 25 90 79 35 -169 33 -7 -242 120 53 -49 33 -106 -1 86 137 293 14 51 28 168 -143 98 74 149
6621 149 -75 48 66 196 -392 -33 174 -45 -65 -57 -28 104 57 -97 -98 -35 -333 57 -65 62 -7 54 -238 -122
6645 -122 102 192 -207 -2 239 -77 -57 15 34 -68 -141 -151 115 136 -179 59 41 -61 131 -82 -99 100 144
6668 144 34 -146 50 28 164 -195 -179 18 -124 156 216 186 -38 -59 -41 201 79 44 -157 102 -162 -66 130
6691 130 -294 -182 -69 -164 -93 22 279 6 89 130 230 36 77 36 -10 -43 -156 -81 -24 -138 -160 -69 90 -123
6715 -123 -330 -74 -115 331 237 17 81 -185 -57 76 -137 40 0 -46 103 396 -16 -32 -203 -49 109 -128
6737 -128 187 154 209 49 72 112 -11 170 -103 24 114 207 175 -3 81 -210 -56 155 3 -158 -343 -72 13
6760 13 -8 55 28 -68 -49 36 -365 120 148 85 -62 -57 -146 -25 -81 191 219 -41 208 110 23 -149 -64 91 86 169 95
6787 95 -107 114 -229 -39 173 252 -50 110 227 -121 -139 109 42 -210 -199 39 -137 -27 -25 -72 34 -65 -25
6810 -25 -28 -112 -286 213 -92 76 34 120 -170 269 22 -110 -39 -272 85 -24 -87 55 -85 91 -17 235 85
6833 85 -117 -255 -189 52 128 42 -1 -101 -371 122 162 -129 1 48 -306 103 -46 107 219 6 357 -32
6855 -32 -2 1 -75 195 191 109 46 118 56 -16 60 -38 97 92 114 194 18 62 -228 -45 -111 -243 -85 -390 34 -205 36
6882 36 -40 213 -176 18 -151 -135 -168 -138 -269 -44 337 123 168 95 253 -157 -4 -147 -89 -26 166 111 103 44
6906 44 -3 -61 4 123 71 269 115 265 4 -38 176 86 -221 66 -27 16 185 -67 54 -69 97 -106 -67
6929 -67 25 -83 220 118 -176 67 -301 -20 321 13 133 -182 -115 54 86 204 -42 -45 55 27 -183 -127 -122
6952 -122 11 142 -236 117 246 -137 124 -124 -187 -84 -108 20 49 67 70 -25 79 -65 -352 -196 60 -46
6974 -46 -111 -70 -110 -92 103 124 -197 54 -105 16 131 -61 -135 148 176 225 24 23 146 -227 17 -184 29 -255
6998 -255 190 44 -99 52 3 260 154 -179 -48 26 49 -417 -199 257 -230 101 -106 98 58 -96 178
7019 178 233 96 250 -43 -12 230 -3 205 -115 -77 -179 -37 -142 149 -124 -35 -143 100 143 1 218 -109
7041 -109 147 -34 300 -121 240 -153 0 89 32 141 -98 188 -60 -73 51 143 -66 -253 38 -306 78
7062 78 -227 37 73 200 -7 -119 -66 -43 -36 -243 -90 53 231 97 118 154 -4 167 -77 111 98 -34 -76
7085 -76 -211 111 -28 -94 191 124 -65 75 -141 -112 17 -147 -101 -49 -59 -55 137 44 121 191 1 14 131 147 -57
7110 -57 104 208 -138 126 171 -194 56 -109 325 -147 -196 -49 -19 114 81 -80 53 202 -37 85 -173 164
7132 164 279 -22 -4 116 -272 -33 -83 126 -94 -180 -54 -1 -57 -67 -66 -83 -231 -202 -54 -210 -90 -302 -180
7155 -180 19 101 -41 -11 78 -169 279 -55 -1 -174 18 97 274 93 -74 -105 146 175 -196 -44 180 -77
7177 -77 -155 428 -31 32 147 57 -18 -476 -335 -188 -57 -39 220 0 37 54 -108 9 66 292 -45 192 8
7200 8 -147 -145 139 -128 161 -176 133 -142 -43 124 -42 -51 23 291 -68 -65 -101 236 300 -104 -95 -174 43 330 27
7225 27 -124 91 -275 -171 61 27 40 205 48 211 104 -273 120 -191 -210 16 97 -68 -55 -86 -121 39 149
7248 149 -24 -87 143 -70 123 40 70 -263 201 59 135 135 -99 33 -121 48 -71 94 86 -185 -20 1 -179
7271 -179 76 -166 46 27 -28 26 9 43 165 46 -88 -374 -119 4 128 84 23 -12 147 194 56 -134 1
7294 1 40 0 78 243 8 48 -97 37 90 -221 136 -132 252 9 -6 139 -178 -99 317 128 69 -133 127
7317 127 -153 -5 -253 -168 -16 9 -44 -190 24 9 187 -130 116 -145 -101 284 -94 163 -174 -240 85 -89
7339 -89 -1 -264 26 -130 -82 -155 269 -104 101 -102 140 33 115 1 143 -106 -84 61 -92 34 -43 146
7361 146 -111 124 186 1 349 100 79 182 128 -214 236 83 -150 42 -116 76 58 126 24 88 108 -74
7383 -74 -84 -70 -6 -29 61 78 -202 29 -211 169 -104 -102 48 117 32 11 -102 -153 14 -127 16 230 186 80 -35
7408 -35 421 -48 164 157 78 -118 -2 -216 123 143 -187 311 170 -38 -19 22 135 -39 54 -129 -31 316 -63
7431 -63 -85 -28 111 -69 7 -57 6 -87 37 -38 176 -63 252 443 -203 43 -233 -104 140 -13 -185 22 34
7454 34 -69 204 112 -14 84 157 95 62 105 272 59 -132 -68 -96 153 -371 -105 76 270 -228 -71 352 101
7477 101 -203 62 25 68 148 60 -43 -107 -157 29 249 29 153 -13 103 -281 -25 51 -112 135 54 -213 -354
7500 -354 -10 130 -21 247 -215 240 -136 -143 -200 -195 106 -34 129 -52 53 -84 -46 125 114 58 -244 321 -231
7523 -231 49 59 140 -312 -76 38 181 99 -91 46 -84 183 288 366 -157 105 -102 104 201 -95 -78 90
7545 90 -38 -36 -34 -20 144 47 120 174 -39 -137 111 -34 135 -65 -143 -46 138 -73 44 -115 31 11 139 -65
7569 -65 -121 79 119 38 14 -27 33 78 8 -227 97 -160 87 245 -272 -104 -54 155 -159 112 -218 142 -20
7592 -20 -275 -115 166 -310 -308 29 48 150 -19 -246 271 -159 -44 -11 -24 -104 -153 65 -289 -59 14 55 16 29
7616 29 36 86 49 -45 70 -173 -112 -26 -102 28 207 -46 -157 255 35 -5 26 -405 76 -169 -65 -104 60 88
7640 88 -282 -346 -282 92 -174 -163 -145 -99 -231 -147 313 -86 322 -64 128 171 -128 -31 239 119 4 -178 277
7663 277 -106 -98 112 140 320 -129 -204 -13 195 129 -19 -222 -17 67 -25 46 -254 -304 28 -71 159 -277 -90
7686 -90 134 111 -239 -138 212 24 -195 88 -134 -38 -73 72 -59 48 -181 128 103 121 -103 -69 87 -95
7708 -95 104 -216 -213 -65 -192 -274 60 189 199 33 102 274 -232 -47 166 177 85 177 -191 42 -341 16 -198
7731 -198 13 -131 -87 75 -55 -10 149 -187 -87 -2 146 -30 -18 14 141 -103 82 -114 52 -4 -107 329
7753 329 -168 73 51 55 -25 -37 -48 19 248 160 152 26 82 -20 -254 -88 178 -34 -69 74 71 -135 -23 -125 -218
7778 -218 37 -14 -225 215 -106 27 85 -165 -126 -101 74 -263 212 -309 72 -61 20 116 -180 298 144 105
7800 105 5 -59 132 67 -359 -29 -246 8 153 -46 1 101 255 70 -141 46 240 -110 -272 -9 71
7821 71 -8 -140 246 -1 -119 -37 23 38 -105 122 44 189 160 13 -39 -98 44 198 -61 -102 -192 -309 -182 -43
7845 -43 203 -124 -73 63 62 33 -191 -76 -67 -15 -174 220 -23 -138 -217 126 224 327 31 -159 -106 62 98 16
7869 16 -72 0 -39 310 -5 12 -101 -114 -66 144 -62 295 -33 -120 -57 -76 212 140 -8 -260 26 25 -81 54
7893 54 134 -27 17 375 -85 -195 -20 -245 -272 90 10 71 26 4 59 -107 27 80 -151 156 -100 -393 -199
7916 -199 194 -96 81 6 -158 151 105 -70 -148 -18 -97 48 -45 -86 66 170 -235 -85 -224 128 -134 -113
7938 -113 -68 73 -70 124 -203 0 66 -152 -266 -26 -29 18 229 -420 -30 300 50 9 233 -88 65 114
7960 114 -78 -84 -57 194 142 -108 217 16 45 -105 -321 111 -149 122 -192 135 -40 62 -78 -67 55 -77
7982 -77 -224 -15 -147 27 192 -105 -60 -27 -264 -51 -117 -26 18 104 76 156 43 -42 -89 179 -76 -150 54 -40
8006 -40 87 -191 87 167 -225 -221 -140 254 69 -182 71 24 54 63 -93 -108 -123 -179 55 167 332 -133 55 155
8030 155 191 91 -6 147 181 50 -90 -54 109 -70 230 358 5 -140 62 208 -229 142 24 101 195 60
8052 60 -82 99 190 104 105 73 5 -148 187 -181 72 -259 -37 -69 -4 -194 -11 -166 155 -78 351 53 45 -31
8076 -31 -280 -79 -103 219 -45 52 219 26 91 236 -21 -138 25 84 -173 42 6 112 37 249 -54 58
8098 58 -93 -76 -107 33 41 -23 5 71 -437 200 206 -6 7 117 -18 32 80 -62 92 129 68 -22 7 158 -73 61
8124 61 198 12 87 -107 -151 3 15 310 -58 -5 83 124 -112 43 -7 -196 -159 122 92 -49 -25 43 -141 82
8148 82 -101 -293 -72 -88 -127 -36 110 -112 176 -164 -53 57 248 -13 59 -59 44 231 309 -4 -125 -78
8170 -78 31 -77 -148 5 -118 -97 -191 -12 134 117 -70 -66 26 -9 -115 178 -179 -129 219 150 -48
8191d8
$$ Imaginary data points
##PAGE= N=2
##DATA TABLE= (X++(I..I)), XYDATA
0 0 0 0 0 0 0 0 0 0 0 0 8 -8 8 -16 16 -24 24 -32 40 -48 57 -72 81 -97 114 -136 158 -183 209 -241 275 -313
32 -313 357 -405 455 -511 576 -647 721 -807 897 -997 1107 -1225 1357 -1498 1653 -1822 2010
49 2010 -2213 2438 -2686 2961 -3268 3609 -3995 4436 -4939 5522 -6214 7037 -8049 9320
63 9320 -10973 13222 -16475 21616 -30994 53611 -227821 -14011 545892 99068 -352868
74 -352868 -241088 186773 194204 -1053 -73690 -71194 -110951 78450 241228 41278 -291336
85 -291336 -176040 245826 290857 -145173 -300316 5976 220527 88421 -96173 -122915
95 -122915 -31626 54245 120560 48268 -151315 -137635 124830 177592 -49923 -159926 -183
106 -183 116732 8471 -51188 41451 -754 -106771 6641 152546 28840 -178036 -91957
117 -91957 164280 121033 -129520 -109604 80804 66447 -50271 -10310 73507 -29307 -125370
128 -125370 55551 185952 -39772 -211251 -9341 200989 63527 -166779 -93965 105580
138 105580 68662 -48127 -20829 5677 -36428 -8928 81655 50840 -103573 -93654 103417
149 103417 123223 -63292 -118242 16635 98758 15835 -62866 -16557 14716 -9618 20070
160 20070 31308 -39153 -54991 27048 67392 -13430 -71534 13299 63342 -21131 -41850 36773
172 36773 37876 -40785 -44796 49390 60538 -51853 -64092 41862 48453 -29377 -33107 19892
184 19892 12549 -38982 505 68621 -8616 -94550 -172 106152 33452 -96542 -62172 79639
196 79639 77283 -42523 -59804 2449 27440 23848 8399 -23293 -47012 -8834 69657 41919
208 41919 -75131 -69650 48014 81154 -7099 -74393 -20398 52688 30669 -8674 -15841 -27420
220 -27420 -5018 45606 35809 -37015 -68303 13074 83805 5563 -79733 -25975 50838 34998
232 34998 -24709 -33077 8636 14182 310 15891 1748 -30477 -4991 35446 22365 -28277
244 -28277 -36081 23446 36865 -20165 -28363 9091 12745 -7326 -9507 9899 5156 -22870 38
257 38 30865 -2797 -26610 3042 24552 6056 -21112 -3384 23477 -3505 -20123 10750 13632
270 13632 -13114 -16761 6632 20682 -10045 -27180 10671 21839 -8978 -13198 4069 11635 921
283 921 -7519 8945 5472 -15173 5101 20080 -7252 -19708 236 20417 4695 -27014 -8838
296 -8838 21659 3153 -13829 -4070 3535 4909 -1143 1509 7355 -10049 -6220 20839 8695 -17051
310 -17051 -11669 11589 19831 -8832 -24295 5982 15004 -5513 -7427 -2821 -516 2252 1292 5413
324 5413 -3432 -13075 10156 17576 -7051 -11920 1935 13358 6367 -13909 -6057 11067 -103
337 -103 -5784 -1040 -2543 -618 -1558 915 4765 -8395 -5434 13803 4261 -9562 -2728 7144 10308
352 10308 -3205 -10173 6125 6308 -4036 -115 -2175 -4386 1675 395 1166 -4053 -9649 5300
366 5300 9546 -5041 -6090 -481 6363 7789 -4626 -3317 4853 -1406 2427 6081 -4120 -6128
380 -6128 -2053 5171 7738 -9126 -12489 4500 6264 1648 -3569 -10094 646 9185 4562 550
394 550 -7847 -5609 11857 9967 -2383 -8309 -8668 7732 13893 -3492 -12269 -8609 2444 15812
408 15812 2720 -16824 -11594 5194 18755 6912 -18912 -11450 11487 14956 5466 -10613 -14006
421 -14006 4694 14008 8472 -5757 -20711 -5166 20062 12935 -10252 -23734 -6666 24452 15576
434 15576 -15541 -18821 -245 17936 14769 -8711 -13735 -2855 7625 17489 3976 -19086 -14094
447 -14094 7129 20876 7955 -24042 -21553 12130 23266 4115 -22335 -19108 13883 22035 60
460 60 -12179 -11069 3103 15546 7697 -3305 -11847 -11674 11526 22018 -1593 -23820 -17793 15518
474 15518 29851 -6949 -33040 -7816 21459 19111 -8074 -20007 -416 10800 6382 7509 -2747
487 -2747 -15241 -5954 14616 23225 -4314 -35613 -9683 32347 22159 -19652 -34288 586 32948
500 32948 10608 -20160 -15095 1413 13400 12055 -1378 -9447 -12152 1268 24743 13619 -21175
513 -21175 -26337 5107 33526 13786 -32995 -28297 16590 30833 2935 -27555 -17776 15845 18864
526 18864 -363 -8417 -9593 -2208 10330 13835 5153 -18250 -21998 15707 32582 -2666 -34785
539 -34785 -17613 26925 28608 -16993 -29951 889 18611 9575 -5847 -8950 -2497 -1614 7692
552 7692 18906 -3007 -26046 -7918 24645 24827 -15514 -36547 1888 32417 10859 -20610 -22475
565 -22475 3842 20369 5533 -8649 -10387 -6563 8354 16523 3731 -12598 -16637 5002 28209
578 28209 8275 -24550 -21170 11162 29447 3508 -30541 -16393 17504 19909 -2941 -20133
590 -20133 -8509 11971 9593 1025 -2817 -9662 -4318 11828 15349 -1283 -22195 -9783 23438
603 23438 18026 -16002 -22398 2011 21130 6471 -17494 -9850 6816 5999 1771 -1671 -3205 -2239
617 -2239 -674 8174 9231 -7892 -11567 4491 12245 4271 -10792 -10436 6633 8656 -1778 -5891
631 -5891 -5710 841 5130 160 -1215 -1558 -3848 2069 5790 2531 -2138 -7231 352 11843 3653
646 3653 -8351 -7016 2093 10052 1644 -10585 -4508 3542 3779 1295 -4101 -4015 543 1998 5681
661 5681 1780 -8289 -3017 7937 7008 -1231 -8838 -2263 9013 3568 -4908 -4622 -1855 3873 2966
676 2966 -3327 -2927 -1807 56 4671 835 -3986 -1124 799 4234 2756 -4018 -1335 2285 819
691 819 2112 -1436 -3630 566 648 546 116 -3912 -1503 1959 -41 1170 -630 -3292 1839 2826 1009
708 1009 293 -2791 39 4934 516 -1605 -2220 -1459 3614 1474 -3681 -1926 -1370 1025 3667 -2654
724 -2654 -3729 384 2371 3516 -487 -4527 1471 4078 1405 -212 -2905 -773 4206 420 -2325
739 -2325 -2040 -1619 2601 1733 -3640 -1930 -159 1449 2780 -2461 -2606 2139 1644 1578 -500 -2570 2086
756 2086 2844 -435 -524 -2061 -195 2881 -1309 -2654 -455 -719 1525 -48 -2900 236 1280 365
772 365 1405 -1554 -714 3305 796 -175 353 -1224 1801 1700 -1888 -323 -493 -280 1273 -1980 -1895
789 -1895 1179 -641 469 230 -2002 1188 1675 -243 1178 -214 494 2458 -283 -417 777 -1013
805 -1013 1057 335 -2130 749 -186 -1365 609 -1057 -648 841 -934 747 1052 -1648 1351 1798
821 1798 -592 639 64 -214 1441 -858 -854 531 -1473 141 798 -1966 -364 -684 -791 1906 -547
838 -547 -1510 1224 493 858 1103 -1487 652 1156 203 1925 -936 -2551 1796 1245 -755 -1230 -2463
855 -2463 1322 2169 -2091 -1154 -114 -394 2395 708 -963 82 -50 2372 2811 -2322 -1735 1612 1309
872 1309 1052 -2372 -2726 1443 620 -407 96 -2977 -1019 2855 1305 -957 -2079 -479 4355 1459
888 1459 -2278 5 177 657 1837 -743 -859 -1487 -1463 3292 1670 -4904 -2777 1759 3224 286 -4882
905 -4882 -727 4109 272 -322 872 -703 33 775 2398 1901 -4061 -3077 4155 2369 -2644 -3874
921 -3874 -1823 3910 1777 -3340 -1693 -98 604 2812 -321 -2061 -191 575 3290 1754 -3171 -1102
937 -1102 1010 1198 2665 -1758 -4767 -487 3762 2814 -3318 -6679 2308 6677 -1063 -4149 -822 2598
953 2598 2372 -1829 438 2482 -3057 -1986 4924 3083 -3718 -6241 1551 8335 -1636 -9434 -477
968 -477 6364 1678 -4034 -3290 2992 2232 -2800 1775 3153 -2432 -2256 2213 4810 762 -6503 -1883
984 -1883 6360 2021 -3936 -4356 -576 4524 1487 -4124 -1736 455 1935 1797 -2277 -352 1394 -781
1000 -781 1402 2826 -180 -2518 -2678 3041 6001 -3921 -7720 2150 6779 116 -7330 -3514 6549
1015 6549 2940 -5580 -989 3678 360 -2586 529 5558 0 -7390 1011 8792 24 -7898 -2697
1030 -2697 6275 4367 -6548 -5033 4313 2172 -2724 -1207 1001 853 -1986 -418 4368 671 -3884
1045 -3884 206 3706 2351 -1613 -3738 699 3358 301 -1348 -2850 -1135 3554 892 -3333 -1684
1060 -1684 882 1820 -170 -1717 2270 1121 -3133 1370 4527 -600 -4578 -1238 5644 3464 -7158
1075 -7158 -4048 5559 2736 -3794 -3612 1995 3033 -3061 -2002 4556 697 -4573 452 4848 2089
1090 2089 -4643 -2938 6041 3468 -5250 -2507 2465 1484 -1101 -2047 818 510 -2764 1268 2682 -2266
1106 -2266 -2053 1302 2240 671 -2406 -101 2905 -330 -113 1320 -1409 -883 1083 1161 -553 -3146
1122 -3146 -636 3884 -938 -3651 593 1807 -227 -1374 656 2381 -1015 -2630 3256 2345 -3119
1137 -3119 -1676 2047 2765 -1738 -3843 1944 2783 -3081 -1528 1789 241 -1909 -1563 2515 1888 -4150
1153 -4150 -671 4237 615 -2521 -369 2413 1949 -2218 -944 3188 -986 -2887 1197 1545 -1120
1168 -1120 -2358 62 3232 -1208 -3644 1740 2273 -1365 -446 765 1401 -678 -1642 2482 1492 -3065
1184 -3065 -350 2610 -80 -1811 -1301 1349 1328 -2840 -192 2378 -1173 -1781 1176 1540 -193 -2018
1200 -2018 708 3317 -1211 -2016 2270 1595 -1265 -1066 499 1875 -1779 -2341 2480 996 -3117 -678
1216 -678 1691 812 -1379 -1512 2906 1271 -2623 335 2635 -331 -1267 -332 1620 738 -3137 -194
1232 -194 2416 -1417 -1856 454 1020 217 -1920 220 2550 -1135 -1298 2397 897 -1194 9 1030
1248 1030 1517 -1265 -1516 2503 326 -2323 127 917 25 -1254 -882 1687 250 -2628 963 1822
1264 1822 -558 -776 382 1636 303 -1892 732 1993 -1723 -1008 1185 585 -695 -1718 448 1469
1280 1469 -1993 -1343 1858 175 -1501 235 646 925 -886 -662 2445 369 -1561 1130 1093 29
1296 29 -923 -949 1317 256 -2039 513 945 -1275 -491 264 648 74 -1731 855 1725 -1116 -426 1088
1314 1088 144 679 -381 177 638 -910 -494 1437 -688 -1188 -17 166 145 -680 -905 1340 -37 -768
1332 -768 1063 276 -480 444 396 854 -158 -1361 1170 976 -1819 -505 384 89 183 -1309 274 605
1350 605 -1258 68 1105 -282 -27 -162 796 1268 -575 -271 1349 54 -72 -111 -832 430 -134 -433
1368 -433 372 -1174 -1083 613 -279 -217 341 -531 386 397 -348 715 274 -171 1139 22 -652 257 -512
1387 -512 767 596 -1323 -453 453 -537 314 -1101 -763 905 -238 -32 590 -345 231 936 75 885
1405 885 74 -985 930 556 -483 -328 -1339 650 1140 -1275 -1001 433 377 626 -591 -195 1327
1422 1327 -381 -60 1431 108 -511 -65 -89 1280 -260 -2058 333 964 -255 -775 -1128 370 945
1439 945 -852 -557 558 0 363 286 158 758 -203 -750 1256 721 -555 -649 -390 1395 290 -2104
1457 -2104 -627 1100 229 -542 -1559 636 1354 -952 -268 1487 96 -403 -151 666 1580 -1408 -1728
1474 -1728 1816 1216 -1262 -1789 -275 1882 -97 -2394 -180 1257 -703 -834 -422 762 645 -1311
1490 -1311 267 1979 -409 -992 98 876 1541 -1225 -1762 1383 1032 -706 -1014 -998 844 336 -1427
1507 -1427 7 835 -372 -70 -66 679 928 -1434 -460 1965 629 -1257 -1010 638 1673 -1136 -2510
1524 -2510 858 1285 -392 -1051 -305 1434 163 -1897 910 1685 -970 -1106 818 1493 305 -1938
1540 -1938 -111 2256 -470 -1586 -327 101 795 -684 -1054 932 -139 -1168 772 223 -37 47 -588
1557 -588 1183 828 -752 -115 517 69 597 -746 -897 424 -28 -292 -608 -968 688 321 -1202 340
1575 340 879 -553 -237 71 1120 417 -1622 662 2023 -510 -1340 264 967 673 -1562 -505 1396
1592 1396 -670 -1549 92 327 -294 -884 -231 1605 163 -1669 832 1641 17 -473 -507 929 388
1609 388 -1197 325 788 -1206 -184 340 -218 -221 -972 262 946 -854 -77 678 85 27 221 483 560
1628 560 -395 297 888 -751 -534 882 -158 -589 -334 -148 694 -842 -988 967 -106 -1025 208 874
1646 874 402 -762 -754 1524 680 -1468 166 1004 -301 -717 -684 554 180 -1665 -104 1328 -762 -770
1664 -770 270 801 537 -1054 397 1660 -292 -708 758 340 -546 -679 -2 718 -532 -1336 720
1681 720 172 -770 -14 31 156 -48 -613 674 181 -828 747 939 -372 -117 221 557 276 -1096 438
1700 438 950 -1071 -259 554 111 -386 -938 314 953 -1025 -623 1136 139 -564 -140 851 600 -497
1718 -497 -642 1096 -49 -913 279 372 -149 -619 -569 753 -82 -1242 482 637 -469 -148 107 742
1736 742 350 -1072 774 1211 -901 37 599 275 -291 -681 349 518 -874 -429 700 -377 -495 97
1754 97 234 567 -653 -336 1388 -12 -970 414 498 -66 -393 -133 914 -411 -1051 842 171 -1244
1772 -1244 -306 255 272 -108 -999 778 908 -1044 101 838 -86 127 -390 468 881 -1337 -32 999
1790 999 -550 -804 212 256 52 -1159 -304 1111 -337 -1125 846 676 -101 -297 118 1400 53 -1146
1808 -1146 1022 608 -945 -171 -170 178 -407 -1111 524 447 -1237 41 679 -34 -79 41 544 761 -531
1827 -531 139 881 -381 -254 685 142 -24 -512 79 750 -712 -751 770 -122 -537 -287 -10 646 -28
1846 -28 -534 1141 221 -859 271 869 141 -268 -574 1008 671 -1297 -78 673 -354 -295 -181 421
1864 421 276 -837 204 944 -233 -329 269 440 70 -6 124 760 -325 -237 795 -240 -589 -252 -69
1883 -69 302 -590 -692 802 -155 -803 451 386 -2 146 -269 964 205 -865 580 556 -373 -131 -224 427
1903 427 56 -1349 -197 794 -573 -536 180 -69 186 -419 149 802 -321 -247 626 222 188 150 -586 263
1923 263 293 -487 -186 -518 -302 196 -428 -458 144 -94 111 -44 -63 706 231 -475 625 433 -276 -137 35
1944 35 421 431 -1130 -199 992 -611 -519 -529 -24 629 -630 -370 986 -342 -382 73 249 834 -10 -615
1964 -615 823 562 -553 -203 -262 513 166 -971 116 554 -504 -221 11 400 210 -384 -223 912
1982 912 126 -467 84 339 603 -359 -816 929 329 -622 -295 -307 220 244 -880 -76 779 -655 -92 231
2002 231 151 385 -415 -92 944 -222 -274 260 176 149 -26 -564 447 -151 -572 27 -220 -191 505 -630
2022 -630 -105 470 -466 -225 144 431 594 -579 -531 641 239 -773 -172 112 481 -524 -862 761 501
2041 501 -920 -66 662 223 -72 -744 583 1205 -536 -431 926 332 -166 -483 574 721 -646 -776
2059 -776 436 -188 -539 -100 -84 351 -155 -659 412 189 -313 402 66 198 699 -176 43 144 -421 523
2079 523 -184 -480 388 96 -336 -5 -288 78 20 -781 188 405 -591 -99 485 481 298 -449 211 993 -403
2100 -403 -699 644 352 -466 -552 66 653 -372 -1052 321 299 -554 -432 -266 433 37 -654 325 750 -492
2120 -492 248 388 -145 177 -294 272 278 -734 -39 492 -406 72 52 -171 14 240 172 737 -463 -5 646
2141 646 -169 -186 295 182 186 -608 -516 755 -242 -639 -89 91 -112 -369 -357 771 29 -757 351 582 74
2162 74 -304 25 807 294 -618 102 519 -621 -540 66 -27 135 -875 -214 585 -508 -125 631 255 -36
2182 -36 52 -306 507 -324 -191 539 -22 -266 295 -18 2 -198 -313 313 -311 -653 156 24 -602 -73 116
2203 116 371 267 -601 767 741 -643 -155 360 216 11 -289 59 719 -649 -152 302 -115 -289 -282 49
2223 49 311 -194 -224 686 7 -383 282 386 222 -146 18 620 -225 -700 413 -62 -380 90 -95 -163 -93
2244 -93 -257 355 17 -705 396 379 75 -37 5 512 385 -354 -76 451 -53 -311 371 -35 189 -572 -344
2265 -344 264 -305 -490 651 50 128 -138 -239 603 -33 -280 528 281 -549 377 -39 13 -95 -435 36
2285 36 91 -627 1 156 -396 28 0 94 432 -487 254 721 -370 -119 517 277 180 -176 -114 657 -362
2306 -362 -380 66 -44 -195 -290 -7 253 -128 -244 373 200 -385 93 -5 169 172 -252 223 262 -595 199 161
2328 161 -419 -46 50 -74 139 -577 223 226 -242 23 285 58 -22 13 -125 421 -300 -95 578 72 -432 113
2350 113 -69 44 -263 -420 476 -117 -424 248 113 219 56 -276 412 442 -287 255 145 -69 103 -294
2370 -294 37 379 -321 -117 49 -429 -185 42 -146 136 21 -29 -32 -38 4 529 -437 -100 601 14 -76 54
2392 54 -116 469 48 -421 274 -234 -301 -104 -15 344 30 -386 480 449 -2 233 240 89 569 -185 77 511
2414 511 -266 -30 398 -192 -46 -282 -221 464 -165 -367 82 288 322 -124 -478 133 377 -62 163 -332 49
2435 49 357 -199 22 431 -160 -271 -121 -151 418 -271 -279 282 379 -201 -117 -22 232 281 -136 186 473 -377 -205
2458 -205 513 -253 31 -572 -84 311 -474 -414 4 15 434 -185 35 398 194 -181 431 42 267 72 -153
2479 -153 400 279 -365 -66 -18 127 51 -624 -150 378 -59 -236 248 -183 -23 -75 -499 182 206 -177 206
2500 206 233 284 215 -272 289 408 -261 -186 176 209 176 -527 -274 51 -155 26 66 -186 109 40 -241 475 252
2523 252 -107 62 80 94 383 -227 392 355 -191 -364 52 -65 8 -541 -230 428 155 -261 240 -74 -51 -64
2545 -64 -390 543 281 -416 -106 18 -62 -4 -232 292 304 -557 -142 438 -129 362 -308 60 554 50 -7 168
2567 168 -36 -306 207 -161 51 136 -289 0 30 -160 301 -306 -235 264 -276 -157 90 -100 374 -213 -656
2588 -656 451 215 -10 -21 106 156 261 -536 118 372 -688 -73 88 25 -58 -336 262 533 -103 -469 495
2609 495 115 163 201 433 527 -123 -487 63 162 -21 12 -162 425 250 -324 176 155 -265 124 -184 -102 518
2631 518 -151 40 416 -101 382 208 -273 -42 -174 -152 182 -127 -31 219 -648 -19 439 -43 7 -183 197
2652 197 215 -277 -79 604 4 -398 88 -37 362 -142 -44 361 77 -244 114 125 -237 -156 -288 222 74
2673 74 -242 125 138 -135 -152 272 -227 108 -41 -64 251 -544 -34 304 -112 125 -92 50 -77 -18 -147 255
2695 255 -296 -375 340 168 -312 -160 -110 666 -368 -517 360 121 -391 -21 -223 -64 -5 -388 188 198 -529
2716 -529 -353 416 61 30 -49 306 389 -369 -54 567 -179 180 234 56 190 -145 -159 281 -262 -206 231 -209
2738 -209 59 32 -129 458 172 -69 455 125 77 361 176 205 -5 -324 175 112 -407 -97 222 -379 -164
2759 -164 124 271 131 -314 70 742 -340 25 118 261 225 -312 -203 432 -186 -254 180 -203 5 -240 183
2780 183 92 -336 -360 377 19 -282 -62 -234 56 61 73 273 429 -336 93 94 -154 -54 -488 -29 -60 -525 -189
2803 -189 227 -462 -288 177 -33 196 -276 -40 373 -138 -59 323 64 130 -336 -37 548 -46 -407 234 183
2824 183 -324 390 -255 103 -42 -390 289 68 -85 308 31 -414 33 66 68 106 -374 425 293 -59 -44 199
2846 199 -395 4 -20 -16 433 -325 -130 431 81 -143 349 51 263 -437 66 382 -80 -302 281 355 -2
2867 -2 -193 -48 591 158 -483 136 313 -252 6 -24 287 16 -438 98 239 -175 -61 293 -70 200 -148
2888 -148 129 190 -109 -104 14 -145 -67 380 -35 -92 -392 -143 198 -159 -145 458 92 -183 -268 -264 418 -340 -421
2911 -421 139 198 -573 -110 133 118 22 -298 311 472 -314 238 218 27 66 26 30 475 -456 -222 49 -121 -10
2934 -10 -194 -154 120 -26 -275 223 -45 -47 -24 238 -100 263 -216 107 265 -183 315 -31 -218 294 -86 -305
2956 -305 125 -176 30 2 -464 308 -18 -312 -13 131 198 213 -338 -37 217 -439 34 438 -134 -145 -379
2977 -379 -239 271 71 -317 -55 -95 -66 132 -348 337 181 -181 -92 -71 -53 294 -39 56 476 -99 79 195
2999 195 -325 133 -173 13 87 -115 -88 135 -130 56 126 -201 8 483 -26 157 179 102 323 -5 -191 335
3021 335 -15 -28 188 -455 165 -104 -412 175 -17 -24 364 87 94 266 -320 229 362 -117 -1 329 -130 143
3043 143 -93 -9 336 -389 -139 -68 -264 36 -93 -337 298 36 -405 14 77 419 400 -191 43 156 124 243
3065 243 129 -144 57 -85 -333 246 -317 -241 389 51 -93 63 -216 293 538 -189 155 -18 -123 -4
3085 -4 -196 -91 171 -70 -10 64 59 357 -205 -33 325 -52 -59 53 -115 315 253 -325 330 415 -167 395 -137
3108 -137 -48 399 -115 120 429 -114 -131 256 -45 28 161 -80 284 126 -35 383 -17 302 262 -149 191
3129 191 250 -242 -6 -222 -108 -122 147 -69 120 -9 404 223 -77 178 59 -212 407 273 79 15 -284
3150 -284 198 -46 -400 195 174 -101 -33 11 26 145 -233 146 339 -57 -125 8 119 176 -166 -246 390 -152
3172 -152 -187 236 6 -98 286 8 33 -195 -209 29 -86 -23 77 -44 95 67 -116 -246 209 -138 -154 33
3194 33 -435 131 355 -180 75 -58 -16 65 -195 -31 241 -149 135 -81 -158 102 -205 -133 350 -148 -130 -147
3216 -147 323 141 60 -50 -18 244 -265 -63 57 70 199 -256 -148 -85 -241 47 -52 67 195 -5 -154 286
3238 286 3 -103 158 -161 -38 38 -208 -74 -159 -214 152 -387 -250 197 -31 -33 107 66 264 214 -151 81
3260 81 -27 -356 384 340 -367 90 -261 -95 -150 -304 -127 150 -291 -22 -70 -235 274 -23 1 184 -2 -93
3282 -93 339 182 138 -194 10 192 14 -155 -3 32 -142 148 -243 6 -182 -71 -40 -234 -162 186 135 37
3304 37 173 -144 106 394 -328 93 227 -105 141 144 -66 -122 -47 -290 57 -285 88 -147 -202 118 43 -53 84
3327 84 -47 115 254 -39 -66 142 -426 -280 336 -171 -69 -7 -128 176 -233 40 -242 -196 -134 85 0 26
3349 26 347 43 43 92 -81 97 -137 -125 -212 -355 6 77 -261 -325 180 53 -43 -227 -16 279 -115 7 221
3372 221 146 144 -26 48 60 -58 -421 98 -16 -108 -270 -196 -77 -91 -270 -108 241 -45 -19 115 12 301 60
3395 60 12 264 -51 -35 137 -313 118 89 -54 13 -215 182 168 -183 -127 192 -54 -287 278 -75 198 262 32
3418 32 236 65 -275 120 -139 5 -328 -390 -100 -128 -58 148 71 -52 163 -295 -141 -59 -50 -69 187 -42 -148
3441 -148 188 348 61 -127 -7 255 -101 -269 33 -390 201 -400 -248 182 -100 133 134 -91 -105 127 186
3462 186 115 9 -237 78 19 -94 76 157 -231 170 -200 83 82 -162 5 134 -51 42 123 -27 214 141 76
3485 76 365 -146 -191 47 -129 78 -121 13 -72 -257 -156 86 43 37 108 -189 -12 149 68 328 38 28 -42
3508 -42 -24 -94 153 -154 297 177 -222 -63 -131 -214 -54 79 -181 -24 -60 41 428 -117 -27 621 4 146
3530 146 -48 -38 12 -130 -208 134 212 -75 -80 -9 237 -100 -296 29 -29 -234 385 12 -31 -128 -4 -114 384
3553 384 -42 10 150 45 2 103 59 244 -5 -90 -113 -523 -97 59 -31 86 199 -122 -48 162 109 250 162
3576 162 89 25 173 -275 345 -111 -285 -130 -167 -190 -114 0 118 8 -100 72 -234 56 206 -6 28 -55
3598 -55 -251 282 -114 -71 -5 1 -149 200 -105 -41 168 -195 -133 259 32 54 -97 183 254 135 199 147 263 -93
3622 -93 140 -72 158 -142 -252 -78 -31 -1 4 -63 -107 -74 -258 -50 213 17 -120 -25 -131 162 295 33 -4
3645 -4 114 248 -259 -67 63 146 -220 135 -110 -214 -52 -162 259 15 -133 44 304 -182 -31 195 -123
3666 -123 221 -15 -56 180 -86 -29 56 -211 -74 214 -304 158 51 -42 233 28 -21 237 -130 98 27 -92
3688 -92 23 246 -57 393 -60 -29 139 -103 68 -34 -527 -86 -188 -219 87 244 2 189 47 -155 198
3709 198 -67 -30 101 -223 -188 108 -192 198 260 -312 383 -349 -125 -123 -44 92 292 182 -59 18 -234 96
3731 96 150 276 -126 9 223 18 -262 77 37 -65 116 -264 -261 -104 -155 -30 -110 106 115 261 -257 21 227
3754 227 41 129 -91 -216 336 -74 6 295 -363 -163 186 35 230 425 -72 250 -21 -49 54 165 239
3775 239 38 -181 -64 180 -13 -86 288 -48 55 -170 55 53 -241 -5 135 -96 97 -132 111 117 224 -205
3797 -205 134 22 41 -57 7 115 7 26 -97 -30 -224 135 97 -105 54 -87 -41 28 38 186 228 64 12 110
3821 110 -58 162 84 174 13 -462 43 253 -193 -190 -42 -101 71 -78 -29 244 -260 -139 363 -115 -138 -77 57
3844 57 -17 217 -66 72 -105 -349 171 333 -177 24 -138 169 168 -94 105 -219 -142 34 209 38 47 -68
3866 -68 -13 39 -139 -120 304 34 -14 14 125 13 -404 -58 -53 27 83 -61 -103 19 -255 -139 128 229 -5 44
3890 44 151 286 311 -264 191 154 -36 -111 -169 -253 18 -173 -88 270 103 9 242 -143 132 116 119 2 81 33
3914 33 -49 -187 122 59 -232 -173 -163 -113 21 234 4 -129 -40 -159 859 -126 5 152 183 194 18 8 69
3937 69 -165 -165 211 51 94 13 -4 79 30 8 101 -160 311 289 57 -254 357 -139 130 322 -134 -223 69 7
3961 7 73 -78 -11 -22 -71 -70 190 -63 -137 7 159 55 87 -121 80 -110 67 -2 143 264 -201 70 15 94
3985 94 -261 -75 -59 75 134 -143 -186 -87 -110 104 -38 -27 194 192 113 34 50 -177 106 -112 57 77 -6 5 78
4010 78 337 15 -41 -294 459 301 -196 209 -267 -83 65 -50 -155 -229 -116 311 22 -153 -82 31 21 148
4032 148 -345 -151 293 -26 -150 -49 -38 103 308 52 304 -59 68 43 154 259 130 87 -60 344 94
4053 94 -160 12 -202 306 -18 73 -66 -91 -161 199 -125 -200 51 50 -7 220 6 -161 -168 254 38 -426 -14
4076 -14 134 160 116 61 -141 13 -53 -200 299 15 268 127 -215 45 12 -31 -81 187 -13 1 143 -124 213
4099 213 -130 178 141 -387 120 -131 145 -69 117 107 45 -81 -177 -59 11 154 86 -82 28 214 8 61
4121 61 4 71 -33 -9 -100 62 1 -85 -40 104 262 -276 -294 199 -92 -248 -174 45 -45 163 -143 83 -75 -51
4145 -51 218 -77 -38 79 -9 -7 180 -90 -120 222 -82 115 27 14 -108 33 -266 -85 -156 -89 -5 -115 120 240
4169 240 -271 -57 -27 -154 88 -276 27 37 18 227 139 59 234 -80 -229 25 108 -34 142 35 -261 -232
4191 -232 -148 -40 -49 -193 40 62 -8 40 156 -42 51 -186 -179 135 53 120 227 -60 156 -36 161 62 219 -122
4215 -122 160 -77 28 213 -71 51 -50 60 9 -284 429 286 -243 -110 -263 24 -237 -85 153 27
4235 27 18 -204 51 -28 -160 -25 -218 108 -111 -375 -16 -107 -17 -341 12 -63 -204 -145 293 -83 -129 -27 -120
4258 -120 -152 -38 -3 57 -112 -134 36 -179 -96 -94 9 -61 6 -144 -107 102 -177 -193 205 -72 -4 273 164 -255
4282 -255 228 24 92 -24 -122 -18 -52 183 198 -102 -155 146 -78 7 -69 -120 -56 -12 -247 69 11 -69 214 155
4306 155 -242 48 20 -109 69 -106 125 264 -79 214 53 -216 94 96 44 -97 -162 232 19 119 -7 18
4328 18 -42 -25 -330 -118 351 -22 120 204 -91 -127 -101 -137 3 -266 -114 67 132 126 5 -8 -50 -28 -135 -131 -76
4353 -76 -216 -185 -23 -220 13 -161 141 -11 128 111 -186 266 213 50 -46 -101 -58 361 -144 -274 -189 -69 -322
4376 -322 -189 78 39 36 172 227 -5 -222 -11 187 -19 332 141 -7 39 -154 187 -41 27 -274 -65 111
4398 111 -94 43 -162 1 40 53 216 180 -82 135 61 -54 -121 -148 -85 129 -67 -183 -88 29 33 -265 -69
4421 -69 40 45 192 103 87 31 108 -14 134 133 -79 -4 136 72 48 1 -171 -3 -91 30 -12 -310 -10 54 -7 154
4447 154 -44 -22 261 -108 12 451 -92 67 95 -64 -137 273 -47 -34 -122 -91 -18 -297 124 -60 -178 101
4469 101 -68 -221 11 -283 -162 35 -137 -103 -224 148 61 -156 66 -120 -104 -73 -72 149 -65 13 106 43 -10
4492 -10 82 -183 124 -101 -253 -47 192 171 -40 280 56 152 178 -99 -86 126 99 -184 65 108 -131 -59 -80
4515 -80 -243 128 218 -78 174 -58 -28 -245 149 -45 51 -27 111 17 -82 -214 -119 295 71 82 83 -226 15 139
4539 139 106 184 295 -19 -1 -68 -77 -38 11 255 -101 50 -103 32 -230 -73 167 -147 -92 -23 269 -84 -158 194
4563 194 284 23 61 127 -114 55 -215 92 166 349 -11 127 207 -28 -27 -246 -39 -31 -172 130 -59 -5 43 273
4587 273 -115 58 -74 -227 216 53 -194 -142 -177 -38 133 -148 357 -66 -218 251 115 -134 -217 -10 327
4608 327 64 -6 91 125 -20 246 -328 -36 37 -90 33 -26 -252 -139 75 -132 -194 -136 -32 130 -33 -115 261
4631 261 80 406 -5 -183 -146 71 -118 91 -101 17 253 -152 -7 185 -121 -172 36 148 80 293 -144
4652 -144 18 -133 -79 -176 -197 -22 12 -61 164 23 -45 -151 -329 96 -95 -261 -7 17 -85 51 232 32
4674 32 -34 1 -256 -63 1 -176 92 5 16 0 25 -110 123 85 51 285 70 143 17 -53 36 157 60 -118 -62
4699 -62 268 146 -35 244 -90 -194 -15 7 -78 130 74 -106 29 -177 -21 -159 6 -131 256 -236 70
4720 70 -90 -141 -129 -60 184 -195 30 -12 44 -141 -14 82 207 19 -35 118 430 -90 106 -224 153 -58 299
4743 299 13 217 165 -161 130 -284 118 -26 99 -86 233 31 90 255 179 183 45 -119 1 65 36 65 -184
4766 -184 -218 1 87 -33 145 -274 331 -59 32 -159 -71 -163 132 19 116 91 -204 126 -31 128 -46 10 -87
4789 -87 -81 -193 59 -98 164 122 3 -190 -301 16 -181 -129 -46 -59 1 106 -108 -66 -16 94 104 63 86 -323
4813 -323 344 180 -299 212 21 31 -242 -61 -113 138 115 147 187 -153 -63 -124 -252 -349 2 93 -7 -38 60 56
4837 56 187 -81 -32 -254 9 104 70 277 -195 -264 313 -267 154 190 -78 115 129 -188 -114 -10 138 -181 59
4860 59 -67 97 90 -221 194 58 -56 58 59 171 134 -33 50 23 -182 158 -62 -204 -76 123 -63 46 -196
4883 -196 -52 196 -342 117 -120 -184 -217 84 -46 71 -77 21 -103 40 -106 72 75 -135 -218 33 52 -100
4905 -100 -371 -119 253 254 -61 -312 -75 -96 -32 -31 -225 206 -182 -46 -78 -33 20 102 107 -149 -233 -173 -123 102 234
4930 234 -170 5 3 193 348 36 -299 -93 -37 195 145 106 273 -136 -2 25 -53 279 -55 96 183 -152 12
4953 12 61 -135 -206 19 -140 148 44 -167 189 -46 60 22 19 -62 84 -162 231 -183 -171 -156 126 28 -10 -4
4977 -4 -64 37 123 -204 133 185 -151 37 48 327 -282 -91 0 120 -25 124 259 -15 -110 -287 126 10 -134
5000 -134 -69 -3 -55 -124 156 369 83 -140 -30 -81 -149 -96 206 -78 156 91 -41 79 246 0 87 202 72
5023 72 203 -237 119 -223 51 156 -5 22 -106 27 -98 296 275 -118 -226 -195 80 19 5 -4 -22 -158 -224
5046 -224 81 88 160 -132 75 286 12 -91 -144 -92 52 22 51 223 11 -137 -92 -270 -67 -5 -133 55 -61
5069 -61 -176 -176 -36 35 114 -231 96 101 -97 -353 125 53 156 216 37 -58 51 -4 178 -182 118 -20 55 -174
5093 -174 49 71 -128 44 -14 85 -67 121 70 -437 117 85 -2 -77 -174 34 -1 -87 -98 53 -269 28 61 89
5117 89 132 97 -37 -16 -259 -222 163 80 -67 123 68 -86 -29 -191 114 -38 97 313 249 -16 -23 -78 -97 -42 -64
5142 -64 125 -15 82 144 5 28 -39 33 45 -13 -127 53 19 23 -35 -97 67 281 127 95 116 187 3 104 -160
5167 -160 -75 -73 -104 -4 -55 268 -44 111 -126 178 307 -194 23 -98 -249 115 123 144 159 -273 70 -229 161
5190 161 -101 -132 19 59 -111 -281 85 119 -142 56 97 276 1 96 -94 -115 -84 8 -43 276 -293 -204 -3
5213 -3 -63 171 -57 -210 -50 3 -121 27 104 -95 -179 109 -170 186 -60 18 150 -83 211 9 -137 -51 -111
5236 -111 132 -5 113 48 -114 -40 -19 -187 94 260 137 137 -22 26 53 -129 50 -372 -119 -36 -7 125 211
5259 211 -201 -70 -46 -6 250 10 85 -13 -91 157 -158 -187 -2 -128 96 65 47 53 97 39 19 97 -61 -102 103
5284 103 -177 58 194 78 -97 -172 192 -108 -112 41 99 50 65 -85 -284 97 -145 104 -114 79 102 -90
5306 -90 -141 74 83 0 -134 -41 -356 152 -61 -55 68 -70 -3 -28 147 -128 -279 121 9 -136 -37 -123 40 155
5330 155 360 -35 -108 -156 67 -166 -231 61 10 70 95 86 41 151 -191 -148 -82 -240 -73 53 48 -179 26 -73 -16
5355 -16 -142 -19 -207 -386 -165 -17 42 -137 -93 3 -40 50 -46 -154 -275 -54 105 -56 151 105 163 100 235
5378 235 -3 221 -166 -81 -114 84 -26 -27 -47 -123 167 29 -31 -51 6 -130 -7 -74 -25 183 303 16 57 89
5402 89 170 -23 -3 159 -39 -89 -94 102 8 -65 146 -83 -27 -9 -48 -36 7 23 -34 71 -79 -117 88 192 -132
5427 -132 256 -257 278 275 -248 137 -183 314 156 23 47 -12 -31 156 227 -59 -294 68 109 204 55 124 -77
5450 -77 251 235 -60 -247 -93 102 -14 40 -133 128 173 -143 129 34 -29 373 9 -8 -46 89 -139 -90 -354
5473 -354 9 12 77 200 137 -50 -79 -257 145 271 -57 10 29 307 52 126 -47 -138 4 11 -58 57 184 2
5497 2 111 65 -24 89 -7 -187 -212 -284 -69 -131 42 -150 -135 189 -65 127 81 -98 -286 -142 -134 31 -64 -103 -62
5522 -62 -89 283 52 208 -213 36 -194 82 88 -3 -10 -162 -102 -121 -127 -79 -137 -49 -38 121 29 206 277 25 165 -190
5548 -190 87 366 96 -389 -98 -332 -199 -69 -63 -49 -142 -2 -142 -63 -249 133 265 -73 48 -167 33 177
5570 177 -116 20 58 339 -291 99 -72 -7 -241 239 106 -172 32 -30 -211 89 -50 -204 53 236 -150
5591 -150 -31 -429 281 3 -50 -22 -27 -142 143 92 211 -128 101 -202 -46 115 -337 126 -77 248 -259 214
5613 214 51 -90 -226 249 134 -44 -33 -178 296 -221 36 -74 31 46 102 -87 -293 90 -222 -79 13
5634 13 -29 -221 -181 119 120 -38 9 -85 111 -38 15 85 180 -107 -159 97 -13 -253 204 30 -157 19 -60 -88
5658 -88 -45 -28 227 -76 198 -101 135 -9 36 -26 -107 161 -76 116 -79 -7 93 -9 -39 77 41 -147 85
5681 85 -166 172 250 41 -2 -20 20 24 -154 -18 7 -57 -149 11 -290 2 142 -90 -149 -151 5 115 -36 51 -105
5706 -105 67 103 157 -189 -71 8 93 -232 -151 -60 -111 -26 237 103 -285 121 147 -52 148 168 17 -128 -36 232
5730 232 -9 56 -349 -94 -75 95 -20 -212 36 -117 -6 -105 143 183 -92 263 -318 -16 -60 -73 -128 -9
5752 -9 -104 -75 188 261 310 53 16 -111 -129 49 -221 -40 18 -41 70 -72 186 113 -282 -19 -337 -217 44 -34
5776 -34 82 -97 -42 -97 319 73 -89 -125 -173 -56 255 13 29 9 153 221 107 -122 104 18 -12 45 32 -6
5800 -6 188 115 64 27 67 92 154 -42 12 101 211 5 272 129 23 246 -293 -220 80 -76 -147 -67 86 133 -177
5825 -177 148 -34 -78 -81 -12 -201 -303 124 -205 147 31 186 77 -53 208 -121 194 112 38 -278 122 -221
5847 -221 290 33 216 129 -246 -40 -40 -37 -118 28 -121 344 -46 -100 83 -23 145 -107 29 80 -198 -296 8
5870 8 -36 -223 -6 27 4 -31 -45 28 -254 -45 217 130 213 44 -74 -84 99 64 -31 -214 -77 54 -314 120
5894 120 162 -5 36 -168 -53 45 -180 137 -78 93 -132 367 42 -447 -19 135 56 -8 -26 -101 -114 -185 -51
5917 -51 91 19 -152 63 186 -56 -250 -123 304 -48 -93 -149 250 187 103 139 164 -22 79 91 257 218 -80
5940 -80 110 -244 76 -210 -33 -32 -343 67 -44 -3 228 -274 29 283 -210 113 148 203 -67 183 -122 131
5962 131 -211 214 -222 332 140 55 63 51 386 -117 73 55 186 -138 -182 72 -90 -93 -25 303 143 39 -185
5985 -185 -151 -22 118 -120 241 66 90 -223 88 151 -37 44 -91 -160 80 34 30 162 -113 -52 -144 -27 -305
6008 -305 -122 -57 -32 120 11 -200 291 -157 250 -107 190 -6 13 128 247 -74 17 191 -40 14 -223 165
6030 165 255 74 -244 -75 227 94 139 -135 -184 -87 -169 134 57 -65 -74 -31 -91 98 8 -174 164 -122 -187 248
6054 248 53 218 -134 80 240 89 59 28 -192 73 104 -79 105 189 209 -188 -47 -45 273 147 440 -179
6076 -179 64 -61 147 -81 -135 248 157 -95 285 -37 -145 -138 -166 281 -13 118 103 133 -151 110 -31 139
6098 139 43 238 132 48 -9 228 -128 -276 19 192 192 -91 151 54 26 71 -139 78 136 -11 31 -38 112 -149
6122 -149 14 140 -246 264 295 84 260 287 104 41 141 -188 167 122 10 42 46 -86 -158 315 318 19 27 -111
6146 -111 -91 -50 -150 -19 47 62 -132 217 108 -17 28 119 65 -35 -58 75 -65 -83 27 69 -31 167 109 140
6170 140 157 -14 49 -156 -126 -93 339 32 138 139 -99 -8 25 41 35 -27 75 96 78 79 99 8 -23 120 60 46 -10
6197 -10 -30 34 -47 149 4 32 -154 -50 185 39 220 -20 -56 -141 12 -117 -4 164 103 -167 -157 179 148
6220 148 -3 -115 54 -7 -48 27 -191 23 107 -293 40 -173 36 -66 -32 -77 -145 -187 -4 -96 -140 -122 -37 -135
6244 -135 -164 302 -132 -199 75 -254 -115 448 -141 354 80 -133 -99 42 24 -69 150 35 518 -195 26 65
6266 65 -143 -231 -50 -44 287 54 68 156 -78 99 32 42 -71 50 -60 77 -138 72 35 139 -159 47 -47
6289 -47 57 115 16 -206 -67 91 131 -101 190 3 -140 -60 14 -239 -175 234 4 -114 4 -45 -11 218 -152
6312 -152 -62 62 48 -20 216 88 76 -58 68 -49 -102 108 -299 104 -2 -231 -21 -220 237 297 213 156 1
6335 1 -72 4 83 -20 14 -116 24 -203 96 -95 -135 -339 -51 89 -92 122 -42 -267 -62 -25 -147 163 -57
6358 -57 -9 -88 -166 -158 220 67 149 152 0 -195 -32 -156 -78 35 27 13 57 -241 246 134 -86 271 -152 54 79
6383 79 -56 40 -54 214 -43 73 -2 165 136 -236 -22 -239 -117 123 -125 97 -74 -167 280 -82 -273 -121
6405 -121 -140 247 186 -2 36 -71 -115 -197 4 -72 87 73 -12 40 -8 104 122 -271 -74 -129 8 68 116 115 182 -91
6431 -91 -221 37 -45 20 222 131 190 65 219 104 -227 289 105 -200 -33 204 -88 -148 -584 133 -20 100
6453 100 -195 -92 -60 52 329 304 73 -45 -30 -180 126 199 -68 -145 -50 33 -59 -5 78 -73 44 -137 34
6476 34 -186 185 158 143 90 -204 169 53 174 -152 -110 -158 -87 -41 -344 -64 65 396 -178 -132 155 -414 -240
6499 -240 80 35 -145 44 -76 -37 -125 -141 375 -139 -255 101 141 164 -260 -252 106 -87 -62 88 -223 315 169
6522 169 -214 -18 11 58 -28 -232 -168 188 25 48 171 66 6 13 -51 -158 250 -314 -92 37 61 98 21 179
6546 179 -54 -24 71 4 -216 76 -320 87 23 67 62 32 -65 -62 202 94 300 -149 -47 -112 253 -128 -209 284
6570 284 145 154 -18 -87 -115 95 121 119 -15 -61 -98 -81 -22 179 70 165 -28 -391 4 -121 268 -210 4 88
6594 88 -101 204 316 59 101 247 143 -89 209 -290 114 87 -187 47 13 -52 -61 7 -275 92 -142 131 -79
6617 -79 -41 -334 -72 -192 170 135 -10 3 -121 125 110 64 -196 -5 -74 38 -70 68 -35 -39 177 -42 -49 69
6641 69 31 -65 -149 -4 -122 15 20 56 129 40 24 73 -122 52 76 27 59 -15 44 -11 11 24 -60 -137 -93 99 -62
6668 -62 -185 32 -52 -184 -84 -214 31 -167 55 -36 236 -376 45 28 15 -115 -3 92 -95 129 -143 95
6690 95 170 228 -189 -49 -17 35 -137 -282 -129 102 -137 -210 128 295 -190 78 -133 -157 -89 27 -78 94 -54
6713 -54 87 56 -60 29 -80 36 44 -8 300 20 -21 -27 -278 90 190 123 101 24 62 35 -286 23 73 236 -283
6738 -283 381 26 -188 -79 89 39 186 53 -50 -56 -97 -58 -83 -110 173 -234 2 -90 -219 -2 152 -96 214
6761 214 132 -76 0 152 -180 -44 20 117 73 52 -301 49 192 -263 -347 -58 143 -34 -17 24 -115 -148 -129 18
6785 18 117 -73 -258 -182 -139 6 157 79 134 84 -22 -104 158 -78 -281 83 -59 164 -123 -274 43 -11 -148
6808 -148 46 152 88 183 -205 163 58 -30 24 -294 -46 95 -127 -79 236 14 -219 10 -15 -86 168 -22
6830 -22 -120 -187 126 93 -301 -285 -195 -56 13 -2 -100 -3 19 -224 136 110 0 -18 -194 41 206 39 -165 41
6854 41 73 -158 -172 -132 -218 23 107 -47 -16 61 -228 -192 128 -71 -138 -13 57 29 -159 -46 -141 -91 48 -340 -41
6879 -41 109 -133 -39 -83 53 -2 -48 153 -118 62 75 -60 112 -76 133 126 0 -112 222 72 -116 41 159
6902 159 -25 98 164 -119 -240 -161 55 71 -37 86 133 180 -80 -6 -182 101 5 -255 -64 -55 249 -61 -39
6925 -39 147 -75 -75 -23 69 58 208 -42 -123 -275 121 -134 111 -43 -76 -138 31 49 -55 97 54 236 -51 201
6949 201 157 -71 -35 54 -60 100 -72 153 66 15 227 182 129 -69 -91 115 59 -123 -50 216 -65 34 -5 -22
6973 -22 16 -98 58 -57 40 -94 157 -156 -113 32 -34 -53 -32 -118 -276 162 71 -177 -170 -173 111 97 203 21 238
6998 238 320 13 -72 118 27 -316 227 269 37 -6 163 -75 95 57 185 -296 197 155 -104 -100 -46 392 -13
7021 -13 102 128 -15 -30 50 -71 -191 -176 -158 -202 -34 65 260 -10 102 -117 -271 -29 -15 -207 -9 110 -24
7044 -24 -38 -6 -95 -265 -126 -41 46 -76 -121 -149 276 353 -525 53 176 -9 -7 8 -18 -164 -46 -19 226 53 148
7069 148 48 -123 116 -158 -40 -17 10 13 -186 -202 38 -73 36 -36 -31 187 198 190 -123 -16 278 -234 -86 77
7093 77 129 -129 -276 77 -101 109 119 176 -7 -88 84 -154 -73 -274 -257 67 61 -119 -187 243 -101 46 -204
7116 -204 -7 -56 -237 -199 203 -223 170 69 -319 -25 164 16 -79 -33 -67 -189 330 -10 128 42 148 306
7138 306 62 -98 67 117 -17 -6 133 17 73 224 9 93 76 178 19 -127 46 -65 146 0 -275 396
7160 396 -1 195 -72 6 158 42 59 -288 -30 38 -103 -79 -202 92 -1 17 -43 -35 -140 156 67 32 -317 48
7184 48 -220 -23 54 314 -18 192 73 124 -118 -108 106 -60 43 -121 263 83 -91 -49 99 22 93 -100
7206 -100 -106 -124 -30 1 36 75 43 73 138 -91 -199 163 -21 -287 148 119 -94 18 -118 43 -134 -24 -51 44
7230 44 -4 13 130 -331 143 -96 90 -331 -69 -26 0 36 -133 -40 -51 155 189 -104 285 16 73 -81 -159 23
7254 23 185 -98 -8 -290 15 -29 -151 -97 -186 -36 51 161 62 -26 41 137 169 172 97 -43 216 -252 204 -152 -114
7279 -114 230 -76 195 -193 -5 49 262 -239 21 -75 257 1 -104 260 135 147 240 181 90 21 -185 72
7301 72 -97 16 211 77 36 77 192 106 62 135 -86 -49 -173 274 -210 -118 128 134 205 78 -26 -170 147 -207
7325 -207 -40 -77 -10 -47 -153 -244 -147 104 -54 45 -126 -149 51 195 -140 50 -274 31 -296 -13 45 41 -1 -211
7349 -211 125 -104 -314 -94 -18 143 16 -2 -96 93 -58 -177 -2 120 -112 108 -4 -77 133 -144 13
7370 13 110 6 -191 -30 -309 239 -156 -110 -92 -63 -45 81 -107 65 159 29 -35 -169 128 285 -115 -337 -241
7393 -241 129 -85 261 166 -177 -101 -27 -98 190 218 272 -87 113 81 58 129 39 164 23 -147 37 183 -55
7416 -55 -11 23 -154 -112 -184 -17 227 180 -254 -11 125 182 27 -93 37 89 199 138 -59 -2 29 123 126 35 -149
7441 -149 114 265 127 -278 -153 291 -154 20 105 -79 -144 50 185 -193 37 -252 57 -71 66 -84 98
7462 98 -254 -5 -28 -62 196 -203 -126 209 41 146 61 204 87 245 -131 -24 -150 -174 -63 42 185 -157
7484 -157 -222 77 -10 141 55 -44 127 41 -31 42 -6 130 452 149 4 276 -79 3 34 -188 197 -33 -95 103
7508 103 10 122 68 33 6 -22 -94 336 8 76 296 -94 -105 7 -22 -297 105 -178 -60 -178 42 -85 -86 -86
7532 -86 -67 14 -115 -237 -153 147 -20 126 -195 -141 -24 90 -96 68 104 -20 -140 64 -44 142 53 38 138
7555 138 10 231 -148 -348 129 -99 -49 390 213 -116 -29 162 -47 103 -179 -6 100 147 80 155 90 -23
7577 -23 68 93 68 304 126 -71 250 -53 -25 -292 41 -30 198 -2 76 96 -168 -142 304 41 50 -91 108 75
7601 75 -336 42 131 -161 -54 -68 -194 31 -27 -148 -90 -280 231 1 170 70 118 -98 -24 -35 -211 -16 -166
7624 -166 -408 69 -68 84 160 231 147 -71 131 62 -141 -358 -122 -6 -77 -47 41 24 19 65 -109 119 -269 -187
7648 -187 -108 -145 -33 -8 250 -52 104 25 312 92 -245 -102 -51 45 260 -17 104 -42 -230 -71 118 -199
7670 -199 -201 -86 -280 -42 93 91 23 -255 18 -55 5 -67 467 -206 99 -158 -159 18 -22 67 -115 99 210 -261
7694 -261 9 4 27 -85 -254 48 -309 11 109 -31 260 -33 71 4 81 10 74 226 -62 183 -77 119 31
7717 31 -16 -164 162 -163 200 -89 32 -207 62 171 44 -88 185 110 124 -213 99 84 181 245 -60 -171
7739 -171 55 415 67 55 -136 110 -164 -229 -128 -84 122 10 169 104 40 -38 46 -122 -58 -211 -47 435 -30
7762 -30 -170 -99 -124 -128 -111 201 102 -130 33 -15 84 116 125 -27 125 -183 -256 64 -96 138 -113 -11 -18 -71 256
7787 256 -262 162 22 -168 13 -192 143 -47 97 -184 60 -91 -296 -56 149 -277 96 243 -206 237
7807 237 205 -80 65 -145 0 39 195 5 95 -90 -96 -203 -219 213 -78 84 -53 -17 4 -4 -44 -165 121 172
7831 172 -67 66 -186 -130 -55 111 -209 -86 241 -250 -108 -291 177 210 -164 67 -142 125 160 99 -263 132
7853 132 -152 14 -9 -295 47 145 136 -265 -183 -55 179 -17 17 -38 11 -24 265 213 -97 62 -91 -68 -48 90
7877 90 184 -28 -174 331 -58 144 12 136 86 -222 -236 -185 325 1 -195 -31 -46 40 -50 2 27 -185 -14
7900 -14 161 -358 -173 270 61 20 200 333 141 -8 -111 153 49 -306 -187 121 -49 208 147 68 160 -173
7922 -173 43 -88 -224 -26 -11 135 31 -30 20 214 -226 -83 12 -376 0 203 -447 8 67 275 276 -63
7944 -63 185 58 71 -52 29 -178 62 -51 -130 -25 249 50 -80 141 154 77 104 238 -160 251 41 -89
7966 -89 24 11 292 288 -161 88 -230 -149 -151 -322 120 -71 8 110 204 -269 273 -297 84 105 195 -38 -84 297
7990 297 64 35 18 -77 77 -79 77 -129 43 64 -19 -202 -125 -200 44 36 -38 -38 -220 -114 -225 -367 41 126
8014 126 29 -65 270 127 84 6 -139 -297 -171 -1 -40 41 -6 38 191 34 -124 76 201 62 23 -106 -282
8037 -282 74 87 -95 -6 -90 115 -12 -127 -37 126 -43 -95 62 -61 -184 -91 -43 70 -119 72 289 -396
8059 -396 -29 -217 82 -142 -219 -19 27 45 75 215 -190 131 109 337 -60 1 22 -147 152 -14 -80 -131 -191
8082 -191 56 -46 115 -233 452 -34 -86 -41 115 20 -5 43 -351 -178 -124 74 -70 129 212 167 -59 -32 6
8105 6 -77 -79 -79 14 25 -37 -6 -17 52 86 -2 -321 40 -174 24 207 135 72 164 59 133 -236 -399 -23 -87 -145 178
8132 178 -142 -24 163 -169 211 -138 24 -62 214 192 -2 -87 -16 75 72 -191 155 -124 -93 -164 94 50 -155
8155 -155 -1 10 86 121 34 -195 -211 70 -118 302 64 -206 -85 272 -17 -67 -192 -126 -166 41 207 -152 -8
8178 -8 57 -87 -260 -56 -23 -14 -9 -9 -87 77 278 -95 -94
8191i4
##END NTUPLES=NMR FID
##END=
