##TITLE=1H_Pr NCS-Eth
 200.13MHz, CDCl3,
 8 sc
 
 28.3.2025
##JCAMPDX= 6.0         $$ Bruker NMR JCAMP-DX V2.0
##DATA TYPE= NMR FID
##DATA CLASS= NTUPLES
##ORIGIN= UXNMR, Bruker Analytische Messtechnik GmbH
##OWNER= pz
$$ XWIN-NMR		Version 3.5
$$ Fri Mar 28 13:56:17 2025 Russian Standard Time (UT+4h)  she@DPX200
##.OBSERVE FREQUENCY= 200.1313
##.OBSERVE NUCLEUS= ^1H
##.DELAY= (6, 6)
##.ACQUISITION MODE= SIMULTANEOUS
##.ACQUISITION SCHEME= undefined
##.AVERAGES= 8
##.DIGITISER RES= 18
##SPECTROMETER/DATA SYSTEM= spect
##.PULSE SEQUENCE= zg30
##.SOLVENT NAME= CDCl3
##.SHIFT REFERENCE= (INTERNAL, CDCl3, 0, 14.3821)
##AUDIT TRAIL= $$ (NUMBER, WHEN, WHO, WHERE, WHAT)
$$ ##TITLE= Audit trail, XWIN-NMR		Version 3.5
$$ ##JCAMPDX= 5.01
$$ ##ORIGIN= Bruker BioSpin GmbH
$$ ##OWNER= she
$$ F:/spectra/data/she/nmr/H-C/1/audita.txt
$$ ##AUDIT TRAIL=  $$ (NUMBER, WHEN, WHO, WHERE, WHAT)
(   1,<2025-03-28 13:54:44.37 +0400>,<she>,<DPX200>,
      <created by zg, POWCHK disabled, PULCHK disabled
       configuration hash MD5:
       00 E9 B6 7A A2 85 ED C7 34 08 36 98 17 FE 4E 26
       data hash MD5: 16K
       F1 88 4B 9E 21 50 93 C6 52 F6 3B 94 5B 21 EF CA>)
$$ ##END=
$$ 
$$ hash MD5
$$ 4B 00 A6 0C CB 55 D8 22 36 27 94 73 A6 C2 64 71
##$RELAX= 
##$RELAX= 
##$RELAX= 
##$RELAX= 
##$RELAX= 
##$RELAX= 
$$ Bruker specific parameters
$$ --------------------------
##$DU= <F:/spectra>
##$EXPNO= 1
##$NAME= <H-C>
##$PROCNO= 1
##$TYPE= <nmr>
##$USER= <she>
##$AMP= (0..31)
100 100 100 100 100 100 100 100 100 100 100 100 100 100 100 100 100 100 
100 100 100 100 100 100 100 100 100 100 100 100 100 100 
##$AQSEQ= 0
##$AQ_mod= 1
##$AUNM= <au_zg>
##$AUTOPOS= <>
##$BF1= 200.13
##$BF2= 200.13
##$BF3= 200.13
##$BF4= 200.13
##$BF5= 200.13
##$BF6= 200.13
##$BF7= 200.13
##$BF8= 200.13
##$BYTORDA= 1
##$CFDGTYP= 0
##$CFRGTYP= 5
##$CHEMSTR= <none>
##$CNST= (0..31)
1 1 145 1 1 1 1 1 1 1 1 1 1 1 1 1 1 1 1 1 1 1 1 1 1 1 1 1 1 1 1 1 
##$CPDPRG= <>
##$CPDPRG1= <>
##$CPDPRG2= <>
##$CPDPRG3= <>
##$CPDPRG4= <mlev>
##$CPDPRG5= <mlev>
##$CPDPRG6= <mlev>
##$CPDPRG7= <mlev>
##$CPDPRG8= <mlev>
##$CPDPRGB= <>
##$CPDPRGT= <>
##$D= (0..31)
0 0.7 0 0 0 0 0 0 0 0 0 0.03 0 0 0 0 0 0 0 0 0 0 0 0 0 0 0 0 0 0 0 0 
##$DATE= 1743155683
##$DBL= (0..7)
120 120 120 120 120 120 120 120 
##$DBP= (0..7)
150 150 150 150 150 150 150 150 
##$DBP07= 0
##$DBPNAM0= <>
##$DBPNAM1= <>
##$DBPNAM2= <>
##$DBPNAM3= <>
##$DBPNAM4= <>
##$DBPNAM5= <>
##$DBPNAM6= <>
##$DBPNAM7= <>
##$DBPOAL= (0..7)
0.5 0.5 0.5 0.5 0.5 0.5 0.5 0.5 
##$DBPOFFS= (0..7)
0 0 0 0 0 0 0 0 
##$DE= 6
##$DECBNUC= <off>
##$DECIM= 32
##$DECNUC= <off>
##$DECSTAT= 4
##$DIGMOD= 1
##$DIGTYP= 9
##$DL= (0..7)
0 120 120 120 120 120 120 120 
##$DP= (0..7)
150 150 150 150 150 150 150 150 
##$DP07= 0
##$DPNAME0= <>
##$DPNAME1= <>
##$DPNAME2= <>
##$DPNAME3= <>
##$DPNAME4= <>
##$DPNAME5= <>
##$DPNAME6= <>
##$DPNAME7= <>
##$DPOAL= (0..7)
0.5 0.5 0.5 0.5 0.5 0.5 0.5 0.5 
##$DPOFFS= (0..7)
0 0 0 0 0 0 0 0 
##$DQDMODE= 0
##$DR= 18
##$DS= 0
##$DSLIST= <SSSSSSSSSSSSSSS>
$$ [...]
##$SUBNAM0= <"">
##$SUBNAM1= <"">
##$SUBNAM2= <"">
##$SUBNAM3= <"">
##$SUBNAM4= <"">
##$SUBNAM5= <"">
##$SUBNAM6= <"">
##$SUBNAM7= <"">
##$SUBNAM8= <"">
##$SUBNAM9= <"">
##$SW= 18.0517328524113
##$SWIBOX= (0..15)
0 0 2 0 0 0 0 0 0 0 0 0 0 0 0 0 
##$SW_h= 3612.71676300578
##$TD= 16384
##$TD0= 1
##$TE= 0
##$TE2= 300
##$TE3= 300
##$TEG= 300
##$TL= (0..7)
0 120 120 120 120 120 120 120 
##$TP= (0..7)
150 150 150 150 150 150 150 150 
##$TP07= 0
##$TPNAME0= <>
##$TPNAME1= <>
##$TPNAME2= <>
##$TPNAME3= <>
##$TPNAME4= <>
##$TPNAME5= <>
##$TPNAME6= <>
##$TPNAME7= <>
##$TPOAL= (0..7)
0.5 0.5 0.5 0.5 0.5 0.5 0.5 0.5 
##$TPOFFS= (0..7)
0 0 0 0 0 0 0 0 
##$TUNHIN= 0
##$TUNHOUT= 0
##$TUNXOUT= 0
##$USERA1= <user>
##$USERA2= <user>
##$USERA3= <user>
##$USERA4= <user>
##$USERA5= <user>
##$V9= 5
##$VALIST= <valist>
##$VCLIST= <CCCCCCCCCCCCCCC>
##$VD= 0
##$VDLIST= <DDDDDDDDDDDDDDD>
##$VPLIST= <PPPPPPPPPPPPPPP>
##$VTLIST= <TTTTTTTTTTTTTTT>
##$WBST= 1024
##$WBSW= 4
##$XGAIN= (0..3)
0 0 0 0 
##$XL= 0
##$YL= 0
##$YMAX_a= 515158
##$YMIN_a= -451422
##$ZGOPTNS= <>
##$ZL1= 120
##$ZL2= 120
##$ZL3= 120
##$ZL4= 120
##$ABSF1= 10
##$ABSF2= 0
##$ABSG= 5
##$ABSL= 3
##$ALPHA= 0
##$AQORDER= 0
##$ASSFAC= 0
##$ASSFACI= 0
##$ASSFACX= 0
##$ASSWID= 0
##$AUNMP= <proc_1d>
##$AZFE= 0.1
##$AZFW= 0.1
##$BCFW= 1
##$BC_mod= 2
##$BYTORDP= 1
##$COROFFS= 0
##$CY= -3
##$DATMOD= 1
##$DC= 2
##$DFILT= <>
##$DTYPP= 0
##$F1P= 0
##$F2P= 0
##$FCOR= 0.5
##$FTSIZE= 0
##$FT_mod= 4
##$GAMMA= 1
##$GB= 0.15
##$INTBC= 1
##$INTSCL= 1
##$ISEN= 128
##$LB= 0.25
##$LEV0= 0
##$LPBIN= 0
##$MAXI= 10000
##$MC2= 0
##$MEAN= 0
##$ME_mod= 0
##$MI= 1.114404
##$NCOEF= 0
##$NC_proc= 0
##$NLEV= 6
##$NOISF1= 3.799351
##$NOISF2= 2.8
##$NSP= 1
##$NTH_PI= 0
##$NZP= 0
##$OFFSET= 14.38212
##$PC= 1
##$PHC0= -620.9011
##$PHC1= 5.19221
##$PH_mod= 1
##$PKNL= yes
##$PPARMOD= 0
##$PSCAL= 0
##$PSIGN= 0
##$REVERSE= no
##$SF= 200.129724274929
##$SI= 16384
##$SIGF1= 3
##$SIGF2= 2
##$SINO= 400
##$SIOLD= 16384
##$SREGLST= <1H.CDCl3>
##$SSB= 0
##$STSI= 0
##$STSR= 0
##$SW_p= 3205.1282051282
##$SYMM= 0
##$S_DEV= 0
##$TDeff= 0
##$TDoff= 0
##$TI= <>
##$TILT= no
##$TM1= 0
##$TM2= 0
##$TOPLEV= 0
##$USERP1= <user>
##$USERP2= <user>
##$USERP3= <user>
##$USERP4= <user>
##$USERP5= <user>
##$WDW= 1
##$XDIM= 8192
##$YMAX_p= 0
##$YMIN_p= 0
$$ End of Bruker specific parameters
$$ ---------------------------------
##NTUPLES= NMR FID
##VAR_NAME=  TIME,          FID/REAL,        FID/IMAG
##SYMBOL=    X,             R,               I
##VAR_TYPE=  INDEPENDENT,   DEPENDENT,       DEPENDENT
##VAR_FORM=  AFFN,          ASDF,            ASDF
##VAR_DIM=   8192,          8192,            8192
##UNITS=     SECONDS,       ARBITRARY UNITS, ARBITRARY UNITS
##FACTOR=    0.0002768,     1,               1
##FIRST=     0,             0,               0
##LAST=      2.2672688,     0,               0
##MIN=       0,             -451422,         0
##MAX=       2.2672688,     515158,          0
$$ Real data points
##PAGE= N=1
##DATA TABLE= (X++(R..R)), XYDATA
0@%%%%%%%%%%%%%%%%Qj6J6j8K3k9L6m4N2o0P0q2R6j12J28j49J75k00K27k58K92
37A55l30L72m18M68n22N82o48P19p97Q82r74J077j187J305j439J584j743J919
55A005k111K326k565K833l134L473l861M306m810N375n980O495o364K626L9592
70C9206M75952m77259k88276M27163k72591k07287M75190J59589m96037r3878
80b58228M43793j05291k88887M16721q3780n29176M21708L36345m46436j435J97164
91A02498k17498l2937K99751N8036l32746n1573L13094j53747j25227L60370j65230
102E4791l17158L23535P7552k32620R0854P1879j10969m3062J29041Q1801k10058
113h4414R659K04774k01976j9220K59708j81313j00715J82206p6367l8803R3789
$$ y = [0, 0, 0, 0, 0, 0, 0, 0, 0, 0, 0, 0, 0, 0, 0, 0, 0, 8, -8, 8, -10, 13, -16, 20, -24, 28, -32, 38, -44, 52, -60, 68, -81, 94, -106, 121, -137, 155, -175, 197, -221, 247, -275, 307, -341, 378, -419, 463, -511, 566, -621, 684, -755, 829, -914, 1005, -1106, 1220, -1345, 1488, -1646, 1827, -2034, 2272, -2538, 2837, -3143, 3352, -3012, -386, 39206, 515158, 37899, -250377, 176786, -95805, -303092, 172098, 331687, -164350, -258228, 185565, 80274, -208613, 208108, 124328, -404848, 16860, 353205, -93231, -94666, 102498, -115000, -147937, 151814, 209850, -122896, -174469, 138625, -15122, -140349, 220021, 54791, -262367, 61168, 138720, -93900, -3046, 68833, -42136, -85198, 43843, 125644, -84414, -74755, 130019, -71957, -91177, 168531, -12782, -113497, 68709, -7658, -46461, 47328]
124D7328j3172l0637p3791M3249R7418r7026N1504N3164j89141O5334J16589r1036
136b0217O2847j5048j05093Q4408m992J682N9913j21174J6543R2993o6005M9228
148C5085j0800j11208P4479K9706J1107M8153j27827n511P9019o5411R4929L3205
160H4926j61029N5096M3461n6062P3561l0775m7615M7844k7111N0917K254j08460
172g2993P8112J2257n8864J19971n1776j04509R4094k2094j1536P0372n9890k087
184h943M561l3052P9103m3099m1181J00710p6750k1631J05956r1823o895Q1810
196D8766o9643J8190K4998m5299L9134k7838j880N4298p9020L3444N9386j07372
208e2836N0597M7789r6323O3511K2059p0503M7386j4101j0456M1721n0760K8414
$$ y = [47328, 34156, 3519, -70272, -27023, 70395, -26631, 24873, 78037, -111104, -45770, 70819, -20217, 42630, 27582, -77511, 6897, 1905, 3587, 63500, -57674, -41131, 51862, -14143, 35085, 24285, -86923, -12444, 17262, 28369, 76522, -51305, -56816, 22203, -43208, 51721, 84926, -76103, -21007, 22454, -33608, 39953, 9178, -38437, 9407, -17704, 33213, 35467, -72993, 5119, 17376, -41488, 78483, 26707, -77802, 16292, -5802, -17338, 53034, -6856, -8943, -4382, -37434, 41669, -1430, -42611, 58099, -18651, -40282, 65674, -26149, -33044, 48766, -20877, -2687, 22311, -22988, 16146, -11692, -13572, 40726, -38294, -4850, 54536, -52836, -2239, 45550, -50773, 12738, 34797, -35706, 11680, -2421, -12877, 28844, -21916, 6498]
220F498J4364o9659P5585R55p5339P7863k3508m6658P7154m1053j6162M3853n0936
233b7043L6268J6010o0841N7500j8485m2692P9776l9518k6909N7408n4504J5666
245g364L6733n7301M4352l999n1107P1062l1010l4756P0494n0595n925N4037n5991
258b1370K0435J7622m5517N2005j9666l1420O4621n1921r161O6694o4012J0492
270a1198M4252n9134L0095J0576l8031M3971k8213r619N1212n8976J5670M6290
282C6895p0682L5280K9023o3041M3844K533l6717M2450k7596j042L3984n1875
294b6944L2567J9552o3644N4526K499n6196O0459j5708l2764M8832l2129K088
306f862K7457m3796L5216J295m5835N8636k1556l6588O4286l7547j7304N1468
$$ y = [6498, 20862, -48797, 26788, 27743, -47596, 30267, 6759, -39899, 37255, -3798, -19960, 23893, -27043, 9225, 25235, -35606, 21894, 3409, -39283, 40493, 975, -25934, 31474, -23030, -7364, 29369, -27932, 16420, 12421, -38686, 32376, 1366, -33390, 37104, -13491, -19416, 34621, -21370, -935, 16687, -28830, 23175, 3509, -27911, 36710, -15211, -24372, 42322, -21690, -11198, 33054, -26080, 4015, 14591, -23440, 20531, -7682, -17301, 33911, -25065, -9395, 36895, -33787, 1493, 30516, -32525, 11319, 13852, -22865, 19585, -8011, -9053, 24931, -26944, 5623, 25175, -38469, 16057, 18556, -37640, 22819, 7111, -25653, 23179, -8950, -6862, 20595, -23201, 12015, 13310, -32525, 26111, 4555, -32033, 32253, -5294, -22598, 28870]
318B8870m3198Q698K4032l9859L4619q224k9253N2475l5860j4326N6433n1062
330a6655L168M3466n1444K0899J7977l8353L5020j3327j7972M2498m0401M787
342a0337M0534n5802K3362K8185n3850L5421P258l7378L8229j7328j0577L3893
354B1610l8878J7126K2516n0777L8445P623m7878M7884j0049l1794M4590k5955
366e537o192L1116l6432K1111J0204l9754M2516j0034l2923N0658k6993j7113
378a9373M4866l6995L636K6825l7858K6168L084l2158M0615k0852j9024M6992
390B5926l5411l215L7081m1105J4626J8589l4697K9127p038k0506L9025l1326
402h924n325M0218m4083J2148L2428m6714J9677J3815l1001K8119r015j0562K5702
$$ y = [28870, -14328, -5630, 18402, -21457, 13162, 4938, -24315, 28160, -7700, -22026, 34407, -16655, -13487, 29979, -21465, -566, 17411, -20942, 14078, 751, -17221, 25277, -15124, -10337, 30197, -25605, -2243, 25942, -27908, 7513, 14771, -22607, 15622, -1706, -12283, 21610, -17268, -142, 22374, -28403, 10042, 17665, -30213, 17671, 7622, -24172, 20418, -5537, -11729, 19387, -17045, 4066, 14270, -25484, 17032, 6998, -25925, 24733, -2260, -19373, 25493, -11502, -7866, 18959, -18899, 7269, 10353, -21805, 18810, -2042, -21066, 25926, -9485, -12700, 24381, -16724, -2098, 16491, -18206, 10921, 3883, -16623, 22402, -8924, -14249, 25969, -18114, -5966, 26462, -20252, -575, 13240, -17761, 10358, 1343, -9219, 16483]
415A6483l3492J5862K5014n0429L1314J7790n1695L8952P207m0704L1535m172
427C665j0383J8159k3159J6955J243l2388M8318j1426m3964N6134j7569l5288
439b9703N2925j9291k2198L0032j3112M635k807j3815K9694k6245l210N0485n1539
452a4149j0323N4166m6031K658M5259m0609j048J8132j4250J0388j2292Q338J8642
465A8881l8120K6081J7109o0922L6282K7156m9073L5207P371m6119K3016O207
477C076m223J0868j8143J6646n541k6420M4967j7120l5545N7034j6796l0974M3290
490B1119k5524j7262L3545j0113N187l939j7773K4275j8392j016L9067m2456j416
503a4698M1577m2400P134K8584l7586J7453J5797k3348J2946j3153k472K4594
$$ y = [16483, -17009, -1147, 23867, -26562, 4752, 22542, -29153, 9799, 17006, -23698, 7837, 3665, -6718, 11441, -11718, 5237, 6480, -25908, 22410, 10984, -32980, 23154, 5585, -29703, 23222, 3931, -18267, 11765, -1347, 3288, 481, -13334, 16360, -9885, -13095, 37390, -14149, -24472, 29694, -16337, -13679, 31580, -9029, -10077, 8055, -6195, 4193, -8099, 239, 18881, -19239, 6842, 23951, -36971, -689, 26467, -22606, 12601, 19972, -26147, -3131, 3076, -1147, 9721, -8422, 8224, 2683, -23737, 21230, 4110, -31435, 25599, 8803, -22171, 21119, -4405, -21667, 11878, 1765, 6952, 3013, -14760, 9515, -8877, -9893, 29174, -13282, -14698, 26879, -15521, -8387, 20197, -17389, 64, 15861, -7487, 5459, -7694, -10166, 14428]
515A4428k0937J3325O610m0640L0530R317l1228L6761j1840k9846L9033j5977
527d64j5133L0191j8699J788J5071j8154P220j1554l02L3444k9558J316K9238
540B4404n1801J3891M5293m7630Q168L1483l4676M236J3844r779k500o404L0147
553A8676j590m3793L7734k681n0456O2680J2575o2236L3754J1114l8639J7909
565d953J6209o083j3708O111L0837m1876j9095O0765l2990k0138P0133l8108m7567
578d0463M8309j698j7254K0206M322j2057k3544K2227K5556n0132J5419M4165
590C5056n4654R244M3556n3168k303M1019j3809l799L21k677k740j4144L4256
603A6158N866m8543K9803J2487m1577L5191Q048l8738K3486O563j1464Q129j5305
$$ y = [14428, -6509, 6816, 13426, -27214, 3316, 12633, -18595, 18166, 6326, -23520, 15513, -464, -15597, 14594, -4105, -2317, 12754, -5400, 1820, -9734, -10036, 23408, -6150, -4834, 24404, -27397, -13506, 31787, -15843, -7675, 23808, -10868, -6632, 7212, -2567, -5067, -11471, 18676, 17086, -26707, 11027, 8346, -42110, 20570, 33145, -29091, 4663, 15777, -22862, -4953, 11256, 5173, -8535, -2424, 28413, -13463, -32558, 28207, -4783, -24921, 45212, 7104, -40463, 7846, 6148, -11106, 9100, 13422, 1365, -22179, 48, 25604, -24528, -9109, 35056, -19598, -10354, 33202, -19966, -22269, 18750, 4941, 1142, 1463, -1214, -3954, -18098, 16158, 22024, -26519, 3284, 15771, -25806, 9385, 17433, -21305, 2181, 8744, -2720, 5409, -9896]
616i896P423P083j1548K5802j4709k8604L1916p663o963L0286k7846q446K2577
629I412j9896J2472R806k4901J7253J621j2863J5733j7116q93K0646j5652J3586
642I208R55l3186K5001N566k0034K9636j1524k3350K4937p576m876J2004j3195
655f434J0166L2j1194K0166k0416r942L6709k0408o278K7503l0909k790K6186
668A2391j5569M424M196r938R166j1831N158J3937k7773J7716J8188l7265J7751
681E51J2242l3635K3654J2674k2564R123l138k806O111q321J6860p081k1204L1805
695A4271j0415k4771L6235j1717k0687L1255j0777j4050J3704n825N788j806n299
708d094J5939k0755k141L0478k6487k276K7607k7378J396K0455j8845M706L821
$$ y = [-9896, -2473, 4610, -6938, 18864, 4155, -24449, 7467, -196, -7159, 23127, -4719, -13165, 9412, -10484, 1988, 11794, -13107, 4146, 5767, -7096, 8637, -8479, -9372, 11274, -4378, 9208, 10163, -23023, 1978, 7544, -12490, 17146, 5622, -17728, 7209, -367, -5243, 6761, -6434, 3732, 3764, -7430, 12736, -7680, -17622, 19087, -1321, -7599, 19904, -11005, -13795, 12391, -3178, 1246, 5442, -4496, 4670, -7161, -2003, 11934, -15839, 1877, 20065, -17200, 551, 12793, -20842, 2812, 15486, -7078, 2045, -1093, -3899, 2212, -6109, 10751, 3670, -17534, 14271, 3856, -20915, 15320, 3603, -17084, 14171, 3394, -10656, 3048, -2777, 3011, 1205, -4094, 11845, -8910, -11051, 19427, -7060, -9336, 18271, -9107, -7711, 12744, -6101, -1395, 2426]
721B426o424J1706j3362K562J4423k4680J2920J6336k9331J4295R434k3160J6759
734C904J306j1487J2885j0928K865R985j9615J4474M971k2009K1376k026j8826
747a3125K1288q266p339J7239j5107L867R221j7964J4807R48j6607J9610p278
760A294j0138J8795j3963k91J3144j7427J0819M538j8544J8325l507j4123K1062
773I984j0752p047J7358j4317L012Q899j5026J2776j962j2721J9577j1490p485
786i194K1277j7099q61J6610j8269O730P540j4482J3099m435q158J6930j4415
799d727k51J6700k0255O992J1648k0045J2138L250j4102J4985o845n097J4423
812H814j5360M790J1325j9675J2352N318j8649J6494j943j2130J6239r303k536
$$ y = [2426, -3998, 7708, -5654, -3092, 11331, -13349, -429, 15907, -13424, 871, 10305, -12855, 3904, 5210, -6277, 6608, -4320, -1455, 8530, -11085, 3389, 8360, -13649, 7727, 5701, -13125, 8163, -103, -7442, 9797, -5310, -1443, 7778, -10186, 4621, 5569, -11038, 8572, 1294, -8844, 9951, -4012, -4303, 8841, -8586, 2233, 6771, -11773, 6552, 3045, -11078, 9984, -768, -7815, 9543, -4774, -1762, 7137, -7889, 4887, 2925, -9796, 9781, -1709, -9194, 12083, -5016, -5877, 10733, -7536, -806, 6734, -7748, 5351, 916, -7242, 9688, -4727, -4978, 11722, -8533, -1541, 10107, -9938, 2200, 5450, -8652, 6333, -512, -5609, 8814, -6546, -1756, 9569, -10106, 2246, 7564, -11085, 5409, 3466, -8664, 7575, -1728, -4264]
825d264J2384j4771P609N827j6773J5363j441j4454J8620p911q169J6896j2863
838c947N62J1017j4841R469K449j3506J5675o138r066J7952j2689k255J5031j6170
852f457N307Q341j5425J1898n86j1106J5415r298m060J5383j5276L543J1025j7131
866h427J0333M022j4678J4532m224q611J5135j1211n80J2000j5460P517O221j5471
880h902J3468j430j1739J5997q406m819J4450j3406L035R454j5298R997K369j3249
894h479J4600n035q064J4527j1170k29J1568j4213P463M605j4387J3939k560j0964
908h399J6541r078n518J4875j2622J471R224j2361Q526K13r739J3464q805l706
922e914J6656j5993N56J4767j7961N811J0404j4522P769J114p206Q954q135K715
$$ y = [-4264, 8120, -6651, 958, 6785, -9988, 5375, 3934, -10520, 8100, 189, -7980, 8916, -3947, -3385, 7632, -7209, 2260, 4709, -8797, 6878, 740, -8326, 9626, -3063, -5318, 9713, -6457, -1150, 7191, -8234, 3664, 3078, -8028, 7387, -1911, -5971, 9412, -5864, -2321, 8704, -8427, 1906, 5928, -8750, 5782, 1558, -7053, 8082, -3129, -3709, 8291, -7169, 348, 6569, -8902, 4566, 3136, -8603, 7394, -1012, -5831, 8619, -4787, -1752, 7702, -7596, 2401, 4770, -8479, 6121, 1086, -6978, 7549, -3621, -3850, 7718, -6495, 968, 5573, -8814, 5125, 2565, -8399, 8142, -936, -6454, 8421, -4201, -2730, 6494, -5867, 2659, 2872, -6867, 6597, -2208, -5914, 10742, -5251, -4695, 10072, -7889, -2078, 8326, -6196, 1573, 2687, -4519, 4435, -3700, -985]
936i85Q767j6348J0609P055k1203J4603N024j7989J4603Q65j1161Q959m559R46
950h14L599r059J2693k881j4392J9329o942j4059K2136o954j0372J5067q322l175
964d146O034n093P896m946m699J4737j4571l511J9410j6737M01J7882j7017M95
978c865Q655j0585O893R62l000P031j2090L806R834j6562J0358P634j9461J3050
992B660L935j5975J2394j236o876J1090o809p5L703j0345J1054Q45j0702J3849
1006G512q297r009J8242r474l736J3646j3522J329Q933j0911O639J042o628J0257
1020F023p399k551R182j2373P252R673j6103Q442J702j5397J5309J163j0225J1669
1034F367o639n104Q235o624M882J681p375J2004p730q461J6594j1766l353K0524
$$ y = [-985, 7782, -8566, 2043, 9098, -12105, 2498, 7522, -10467, 4136, 5001, -6160, 2799, -1760, -814, 2785, -6274, 6419, 3538, -10854, 8475, 1533, -12526, 9610, 2656, -7716, 7351, -971, -4146, 1888, -3205, 4691, -255, -4954, 9783, -4788, -8299, 11111, -5626, -5225, 12657, -4360, -3865, 4790, -5795, 1098, 2060, -940, 6091, -5999, -2193, 7641, -8921, 1437, 9071, -10390, 2660, 6595, -9380, 3014, 1778, -5098, 5992, -817, -892, 2811, -7534, 3520, 4365, -6337, 7512, -785, -9794, 8448, -1026, -4762, 8884, -4638, -3309, 5624, -5287, 1352, 2394, -4234, 6023, -1376, -3927, 5255, -7118, 134, 9807, -6296, 2146, 3848, -11549, 3760, 4923, -5302, 6367, -272, -5376, 2859, -3765, 1117, 2798, -4577, 7427, -303, -8764, 7830, -3936, -7289, 13235]
1048A3235j4315m955J3091j1896N21Q090l634L212n718K022O144j6420R347J2210
1062A0934k0801J1793J1560k4796O975J1417j2628N676N647l426m038n335J1731
1075D709l700j2064K2359m690k1097K1942k809j9787J9616L755j2330N187O88
1088A779k170n542L448J4253j5368l734K0786j9176o179K5159j4341p640J7992
1101I267q078o632M922J329J625p189P049O677k0120Q707J3722k0989Q698J3082
1115A2070j9568M421Q747r173L103J143J315N42q931R216j60j3202J6746M48j5999
1130i282J4188k712j1665J3478j604m325N860n902K258k32n429J0349m635m452
1144d105J2498j1018l658J2013j0631L430R878j1996L483K240q426Q571r25l370
$$ y = [13235, -1080, -6035, 7056, -4840, -4319, 3771, 137, 3349, -2369, -347, 5797, -10623, -1276, 10934, -9867, 1926, 13486, -11310, -4335, 7082, -5546, 130, 5777, 2351, -1687, -7022, 4709, 1009, -11055, 11304, 6614, -14483, 7459, 4650, -15137, 4479, 8234, -4096, 1091, 1779, -391, -5933, -2485, 11768, -3600, -7334, 13452, -5724, -11903, 13256, -1085, -8725, 9267, 1189, -5443, -521, 808, 2433, -4756, 2293, 8970, -11150, -2443, 11279, -9710, -1012, 12070, -7498, -3077, 5670, -3503, -400, 743, 2058, 2600, -6331, 2885, 2725, -10477, 6269, 6717, -9282, 4906, 2194, -9471, 4007, 2403, -1922, 3938, -1964, 294, 62, -5367, 4982, 347, -4105, 8393, -2625, -6283, 5730, -4901, -1471, 8407, -3589, -106, 2134, -6292, 2279, 1354, -2016]
1158b016P100p476J503M728j0376P899K410r597J2009l436j0721J1751n050l720
1172d992J1890o970j587M060o674N651p64l867R614q021k009J1221j2685N54J1918
1187G339j1359L350O824j0636L278J668k472O003n808J775M317j1340Q264N059
1201F262j3793R795L012j2260R351L25p200O360k222R14J654o766P751j904p946
1216f667J3295n129r138J3319n697n260J0449n923j055L996m836N231k719l616
1230c750R488p779j579J0674j0949M96R341r668L436M123p858N387j388k833P330
1245D471o717R00O514r841M560M545r694P134Q91p095P783m062k892P648o758
1260b613J854N283q813N139J724p268P714k273m228Q032o390k86O662q371L817
$$ y = [-2016, 5084, -2392, -889, 3839, -6537, 1362, 3772, -5825, 6184, 2748, -7973, 3778, -1272, -4992, 6898, -72, -1659, 2401, -4273, 1378, 614, -3253, 6361, -1660, -3669, 7552, -5133, -4579, 7339, -4020, -670, 6154, -4482, -1204, 464, -2008, 3995, -1813, -38, 4279, -7061, 1203, 6262, -7531, 2264, 5276, -6984, 2367, 2692, -4508, 1852, -370, 544, 2198, -4568, 3183, 1279, -6667, 6628, 1499, -7639, 5680, -17, -5277, 5172, -751, -1806, 2190, -2646, 2585, -134, -3750, 5738, -2041, -3620, 7054, -3895, -3399, 5942, -3726, -290, 3833, -4025, 1362, -26, -2859, 4471, -2246, -1346, 5168, -4673, -113, 4432, -5262, 1872, 2763, -4332, 3451, -611, -3503, 4145, -2613, -759, 4524, -4289, 850, 2574, -4694, 3020, 747, -3481, 4551, -1839, -2125, 4537, -3834, -17]
1275a7M057q473O305m9o147P455l704k003O623o995K467M340q544O343J149p776
1291d969Q303k082n179P862m973j031N642o611L623J933o871P193j908n366Q741
1306D307n002k575P941o877Q99M971p017M287R91n543O763l485k866P405o415
1321b216L77O171p783L426L284p156N717n78m708O686m355j097O155o891K525
1336d43M061p740N474J083o334O751k439l339O441n240N83M590o905M251J732
1351B526o843O742j390m842P429m256j821O248o052J772L547o333M804%n173O701
1367C059l380k569O697n904O19N167o926L568K359o341N637r83m266O315l854
1382h02r95N323o075K428K965o488N366J5n498O600k895k967O548n162K64M591
$$ y = [-17, 4040, -4433, 1872, 1823, -4324, 3131, -573, -2576, 4047, -2948, -481, 3859, -4685, 1658, 2807, -4969, 3334, 1252, -3927, 3935, -1038, -2069, 3573, -3038, 585, 2518, -4353, 2840, 932, -4434, 4307, -695, -3270, 4671, -2206, -1307, 3664, -3353, 934, 1925, -3618, 3145, -340, -3206, 4199, -2216, -1839, 4332, -3451, -25, 3259, -3897, 1820, 1242, -3466, 3220, -1135, -2232, 3923, -2968, -443, 3618, -4122, 1352, 2435, -3899, 2852, 413, -2926, 3515, -1725, -1142, 3448, -3457, 794, 2526, -4317, 2425, 1035, -3807, 3622, -634, -2455, 3793, -2259, -487, 3060, -3273, 1531, 1531, -3642, 3059, -321, -2890, 3807, -2097, -1478, 3689, -3237, 331, 2690, -3651, 1986, 1003, -3263, 3052, -802, -1797, 3526, -2549, -121, 2844, -3644, 1722, 1737, -3761, 2839, -56, -3023, 3525, -1637, -1373, 3218]
1398C218o059L427J549n513N784j761l647O569m596j086N606o025K311L183o507
1413c547M802J17m986O433k787k628N922n002N88L984n699L655J066n126N940
1428B732k487l834P176m472j275O112n754P39L364m753L513l25k944N205m393
1443a396o90O143p155J496O123p342K566L457o154L017O72j727L270l980J725
1458B5K600p057N355K492q273O659J532p567N475j68l591L891j402J141j09m386
1474c383N627j726m593Q701l758n586Q385l868l319O419l232n01K051k380K620
1489A457k514j079O014n610J17O352q004J232O159o746K468L221n420K492pj488
1505a356L194l115J630K042o026M549J187o250O763k77n969O042k142l576N362
$$ y = [3218, -2841, 586, 2135, -3378, 2406, 645, -3002, 3567, -1029, -2115, 3491, -2534, -223, 2960, -3547, 1255, 1372, -3614, 2819, 32, -2596, 3326, -1676, -1088, 2896, -2803, 852, 1918, -3208, 2732, 245, -3589, 3587, -885, -2160, 3952, -1802, -1063, 2301, -2452, 1061, 736, -2208, 2997, -1396, -2086, 4057, -3098, -1602, 4521, -2821, -255, 3202, -2952, 65, 737, -990, 2280, -1700, 25, 2625, -4432, 923, 3415, -4858, 1801, 3333, -4234, 1241, 1073, -2518, 1373, -29, 1112, 1003, -3383, 2244, 518, -4075, 4626, 868, -4718, 3667, -201, -3520, 2899, -333, -834, 1217, -1163, 1457, -1057, -2136, 3878, -1732, -1615, 4737, -3267, -2035, 4124, -2622, -154, 3067, -2353, 139, 132, -1356, 1838, -1277, 353, 2395, -3631, 918, 2105, -4145, 2618, 2341, -3628, 2414, 272, -3304, 2058]
1520B058k041j42J960l516K411j371k102O164l704j478N995o744n41O460n408
1535a999J737L983n476J414L95j929L334k146J057K515n809L145J747o412N913
1550A469J539o010N350j353m989M941p63n23K576k928J235r88k246N447l112k019
1566b374O935n563k057O733n740q14O354l384l31J161k091P95j710L066L004p110
1582c126L345L274q859N070N251q229L067L724n460M87J610N23p87j513N298l130
1598E45o204Q835j567o943R485r58q161N905Q26l946K053J578L52l712L12N379
1614C779o300p11R100o847k752Q310n791k648O468j797j366P47Q1L07l498L003
1630H5L748o732K979M044q165K770M318n500K927K039l507R63j314P54J953k834
$$ y = [2058, 17, -125, 1835, -1681, 730, -641, -2743, 3421, -283, -1761, 4234, -2510, -3051, 3409, -1999, -262, 3721, -1755, -341, 54, -1875, 1459, -687, 370, 2885, -2924, 221, 1968, -4444, 1469, 3008, -3002, 2348, 995, -3994, 947, 184, -339, 2237, -691, 544, -444, -2690, 2757, -355, -2374, 4561, -1002, -3059, 3674, -2066, -2880, 3474, 90, -241, 920, -1171, -376, -2086, 980, 3984, -3126, 219, 3493, -5366, -296, 4955, -3274, -207, 3517, -1943, -1456, 154, 677, -110, -1623, 3675, 545, -5659, 3176, 1609, -5334, 4151, 3193, -4968, 937, 1763, -2183, -130, 1448, 1800, -1912, -1600, 3779, -2521, -3232, 5868, -979, -3731, 4579, -1212, -3860, 2608, 811, -555, 192, 273, 580, -2918, 85, 3833, -2899, 80, 4124, -4041, -1271, 3047, -2453, 474, 2513, -994, -31, -1345, -591, 1362, -1472]
1646a472L453n2n444M653m03l902N679j425k847L922l122o04K747k811K424Q04
1662A600l137K911k020j755M337k713M25L222m909J712J980m425L748Q13l759
1677a970L560j324k049K922k215J063J589l195L004r10l550N168j842k476N258
1692C033l212k021M057k859M38K121k217J548j372j012L574l432L90M278n431
1707b117J042L907n199J835K731l561J869k7j321J660k387K034J602m601L588
1722A055P03n371M802O48m379L973o89k360K427j481Q90N14k389L486j415l052
1738b638M978k440k401N292k854j636L511k791M77J403j977K348j528j248L632
1753B128l341m2L881m210R12K890l990J907R95k738K797j096j125K717k858O81
$$ y = [-1472, 1981, 1929, -3515, 1138, 735, -3167, 2512, 1087, -1760, 2162, -960, -1564, 1183, -1628, 796, 1600, -1537, 1374, -646, -2401, 1936, -777, -352, 2870, -2039, -327, 1653, -2772, 976, 1789, -1970, 1590, 266, -1783, 1139, -1076, -13, 1576, -1619, 1385, 475, -3075, 2093, 251, -2225, 3033, -179, -2200, 1857, -1002, -564, 1557, -660, 888, -484, -1496, 2078, -1354, -964, 3314, -2117, -1075, 2832, -2367, -532, 2199, -1362, 507, 480, -841, 819, -1568, 466, 2068, -2533, 1055, 1758, -3613, 1189, 1837, -2542, 1431, 742, -1618, 809, -672, 218, 732, -1657, 1829, 414, -2638, 2340, -100, -2501, 2791, -63, -1699, 1812, -979, -502, 901, -1076, 1272, -256, -1504, 2128, -1213, -1255, 2626, -1584, -672, 2218, -1772, 135, 1130, -1608, 1189, 93, -1032, 1685, -1173, -492]
1769d92K345l701K260R82l504L196m86k456L648k185p79L109l185R83J810l257
1785a712K412J50k544L068j594j127L225k924M69K437l719J934J310l292K838
1800I31l35k096K913j956l26K532l075J527J435l520K810J11k865L357j226j598
1816a381L029k392K15J917k910K023N68k916L128r29k193L624k126q47K964k781
1832a007P02J633k843K273j67k157L051j778j049L302k931K11K470l223J647J046
1848A180k703K550p92j564K914k225q3K513l145J262J609l284K498J04k492K932
1864A274j342j154K756k469N06J995l050J874O16k627K732q46j726K993k076l37
1880h81K496k899J148J453k971K326M4k259K809j460r12K713k609O93J850l068
$$ y = [-492, 1853, -1848, 412, 1394, -2110, 1086, 600, -1856, 1792, -393, -1172, 1937, -1248, -265, 1545, -1712, 700, 850, -1694, 1374, -220, -1347, 1878, -1046, -577, 1860, -1859, 75, 1385, -1907, 931, 596, -1500, 1413, -543, -869, 1663, -1412, 115, 1550, -1970, 840, 951, -1914, 1443, 217, -1381, 1648, -744, -529, 1388, -1522, 501, 1069, -1847, 1281, 352, -1841, 1783, -343, -1190, 1774, -1007, -305, 1328, -1515, 758, 591, -1566, 1485, -293, -1342, 1960, -971, -760, 1710, -1513, 134, 1180, -1523, 1027, 235, -1329, 1585, -640, -723, 1790, -1355, -93, 1516, -1768, 730, 834, -1658, 1274, -68, -1222, 1534, -935, -429, 1566, -1484, 390, 1006, -1621, 1111, 265, -1461, 1532, -544, -881, 1615, -1284, -136, 1317, -1654, 672, 716, -1543, 1266, -194, -1106, 1607, -1002, -309, 1541, -1527]
1896a527J998O64k883K807o02j901K850j838l33K177k541J298R36k779K574l88
1912E12k166L134j556j147K822k457L07J901k591J657M03k268K524j020j303K773
1928A525k134l1K238k911J208J179k736K466k1k269K696j365r96K517j963N38
1944e9J196k516K046q6k306L215j422j588L431k379q07K642k163O13J125j668
1960g26J531j160p45K829k641J69L018l679O13K720l394J088J604j930J181n62
1976h4k25R94k188J805J416l623K515Q53l902L038P85k930K266j82j266J141j049
1993f36J041o2j728K875j125k413L660j702j747L822j891j256K274j733L33R24
2009F36j104J329j249n16K361k544M16K624l233J014J991l324J360J185j899J755
$$ y = [-1527, 471, 1135, -1748, 1059, 457, -1444, 1406, -432, -765, 1412, -1129, 169, 1105, -1674, 900, 512, -1654, 1480, -76, -1223, 1599, -858, -551, 1350, -1241, 416, 819, -1449, 1075, 55, -1248, 1525, -609, -640, 1598, -1313, -105, 1074, -1662, 804, 783, -1486, 1210, -155, -1151, 1366, -597, -59, 1137, -1379, 667, 581, -1725, 1490, 68, -1520, 1911, -468, -1275, 1367, -796, -183, 942, -726, 805, -355, -1100, 1729, -912, -743, 2275, -1404, -791, 1929, -1465, -377, 1227, -703, 478, -84, -309, 685, -1503, 302, 1718, -1905, 610, 1463, -2439, 599, 1384, -1546, 720, 538, -728, 413, -636, 405, 343, -1385, 1490, 365, -2048, 1612, -90, -1837, 1985, 94, -1162, 1112, -621, -288, 636, -468, 861, -388, -904, 1457, -1087, -671, 1953, -1280, -266, 1725, -1599, -239, 946, -953, 802]
2025H02m34q96J016j689J236J231k458K139n1k973K753k33j869K836j044j049
2041f83J430j688N03R03j200J948o85j747K161j691m39K861j989J71J580k694
2057a259R49Q42j775K027j55j273J511j505k14J486j507J547M31k322K078p81
2073H0k004L234r37j417K541j519j038J411q43P81j21m71J754k517j77L130k995
2090a108K10L337l344l25K590j969j5J169j77J6j379J341N77k976K718J454m328
2107b209K288J655l804J882J813k040J98L69J27p06o75K810j285k354L852j442
2123D79l268M055m36k460K733l11j648L57J66J000j048J29K248k994n73L311k726
2140i86j36L309k395m96J586j611K35N02J52J087j921N40R93k710J764J603k677
$$ y = [802, 368, -528, 488, -1201, 35, 1266, -1192, 947, 896, -2077, 676, 443, -1426, 1410, 366, -683, 747, -941, -438, 465, -735, 1213, 528, -1219, 942, -749, -1188, 1673, -316, -145, 1435, -1259, -310, 532, -1243, 784, 629, -644, 867, -638, -852, 634, -873, 674, 1105, -1217, 861, 80, -1924, 1310, 373, -1044, 1497, -22, -1060, 351, -492, 289, 168, -303, 1451, -1066, -1243, 1887, -1108, -898, 2439, -905, -1230, 1360, -609, -624, 545, 368, 384, -995, 346, 923, -2053, 665, 2119, -2209, 79, 1734, -2070, -188, 1625, -415, -217, 152, 279, -427, -1102, 1708, 423, -1931, 1921, 479, -2789, 1266, 830, -1630, 1103, 792, -856, -499, -333, 667, -381, -252, 1996, -998, -1571, 1740, -986, -1122, 2187, -208, -704, 882, -729, -494, 8, 160, 1247, -674, -134, 859, -1851, -87, 1516, -1161]
2157a161J737N56k594J612J1q85J489p47N9N45j674J268O4j360K236p66j462K036
2175I64j448n10K109j561K91J042j688R37R1r72J525q90k50J477j938M55J330
2192I64j945J384N94k118J560k28j274J807o73m11R42j293P37M55j425J718n16
2209B78j354K148j302p79K180j415j45J341j560L55M02p34J252p51l29J408j909
2226i14M76J703k237R14J342k255R69N80j283J053l01q3O54j388R53L89j820J844
2244E96J91k050J937l37j480J673m42l72Q48r12N38Pj142J689o16j020J992j268
2262a68p41J777j256K2J063j172O58O0r78J335p84m74J626j400L4J338j683P42
2280aO61j406J095j45r22J297q04k38J239j363N26P06j437R99J10j103J411o69
$$ y = [-1161, 576, 1132, -1462, 150, 161, -724, 765, 18, 77, 622, -1052, 216, 280, -1080, 1156, 390, -1072, 964, -484, -994, 1115, -446, -155, 887, -801, 136, 227, -745, 780, -110, -360, 1117, -821, -366, 964, -981, 403, 997, -1121, 439, 211, -1063, 744, 71, -340, 602, -691, 46, 501, -924, 794, 278, -1076, 1072, -230, -1009, 1171, -244, -389, 952, -608, -253, 149, -585, 667, -84, -413, 995, -914, -438, 1265, -972, -58, 1284, -971, -2, 578, -705, 348, 47, -36, 618, -770, 183, 572, -1248, 596, 787, -1263, 674, 337, -1143, 530, 88, -284, 564, -348, 190, 197, -945, 744, 128, -892, 1100, -168, -909, 868, -388, -366, 697, -475, 183, 243, -735, 600, -184, -658, 968, -432, -398, 940, -743, -1, 660, -746, 349, 204, -718, 579, -225, -463, 776, -587, -61, 645, -792, 207, 317, -786, 625, -44]
2298d4n91J444j162O2J020j381O46N49j304J117k32p55J298r64p2J138j315N21
2316b5P30j443R90K33j165J114l77n26J131j062K65P27j261Q50L04j354J301j93
2334B39j026J372p43k98J081j065M23N58j131R60q0r84J365o73o04J266r74J7
2352b97R26j203O37K93r74J030m11n97J219q65j46J150j251L78P91j360R02Q6
2370C08r32J151n76l84J055j005K16P42j209P50L03j102J088l03o98J238p88j99
2388c45R63j086L88N41j030R11j61p44J144p12l05J109j051J66Q69j200O43L49
2406D49j072R79j98n91R61q58J23P97j173O29M98j240R51Or00J066m34l98R17
2425E12q60K89M76j048Q45Q9r70J172m14o87J158p30j03Q54r28M14K88r57R14
$$ y = [-44, -635, 809, -353, -291, 729, -652, -6, 543, -761, 356, 124, -631, 667, -297, -369, 769, -546, -25, 705, -738, 252, 485, -680, 434, 57, -469, 662, -400, -135, 592, -669, 181, 485, -869, 432, 239, -787, 585, -158, -456, 625, -440, -17, 541, -590, 370, 290, -694, 671, -2, -606, 660, -314, -297, 629, -574, 63, 356, -618, 412, 1, -596, 623, -242, -388, 762, -489, -111, 680, -680, 222, 308, -624, 527, -49, -433, 622, -383, -167, 575, -634, 116, 419, -683, 405, 102, -596, 642, -146, -345, 618, -468, -80, 461, -569, 342, 181, -563, 581, -131, -436, 673, -378, -212, 657, -543, 100, 449, -623, 356, 158, -433, 528, -330, -207, 590, -583, 46, 544, -696, 255, 261, -639, 427, -7, -405, 512, -348, -59, 417, -631, 214, 303, -667, 505, 91, -596, 562, -168, -271, 583, -345, 69, 357, -600, 314]
2444C14j42o71J063o22k95R08r43K71O05j026Q34R1j002J061l55o50J085n34k14
2463b22O47p81L11J51n96R36m47o10J251q74k77J257j007l3R07q97K91P8l53N80
2483C12n23J19O77j183L21R86j343O40P14j320N71L37o23M45j91P3K85p81O97
2502B13M8j044J206lj151J148k95q16J037k33k91M21n46L17p3m07J046n51m64
2521d38J145j023k25J149q97J25Q33q44J34O0m10N83k75K19L95j009L48N46j125
2540g09R20N07j151O47J6p79N90q1J8M28n74L93k19p58J060j49n47J007n78o32
2560e91R24n67q9P59n90L35k2n43N12k37j43Q10o72J4M41r23N48M53q95P69M6
2581C39q94O54K5m29N54k23P3j7m54P14m23m28J274p07p82J282o59n90J098j51
$$ y = [314, 172, -499, 564, -58, -353, 555, -388, -117, 488, -538, 296, 387, -615, 446, 91, -559, 526, -8, -222, 425, -356, -45, 106, -490, 446, -1, -611, 640, -234, -511, 746, -261, -294, 613, -284, 7, 85, -268, 312, -211, -92, 585, -598, -277, 709, -634, 6, 720, -600, -29, 308, -315, 130, -61, 12, 297, -484, 213, 261, -783, 423, 420, -731, 417, 122, -694, 343, 110, -181, 240, -306, 11, -62, -469, 577, 26, -438, 707, -316, -541, 608, -289, -164, 669, -175, -41, 19, -391, 192, -83, 136, 531, -478, -130, 416, -709, 211, 718, -433, 214, 230, -549, 41, -40, -22, 406, -168, 225, 6, -752, 308, 159, -388, 619, 41, -591, 333, -234, -323, 436, -154, 181, 159, -384, 128, -109, -252, 558, -114, -100, 341, -582, -34, 419, -476, 293, 339, -555, 99, 124, -305, 249, 26, 99, 82, -372, 342, -81, -509, 765, 58, -724, 558, -101, -691, 407, 256]
2601B56m80K68q6N2m62M54P80j304K81J126j622K45J366j099j18R99o79m26K42
2620b07M08J4o29R38kj596J202N17j490J076N96j337L49L85m15J1K13N43n56n20
2640e00R62n45p50J494l85r11J151m25p28O51N3jM6j50L77o58j61J007p24k8R06
2661F81r37q3O64o33K08L72l14K37l33l1M10o38M16M65r15N17K15q73P41L2m97
2682b96O23l87j68M80n37L22J82m90M85k02m14O73l47j39O62o29P5M01o28L97
2702F3K39n91N38j87m06N83l85N4M43n72L08J45o52O18n9n17P87l97l70O39m74
2723a93j5M07l43K60j38k42M89l32r1O73o46q2P00p39J19N01n26K46J39l45L11
2744A53l41J22L83o74M29L39r23N35K93o46M68N2m40L53k07Q6J29l73M66l7n43
$$ y = [256, -224, 44, -42, 10, -452, 2, 782, -522, -241, 885, -737, -492, 874, -225, -343, 656, -23, -449, -207, 201, 215, -414, 524, 522, -1074, 128, 645, -845, 231, 827, -510, -161, 224, -191, -180, 33, 576, 20, -500, 462, -83, -833, 661, 276, -635, 516, 91, -637, 14, 67, 66, 112, -38, 339, -319, -480, 527, -197, -225, 681, -256, -339, 325, -308, -100, 272, -42, 195, -138, -169, 241, -397, 19, 484, -431, 86, 301, -572, 169, 201, -296, 327, -60, -228, 252, -285, 37, 219, -271, 214, 12, -402, 271, -76, -215, 447, -182, -107, 294, -334, 63, 302, -289, 249, 62, -344, 239, -146, -92, 351, -221, 87, 232, -420, 198, 139, -378, 409, 12, -358, 281, -193, -208, 199, -144, 116, -22, -264, 225, -107, -198, 475, -171, -253, 447, -292, -173, 328, -198, 48, 187, -158, 153, -188, -66, 317, -357, 72, 411, -512, 23, 316, -330, 138, 190, -250, 103, -104, -18, 111, -262, 204, 167, -376]
2765c76O68j65n15P99l51l14M54k70jJ88l10L56j28l06N71m21j76O82n20o5M76
2786B76n04J67K68l93L73j85k75N50l73PM09n67K46K30n38L45P8m17M63j36k25
2807b01M67m02Q3K87n04L56L5m01M48j11l92N66l17m8M04n02K10K60m56L06pl15
2829b34M35k95p9M20l94J50K47n25L10R3m03M72k01k32M30k67jK49l39K07N3l75
2851b79M17p9k95M30j93k02M67m45R9L09l92K89m2l76N42k21k13M21l38k7L28
2872B00m07J61K42l95K84n7k18L99k30j08L82l58N5K77m44K81P8m16L64j00k01
2893b11M41l31L4K59m01K69R9m03L53q9k10L99k69j20M08k92OK35l80L32Qk97
2915a60L00j97j10L72l36M2L27m21J63J65k98K61k2k00K52j89m8K60l34K17J46
$$ y = [-376, 292, 127, -388, 411, 60, -254, 200, -70, -71, 117, -193, 163, 35, -271, 300, -121, -297, 385, -135, -200, 276, -228, -61, 207, -186, 187, 2, -273, 277, -96, -89, 320, -247, -1, 229, -309, 36, 114, -303, 160, 24, -201, 266, -136, -53, 234, -270, 86, 121, -280, 168, 57, -335, 231, -86, -134, 270, -232, -22, 238, -218, 88, 81, -234, 201, -94, -173, 247, -147, 3, 250, -275, 35, 128, -275, 197, -4, -236, 194, -73, -74, 175, -164, 43, 96, -279, 138, 59, -236, 194, 1, -201, 266, -179, -80, 229, -163, 126, 84, -292, 250, 29, -184, 237, -101, -128, 200, -207, -46, 196, -199, 85, 28, -190, 209, -21, -129, 253, -105, -50, 227, -217, 64, 142, -274, 90, -10, -211, 230, -101, -67, 192, -209, 60, 159, -244, 109, 20, -190, 209, -60, -180, 228, -64, -58, 177, -203, 129, 137, -160, 140, -57, -167, 205, -131, -89, 238, -183, -20, 145, -153, 108, 86, -114, 138, -51, -99, 161, -173, 44, 190]
2936A90m62L21O6l40L82j18k01L60k97L6J67k41K46lk49K34k4k14K89j69j4K18
2958A77l17J08J59l54L51m1k67L48k27o4K20j85P7J24l20K67k6k88M05j81j36
2979a70L89k02j25K45j91rJ78k04J62j45m7L22l28lM13m00K9K95l70J59J59k58
3001a01J74r6K0J13k44K00N3k91K31J07m50L66K8k44K32m2j01J08j71J03L5j88
3023a58K86j36k24M44k76j35M00j82j28K42j76m7J37j1Q1j92M1K51m37J80K86
3044B46l47J07J85l85J12K10j93J49l8JL5k81K18R2l07L01j7k72K88p9k58K77
3066D4k1j9Q2k35J79k3j17L13j84j07J84j16o9K55k11N9Q6k16J70k1j14J95l5
3089G9j73K33j87j6R6q5R6m2j27K85k40n9L09j47j57J93j18p6J12J0R8r6j0J08
$$ y = [190, -272, 49, 115, -225, 157, 39, -162, 198, -99, -63, 104, -137, 109, 106, -143, 91, 67, -147, 142, -27, -41, 177, -140, -32, 127, -227, 124, 83, -184, 164, -63, -127, 93, -92, -15, 109, -211, 56, 30, -258, 147, -34, -170, 219, 17, -108, 137, -54, -63, 115, -89, 73, -72, -119, 203, -125, -128, 285, -115, -86, 209, -161, -2, 157, -101, 73, -23, -3, 110, -134, 66, 119, -172, 59, 166, -284, 82, 110, -134, 98, 56, -45, 63, -108, -5, 30, -158, 128, -8, -232, 212, -64, -199, 201, 19, -109, 133, -43, -90, 47, 36, 117, -75, -34, 217, -220, -40, 246, -101, 6, 191, -194, -82, 128, -65, 84, 46, 47, 82, -199, 19, 111, -196, 105, 88, -184, 104, 25, -233, 44, 23, 4, 86, -149, 30, 7, -110, 203, 19, -88, 96, -20, -89, 166, -45, 14, 100, -116, 54, 33, -81, 114, 79, -94, 139, -48, -64, 32, -53, 43, 1, -126, 159, -81, -140, 169, 22, -135, 58, -60, -136, -24, -14, 84, -12, -22, 86]
3113H6k35O6K89l72J43K35l31O2J65k04J0J26O7l3k37K15K3k99L36R8m55L16L4
3136A05k53P3K21j50K5n4J04j49j16L95j90j82L98j62k59L54j41j81K58q2j2n8
3158e6k2J62j69L3K53k08j29L26l20M0K27j40K4M8j22O1l9J8R7j95J81%k68K45
3182D7lj90K09mk07J36K2p1J51j39P1L9j01L2j4p7K32j68k4J54j61M3J35j71M9
3207a0P1j52J21oj38J97j57M6J11j65J10P7k06K00j10j21J64m9k3J37r6kJ06j56
3231e1M2k3m0J55r6l5J50j44J3J34j92Q3M7q4N7K6n6O5o1J6Q3j62J01O9j54J19
3257F2K9j87J62n1j14J14j9PJ5r2Q1j5o2J63j10j14J54m6j02J42j5l2P6p3O2r0
3283e5M4M9p5L5J00j73Q2L2r3J00J8j33P0L0k8J5r8R7L4j31J26K6j97J32j7r0
$$ y = [86, -149, -83, 206, -166, -23, 212, -119, -57, 108, -96, -86, 40, 107, 74, -163, 52, 75, -224, 112, 210, -245, 71, 105, -148, -75, 146, -4, 21, -33, 71, -78, -194, 201, 11, -171, 227, 65, -194, 160, 19, -162, 96, 14, 2, -56, -78, 84, -85, -52, 201, -7, -136, 190, -130, -90, 137, -3, 21, 69, -53, 8, -31, -13, 84, -111, 70, 70, -198, 47, 44, -146, 63, 59, -148, -12, 10, -61, 90, -49, 22, 61, -40, -8, -22, -99, 133, -35, -59, 95, -66, -23, 112, -59, -10, 61, -91, 30, 24, -114, 83, -74, -28, 83, -82, 28, 105, -101, 99, -11, -132, 32, -17, -40, 97, 1, -1, 105, -51, -9, -32, -72, 83, -13, -48, 102, -42, -29, 105, -87, -4, 43, -41, 16, 42, -14, 51, -10, 6, 89, -73, 28, 97, -57, 62, 91, -96, 66, 15, -99, 15, -4, 3, 18, -74, 7, -8, -70, 93, -17, -131, 23, -23, -125, 17, 2, -30, 46, -27, 35, -55, -11, 38, -37, -2, 98, -75, 7, 39, -54, 46, 64, -69, 1, 31, 3, 18, -80, 17, 51, -80, 46, 72, -125, 7, -10, -100]
3309a00J09l9j1R7n7%N5j11P3m2k6J45j10J9M8l7q6K15j91Q5Or7N0k1J7L6l0o0
3337f3Q1j07R9k3n3J24n7l4L9k3L9Qj04P2N6j38M5L7o6R3o8M3O1r1p1J19p5R2
3365C5l7p6J59j09J3N2n8pO8l5L6m2n7R5J4p2Rj9L3M5j5m0M6n8M1r5k6J83j42
3394e9P4O1j02L4pj24J73n1o8J09m2o6Q9q6%J38j18N4nKm8J06o5J1m3K9P4r6M7
3423B1N3q5N0m0q4J32m6m9P1k7k6L7j9N3o1k1J7J7j00J56r3k8J35n4j8N0o8L4
3451Gj7j9M7j04Q0L3l4j0P4p2K9j6m2P4j4k5N4q3M0O2j02J2N6j04P6Nr3Q1J4L0
3481C9k9m2j2K2o0Q8L4m7K1k1NM3p6M5L0o5J2R4j23N6R4j61P1jp8J00K0pk2p6
3511d6M1Or5J82j38k5J71j55J1M8m5R9j17lR3o9Q1L2n1n6J20j39O2P8j25O1qo5
$$ y = [-100, 9, -30, -41, 56, -1, -1, 54, -57, 16, -26, -52, 93, -17, 2, 50, 13, -73, 142, -49, 36, 42, -55, -5, -26, -9, 27, -3, -63, 18, -89, 10, -13, -66, 58, 1, -33, 6, -17, 22, 30, -74, -2, 54, -84, -39, -2, -68, 25, -43, 0, 61, -30, -101, 18, -57, 35, -2, -78, 81, -28, -15, 37, -21, -28, 40, 5, 41, -1, -58, 37, 51, -21, -12, -31, 2, 47, 32, -8, 38, -20, 21, -74, -100, 83, -59, 15, 76, -26, 8, 1, -123, 50, -1, -69, 40, -2, -68, 21, -65, -65, 73, -45, 9, 4, 6, -42, 64, -1, 10, -33, -4, 70, -26, 21, 74, -11, 39, -1, -85, 47, 1, -48, 23, -4, -30, 7, -12, 41, -20, -41, -24, -7, -107, 49, -44, -72, 63, 9, -9, 41, -27, 7, -10, -29, 18, -86, -6, 27, -7, -17, 57, -15, 14, -2, -44, 30, 16, -9, 45, -38, 2, 64, -38, -26, 30, -74, 2, 7, -86, -5, 9, 39, 10, -32, -44, -22, -82, 6, 40, -7, 14, -7, -2, 41, -35, 10, 40, -25, -13, 81, -42, 14, 108, -53, 18, 17, -61, 39, 59, 52, 30, -46, -5, 1, -94, 88, -50, -75, 96, -59, -48, 0, -45, 54, -63, -66, 27, -42, 39, 71, 20, -36, 84, -55, 7, 85, -40, 21, 13, -52]
3539e2R9r2O4m9n3J33m2q2Q7Oj24J05J0j2M5K2q7P2m1rj0m7Q5j9o5J06r1%P8o7
3569c0LN0l8k2O3K4Jr2j2R1p4L1N2o2N7k1m4N0J0j8L0k5N4k2j30P0Q6j36J27o7
3599Fj1n7P0L4J0o6k9J02j09O7K2j29O6L2l4J8LmL2mlJm9O0k7p0J04K4q4L0k9
3630b4k4K2O6M7q4k7J06j21k8J30k9l4M2l5n4j4K2J37j41L0J13j44J6P2j29O4
3656b1N6j12O7M8k0ln9L4L9l7L4J8j39J36J9o9L3J8p1P7J6n7Jk1L8p8K6O9n9l3
3686e0P0r8O3M8p2P8K1r1M5n8J9J04j12m6J01q7O6J7n7O4J7j14M7J0o2Q4l8N8
3714B7J6r6Q4jl6O1m5n0L4k0m0R3k6K4m3l7J05m3n4N4l2L4J6m9J3Lm5P5J7r4J18
3745F3n4n9J12j05N9K3p1O3m3jn4JL5J21j48P6O1j89J45ol0K5n3n0J07q7K6J09
$$ y = [-52, 47, -45, 19, -30, -83, 50, 8, -74, 13, 19, -105, 0, 10, -2, 43, 65, -22, 50, 9, 0, -10, -57, 28, 9, -56, 50, -41, -41, 37, -30, -27, 23, -15, -37, 26, 50, 51, -41, -53, 38, -36, -5, 47, -15, 42, 21, -23, 27, 37, 19, 49, 24, 78, 56, -74, -4, 82, -54, 73, 6, -5, -62, 8, 42, 52, -14, -43, 59, -50, 17, 39, -90, -24, 8, -26, -8, -5, -9, 23, 19, 16, 17, -32, 28, 1, -69, 35, 59, -25, 5, -24, -48, -26, 40, 87, 3, -24, 82, -39, -67, 63, 34, 0, 42, 7, -47, -61, -39, 98, -43, -13, 100, -44, -28, 44, -85, -21, 35, -77, -10, 38, 18, 15, -44, -10, 29, -8, 26, 44, -95, 41, 60, -9, 24, 42, -29, 48, 64, 7, 8, -13, 25, -53, -27, 42, -17, -50, 20, -78, -15, 33, -39, 39, 60, -31, 14, -44, -25, 79, -33, -79, 22, -65, 1, 18, -39, 25, 42, -72, -25, -15, -77, 7, -31, 27, 43, -53, 31, 30, -6, 55, 10, -40, -6, -26, -66, 27, 1, 25, -18, -55, 50, 7, -47, 7, -25, 9, 25, -24, -11, -8, -53, 22, 39, -55, 63, 9, -50, 62, -43, 16, 39, -32, 31, -12, -13, -67, -66, -31, 90, -58, 18, 79, -110, 35, 29, -1, 24, -29, -79, 28, -59, -33, 76]
3773G6j76J20j5j9M7lq9Q6j3r1J07r8L2L1mK4Qn7N5k8j05J93j17j6J23j11N1l4
3801b3l8J08o1QP1j26PJ32j55J34oj65J37Qk2Mnl7O4j15O3O7n3J0j7j02J62J0
3829F0r5P0m0m7Q2o5M5O4j34R1m1l0O0p7R0m4j7j0P1p8R3l6p9R2k7m6N3k0L8J0
3859C3o5N5k7m6J37qj49J00m4j9O6nq5Q2q2N1j1JN1k8p1J44r7NO2j32K4P3l3L8
3889B0lr5J52j24O3N1j05L8J3p5N8jj0P2r0L8L5r7O1M9q8N0L2j49J49j0l1O0j23
3918f0O7L8m4K8j9p4Q1j8n6J55j49M3P3m9o0J16j07L1N5j31K11j53K9M2j08O1
3944BL7j29J20j0m5K7M2j73J86q5L2K1p9K3R7q7Q3J0j37J04p6NJ13j06L9J5o9
3971d0P0Rj32R9Q4j18P9o9M5Qp9Q7Or2L3K3m9R3l1j08J53j23qR9j4l8K6j01J06
$$ y = [76, -100, 20, 5, -14, 33, 30, -59, 27, 14, -77, 30, -68, -36, -5, -9, 15, 23, -34, 21, -7, -112, 81, -36, -52, 71, -40, 11, -23, -61, 47, -14, -6, 65, -61, -54, 78, -77, 57, 51, -114, 23, 31, 9, 13, 8, -29, 35, -80, -17, 50, -3, 7, -10, -112, 50, 60, -35, 35, -5, -52, 30, -35, 10, 74, -60, 31, -10, -40, 20, -57, 33, -11, -28, -38, 33, -45, 48, 12, -67, 25, -2, -48, 5, -15, 23, 33, -32, 23, -4, -50, 87, 79, -70, 30, -14, -33, 33, 28, -57, 25, -57, -6, -17, -16, 35, 7, -64, 80, -17, -12, 50, -82, -58, 15, -18, 20, 17, -78, 74, -50, 13, 64, -41, -3, 10, -65, -7, -8, -18, 54, -36, 2, 37, -60, 1, 50, -38, 12, 44, -105, 44, 34, 3, 63, -60, 7, 45, 1, 29, 10, -64, 17, -1, -57, 98, -51, -8, 65, 16, -44, 72, -35, -4, 51, -80, 131, -22, 7, 49, -59, 2, 39, -90, 30, 20, -25, 2, 44, -129, 57, -28, 4, 25, -54, -31, 66, -21, 62, 72, -65, 39, -37, -32, 81, -25, 14, 29, -40, 30, 39, -93, 6, 90, -28, 51, -18, 27, 35, -44, 43, 49, -43, -10, 13, -36, 57, 26, -82, 71, -52, -60, 39, 25, -13, 13, -88, 18]
4000A8j4n4J52j58N4P2r5k8R5o2N1j4jj7l5N9Lr8J08l6p0M9P7q8j3O6q1%J4j9
4030f5P3o0P0Lj06J46n6j28J67J5j40J04j7n5J02p5O1k8m5J17j12l3J46j00n2
4055f8J76j01r1R0l5P3m9L3K5q2J9P0j01M2Qo9J28kj27R8k4n6R3q6O5j2p8R6O
4084D1j50K21n9k00J55Jn4J09j09L1J2k0K1l8QJ16l6j16J52j48N6O4l8l1K9r2
4110g5R1%j0N3j29oQ6o7O4O9j03J2O2q8O0m1%J26q5m8Q7j01j4J18l2mj8K3l7j26
4140a33J28P8j19N4L4j05j3J22j14J05o9L8Qo2M1qo0J32k6j62J13N7j61J62j4
4165B6m6j3O6J8j02LJ74j42o4J81j81K1J48k7r4P6m3K9K7k6J0j06N5Q3j21N8N5
4192F5j13O7Pn2M7m0l6N2j2J5M3j45R8j2p9R4R0j88J31p8M2N2l1k8R1r0LJ0K6
$$ y = [18, 4, -50, 102, -56, -2, 70, -25, -53, 42, -20, 31, 17, 16, -1, -36, 23, 26, -72, 36, 0, -70, -21, 56, -32, -45, 21, -60, -60, -46, -65, 8, -52, 18, 21, -85, 61, 5, -123, 44, 59, -81, 23, 6, -49, 53, -22, 39, 11, -34, 83, -29, -62, 84, -16, -68, 108, 7, -84, 6, -29, 44, -5, 28, 53, -29, -10, 60, -41, 1, 9, -60, 68, 66, -61, 37, 13, -43, 50, -36, 29, 17, -61, 35, 41, -109, 112, 53, -147, 8, 9, -45, 64, -45, -14, -2, -22, -1, -39, -31, 85, 49, -67, 85, -63, -7, 57, 19, -12, 17, -75, 16, 16, 6, 59, -70, -76, 10, -57, 7, 76, -27, -15, 47, -41, 19, -22, -22, 104, 19, -29, 58, -43, -57, 61, 29, 25, 7, 30, -7, -133, -5, 73, -46, 8, 42, -63, -76, 46, -68, 37, -32, 6, 14, -48, -7, -15, -75, 57, 31, -131, -18, 39, -122, 40, 26, -20, -33, 33, 51, -51, -48, 126, -16, -80, 101, -80, -59, 89, 62, -32, 44, 1, 30, 57, 31, 41, -65, -10, 73, -48, 10, 65, -48, 19, 26, -26, 21, -19, -55, -3, -15, 0, 43, -102, -4, -16, -95, -1, 89, -99, 32, -46, -4, 48, 17, -11, 80, -10, -7, 3, 29]
4221B9N4o9l3O5l7p9N4l4M5K0M0j4j06j3J64j12j6J16j43L3O9p1L5k2qO9n0j9
4249c3Q4l6LP2j30R1%p8R8l8J5k5nj3P3j16N0P2j71J39l2p2N5nJ6L3Jk2P6j32
4279c0M8k8q8J54J6j32N5M3j08Q5n2lK7o8J30n7l4J12q5o8J45o8K4N1j25J09k7
4306B6l4L7q5PQ0j4r1J51o8m0J1oP0n0m1O0n3n6J70j50O9L3j09J30l3q7P5l9m5
4335h2J22r3L9K2JMj4m7R9n4qM5o6l9J74j29O4L1j08M0ok1Q9l7p7J30j49N0K8
4364Hn6Q7n5o6Q5Lj6L0j3oL5j21N3J52j31M7n1l8R1o1oJ20p9j0on3K2j0P0p6M9
4395bk9Ok7P0j3q1P6M3j12N4N5q0N1jmJ2l0kM7j22J06K2r2O7Mj10O7J7L9j4l5
4426a8Pj5M5J0p1l4J26q0kO4j06K0J14j16N3K3nk5J9n2K7nj6R2j03l9J34r4N9
$$ y = [29, 83, 14, -19, 46, 9, -70, -16, -50, -5, 15, 55, 41, -65, -78, 86, -26, -42, 74, -69, -36, 33, -38, -3, -25, -33, 36, -14, -33, 51, 15, 18, 90, -40, 51, 51, -27, 71, 33, 48, 23, 18, 5, 78, -38, 12, 84, -87, 52, 20, -52, 3, -2, 14, 47, 48, 26, 102, -30, 18, -10, -98, 56, 72, -60, -5, 38, -70, 15, -37, -40, -13, -81, 49, -8, -42, 70, -15, -83, 62, -6, 18, 69, -56, 53, 26, -8, 29, -56, -49, 31, 17, -74, 77, 9, -31, -20, -26, 44, -6, -47, 13, -40, -96, 74, -76, -7, 26, -83, 47, 14, -73, 2, -37, -82, 40, -53, -14, 8, 9, 13, -1, -48, 51, -3, -11, 34, -32, -71, 103, -26, 38, 69, -39, 1, -5, -26, 63, 26, -51, 79, -70, -20, 8, -48, 39, -16, -82, 3, 6, -10, 20, 7, 1, 36, -85, -32, 120, -11, 36, -15, -53, 38, -23, -29, 91, 12, 2, -4, -57, -35, -45, 25, -51, -2, -31, -25, -52, 18, 5, -76, 0, 43, -69, -15, 40, -40, 11, 10, 6, 18, -12, -14, 33, -89, 17, 39, -53, 14, 18, -92, -25, -8, 31, 17, -18, -11, -26, 19, 29, -42, -76, 50, -30, -32, 32, -74, -54, 60, -56, -3, 20, 15, -10, 9, -43, -16, -21, -37, 55, -48, -87, 47, -47, 12]
4455A2qj08J24p3K7M8lj6L3r1J15p4l0Q1k7o6O0kl2N5m7j6J5j4O7K4m4nNk3K8
4486A5p3P0l1l5P6m1k2Q5n5j03J91r7oO0q6R4m3j4N2o7J4M0o7QR2r8N1NpP1n3
4517B6l1N1n8k5R7j31R4L2j30O9O9p8J8Ll6J4l5Q1k7n1J47j33m5J26l7j5K4qp7
4546f6R9J4r3N9m2K8j0o7J68j46L0J39j06k5K2l3N5J1n5J8M3k6L2j03K7N0r9J00
4574B4Nj21J39O5j74J21m9k1K3m9J0J3l8N8l1q6J69m6q3J55l3j27J33k9k5kl3
4601c2P9r3%J07o7n2J21p0k8loML8n1Q2j5l8K4j00N1J14j09K3N6j16L8J6JQ5p2
4631a3l8R1j28J4J48j12Q8Kl6n3NL7Q0j68J52j5r7P8J7q5J4Q5q3J8pQ%o7J00l3
4661Bj32J92m5j46J69k3j09J17n8k9M0J5K4l8o7J35q0K3J29r2q4J44m2j09J15
$$ y = [12, 4, -104, 20, -53, -26, 22, 19, 3, 36, -55, 60, -14, -44, 37, 10, -56, 4, 2, -30, 25, -22, -38, -23, -37, 30, 54, 10, 5, 10, -13, 15, -58, 12, -19, -54, 22, -19, -41, 44, -11, -114, 77, -20, -26, 34, -52, 42, -1, -15, 37, -30, -16, 24, -43, -35, 57, -41, 10, 15, 8, 79, 26, -5, 46, -12, -37, 60, -71, 23, 55, -75, -6, 63, -15, 3, 6, -30, -16, -51, 30, 3, -48, 99, -34, -79, 47, 10, -5, 19, 11, -66, 33, 47, -46, 13, -29, -1, -11, -78, 90, -56, -26, 113, 7, -18, 4, -29, 26, 37, -18, 0, 43, 17, 49, -54, -27, 23, -76, 24, 29, -92, 47, 112, -62, 59, 10, -11, 12, -37, -27, -14, -52, 6, -25, -111, 58, 12, -71, 84, 51, -76, 57, 28, 3, 1, -32, 47, -46, -46, 61, -6, -58, 63, -7, -35, -38, -44, -40, -2, -53, 29, 14, -24, 0, -100, -49, 65, -44, -21, 35, -81, -43, -27, -26, 59, -13, -51, 40, -88, -74, 74, -38, 50, 52, 16, -37, -32, 5, 85, -83, 69, 54, -43, 35, 52, -33, -19, 66, -17, 1, -6, 2, 2, -65, 35, 2, -130, 62, 17, -129, 40, 17, -92, 25, -33, -62, -22, -7, 17, -21, -88, 47, -33, -10, 119, 27, -57, 87, 45, -64, 51]
4686E1m5K4j4L3k4p6P5Q4j31kJ28j83J30O1j41oO9p3O9n5O5k8j06J22J9j59J16
4713CM6j25J09Rp7K0J8j4K1n9O9jlQ0n4q0J13q0m3R4q6Q5m8l2N7k2l9Q4k3p5J25
4744G2j58L3N4n3P6j4l6L9n0mJ06o2l7M6k3J6M1Qn6J4j2j0N7l6O3j57O7J6p6R2
4774A6j5p0J02J1n8Q9n8rJ7j16J02Lj21J88j30o6J74n9RL8o4M9K6r9Q4l2j35K10
4802H6j06q3J65k5n5R8j21M4K5o7N6j8j5N2m1OP1j10O6rn8O4J4l4Pj3J7J0m8K2
4832@J5p3R4J7j04J23r9l9Q4l5N0O6j43M2J5r9R5mp9J80j15j6O2p2k7R3ppP3j40
4862e0L2%mJ15q3K8n1q7N6N6j4M0j9l8P5n3j4N4n6j6K3m3Q9o8l4O7nn6J27q3J9
4893GP6q2M8j3p5J05j18K9Q8n6j7Q8j09K6M8o1N8Oj42J38l3J3k4l7k2J13j24Q0
$$ y = [51, 6, 30, 16, 49, 25, -51, 24, 108, -23, -25, 103, -80, 50, 111, -30, -36, 33, -40, 29, -26, 39, 11, -95, 27, 46, -113, 3, 49, -76, 33, 42, -35, -15, 3, -11, 10, -49, 20, 19, 16, 96, 42, -38, 75, -5, -48, 46, -40, 45, -3, -35, 22, 0, -39, 45, 22, -53, 72, -86, -53, 1, -52, 24, 10, -26, 13, -37, -41, 65, 3, -34, 12, -11, 5, 46, 54, -2, 12, 0, -10, 47, 11, 74, -83, -16, 0, -76, 16, 1, -69, 33, 44, -14, 75, 17, 8, 25, -91, 11, 14, -107, 81, -49, -115, 59, 0, 9, 47, -17, 32, 58, -41, 43, 11, -124, 86, -20, -103, 62, 37, -18, 80, -41, 3, 28, -39, 17, -1, -16, 36, -5, 1, 72, -38, 28, 19, -39, 25, 39, 5, 12, -1, 16, 26, -22, 0, 15, -58, 36, 53, -51, 72, -27, -66, 18, -17, 33, 99, -44, -2, 13, -86, 9, 5, -74, 106, -9, -25, 37, -35, -62, 31, 24, 17, 90, -50, -18, -18, -22, 93, 10, 38, -13, -100, -44, 12, -2, 38, 19, -19, 56, 3, -11, 43, -13, -29, -6, -49, 40, -28, -62, 5, 0, -56, 71, -12, 7, 83, 1, 49, 36, -39, 66, -52, -23, 65, 9, -8, 80, -29, -3, 45, -16, 42, 48, -94, 44, 11, 24, 0, -37, -59, 54, -70, 10]
4921A0po0R3rn8P7o0lM7l8N3m4K3J1j1k3pqpK1j6j3J47j84R5J4j25P4L7j6M1j00
4953d6Q9j4j01O2L9j24J05K8j34R9m5L7M6o0P8n0m7N7J0j09J47r9m9J41l0p8J22
4980G4q6P4l2r5Q6J6l8L5m3pR3l1p6N4m2K7n3qJ41o9n1Q4j21J0J8k3K0M8J5l7
5010a7l4j6J42r4kP8m6%N2o2M6P6j40M3m3kQ5j36R3P7k03R1R1j14L0P1j05J02
5038F3q2J1jr7J37Kj05R7R0j68L7l0K9L1J9K5o3n9P4m8k2J14%p6R7p0q0R7m9m
5068c1J3oP0j1m0N9n2l6O2m8M7L1j16P4K4j03P2J7k3%K5n4omP7Mn8K1j7p0Q1j9
5100a7n4J60n7j7qk4K2Lo0J26m3r8J39j07k3J27j04J0N9p8R3r5o9K22q8j13J90
5127I6r7n7R8j25R0J2l0L4l2k5R6q1kO7q1O4o9k3P9ro6P9l0mM8q0J2J24j05K5
$$ y = [10, 3, -57, 36, 27, -31, 46, -14, -17, 30, -8, 45, 1, 24, 35, 24, 1, -6, -14, -21, 0, -16, -29, 118, -66, 29, 43, -82, -8, 29, 13, 54, -46, 43, 29, -72, -10, 29, -95, 10, 38, -96, 3, -42, -5, 41, -19, 59, 9, -38, 19, 29, -80, 67, -32, -81, 60, 30, -48, 74, -12, 62, 30, -65, 21, 37, -1, 34, -9, -16, 77, 46, -30, 24, -18, 9, -44, -52, 89, 20, -31, 53, -68, -58, -40, -63, -43, 5, 20, -17, -51, -67, 75, -19, -21, 57, 11, 11, 63, 1, 47, 123, -17, 26, -17, -19, 66, -70, 23, 100, -103, -12, 79, -35, -5, 66, -39, 63, -19, -8, -9, -106, 31, 33, -72, 25, 115, -53, -16, -46, -17, 14, 33, 58, -5, -64, 10, -38, -60, 54, 54, -22, 75, 5, -75, 22, -27, -31, -18, -24, 46, 35, -5, 54, 2, -34, 28, -20, 27, 58, -58, 16, 40, -63, 9, 26, 3, 3, 28, -26, -32, -36, 41, 45, -13, 8, -9, -79, 2, -17, -71, 89, 32, 15, 7, -17, 5, 8, -52, 74, 31, -67, 72, -35, -58, 69, -35, -25, 34, -44, 49, -46, -115, 107, 19, -94, 96, -1, -58, 40, -85, 5, 17, -13, 21, -11, -36, 60, -21, -23, 44, -37, 27, -42, -65, 14, 5, -61, 18, -12, -16, 32, -48, -36, 88, -17, 8]
5157HN8j30O8K9k3Jo4Q6rj25J49J2j15J00M0j69N1O3n1j3j7J03o0k4J00p3j04
5184a09K33j26q4J50lp4L7K0m4K0k1N8j16M6J84j61o7J27j32J9J20j29K9O4m9
5209hp6M7N0K1q3L9J11k03L8J05j02N0J07j43P4m5J4J6p0O8J6r2O1J5l2Q7Jk3
5237D3J5j25O9L2m8RJ5o4Q1J8j10P3k8kQ3j32R7l0o9J27o2l2O6L0j47J19l8O7
5265E7k6m4k6P4j06R1Pq0Q6m6K7%p7L8Q2j12OJ61j01M7l6m0L6k1qQ9j49K7N6q2
5295g0L1J5l5M4L1l7J3q9N5njQ8k8q0J38o4k4Q0p9k4P5p9J0J5l5P1l7p6J39o0
5325a8K7K2l4l3M0n3J9L2J8M8j17L8P3n2n4J09j46P1M5j36Q2L0o6Q4q1Q2K2r6
5353d4R6k2p3K8N5p1O1l4l1O7m4j1R2j24O1N5j47J37j4k3L1p8N9N0j29R3mr7L9
$$ y = [8, 66, -64, 4, 33, 10, 11, -53, 33, 24, -101, 48, 60, -55, 45, 85, -84, -33, 30, -21, -34, -51, 52, -8, -32, 68, -5, -109, 124, -2, -86, 64, 61, -13, 24, 44, 0, 20, -1, 57, -59, -13, 171, 10, -57, 70, -62, -43, 77, -52, -23, 41, -8, -84, -37, 13, 34, -49, -10, 101, -102, -64, 41, -61, -11, 96, -47, 27, -18, -4, 12, -58, 10, 26, -66, -5, 10, -22, 65, 66, 43, 58, -67, 2, 34, -14, -5, 10, -54, 27, 45, -65, 8, -20, -22, 61, -71, 26, -4, -73, 54, -8, -40, 26, 56, -91, 28, -10, 57, 31, -13, -39, 35, -71, 20, 27, -53, 33, -13, 14, 14, -63, -25, 57, -55, -49, 112, 11, 58, 22, -18, 18, -3, -11, 78, -71, -44, 12, -70, -39, -24, -59, -15, 16, -21, -8, -97, -42, -47, -48, 40, 12, -68, 70, 6, -18, 62, -17, -41, 34, -45, -35, -20, -55, 16, -21, -97, 42, -18, 9, 31, -3, -36, 4, -49, -30, 2, 20, 68, -49, -11, 62, 10, -44, 65, -81, -10, 35, -101, -19, 11, -55, 29, -52, 30, 52, -44, 52, 30, -43, -15, 40, -31, 30, -4, -35, 32, -12, -23, 69, -55, 6, 61, -86, 51, 37, 14, 45, -33, 26, 76, -53, 40, 36, -61, -22]
5382b2Pl8O4Jm2lL4m8O1q1J16l1n4N9k8n2J32j7q2Q6l0k3M1q5P7l8q7Q7m3J8M7
5413B6J6j0m1n2N4M6om1k8l5Q8r3L1P7j12O7M6o7M5M6r4P0lq0J01m8J8on0N8l0
5444gn5J67j23o0Q2Q0j25Q4l1M6o0n3J04m2k2K3j04L1J10o4l4J60j33LM0p1R9
5471D5j03P2N1p5j9Q8j15Q1M6j26R7l6m2P9l5l0Q8o9K9j5p5N7N3j61J67k7nn4
5499c4KOJ16j39N9K0n2O0j8j04J50n2p0P0l5L1N2n0J3j8j09J67m3n1L4J4J0J7
5527D6j9k2k0q1J12n5J6O3q7L4R9r3n7J51j05O0n5q4J05oJ7lm6k4J34j91J38J9
5555D6l7m1L3l1K1Nj3P6j05P4J2j18J16J0j12J36j5q1N9r8M5Q4j03K1L3j4L1p
5583B7q1J28l2q4O6j2J1N0p5Lm9N6J2q1K8O7j05Q9K2j37N7J25p9l8N4m7P1o5N9
$$ y = [-22, -15, -53, 11, 12, -30, -33, 1, -47, 14, -67, 49, 18, -36, 23, -5, -57, 75, 58, -24, 62, 32, 9, 50, -35, 42, 4, -83, 4, -39, -21, 26, 42, 32, -9, -61, -7, 39, 33, -8, -36, -71, 17, -76, -45, 32, -80, -13, 33, -34, 11, 57, -37, 33, 30, -50, 51, 3, 21, 15, -35, 23, -7, -62, 105, -18, -78, 4, 84, -41, 43, 12, 58, -2, -55, 49, 7, -15, 8, -96, -65, 45, -19, -53, 107, -26, -23, 17, -54, 45, -58, 14, 65, -10, -29, 59, -56, 25, 71, -55, 42, 6, -36, 43, 8, -22, 66, -3, 26, 11, -64, -7, 46, -115, 52, 25, 20, -34, -32, -26, 90, -49, 10, 30, -22, 38, 20, -84, 66, 14, -56, 14, -21, 10, 62, 12, 25, 7, -102, 65, 22, -29, 5, 19, 29, 46, 27, 5, -15, -96, 16, -39, -23, 40, -47, -13, 86, -7, -64, 87, -18, 42, -13, -97, 8, 2, 19, 16, -30, -54, 80, -111, 27, 46, 9, -32, 1, -30, -9, -4, -17, 59, -46, 28, 40, -78, 38, 48, -64, 72, 57, -24, 35, -63, -18, 66, -37, -16, 17, 3, 34, 27, -54, 74, 42, -42, 24, 12, 23, 73, -2, 1, -48, 8, 20, -61, -33, 34, -71, 18, 40, -97, -40, 85, 6, -32, 22, -25, 46, -19, 40]
5612D0n4n0J07P3j75P6j0q8J58n1n7R5r4j1j3j3J43r5o3J03j9q2J14L4j13M4m0
5639d1K2k1j2R0n8j6R8k3j24J06k7q1J48p4O1n6n8J22q7QJ37j32%Q3q3K3L4k6
5667A3rk4j2P4l9k5P6n2j3N2j39J04K7m4No4M5J6j8K2M9q9R0Q8j87M2J03j65J00
5696B6K8p1M2j2K2mr8J73p5j50J64N1j86J29K8j21P5l9K2N6q6O1nj09J39q9k7
5723e6J10j8m9P0p3J9lj1L8p6M7Qo5J2J00j53J54M9j58N7j3L5L0k3j6M9j21L9
5751a8N1j08Q2L4j37J00Lo6R5m1K5n5lL4L2j26J08K4o9R7p7K9mJ8k3nm7J20m3
5780C0m5P0n1L0M4j38M8O3l6lJp7Q2o7J9P6p6J6J05j28QJ18j13j4J8rO7k6k3M9
5810C8q5K8R9q8p4Q3k2P3n2l5N6r0P0N3j51Q9N6j06Q8K4j08J08J1r6L9k9K2J7
$$ y = [40, -14, -64, 43, 116, -59, 17, 7, -81, 77, 26, -31, 64, -30, -41, -54, -67, 76, -19, -82, 21, 2, -80, 34, 68, -45, -1, -41, -19, -40, -52, 38, -20, -36, 62, 39, -85, 21, -6, -87, 61, -13, 48, -8, -66, 56, -31, -23, 114, -18, -18, 65, -18, 5, 39, 13, 4, -20, -32, 42, 3, -22, 54, 2, -11, 41, -98, 6, 33, -11, -6, -70, -25, -9, -27, -5, 44, -45, 45, 133, -54, -12, 91, -74, 26, 54, -17, 25, 13, 35, 31, -67, 106, 31, -119, 45, 96, -90, 39, 67, -54, 21, -18, 4, 60, -26, 35, 30, -79, 60, -29, -56, 54, 36, -13, 57, -16, 3, 0, -11, 27, -49, -2, 6, -59, -47, 53, -100, 54, 103, -55, 2, -11, 24, 54, 31, 15, 64, -57, -18, 33, -75, 7, 41, -96, 4, 7, -59, 36, -5, 20, -35, -38, -4, 28, -98, 10, 34, -35, 62, -15, 14, 10, 28, 5, 0, -47, 73, 30, -15, 55, 4, 34, 78, -60, -12, 51, 15, 12, 13, -64, 18, -49, -30, 46, -30, -14, 91, -37, -29, 89, -24, -38, -20, -29, 38, 12, -11, 38, -47, -19, 80, -8, -82, 1, -21, 52, 0, -35, 21, -69, 1, 54, -97, -8, 48, -58, 30, 54, -54, 54, 65, -31, 8, -21, 1, 18]
5838A8o3O1Rj13J35n1n9J13m6KL1m2MPo0O4j6p0R3k7l4Q7n6kQ5j12N9K7p6Q3n1
5869@k2Q3p4k1J02q1J6N4o5K1l8m3R2q6M1J25j21J1M1q0P8J2r5J06q4m2J06l7
5897ak3O1o5N0J4j22J27J0j03N8J5m9P0p6N2L4m4K8N0j36J00l7k5O2j13N8O0j40
5925h5J09K1r1J16l3q4Q7k9j13J29jq3J05j10Q3J7p3R0o4j1N0o4rJ07r0P0Lo3
5953a6lQ3r2Q4m4j7P9j18J04m7j08R8Q1j91J29Jr4J43j29jR4j11J14Km7M1n6p5
5981i6J58j16J7J09r0j2O2l9N4q5j2P3r0L3M4o0L6R1q1o1J77j90PJ49o8M8r6L0
6009hQ0j26N7O7o5j0P7j19J04l0j31J17j2j4O1p8R4n0r5R3L5p5O5n3J7J5n1R2
6037E7l6n6J03n5q3O4J6j05J37l9L0Nk2j8j4m2R3o3K4O3p9L1O5q7m0J0K4L7K1
$$ y = [18, -45, 16, 25, -88, 47, -4, -63, 50, 4, 6, 37, -5, -1, 6, -54, 10, -6, -76, 17, -10, -44, 43, -13, -15, 70, -42, 17, 44, -32, 51, 0, -22, 61, -13, -34, 68, -13, 3, 57, -8, 13, -25, -68, 24, -62, -21, 104, -17, -6, 35, -45, 33, 45, -50, 56, -28, -70, 36, -1, -24, 37, -28, 22, 36, -86, 41, 51, -52, 6, 21, -28, 42, -34, 18, 52, 8, 36, 86, -50, 50, 13, -12, 50, -63, -5, 55, -85, 24, 45, -46, 70, 37, -47, 40, 11, -102, 27, 26, -57, 48, -62, 21, 38, -35, 55, -9, -20, 30, -34, -43, 64, -26, 44, 47, -16, -19, 64, -28, 56, 12, -5, 74, -44, 60, 13, -95, 3, 84, -107, 22, 23, -71, 72, -57, -58, 36, -75, 39, 41, -6, 35, -21, -96, 62, -54, -37, 72, -18, -30, 32, -7, 47, -38, -50, 23, -67, -34, 10, -50, -14, 77, -4, -65, 112, -78, -71, 78, 10, 58, -38, -8, 72, -54, 3, 70, 5, -5, 72, -47, 57, 27, -104, 13, 1, -13, 48, -30, 64, 14, -81, 12, 47, -28, 37, -16, 1, 16, -35, 57, 21, -35, 68, 13, -70, -6, 10, -95, 42, 3, 33, 38, 16, -2, -16, -58, 35, -28, -4, 59, -20, 11, 76, -11, -51, -41, -17, 20, 41]
6066D1Km1Jj3K4o1O1N6j38K3O0j07L6M5m9J1L3L8J5r8P4J16k08J12L8r6N9L6o5
6095EM7o2m6N7n9P7l3l2M4J8j17J46p9l1J62j51O8j2lN5o4m9Q0Ln1R0p5p2J97
6124A13j17l7Q9r7KJ3j8Q4r9P8Q8k15J37L1q8J8N8q9%J2kR0p0L6N8q8j4R4j15
6153d8P7Q1j63J12j23J17j2j09J07J0j39R6Oq9J09L2q3N4j01L5n0K8J15m9j06
6178i3J79j12r0J57n3j9M2k4Nk5N6QJ1n7J02j82K9J78j29oJ25o1j05P9l3K3k4
6205a9K2N9j33R3j1p1M0J15j17k6R2q7M0K3nkn5O2lr8Q7Mo3J34r3lM7J0l7J3n2
6236c4L2j9n1J26o5NN2n6m9J16k6p5J07j03L4oj9O5m0l5R4l4q4Q7q6j7J21m4J3
6265IJ6n2M3k6PM7r4M8L9q6Q1l8o4Q8k1k2L4k9pO2j3k7M9j07J08l7p7J17%J0n0
$$ y = [41, 43, 2, 3, -10, 14, -47, 14, 70, -68, -45, 15, -92, -56, -11, -60, -49, -16, 22, 37, -61, 13, 129, -79, 33, 71, -25, 34, 70, 5, 52, -10, -56, 1, -58, 19, -14, -46, -2, 16, -101, 45, -34, -65, 97, -54, 14, 2, -1, 54, -10, -59, 21, 24, -27, 63, -12, -84, 113, -4, -41, 48, -49, -47, -34, -52, 32, -67, 11, 99, -116, 21, 52, -36, -18, 40, -49, -49, -37, -39, 51, -19, 17, 75, -13, -27, 67, -48, 29, 110, -53, 59, -64, 53, 41, -68, 39, 49, -90, 6, 12, -77, 32, 64, -19, 35, -66, -31, -81, -53, 62, 13, -93, 86, -26, -116, 41, -12, -31, 11, -13, -8, -33, 23, 31, 42, -15, 87, -95, -66, 112, -17, -23, 102, 41, -64, 15, -18, 5, -19, 3, 62, -71, 22, 11, -60, -20, 95, -22, -48, 44, -43, -3, 20, 15, 13, -42, 20, 17, -81, 6, 10, -53, 81, -12, -15, 32, 42, 5, 18, -34, -2, -21, -72, 54, -11, -6, 46, -10, -59, 57, 31, -44, 63, -40, -6, -12, -31, 34, -6, -41, 53, 19, -65, 22, -64, -81, 40, -4, 9, 25, -27, 16, -10, -3, 44, -50, -2, 37, -49, 32, -6, -70, 18, -3, -25, 9, -20, -27, 35, 22, -5, 44, -63, 45, 8, -69, 48, 48, 58, 8]
6296Ho2J04J3j05J40j02j30J70o4j9Q8o0J5M2p0N7n5O3l7J2o4N9j0k8P6q2N3J2
6324B4J5l7l2k0Q9m1jQ7j24L3J01j44P2kLo1L6m9N9J2l6K0KK0N1k26J88Or9Q5
6354C1j7l5P3r9N4N3k3Km5n9O2j6l4P6k8m1N1L2k6K7j9N3p5q1R4n0k0J01qm2M6
6385C7j0j04J00n0M5m4k0J8L5m7J17j40M0K1m7nO3m1K4Qj6N3m5o0J17l8L8m5n1
6414d7N2J6k0P6n0J1L4j61P5O2r6Q1nl5K6Mj9pM7q7N9k9RN0j22P6J4m4M3j7PK3
6446B6l2J5Ql9L2M2r8J06Jn6N1p8pJ35j74R0J1n0M6L4j06Q7q6m6J98j21K3K9j02
6475f1K8N1p9Q5m6K6M6r5Q0Mj56J58K6j28J06Kr5Q0j5nN2l5m5L6p6J17r9K9Q1
6504G2j05m7J20p1K6L1m2O1l5p2R4k8k1P4q0J8K2o7K0N5k7o0O0l3J8l7M9N0j33
$$ y = [8, -54, 50, 63, -42, 98, -4, -134, 36, -28, -47, 41, -19, -4, 38, -32, 25, -30, 33, -4, 8, -56, 3, -7, -35, 41, -41, 12, 24, 39, 2, -30, -50, 39, -2, -3, 84, -40, -7, 94, -50, 22, 20, 23, -38, -2, -51, 8, 20, -16, 4, 6, 26, 77, -149, 39, 45, -54, 31, 14, -21, 52, -47, 7, 60, 37, 39, -6, -65, -3, -19, -53, 23, -5, -46, 5, 37, 11, 38, 19, 72, -3, -84, 10, -40, -60, 41, 33, -9, 37, 27, -77, 23, -27, 18, -26, -46, -28, 7, -40, 77, -63, -23, -2, -49, -54, 9, -32, -8, 0, -16, 37, -8, -68, 49, 11, 49, 4, -47, 5, 21, 1, 77, 27, 38, 72, -89, -14, 48, -48, 33, 28, -7, 19, 23, 4, -3, 44, -43, 16, -13, -4, 46, -76, 0, 14, -30, 13, -4, 3, 26, -6, 9, 17, -22, 10, 52, -46, 60, 61, 5, 56, -22, -29, 106, -68, 22, 33, -17, 29, 63, -43, 44, -42, -88, 110, -11, 12, 41, -61, -33, 18, -61, 24, -22, 4, 50, -45, 35, 39, -117, 41, 67, -61, 45, 47, -48, 32, 17, 12, 64, 29, -16, 20, -56, 61, -38, -9, 72, -33, -80, 40, -31, -5, 26, -16, 45, 10, -62, 32, 4, -17, 57, -23, -5, 17, -50, -30, 25, -2, -62, -2, -35, -17, -54, -5, 45, -88]
6533h8J01Pn3l8R1m6N4njM3r7O9K8j01L6O0j26N2J2n7L7j5J2K0pM1l9m6J14jj91
6564a34J18K7n4K0J04r5M5l7l6MjJ54j30m5J06l3l6O6q5O4L6l5k9pj1R3j02N8
6592B5%o7M9K5o5J4Q8q0J0J7j0j3JK4J6j00O3ko0R0M5r7J2j8j7M3K2j7L1q5R7
6623D1m5n0R9rq5R1kr6M8nRJ1l1J7PMRj5n2J52j36K2j6J5nQ1p4O2l7j8M9j38M7
6656e0J48j29K4N1o1J6N2Jkn9L9m0l0m7J43o2O7R2k63J37J1l9K7m1j7M9q1J05
6684D1mj02J52q5r0P2Pl2PL1J7Jq0Q6r6j3J36j3o3J15j46L3L7N6p2j6l4Rj3K3
6714c6J30j18L1J07j43l1J05p9K0J8Mj0p9P9Q8j38Q2mj10L0J37j45J07J2j16J2
6740d7MO7L3j05P5op0Q4l8p8R1Rj1j3qK1P3j08N3J5p6Q4l6l7PPK3O6q8j7N8p4
$$ y = [-88, 13, 20, -33, -71, 20, -26, 28, 23, 22, 65, -32, 37, 65, -36, 0, 60, -66, -14, -2, -59, -22, -37, -25, -5, -12, 29, -10, -56, 58, 57, -134, -16, 11, -43, -23, 81, -14, 31, -6, -42, -38, -39, 115, -15, -60, 46, 13, -23, 43, -42, 22, 58, 23, -6, -13, -24, 69, -33, 25, 25, -42, 7, 32, -33, -19, 69, -11, -1, 16, 6, -7, -6, 18, 34, -66, -3, -5, -65, 25, 70, -27, -15, -33, -50, -7, 15, -2, 29, -56, 41, -4, -54, 45, 36, -49, 42, 40, -56, -8, -13, -4, 7, -24, -7, 0, 4, 13, -2, -54, 98, -38, -16, -32, -17, -22, 59, -15, 47, 10, -8, 41, -97, -50, 98, -31, -7, 44, -17, -1, 51, 52, 50, -9, 30, -10, -40, -87, 56, -6, 61, 153, -110, 27, 38, -1, 26, -15, -32, 17, -64, 41, 37, -65, 87, 2, -88, -16, -9, -41, -34, -3, 14, 15, -65, 21, -75, -88, 48, 35, -28, 87, -59, -26, 11, 67, -5, -21, -55, -46, -59, -36, 94, -24, 7, 114, -29, -60, 45, -34, -14, 4, 8, -2, -81, -2, 86, -52, 30, 26, -84, -54, 83, -62, 45, 57, -59, -47, -43, 24, 57, -48, 27, 21, -49, 35, -3, -81, 10, 19, 8, -5, -13, 8, 81, -27, 26, 41, -35, 49, 13, -24, -17, -10, 13, 79, -9, -26, 32, -42]
6772d2L8j7n6N6k6L9M7m0mQ4j23N0Kk8M8o3J1P2o9J2M8n3M6L6j30R6qo7N7Lj2
6803GN4m4oj4n4M0L6k7N7k4q4P1l2pO4n6mj2K9k8Q4j21R2k5k2J6RMj1J8Ml1rL7
6837A1lo1R4o6l6P0p7N6J3qm3L5m3J14l8q9R5n4K2K9j41Q3O0n3nK6M0j8J7l2J5
6868A3KJ1op8L1J9%N2m9PM0j0m8M3q3M6N5j27J08Lp0K6l7O1Qo6J13j15j2M2L4
6899A3j4K5jjRp2L0K7l2J0K7m2J3pn0OL8k9Q7n8J0N3n0P2k7n5J8l9M7J4nk0n7
6932f0%Q3k7o4R4r5N3L5p3K0N9k9J9l3M0k7kjM2k7k7L4k8N2o1mM7l5l3J3M3K2
6964C0K7rm1RL4l9m3J4J30j38j5P3j05N0M1n3L2O3o8J1rL1%p6K2N3q3J1N3q0Q9
6995A4M3p4N1r0NN5K9m8M1n8O4j8o4J05l6MPqo4Q3n9K2K0n2P1jj36J19j7n0Q4
$$ y = [-42, -4, -21, -77, -21, -47, -8, 39, -1, -5, 79, -44, 6, 8, -20, 28, -35, -24, 48, -21, -9, 39, -14, 32, 68, -62, 34, 26, -41, 16, 19, 7, 61, 17, 11, -3, -57, -17, 19, -8, 49, 25, -59, 12, -20, -27, 37, -19, -23, -35, -6, -34, 50, -71, 21, -4, -26, -10, -1, 3, -8, 10, 14, -17, -26, 11, 8, -53, 41, -25, -61, 9, -68, -12, 1, -7, -50, -15, -58, 56, 18, -71, 24, -30, -8, 21, -120, -37, 23, -30, -35, -9, 31, 13, 30, -2, 13, 15, 26, 20, -58, -27, -8, -8, 44, -5, 2, 42, 32, -16, 27, -56, -10, 45, -82, 26, 29, -41, -15, -52, 9, 17, -49, 64, -51, -63, -21, 13, -1, 24, 23, 22, 31, -41, -11, 16, -16, -6, 21, -21, -8, -15, -65, -59, -21, -50, 37, -21, -11, 42, -8, 64, 37, -18, 0, -39, 8, 22, 17, -3, -60, -60, 23, -4, -68, 26, -69, -16, 19, -54, -34, 25, -4, 15, -18, 22, -5, -7, -8, 34, 7, -20, 14, -14, 38, -23, -27, 20, -15, -48, -35, 8, 30, 57, 48, 7, 16, 50, 11, -32, -18, 112, -26, -41, 32, -73, -23, 18, -35, -3, 60, -8, 3, -6, 25, 25, -51, -29, 24, -59, -48, 5, -75, 14, 57, -17, 34, -56, -51, 4, 33, -15, 26, -32, 32, 14, -50, 55, 19, 23, 30, 22, -42, 41, -18, 4, 24, -28, 43, 42, -94, 25, 8, -42, 42]
7026D2k3j8P3j17O7L9r2P7k1r4J12o3k2N4n9L7M1j25L3M0j7Q9r8J5L6J4j6j0m6
7055e2K3QPJ6j8j0J8m4Q7m1jNK4o6M7oj22N1J19k7Nm4M3K3l0K5l3k5K8m4l4R0
7087B2l9N1p6MjL0l5P6j7%J7J9l6L5k6j00J19r0L6j7L5J2l3J1L1m4%P1m5l6O4
7118C8p1%O4m1O5r8K2J0j5K1P4j04lP7p7L3Mo3J19k3k1M6n6N1q0j9J48q5o2J04
7148E8j03l0J07J0p4N0rk7K9jN1o3j4J14j49J6P8k9k6L2m2K4l1oN4L4j8K5r5j
7178c6P4j27J00O9j01J6j2%lK8nM8m4%L7r3J9L3lRJ1OJ9o6L9J8j05P4j9l5J09
7209F0m8k0O1m0jj5J5MJ0knk1n5N8j5l8O5j2J4k5oJ2k6M8j0o1pQ8m9L5j1M6o9
7242b0k1O2l6J5mK5n4M5O4j38P6L3p8O5m5K6nn9M7QM5m2R8j20K8J3l4O2k7p5P8
$$ y = [42, 19, 1, 74, -43, 24, 63, -29, 48, 27, -67, 45, -18, -40, 14, -45, -8, 33, -92, -59, -19, -36, 53, -45, -30, 6, 20, 4, -6, -52, -29, -21, -14, 2, -16, -26, -8, -52, 35, -6, -7, -2, 22, -44, 3, -3, -125, -74, 45, 18, 23, -21, 22, 45, 15, 40, 7, -18, 10, -34, -68, 22, -17, 34, -42, -38, -39, -9, -44, 32, 15, 15, 32, 51, 15, 50, 24, -76, 43, -47, -11, -28, 7, 19, -14, -3, 28, -16, -16, 55, 10, -26, 38, -33, -33, 31, -10, 55, -43, -21, -11, -26, -5, 69, -35, -38, 39, -38, -5, -1, -64, 55, 32, 11, 57, 1, 52, -28, -47, 101, 16, -46, 58, -45, -75, 32, 42, -32, 18, 9, -18, 11, 10, 61, -2, -16, 98, -51, -35, 43, 14, -12, 20, -22, 2, -29, -35, 19, 53, 35, 60, -35, -36, 38, -89, 11, 80, -21, -5, -17, -17, -20, 8, 3, 51, 7, 7, 44, -49, -30, 3, 0, 9, 20, 26, 45, -21, 18, 36, -69, 5, -14, -49, 60, 12, -8, 53, 13, 12, -3, 12, 16, 26, 24, 19, -2, -57, 1, -14, -52, 13, 1, 15, -10, -16, -4, -30, 18, 8, -53, -60, 28, -21, 14, 3, 49, -20, -41, 21, -15, 0, -4, 21, -33, 12, 76, -62, 14, 47, -31, 34, -11, 15, 10, -49, -2, 6, 51, 9, 107, -13, 15, 28, -6, 56, 29, -46, 32]
7273C2m1l9L8L9Pp8J5J8oj7O4m2l9O2L3j5L1n0l3J8j6N0q4jQ3j2k8L6n3P0Qm1
7305ILn2NO0l3J6J4Ql7M9j3L0k2q8P9lk3%P8p1k1k7J7J4j8O0m9rM0J8n5O3m6J3
7339Il7J7l4N9p5N8oK3j3K8n4PJ0J3Jrk2M3p5L8K7L0j7LNj07Q5k0m8J7M7L5m2
7372dml9J06l1k7rM7k7L1O0j13J0l6M5l5j8J5R9m6p2M1j7K9k4j1K1N1n2J6k5J0
7403iQj28J64Nj3l8P5q5MM0qk3l2kN8J9m3O4q5Q3m0o2M7J8N2r6L9k8N3n7L8Rj1
7436A6n3%N4m3M6l3M9q2P4%o6Q5m1l9N5J4J4n1m6K6L0j1nk7M5Nm3O0L3q1M6rn5
7469c3N8K6p7Q1r1M5ml8KMK1k3L2j6P7q2L6N2p1k4P4q1K9K0l4M2j00P7J5OLJ4
7501D0j05Q2kl0J6l0L8K4k2nKmj4L8m3J8P6r9J6Np4J07pL8l5o7Q8m1j0M3km6L2
$$ y = [32, -9, -48, -10, 29, 36, -42, -27, -9, -15, -32, 32, -10, -49, 13, 46, 31, 62, 12, -21, -3, -19, 31, -53, -54, 29, 17, -11, 25, -28, 42, 50, 9, 12, -40, -35, 25, -8, 8, 22, 30, -7, 42, 29, 59, 37, -51, 28, 25, 2, 2, 80, 9, -12, -39, -22, -8, -26, 34, -15, -24, 16, 34, -21, 42, -4, 9, -28, -11, -45, 14, -61, -3, -9, 14, 1, 29, -25, -18, -8, 5, 6, -3, -25, 18, -57, -19, 8, 38, 21, 24, 29, -78, 7, -13, -61, -44, 3, 38, -4, -8, -47, 59, 28, 1, -8, 39, 12, 43, 103, -10, 0, -36, 9, -26, -44, -29, 70, 24, -48, -7, -24, 5, -19, -30, -9, 42, -10, 6, -19, -9, -1, -129, 35, 40, 27, -11, 64, -21, -17, 23, 15, -8, -40, -42, 16, 35, -8, 56, -29, 54, 14, -48, -1, 17, 69, -27, 12, -16, 37, -20, 18, 27, 16, -37, -37, 17, -26, 20, -13, 36, -46, 28, 28, -38, 47, 6, -33, 22, 36, 50, -1, -47, -21, 9, -2, -7, -34, 11, 16, -27, 33, 66, -15, 31, 22, -33, 25, 51, -26, 55, -36, 9, 5, -33, -31, -27, -6, -29, 3, -13, 64, -18, 18, 70, -1, -25, 49, -32, -3, 17, -17, 25, -75, 2, 17, 23, 26, 40, -65, 17, 15, -15, 1, -29, 9, 33, 11, 6, 8, 4, -10, 28, -15, 3, 79, -20, -4, 1, -73, 34, 27, 65, 30, -37, 51, 10, 0, 43, 41, -5, 27]
7534B7m2KL4l1J4l0j4O2j0n2M9k4k4L6j8K9j2J0J9k5K6r8nK6M4Rj3J9k7PM3j5
7566A6j6R3j04J1N2p6K8J2j4K4m7K0n0K3mO7n6M0J0q3P1k0j8K5j9J05q9n3KR0
7596D0m4n8K9Q3%m6K8l8K3Mk0L4l7k4K8j3K9pk0o5N8Km8J32l3l5m9K3L5L1q1k
7628d1J01n7K6l5N6k0km3N3l8k3R2n6Qk0k9N1j4JK5l9L7k8p9J18PJ9n3l5oM4n
7660A5l4j6K9L9k6o8Q2k1j7J0QkM3r4R1m6k9J10j02K7Jj1k0L1K0K3j6j4m6N3R
7691B9k3n3mQ6r6J8L0%j8LJ8k7k5K2M4j4K0j5M3l1L9l3k2K6k2l2P6oj2j5j8N9
7723D7p2M7l7pM7Pj1k6L5m3n8Q3N1j08j2L1j5N5rJ1k9N0o4j2K7L3K2l5j4J3k6
7754a9L7k8Mj0P0q3M5J5Mk4LJ5rl6L3qm2N6m5K7L3k2j5M2Oq3J01j00k9K9PpP7
$$ y = [27, -15, -13, 21, -10, 4, -26, -40, 22, 12, -40, 9, -15, -39, -3, -21, 8, -4, 6, 25, 0, 26, -72, -77, -51, -7, 2, -11, 8, -19, -12, 31, 16, 0, 93, -11, 0, 52, -24, 4, 16, 2, 26, -21, -1, -51, -28, -32, 35, -21, 19, 29, -54, 17, -3, -21, 4, -15, 90, 1, -52, -50, 40, -4, -62, -33, 50, 50, 4, 32, -6, 17, 21, 1, 35, -2, -26, 2, -11, 18, 11, -9, -74, -16, -14, -62, 70, 37, 2, -47, -24, 11, 42, -39, -41, 60, 3, 29, -6, 50, 30, 28, -15, 38, 0, -23, 69, 13, 21, 1, -28, 23, 9, 10, 35, -4, 33, 5, -74, 44, 51, 70, 17, -18, -24, 20, 15, -19, -35, -6, 33, 7, -61, 21, 0, -17, -7, 1, -1, 42, -52, 39, -7, -36, 74, -28, -1, 0, -11, -31, 0, 20, 43, 27, 13, -33, 20, 29, 6, -47, -51, 35, -61, -43, -13, -13, -31, -28, -10, -37, -62, -40, 4, -10, 10, -5, 38, 7, 46, 13, -9, 17, -5, -37, 39, 33, 21, 6, -12, 47, -25, 22, -15, -22, 25, 32, 21, -5, 30, -13, -71, 12, 63, -45, -57, -26, -41, 14, 5, 16, -13, 37, -27, -39, -12, 21, 43, 8, -6, 7, -19, 18, -10, -6, -16, 54, -29, 16, 31, 35, 11, 14, 29, 20, -16, 17, 9, -33, 23, -22, 5, 38, 16, 1, 43, 49, -34, 67, -33, -62, -33, -26, -33, 44]
7787D4p3J8PN3J4j4j29R2k0K5n3j0L6k0K7K0L7p8N7k9k9K1mL3L1j17O5k2j0L8
7817A0j5k1M2j5n7Q7j2ol7K4J6LK4j2k8l8Q1o2lO2km5M5o2P3q1qK5N7m5L0M3j6
7850E7p2m4N2j1KL4n2K3M5l1jL0nk1LK3k3J7n3M6m3kj7O0Lk5MM2k6l6O9qj7j1
7884A2j3p1Q8k9K3m7L2K5j2NN4j24K6N3l6QL6j5JJ5jml0rL7mJ0J9o4O3j26O4R
7917eq6P2O9n0N4j9m6M7j8Mn4j4J6L5pJ2j2J1M0p5L7M6q1QM9Kn4P1q9M2k6JO7
7950D7p3K0L8q8lJ01q9N8J9m6K3On0%O7pk5Qjj5Rlk0K9K0Jp4Q5p5Q6n9N3n7j1
7984b6L6MnQk8K2j4K2j6nNk8M8k5mK0Ll7J7k0j7N6k0pl1OL3Oj5J0J3O2k4%o1M1
8020B9k5L1j8o0O2M7q9N3j3K0j7qjN3p5J2jl0J23p2ql0M7j10J21k2RPm7J0k9O3
$$ y = [44, -29, -11, -4, 49, 63, 49, -80, 12, -8, 17, -36, -46, -10, -30, -3, 17, 54, -24, 33, 4, -25, -4, -8, 25, 56, -61, 4, -18, -28, 10, -5, -26, 16, 1, -56, 31, 19, 13, -24, 0, 16, 19, 43, 31, 3, -35, 46, -16, -19, 43, 41, -4, 41, -21, 52, -29, -37, -12, 45, 0, 30, 73, 57, -15, -59, -7, -18, -16, 18, -34, -11, 34, 3, 2, 32, 27, 6, 9, 32, 9, 26, -27, 19, -24, -26, -43, 17, 20, -5, -1, 41, 15, -21, 48, 40, 23, 12, -1, -72, 16, -13, 10, -37, -5, 20, 8, 13, 67, -57, -31, 22, -14, -6, 30, 15, 16, 31, 30, 26, -4, -13, 24, 20, 30, 49, -15, 48, -78, -14, -5, -91, -19, 50, 0, 54, 35, -11, 36, 18, 22, -32, -46, -30, 5, -2, 10, -2, 9, 49, -26, 11, 57, -24, -16, 33, 35, -19, 52, -37, 5, -21, -20, 47, -26, -6, 32, -56, -59, 42, -47, 11, 30, -16, 7, 13, -37, -37, 30, 23, -2, 6, 5, -10, -1, -4, -24, 5, 25, 26, -48, 37, -38, 48, -11, 42, -15, -26, 10, 14, 9, 17, -11, 11, -3, 19, 3, -2, 3, -25, 23, -2, -6, 14, 17, -20, -3, -23, -40, 16, -4, -11, -42, -36, -3, 3, -12, -2, 11, 73, 49, 49, -12, 29, 4, 35, 17, -43, 19, 66, -23, 30, 17, 37, 20, 12, 11, 64, -11, 1, 0, -30, 93, 21, 13, -17, 30, -80, 41, 19, 28, 35, -12, -2, -31, 32]
8052C2j3J5q0Q9Kn4M3m9K3l0K7Nnl1lL1j1Kk5M0nJo9J4Q5%j5r3M1j4K8N3k5k6
8086a7rj3L2jmk4L6K7m5K6J3m1L3p6N0l4J08j06K8K1J5K1j2K4p5O9n2jk4L5RN4
8118F7n3j3L7m9K0K4j0l8P3n2mk1N4q8O3m2M2kk9J3m5J21j13Q0%k3l1L0nj1PM0
8150D2n4L6Kjk6J3nqKNJ3km1j0NL7m5N9l6L6n8OK1K5M7m8l8L8k1j1RK0k3o1N1
8185b1R8o9j0j4L4q
$$ y = [32, 19, 34, -46, 43, 45, -9, 34, -15, 8, -22, 5, 10, 5, -26, -29, 2, -9, -7, -32, 8, 3, 4, -65, -51, 34, 34, 19, -74, -33, -47, -19, 34, 9, -17, -26, -39, -7, -8, -12, -36, 0, 27, -18, 8, 21, -20, 13, -63, -13, -47, 61, -45, -17, 4, 19, 40, 28, 52, -23, 46, -6, -7, -31, 4, 13, 67, 14, 1, 38, -11, 9, 33, 23, -15, 58, 6, 2, -19, 35, -53, 10, -32, 10, 8, -21, -8, -53, 68, -45, 35, 35, 12, -19, 11, 6, -5, 2, 42, -12, 24, 26, 25, -1, 12, 7, -1, 1, 6, 19, 17, -24, -34, -29, 8, -37, 22, -14, 22, -36, -30, -9, 16, 63, 15, -23, 15, -6, -17, -8, 12, -11, -72, -21, 77, 8, -2, -16, 18, 10]
8191A0
$$ Imaginary data points
##PAGE= N=2
##DATA TABLE= (X++(I..I)), XYDATA
0@%%%%%%%Mj2J6j6J6k4L2m0N5o5P6r8J20j38J65k03K40k79L27l77M35n06N81o63
31c54P57q61R76j104J245j398J567j753J956k179K425k692K983l300L646m026
47b112M439m892N390n935O539p209P950q780R713j0771J1982j3382J5025j6982
61i025J9364k2334K6153l1275L8536m9679O9097j12259L69879j21334o28545N55180
73A03758p1353k68855L80635J93335n22276j18701M59101L4635m04466K78271
83F4084J11196n01174K71141M75435m89025j61249L27930j25143r3043K73974
93A54126K6471l14967q0835L40343l3870k39082K75602j7906l77330K76862K03773
104B13187l01818K6732J44475j14177l7598J09984O8925j68056n7993K29102j06261
$$ y = [0, 0, 0, 0, 0, 0, 0, 0, 4, -8, 8, -8, 8, -16, 16, -24, 31, -34, 42, -56, 64, -74, 91, -112, 128, -151, 176, -201, 234, -272, 309, -354, 403, -458, 518, -586, 659, -739, 828, -925, 1031, -1148, 1277, -1415, 1568, -1732, 1914, -2112, 2327, -2565, 2825, -3110, 3429, -3780, 4170, -4610, 5103, -5668, 6314, -7068, 7957, -9025, 10339, -11995, 14158, -17117, 21419, -28260, 40837, -71422, 298457, 177123, -451422, 103758, 32405, -236450, 144185, 337520, -184756, -303457, 155644, 190279, -214187, 64084, 175280, -325894, -54753, 420682, -68343, -229592, 98338, -26805, -119848, 154126, 180597, -134370, -215205, 125138, 91268, -147814, 127788, 109882, -267448, 9414, 213187, -88631, -61899, 82576, -31601, -69199, 40785, 109710, -58346, -116339, 112763, 6502]
115F502j29851K60909r6625j99582K10574j761j13827J06119r606o0026k2755
126d9929K4433J07583p4475l8547R1339j39413O726J80907r7781k3224M6572j10432
138g6241O6681N7406n8187N0764p1421l1736J30085n6041k4038L9202j00792N6698
150a7620Q1795m9196K1318q0632m0840J29326l6620P349O5396j52944J3905J17251
162E8488p2030K9132J4427p8408N5445L329o814K9734r6851M1553P7364q5935
174c0566O4214O742j33880R1110M3517o2703O4985l6845m3563M5927l0696M4512
186B2754L725p8729Q5551j8526p6944J10946m2403o4697J06485m4579l2531O0159
198C1211m8065J5297J3651l4714N5797m3677k0175Q6518q3331p033R3681r0328
$$ y = [6502, -123349, 137560, 40935, -158647, 51927, 50166, -63661, 42458, 32852, -27174, -49929, -25496, 82087, 7612, -30935, 60404, -79009, -72283, 108624, 10843, -12381, 34191, -76241, -9560, 47846, -10341, 40423, -30998, -62734, 67351, 11310, -12728, 26474, -74318, -17620, 64175, 14979, 36297, -44335, -85175, 44151, 7531, 14880, 80276, -72668, -58763, 58488, -13542, 15590, 30017, -48391, 7054, 10383, 3569, 33303, -63548, -21995, 55369, -30566, 33648, 40390, -93490, -2380, 41137, -21566, 43419, 6574, -36989, 8938, -21758, 22754, 26479, -52250, 33301, 14775, -62169, 48777, 6374, -58323, 48162, 3583, -28948, 31211, -16854, -1557, 12094, -22620, 33177, -10500, -30675, 55843, -27488, -34521, 59160, -31168]
210c1168J3020O9283q4404K3507L0634m1162M2651k6913j3064M6699o2210L3417
222B90M6760r1932M7678L0699p7368O4831K24n7266N7625k6949o734M6212o3280
235b9210K5623K9331o4336O0992J990o6153O2971k0207k6507O0429m9028N008
247i097L6981o2578M6263J4086o6890O4279j0843m7380O6720l5002j9384M9076
259B6231m5786K2828J9216n6120N3064j0487m7400P3909l4406l3677O7720m6079
271a0987n389M4439m7244K4206P546l8376N1808k9171k5269O5890n3221o650O1667
284C9249o1873J2216L9220n2704K9914M678l0725M2881l2359m326M7476n9604
296b5957K0017M1178o8958L6860K3155n8154M3685l018l0131M1851l1337L687
$$ y = [-31168, -18148, 51135, -33269, -9762, 20872, -20290, 22361, -4552, -17616, 29083, -33127, 290, 47050, -44882, 2796, 33495, -43873, 20958, 21182, -36084, 21541, -5408, -12142, 34070, -29210, -3587, 25744, -38592, 22400, 24390, -41763, 21208, 1001, -25506, 34923, -14105, -9097, 27884, -34694, 11569, 25655, -41235, 23044, 12201, -35179, 31541, -3461, -22845, 26231, -19555, 3273, 22489, -33631, 19433, 8946, -38454, 35455, 1049, -32628, 35092, -10987, -16376, 28063, -19181, 5025, 12571, -25805, 26003, -3168, -28437, 37453, -15768, -22418, 39249, -22624, -10408, 28812, -23892, 6022, 10700, -20025, 22856, -9503, -13829, 33647, -25957, -5940, 35238, -33720, 3140, 26295, -31859, 11826, 8808, -21323, 20528, -10809, -7122]
308g122L2188n2651L4301J7153n9825N3476j337n0173N6657j9165k5195M4621
320B2928l4480P480K2699m3546L8344j631m3471N7432k2573l2778N9208l5703
332f091j2043M3748m0592J3340J6957l6574L7256j2830k6489N1542l6934j1311
344b0021N2280m9005N738L7361m7116K2638J1533l3376L5521j8066j2779M1084
356B5792m2492Q330L7334n3872K5802K2887n0239L6022J616l2531L8642k1207
368c916p382L1997l9962J9292K0676m7743L8072L707m2589M6082j3856k5159M1819
381B1038k8703j30K7644l8821K4136Q451l9054M2446j0099l1406M5893k5224j3168
394a6997L8188l3073Q482J8992l4046K9923n352k9440M5219k3436j7976M7216
$$ y = [-7122, 25066, -27585, 6716, 23869, -35956, 17520, 16183, -33990, 22667, 3502, -21693, 22928, -11552, -4072, 18627, -24919, 13425, 11794, -31677, 25755, 3182, -29596, 29612, -6091, -18134, 25614, -14978, -1638, 15319, -21255, 16001, 3171, -23318, 28224, -8710, -20021, 32259, -16746, -11008, 26353, -20763, 1875, 13408, -19968, 15553, -2513, -15292, 25792, -16700, -8370, 28964, -24908, 894, 23781, -26458, 9564, 11180, -21351, 17291, -3916, -11298, 20699, -19263, 29, 20705, -27038, 11034, 14741, -27848, 18234, 4378, -20781, 21038, -7665, -7795, 19849, -18972, 5164, 13615, -25439, 17007, 6908, -24498, 21395, -3829, -16997, 21191, -11882, -3400, 15592, -18454, 11469, 6117, -23323, 21896, -1540, -19516, 27700]
406B7700l7290o122L7227l3803J1886J3333k7577K4923j3608r835L8429l9772
418a4509J975M2378n0356J3554L4703m9147J8325J9332k7473J8847j0557l699
430f627J9964l1788K5709J6113n6131L9324J5681n4301M3692O926m3771L2766
442G557k9j4343J1408j6164J9939k815k4213M5342k5897l7468O2663k1632k9204
455b4856N4481k8888k4036L4909j3757L69L115o612K2229k6655n76L5435m9923
468b4765J0421N2623n1157O095L1723m9612J3591K8219j8631Q733j1091P1J2188
481H408k8129K7851R608m8371M3153J1040n2248L7150P94l4857L8329l83j5891
494c546P649j8844J7360L081j8685L5343k2630k6428N0105k5040j9674M3606k8767
$$ y = [27700, -9590, -15712, 21515, -12288, -402, 12931, -14646, 10277, -3331, -13166, 25263, -14509, -12534, 29844, -20512, -6958, 27745, -21402, -3077, 16255, -11218, 7629, -2928, -6627, 13337, -18451, 7258, 23371, -32760, 6564, 22245, -32056, 11636, 18562, -25209, 7557, 7528, -6815, 4593, -11571, 8368, 5553, -18660, 26682, 785, -36683, 25980, 4348, -24856, 29625, 737, -23299, 11610, -2147, -1778, 1337, -5275, 16954, -9701, -10277, 25158, -24765, -14344, 38279, -12878, -6783, 24940, -24672, -11081, 17138, -1493, 7240, -3851, -3780, 8408, -19721, 8130, 17738, -30633, 12520, 23560, -28688, 8462, 9256, -25601, 12728, 12345, -3546, 4103, -14741, 2619, 5700, -12985, 22358, -272, -26700, 23405, -1635, -21309, 22297, -6470]
507f470m715L1834k7899K092O738j2779K5725j1547r340J9691l3144J2812L1480
520B4478l8066J7063J2193m1417L1158P258l2391L0416m481j6859K2110j5840
532d378k721P426q591K8272j5045k3027L5792k9952j0651N7505l6061k0072M5482
545B3979k8394j2223K7473j2092l229J406J3508P430m3274J8838K7283n0258L6729
558G176L6562p1992J3538L8434m2197R721K7691j4516j0930J087K2580k1503l1145
571c5494N7764m424m7324N7828j1667o5914N1048K1953l4344J6471N845j6412
583d670j2401J3010K9917l6797r075N4118l9461k1051N5823l6862k2875N3972
595B3648j1008k1322Q190m605L097n709J6901J5108m7173J1398L5981m1812J4213
$$ y = [-6470, -11185, 20649, -7250, -5158, 1580, -11199, 14526, 2979, -6361, 13330, -19814, -7002, 24478, -13588, 3475, 15668, -25749, 5409, 12667, -19724, 10692, 6211, -10648, 11462, -4378, -7099, 327, -8264, 20008, 4963, -18064, 17728, -12224, -22875, 34630, -1431, -21503, 23979, -4415, -16638, 10835, -1257, -4486, -3080, 10428, 17858, -25416, -6578, 20705, -29553, 7176, 43738, -28254, -14716, 23718, -18479, -8758, 18933, 4417, -6513, -5426, 17154, -4349, -35494, 22270, 17846, -29478, 28350, 16683, -49231, 1817, 23770, -10574, 5897, 11742, -4670, -17071, -4061, 25856, -10941, -20016, 34102, -5359, -26410, 29413, -7449, -30324, 23648, 12640, -8682, -492, -5097, -2000, -7709, 9192, 24300, -22873, -11475, 24506, -17306, -3093]
608c093K8465m4101J1891K3916k2638N426m079k185J6878j3526R785P26l3525
621b6060K7859J2944k4104K4395j3061k3949L1405q869n460J9984k4118N006J5727
634A1699k0512J0860k122j1577K4635j0247n801J2430k8730J3682K4320k7670
646i033J5275N156l2378K2879P330j7679J4930p334j473J0058j5890J2038k685
659A194j9579L3917n493k6279K8888j5431j7224L4760r846j0651J2883j2257N020
672i8q6n605J7750j8529k89K8163l2437q37K9503l0703Q208K6365k8660R82R626
687C353r119R367m748M665M210k4076K1194Q330l3658K7431P506l3489K6162L597
701A0725k5999J7107J436m086N139r876J0882o634j3082L0436j3193j9797L2342
$$ y = [-3093, 25372, -18729, -6838, 17078, -5560, -134, -4213, -6398, 10480, -3046, 6739, 7465, -26060, 1799, 14743, -9361, 15034, 1973, -21976, 9429, 560, -4900, 15084, -9034, -4028, 11699, -8813, 2047, -75, -11652, 12983, 2736, -3065, 9365, -19365, -5683, 18637, -9033, 6242, 11398, -20980, 1899, 9229, -8450, 6480, -854, -2327, 7731, -8159, 3879, 1194, -18385, 15532, 10039, -16240, 12648, -2783, -20007, 14753, 4907, -5744, 7139, -5118, -98, -184, -5789, 11961, -6568, -6857, 21306, -11131, -11968, 17535, -13168, -4960, 21405, -7255, -6273, 3353, -5766, 3601, -1147, 3518, 7728, -16348, 4846, 13176, -20482, 6949, 14455, -19034, 7128, 10725, -15274, 1833, 3269, -817, 4322, -5554, 5328, -1306, -14388, 16048, 2855, -16942, 15400]
714A5400j5606j4747K8773j4311p106J4378r949O640l384q151J8259j5517k468
727g789K5232k5391j153K3220k3324O050J4283j8596R428k97p847J4939j4149
740e394J606J6198k2638R806J2390k5059J5081N785j8050J7166n766q881J6421
753H665j4520L299J2724k0035J1820N870j8927J7109k823j2137J7955j1650j883
766d533J4696j8864Q300R761k0666J5391J973j7520J8230n535q783J5660j2342
779d232K607R326j6955J3358J685j7525K0402o015j3850K1161j1671n538J6556
792I309j4476M198O898j4552J4122l262j1681J9742j2348o240J9986j7112R12
805d504J4393j7301Q344M515j3614J4385o416o960J7293j5207L87J5757j9701
$$ y = [15400, -206, -14953, 13820, -491, -7597, 6781, -3168, 3472, 88, -8063, 10196, -5321, -7789, 17443, -7948, -9101, 14119, -9205, -3155, 11128, -7468, 1960, 1663, -6184, 8755, -5394, -3788, 12410, -10228, -422, 11968, -13091, 1990, 7775, -10275, 6891, 1125, -7756, 8665, -5855, -2556, 10168, -9867, 1953, 7823, -11104, 6005, 3182, -8955, 9000, -2650, -4533, 10163, -8701, -401, 9360, -11306, 4085, 6058, -11462, 6768, 1233, -7550, 8110, -4232, -1625, 7701, -9254, 4104, 5789, -11736, 8666, 2651, -11199, 9962, -1709, -7247, 9309, -5167, -969, 5929, -8623, 5499, 2237, -9444, 10298, -2050, -8290, 11696, -5416, -4504, 9889, -7412, 932, 5447, -8167, 6218, -198, -7158, 10135, -5072, -4685, 11072, -8629]
818h629P351J0155j8197J2238J258j2189J4636q084l427J3908j5658N614J0065
831I041j8870J2641L933j6977J6090l682j0261J5773j0392r56J1554j5222Q342
844A014N279j5993J5318k264j2875J7799r018n935J5704j3770K555R716j5272
857g742J0567J309j3024J5918o903p785J6912j3400m33J3572j6166P100O708j5050
871h417J2839j738j0293J5374r712l034J4049j4989M542R049j6245J1212K019
884D656j3486J4978n658p239J4959j2065M01J1583j4943P957N228j4685J2702
897D388k117r637J4813r314k742J2375j4185N880P877j5960J2060J208j3894J5374
911F126n002q175J4218r581r0Q522j2332Q629J271j1641J5932p015j0322J8916
$$ y = [-8629, -1278, 8877, -9320, 2918, 4176, -8013, 6623, -1461, -4888, 9020, -6638, -1024, 9041, -9829, 2812, 6745, -10232, 5858, 2176, -8085, 7688, -2704, -3660, 7894, -7328, 1014, 6293, -9700, 5618, 3354, -9521, 8278, -740, -6675, 9029, -4741, -2186, 7530, -7742, 2825, 4134, -8890, 7028, 125, -7660, 9252, -4148, -4581, 8991, -7175, -75, 6633, -8417, 4422, 2684, -7609, 7765, -1947, -4981, 9068, -5921, -1379, 7670, -8575, 2637, 4656, -8830, 6148, 490, -6749, 8210, -3855, -3454, 8129, -6814, 1143, 6371, -8314, 4388, 2271, -7366, 7447, -1867, -4609, 7766, -6419, -539, 7338, -8622, 3438, 4646, -9248, 6126, 1124, -7051, 7167, -2414, -2504, 6018, -6314, 2315, 3586, -8055, 7877, 862, -9460, 9456]
925I456j1584n188J7402j3362m05R472j0769O346l68n362J1756j1438j90J5060
939A0826j9084M359J5835j9787O621J0490j6183O526K733n693P136p144M410N467
953F512j6968J2662N338j9988J7473L797j9152J3941l68j0551J0341l027J399
966A409J880r566J1666m669j1862K0491p573j1429K0724j1271r528J5756q250
979b222L44P463p793M991n003l712J4256j1866m16J5151j8115L068J3938j8025
993g941O222Q449j2434Q849q55p414Q021p020M008P909j3990P803K221j4359J6217
1008E686l30j3361J4525o652p397J4200q601o78P994r528O270j89q851J1194n761
1023a479j964J3985j4436j033J1272j4888Q670J0046j5695P073J426j0742J0223
$$ y = [9456, -2128, -7316, 10086, -3276, -3681, 5791, -4978, 1368, 1000, -4362, 7394, -4044, -4234, 10826, -8258, -3899, 11936, -7851, -1230, 9260, -6923, -397, 2336, -3357, 3779, -3365, 1045, 6512, -10456, 2206, 7544, -12444, 5029, 8826, -10326, 3615, 3247, -7304, 3037, 10, 1409, 3289, -6277, 5389, 720, -11142, 9349, 1776, -9653, 11071, -200, -9728, 6028, -2222, -1878, 5585, -2208, 2783, -2220, -5932, 8324, -3542, -3958, 11193, -6922, -3854, 10084, -7941, -1719, 6730, -5704, 3145, 2290, -5124, 2897, -4123, -115, 7794, -6196, 1607, 3828, -10531, 5686, 5356, -8005, 6520, -132, -7529, 6671, -1930, -2608, 5386, -4142, 2128, 1939, -6912, 4282, -1479, -3443, 10542, -3894, -4927, 6345, -8543, 127, 10173, -5522, 1551, 2977, -7765, 2458]
1036B458j785k102O466q786N807R51j3323J4750j002j2425J9259o782j4816J6483
1050E153n362o287J2566m213j471o31l270Q174r972M37J7721j7306j066J8716
1064A3189k1537j962K0801j1968j255R694p000l269j958P477L423j3974J3756
1077E417N328k5491J4774J0457k3776J4032J2210j8375K565N238m422r60J372
1090a631J1258q742j1931K0250q057j5746K5684n124j8102J8847k264j2772Q551
1103B21K138m33l804P31Q970j4761l30K0038j6803k992J9702j7089l924J6084
1117G748r193j154N692k705J486o368L726O584j3196R177Q437j9448Q165P418
1131F369j5415J0704N111j0801N790k293k289M849n653O502J418r860J0229l599
$$ y = [2458, 673, -1429, 5037, -3749, 2058, 3009, -10314, 4436, 3434, -8991, 10268, 3486, -11330, 5153, -209, -6496, 6070, 1857, 386, -245, -3515, 4659, -5313, -4876, 12845, -4461, -5527, 13189, -8348, -10310, 10491, -1477, -2732, 6962, -38, -3307, -5265, 2212, 5635, -8339, 5417, 10745, -14746, 28, 10485, -13291, 741, 12951, -5424, -2859, 2379, -2043, -3003, -1631, 9627, 885, -11046, 9204, 1147, -14599, 11085, 5961, -12141, 6706, 4442, -8330, 221, 2359, 1926, -1878, -1147, 7823, -6938, -7268, 12770, -4033, -7025, 12677, -4412, -8336, 7748, -1445, -2599, 3093, 388, 1874, -4494, -768, 5816, -7380, 1797, 10234, -9214, -1049, 6369, -9046, 1658, 6769, -4032, 1758, -535, -2824, 2025, -3628, 2874, 4292, -5568, 4661, 1062]
1145A062j0113J4273m356n174J2703j0051l525Q824q141M694M705q007N833k848
1159a21m208Q332p445J745Q487j1000N600L980j4071R467L276r449J0838k744
1173B687q097P312m225J191M592o656O681j828q042J1763n913o625J5021p487
1187C74m813J0764r264j270P546m722L795j851l789P034p762J497J0484j3024
1201e001K679J0038j3432M401P035j0369M823K178l946L812n308L048M100r871
1215e813Q711K226j3464J1061J689j1111J0262j292o726O768l447R52K341o248
1229d091P441j866p335J1409n541o146J2418o688l175Q521p727J328M127n907
1243c232N953k148m510Q460o550j365R147q886J818O522r186M636J776o986P648
$$ y = [1062, -9051, 5222, 866, -4308, 8395, -1656, -5181, 3643, -4498, 196, 4901, -3106, 2727, -121, -4329, 4003, -3442, -1697, 6790, -4210, 1390, 5370, -8701, 766, 4042, -5407, 5431, 2687, -5410, 1902, -2323, -1132, 3460, -3196, 3485, 1657, -6385, 5378, -535, -7160, 7861, 374, -4439, 6325, -2939, -4209, 3337, -1385, 2410, 559, -3230, 3804, -3958, -2461, 8023, -5001, -2322, 7716, -5716, -1315, 5720, -4649, 174, 2352, -1594, 2218, -3090, -42, 4058, -5813, 2898, 5124, -8340, 2721, 4410, -6701, 3561, 2269, -4457, 2311, -1136, -184, 2157, -4091, 3350, 1484, -5851, 5558, 17, -6129, 6289, -399, -3574, 4947, -2780, -1452, 2675, -3232, 2721, 573, -3937, 4523, -2027, -3392, 5755, -3131, -1313, 5209, -3977, 659, 2435, -4551, 3097]
1258C097k496l852P792o840j23O745q032M040L138p816O714j272n424Q370n101
1273a060j892Q046p868J649N196q114N063J445o233O831l253k989P437o903J020
1288a625O197q851M559L474q444O623q9n644P119l867j416N753o904L179L333
1303C397q039O680K64p102Q159k827m318P651n288j33N154o627L858J544o495
1318d122O984k213m600Q075n232j607O988o924J822M230o936M964J76n180O836
1333C261l783k420P060o472Q02N600p569L789K548o526N884j377l842O627m924
1348a342l89N630p112L049L556p465N638L47n905O840k864k729O239n349Q80M298
1364C322o574M302J266o107O468k130l986P118m824j076O044o431K198L366o462
$$ y = [3097, 601, -3251, 4541, -2299, -2422, 4323, -3709, 331, 3469, -4347, 2367, 1095, -4329, 4041, -1060, -2952, 5094, -2774, -1125, 4071, -4043, 1020, 2465, -3768, 3063, -190, -3179, 4258, -2645, -1625, 4572, -4279, 280, 3754, -4690, 1933, 1844, -3800, 3319, -548, -1964, 3789, -3115, 64, 3397, -4642, 2038, 2302, -4800, 3359, 532, -3786, 3865, -1423, -1556, 3598, -3029, 829, 2373, -4122, 2862, 649, -3951, 4124, -1108, -2715, 4273, -2651, -829, 3401, -3535, 1429, 1605, -3575, 3261, -522, -2942, 4118, -2354, -1552, 4048, -3521, 268, 2816, -3710, 2174, 797, -3045, 3582, -1342, -1731, 3899, -3213, -164, 3392, -4073, 1565, 1912, -3993, 2847, -17, -2746, 3493, -1856, -976, 3322, -3252, 1050, 2316, -3791, 2677, 547, -3439, 3679, -1145, -2221, 3823, -2608, -410, 2956, -3506]
1379c506M915O4m756O119l281j915N954n758J473M289o961M157J588o119O044
1394B307j497l986O288m167p90N005n856K678K691o112N286o02m793O672l324
1409b00k090N958n735J024M163o315M042J391n842N610j507l471N922m118j91
1424a359M519n850L138J860o274N992l12n294O658k974l164N878l843K89L101
1439B365m637L653n56m213O640l729l001Q056n474j888O419n667M24M019l499
1454a088K383j417j666M608n226J051O132q168K361N769q613K772M139n692L245
1469E90Q21k051J724l789K997K376o343O021P24q527P307O89o887O599o97l917
1485b363L781k126N70N57k814N144k219l977P150m681l089Q523m884j912N930
$$ y = [-3506, 1409, 1473, -3283, 2836, -445, -2360, 3594, -2164, -691, 3598, -3363, 794, 2382, -3737, 2307, 810, -3176, 3112, -1055, -1845, 3160, -2696, -18, 2673, -3439, 1847, 1245, -3548, 3124, -200, -2290, 3668, -2067, -1043, 3120, -3195, 847, 2238, -3604, 2006, 499, -2972, 2950, -1168, -1359, 3160, -2690, 448, 2308, -3966, 2026, 1714, -3580, 3078, 104, -3060, 2818, -1025, -736, 2365, -2272, 1381, 825, -3388, 3252, -477, -3478, 4578, -896, -2784, 3635, -2032, -1608, 2411, -1088, 1295, -122, -1788, 2820, -2406, -1355, 4777, -3391, -1030, 4739, -3874, -1102, 3037, -2655, 590, 1411, -640, 1084, -2705, 292, 2668, -3675, 2346, 3070, -5457, 1850, 2539, -4348, 2251, 1554, -2363, 1418, -708, -138, 419, -2395, 2749, 530, -3447, 3703, -978, -4067, 4456, -428, -2340, 3590]
1500C590n236J25L196k949K563j085j530L693m739J174M709o550L342L641p821
1515c877M002K095n787N039M42l308L012k722K33J923l311M637n48n066N812l058
1531d82l963Q032l019k677N648m796j114L636k596K356n1j918L243m082jM800
1547C016n786K467M962p374K399K551o294M225K220l391K607j975r43J726k568
1562b158L849J08m785N881j993n447P331k329m156P308k190l532K827j782L16
1577g52N62N64L218n629n40O293o895R48Q331p789r45O509n363j060L910o01l56
1594D05j570K826k10o762O329L236r028O226L294j0074M283M518n480J524K295
1609A812r92k113q87N123l063l903Q791l319o968Q657j950n962P287k25m039J811
$$ y = [3590, -1646, -1521, 1675, -1274, 1289, 204, -1326, 2367, -2372, -1198, 3511, -3039, 303, 3944, -3877, 125, 2220, -3567, 1472, 1914, -1394, 1618, -1104, -871, 1052, -2259, 2378, 1830, -3236, 2576, -482, -4445, 3587, 568, -2109, 3539, -1257, -2371, 1265, -1331, 1025, 974, -944, 2299, -1783, -1784, 3016, -2770, -303, 4659, -2715, -316, 2235, -4059, 166, 2386, -1005, 1602, -373, -1316, 410, -2158, 1691, 1799, -2986, 2895, 902, -4545, 2786, 457, -3699, 3609, 1419, -2113, 714, -1068, -752, -190, 374, 3592, -2037, -2577, 3716, -3179, -2231, 6100, -1689, -2634, 3875, -1488, -2548, 1362, 761, 405, -1165, 1661, 1451, -5311, 1018, 4254, -4774, 1452, 4746, -5328, -1045, 3473, -2007, -483, 1812, 820, -1293, -2180, 2943, -120, -4023, 4768, 1449, -5519, 3138, 1188, -4774, 2513, 2288, -1751, 60]
1625F0k77L19j566Q37M636n336r52O326o583n32P367n127l12M239m396j8J181
1642a34o08K580k215N76J930n474K609L261n140L873J442n329L466m65k780M064
1658A656j682j75K380l761J289R69l181M090n92k584L846l323j070M367l810J190
1674c91L282m752J926J344l648K981k00j330K690k893O50J728m111L603J228m779
1690b672M418n57m398M571p65k133L313k067j07Q75k135L153j175k286M764l426
1706f27k036N568l789j083M751l556j33K047k370J606o15k06K761l888P68L363
1722B561n299K438L529n457K196J891l924K351J84j022J753k368J525J042m110
1737b710L719N92m559M760m22m077L992j042j570K742j929P33N84k673L256j066
$$ y = [60, -217, 102, -1464, -627, 4009, -1327, -2279, 4047, -2536, -3068, 4299, -828, -1140, 3099, -1297, -1315, -134, -742, 1838, -377, 199, 2129, -3345, -736, 2525, -2615, 1258, 2700, -2629, 837, 372, -2408, 1656, -26, -201, 2179, -1582, -293, 676, -2505, 1585, 993, -1591, 2255, -1068, -2138, 2229, -1581, -391, 2891, -1861, 65, 1409, -2239, 742, 542, -788, 1902, -991, -341, 1387, -2724, 879, 2107, -2672, 1746, 1189, -3209, 1362, 597, -1536, 1777, -290, -397, 478, -1657, 1496, 321, -1965, 2799, -627, -2663, 2905, -884, -1967, 2784, -772, -905, 1142, -1228, 378, -237, -443, 2318, -1570, -802, 2561, -2738, -300, 3229, -2228, -32, 1859, -2065, 286, 470, -552, 1201, -1167, 358, 1400, -2710, 1009, 1601, -2958, 1802, 1380, -2697, 1295, 253, -1317, 1425, -504, 229, 813, -1860, 1396, 330]
1753C30k455M433k539j819M370l182m06L168l144J358J020k724K693j133j423
1768a453L466k776j31K968l651J396J882l609K672J20k787L363j593j292L224
1783A799k724L49K240l302K029O10k770L184j187j859L567k679m15L148l375J113
1799b72J888l297K243Q1k208L023j750p87L016l206P91K284l586K102J085l133
1815a726K671n78j793K916k091j18K380l202J619J348l455K888M4k816L254j309
1831C2j323K873k431N06J790k918K093L17k797L256j249j859L468k296n01K718
1847A679k882J064J305k655K320k67k141L116j871q39L004k908N70K218l171J760
1863C02P28k652K675q65j511K971k341q2K407k940J338J283k908K380j97k122
$$ y = [330, -2125, 2308, -231, -2050, 2320, -862, -1268, 1900, -1244, 114, 1134, -1590, 1103, -30, -1453, 2013, -763, -894, 2074, -1577, -181, 1701, -1908, 764, 884, -1903, 1460, -133, -1425, 1799, -925, -576, 1664, -1638, 391, 1001, -1769, 1415, 228, -1631, 1936, -743, -1158, 1990, -1385, -272, 1616, -1681, 562, 643, -1565, 1458, -292, -1079, 1937, -1269, -478, 1806, -1780, 322, 1407, -1726, 945, 367, -1426, 1490, -601, -719, 1661, -1541, 78, 1426, -2029, 859, 903, -1913, 1341, 32, -1291, 1582, -849, -343, 1447, -1471, 622, 939, -1858, 1398, 149, -1710, 1758, -538, -1039, 1679, -1203, -139, 1166, -1489, 831, 564, -1577, 1539, -332, -1171, 1833, -1075, -505, 1713, -1458, 302, 1030, -1622, 1053, 188, -1323, 1648, -693, -775, 1632, -1308, 30, 1313, -1595, 785, 588, -1534]
1879a534K966j668q56K807k674N32J933k985J822N20k407K628j039j290K857k372
1895g60J15K419l178J373J471l016K275p0k017K555j409n61K336k704J018J540
1911A387l014K294L24k725K856r35j622K889j953j53K050k687J423Q81k514K496
1927I97n21j806K847j995n90K632k630R13J683l152J856N15k221K489p77j190
1943i50K192k032M68J573k732K064O71l079K955m99k615L120j028j085K167j676
1959d86L23N86j732K512r51j745L448k281j501L873k496q42L009k055P3Q36j308
1976g37J255j099J26K377l204M67K842l900J369K740l610J197J421k188J080q4
1992E2k58J081j928J625N45l251K771N03l219L318k27k894K573n01j047J836j187
$$ y = [-1534, 1432, -236, -1092, 1715, -959, -427, 1506, -1479, 343, 863, -1544, 1084, 45, -1245, 1612, -760, -645, 1774, -1404, -31, 1440, -1576, 699, 629, -1388, 1167, -242, -803, 1533, -1171, -153, 1387, -1627, 667, 991, -1734, 1122, 187, -1435, 1454, -499, -652, 1398, -1289, 134, 1015, -1499, 997, 476, -1330, 1517, -478, -1068, 1564, -1066, -153, 1530, -1622, 234, 749, -1472, 1017, 240, -950, 1242, -790, -322, 1251, -1481, 583, 1254, -1825, 1130, 631, -1984, 1136, 108, -977, 1190, -486, -163, 423, -1309, 1203, 252, -1493, 1955, -326, -1827, 2046, -450, -1292, 1717, -338, -265, 571, -737, 518, -581, -455, 1922, -1282, -815, 2027, -1873, -504, 2236, -1374, -177, 1244, -944, 136, 52, -206, 875, -1053, 572, 1117, -2134, 637, 1140, -2079, 1239, 1012, -1882, 691, 190, -857, 979, -208]
2009b08L91J49j524K263j141j228L151k183j052L124k580k42K673k169N85Q22
2025H31j869J228n04p0J948k252M00J563l170J836J637k852J993L83k421J705
2041C86o10n79J901j359O67M54k430J701J42j653K900r09j748K282j911l06K261
2058A189j779Q47J063k235J153k91j145K036q44nJ338k567R37J126k522K425P14
2075A440k823K263l29k085J843j37k01O71j054J101r87j322L273j445j785L679
2091B102k143k031L422j211j271J947m83l53o44M27J471k466J011K724m098M65
2107a131L359l673M18L193k528n86J227k34k29o16J879ql111K728P15m053L182
2124E32J535l708J952Q94k508O65P71M85l91q12J842j652j797L706j157j958L543
$$ y = [-208, 183, 332, -1192, 1071, -70, -1298, 1853, -330, -1382, 1742, -838, -1080, 1593, -576, 9, 831, -1038, 190, -314, -384, 1564, -688, -288, 1275, -1895, -59, 1578, -1274, 719, 1102, -1319, 386, -224, -803, 1098, -261, 406, 860, -1570, 131, 273, -1380, 1520, 611, -1137, 1145, -766, -1072, 1189, -590, 257, 1320, -915, 238, -53, -1198, 838, -6, -11, 1327, -1240, -303, 823, -1699, 726, 1440, -1383, 880, 551, -1534, 309, 172, -29, 642, -412, 689, -298, -1620, 1653, 208, -1577, 2102, -41, -2072, 1350, 139, -1132, 815, 332, -21, -665, -238, 1233, -1233, -222, 2502, -1596, -1131, 2228, -1445, -1027, 2166, -362, -948, 279, 45, -184, -800, 1079, 1071, -2040, 688, 1403, -2650, 532, 2067, -1641, 311, 1205, -1303, -638, 133, 618, 227, -585, 1257, -395, -2192, 1514, 357, -1601, 1942]
2141A942j501k146K401r91m29J361l84N30j031o41J735j852M59K625k642j7J859
2158A278k623P99J573j689J124o5r48J026j259M16J237j645J436L56k389J692
2174C19K6j597K319p12j140J623j303n3J106j237J015J61j318J467r01o70K063
2191A168j612P5J601k162O76J123j733J246J72j356J290o63l01J208j316P62O09
2208G87j982J623M8j707K150m54j469J851r42o42J321q92O02O4j095J356q62o98
2226i41K254j658m04K065j958p5J608j440N41N24r05Q07q14J7J230j678Q07J316
2244A296k407J017J024k052J334M31j258R67m87j68P41j197J079M17j737J571
2260E71o8j684J814l45j044J506q79k04Q18j093P77K89j230J442n46r86J669r54
$$ y = [1942, 441, -1705, 696, -295, -724, 637, 253, 783, -248, -889, 846, -1006, -547, 2078, -564, -581, 1278, -1345, -546, 1027, -662, 462, 397, -551, 475, -784, -368, 869, -776, 660, 1016, -1373, 319, 345, -1252, 1067, 355, -785, 838, -465, -518, 588, -649, 366, 527, -791, 676, -225, -895, 1168, -444, -369, 1232, -930, -254, 869, -864, 382, 554, -802, 488, -175, -476, 732, -584, 178, 787, -1195, 428, 476, -1231, 919, 465, -1004, 847, -95, -737, 584, -308, 294, 358, -737, 619, -243, -941, 1313, -345, -749, 1316, -642, -717, 891, -549, -8, 516, -389, 418, -396, -379, 851, -827, -20, 1296, -1111, -94, 930, -1122, 212, 643, -615, 352, -135, -303, 438, -759, 320, 737, -1000, 571, 503, -1181, 633, 288, -756, 750, -129, -333, 485, -608, 169, 458, -772, 670, 124, -862, 807, -147]
2278a47l68J411j352L18P50j279R34L8j032J384p27m70J292j212K26R32j370Q36
2296A64L05j247J294l01r09J416q70l10J223j244L98O59j199Q94mr51J317p81
2314a46m02J372j248Q4J108j353O31M68j148J036k90o56J185r92J04J002j341
2331e86N66P12j449J013J08j035J156n05m66J074j035L72P02j332R58K08j249
2348g88J296l27p83J298q16k20J002j111M28M87j189J101k01q73J331p27m06J247
2366G49j093J63P94j145O32K48r81J078l48o37J143q74KR65j209N33M65j165J016
2385C36r3q37J150o17m05J080r13K60N92j081Q17kr78J233n41o36J287q81j04
2404c33J016j076L52N05r15P77j89o39J083p61j50J121j236K87P47j146O45K43
$$ y = [-147, -515, 896, -456, -138, 612, -667, 267, 305, -727, 657, -70, -540, 752, -460, -234, 698, -672, 164, 469, -778, 516, 215, -694, 722, -148, -458, 765, -479, -81, 578, -621, 273, 269, -682, 635, -146, -548, 824, -424, -340, 768, -585, 46, 514, -634, 402, 112, -544, 641, -351, -247, 755, -586, -20, 692, -757, 256, 364, -671, 485, -20, -486, 588, -447, -75, 627, -705, 253, 461, -788, 508, 181, -602, 696, -120, -340, 662, -449, -21, 466, -723, 378, 177, -696, 635, -92, -498, 749, -344, -181, 613, -532, 100, 348, -633, 445, 97, -540, 603, -271, -269, 696, -513, 20, 485, -680, 336, 243, -594, 556, -61, -466, 614, -299, -39, 553, -528, 289, 287, -691, 542, 1, -635, 652, -229, -333, 683, -393, -41, 464, -451, 326, 137, -502, 581, -180, -330, 791, -445, -158, 589, -557, 88, 331]
2422C31r05R52l57m54Q92q10J85P94j191O82L52j158R51l5p74J086n90k98Q90
2441E43r61L81N91j053P02O4q93J045m88l78R94q16J62O51j121O23L60j003R55
2460C58o3p22P50m30j64P27p58M41K36r90R55k16q68J264l65q26J224o04k82O45
2480C12n45M28Nn05P84p20k27J269j076j57J202j194k9R69p80K51J94l70M25n47
2500c11J30O88j054N42O75j402P98L99j123Q45K38p86N80l35p9M09n52O41q5q13
2520e95R26k71p98J350n79n02J078p01l14N71l60K84J61l37M55o51j59R78q97
2539c61K52J003j346K13P00j037M62M80m57L79l84j30L78p09P13M39j030P32j0
2558B87j040Q42R9n52Q76m13l36M03n50K87K59m39P14l07n24P49o27n1R26q23
$$ y = [331, -574, 378, 21, -433, 459, -351, -166, 628, -563, 119, 471, -687, 264, 229, -545, 541, -49, -347, 543, -418, -37, 554, -499, 203, 267, -626, 419, -69, -447, 547, -269, -107, 544, -577, 46, 406, -597, 358, 295, -427, 323, -107, -271, 456, -302, 139, 375, -615, 340, 124, -744, 520, 155, -671, 553, -51, -333, 312, -233, 195, 200, -305, 479, -241, -468, 801, -275, -432, 770, -424, -453, 516, -264, -13, 181, -189, 236, -311, -181, 507, -547, -5, 670, -732, 66, 465, -658, 187, 425, -361, 219, -116, -195, 214, -338, 303, 218, -595, 331, 60, -738, 612, 33, -469, 609, -92, -406, 165, -195, 89, 250, -87, 368, -283, -442, 536, -361, -109, 894, -452, -239, 461, -576, -114, 366, -91, 288, -96, -226, 152, -557, 156, 595, -435, 297, 287, -753, 89, 188, -364, 512, 99, -237, 166, -384, -97, 162, -277, 437, 130, -394, 355, -272, -323, 603, -220]
2578b20J52N15j002M12N22p20M91K7l72L00m44M39J47o95R00o7j236J163J4j069
2598g43J169P9q93L25Q8j3p3K1O78q62l83J371r84n49J671p06q40J165m18o07
2618e04M73K34O4o01M60M04j361N93J172j432L39J151j483n3Q58m60MK74K15k53
2638I4o64P24J00r71J223J45j373Q93Q7r84P62L01l55J24k47K39k19l50R84l34
2658A79n68R51o34o19J088m86j22N71m57R2L8k68M66l53n4P13q39Q2N52p44L75
2679c7M92p48M34L3n31N38j15j75M81n77J42K85o43N97L7n36O38l59l40O38m29
2700a75R1N24o52K80J12n60N47Ll32M49l61j13M66o12L27L19p11O53pp88O94p3
2722H1l74O21l17j28K69m67M13N7m36O65l42m46P66m10l24P84m31j43L93m40K33
$$ y = [-220, -68, 447, -555, -143, 379, -341, 150, 177, -195, 105, -339, 100, 247, -448, 452, 385, -851, 312, 326, -743, 426, 505, -388, -63, 25, 12, -61, -40, 638, -224, -607, 764, -220, -769, 902, 196, -644, 521, 103, -504, -31, 203, 267, -334, 126, 530, -831, -238, 934, -498, -159, 992, -491, -544, 314, -146, -142, 132, 347, 94, -570, 154, 254, -717, 506, 651, -722, 171, 258, -726, 36, 337, -18, 106, -141, 98, -121, -471, 513, 179, -389, 562, -72, -691, 397, -89, -211, 360, -97, -5, 33, -235, 231, -122, -176, 537, -302, -220, 332, -412, -37, 455, -293, 141, 174, -357, 181, 66, -109, 372, -205, -63, 222, -421, 176, 213, -323, 315, -44, -384, 254, -175, -84, 440, -212, 68, 180, -380, 167, 170, -162, 287, -74, -187, 279, -333, -6, 313, -398, 255, 248, -540, 154, 81, -293, 328, 11, -117, 152, -315, 98, 155, -281, 384, 42, -404, 362, -48, -372, 412, -19, -162, 231, -209, 24]
2743B4l3j33N24m71p0O59q64J16Q17q62K53M04o40K82P8k18K75k93K06K79o67
2764c34L77K52p36O09J23o41N51j26l07M00k07L2J82m55M26K9m99O32k45l51N44
2785B56k88j94N09l98M2K87m41L48o0k68M49k64j98O02n76J05M06n37K53J92n25
2806c00M57j69k09M54k95k2K54l60K38J73n12M92j16k85M94k81j79M23m19J09
2826e3L39m54K24K9l20M19j61k43M87m02O9L70n40J85K31l83L11l9k95M68l10
2847f8nL31m67J42K50m12K85J36m90N01j94k14M02l24k2L69m18K24J51m44M80
2868B13j56l03M61k16j85M37m05Q6K65m37K82L7k66M12k17j80L72k78k3L48m64
2889b17K63J03l74L54p4k94L78k69J1L12l67J98K41n02L40K1l25M14k42r0K82
$$ y = [24, -9, -142, 382, -89, -159, 500, -364, -248, 569, -293, -40, 364, -276, 6, 84, -134, 141, -152, 54, 333, -334, 43, 295, -441, 168, 291, -350, 201, 75, -232, 168, -39, -7, 175, -280, 146, 175, -324, 308, 63, -288, 256, -32, -226, 283, -115, -73, 214, -227, 121, 61, -207, 242, -22, -220, 382, -194, -89, 317, -220, 33, 225, -300, 157, -12, -221, 233, -62, -84, 170, -190, 48, 221, -291, 201, 85, -200, 294, 13, -166, 257, -162, -53, 286, -168, 56, 85, -235, 184, 23, -220, 267, -135, -66, 304, -236, -51, 180, -203, 108, 69, -226, 242, -68, -73, 258, -209, -67, 183, -229, 56, 192, -298, 203, 9, -205, 197, -127, -149, 220, -198, 26, 177, -267, 213, 57, -246, 215, -1, -186, 251, -154, -68, 197, -240, 42, 79, -187, 225, 8, -172, 200, -78, -101, 247, -217, 46, 149, -225, 129, 55, -239, 139, -130, -119, 193, -174, 24, 265, -237, 103, 124, -201, 213, -29, -119, 163]
2910A63k75kK86k76J71M0l37L89j78j51M19l41o9M08l45J22J55l73K26L1k13L56
2932B06k49n3L42m10J18K33l28K10J22l75L35j36j49K92k10k1K68k84P9R5k64
2953a79K70o6j69L39k72o0L12l35J39K28l51K12L3k05J66k3j66K16k10R5J66l27
2975a87K93K3l31L09k6l51M54j46j69K17j07nL2j65L48j20k71M16k56j49M00k63
2997e4r1L32j70l3K7j11J32q3OK82m22R3K72l46J91K10l95J67O0k67K12L3l4N7
3021F8j73J68L3l59M23j8l09L76p2l39L03o4j45K28o2%j01o2J65j17l4L56k70
3044ej11K68k33q2K97j38OQ7j09J6j54J32J57k63J62K09n02J90K34l23K16O6j92
3067g2J24j21LR5j05K04kk32J84j7k00K17k6j02K04k07J2J60j60N1J41k32J93
$$ y = [163, -112, -114, 172, -104, 67, 107, -230, 159, -19, -170, 249, -92, -161, 247, -98, 24, 179, -194, 32, 63, -150, 206, -43, -96, 246, -164, -46, 187, -141, 69, 191, -184, 151, 15, -134, 158, -52, -73, 195, -89, -10, 85, -179, 91, 25, -144, 195, -77, -137, 175, -160, -21, 207, -144, 68, 101, -104, 62, 39, -127, 89, -121, -26, 140, -187, 106, 129, -202, 107, 81, -270, 184, 38, -131, 86, -21, -26, 6, -159, 189, 69, -202, 214, -42, -191, 209, -54, -145, 187, 17, -16, 11, -100, 32, -51, -45, 237, -185, -92, 180, -166, 25, 235, -160, 7, 67, -200, 12, 45, 11, 68, -105, 63, 96, -263, 160, 142, -167, 209, 137, -202, 101, 37, -108, 120, 58, 58, -43, -105, 60, -57, -91, 265, -5, -116, 152, -81, -163, 134, -4, 2, 89, -20, -4, -158, -26, 131, -132, 30, 239, -263, -73, 161, -162, 54, 120, -72, 52, -69, -66, 29, -76, 128, 126, -106, 78, 61, -139, 78, 52, -50, 154, -53, -41, 119, -41, 10, 151, -81, 112]
3090A12j17o5J46j64R5O4j85J52%k05K60l5k11J84k2j29K11k9Kj6q2J55k28o9
3114a76L36j41j75M31l03j80L70j68p8J78k4k6j56J04K13l87K05K60m68Q3K54
3135A52l21J36K76k27o7P3j3q8j04K24J00l19K97k2l45K60J47k70J69N9k36J19
3157@k9R8j8o5J77j57j62L19j98q3K83j39p9L3MkJ06r8J37j48k0J54k32J07J36
3182A24j76K3J27k16R2M0q5J40j08QR0j72J26L1q2Q1j6j63J95q6k4J94k42M7J08
$$ y = [112, -5, -70, 76, -88, 7, 71, -114, 38, 38, -167, 93, 58, -153, 31, 9, -120, 91, 62, 64, 48, -34, 121, -107, -176, 160, 19, -156, 275, -28, -208, 162, -6, -84, 94, 70, 44, -112, -8, 205, -182, 23, 283, -185, -102, 152, -169, -33, 243, 16, -51, 22, 9, -79, -183, 41, 141, -178, 119, 97, -248, 12, 159, -111, 58, 117, -119, 0, -29, 69, 51, -14, 163, 6, -156, 163, -35, -118, 165, 26, -53, -20, -16, -18, 88, -10, 127, -21, -41, 113, -119, -12, 124, -52, -29, 98, -118, -26, 14, -71, 69, -39, -31, 59, -113, 13, 44, -38, 43, 27, -136, 59, -27, -51, 143, -99, -52, 56]
$$ [...]
8191C8
##END NTUPLES=NMR FID
##END=
