##TITLE=1H_Pr NCS-Et-2
 CDCl3
 8 sc, 
 22.09.2022
##JCAMPDX= 6.0         $$ Bruker NMR JCAMP-DX V2.0
##DATA TYPE= NMR FID
##DATA CLASS= NTUPLES
##ORIGIN= UXNMR, Bruker Analytische Messtechnik GmbH
##OWNER= root
$$ XWIN-NMR		Version 3.5
$$ Thu Sep 22 15:47:07 2022 Russian Standard Time (UT+4h)  she@DPX200
##.OBSERVE FREQUENCY= 200.1313499994
##.OBSERVE NUCLEUS= ^1H
##.DELAY= (6, 6)
##.ACQUISITION MODE= SIMULTANEOUS
##.ACQUISITION SCHEME= undefined
##.AVERAGES= 8
##.DIGITISER RES= 18
##SPECTROMETER/DATA SYSTEM= spect
##.PULSE SEQUENCE= zg30
##.SOLVENT NAME= CDCl3
##.SHIFT REFERENCE= (INTERNAL, CDCl3, 0, 15.7039)
##AUDIT TRAIL= $$ (NUMBER, WHEN, WHO, WHERE, WHAT)
$$ ##TITLE= Audit trail, XWIN-NMR		Version 3.5
$$ ##JCAMPDX= 5.01
$$ ##ORIGIN= Bruker BioSpin GmbH
$$ ##OWNER= she
$$ F:/spectra/data/she/nmr/H-F/1/audita.txt
$$ ##AUDIT TRAIL=  $$ (NUMBER, WHEN, WHO, WHERE, WHAT)
(   1,<2022-09-22 15:46:10.46 +0400>,<she>,<DPX200>,
      <created by zg, POWCHK disabled, PULCHK disabled
       configuration hash MD5:
       00 E9 B6 7A A2 85 ED C7 34 08 36 98 17 FE 4E 26
       data hash MD5: 16K
       CC A4 9B 1A D8 A7 B0 EC 19 21 AD C1 BA 45 91 DF>)
$$ ##END=
$$ 
$$ hash MD5
$$ 2F BC CC 98 EA DD 55 50 15 36 8C E1 D7 65 FB 94
##$RELAX= 
##$RELAX= 
##$RELAX= 
##$RELAX= 
##$RELAX= 
##$RELAX= 
$$ Bruker specific parameters
$$ --------------------------
##$DU= <F:/spectra>
##$EXPNO= 1
##$NAME= <H-F>
##$PROCNO= 1
##$TYPE= <nmr>
##$USER= <she>
##$AMP= (0..31)
100 100 100 100 100 100 100 100 100 100 100 100 100 100 100 100 100 100 
100 100 100 100 100 100 100 100 100 100 100 100 100 100 
##$AQSEQ= 0
##$AQ_mod= 1
##$AUNM= <au_zg>
##$AUTOPOS= <>
##$BF1= 200.13
##$BF2= 200.13
##$BF3= 200.13
##$BF4= 200.13
##$BF5= 200.13
##$BF6= 200.13
##$BF7= 200.13
##$BF8= 200.13
##$BYTORDA= 1
##$CFDGTYP= 0
##$CFRGTYP= 5
##$CHEMSTR= <none>
##$CNST= (0..31)
1 1 145 1 1 1 1 1 1 1 1 1 1 1 1 1 1 1 1 1 1 1 1 1 1 1 1 1 1 1 1 1 
##$CPDPRG= <>
##$CPDPRG1= <>
##$CPDPRG2= <>
##$CPDPRG3= <>
##$CPDPRG4= <mlev>
##$CPDPRG5= <mlev>
##$CPDPRG6= <mlev>
##$CPDPRG7= <mlev>
##$CPDPRG8= <mlev>
##$CPDPRGB= <>
##$CPDPRGT= <>
##$D= (0..31)
0 1.2 0 0 0 0 0 0 0 0.06 0 0.03 0 0 0 0 0.0002 0 0 0 0 0 0 0 0 0 0 0 0 
0 0 0 
##$DATE= 1663847169
##$DBL= (0..7)
120 120 120 120 120 120 120 120 
##$DBP= (0..7)
150 150 150 150 150 150 150 150 
##$DBP07= 0
##$DBPNAM0= <>
##$DBPNAM1= <>
##$DBPNAM2= <>
##$DBPNAM3= <>
##$DBPNAM4= <>
##$DBPNAM5= <>
##$DBPNAM6= <>
##$DBPNAM7= <>
##$DBPOAL= (0..7)
0.5 0.5 0.5 0.5 0.5 0.5 0.5 0.5 
##$DBPOFFS= (0..7)
0 0 0 0 0 0 0 0 
##$DE= 6
##$DECBNUC= <off>
##$DECIM= 32
##$DECNUC= <off>
##$DECSTAT= 4
##$DIGMOD= 1
##$DIGTYP= 9
##$DL= (0..7)
0 120 120 120 120 120 120 120 
##$DP= (0..7)
150 150 150 150 150 150 150 150 
##$DP07= 0
##$DPNAME0= <>
##$DPNAME1= <>
##$DPNAME2= <>
##$DPNAME3= <>
##$DPNAME4= <>
##$DPNAME5= <>
##$DPNAME6= <>
##$DPNAME7= <>
##$DPOAL= (0..7)
0.5 0.5 0.5 0.5 0.5 0.5 0.5 0.5 
##$DPOFFS= (0..7)
0 0 0 0 0 0 0 0 
##$DQDMODE= 0
##$DR= 18
##$DS= 0
##$DSLIST= <SSSSSSSSSSSSSSS>
$$ [...]
##$SUBNAM2= <"">
##$SUBNAM3= <"">
##$SUBNAM4= <"">
##$SUBNAM5= <"">
##$SUBNAM6= <"">
##$SUBNAM7= <"">
##$SUBNAM8= <"">
##$SUBNAM9= <"">
##$SW= 18.0517283424941
##$SWIBOX= (0..15)
0 0 2 0 0 0 0 0 0 0 0 0 0 0 0 0 
##$SW_h= 3612.71676300578
##$TD= 16384
##$TD0= 1
##$TE= 0
##$TE2= 300
##$TE3= 300
##$TEG= 300
##$TL= (0..7)
0 120 120 120 120 120 120 120 
##$TP= (0..7)
150 150 150 150 150 150 150 150 
##$TP07= 0
##$TPNAME0= <>
##$TPNAME1= <>
##$TPNAME2= <>
##$TPNAME3= <>
##$TPNAME4= <>
##$TPNAME5= <>
##$TPNAME6= <>
##$TPNAME7= <>
##$TPOAL= (0..7)
0.5 0.5 0.5 0.5 0.5 0.5 0.5 0.5 
##$TPOFFS= (0..7)
0 0 0 0 0 0 0 0 
##$TUNHIN= 0
##$TUNHOUT= 0
##$TUNXOUT= 0
##$USERA1= <user>
##$USERA2= <user>
##$USERA3= <user>
##$USERA4= <user>
##$USERA5= <user>
##$V9= 5
##$VALIST= <valist>
##$VCLIST= <CCCCCCCCCCCCCCC>
##$VD= 0
##$VDLIST= <DDDDDDDDDDDDDDD>
##$VPLIST= <PPPPPPPPPPPPPPP>
##$VTLIST= <TTTTTTTTTTTTTTT>
##$WBST= 1024
##$WBSW= 4
##$XGAIN= (0..3)
0 0 0 0 
##$XL= 0
##$YL= 0
##$YMAX_a= 343158
##$YMIN_a= -411207
##$ZGOPTNS= <>
##$ZL1= 120
##$ZL2= 120
##$ZL3= 120
##$ZL4= 120
##$ABSF1= 10
##$ABSF2= 0
##$ABSG= 5
##$ABSL= 3
##$ALPHA= 0
##$AQORDER= 0
##$ASSFAC= 0
##$ASSFACI= 0
##$ASSFACX= 0
##$ASSWID= 0
##$AUNMP= <proc_1d>
##$AZFE= 0.1
##$AZFW= 0.1
##$BCFW= 1
##$BC_mod= 2
##$BYTORDP= 1
##$COROFFS= 0
##$CY= 11.3945322036743
##$DATMOD= 1
##$DC= 2
##$DFILT= <>
##$DTYPP= 0
##$F1P= 2.36226072786647
##$F2P= -0.459571619588291
##$FCOR= 0.5
##$FTSIZE= 0
##$FT_mod= 4
##$GAMMA= 1
##$GB= 0.15
##$INTBC= 1
##$INTSCL= 1
##$ISEN= 128
##$LB= 0.24
##$LEV0= 0
##$LPBIN= 0
##$MAXI= 10000
##$MC2= 0
##$MEAN= 0
##$ME_mod= 0
##$MI= 1.114404
##$NCOEF= 0
##$NC_proc= 0
##$NLEV= 6
##$NOISF1= 3.799351
##$NOISF2= 2.8
##$NSP= 1
##$NTH_PI= 0
##$NZP= 0
##$OFFSET= 15.70392
##$PC= 1
##$PHC0= -18039.79
##$PHC1= 18.80069
##$PH_mod= 1
##$PKNL= yes
##$PPARMOD= 0
##$PSCAL= 0
##$PSIGN= 0
##$REVERSE= no
##$SF= 200.130013532006
##$SI= 16384
##$SIGF1= 3
##$SIGF2= 2
##$SINO= 400
##$SIOLD= 16384
##$SREGLST= <1H.CDCl3>
##$SSB= 0
##$STSI= 0
##$STSR= 0
##$SW_p= 3612.71676300578
##$SYMM= 0
##$S_DEV= 0
##$TDeff= 0
##$TDoff= 0
##$TI= <>
##$TILT= no
##$TM1= 0
##$TM2= 0
##$TOPLEV= 0
##$USERP1= <user>
##$USERP2= <user>
##$USERP3= <user>
##$USERP4= <user>
##$USERP5= <user>
##$WDW= 1
##$XDIM= 8192
##$YMAX_p= 0
##$YMIN_p= 0
$$ End of Bruker specific parameters
$$ ---------------------------------
##NTUPLES= NMR FID
##VAR_NAME=  TIME,          FID/REAL,        FID/IMAG
##SYMBOL=    X,             R,               I
##VAR_TYPE=  INDEPENDENT,   DEPENDENT,       DEPENDENT
##VAR_FORM=  AFFN,          ASDF,            ASDF
##VAR_DIM=   8192,          8192,            8192
##UNITS=     SECONDS,       ARBITRARY UNITS, ARBITRARY UNITS
##FACTOR=    0.0002768,     1,               1
##FIRST=     0,             0,               0
##LAST=      2.2672688,     0,               0
##MIN=       0,             -411207,         0
##MAX=       2.2672688,     343158,          0
$$ Real data points
##PAGE= N=1
##DATA TABLE= (X++(R..R)), XYDATA
$$ plain form
0 0 0 0 0 0 0 0 0 0 0 0 -8 8 -8 8 -16 16 -22 24 -32 38 -48 56 -64 72 -88 104 -120 136 -160 182 -208 238
32 238 -270 305 -344 389 -437 488 -546 609 -679 755 -837 926 -1026 1133 -1250 1379 -1521
49 -1521 1673 -1846 2032 -2240 2470 -2731 3022 -3353 3732 -4174 4690 -5311 6067 -7019 8252
64 8252 -9923 12324 -16086 22859 -38811 159223 -73722 -403929 71670 290954 32927
75 32927 -189407 -54780 50388 78416 58000 -29730 -156618 -37466 193369 118786 -208589
86 -208589 -181191 163606 204481 -114058 -194139 33402 143111 22548 -71505 -63009 -5950
97 -5950 69240 80949 -51505 -123629 30018 146094 -4469 -120686 3423 81373 -6041
108 -6041 -17753 29932 -33711 -57273 69426 86836 -81402 -113609 69698 118718 -60134
$$ packed form
0@%%%%%%%%%%qJ6j6J6k4L2l8M6n6P0q6J04j20J36j60J92k24K56k96L42l90M46
32B38n08N75o49P33q26R25j034J155j288J434j592J763j952K159k383K629k900
49a521L194l519L878m272M710n201N753o375P085p906Q864j0001J1378j3086J5271
64H252j8175K2247k8410L8945o1670J98034k32945l30207M75599K19284k58027
75C2927k22334J34627J05168K8028k0416q7730j26888J19152K30835p4583l27375
86b08589K7398L44797M0875l18539q0081K27541J09709j20563r4053Q496N7059
97e950P5190J1709j32454p2124J53647J16076j50563j16217J24109P7950q7414
108f041j1712M7685o3643k3562J26699J7410j68238l2207J83307M9020j78852
$$ plain form
119 -60134 -115567 42554 79032 -45669 -35497 52903 -22200 -76195 65963 100414 -93601
130 -93601 -120967 103802 138366 -88054 -132307 69909 116455 -38845 -72772 22574 27079
141 27079 -6673 25492 6349 -66099 -15973 87840 28751 -95874 -48128 81783 51680
152 51680 -67443 -52474 38431 30383 -18935 -7407 -4475 -21517 20287 44215 -29517 -53168
164 -53168 36632 55501 -32648 -39786 37707 28862 -36978 -8385 46890 -2727 -51615 13480
176 13480 56386 -17946 -54577 16075 40410 -19058 -25309 16764 -1657 -27818 19062 36032
188 36032 -40049 -54084 47263 66501 -49184 -73502 41871 71383 -23959 -53130 8667
199 8667 33121 11369 308 -15930 -25441 19239 53031 -7364 -67019 -6981 72108 21864
$$ packed form
119f0134n5433J58121L6478j24701J0172Q8400p5103n3995J42158L4451j94015
130i3601k7366K24769L4564k26420m4253K02216M6546j55300l3927R5346M505
141B7079l3752L2165j9143p2448N0126J03813n9089j24625M7746J29911l0103
152E1680j19123J4969R0905q048m9318J1528K932j7042M1804K3928p3732k3651
164e3168Q9800J8869q8149p138P7493q845o5840K8593N5275m9617m8888O5095
176A3480M2906p4332l6631P0652K4335n9468o251M2073j8421k6161M6880J6970
188C6032p6081j4035J01347J9238j15685k4318J15373K9512r5342k9171O1797
199H667K4454k1752j1061j6238r511M4680L3792o0395n9655O0038P9089n0244
$$ plain form
211 21864 -66906 -35066 47700 34722 -28493 -32638 -76 14321 17399 2190 -34499 -25003 38733
224 38733 41555 -36884 -50943 30526 53786 -17817 -42315 11095 30972 704 -9055 -598 -4466
237 -4466 3089 20794 2687 -28244 -8231 31487 11897 -33213 -16465 26266 10984 -24679
249 -24679 -8637 14658 -3082 -12954 8431 5985 -17042 -3695 20782 828 -20385 3405
261 3405 20667 -3133 -12684 9235 10914 -8231 -1555 14358 -325 -14028 4700 16767 -5743
274 -5743 -17872 5075 15174 -7665 -15820 4466 8301 -9037 -6038 5781 -3755 -8908 7830
287 7830 6608 -14874 -7024 18674 7510 -17957 -4379 19436 6909 -12522 -1993 11686 3705
300 3705 -3510 1286 1211 -2476 3884 6710 -6575 -11449 6414 12633 -8912 -17888 5191 14334 -7355
$$ packed form
211B1864q8770L1840Q2766j2978o3215m145L2562J4397L078j5209l6689R496O3736
224C8733K822p8439j4059Q1469K3260p1603k4498N3410J9877l0268r759Q457l868
237d466P555J7705j8107l0931K0013L9718j9590m5110J6748M2731j5282l5663
249b4679J6042K3295j7740r872K1385k446k3027J3347K4477j9954k1213K3790
261C405J7262k3800r551K1919J679j9145O676J5913j4683j3703J8728J2067k2510
274e743j2129K2947J0099k2839q155K0286L835j7338K999J1819r536n153J6738
287G830j222k1482P850K5698j1164k5467J3578K3815j2527j9431J0529J3679p981
300C705p215M796p5l687O360K826j3285m874J7863O219k1545q976K3079R143k1689
$$ plain form
315 -7355 -15459 2858 7877 -4264 -3907 1798 -2460 -527 8432 1840 -9428 683 14188 3014
329 3014 -10469 -720 12159 4738 -7156 -2114 6389 2742 -3744 -1696 799 -2185 -561 1597
343 1597 -3975 -6791 2413 5308 -7153 -8622 5143 5939 -6889 -5822 5048 3896 -2375 -480
357 -480 2379 503 2049 4504 -355 -3007 3065 7079 426 -5537 -288 6543 2443 -5611 -3380
372 -3380 2453 1449 -2577 -1782 -2479 -4397 914 4173 -4695 -9062 1805 7880 -863 -7668 -1353
387 -1353 5385 4954 357 -3834 -1908 5781 7994 9 -6445 -1434 8002 7805 -2627 -9908 -947
402 -947 10614 5460 -8836 -10377 1794 10047 2266 -12009 -12132 5807 13606 -3318 -16278 -4039
416 -4039 11359 8027 -5123 -9817 -2492 10040 11860 -3225 -13440 -1238 16909 11428 -11005
$$ packed form
315g355q104J8317N019j2141L57N705m258J933Q959o592j1268J0111J3505j1174
329C014j3483R749J2879p421j1894N042Q503l647o486K048K495k984J624K158
343A597n572k816R204K895j2461j469J3765P96j2828J067J0870j152o271J895
357d80K859j876J546K455m859k652O072M014o653n963N249O831m100q054K231
372c380N833j004m026P95o97j918N311L259q868m367J0867O075q743o805O315
387a353O738m31m597m191J926P689K213p985o454N011R436j97j0432p281Q961
402i47J1561n154j4296j541J2171Q253p781j4275j23J7939P799j6924j2960J2239
416d039J5398l332j3150m694P325J2532J820j5085j0215J2202J8147n481k2433
$$ plain form
429 -11005 -15517 6646 20519 2334 -18610 -9182 13709 12373 -7771 -13907 -3305 7044 7619
442 7619 -2433 -14079 -8814 10802 14030 -7240 -19438 -2594 19029 11867 -13822 -17527 8787
455 8787 22375 1559 -17047 -5218 12894 11476 -1173 -8791 -5700 5146 11981 3220 -12588
468 -12588 -12237 7582 17993 -1951 -24117 -9644 20546 14623 -18029 -21074 8308 18109 -2487
481 -2487 -13146 -3986 4092 6301 6936 -2015 -13341 -2693 19705 15020 -15760 -21294 12464 29637
495 29637 -1904 -29209 -5268 24945 11264 -16604 -14188 4548 9563 3514 -4750 -11765 -8012
508 -8012 9511 15002 -6612 -23587 -3791 25392 13830 -22969 -22463 16522 28673 -4739 -25842
521 -25842 -2365 21953 11341 -10259 -10218 2312 8253 7370 1039 -10040 -11318 7966 20340 -2815
$$ packed form
429a1005m512K2163J3873j8185k0944R428K2891j336k0144o136J0602J0349N75
442G619j0052j1646N265J9616L228k1270j2198J6844K1623p162k5689l705K6314
455H787J3588k0816j8606J1829J8112j418j2649p618L091J0846O835q761j5808
468a2588L51J9819J0411j9944k2166J4473L0190n923l2652l045K9382R801k0596
481b487j0659R160Q078K209O35q951j1326J0648K2398m685l0780n534L3758J7173
495B9637l1541k7305K3941L0213j3681k7868K416J8736N015o049q264p015L753
508h012J7523N491k1614j6975J9796K9183j1562l6799N06L8985J2151l3412k1103
521b5842K3477K4318j0612k1600M1J2530N941q83o331j1079j278J9284J2374k3155
$$ plain form
535 -2815 -28933 -7519 28503 13128 -27923 -21593 18111 20357 -10691 -18424 1106 10387 3212
548 3212 279 -1848 -8606 -1730 17262 13001 -17448 -19506 17713 29462 -9079 -30440 1766
561 1766 28479 6696 -20656 -12739 9673 12373 -466 -10573 -9454 261 10164 6637 -10354
574 -10354 -17630 1526 21544 6564 -23084 -15991 19469 23549 -10810 -24810 3639 25521 7509
587 7509 -17356 -10334 11333 13108 -1022 -7811 -4397 1162 8031 7973 -8476 -17570 3389 21844
601 21844 567 -25077 -8472 20526 10420 -17049 -13940 8851 11990 -3687 -8413 -168 3571
614 3571 2158 3724 1146 -6596 -2508 11101 8377 -8491 -8988 7533 11606 -2926 -10146 -701
628 -701 7348 2989 -4554 -4460 -776 1731 509 -1238 -3109 -3681 58 4988 1340 -7130 -5490 6125
$$ packed form
535b815k6118K1414L6022j5375m1051O330L9704K246l1048p733J9530R281p175
548C212k933k127o758O876J8992m261l0449k058L7219J1749l8541k1361L2206
561A766K6713k1783k7352P917K2412K700j2839j0107J119R715R903l527j6991
574a0354p276J9156K0018j4980k9648P093L5460M080l4359j4000K8449K1882j8012
587G509k4865P022K1667J775j4130o789L414N559O869n8j6449r094K0959J8455
601B1844k1277k5644J6605K8998j0106k7469L109K2791L139j5677m726Q245L739
614C571j413J566k578p742M088J3609k724j6868m97J6521M073j4532p220R445
628g01Q049m359p543R4L684K507j222j747j871n72L739M930l648q470J640J1615
$$ plain form
644 6125 8176 -3277 -8472 1427 9623 3336 -5894 -3116 5620 5635 -316 -2589 -537 552 3081
659 3081 3342 -3371 -6764 1942 7655 -1556 -10035 -2479 7183 2864 -6762 -5657 2380 3900 -913
674 -913 -3289 -1296 1330 2270 1349 -815 -1587 1192 4512 2121 -2406 -780 3511 2831 -444 -918 235
691 235 844 1136 -131 -2223 -1934 421 575 -813 -2130 -2424 -566 1140 -106 -2819 -2164 1313 2713
708 2713 -599 -2620 -406 3335 2867 -1047 -2092 1535 4415 1945 -1684 -1538 1861 3774 942 -3181
724 -3181 -2332 2720 3049 -2593 -4586 -254 2490 -176 -3549 -2919 222 2522 -494 -3966 -1589 2451
740 2451 2516 -1337 -1994 506 3317 2230 -1275 -1305 2566 3885 354 -1885 381 2775 1111 -1242
756 -1242 -1615 387 1606 -288 -2511 -2069 324 642 -2059 -2304 -750 489 85 -1374 -1799 306 1763
$$ packed form
644F125K051j1453n195R899Q196o287r230K778Q736J5n951k273K052J089K529
659C081K61o713l393Q706N713r211q479P556R662m319r626J105Q037J520m813
674i13k376J993K626R40r21k164p72K779L320k391m527J626M291o80l275m74J153
691B35O09K92j267k092K89K355J54j388j317k94J858J706j246k713O55L477J400
708B713l312k021K214L741m68l914j045L627K880k470l629J46L399J913k832m123
724c181Q49N052L29n642j993M332K744k666l373O30L141K300l016l472K377M040
740B451O5l853o57K500K811j087l505l0L871J319l531k239K266K394j664k353
756a242l73K002J219j894k223M42K393L18k701k45J554J239m04j459m25K105J457
$$ plain form
773 1763 -85 -1091 779 2006 931 70 522 1336 1517 995 -15 31 1392 981 -626 -402 -70 -135
791 -135 -213 -1084 -1430 -696 -181 -1192 -1915 -983 223 -542 -970 -468 -15 460 160 -147 248 1270 765 585
811 585 1242 881 798 1029 1151 293 407 1173 557 -1034 -304 331 -487 -999 -732 -809 -1108 -994 -650 -1029 -1300
832 -1300 -481 -68 -120 -1265 -649 1075 1246 -319 -484 1424 1547 715 453 85 533 2070 1548 -1235
850 -1235 -1411 1354 1842 -862 -1728 -53 731 122 -1411 -2104 -978 542 -59 -1728 -2517 -504 2245
867 2245 494 -2512 -1484 2206 2311 -588 -1189 902 2119 1691 664 -867 -461 2573 2750 -1308
883 -1308 -2340 1447 2544 -993 -2251 -743 119 -407 -524 -846 -2568 -1132 1613 956 -3368 -2874 2579
900 2579 3263 -2322 -3294 2178 3234 -822 -1202 1841 853 -62 2413 2283 -2054 -1724 3813 3359 -3204
$$ packed form
773A763j848j006J870J227j075q61M52Q14J81n22j010M6J361m11j607K24L32o5
791a35p8q71l46P34N15j011p23R32J206p65m28N02M53M75l00l07L95J022n05j80
811E85O57l61q3K31J22q58J14P66o16j591P30O35q18n12K67p7k99J14L44l79k71
832a300Q19M13n2j145O16J724J71j565j65J908J23q32k62l68M48J537n22k783
850a235j76K765M88k704q66J675P84o09j533o93J126J520o01j669p89K013K749
867B245j751l006J028L690J05k899o01K091J217m28j027j531M06L034J77m058
883a308j032L787J097l537j258J508Q62n26j17l22j722J436K745o57m324M94N453
900B579O84n585r72N472J056m056l80L043r88r15K475j30m337L30N537m54o563
$$ plain form
917 -3204 -3916 2352 3881 -1551 -4356 -720 1975 -74 -2068 -2053 -810 193 755 -200 -2246 -1244
933 -1244 1930 2273 -643 -1756 -86 2910 3058 -616 -3248 1342 5891 1612 -5015 -1028 5526 1971
949 1971 -4190 -1423 2657 -73 -2466 1008 1024 -4308 -2832 4479 2007 -7008 -4301 6574 4129
964 4129 -7468 -4779 6408 4778 -4965 -2417 4792 2140 -2701 1401 4189 -1755 -2728 4195 4592
979 4592 -3611 -4639 3638 4999 -2862 -5806 509 4335 -711 -4703 -1674 1471 582 -1759 -1605 -542
995 -542 223 -296 461 579 -658 -1397 1776 4148 -662 -4933 1775 7828 326 -7215 674 8416 473
1012 473 -6931 280 6104 -1048 -5521 1481 3288 -4697 -4020 5188 2614 -8227 -4118 7726 3021
1027 3021 -8546 -3613 7582 3160 -6678 -1996 6450 1541 -4148 1023 4213 -887 -2396 3615
$$ packed form
917c204p12O268J529n432k805L636K695k049j994J5J243J003N62r55k046J002
933a244L174L43k916j113J670K996J48l674k632M590M549m279o627L987O554l555
949A971o161K767M080k730k393L474J6n332J476P311k472r015K707J0875k445
964D129j1597K689J1187j630r743K548P209k652m841M102K788n944r73O923L97
979D592q203j028Q277J361p861k944O315L826n046l992L029L145q89k341J54J063
995e42P65n19P57J18j237p39L173K372m810m271O708O053p502p541P889P742p943
1012D73p404P211N824p152m473P002J807p985O77R208k574j0841M109J1844m705
1027C021j1567M933J1195m422r838M682Q446m909n689N171L190n100j509O011
$$ plain form
1041 3615 3567 -2935 -2689 3668 3191 -2794 -3433 1588 2840 -997 -2876 -1805 610 977 -1418 -2934
1057 -2934 -185 1833 -800 -2307 867 1784 -1861 -313 4086 882 -4306 1099 6691 431 -6047
1072 -6047 906 7465 -111 -6294 681 5950 -1463 -4891 1799 3279 -3889 -3332 3990 1261 -6222
1087 -6222 -1659 5735 71 -7243 -700 5964 -289 -4915 548 4034 -789 -1862 2087 1959 -1824
1102 -1824 600 3169 142 -2494 1118 2769 -949 -1976 1151 1125 -975 -301 349 -1751 -1190 1570
1118 1570 -340 -3546 -729 2691 -289 -3807 320 2646 -1175 -2143 2255 2022 -2447 -332 3838
1133 3838 636 -3289 1014 4560 -551 -3349 1864 3542 -1811 -2791 2320 1776 -2847 -1235 2829
1148 2829 -650 -4165 358 3039 -2569 -3720 1875 2457 -2702 -2300 2665 1150 -2404 130 2883
$$ packed form
1041C615m8o502K46O357m77n985o39N021J252l837j879J071K415L67k395j516
1057b934K749K018k633j507L174R17l645J548M399l204n188N405N592o260o478
1072f047O953O559p576o183O975N269p413l428O690J480p168N57P322k729p483
1087f222M563P394n664p314O543O664o253m626N463L486m823j073L949j28l783
1102a824K424K569l027k636L612J651l718j027L127k6k100O74O50k100N61K760
1118A570j910l206K817L420k980l518M127K326l821r68M398k33m469K115M170
1133C838l202l925M303L546n111k798N213J678n353r80N111n44m623J612M064
1148B829l479l515M523K681n608j151N595N82n159M02M965j515l554K534K753
$$ plain form
1163 2883 -698 -2055 2631 3083 -1966 -1490 3343 2040 -2174 -440 2711 92 -2298 571 1739
1178 1739 -1718 -1826 1472 248 -3011 -836 2125 -446 -3317 106 2295 -1311 -1987 1820 1249 -1619
1194 -1619 55 2931 -146 -1960 1371 2796 -675 -1816 2358 2196 -1863 -772 2564 291 -2765
1209 -2765 221 2343 -1468 -2868 1175 1464 -2714 -2127 1856 758 -3196 -722 2391 -426 -2533
1224 -2533 985 2421 -1216 -1418 2611 1694 -1793 -37 3023 1005 -1844 247 2475 -500 -1593
1239 -1593 1325 1100 -1928 -1140 1713 -347 -2641 -190 1650 -1508 -2226 821 1192 -1970 -1064 1460
1255 1460 167 -1529 497 2205 -324 -1106 2084 1888 -1038 -274 2353 1230 -1384 -193 1856 -216
1271 -216 -1533 336 1302 -1553 -1608 917 317 -2233 -958 1336 -515 -2258 88 1474 -1244 -1491
$$ packed form
1163B883l581j357M686M52n049M76M833j303m214J734L151k619k390K869J168
1178A739l457j08L298j224l259K175K961k571k871L423K189l606o76L807n71k868
1194a619J674K876l077j814L331J425l471j141M174j62m059J091L336k273l056
1209b765K986K122l811j400M043K89m178N87L983j098l954K474L113k817k107
1224b533L518J436l637k02M029r17l487J756L060k018k849K091K228k975j093
1239a593K918k25l028P88K853k060k294K451J840l158p18L047L71l162R06K524
1255A460j293j696K026J708k529p82L190j96k926P64K627j123k614J191K049k072
1271b16j317J869R66k855n5K525o00k550J275K294j851j743K346J386k718k47
$$ plain form
1287 -1491 1235 1310 -1471 -252 2130 762 -1336 680 2206 398 -783 1354 1329 -936 -683 1282
1303 1282 276 -1360 -389 1013 -486 -1934 -39 551 -1089 -1508 309 -177 -1159 -434 705 -484
1319 -484 -723 670 891 -501 -166 1359 1026 -113 233 1268 594 1 673 779 -534 -79 918 235
1337 235 -1291 -423 916 -380 -1747 -380 579 -567 -1138 62 -127 -1030 -216 719 -249 -1082 243
1354 243 1205 195 -550 611 1293 487 291 375 631 630 510 163 -36 -144 226 34 -279 -661 -100 -8 -812
1375 -812 -874 -416 -604 -515 -30 -464 -811 -43 655 199 -745 342 857 533 -279 73 867 690 -117 201
1395 201 648 560 153 189 215 -501 -412 554 440 -888 -979 -45 594 -481 -1327 -365 544 -142 -1030 -532 666
1416 666 109 -351 98 536 -77 -20 752 987 -537 -192 1356 1201 -754 -662 1077 1063 -530 -1198 182
$$ packed form
1287a491K726P5k781J219K382j368k098K016J526j808j181K137k5k265K53J965
1303A282j006j636R71J402j499j448J895N90j640m19J817m86r82P25J139j189
1319d84k39J393K21j392L35J525l33j139L46J035o74n93O72J06j313M55R97o83
1337B35j526Q68J339j296j367J367R59j146n71J200j89r03Q14R35r68q33J325
1354B43R62j010p45J161O82q06j96Q4K56jj20l47j99j08L70j92l13l82N61R2q04
1375h12o2M58j88Q9M85m34l47P68O98m56r44J087N15l24q12L52P94j77q07L18
1395B01M47q8m07L6K6p16Q9R66j14j328r1R34O39j075q46R62R09o86q88M98J198
1416F66n57m60M49M38o13N7P72K35j524L45J548j55j955R2J739j4j593o68J380
$$ plain form
1435 182 766 -691 -1189 2 93 -747 -919 303 -135 -880 -493 1080 96 -1098 -626 1450 1135 -949
1453 -949 -947 1445 1675 -649 -1040 1712 1503 -883 -493 1339 507 -1069 -83 1078 -225 -2170 -465
1470 -465 1360 -629 -2734 -829 1831 -313 -2468 -227 1821 -324 -1955 453 1676 -322 -851
1485 -851 1160 1446 -735 -414 1829 1372 -632 -928 1482 1813 -856 -1602 701 1112 -754 -1433 96
1502 96 508 -947 -1363 -43 46 -1036 -1181 414 663 -1486 -795 1419 1410 -1161 -1311 1846 1846 -800 -1130
1521 -1130 1778 1450 -862 -703 1715 1233 -1305 -433 1546 244 -1830 -314 1573 -450 -2374 357
1537 357 1922 -1061 -2424 347 1604 -514 -1559 520 1172 -778 -632 969 743 -511 137 1169
1553 1169 884 -608 -32 1370 762 -297 -302 762 565 -426 -769 -247 295 -173 -663 -546 124 -354 -874
$$ packed form
1435A82N84j457m98J191R1q40j72J222m38p45L87J573r84j194M72K076l15k084
1453i49KK392K30k324l91K752k09k386L90J832q32j576R86J161j303j945J705
1470d65J825j989k105J905K660k144k155K241K048k145j631K408J223j998n29
1485h51K011K86k181L21K243m57k004k96K410L31k669p46K303M11j866o79J529
1502I6M12j455m16J320Q9j082j45J595K49k149O91K214rk571j50L157%k646l30
1521a130K908l28k312J59K418m82k538Q72J979j302k074J516J887k023j924K731
1537C57J565k983j363K771J257k118j045K079O52j950J46J601k26j254O48J032
1553A169k85j492N76J402o08j059nJ064j97r91l43N22N42m68m90J17O70m78n20
$$ plain form
1572 -874 -410 328 -310 -1023 408 736 -704 -656 1257 1425 -713 -857 1526 1447 -738 -191 1705 544
1590 544 -859 -146 1029 -241 -1463 319 849 -1255 -1868 398 844 -1590 -1470 693 306 -1488 -995
1607 -995 963 59 -868 -86 645 -513 -570 1132 608 -486 -13 1213 546 -362 179 618 180 -136 421
1626 421 218 -805 -31 370 -274 -898 41 312 -800 -872 285 -42 -917 -242 643 -360 -582 548 944
1645 944 -500 -726 1481 923 -816 272 1257 141 -545 323 1228 -324 -968 722 831 -835 -1038
1662 -1038 812 433 -1379 -692 776 -397 -1499 -66 576 -877 -1093 725 569 -672 -336 1006
1678 1006 424 -463 540 1008 137 -266 699 595 -359 -69 612 -198 -475 263 623 -323 -818 447 73
1697 73 -1073 -563 404 -359 -1158 1 785 -637 -735 717 707 -817 -66 1321 538 -931 248 1396
$$ packed form
1572h74M64P38o38p13J431L28j440M8J913J68k138j44K383p9k185N47J896j161
1590E44j403P13J175j270j222J782N30k104o13K266M46k434J20K163l87j794M93
1607i95J958r04r27P82P31j158n7J702n24j094M73J226o67r08N41M39m38l16N57
1626D21k03j023P74M01o44o24R39K71j112p2J157l27q75O75Q85j003k22J130L96
1645I44j444k26K207n58j739J088R85j116o86Q68R05j552o44J690J09j666k03
1662a038J850l79j812O87J468j173j102J433O42j453k16J818j56j241L36J342
1678A006n82q87J003M68q71m03R65j04r54K90O81q10k77P38L60r46m95J265l74
1697G3j146N10R67p63p99J159P84j422r8J452j0j524P51J387p83j469J179J148
$$ plain form
1715 1396 320 -664 870 926 -434 -368 1002 393 -934 -167 575 -90 -1296 -157 439 -700 -711 333
1733 333 -133 -1117 -278 500 -130 -693 130 1002 -135 -116 579 857 -294 78 707 515 -632 221 899
1752 899 -173 -739 420 776 -562 -617 481 165 -1120 -457 275 -486 -969 204 332 -801 -430 852
1770 852 279 -450 -91 1053 140 -314 475 1106 -181 177 1166 575 -380 125 934 125 -738 150 945
1789 945 -639 -1016 361 406 -1169 -605 264 -289 -1284 55 580 -354 -912 432 575 -296 -320 869 602
1808 602 -311 13 910 463 -454 302 1154 -75 -456 601 500 -527 -201 785 -303 -897 -199 309 -333
1827 -333 -428 320 71 -723 -92 484 -232 -708 103 926 -375 -186 871 590 -544 305 1145 134 -546
1846 -546 307 906 -132 -1013 465 666 -852 -904 459 131 -1121 -247 643 -360 -1108 41 446 -575
$$ packed form
1715A396j076r84J534N6j360O6J370o09j327P67P42o65j206J139N96j139j1J044
1733C33m66r84Q39P78o30n63Q23Q72j137J9O95K78j151L72O29j92j147Q53O78
1752H99j072n66J159L56j338n5J098l16j285O63P32p61m83J173J28j133L71J282
1770H52n73p29L59J144r13m54P89O31j287L58R89n91r55N05Q09q09q63Q88P95
1789I45j584l77J377M5j575N64Q69n53r95J339N25r34n58J344J43q71k4J189k67
1808F02r13L24Q97m47r17P56Q52j229l81J057j01j027L26R86j088n94O98N08o42
1827c33r5P48k49p94O31N76p16m76Q11Q23j301J89J057k81j134Q49Q40j011o80
1846e46Q53N99j038q81J478K01j518n2J363l28j252Q74Q90j003p48J149M05j021
$$ plain form
1864 -575 -601 504 663 -513 -453 529 404 -430 264 459 54 9 645 342 -211 237 681 100 -744 -4
1884 -4 399 -336 -469 193 44 -749 -305 163 -297 -1159 102 642 -895 -739 313 711 -187 -380 624
1903 624 704 -396 25 964 548 -358 44 765 323 -487 360 440 -154 -532 -153 247 -204 -565 -255 -371
1923 -371 -405 -362 -352 -338 -318 -216 -281 10 484 210 -264 456 417 -102 23 801 833 -190 -407 368 803 -309
1945 -309 -209 496 586 -657 -272 437 -180 -841 -496 448 -141 -929 -401 447 -246 -882 174 476 -17 -762
1965 -762 -245 748 -47 -512 176 956 290 -259 556 934 85 -386 432 599 -285 -560 257 523 -763 -547
1985 -547 251 354 -879 -796 434 251 -415 -436 248 -87 -588 -370 582 316 -717 -102 935 332 -430
2004 -430 19 1028 234 -73 262 504 -40 -258 -2 375 116 -356 -245 293 -346 -676 -365 173 357 -759
$$ packed form
1864e75k6J105J59j176O0R82j25q34O94J95m05m5O36l03n53M48M44n81q44P40
1884dM03p35j33O62j49p93M44M68m60q62J261N40j537J56J052L98q98j93J004
1903F24Q0j100M21R39m16r06M02P21m42q10Q47Q0n94l78L79M00m51l61L10j16
1923c71l4M3J0J4K0J02o5K91M74k74m74P20l9n19J25P78L2j023k17P75M35j112
1945c09J00P05R0j243L85P09o17o61L45R44n89p88N28Q48o93o36J056L02m93p45
1965g62N17R93p95m65O88P80o66n49Q15L78q49m71Q18J67q84k75Q17K66j286K16
1985e47P98J03j233Q3J230j83o66k1O84l35n01K18R52k66j033O15J037o03p62
2004d30M49J009p94l07L35K42n44k18K56L77k59m72J11N38o39l30L11N38J84j116
$$ plain form
2024 -759 -369 305 -28 -784 -63 511 149 -581 181 893 -102 -395 374 848 -196 -749 692 983 -454
2043 -454 -451 705 604 -665 -456 368 202 -963 -463 353 -292 -722 49 487 -228 -676 188 472 -42 -53
2063 -53 344 651 -184 -44 254 621 -111 290 173 103 67 534 4 259 153 -13 -318 111 52 -519 -426 83
2085 83 123 -497 -676 399 -260 -535 -355 533 132 -657 198 1050 -167 -711 596 882 -394 -284 857
2104 857 566 -470 -101 846 176 -655 -284 540 100 -1013 -271 412 -565 -609 94 276 -468 -343 341 68
2124 68 -341 -152 292 276 203 155 440 -52 202 725 121 39 353 111 66 -296 511 179 -466 -14 175 -482
2146 -482 -488 -109 190 -715 -741 353 36 -633 -366 581 -81 -472 201 1052 118 -312 452 846 -297 -152
2166 -152 593 501 84 -66 512 -120 -735 -28 508 -136 -536 -154 -67 -472 -230 176 -34 -385 166 141 -350
$$ packed form
2024g59L90O74l33p56P21N74l62p30P62P12r95k93P69M74j044n53J441K91j437
2043d54LJ156j01j269K09Q24j66j165N00Q16o45m30P71M38p15m48Q64K84n14j1
2063e3L97L07q35J40K98L67p32M01j17p0l6M67n30K55j06j66l05M29n9n71R3N09
2085H3M0o20j79J075o59k75J80Q88m01p89Q55Q52j217n44J307K86j276J10J141
2104H57k91j036L69R47o70q31L71Q24m40j113P42O83r77m4P03J82p44J25O84k73
2124F8m09J89M44j6p3m8K85m92K54N23o04q2L14k42m5l62Q07l32o45M52J89o57
2146d82oL79K99r05k6J094l17o69K67R47o62l91O73Q51r34m30P64L94j143J45
2166a52P45r2m17j50N78o32o15P07N36o44m00L82Q7m05K42M06k10l51N51k5m91
$$ plain form
2187 -350 -432 339 540 -299 -6 188 -11 -92 653 410 -131 -84 605 139 -384 59 529 100 -543 -16 678
2208 678 -296 -711 216 266 -480 -549 425 48 -893 -318 620 -173 -624 141 619 -70 -388 83 338 -218 233
2229 233 533 206 -57 221 544 -134 -216 354 163 -63 -296 125 -142 -547 -46 83 -741 -365 41 309
2249 309 -848 -526 372 -1 -449 61 459 1 -367 460 410 96 9 584 373 -241 137 610 239 -425
2269 -425 176 160 -141 -655 80 -45 -557 -428 171 -279 -229 147 362 -418 -151 -68 184 -57 -15 432 411 -70
2291 -70 150 569 -163 -105 366 650 -193 -2 446 109 -419 52 408 -172 -372 255 93 -353 -203 261 -253
2312 -253 -634 -124 182 148 -353 138 90 -104 -165 223 223 -1 -140 322 352 117 349 242 -283 -69 522 -71
2334 -71 -451 -78 48 -222 -288 113 -266 -242 -184 86 -254 -457 -380 97 -73 -201 85 407 -200 -114 71 453
$$ packed form
2187c50q2P71K01q39K93J94j99q1P45k43n41M7O89m66n23M43M70m29o43N27O94
2208F78r74m15R27N0p46o9R74l77r41N75R38p93m51P65M78o89l18M71K55n56M51
2229B33L00l27k63K78L23o78q2N70j91k26k33M21k67m05N01J29q24L76M06K68
2249C09j157L22Q98l73m48N10L98m58l68Q27n0l14q7N75k11o14L78M73l71o64
2269d25O01j6l01n14P35j25n12J29N99m50N0L76K15p80K67Q3K52k41M2M47k1m81
2291g0K20M19p32N8M71K84q43J91M48l37n28M71L56n80k00O27j62m46J50M64n14
2312b53l81N10L06l4n01M91m8j94o1L88%k24j39M62L0k35K32j07n25K14N91n93
2334g1l80L73J26k70o6M01l79K4N8K70l40k03P7M77j70j28K86L22o07Q6J85L82
$$ plain form
2356 453 72 -112 233 325 60 108 204 437 -197 -6 225 -143 -234 75 -116 -266 -48 43 21 -187 21 -154
2378 -154 -169 -116 12 -12 -106 -151 146 -50 3 445 -47 307 398 320 -60 22 256 440 8 -400 148 364 -234
2401 -234 -487 171 165 -485 -284 -48 128 -337 -205 -134 -52 -479 -85 256 -142 -448 -55 232 35 -225 145
2422 145 218 200 5 255 337 -32 86 -154 41 -274 -12 138 125 -374 -284 98 89 -221 -409 -9 -1 -58 -219
2445 -219 -269 128 -209 0 -41 241 196 -111 87 251 -52 -265 623 249 -41 -239 322 412 -179 -409 82
2466 82 129 7 -222 -18 323 -453 -48 46 -71 -117 -247 202 -213 -150 -40 88 97 -117 197 582 176 -111
2488 -111 119 411 492 -321 -89 295 296 -242 -240 320 -140 -84 -117 92 84 -559 120 234 -209 -563 -202 493 -71
2511 -71 -290 6 15 190 -141 157 311 105 35 198 271 125 -95 171 323 23 -290 36 296 -161 -270 78
$$ packed form
2356D53l81j84L45R2k65M8R6K33o34J91K31l68r1L09j91j50K18R1k2k08K08j75
2378a54j5N3J28k4r4m5K97j96N3M42m92L54R1p8l80Q2K34J84m32m08N48K16n98
2401b34k53O58oo50K01K36J76m65J32P1Q2m27L94L41l98l06L93K87j97k60L70
2422A45P3j8j95K50Q2l69J18k40J95l15K62J50j3m99R0L82rl10j88M00Qn7j61
2445b19n0L97l37K09m1K82m5l07J98J64l03k13Q88l74k90j98N61R0n91k30M91
2466H2M7j22k29K04L41p76M05R4j17m6j30M49m15O3J10J28Rk14L14L85m06k87
2488a11K30K92Q1q13K32L84Jn38KN60m60N6l3K09qo43O79J14m43l54L61O95n64
2511g1k19K96RJ75l31K98J54k06p0J63P3j46k20K66J52l00l13L26K60m57j09L48
$$ plain form
2533 78 -1 201 -130 -26 -59 -64 -326 -68 103 -108 -297 75 381 -329 -211 88 367 -136 88 366 285 -28
2555 -28 164 346 378 -162 -155 -70 87 -289 -135 196 -191 -122 -245 168 -47 -79 -145 24 -294 -143 -269 -75 -37
2578 -37 -43 -174 116 336 -94 -333 154 271 162 -155 152 136 -212 -429 -14 287 -273 -276 351 -32 -278 -106
2600 -106 81 -89 -279 -71 272 -331 -294 229 134 -215 -275 474 110 -227 319 165 269 22 -143 299 194
2621 194 -303 76 298 -4 -207 -133 -65 -167 -142 -116 -92 -87 177 -81 -102 -162 -73 -353 -91 30 128 -84 123 441
2645 441 -14 110 186 636 -37 -31 -13 287 68 -237 36 62 -312 -269 119 -81 -557 -156 319 -364 -342 -222
2667 -222 245 -304 -501 -184 142 -323 -278 90 -131 -84 159 315 151 68 26 351 154 -47 246 201 4 70
2689 70 -49 -190 -228 71 -141 -309 48 -19 26 -455 -14 241 -79 -308 142 -47 -105 51 90 154 -270 77
$$ packed form
2533G8p9K02l31J04l3nk62K58J71k11j89L72L06p10J18K99K79n03K24K78q1l13
2555b8J92J82L2n40PQ5J57l76J54L31l87O9j23M13k15l2o6J69l18J51j26J94L8
2578c7oj31K90K20m30k39M87J17j09l17L07j6l48k17M15L01n60lO27l83k46J72
2600a06J87j70j90K08L43o03L7N23r5l49o0P49l64l37N46j54J04k47j65M42j05
2621A94m97L79K22l02k03P4O8j02K5K6K4NK64k58k1o0Q9k80K62J21R8k12K07L18
2645D41m55J24P6M50o73OJ8L00k19l05K73K6l74M3L88k00m76M01M75o83K2J20
2667b22M67n49j97L17L26m65M5L68k21M7K43J56j64q3m2L25j97k01K93m5j97O6
2689G0j19j41l8K99k12j68L57o7M5m81M41K55l20k29M50j89n8J56L9O4m24L47
$$ plain form
2711 77 510 -104 -211 130 596 133 -296 393 332 -174 -10 259 204 -231 56 20 -286 -17 39 141 -358 -627
2733 -627 72 -107 -61 -76 -28 189 -191 120 317 -33 226 257 178 40 253 246 179 -49 118 -185 -134 -141 98 88
2757 88 -329 159 124 -105 -80 -14 39 -177 -380 187 47 -128 -50 25 300 -164 174 138 -136 55 443 389 -164
2780 -164 126 138 156 -149 291 208 -21 -113 -118 131 -444 -153 -69 -164 -291 219 285 -181 50 142 -120 -244 -277 83
2804 83 -148 -290 -95 270 28 -123 454 254 -63 -210 17 244 37 -1 371 210 -261 28 -93 -262 -106
2825 -106 -112 -138 -282 -319 169 -85 -40 -224 198 58 -250 197 -4 104 7 358 168 -96 105 378 -90 -306
2847 -306 153 192 -91 -49 352 246 -385 -145 61 130 -191 82 66 -219 -551 168 233 -108 -147 135 -268 -422
2869 -422 -89 203 62 250 209 223 -41 212 364 159 45 159 94 65 -75 34 164 -242 -83 154 139 10
$$ packed form
2711G7M33o14j07L41M66m63m29O89o1n06J64K69n5m35K87l6l06K69N6J02m99k69
2733f27O99j79M6j5M8K17l80L11J97l50K59L1p9j38K13po7k28J67l03N1pK39j0
2757H8m17M88l5k29K5O6N3k16k03N67j40j75P8P5K75m64L38l6k74J91L88n4n53
2780a64K90J2J8l05M40q3k29r2nK49n75K91Q4r5j27N10O6m66K31R2k62j24l3L60
2804H3k31j42J95L65k42j51N77k00l17j47K27K27k07l8L72j61m71K89j21j69J56
2825a06ok6j44l7M88k54M5j84M22j40l08M47k01J08r7L51j90k64K01K73m68k16
2847c06M59L9k83M2M01j06o31K40K06O9l21K73j6k85l32P19O5l41l9K82m03j54
2869d22L33K92j41J88m1J4k64K53J52k05j14J14o5k9j40J09J30m06J59K37j5j29
$$ plain form
2891 10 -132 153 -45 -269 337 -13 -74 -31 53 53 -267 245 -95 51 -154 195 137 -146 -125 420 -252 -234 130
2914 130 191 3 -255 158 -66 93 -77 122 187 12 -353 146 9 -247 -193 9 155 -193 -89 85 381
2935 381 -57 -106 287 149 -127 243 23 -25 112 95 164 -126 184 -67 -35 146 85 -76 -17 -3 -121 -425 5
2958 5 274 -147 -293 -286 94 41 -48 55 252 -183 -48 66 -156 -46 130 350 414 12 114 -134 86 -229
2980 -229 -45 145 -235 74 -165 278 -240 -185 -166 -37 9 -179 193 163 47 -271 23 -105 77 -96 -46 16
3002 16 125 -119 78 124 128 -147 -142 214 21 172 43 -160 265 163 -14 -187 -178 -256 166 89 42 -337 -132 141
3026 141 29 -152 -7 238 -7 -82 83 -2 -106 -114 23 255 11 236 -99 139 -297 -103 31 287 -37
3047 -37 -215 137 -346 -66 -197 -61 -228 -448 -149 193 -61 -41 -132 32 40 -219 118 224 458 -335 -87 442
$$ packed form
2891A0j42K85j98k24O06l50o1M3Q4%l20N12l40J46k05L49n8k83K1N45o72J8L64
2914A30O1j88k58M13k24J59j70J99O5j75l65M99j37k56N4K02J46l48J04J74K96
2935C81m38m9L93j38k76L70k20m8J37j7O9k90L10k51L2J81o1j61N9J4j18l04M30
2958EK69m21j46PL80n3q9J03J97m35J35J14k22J10J76K20O4m02J02k48K20l15
2980b29J84J90l80L09k39M43n18N5J9J29M6j88L72l0j16l18K94j28J82j73N0O2
3002A6J09k44J97M6Mk75NL56j93J51j29k03M25j02j77j73Rp8M22p7m7l79K05K73
3026A41j12j81J45K45k45p5J65q5j04qJ37K32k44K25l35K38m36J94J34K56l24
3047c7j78L52m83K80j31J36j67k20K99L42k54K0r1J64Qk59L37J06K34p93K48N29
$$ plain form
3069 442 -67 116 -111 -16 379 99 -18 40 25 262 8 11 294 -52 76 3 -18 -130 -126 -69 20 -209 -22 180
3093 180 -38 -214 -223 28 -63 81 107 232 220 -72 275 122 -89 -315 15 324 -65 -98 -59 -12 -228 -59 9
3116 9 -71 -206 -41 5 154 133 -93 40 -39 63 -133 49 363 239 -244 10 -276 57 273 -206 115 28
3138 28 -152 -128 173 0 -170 -331 -29 74 -405 302 45 -48 -140 -229 195 -265 -155 214 188 6 -240 224
3160 224 197 65 41 313 275 -274 -162 88 148 152 -163 154 -111 -253 217 283 -84 -81 -22 -22 -2 -234 169 -180
3184 -180 -422 -7 -199 -360 85 -7 -27 88 80 -145 129 -185 -14 -17 -327 159 -111 -278 15 -117 -44 40 -153
3207 -153 281 188 -97 -299 -32 56 -43 -7 158 -170 -70 270 -91 21 -258 4 191 -189 117 94 -15 -118
3229 -118 24 0 0 117 -271 330 121 171 20 -225 -85 122 -43 -69 143 -191 -77 -115 38 -20 -23 -295 -90
$$ packed form
3069D42n09J83k27R5L95k80j17N8j5K37k54LK83l46J28p3k1j12MN7Q9k29J87K02
3093A80k18j76rK51r1J44K6J25j2k92L47j53k11k26L30L09l89l3L9M7k16J69O8
3116Iq0j35J65M6J49k1k26J33p9J02j96J82L14j24m83K54k86L33K16m79L21q7
3138B8j80K4L01j73j70j61L02J03m79P07k57r3r2q9M24m60J10L69k6j82k46M64
3160B24k7j32k4K72l8n49J12K50O0Ml15L17k65j42M70O6l67LN9%K0k32M03l49
3184a80k42M15j92j61M45r2k0J15qk25K74l14J71ll10M86k70j67K93j32P3Q4j93
3207a53M34r3k85k02K67Q8r9L6J65l28J00L40l61J12k79K62J87l80L06k3j09j03
3229a18J42k4%J17l88O01k09N0j51k45J40K07j65k6K12l34J14l8J53n8lk72K05
$$ plain form
3252 -90 61 -81 155 -134 139 -45 16 146 -34 -71 35 316 180 72 132 160 52 -191 -105 35 -172 162
3274 162 136 9 -178 -8 196 16 -258 129 -125 -98 -153 98 -59 -47 159 -1 104 131 48 269 192 8
3296 8 171 172 115 -4 -35 136 -113 146 47 42 225 119 -101 -165 -298 31 -524 -139 -37 -175 69 -58 -89 -27
3320 -27 134 20 130 259 12 24 -54 260 -184 122 77 32 -57 -21 43 -129 -128 -130 -123 214 63 -70 46 40 -51 74
3346 74 108 -87 -172 45 128 143 28 -147 61 -98 -44 -89 -120 252 52 -277 80 178 71 150 4 -76 -292 -87
3370 -87 227 -21 55 123 -211 -170 -165 -112 23 41 -54 -39 -27 -26 -37 96 142 -122 -218 75 183 -129 41 477 266
3395 266 -124 -229 325 248 86 46 -35 -15 -80 101 -54 65 -112 -90 -82 -148 75 -149 -25 -142 -218 -28 210
3418 210 110 175 265 -105 -105 -20 0 263 256 85 -27 47 151 -46 -13 182 -107 -116 -217 -11 92 -16 -5 -41 -119
$$ packed form
3252i0J51j42K36k89K73j84O1J30j80l7J06K81j36j08O0K8j08k43Q6J40k07L34
3274A62k6j27j87J70K04j80k74L87k54K7n5K51j57J2K06j60J05K7q3K21p7j84
3296HJ63Jn7j19l1J71k49K59r9nJ83j06k20o4j33L29n55L85J02j38K44j27l1O2
3320b7J61j14J10J29k47J2p8L14m44L06m5m5q9L6O4j72JkPL37j51j33J16or1J25
3346G4L4j95q5K17Q3J5j15j75K08j59N4m5l1L72k00l29L57R8j07P9j46q0k16K05
3370h7L14k48P6O8l34M1NN3J35J8r5J5J2Jj1J33M6k64r6K93J08l12J70M36k11
3395B66l90j05N54p7j62m0q1K0o5J81j55J19j77K2Qo6K23k24J24j17p6J90K38
3418B10j00O5R0l70%Q5K0K63pj71j12P4J04j97L3J95k89rj01K06J03j08J1l6p8
$$ plain form
3443 -119 105 -199 -133 -12 73 103 -153 -266 430 -119 -3 169 -63 54 187 172 21 -93 -38 33 55 57 157
3466 157 72 -101 105 95 15 -246 -267 0 128 39 -96 -232 -404 -13 153 -138 104 -1 123 -70 165 -133
3488 -133 -150 155 69 -95 254 -177 159 -27 -5 -3 160 -38 -40 -219 90 -19 -5 -209 -17 41 90 250 123
3511 123 -55 18 257 72 -101 -178 86 250 82 -113 -12 107 -66 288 72 31 -10 220 -42 89 -294
3532 -294 -100 -132 237 -87 -46 -66 4 -7 -15 124 132 48 31 247 -240 -4 107 73 -37 -283 298 66 -196 -78
3556 -78 53 371 124 -19 -2 -28 -20 48 -153 150 -68 -84 68 -108 -15 180 11 -37 -152 -141 -144 -224 -288 -171 -210
3581 -210 112 -35 109 143 115 151 70 75 -4 -127 157 -144 205 -17 230 285 270 -61 -62 82 -99 12 -83 -75 -75
3606 -75 -20 -415 105 -184 -110 -228 541 104 101 413 27 -15 44 -28 -2 -63 -26 69 -60 -116 -215 165 -129 -196 25
$$ packed form
3443a19K24l04O6J21Q5L0k56j13O96n49J16J72k32J17J33j5j51j14N5P1K2KJ00
3466A57q5j73K06j0q0k61k1K67J28q9j35j36j72L91J66k91K42j05J24j93K35k98
3488a33j7L05q6j64L49m31L36j86K2KJ63j98kj79L09j09J4k04J92N8M9J60j27
3511A23j78P3K39j85j73p7K64J64j68j95J01J19j73L54k16m1m1K30k62J31l83
3532b94J94l2L69l24M1k0P0j1qJ39Qq4j7K16m87K36J11l4j10k46N81k32k62J18
3556g8J31L18k47j43J7k6QO8k01L03k18j6J52j76R3J95j69m8j15J1lq0o4J17l9
3581b10L22j47J44L4k8L6q1Np9j23K84l01L49k22K47N5j5l31jJ44j81J11r5Q%
3606g5N5l95N20k89P4j18P69m37lL12l86m2N9p2K6o1L7R5j29n6r9L80k94o7K21
$$ plain form
3631 25 97 -15 -25 24 -34 -120 4 -93 19 -209 -195 -117 86 316 -48 95 106 199 67 176 215 168 -41 61
3655 61 158 350 4 -251 -7 90 -264 16 -76 120 -185 47 -66 -49 209 -26 -19 26 -98 -95 26 -76 2 44
3679 44 -27 46 -36 11 188 85 164 55 73 208 260 -211 267 -162 120 -180 174 79 -76 161 -54 256 -295
3702 -295 -360 -99 -246 49 -76 -103 195 -20 -79 -77 260 -65 -141 -21 -1 -31 -3 30 -36 -3 215 -30 -102 -119 -61
3727 -61 56 63 -212 40 68 -271 125 262 -119 -5 -120 -60 -222 -150 97 142 -136 17 43 -94 14 -96 112
3750 112 69 20 140 156 -82 61 263 -27 173 128 -204 24 2 162 -7 11 -65 -107 -258 -151 109 -78 -119
3773 -119 199 35 -155 -322 63 -111 86 90 70 89 -65 216 110 -231 -54 98 328 -89 19 -43 -80 46
3795 46 -404 126 -156 -159 30 -166 51 -88 121 -87 -62 -167 88 35 296 -72 27 -87 -117 140 13 128
$$ packed form
3631B5P2j12j0M9n8q6J24r7J12k28J4P8K03K30l64J43J1R3j32J09L9m7k09J02
3655F1R7J92l46k55K44R7l54K80r2J96l05K32j13J7K58k35PM5j24LJ21j02P8M2
3679D4p1P3q2M7J77j03P9j09J8J35N2m71M78m29K82l00L54r5j55K37k15L10n51
3702b95o5K61j47K95j25k7K98k15n9KL37l25p6J20K0l0K8L3o6L3K18k45p2j7N8
3727f1J17Pk75K52K8l39L96J37l81J14j15O0j62P2K47M5k78J53K6j37J08j10K08
3750A12m3m9J20J6k38J43K02k90K00m5l32K28k2J60j69J8p6m2j51J07K60j87m1
3773a19L18j64j90j67L85j74J97Mk0J9j54K81j06l41J77J52K30m17J08o2l7J26
3795D6m50N30k82lJ89j96K17j39K09k08K5j05K55n3K61l68R9j14l0K57j27J15
$$ plain form
3817 128 -172 -33 71 150 -25 231 -137 -169 -246 -70 -118 -206 66 -50 -75 -221 16 71 -18 -77 158 -10 -13 -39
3841 -39 4 107 -130 -1 96 -51 -6 121 153 122 -99 57 52 -84 107 414 -28 -262 118 -107 -9 93 -59
3864 -59 -141 34 34 162 98 -339 173 24 -320 -108 -103 23 -50 49 88 78 67 78 446 -231 93 -19 140 100 -8
3889 -8 -137 -103 45 123 142 -14 10 74 -14 -214 62 1 97 -200 252 -33 -130 150 126 48 -133 42 165 -37
3913 -37 -139 -96 -43 -68 -114 21 30 -298 1 -31 -257 -175 -96 -54 83 -257 -48 66 135 -118 154 128 -76 132
3937 132 15 118 190 254 62 88 66 254 136 -70 101 -180 92 -14 -76 86 91 47 73 97 -76 -161 136 -2
3961 -2 -222 -165 -67 29 28 58 -280 163 193 -199 -38 -324 87 343 -103 20 112 -19 67 -110 -212 -247 83 64
3985 64 -140 43 -125 -25 203 32 -164 156 -6 -271 24 -37 -82 -114 -53 126 74 37 -7 48 70 148 -58 -85
$$ packed form
3817A28l00J39J04P9j75K56l68l2p7J76m8q8K72j16k5j46K37N5q9n9K35j68lk6
3841c9M3J03k37J29R7j47M5J27L2l1k21J56nj36J91L07m42k34L80k25R8J02j52
3864e9q2J75%J28o4m37N12j49l44K12NJ26p3R9L9j0j1J1L68o77L24j12J59m0j08
3889hj29L4J48P8J9j56K4O4q8k00K76o1R6k97M52k85r7K80k4p8j81J75J23k02
3913c7j02M3N3k5m6J35Rl28K99l2k26Q2P9M2J37l40K09J14O9k53K72k6k04K08
3937A32j17J03P2O4j92K6k2J88j18k06J71k81K72j06o2J62Nm4K6K4j73q5K97j38
3961bk20N7R8R6jL0l38M43L0l92J61k86M11K56m46J23R2j31Q6j77j02l5L30j9
3985F4k04J83j68J00K28j71j96L20j62k65K95o1m5l2O1J79n2l7m4N5K2P8k06k7
$$ plain form
4009 -85 166 12 268 45 131 22 85 -267 -6 186 -243 -144 -58 -20 -3 -146 139 279 -367 -99 -7 -156 -264
4032 -264 54 43 -43 46 25 -115 -2 -115 103 78 -20 146 -170 120 8 34 -67 -65 -119 -98 141 3 25 201
4056 201 -55 -147 -61 -46 50 40 -52 -230 -311 219 207 -152 -290 159 19 -95 -108 69 102 -67 24 75 -3 36 66
4081 66 43 -30 -176 -191 -217 -199 -247 78 78 -202 -237 8 -173 -97 -146 -92 135 -61 30 236 -177 -121 162 -139 133
4106 133 -206 246 148 -12 -83 -120 38 -216 69 5 -341 -62 -146 -238 55 1 -177 -217 -43 -114 -219 56 7
4129 7 -48 171 86 -160 -28 65 -50 59 146 5 122 -39 62 -133 169 -18 -1 141 52 281 14 77 -82
4152 -82 6 134 100 20 72 -213 -173 13 162 37 -487 29 -89 -47 16 97 34 -170 323 207 42 -93 -41 25
4176 25 146 -143 -149 99 -58 76 -79 -7 -354 -341 61 191 -29 -4 -34 13 -62 -257 -121 -197 -45 146 227 408
$$ packed form
4009h5K51j54K56k23Q6j09O3l52K61J92m29R9Q6L8J7j43K85J40o46K68R2j49j08
4032b64L18j1q6Q9k1j40J13j13K18k5r8J66l16K90j12K6j01Kn4K1K39j38K2J76
4056B01k56r2Q6J5R6j0r2j78q1N30j2l59j38M49j40j14j3J77L3j69R1N1p8L9L0
4081F6k3p3j46j5k6J8m8L25%k80l5K45j81P6m9N4K27j96R1K06m13N6K83l01K72
4106A33l39M52r8j60p1l7J58k54K85o4l46K79q4r2K93n4j78m0J74p1j05K75m9
4129Gn5K19q5k46J32R3j15J09Q7j41J17j61J01j95L02j87J7J42q9K29k67O3j59
4152h2Q8J28l4q0N2k85M0J86J49j25n24N16j18M2O3Q1o3k04M93j16j65j35N2O6
4176B5J21k89oK48j57J34j55P2l47J3M02J30k20K5l0M7p5j95J36p6J52J91Q1J81
$$ plain form
4200 408 -382 35 257 5 -22 -151 166 -13 -62 -196 43 -68 21 170 -276 124 -185 -265 -45 -47 -168 -102
4222 -102 -120 233 25 -6 -72 -150 65 171 160 -137 124 99 201 144 62 -21 86 184 89 -3 -28 4 -256 -48 60
4247 60 -403 -89 -176 -50 -120 -57 -2 -74 -21 -182 -8 -77 -390 1 -157 -21 -109 -174 -123 -60 8 82 94 115 34 -104
4273 -104 168 84 -113 10 -58 47 38 28 -62 -220 -288 115 33 124 -164 -221 8 51 -122 188 -43 -95 -16 91
4297 91 288 -71 49 -48 190 -97 285 63 0 76 27 -18 -278 -94 83 34 -60 -174 10 -72 -199 -166 -26
4320 -26 167 101 -36 74 -85 118 100 -49 145 -93 79 -153 131 218 -52 197 -121 -92 -31 -239 212 -37
4342 -37 80 2 -178 34 -148 4 -187 -158 130 -271 14 -36 -89 17 -67 35 -147 -35 22 213 -353 -109
4364 -109 -54 79 -29 152 57 -176 -81 -15 -57 -263 99 94 56 -476 -61 -111 -14 11 165 271 -113 -127 -167 -5
$$ packed form
4200D08p90M17K22k52k7j29L17j79m9j34K39j11Q9J49m46M00l09q0K20kj21O6
4222a02j8L53k08l1o6p8K15J06j1k97K61k5J02n7q2q3J07R8r5r2k5L2k60K08J08
4247F0m63L14q7J26p0O3N5p2N3j61J74o9l13L91j58J36q8o5N1O3O8P4J2K1q1j38
4273a04K72q4j97J23o8J05rj0r0j58o8M03q2R1k88n7K29M3j73L10k31n2P9J07
4297I1J97l59J20r7K38k87L82k22o3P6m9m5k60J84J77m9r4j14J84q2j27L3J40
4320b6J93o6j37J10j59K03j8j49J94k38J72k32K84Q7k70K49l18K9O1k08M51k49
4342c7J17p8j80K12j82J52j91K9K88m01K85n0n3J06q4J02j82J12N7J91n66K44
4364a09N5J33j08J81r5k33R5O6m2k06L62nl8n32M15n0R7K5J54J06l84j4m0J62
$$ plain form
4388 -5 -196 58 300 -59 56 132 99 99 66 106 -73 -29 23 109 -125 26 185 -158 -247 -19 -58 -32 -127 341 70
4413 70 -82 2 -59 -148 37 -2 345 159 3 56 233 -344 130 161 259 417 -12 157 -54 249 -3 33 230
4436 230 -78 -128 144 -288 -162 110 109 -142 82 238 179 78 -74 -4 75 10 -31 217 42 32 199 -44 6
4459 6 115 107 163 -27 -151 138 -48 50 110 19 -143 188 25 -129 -278 -26 162 -36 8 26 -20 -150 61 -64
4483 -64 -131 33 -147 -21 -382 183 118 54 104 74 124 78 185 105 173 -209 -29 59 -69 157 -136 -89 -240 -245 33
4508 33 -33 -74 18 42 -29 125 70 148 -92 210 -126 73 -166 -23 -160 -46 -14 -34 -212 -144 99 15 257 -64
4532 -64 82 197 -112 224 89 -51 -38 -84 91 129 -192 77 -229 -79 -244 -37 212 -33 -13 137 -72 37
4554 37 158 -4 -17 150 50 20 114 -74 100 115 -122 215 -265 163 -90 -144 -114 -96 -114 62 -37 -218 -65
$$ packed form
4388ej91K54K42l59J15P6l3%l3M0j79M4N2Q6k34J51J59l43q9K28l9K6r5M68k71
4413G0j52Q4o1q9J85l9L47j86j56N3J77n77M74L1R8J58m29J69k11L03k52L6J97
4436B30l08n0K72m32J26K72jk51K24J56n9j01j52P0P9o5m1K48j75j0J67k43N0
4459FJ09qN6j90j24K89j86R8O0r1j62L31j63j54j49K52J88j98M4J8m6j30K11j25
4483f4o7J64j80J26l61N65o5o4N0l0N0m6J07q0O8l82J80Q8j28K26k93M7j51nK78
4508C3o6m1R2K4p1J54n5P8k40L02l36J99k39J43j37J14L2k0j78O8K43q4K42l21
4532f4J46J15l09L36j35j40J3m6J75L8l21K69l06J50j65K07K49k45K0J50k09J09
4554C7J21j62j3J67j00l0R4j88J74J5k37L37m80M28k53n4L0J8j8J76r9j81J53
$$ plain form
4577 -65 -108 126 81 -74 165 -11 -71 505 182 87 -47 179 -63 49 -149 138 75 -22 -85 97 -262 -74 80
4600 80 82 43 281 21 -105 -46 -63 -44 -167 101 76 -33 168 50 -160 -28 176 154 -115 129 239 131 -108
4623 -108 11 35 37 -56 196 -24 -65 8 8 -305 -24 -80 -94 14 -267 150 108 113 148 -185 -239 85 35 185 -10
4648 -10 -125 105 -197 61 313 -162 147 125 -7 247 -24 -204 151 -290 111 247 205 86 -6 -174 91
4669 91 108 -327 -112 -150 58 36 -137 121 -175 -65 -3 114 6 -32 -139 9 34 71 371 -30 299 190 120
4692 120 -116 -31 27 3 -80 95 -178 117 -118 -115 172 -82 -105 -90 -19 -126 -62 -146 -40 98 106 140 22 -21 -65
4717 -65 209 -29 -53 155 67 35 -293 -114 -139 129 213 23 -62 -250 -220 -135 -134 41 -6 -97 -54 -15 19 -61 120 -67
4743 -67 -26 -162 -71 258 -21 -135 152 -185 -82 80 -56 147 -108 99 114 209 102 -7 -183 -37 -148 -229
$$ packed form
4577f5m3K34m5j55K39j76o0N76l23r5j34K26k42J12j98K87o3r7o3J82l59J88J54
4600H0Kl9K38k60j26N9j7J9j23K68k5j09K01j18k10J32K04k2k69K44J10j08k39
4623a08J19K4Kr3K52k20m1P3%l13K81n6j4J08k81M17m2NL5l33n4L24n0J50j95
4648a0j15K30l02K58K52m75L09k2j32K54k71j80L55m41M01J36m2j19r2j68K65
4669I1J7m35K15l8K08k2j73K58k96J10O2J17j08l8j07J48K5L7L00m01L29j09p0
4692A20k36Q5N8k4q3J75k73K95k35LK87k54k3J5P1j07O4q4J06J38QL4j18m3m4
4717f5K74k38k4K08q8l2l28J79k5K68Q4j90q5j88L0Q5JJ75m7r1M3L9L4q0J81j87
4743f7M1j36R1L29k79j14K87l37J03J62j36K03k55K07J5R5j07j09j76J46j11q1
$$ plain form
4765 -229 101 -189 -161 -139 -255 114 115 23 -82 55 219 -68 -185 -55 76 -122 66 2 116 96 -90 153
4787 153 82 -68 -56 231 97 -220 -272 -7 25 84 65 141 -82 -76 -62 200 149 -21 -86 -83 24 226 -201 -92 44
4812 44 264 98 -17 220 265 -83 -73 65 183 283 39 -32 -4 -58 -173 136 -141 -29 -299 -11 -191 146
4834 146 -67 -5 -60 -143 -193 -204 -200 -41 -91 -195 -31 -65 71 -69 189 -67 -48 -260 21 128 0 -181 9
4857 9 92 -11 63 6 -119 -92 47 -187 -121 -198 178 14 57 -158 3 -18 107 -211 52 -116 -1 -22 28 64
4881 64 -22 172 7 -59 -24 99 -149 101 -158 -30 52 -66 -85 -44 32 -136 -80 -2 -237 49 -53 3 229 -30
4905 -30 32 230 -101 132 -95 68 -33 57 85 -46 -10 116 15 63 -25 -18 21 39 91 -221 129 -97 -61 -154 78
4930 78 -18 198 -438 158 -43 -238 -440 -157 -121 175 37 246 6 -99 -12 94 -50 -6 77 219 -191 -61
$$ packed form
4765b29L30k90K8K2j16L69Jr2j05J37J64k87j17J30J31j98J88o4J14k0j86K43
4787A53p1j50J2K87j34l17n2K65L2N9j9P6k23OJ4K62n1j70o5LJ07K02m27J09J36
4812D4K20j66j15K37M5l48J0J38J18J00k44p1K8n4j15L09k77J12k70K88j80L37
4834A46k13O2n5q3n0j1MJ59n0j04J64l4J36j40K58k56J9k12K81J07j28j81J90
4857IQ3j03P4n7j25K7J39k34O6p7L76j64M3k15J61k1J25l18K63j68J15k1N0L6
4881F4q6J94j65o6L5J23k48K50k59J28Q2j18j9M1P6j68N6P8k35K86j02N6K26k59
4905c0O2J98l31K33k27J63j01R0K8j31L6J26j01M8q8PL9J8N2l12L50k26L6r3K32
4930G8r6K16o36N96k01j95k02K83L6K96j38K09k40j05Q7J06j44M4Q3J42m10J30
$$ plain form
4952 -61 -261 -22 -84 29 54 -114 106 181 8 120 -94 -117 66 -102 -254 50 105 67 40 -225 48 87 269
4975 269 29 -298 -43 -38 -16 -76 51 140 -1 -220 205 -36 -118 -143 60 97 -268 42 -53 -213 160 -193 29
4998 29 62 25 49 -79 -87 152 -45 -31 -36 137 157 -54 81 24 127 -125 109 -70 -250 195 -69 161 122 260
5022 260 -160 60 30 20 118 -102 -37 134 -237 33 301 50 -265 -207 257 112 89 112 281 16 54 -96 -126
5045 -126 -168 17 -25 202 -206 -143 122 -74 -145 -302 -2 -15 -165 34 44 86 -97 194 18 145 -100 -105 25
5068 25 172 168 63 130 384 42 10 108 29 144 -116 -56 -70 -1 57 -112 106 -12 -246 -51 -61 201 -58 -197
5092 -197 129 -17 -99 200 172 -458 -69 -151 -104 37 58 -3 71 -221 50 -102 130 -177 -94 243 160 28 -348
5115 -348 174 55 -64 -102 24 -77 205 -84 -199 -197 -99 143 116 -124 103 -67 -95 -166 -106 -27 -3 30 -17 -55
$$ packed form
4952f1k00K39o2J13K5j68K20P5j73J12k14k3J83j68j52L04N5l8k7k65K73L9J82
4975B69k40l27K55NK2o0J27Q9j41k19M25k41q2k5K03L7l65L10r5j60L73l53K22
4998B9L3l7K4j28qK39j97J4nJ73K0k11J35n7J03k52K34j79j80M45k64K30l9J38
5022B60m20K20l0j0R8k20O5J71l71K70K68k51l15N8M64j45k3K3J69k65L8j50l0
5045a26m2J85m2K27m08O3K65j96p1j57L00j3j50J99J0M2j83K91j76J27k45nJ30
5068B5J47mj05O7K54l42l2R8p9J15k60O0j4O9N8j69K18j18k34J95j0K62k59j39
5092a97L26j46q2K99k8o30L89q2M7J41K1o1P4k92K71j52K32l07Q3L37q3j32l76
5115c48N22j19j19l8J26j01K82k89j15KR8K42k7k40K27j70k8p1O0P9K4L3m7l8
$$ plain form
5139 -55 39 65 131 16 19 -25 -91 33 53 51 149 178 -53 71 -175 67 38 -155 -106 50 162 49 158 76 -136
5164 -136 -163 123 69 51 -139 -110 226 -47 -95 126 164 459 -131 274 -41 -84 30 -241 35 -74 47 189
5186 189 61 -141 179 111 -275 150 67 -132 34 -166 102 -25 -62 -57 330 47 -29 45 28 149 24 167 -59
5209 -59 -166 -97 -118 -205 -100 -76 120 1 -21 173 -16 -306 -79 -150 -232 10 -220 138 -31 -202 -62 29 158
5232 158 143 153 102 -71 57 143 38 -170 -279 59 -244 -215 -203 -13 -91 -65 74 117 188 -41 33 -319 113 -208
5256 -208 -228 -180 71 -197 85 56 1 51 -72 33 148 -137 37 214 -108 100 113 2 -32 -147 -17 -114 -107
5279 -107 -149 127 -172 -175 -176 -109 -212 -39 -87 40 -155 67 65 -43 -157 -34 -88 265 -200 58 43 162 4 149
5303 149 44 -65 -95 -226 -187 -93 -59 132 -18 -54 135 -222 -173 -178 -52 142 -272 34 -104 -56 71 -137 80
$$ packed form
5139e5R4K6O6j15Lm4o6J24K0kR8K9k31J24k46K42k9j93M9J56J12j13J09q2k12
5164a36k7K86n4j8j90K9L36k73m8K21L8K95n90M05l15m3J14k71K76j09J21J42
5186A89j28k02L20o8l86M25q3j99J66k00K68j27l7NL87k83p6P4j7J21j25J43k26
5209e9j07O9k1q7J05K4J96j19k2J94j89k90K27p1q2K42k30L58j69j71J40R1J29
5232A58j5J0n1j73J28Q6j05k08j09L38l03K9J2J90p8K6J39M3P1k29P4l52M32l21
5256b08k0M8K51k68K82k9n5N0j23J05J15k85J74J77l22K08J3j11l4j15J30r7P
5279a07m2K76k99ljO7j03J73m8J27j95K22kj08j14J23n4L53m65K58j5J19j58J45
5303A49j05j09l0j31L9R4L4J91j50l6J89l57M9nJ26J94m14L06j38M8J27k08K17
$$ plain form
5326 80 53 44 224 -24 43 -136 122 -142 -179 114 -56 26 -23 -6 -31 110 187 106 -161 -122 -96 -127 67 -30 -225
5351 -225 81 -301 117 -185 -101 159 173 -41 200 20 6 127 -11 244 -90 164 34 -164 29 120 122 307
5373 307 -12 -31 48 -38 -75 -69 171 -251 -258 -103 -177 106 -225 -270 -79 49 12 94 -140 131 168 4 140 -80
5397 -80 68 309 61 77 39 130 65 -75 7 28 -220 68 -114 -33 181 -91 141 72 6 -4 129 61 91 183 139
5422 139 -22 133 3 -96 -116 272 -60 64 -5 -135 62 -45 136 124 40 35 -142 -26 -30 -64 135 38 -194 43
5446 43 121 -97 65 -59 -48 54 6 -12 85 -15 -226 174 -69 -343 302 182 -153 29 180 88 -84 -169 148
5469 148 -61 183 71 -369 53 -197 -292 7 -19 -169 145 -124 89 -13 -225 -46 46 68 6 68 98 -22
5491 -22 -273 39 -180 46 3 81 -89 63 118 126 -179 -171 -84 -123 347 82 -93 -36 20 45 -127 -81 97 -338 -101
$$ packed form
5326H0k7rJ80k48O7j79K58k64l7K93j70Q2m9J7k5J41P7q1k67L9K6l1J94r7j95
5351b25L06l82M18l02Q4K60J4k14K41j80j4J21j38K55l34K54j30j98J93R1KJ85
5373C07l19j9P9q6l7OK40m22pJ55p4K83l31m5J91J28l7Q2k34K71L7j64J36k20
5397h0J48K41k48J6l8R1o5j40Q2K1k48K88j82Q1K14k72K32o9o6j0J33o8L0R2m4
5422A39j61J55j30r9k0L88l32J24o9j30J97j07J81j2q4nj77J16ml4J99r7k32K37
5446D3P8k18J62j24J1J02m8j8R7j00k11M00k43k74O45j20l35J82J51r2j72q5L17
5469A48k09K44j12m40M22k50r5K99k6j50L14k69K13j02k12J79R2K2o2O2L0j20
5491b2k51L12k19K26m3P8j70J52N5Ql05QQ7l9M70k65j75N7N6K5j72M6J78m35K37
$$ plain form
5516 -101 68 -3 110 70 -184 108 81 -52 113 27 2 -1 170 282 -215 -62 -20 85 -173 -117 -298 -92 -8
5539 -8 27 136 -153 -74 -83 107 -122 40 -86 -114 255 200 2 238 -129 138 69 116 169 60 263 228 -27 20
5563 20 54 155 149 111 -156 -130 26 97 -136 -69 -128 -66 -327 -145 -103 -357 -184 22 -211 -19 28 -243 -78 -189
5587 -189 -138 21 142 -26 279 110 -68 15 26 479 -161 -88 -181 -86 299 18 -83 31 109 -46 -79 -35 55
5610 55 -236 -119 156 -74 124 192 140 -154 166 -38 -96 217 168 2 117 -164 19 76 145 -107 -28 -10 -103
5633 -103 112 -73 98 -193 -378 -248 91 53 82 -259 -142 3 53 14 -21 -39 -127 17 64 26 87 13 160 278
5657 278 23 73 127 126 -203 -73 114 166 25 -148 -88 -118 -264 69 136 -189 70 -128 165 -127 -347 94 31
5680 31 -51 62 -23 72 -112 -27 204 62 -116 218 59 -292 179 82 140 -76 -41 36 -2 -322 60 -44 -100 43
$$ packed form
5516a01J69p1J13m0k54K92k7j33J65q6k5lJ71J12m97J53M2J05k58N6j81K06Q4
5539hL5J09k89P9rJ90k29J62j26k8L69n5j98K36l67K67o9M7N3j09K03l5k55M7
5563B0L4J01ol8k67K6J56P1k33O7n9O2k61J82M2k54J73K06k33J92M7k71J65j11
5587a89N1J59J21j68L05j69j78Q3J1M53o40P3r3R5L85k81j01J14P8j55l3M4R0
5610E5k91J17K75k30J98O8n2k94L20k04n8L13m9j66J15k81J83N7O9k52P9J8r3
5633a03K15j85J71k91j85J30L39l8K9l41J17J45N0l9l5j8q8J44M7l8O1p4J47J18
5657B78k55N0N4jl29J30J87N2j41j73O0l0j46L33O7l25K59j98K93k92k20M41o3
5680C1q2J13q5R5j84Q5K31j42j78L34j59l51M71r7N8k16L5P7l8l20L82j04n6J43
$$ plain form
5704 43 -14 130 55 -142 -29 20 23 207 -197 153 -99 135 -43 -59 56 132 50 -349 -4 297 51 -88 204
5727 204 160 -152 -203 48 53 -287 -114 79 -3 -39 50 27 99 144 -96 -39 -13 -170 178 -150 -62 101 -139 118
5751 118 153 194 91 -16 -115 93 244 -222 39 77 -119 -335 3 -119 -55 -151 236 244 202 -212 17 60 206
5774 206 -40 162 110 -138 -97 -146 331 -41 79 128 -47 133 -122 -131 -77 63 -71 43 -94 44 353 -44
5796 -44 -125 190 -33 -154 129 -4 150 -77 -57 -14 -98 94 -76 37 -11 -107 -47 -296 231 -165 113 38 -50
5819 -50 -35 -68 -53 -48 31 -36 169 -127 147 -23 14 -130 -208 24 87 166 163 -152 -135 -206 239 159 -75 261 -3 72
5845 72 215 145 -78 283 22 155 49 233 -258 -177 26 137 -350 -35 -98 47 -255 37 208 -279 -246 96
5867 96 75 -272 237 162 -264 -93 175 -82 64 180 448 89 49 -128 143 33 168 -128 20 139 66 -161
$$ packed form
5704D3n7J44p5j97J13M9LJ84m04L50k52K34j78j6J15P6q2l99L45L01k46j39K92
5727B04m4l12n1K51Nl40J73J93q2l6Q9k3P2M5k40N7K6j57L48l28Q8J63k40K57
5751A18L5M1j03j07r9K08J51m66K61L8j96k16L38j22O4r6L87Qm2m14K29M3J46
5774B06k46K02n2k48M1m9M77l72J20M9j75J80k55rN4J40j34J14j37J38L09l97
5796d4q1L15k23j21K83j33J54k27K0M3q4J92j70J13m8r6O0k49N27l96K78p5q8
5819e0J5l3J5NP9o7K05k96K74j70L7j44p8K32O3P9ll15J7p1M45q0k34L36k64P5
5845G2J43p0k23L61k61J33j06J84m91Q1K03J11m87L15o3J45l02K92J71m87L3L42
5867I6k1l47N09p5m26J71K68k57J46J16K68l59m0j77K71j10J35k96J48J19p3k27
$$ plain form
5889 -161 57 144 29 106 -154 -101 -246 -150 -124 291 -9 184 51 -65 87 156 115 54 -25 57 137 -63 154 -62
5913 -62 -67 128 -175 67 -77 -113 11 -107 11 41 13 220 -36 -247 -170 -58 83 145 -33 -67 -180 -228 68
5936 68 -14 119 39 43 144 -192 26 -97 -414 292 -130 -91 43 -37 145 -40 -223 169 -20 -177 115 -63
5958 -63 -55 -80 -3 -100 -184 -154 -234 -480 -37 68 91 -44 -99 194 -165 87 -3 352 -69 -170 149 -37 164 -38
5982 -38 -7 69 307 46 145 204 105 -79 130 -69 -123 -246 -174 -254 -52 -199 24 -156 -171 5 48 62 138 110 -107
6007 -107 -121 -23 54 94 -122 -25 86 99 168 203 74 55 93 -71 141 -32 -54 -142 93 -81 -188 174 84 -135
6031 -135 -92 46 -115 -199 2 23 179 85 32 56 -16 226 -203 164 207 120 74 -238 -87 -58 -12 -27 -9 32 -123
6056 -123 -89 12 37 27 -14 -69 -116 196 -181 -177 -275 -106 -110 75 -99 155 133 -195 112 58 88 -22 -201 211 -19
$$ packed form
5889a61K18Q7j15P7k60N3j45R6K6M15l00J93j33j16J52O9m1o1p9Q2Q0k00K17k16
5913f2nJ95l03K42j44l6J24j18J18L0k8K07k56k11P7J12J41O2j78l4j13m8K96
5936F8q2J33q0MJ01l36K18j23l17P06m22L9J34q0J82j85j83L92j89j57K92j78
5958f3Qk5P7r7q4L0q0k46M43J05K3j35n5K93l59K52r0L55m21j01L19j86K01k02
5982c8L1P6K38k61R9N9r9j84K09j99n4j23P2q0K02j47K23j80j5J76M3J4P6k8k17
6007a07j4R8P7M0k16R7J11J3O9L5j29j9L8j64K12j73k2q8K35j74j07L62r0k19
6031a35M3J38j61q4K01K1J56r4n3K4p2K42m29L67M3q7m6l12J51K9M6j5J8M1j55
6056a23L4J01K5j0m1n5m7L12l77Mr8J69mJ85j74K54k2l28L07n4L0j10j79M12k30
$$ plain form
6081 -19 -78 -44 -60 60 126 89 -59 -59 -79 186 37 10 -32 94 -38 189 241 143 60 16 117 -10 -54 254 -14
6106 -14 63 -53 213 165 -66 105 -7 147 61 -29 -152 -43 -19 156 188 -185 -98 33 -42 -64 -167 46 44 -182
6130 -182 -30 51 -14 -106 -43 236 127 -93 104 129 -76 219 -64 118 -6 125 -176 245 87 -10 -154 144
6152 144 75 54 -11 51 404 -286 -3 46 -72 -151 -137 399 -44 172 81 129 -4 -64 -111 156 -219 -198 -137 67
6176 67 -92 126 -6 -102 -85 -28 169 45 -255 -59 -206 -74 16 -44 -43 -312 -81 -30 144 104 -325 209 16
6199 16 127 126 -41 60 -151 -53 49 -74 -241 336 153 -81 104 -63 -184 136 -46 -55 144 74 -39 -124 -50
6222 -50 -201 14 -174 120 47 -253 46 -63 268 38 -36 16 14 -15 -19 54 243 -213 47 -103 -312 -272 -3 -132
6246 -132 94 -132 131 -99 -25 7 114 192 58 -61 -61 43 40 79 -94 130 -71 203 -33 -169 169 19 -104
$$ packed form
6081a9n9L4j6J20O6l7j48%k0K65j49k7m2J26j32K27N2r8q3m4J01j27m4L08k68
6106a4P7j16K66m8k31J71j12J54q6r0j23J09K4J75L2l73Q7J31p5k2j03K13kk26
6130a82J52Q1o5r2O3K79j09k20J97K5k05K95k83J82j24J31l01M21j58r7j44K98
6152A44o9k1o5O2L53o90K83M9j18p9J4N36m43K16r1M8j33o0m7K67l75K1O1K04
6176F7j59K18j32r6J7N7J97j24l00J96j47J32R0o0Jk69K31N1J74m0m29N34j93
6199A6J11jj67J01k11R8J02j23j67N77j83k34J85j67j21L20j82rJ99p0j13q5P4
6222e0j51K15j88K94p3l00K99j09L31k30p4N2kk9mP3J89m56K60j50k09M0K69j29
6246a32K26k26K63k30P4L2J07P8j34j19%J04lL9j73K24k01K74k36j36L38j50j23
$$ plain form
6269 -104 65 7 -112 57 147 -47 12 235 -216 196 -241 -181 -57 -47 -15 74 56 -7 98 116 -199 94 116 -31
6293 -31 177 66 72 -193 -6 39 64 -29 -34 -103 -120 -80 85 -19 -60 -177 55 135 -139 -198 -60 52 -55 12 -119
6318 -119 -24 -22 138 272 -49 -210 57 -47 -120 14 111 -74 -68 90 -31 26 121 43 -143 22 -146 30 43 214
6342 214 -145 -241 274 -273 -194 -40 -20 57 -166 287 -31 7 -95 170 125 -189 73 -149 -36 121 -114 -31
6364 -31 -56 2 -223 50 -283 -3 94 2 -23 13 -16 -182 18 -170 98 100 -74 -403 -26 -62 12 -345 -65 135
6388 135 -5 -131 -57 129 352 134 60 38 62 18 31 175 -138 275 -121 99 -215 116 60 -202 -10 -49 -129
6411 -129 -209 -65 -163 130 -140 -22 -264 212 -6 34 188 144 65 -109 1 276 -179 -8 -53 -149 50 14 -1
6434 -1 144 111 -299 230 117 -2 23 30 275 -141 -16 -64 -191 -42 93 -5 85 338 44 77 -67 -40 -153 -9
$$ packed form
6269a04J69n8j19J69R0j94N9K23m51M12m37O0J24J0L2Q9j8o3J05J8l15K93K2j47
6293c1K08j11Ok65J87M5K5r3no9j7M0J65j04m1j17K32Q0k74n9J38J12j07O7j31
6318a19R5KJ60J34l21j61K67j04p3J34R7j85OJ58j21N7R5p8j86J65j68J76J3J71
6342B14l59r6N15n47P9J54K0P7k23M53l18L8j02K65m5l14K62k22J13J57k35Q3
6364c1k5N8k25K73l33K80R7r2k5L6k9j66K00j88K68Kj74l29L77l6P4l57K80K00
6388A35j40j26P4J86K23k18p4k2K4m4J3J44l13M13l96K20l14L31n6k62J92l9q0
6411a29q0J44r8K93k70J18k42M76k18M0J54m4p9j74J10K75m55J71m5r6J99l6j5
6434aJ45l3m10N29j13j19K5PK45m16J25m8j27J49J35r8R0K53k94L3j44K7j13J44
$$ plain form
6458 -9 70 148 207 25 32 -144 144 -45 -140 68 -51 288 22 -159 59 -125 -130 -75 -83 18 -127 16 -18 -67 -349
6483 -349 -32 -324 19 -25 -156 -77 334 -25 24 -250 -112 -137 -169 -36 -153 116 -180 301 -174 -250 -239 50
6505 50 -94 -294 -30 31 71 65 -21 -44 -81 -34 142 -133 -153 -92 349 107 270 -14 -29 133 174 170 -52 44 26 -262
6531 -262 81 -48 -510 -145 -134 -16 159 63 -52 -75 -48 -13 252 -158 -96 -223 57 -52 -102 -129 -115 -101 73
6554 73 -54 74 -24 211 303 16 111 -77 27 179 -80 107 100 187 144 123 13 -76 12 -132 166 -314 14 147
6578 147 54 206 -65 251 169 236 249 -94 112 31 143 157 -106 112 129 -32 60 -78 -41 141 -93 -77 -71 -108
6602 -108 -109 -28 81 45 101 -40 -51 -59 13 -373 89 151 161 25 -86 81 44 -134 -69 48 -43 112 -135 20 -100
6627 -100 -46 -108 -12 -85 -186 72 -135 201 -49 -140 -93 -115 -96 -16 55 -38 -204 22 -20 13 -110 -52 -263 -50 66
$$ packed form
6458iP9P8N9j82Pj76K88j89r5K08j19L39k66j81K18j84nN5qJ01j45J43l4m9k82
6483c49L17k92L43m4j31P9M11l59M9k74J38k5l2J33j17K69k96M81m75p6J1K89
6505E0j44k00K64O1M0oq6k3l7M7J76k75k0O1M41k42J63k84j5J62M1mk22R6j8k88
6531b62L43j29m62L65J1J18J75r6j15k3K7L5K65m10O2j27K80j09n0k7J4J4J74
6554G3j27J28r8K35R2k87R5j88J04J52k59J87pQ7m3k1j10q9Q8j44K98m80L28J33
6578A47r3J52k71L16q2O7J3l43K06q1J12J4k63K18J7j61R2j38L7J82k34J6Ol7
6602a08jQ1J09l6N6j41j1qP2l86M62O2J0j36j11J67l7j78O5J17r1J55k47J55j20
6627a00N4o2R6p3j01K58k07L36k50r1M7k2J9Q0P1r3j66K26m2L3j23N8k11K13J16
$$ plain form
6652 66 50 138 80 -37 -5 -79 -122 17 204 -118 -152 -22 -72 -125 2 -69 -82 -58 357 162 20 -101 32 -39 -80
6677 -80 -83 7 150 175 -63 -79 192 14 199 118 -156 -61 -33 340 -5 -3 -67 40 -98 206 -56 22 172 -180
6701 -180 -146 76 -184 84 -51 7 7 -204 78 -40 -71 106 124 -56 3 -185 -173 -55 5 -105 22 228 174
6724 174 0 113 -225 103 -261 -38 -87 -213 -101 -138 217 -159 24 -169 34 49 246 -90 59 59 -31 83
6746 83 -107 55 -154 -161 133 -38 -4 217 139 -90 -169 1 218 -25 -79 47 35 -53 -256 -12 -29 -191 41
6769 41 12 -195 -106 8 -37 -65 -66 -127 151 176 167 -191 146 95 145 27 132 -131 -118 -20 61 65 22 -117 -216 122 -80
6796 -80 119 193 -49 115 36 -52 243 -33 90 188 -22 -275 23 208 37 -199 30 -18 28 -197 -176 223 136
6819 136 -58 262 -20 -213 65 -155 154 1 -82 -138 157 12 -177 -46 125 -81 345 -61 -115 18 17 29
$$ packed form
6652F6j6Q8n8j17L2p4m3J39J87l22l4J30n0n3J27p1j3K4M15j95j42j21J33p1m1
6677h0lR0J43K5k38j6K71j78J85q1k74R5K8L73l45Ko4J07j38L04k62P8J50l52
6701a80L4K22k60K68j35N8%k11K82j18l1J77J8j80N9j88J2J18O0j10J27K06n4
6724A74j74J13l38L28l64K23m9j26J12l7L55l76J83j93K03J5J97l36J49%r0J14
6746H3j90J62k09pK94j71L4K21p8k29p9J70K17k43n4J26j2q8k03K44j7j62K32
6769D1k9k07Q9J14m5k8jo1K78K5rl58L37n1N0j18J05k63J3R8Q1Mm3j39r9L38k02
6796h0J99P4k42J64p9q8K95k76J23R8k10k53K98J85j71k36K29m8M6k25K1L99q7
6819A36j94L20k82j93K78k20L09j53q3n6K95j45j89J31J71k06M26m06n4J33jJ2
$$ plain form
6841 29 67 14 -20 -21 75 -31 29 140 55 119 201 32 -89 101 -101 130 -111 -207 -54 284 67 -211 9 84
6865 84 -108 98 295 139 -137 109 100 256 160 -84 115 70 121 -135 -274 -44 42 31 53 9 100 -151 74 -174
6889 -174 127 -54 -114 -103 -232 158 188 -54 -221 -38 -118 130 211 -141 -159 69 -79 162 -52 -22 93 -3 95
6912 95 101 109 80 215 -114 341 207 -1 -113 67 -43 -273 157 -64 -204 -12 -74 76 46 225 -61 -51 -234
6935 -234 162 59 -26 -246 203 157 175 125 -21 -76 -15 62 2 -82 -124 -63 -25 -8 -248 -71 111 -181 12 -48 89
6960 89 98 -10 50 -246 -48 97 40 -224 109 63 110 -35 -195 44 37 121 230 197 -107 58 -35 -138 29 2
6984 2 349 -140 38 234 225 43 -34 116 -24 -107 395 -179 52 71 214 125 47 166 -48 -206 61 -153 99
7007 99 -209 -55 -88 37 148 -9 81 -37 -91 -33 -44 -118 69 19 -7 71 132 -37 -56 136 -51 60 -101 -73
$$ packed form
6841B9L8n3l4jR6j06O0J11q5O4Q2j69j21J90k02K31k41r6J53L38k17k78K20P5
6865H4j92K06J97j56k76K46rJ56r6k44J99m5N1k56j39K30Q6j1K2m4R1k51K25k48
6889a74L01j81o0J1j29L90L0k42j67J83q0K48Q1l52j8K28j48K41k14L0J15r6R8
6912I5OQk9J35l29M55j34k08j12J80j10k30M30k21j40J92o2J50l0J79k86J0j83
6935b34L96j03q5k20M49m6J8n0j46n5O1P7o0q4m2O1L8J7k40J77J82k92J93o0J37
6960H9Rj08O0k96J98J45n7k64L33m6M7j45j60K39pQ4J09l3l04J65r3j03J67k7
6984BL47m89J78J96rj82p7J50j40q3N02n74K31J9J43q9p8J19k14j58K67k14K52
7007I9l08J54l3J25J11j57R0j18n4N8j1p4J87n0k6P8O1j69j9J92j87J11j61K8
$$ plain form
7031 -73 -130 55 124 44 166 52 -10 -107 43 -105 -180 18 166 36 50 227 -4 -38 -222 -54 -249 -56 127
7054 127 -203 -104 -361 -195 -59 44 -62 -122 112 -51 305 55 89 -43 6 -87 305 80 159 1 -45 248
7076 248 121 -89 208 32 62 -6 211 -12 -46 189 -5 130 104 29 87 61 99 249 -90 -136 96 -135 -38
7099 -38 167 -61 108 106 -65 47 175 130 -13 -154 10 -117 171 -58 -305 85 -210 -68 -115 -261 81 -190
7121 -190 -25 161 -162 75 -10 -184 -111 24 51 91 -148 12 -271 -3 224 167 63 48 -79 155 -7 -109
7143 -109 -16 162 -96 -58 63 -84 38 84 -101 -53 -47 -17 140 -96 -42 -7 -102 -124 168 -35 159 97 46 94 -185
7168 -185 -138 47 -18 -75 51 -286 104 -48 18 -156 -3 100 259 -59 -241 -60 -129 -29 105 113 -150 13
7190 13 -131 158 203 -52 -167 35 -98 62 -13 248 -107 1 161 89 -137 54 184 102 -329 -110 160 -121
$$ packed form
7031g3n7J85O9q0J22j14o2r7J50j48p5J98J48j30J4J77k31l4j84J68j95J93J83
7054A27l30R9k57J66J36J03j06o0K34j63L56k50L4j32M9r3L92k25P9j58m6K93
7076B48j27k10K97j76L0o8K17k23l4K35j94J35k6p5N8k6L8J50l39m6K32k31R7
7099c8K05k28J69kj71J12J28m5j43j41J64j27K88k29k47L90k95J42m7j46L42k71
7121a90J65J86l23K37q5j74P3J35K7M0k39J60k83K68K27n7j04j5j27K34j62j02
7143a09R3J78k58L8J21j47J22M6j85M8OL0J57k36N4L5r5k2K92k03J94o2n1M8k79
7168a85M7J85o5n7J26l37L90j52O6j74J53J03J59l18j82J81o9J00J34Qk63J63
7190A3j44K89M5k55j15K02j33J60p5K61l55J08J60p2k26J91J30q2m31K19K70k81
$$ plain form
7212 -121 -111 8 -116 -313 156 -11 -217 28 16 139 113 34 -23 150 153 -70 25 -162 105 -230 -153 5 8 84
7236 84 -205 -102 -41 177 99 114 107 -103 19 7 163 -25 32 177 12 -128 -46 -184 86 -65 -161 2 322
7259 322 -19 152 36 215 117 37 -2 5 -62 -50 -50 -40 56 64 -6 -140 206 -67 -27 -53 0 -43 -146 76 -79 -134
7285 -134 -159 -12 -61 -56 117 139 176 208 67 193 326 -9 -54 -20 64 95 -161 -81 143 304 -76 5 59 36 129
7310 129 -95 -100 -16 42 -3 107 23 44 13 22 218 35 20 71 -35 -135 214 146 63 -6 96 -43 25 -51 30 -15
7336 -15 -141 104 93 140 -100 -10 -138 103 -29 -18 232 191 90 -27 96 102 124 -108 -20 156 322 -94 99
7359 99 -124 79 104 -78 51 38 125 267 160 106 -86 -37 77 60 -83 383 279 -172 64 52 -118 -58 -37
7382 -37 -21 -77 15 -201 86 148 138 -39 -2 205 -95 247 67 82 -67 62 -253 -188 -127 -156 191 53 140 251
$$ packed form
7212a21J0J19j24j97M69j67k06K45j2J23k6p9n7J73Lk23R5j87K67l35P7J58LP6
7236H4k89J03O1K18p8J5pk10J22j2J56j88N7J45j65j40Q2j38K70j51r6J63L20
7259C22l41J71j16J79r8q0l9Po7J2%J0R6Qp0j34L46k73M0k6N3m3j03K22j55n5
7285a34k5J47m9NJ73K2L7L2j41J26J33l35m5L4Q4L1k56Q0K24J61l80Q1N4k3R3
7310A29k24nQ4N8m5J10q4K1l1RJ96j83j5N1j06j00L49o8q3o9J02j39O8p6Q1m5
7336a5j26K45j1M7k40R0j28K41j32J1K50m1j01j17J23OK2k32Q8J76J66m16J93
7359I9k23K03K5j82J29j3Q7J42j07n4j92M9J14j7j43M66j04m51K36j2j70O0K1
7382c7J6n6R2k16K87O2j0j77L7K07l00L42j80J5j49J29l15O5O1k9L47j38Q7J11
$$ plain form
7406 251 -223 200 -175 -7 85 -47 20 65 -236 -32 18 16 -77 -87 368 142 -49 69 93 -85 247 189 20
7429 20 -109 230 -151 25 292 -164 16 60 34 -276 -266 334 -62 -126 -27 113 -26 -98 32 -156 -38 174
7451 174 -152 -114 44 -28 310 126 -12 63 -81 81 32 34 217 -209 212 207 21 -96 -123 -87 72 71 96 -183
7475 -183 46 -14 -63 137 -40 -32 -144 -52 24 135 -330 -153 120 280 -152 -1 128 13 -26 -446 -12 -59 -94
7498 -94 49 -207 91 -40 -52 -242 -119 335 -229 24 163 164 36 -76 61 -160 -182 136 113 -15 395 23
7520 23 248 -75 -153 143 303 42 253 -142 -9 249 37 162 -64 15 -218 181 100 -246 219 -170 343
7541 343 158 38 -11 110 -52 -8 -76 38 222 71 -20 -272 337 66 -208 -51 247 -201 58 145 -24 20
7563 20 -76 86 -87 -41 47 106 83 -183 192 -15 -96 -122 6 184 126 -48 -85 -97 -80 177 154 -74 87 -186
$$ packed form
7406B51m74M23l75J68R2j32O7M5l01K04N0kr3j0M55k26j91J18K4j78L32n8j69
7429B0j29L39l81J76K67m56J80M4k6l10J0O00l96o4R9J40j39p2J30j88J18K12
7451A74l26L8J58p2L38j84j38P5j44J62m9KJ83m26M21nj86j17k7L6J59jK5k79
7475a83K29o0m9K00j77Qj12R2P6J11m65J77K73J60m32J51J29j15l9m20M34m7l5
7498i4J43k56K98j31j2j90J23M54n64K53J39Jj28j12J37k21k2L18k3j28M10l72
7520B3K25l23p8K96J60k61K11l95J33K58k12J25k26P9k33L99q1l46M65l89N13
7541C43j85j20m9J21j62M4o8J14J84j51r1k52O09k71k74J57K98m48K59Q7j69M4
7563B0r6J62j73M6Q8N9k3k66L75k07q1k6J28J78n8j74l7j2J7K57k3k28J61k73
$$ plain form
7587 -186 28 -203 281 103 -13 105 -10 -133 -237 44 179 136 87 243 89 -111 -161 135 22 147 -43
7608 -43 68 -22 -28 -123 -40 -91 -59 50 23 -23 22 -80 102 22 -69 -392 -75 296 90 86 174 173 10 -110 21 -228
7634 -228 -69 80 -207 -197 49 135 5 207 -90 -21 85 35 15 47 3 -137 -88 109 -204 -33 -32 -345 -110
7657 -110 -116 87 -190 69 99 -169 -73 -26 207 -25 -3 -198 -166 -51 -18 -275 -120 -106 350 186 2 -9 -50 76
7681 76 152 -167 54 65 109 -17 131 235 141 -81 -76 59 -36 -72 3 -130 127 -284 163 -7 -170 104 -85
7704 -85 133 -301 -201 201 311 -8 -127 38 274 -248 -77 184 146 28 34 -142 12 261 -38 302 156
7725 156 -27 -62 18 23 -15 147 -42 -93 55 255 6 -50 -75 -59 -53 46 220 -176 -83 -206 38 225 -55 135
7749 135 37 61 -43 -30 -56 21 40 136 -39 80 -172 200 189 -27 -94 -117 -22 -109 174 -30 -35 74 40 73 -116
$$ packed form
7587a86K14k31M84j78j16J18j15j23j04K81J35m3m9J56j54k00n0K96j13J25j90
7608d3J11r0or5Q3n1L2J09k7m6M5j02J82q0r1l23L17L71k06mQ8jj63j20J31k49
7634b28J59J49k87J0K46Q6j30K02k97O9J06n0k0L2m4j40M9J97l13J71Jl13K35
7657a10oK03k77K59L0k68R6M7K33k32K2j95L2J15L3k57J55J4M56j64j84j1m1J26
7681G6P6l19K21J1M4j26J48J04r4k22NJ35r5l6P5j33K57m11M47j70j63K74j89
7704h5K18m34J00M02J10l19j19J65K36n22J71K61l8j18Oj76J54K49k99L40j46
7725A56j83l5Q0Nl8J62j89n1J48K00k49n6k5J6OR9J74l96R3j23K44J87k80J90
7749A35r8K4j04J3k6P7J9R6j75J19k52L72j1k16o7k3R5q7K83k04nJ09l4L3j89
$$ plain form
7774 -116 233 -35 -207 -65 32 -231 170 361 93 49 -114 167 63 140 -51 -87 49 -72 -174 -100 29 -103
7796 -103 -240 -25 -227 -107 -60 90 -39 26 63 -78 -64 213 -135 84 31 189 -17 -113 75 158 -92 117
7818 117 -81 -49 92 -4 -20 335 -4 -66 20 -109 -51 -97 -13 121 -234 -75 32 -48 -85 -14 81 -266 -24 46
7842 46 -174 -6 -25 -7 -107 -155 96 -5 -373 35 -2 83 -23 -212 -147 -281 122 151 -151 -52 -43 -144 24 -59
7866 -59 89 16 -230 -113 -161 58 -51 -115 250 -117 -47 151 -211 100 121 -99 6 -72 -125 -65 -73 -84 302 108
7890 108 -66 -81 -71 -184 -65 -10 45 101 -93 50 160 -61 97 75 125 204 68 -13 -111 -35 -20 127 -184 -4
7914 -4 73 -17 -79 42 -129 -17 59 -152 -171 174 144 77 -98 2 68 110 260 -87 228 62 108 -2 -98 25
7938 25 -65 147 -5 166 124 32 95 -124 153 -180 235 235 -202 191 -222 48 -412 63 -150 -234 -158 211 -205
$$ packed form
7774a16L49k68j72J42R7k63M01J91k68m4j63K81j04P7j91l6J36j21j02P4J29j32
7796a03j37K15k02J20M7J50j29O5L7j41J4K77l48K19n3J58k06r6J88Q3k50K09
7818A17j98L2J41r6j6L55l39o2Q6j29N8m6Q4J34l55J59J07q0l7P1R5l47K42P0
7842D6k20J68j9J8j00m8K51j01l68M08l7Q5j06j89O5j34M03K9l02R9Rj01J68q3
7866e9J48p3k46J17m8K19j09o4L65l67P0J98l62L11K1k20J05p8n3O0qj1L86j94
7890A08j74j5J0j13J19N5N5N6j94J43J10k21J58k2N0P9j36q1r8P6J5J47l11J80
7914dP7r0o2J21j71J12P6k11j9L45l0o7j75J00O6M2J50l47L15j66M6j10r6J23
7938B5r0K12j52J71m2r2O3k19K77l33M15%m37L93m13K70m60M75k13q4P6L69m16
$$ plain form
7961 -205 -126 -199 -153 135 -109 -21 -189 135 119 75 -83 92 -167 -118 132 25 6 -2 307 77 2 -64 112 214
7985 214 157 -119 -163 -22 -141 -57 -2 -220 118 176 86 -64 -82 204 88 -45 97 -86 150 -62 334 -253
8007 -253 -291 -135 83 25 175 62 -51 132 -271 209 144 119 53 -54 -81 -99 128 123 47 151 -106 21 266
8030 266 109 -63 -95 -30 93 -194 -222 213 80 99 -18 0 -83 74 41 38 -88 38 93 -195 -120 48 -185 43
8054 43 37 -126 -66 19 358 18 75 142 207 -11 98 9 45 186 -129 -31 68 72 50 -112 115 -30 -13 129 -73
8079 -73 -100 -118 277 54 13 96 -192 32 -131 -36 123 -61 -122 -10 -117 -97 69 96 -7 -148 -25 -173 274
8102 274 162 57 38 189 59 -120 -68 66 140 -217 91 -103 98 -107 73 -37 -37 -95 49 80 145 266 46
8125 46 99 -311 -192 165 -82 8 112 19 37 -84 -43 -193 -135 -169 -123 -36 -82 -13 -33 85 -143 147 -80 82
$$ packed form
7961b05P9p3M6K88k44Q8j68L24j6m4j58J75k59M9K50j07j9qL09k30p5o6J76J02
7985B14n7k76m4J41j19Q4N5k18L38N8r0j50j8K86j16j33J42j83K36k12L96n87
8007b53l8J56K18n8J50j13j13J83m03M80o5k5o6j07k7j8K27np6J04k57J27K45
8030B66j57j72l2O5J23k87k8M35j33J9j17J8q3J57l3lj26J26N5k88P5J68k33K28
8054D3oj63O0Q5L39l40N7O7O5k18J09q9L6J41l15R8R9Mk2j62K27j45J7J42k02
8079g3k7j8L95k23m1Q3k88K24j63R5J59j84o1J12j07K0J66K7j03j41J23j48M47
8102B74j12j05j9J51j30j79N2J34P4l57L08j94K01k05J80j10%n8J44L1O5J21k20
8125D6N3m10J19L57k47R0J04r3J8j21M1j50N8l4M6Q7m6O9k0J18k28K90k27J62
$$ plain form
8149 82 73 -271 -37 131 -73 -252 -41 -53 79 -144 -296 -175 -52 53 -57 85 -33 -114 -89 204 -96 -132
8171 -132 86 -115 -58 -102 -52 123 -53 -41 -130 -185 183 133 46 -71 -153 77 2 59 41 -85
$$ packed form
8149H2rl44K34J68k04j79K11j2J32k23j52J21J23J05j10J42j18q1K5K93l00l6
8171a32K18k01N7m4N0J75j76J2q9n5L68n0q7j17q2K30p5N7j8j26
8191h5
$$ Imaginary data points
##PAGE= N=2
##DATA TABLE= (X++(I..I)), XYDATA
$$ plain form
0 0 0 0 0 0 0 0 0 0 0 0 0 0 2 -8 8 -8 8 -16 16 -16 24 -24 32 -39 40 -48 56 -65 75 -87 98 -112 127 -143 162
35 162 -181 204 -227 254 -282 314 -348 386 -426 471 -520 574 -630 695 -766 845 -931 1025
53 1025 -1132 1255 -1391 1547 -1731 1944 -2201 2511 -2901 3401 -4076 5028 -6475 8921 -13812
68 -13812 27276 -139614 -411207 93772 343158 -8095 -245766 -39981 120022 79848 8357
79 8357 -52568 -109847 4983 182809 83906 -204859 -150373 190356 198716 -142950 -204702 70953
91 70953 170365 -7451 -112600 -51154 29046 65173 41639 -66693 -108543 38537 138256
102 138256 -16944 -137178 2423 105034 -1186 -47520 19598 -6329 -39208 58409 76221
113 76221 -75026 -98622 79494 120074 -63179 -118793 50527 99565 -43768 -60636 45573
$$ packed form
0@%%%%%%%%%%%%Kj0J6j6J6k4L2l2M0m8N6p1P9q8J04j21J40j62J85k10K39k70L05
35A62l43L85m31M81n36N96o62P34q12Q97r91J094j204J325j461J611j776J956
53A025k157K387k646K938l278L675m145M712n412O302p477R104j1503J5396k2733
68a3812M1088j66890k71593N04979K49386l51253k37671K05785J60003m0174p1491
79H357o0925n7279J14830J77826r8903k88765N4486L40729Q360l41666o1752K75655
91G0953R9412j77816j05149O1446Q0200L6127k3534j08332m1850J47080R9719
102A38256j55200j20234J39601J02611j06220m6334O7118k5927l2879R7617J7812
113G6221j51247k3596J78116M0580j83253n5614J69320M9038j43333j6868J06209
$$ plain form
124 45573 3472 -66803 42474 85238 -85837 -114472 98453 128721 -100020 -139002 78944
135 78944 126686 -53577 -95475 31016 52689 -10777 2931 8061 -44531 -6849 81960 24840
147 24840 -91721 -37046 91772 52055 -75245 -53953 52363 41768 -30265 -21820 4036
158 4036 -10456 10128 31096 -28602 -52978 31356 53841 -36276 -49655 34505 35079 -36229 -16958
171 -16958 43547 4654 -46612 11275 57339 -13476 -53796 19842 50723 -16007 -31797 18279
183 18279 12582 -21557 10087 30117 -31798 -47074 42424 58314 -52367 -73661 43910 71428
195 71428 -35510 -65522 14839 42991 1462 -16534 -14606 -12114 20504 41816 -12026 -58689
207 -58689 3268 73585 17412 -68578 -27228 60039 37646 -37650 -34401 14180 23892 8492
$$ packed form
124D5573m2101p0275J09277M2764j71075k8635K12925L0268k28741l8982K17946
135G8944M7742j80263m1898J26491K1673o3466J3708N130n2592L7682Q8809n7120
147B4840j16561N4675J28818l9717j27300K1292J06316j0595p2033Q445K5856
158D036j4492K0584K0968n9698k4376Q4334K2485r0117j3379Q4160N74p1308J9271
171a6958O0505l8893n1266N7887M6064p0815m0320P3638L0881o6730j5790N0076
183A8279n697l4139L1644K0030o1915j5276Q9498J5890j10681k1294J17571K7518
195G1428j06938l0012Q0361K8152m1529j7996J928K492L2618K1312n3842m6663
207e8689O1957P0317n6173q5990M1350Q7267k2393p5296L249M8581R712j5400
$$ plain form
219 8492 -7678 -28577 -15892 35453 31497 -41022 -49646 31887 51324 -26057 -50340 13194 36616
232 36616 -5151 -19946 -542 3291 3873 14893 1889 -22692 -3247 32844 13092 -30661 -13082
245 -13082 31028 15149 -24803 -9925 19376 2250 -14886 4192 7361 -15050 -6891 16680
257 16680 -280 -23025 -794 19159 -4662 -17861 5265 11215 -8382 -5173 12298 1782
269 1782 -12392 4952 17524 -3129 -14835 7998 18727 -4746 -14144 7509 12875 -6413 -7555
282 -7555 6810 188 -8780 4278 5892 -13784 -9309 14980 4584 -20497 -7605 17537 4828
295 4828 -16876 -4357 12590 3673 -6654 -152 3845 174 3669 6804 -3266 -6955 8421 13670
309 13670 -6044 -14450 7815 16808 -6129 -15637 4241 10106 -5257 -7639 736 -1692 -3400 3363
$$ packed form
219H492j6170k0899J2685N1345l956p2519q624Q1533J9437p7381k4283O3534K3422
232C6616m1767j4795J9404L833N82J1020j3004k4581J9445L6091j9752m3753J7579
245a3082M4110j5879l9952J4878K9301j7126j7136J9078L169k2411Q159K3571
257A6680j6960k2745K2231J9953k3821j3199K3126N950j9597L209J7471j0516
269A782j4174J7344J2572k0653j1706K2833J0729k3473r398K1653N366j9288j142
282g555J4365o622q968J3058J614j9676M475K4289j0396k5081J2892K5142j2709
295D828k1704J2519J6947q917j0327O502L997l671L495L135j0070l689J5376N249
309A3670j9714q406K2265Q993k2937r508J9878N865j5363k382Q375k428j708O763
$$ plain form
323 3363 -801 -10896 -1780 11117 576 -12968 -1653 12104 3659 -8393 -1762 8441 4425
336 4425 -2769 -167 3722 1771 1147 3286 -442 -3867 3502 5910 -5249 -7863 4823 6171 -7897
351 -7897 -8099 4166 3025 -5791 -4080 894 -1265 -990 1297 -1740 -3875 2246 5807 -646 -5120
366 -5120 1218 7848 3151 -4489 -1684 5825 4066 -1335 -552 328 -842 2117 4099 -3841 -7986 2228
382 2228 7275 -3156 -9690 -1994 4800 1708 -4294 -6055 -2395 4401 5193 -2837 -7332 -227 8373
397 8373 5822 -4198 -7343 2797 12242 5070 -8329 -6674 6556 11573 1170 -11167 -7319 8933
411 8933 12564 -5643 -16326 -1873 12611 4468 -10335 -10877 -501 8974 5895 -8062 -13725 830
425 830 15670 6524 -13983 -12994 10513 19580 -576 -18424 -4310 18241 13083 -9128 -12399 3360
$$ packed form
323C363m164j0095R116J2897j0541j3544J1315J3757q445j2052O631J0203m016
336D425p194K602L889j951o24K139l728l425P369K408j1159k614J2686J348j4068
351g897k02J2265j141q816J711M974k159K75K287l037k135O121L561o453m474
366e120O338O630m697p640K805P509j759n401P83Q80j170K959J982p940m145J0214
382B228N047j0431o534P696O794l092o002j761L660O796P92q030m495P105Q600
397H373k551j0020l145J0140R445p172j3399J655J3230N017j0403j2337L848J6252
411H933L631j8207j0683J4453J4484q143j4803n42J0376R475l079j3957n663J4555
425H30J4840r146k0507R89K3507R067k0156j7848J4114K2551n158k2211l271J5759
$$ plain form
439 3360 11653 6429 -4650 -11853 -3621 12342 10736 -10744 -18532 930 17961 5482 -18315
452 -18315 -16868 10237 19605 -4457 -20898 -3895 15241 9402 -6573 -9652 -783 8458 10726
465 10726 532 -11429 -6568 12161 17057 -3976 -20817 -3193 23228 12462 -20296 -19180 12304
478 12304 19123 -6294 -17845 -2655 7383 4054 208 -6158 -11685 -1069 16184 8349 -18544
491 -18544 -17878 15280 26852 -6508 -29018 -155 29292 10254 -20180 -11627 12055 13315 501
504 501 -6714 -7645 -1480 10989 11006 -9392 -20901 478 23894 7051 -26211 -19790 18927 24794
518 24794 -11940 -28940 18 24188 7480 -16196 -10728 6707 10729 4009 -2573 -7520 -4549
531 -4549 10859 17484 -4562 -24273 -861 29952 10949 -28616 -17947 22801 20810 -15466 -21434
$$ packed form
439C360Q293n224j1079p203Q232J5963j606k1480p788J9462J7031j2479k3797
452a8315J447K7105R368k4062j6441J7003J9136n839j5975l079Q869R241K268
465A0726j0194j1961M861J8729M896k1033j6841J7624K6421j0766l2758J116L1484
478A2304O819k5417j1551J5190J0038l329l846o366n527J0616J7253p835k6893
491a8544O66L3158J1572l3360k2510K8863K9447j9038l0434Q553K3682J260j2814
504E01p215r31O165J2469J7k0398j1509K1379K3416j6843l3262O421L8717N867
518B4794l6734j7000K8958K4170j6708k3676N468J7435M022o720o582m947K971
531d549J5408O625k2046j9711K3412L0813j9003l9565J0669M0748j991l6276n968
$$ plain form
544 -21434 4251 13258 95 -6756 -4635 -5810 -597 12373 6495 -18156 -16364 18335 25502 -13070
558 -13070 -29037 6866 31261 3945 -23594 -8723 16658 14229 -3753 -11006 -4510 5896 10569
571 10569 3076 -11309 -13402 5264 19140 1335 -24343 -12932 20295 18784 -16912 -25864 6421
584 6421 25102 1771 -22249 -9044 14937 13387 -5153 -9805 -852 5953 7855 4923 -7501
597 -7501 -11865 7571 21106 -647 -23786 -4681 23203 9644 -19784 -13635 12213 12323 -7789
610 -7789 -12212 357 5084 328 -914 -1762 -6163 -2093 8925 5466 -9775 -8100 9114 11788
624 11788 -4061 -10005 2409 10185 3065 -4927 -3016 2833 3870 1254 -1020 -2179 -1633 1171 3607
639 3607 -506 -7591 -4395 5631 5763 -5834 -9561 1384 8212 144 -8243 -3725 6096 4897 -2388
$$ packed form
544b1434K5685R007j3163o851K121j175N213J2970n878k4651J792L4699P167l8572
558a3070j5967L5903K4395k7316k7539J4871K5381k429j7982p253O496J0406M673
571A0569p493j4385k093J8666J3876j7805k5678J1411L3227j511l5696q952L2285
584F421J8681k3331k4020J3205K3981j550j8540m652Q953O805J902k932j2424
597g501m364J9436J3535k1753k3139J9105K7884j3559k9428O149K5848J10k0112
610g789m423J2569M727m756j242q48m401M070J1018l459j5241J675J7214K674
624A1788j5849n944J2414P776p120p992J911N849J037k616k274j159N46K804K436
639C607m113p085L196J0026J32j1597l727J0945O828q068q387M518R821j199p285
$$ plain form
654 -2388 -3646 1104 2493 3081 2527 -2265 -3748 4008 8525 -754 -8737 -399 8873 3069 -7368
669 -7368 -4945 3874 3923 -2344 -4812 -1678 1245 975 -985 -2972 -2499 349 2507 59 -3501 -1216
685 -1216 3394 2553 -1515 -1135 1471 2329 1507 688 -459 230 2472 2103 -169 -902 -571 484 1392 -284
703 -284 -2754 -2047 1002 1227 -2407 -3905 -903 2185 634 -3030 -3342 610 3204 501 -2788 -1327
719 -1327 2505 3767 773 -2496 -657 4231 3903 -1462 -2905 1539 4325 498 -2814 -1580 1635
734 1635 2175 -1068 -4122 -1653 2223 1012 -3186 -3565 -175 1712 24 -2907 -2342 1727 2797 -783
750 -783 -2225 823 3478 1305 -1210 -252 1967 2502 1096 -1151 -82 2382 1696 -1101 -1323 218
766 218 911 -260 -1908 -2091 -203 702 -1675 -2706 -859 678 -560 -1570 -1003 665 646 83 -557
$$ packed form
654b388j258M750J389N88n54m792j483P756M517r279p983Q338R272n804j0437
669g368K423Q819M9o267k468L134K923k70j960j987M73K848K158k448l560K285
685a216M610q41m068L80K606Q58q22q19j147O89K242l69k272p33L31J055R08j676
703b84k470P07L049K25l634j498L002L088j551l664l12L952K594k703l289J461
719a327L832J262k994l269J839M888l28n365j443M444K786l827l312J234L215
734A635N40l243l054K469L876j211m198l79L390J887j688k931N65M069J070l580
750g83j442L048K655k173k515R58K219N35j406k247J069K464o86k797k22J541
766B18O93j171j648j83J888R05k377j031J847J537j238j010N67J668j9n63o40
$$ plain form
783 -557 346 1695 1451 251 606 1479 1391 925 695 292 740 983 -24 -1127 -42 466 -960 -1382 -809
802 -809 -361 -465 -1237 -1089 -945 -460 -888 -961 69 107 -350 408 574 -118 475 1575 1094 -216 861 1588
822 1588 1004 193 756 820 145 300 118 -410 -761 -580 60 -737 -1797 -1548 -82 -108 -1938 -1720 240
841 240 225 -889 -823 -416 -7 1239 1370 -697 -366 2419 2581 -511 -1132 1255 2127 838 -442 -370 450
860 450 1267 298 -1439 -2016 -106 1399 -695 -3111 -2168 1327 1379 -2179 -2611 -68 1381 79 -1015
877 -1015 -900 -180 2089 1797 -1320 -1710 2172 3356 60 -1499 1163 1942 534 138 -88 -864 -261
894 -261 1909 601 -3090 -2964 2343 2130 -3369 -4138 1497 2634 -2375 -2852 756 653 -1287 834 1775
911 1775 -1897 -1616 3865 3350 -2799 -2920 3722 4640 -1229 -3217 1386 3467 875 -1799 -1039 429
$$ packed form
783e57R03J349k44j200L55Q73q8m66k30m03M48K43j007j103J085N08j426m22N73
802h09M48j04p72J48J44M85m28p3J030L8m57P58J66o92N93J100m81j310J077P27
822A588n84q11N63O4o75J55j82n28l51J81O40p97j060K49J466k6j830K18J960
841B40j5j114O6M07M09J246J31k067L31K785J62l092o21K387Q72j289j280P2Q20
860D50Q17r69j737n77J910J505k094k416R43L495N2l558m32K543J449j302j094
877a015J15P20K269k92l117l90L882J184l296j559K662P79j408l96k26p76O03
894b61K170j308l691J26N307k13n499p69N635J137n009m77L608j03j940K121R41
911A775l672K81N481n15o149j21O642R18n869j988M603K081k592k674P60J468
$$ plain form
927 429 931 397 -652 -2205 -1448 1104 840 -2321 -2911 -631 1847 1002 -2267 -3378 964 4934 497
944 497 -5118 -935 6273 2555 -3778 -761 4312 1752 -1753 1129 2221 -2198 -1591 4378 2276 -6101
960 -6101 -3997 6236 3563 -7741 -5727 6050 3847 -6663 -4456 4050 1931 -4150 -362 3381
974 3381 -1826 -3225 3581 4421 -3311 -3754 4731 5909 -2488 -4934 2500 5866 -9 -4241 -256 3204
990 3204 984 -1890 -1391 -58 153 -378 -869 -689 -1435 -1760 538 2424 -1900 -4865 1026 6347 -705
1007 -705 -7356 423 8645 872 -6968 464 7690 347 -4782 2265 4701 -2799 -3260 5135 3433
1022 3433 -6916 -3664 7676 3123 -9276 -4013 7640 2408 -8319 -3236 5832 1056 -5931 -521
1036 -521 3563 -1318 -3204 2770 3478 -2723 -2226 4319 3713 -2538 -2630 3276 4053 -345 -2217 -21 1904
$$ packed form
927D29N02n34j049j553P57K552k64l161n90K280K478q45l269j111M342L970m437
944D97n615M183P208l718o333L017N073k560l505K882J092m419O07N969k102q377
960f101K104J0233k673j1304K014J1777k203j0510K207Q506k119o081L788L743
974C381n207j399O806Q40p732m43Q485J178q397k446P434L366n875m232L985L460
990C204k220k874M99J333K11n31m91J80p46l25K298J886m324k965N891N321p052
1007g05o651P779Q222p773p840P432P226p343n129P047K436p500m61Q395j702
1022C433j0349L252J1340m553j2399N263J1653n232j0727N083R068m776o987N410
1036e21M084m881j886N974P08o201M97O545o06o251r2N906P77m398j872K196J925
$$ plain form
1053 1904 1259 -999 -2223 19 1819 -746 -2969 36 1057 -2248 -1821 2440 -121 -4642 -641
1068 -641 5411 -426 -6334 468 7282 115 -6364 1286 6890 -99 -4731 2418 4804 -2467 -2539 4338
1084 4338 2357 -5049 -1365 6044 564 -6835 -864 5884 -444 -6369 -460 3922 -1564 -3693 994
1099 994 1273 -2498 -809 2509 12 -2697 1187 3325 -574 -1717 1742 2642 -303 -286 1140 -20
1115 -20 -289 1988 623 -2546 -335 2849 -455 -3767 -360 2370 -1392 -3143 787 1163 -3029 -1540
1131 -1540 2882 303 -3641 -121 4362 -506 -3681 1789 4244 -1426 -2658 2844 3019 -2405 -1046
1146 -1046 3547 589 -3214 500 3791 -1268 -3948 1530 2813 -2864 -3075 1875 948 -3400 -1110
1161 -1110 2177 -975 -3018 1140 2229 -2313 -2455 2942 1854 -2381 -761 3198 873 -1969 1083
$$ packed form
1053A904o45k258j224K242J800k565k223L005J021l305M27M261k561m521M001
1068f41O052n837n908O802O814p167o479P650N604o989m632P149K386p271p2O877
1084D338j981p406L684P409n480p399N971O748o328n925N909M382n486k129M687
1099I94K79l771J689L318k497k709L884K138l899j143L459R00k945J7J426j160
1115b0k69K277j365l169K211L184l304l312L407K730l762j751L930L76m192J489
1131a540M422k579l944L520M483m868l175N470K455n670j232N502J75n424J359
1146a046M593k958l803L714L291n059k680N478J283n677k11M950r27m348K290
1161a110L287l152k043M158J089m542j42N397j088m235J620L959k325k842L052
$$ plain form
1176 1083 2762 -555 -1175 2137 1601 -2114 -769 2682 198 -2962 -75 2102 -1206 -2872 841
1191 841 884 -2547 -1240 1979 -395 -2902 699 2473 -1220 -1967 2035 2231 -1707 -667 3012 1123
1207 1123 -2060 800 3022 -66 -1713 1587 2487 -1831 -1619 2227 1046 -3139 -1481 2120 -635
1222 -635 -3068 130 1544 -2014 -2379 1522 992 -2423 -942 2043 584 -2232 514 2641 196 -1139
1238 -1139 1472 1844 -1073 -519 2447 885 -1809 368 2072 -596 -2180 844 1294 -1928 -1577 962
1254 962 -6 -2216 -464 1454 -973 -2017 912 1301 -1787 -1089 1666 871 -1749 161 2104 484
1270 484 -1054 1172 2006 -535 -1018 1837 1159 -1393 -632 2032 158 -2104 -2 1383 -1280 -2160
1286 -2160 524 587 -1980 -1093 1308 220 -2210 -453 1589 -181 -1272 645 1516 -835 -153 1457
$$ packed form
1176A083J679l317o20L312n36l715J345L451k484l160K887K177l308j666L713
1191H41M3l431J307L219k374k507L601J774l693p47M002J96l938J040L679j889
1207A123l183K860K222l088j647L300R00m318K12L846j181m185J658L601k755
1222f35k433L198J414l558l65L901n30l415J481K985j459k816K746K127k445j335
1238a139K611L72k917N54K966j562k694K177J704k668j584L024M50l222L51K539
1254I62r68k210J752J918k427j044K929L89l088O98K755p95k620J910J943j620
1270D84j538K226Q34k541m83K855o78k552P61K664j874k262K102J385k663q80
1286b160K684O3k567Q87K401j088k430J757K042j770j091J917Q71k351O82J610
$$ plain form
1302 1457 1193 -868 388 2037 520 -1236 642 1844 -503 -1296 831 530 -799 -609 213 -736
1318 -736 -1529 199 356 -1278 -918 351 120 -1066 -340 301 109 -135 147 517 151 171 1283 917 -377
1337 -377 265 2047 548 -926 97 1295 -61 -925 142 536 -1061 -573 378 -481 -1494 -389 573
1354 573 -388 -1207 -249 515 -151 -758 -143 513 140 -82 483 455 76 821 912 350 3 665 939 -50 -252
1375 -252 192 178 6 -104 -168 -654 -201 225 -714 -886 -445 554 -100 -928 -591 204 169 -218 -237 402 585
1396 585 183 651 583 109 -11 1203 972 74 -162 273 1249 -75 -957 -9 632 -56 -1298 -395 686
1415 686 -180 -1033 -460 41 -619 -918 238 -47 -940 -465 872 825 -677 -705 1330 1331 -214 -756 928
1434 928 1369 -120 -647 864 957 -266 -394 556 18 -708 -771 794 -185 -1567 -851 582 369 -1547
$$ packed form
1302A457k64k061J256J649j517j756J878J202k347p93K127l01j329J90Q22r49
1318g36p93J728J57j634L60J269k31j186P26O41j92k44K82L70l66K0J112l66j294
1337c77O42J782j499j474J023J198j356q64J067L94j597M88R51q59j013J105R62
1354E73r61q19R58P64o66o07O15O56l73k22N65k8l79P45R1n62l47O62K74r89k02
1375b52M44j4j72j10o4m86M53M26r39j72M41R99o54q28L37P95l5l87j9O39J83
1396E85m02M68o8m74j20J214k31q98k36M35R76j324q82R48O41o88j242R03J081
1415F86q66q53N73N01o60k99J156k85q93M75J337m7j502k8K035Jj545n42J684
1434I28M41j489n27J511R3j223j28R50n38p26o3J565r79j382P16J433k13j916
$$ plain form
1452 -1547 -1330 882 1103 -1224 -1213 997 1337 -801 -517 1498 1129 -636 98 1706 526 -1047 240
1469 240 1957 82 -2197 -69 2246 -130 -2276 -808 1734 -181 -2528 -283 1221 -808 -1759
1484 -1759 346 712 -1112 -1176 982 1250 -1199 -1119 1450 1541 -656 -1246 1274 1999 -416 -636 1048 1293
1502 1293 -343 -780 377 768 -686 -896 747 483 -1255 -1555 793 512 -1744 -1616 1093 1162 -1762
1519 -1762 -1593 1343 1344 -1384 -1061 1491 1326 -1080 89 2083 960 -1224 250 2384 106 -2246
1535 -2246 492 2212 -607 -2335 241 1830 -603 -2112 -138 765 -993 -1227 173 143 -1418 -526
1551 -526 862 540 -1027 -404 1138 1034 -331 -65 806 1129 -111 -119 519 868 466 -368 -270 644 284
1570 284 -739 -432 595 -453 -944 31 388 -971 -1535 443 975 -1331 -1394 1069 1014 -875 -926 1268
$$ packed form
1452a547K17K212K21k327J1K210L40k138K84K015l69j765P34J608j180j573J287
1469B40J717j875k279K128K315k376k146J468K542j915k347K245J504k029r51
1484a759K105L66j824o4K158K68k449Q0K569R1k197n90K520P25k415k20J684K45
1502A293j636m37J157L91j454k10J643k64j738l00K348k81k256J28K709O9k924
1519a762J69K936Jk728L23K552j65k406J169J994j123k184J474K134k278k352
1535b246K738J720k819j728K576J589k433j509J974R03j758k34J400l0j561Q92
1551e26J388l22j567O23J542j04j365K66Q71L23j240qO38L49m02q34R8R14l60
1570B84j023L07J027j048m91R75L57j359n64J978N32k306o3K463n5j889n1K194
$$ plain form
1588 1268 1021 -1064 162 2046 109 -982 733 1581 -442 -1193 1179 1449 -555 -1398 1117 773
1604 773 -1229 -880 863 85 -1088 -299 806 -991 -1285 361 251 -1163 -644 960 267 -355 5
1621 5 654 97 62 617 416 -414 406 1038 432 -580 688 816 -282 -429 518 255 -901 -321 262 -531
1641 -531 -1073 471 266 -1200 -1173 706 724 -1488 -503 1008 125 -816 558 1260 -48 -711 1222 979
1659 979 -693 -154 1097 774 -1150 -423 1023 210 -1205 -185 677 -839 -1223 369 169 -1172 -837
1676 -837 667 -165 -1301 -427 711 -393 -671 408 451 -137 365 1197 232 -116 733 1429 243 -552
1694 -552 541 807 -415 -227 496 261 -985 122 758 -659 -1066 217 469 -1237 -875 666 -103
1711 -103 -1375 -302 868 -295 -775 356 995 -429 -463 1076 762 -494 116 1358 578 -725 287
$$ packed form
1588A268k47k085J226J884j937j091J715Q48k023p51K372K70k004q43K515l44
1604G73k002L49J743p78j173P89J105j797k94J646j10j414N19J604o93o22L60
1621EO49n57l5N55k01q30Q20O32o06j012J268J28j098j47R47k63j156N80N83p93
1641e31n42J544k05j466K7J879J8k212R85J511q83r41J374P02j308o63J933k43
1659I79j672N39J251l23j924P27J446q13j415J020Q62j516l84J592k00j341L35
1676h37J504q32j136Q74J138j104k78J079M3n88N02Q32r65l48Q49O96j186p95
1694e52J093K66j222J88P23k35j246J107O36j417m07J283K52j706L62J541p69
1711a03j272J073J170j163m80J131O39j424l4J539l14j256O10J242p80j303J012
$$ plain form
1728 287 1067 -157 -808 578 -135 -654 -579 406 -529 -1354 -272 575 -817 -1081 194 370 -340 -93 607
1747 607 147 -497 85 900 55 -412 614 902 -101 -447 915 767 -340 114 850 -363 -772 148
1765 148 373 -648 -731 443 -93 -1128 -304 454 -238 -1027 -382 395 -341 -467 541 519 -560 305 1010
1784 1010 57 -363 465 1126 -150 -387 556 896 -685 -413 702 402 -1038 -80 868 -556 -1369 62
1802 62 486 -856 -848 312 527 -1063 -475 638 189 -708 10 756 -155 -502 713 859 -243 158 1074
1821 1074 402 -590 147 768 142 -430 345 301 -687 -123 557 -447 -1194 -191 248 -547 -747 86 277
1840 277 -609 -387 603 417 -783 53 796 -10 -609 876 1274 -466 -430 1173 1207 -604 -223 1004 12
1859 12 -711 61 493 -462 -618 210 219 -652 -775 392 -120 -588 -238 173 -96 -395 242 241 -266 367 598
$$ packed form
1728B87P80j224o51J386p13n19P5R85r35q25J082Q47j392k64J275J76p10K47P00
1747F07m60o44N82Q15q45m67J026K88j003l46J362j48j107M54P36j213m09R20
1765A48K25j021q3J174n36j035Q24P58o92p89O45P77p36j26J008k2j079Q65P05
1784A010r53m20Q28O61j276k37R43L40j581K72J115l00j440R58R48j424q13J431
1802F2M24j342QJ160K15j590N88J113m49q97P18P46r11l47J215J46j102M01R16
1821A074o72r92P37O21o26n72P75m4r88N64O80j004p47J003M39p95k00Q33J91
1840B77q86K22R90j86j200Q36P43q06n99J485L98j740L6J603L4j811L81J227r92
1859A2p23P72M32r55j56Q28Rq71j23J167n12m68L50M11k69k99O37jn07O33K31
$$ plain form
1880 598 174 -81 715 963 -55 -369 499 733 51 75 923 113 -819 192 571 -373 -1179 126 460
1899 460 -753 -848 -36 52 -748 -539 225 170 -681 -118 683 119 -513 382 691 258 -353 592 909 499 -94
1920 -94 194 313 197 48 -393 -146 -67 -9 -368 -173 81 -491 -567 154 -33 -507 -62 124 -85 -293 -454
1941 -454 305 639 -62 -222 814 678 -488 -46 632 233 -267 -68 806 247 -708 71 226 -105 -905
1960 -905 -171 442 -287 -842 -244 514 108 -836 -66 607 -105 -629 112 679 1 -421 624 980 3 -423
1980 -423 649 959 -468 -446 728 499 -491 -727 554 424 -382 -840 227 228 -1081 -477 199 -336 -677
1999 -677 -527 395 -95 -867 7 427 2 -397 76 610 244 -106 503 861 493 162 91 569 63 -149
2019 -149 -121 293 130 -540 -303 437 82 -709 -361 302 42 -835 -56 448 -97 -702 184 469 -117 -434
$$ packed form
1880E98m24k55P96K48j018l14Q68K34o82K4Q48q10r32J011L79r44q06J305L34
1899D60j213r5Q12Q8q00K09P64n5q51N63Q01n64o32Q95L09m33o11R45L17m10n93
1920i4K88J19j16j49m41K47P9N8l59J95K54n72p6P21j87m74M45J86k09k08j61
1941d54P59L34p01j60J036j36j166M42O78l99n00J99Q74n59r55P79J55l31q00
1960i05P34O13p29n55N98P58m06r44P70O73p12n24P41N67o78m22J045L56r77m26
1980d23J072L10j427K2J174k29r90k36J281j30q06m58J067Jj309O04O76n35l41
1999f77J50R22m90p72Q74M20m25l99M73N34l66l50O09L58l68l31p1M78n06k12
2019a49K8M14j63o70K37P40l55p91L48O63k60q77P79N04n45o05Q86K85n86l17
$$ plain form
2039 -434 390 1238 -278 -380 742 864 -324 -501 1022 649 -624 -120 924 308 -920 -12 495 -144
2057 -144 -879 -176 76 -309 -613 62 461 -244 -466 83 -227 -175 -215 159 -12 318 37 205 220 321 60
2078 60 272 221 347 130 -178 300 21 -315 -402 267 312 -672 -327 195 -227 -1058 -192 484 -511 -920 233
2099 233 655 -346 -558 382 753 -310 -178 1026 530 -219 6 774 330 -534 359 525 177 -643 210
2118 210 169 -437 -513 437 245 -787 -455 417 -260 -744 -102 -75 -61 -606 -125 203 -263 8 378 -105 118
2139 118 264 170 -220 382 607 124 -234 319 457 -406 -470 551 309 -892 -368 477 -53 -991 -189 503
2159 503 -275 -661 100 340 -375 -494 259 356 -230 6 677 248 -299 262 640 144 -107 442 953 -56
2179 -56 -299 345 92 -368 -1 144 -468 -452 190 118 -507 -287 190 -195 -646 17 94 -287 -167 430 168
$$ packed form
2039d34Q24Q48j516j02J122J22j188j77J523l73j273N04J044o16j228R08N07o39
2057a44p35P03K52l85l04O75L99p05k22N49l10N2m0L74j71L30k81J68J5J01k61
2078F0K12n1J26k17l08M78k79l36q7O69M5r84L45N22m22q31Q66O76r95m09J153
2099B33M22j001k12R40L71j063J32J204m96p49K25P68m44q64Q93J66l48q20Q53
2118B10m1o06p6R50j92j032L32Q72o77m84O42K7J4n45M81L28m66K71L70m83K23
2139A18J46r4l90O02K25m83l58N53J38q63o4J021k42j201N24Q45n30r38Q02O92
2159E03p78l86P61K40p15j19P53R7n86K36O71m29n47N61L78m96k51N49N11j009
2179e6k43O44k53m60L67J45o12J6O42p2o25K20M77l85m51O63P7l81J20N97k62
$$ plain form
2200 168 -206 5 886 263 -244 356 824 315 -413 587 549 -208 -119 654 203 -567 -292 497 17 -923
2220 -923 -116 416 -433 -877 -7 -115 -436 -64 283 -15 -377 285 370 47 -127 348 399 -10 116 480 364
2241 364 -308 113 396 -187 -162 216 205 -559 -266 77 -176 -673 -355 269 -385 -701 119 84 -470 -177 446
2262 446 126 -195 -61 309 198 -129 624 613 -143 -26 245 471 -113 49 251 -110 -329 -316 233 -507 -386
2283 -386 -66 141 -257 -289 -235 -124 -410 -172 -7 -456 -332 197 87 -230 -192 597 349 -413 118 671 364
2304 364 -63 306 611 -126 -81 267 382 -255 7 -49 58 -409 -48 519 -367 -465 -27 59 -178 -242 210 146
2326 146 -45 302 -98 -46 -37 485 51 -55 75 196 -87 -21 248 187 72 -212 -65 169 -355 -149 589 -210
2348 -210 -703 -69 330 -158 -529 -5 343 -196 -518 250 185 -98 -226 139 -132 -187 155 471 -21 29 159
$$ packed form
2200A68l74K11Q81o23n07O00M68n09p28J000l8p57Q9P73m51p70K75P89m80r40
2220i23Q07N32q49m44Q70j08l21L72L47k98l62O62Q5l23j74M75N1m09J26L64j16
2241C64o72M21K83n83K5L78j1p64K93L43k53m97L18O24o54l16Q20l5n54K93O23
2262D46l20l21J34L70j11l27P53j1p56J17K71K26n84J62K02l61k19J3N49p40J21
2283c86L20K07l98l2N4J11k86K38J65m49J24N29j10l17L8P89k48p62N31N53l07
2304C64m27L69L05p37M5L48J15o37K62n6J07m67L61N67q86r8M38Q6k37o4M52o4
2326A46j91L47m00N2RN22m34j06J30J21k83O6K69o1j15k84J47K34n24K06P38p99
2348b10m93O34L99m88l71N24L48n39l22P68o5k83j28L65k71n5L42L16m92N0J30
$$ plain form
2369 159 395 224 -136 333 146 50 39 -44 -274 -65 -101 -244 -375 -117 -119 12 -126 81 334 -185 -177 -142 -138 -77
2393 -77 521 501 109 -264 325 615 -17 -246 514 427 -26 119 215 150 -364 -277 -11 189 -456 -127 121 -277
2415 -277 -682 8 185 -417 -476 -169 379 36 -471 52 -155 106 145 235 130 332 -16 89 232 172 -19
2436 -19 -107 224 -52 -190 -218 387 -174 -337 -153 262 81 -451 -264 172 -83 -159 7 309 -24 -76 140 48
2458 48 -214 -72 366 497 -110 -99 240 466 -257 -397 377 215 171 -178 150 338 68 -393 -50 21 -614
2479 -614 -334 72 -88 -444 -127 78 -65 -491 -268 164 157 -6 56 89 231 174 -49 274 200 102 125 355 -49
2502 -49 -251 54 183 80 -518 67 109 -108 -213 -204 293 -351 -136 -232 -36 -138 -177 32 164 225 79 24 237
2525 237 95 -67 164 259 293 59 -55 80 -100 -437 31 339 -232 -273 -140 444 -314 -301 -126 28 -373
$$ packed form
2369A59K36j71l60M69j87r6j1q3k30K09l6j43j31K58kJ31j38K07K53n19QL5MO1
2393g7N98k0l92l73N89K90o32k29P60q7m53J45R6o5n14Q7K66K00o45L29K48l98
2415b77m05O90J77o02n9L07N48l43n07N23k07K61L9R0j05K02l48J05J43o0j91
2436a9q8L31k76j38k8O05n61j63J84M15j81n32J87M36k55p6J66L02l33n2K16r2
2458D8k62J42M38J31o07J1L39K26p23j40P74j62m4l49L28J88k70m61L43P1o35
2479f14K80M06j60l56L17K05j43m26K23M32pj63O2L3J42n7k23L23p4r8K3K30m04
2502d9k02L05J29j03n98N85M2k17j05RM97o44K15r6J96j02l9K09J32O1j46n5K13
2525B37j42j62K31R5L4k34j14J35j80l37M68L08n71m1J33N84p58J3J75J54m01
$$ plain form
2546 -373 -161 46 129 -223 -361 153 192 -128 -133 309 223 -249 -55 234 221 -111 37 348 330 -25 186 189 -211
2569 -211 -285 41 -85 -175 -126 92 -76 -169 -359 -152 -355 -147 -23 -187 -298 -27 13 -213 368 256 222 48
2591 48 187 25 114 181 66 70 -378 -130 438 212 -206 -122 288 -113 -538 -48 161 -279 -491 188 128 -321
2613 -321 -328 -7 126 -452 -10 464 34 76 164 165 -41 -140 204 69 149 227 250 186 146 -215 -7 -200 103 128
2637 128 -262 -146 -124 -124 -99 -290 -97 -13 -293 -138 126 56 -44 25 257 -137 -276 398 571 147 34 203
2659 203 237 -225 30 280 -66 -249 -104 412 170 -427 213 155 -188 -327 -35 -156 -338 -51 -37 -10 -336
2680 -336 292 173 -66 -275 82 274 -32 223 145 150 -68 196 47 -85 -29 360 -88 -322 -86 244 -93
2701 -93 -392 -233 183 -353 -179 56 64 -318 -181 288 50 -265 -71 320 -147 75 336 362 -92 -47 323 -16
$$ packed form
2546c73K12K07Q3l52j38N14L9l20nM42q6m72J94K89j3l32J48L11j8l55K11Lm00
2569b11p4L26j26r0M9K18j68r3j90K07k03K08J24j64j11K71M0k26N81j12l4j74
2591D8J39j62Q9O7j15Mm48K48N68k26m18Q4M10m01m25M90K09m40k12O79o0m49
2613c21pL21J33n78M42M74m30M2Q8Jk06r9L44j35Q0P8K3o4m0l61K08j93L03K5
2637A28l90J16K2%K5j91J93Q4k80J55K64p0j00O9K32l94j39O74J73m24j13J69
2659B03L4m62K55K50l46j83J45N16k42n97O40n8l43j39K92j21j82K87J4K7l26
2680c36O28j19k39k09L57J92l06K55p8Nk18K64j49j32N6L89m48k34K36L30l37
2701i3k99J59M16n36J74K35Ql82J37M69k38l15J94L91m67K22K61K6m54M5L70l39
$$ plain form
2723 -16 -191 138 278 77 -157 252 83 -359 -197 352 24 -430 -371 -130 58 -120 20 -16 -27 -172 20
2744 20 -194 -298 -103 432 -109 -199 268 557 16 26 326 411 -59 -16 402 -51 -367 397 212 -180 -263 287
2766 287 147 -245 -100 -207 114 -386 -170 -111 -204 -390 -109 209 -231 -118 333 119 -292 -44 149 -3 -12
2787 -12 229 202 -90 185 326 323 -148 56 264 -91 -264 20 308 -452 -139 263 80 -113 -65 111 -318 -386
2809 -386 -4 30 11 -44 268 160 -274 148 567 416 -79 143 280 319 -5 44 115 -221 -50 189 -16 -368
2831 -368 78 59 -137 -188 214 -294 -186 114 -76 165 -108 249 354 -316 -269 136 414 -46 -246 42 138
2852 138 10 -94 63 72 -65 71 119 96 -353 246 165 -659 -140 270 134 -420 68 -13 95 -78 -19 379
2874 379 -312 -277 47 284 -200 -88 123 362 186 135 106 38 15 66 27 -88 -108 -69 -423 -160 217 -89 -209
$$ packed form
2723a6j75L29J40k01k34M09j69m42J62N49l28m54N9K41J88j78J40l6j1j45J92
2744B0k14j04J95N35n41r0M67K89n41J0L00Q5m70M3M18m53l16P64j85l92q3N50
2766B87j40l92J45j07L21n00K16N9r3j86K81L18m40J13M51k14m11K48J93j52r
2787a2K41k7k92K75J41lm71K04K08l55j73K84K88p60L13M02j83j93M8J76m29o8
2809c86L82L4j9n5L12j08m34M22M19j51m95K22J37L9l24M9P1l36J71K39k05l52
2831c68M46j9j96n1M02n08J08L00j90K41k73L57J05o70M7M05K78m60k00K88R6
2852A38j28j04J57Rj37J36M8k3m49N99q1q24N19M10j36n54M88q1J08j73N9L98
2874C79o91L5L24K37m84J12K11K39j76n1k9o8k3N1l9j15k0L9l54K63L77l06j20
$$ plain form
2897 -209 -40 194 214 -271 57 101 -322 -326 34 -116 -302 -208 411 120 -240 -150 341 232 -230 311 359 221
2919 221 -200 191 221 -65 -55 87 230 -198 94 151 23 -132 -313 146 -107 -68 -12 -72 189 -171 -97 17
2941 17 -140 -337 165 96 -20 51 -199 37 79 245 5 -112 239 -94 -232 -148 145 72 -110 -229 29 -200
2963 -200 -104 113 61 94 -145 -15 173 -72 68 74 40 91 -15 278 -28 -337 -60 -135 213 -3 -209 166 13
2986 13 130 62 -12 -110 197 188 205 189 -347 -92 -4 -18 -73 -137 65 71 68 -212 -155 311 182 -90 183 132 69 -16 -26
3013 -26 330 298 -6 175 144 23 -73 151 -40 -114 -143 -14 71 -155 17 171 -139 -299 -262 256 -47 -198 -23
3036 -23 -63 -62 -58 -136 -113 -128 -41 177 71 140 50 153 -55 186 -165 67 207 -119 -101 -128 -165 -355 -91 44 213
3061 213 -19 -267 -72 238 -51 -338 137 170 -493 -35 202 -25 -319 -182 187 250 -117 -255 -56 37 -131
$$ packed form
2897b09J69K34K0m85L28M4m23mL60j50j86R4O19k91l60R0M91j09m62N41M8j38
2919B21m21L91L0k86J0J42J43m28K92N7j28j55j81M59k53L9N6o0K61l60P4J14
2941A7j57j97N02o9j16P1k50K36M2J66k40j17L51l33j38Q4K93p3j82j19K58k29
2963b00R6K17n2L3k39J30J88k45J40Ol4N1j06K93l06l09K77p5L48k16k06L75j53
2986A3J17o8p4r8L07rJ7j6n36K55Q8j4n5o4K02Olk80N7M66j29k72K73n1o3q5j0
3013b6L56l2l04J81l1j21r6K24j91p4k9J29Q5k26J72J54l10j60L7N18l03j51J75
3036b3m0JMp8K3j5Q7K18j06O9r0J03k08K41l51K32J40l26J8k7l7j90K64J35J69
3061B13k32k48J95L10k89k87M75L3o63M58K37k27k94J37L69O3l67j38J99R3j68
$$ plain form
3082 -131 88 -87 162 108 114 74 75 -113 -21 162 29 -206 -207 -52 247 -28 -111 144 103 -420 -81 143 -3 -174
$$ packed form
3082a31K19j75K49n4Om0Jj88R2J83j33k35jJ55K99k75q3K55m1n23L39K24j46j71
$$ [...]
8191D7
##END NTUPLES=NMR FID
##END=
