##TITLE=1H_Pr NCS-E
 CDCl3
 8 sc, 
 29.10.2024
##JCAMPDX= 6.0         $$ Bruker NMR JCAMP-DX V2.0
##DATA TYPE= NMR FID
##DATA CLASS= NTUPLES
##ORIGIN= UXNMR, Bruker Analytische Messtechnik GmbH
##OWNER= root
$$ XWIN-NMR		Version 3.5
$$ Tue Oct 29 14:52:09 2024 Russian Standard Time (UT+4h)  she@DPX200
##.OBSERVE FREQUENCY= 200.1318
##.OBSERVE NUCLEUS= ^1H
##.DELAY= (6, 6)
##.ACQUISITION MODE= SIMULTANEOUS
##.ACQUISITION SCHEME= undefined
##.AVERAGES= 8
##.DIGITISER RES= 18
##SPECTROMETER/DATA SYSTEM= spect
##.PULSE SEQUENCE= zg30
##.SOLVENT NAME= CDCl3
##.SHIFT REFERENCE= (INTERNAL, CDCl3, 0, 15.7039)
##AUDIT TRAIL= $$ (NUMBER, WHEN, WHO, WHERE, WHAT)
$$ ##TITLE= Audit trail, XWIN-NMR		Version 3.5
$$ ##JCAMPDX= 5.01
$$ ##ORIGIN= Bruker BioSpin GmbH
$$ ##OWNER= she
$$ F:/spectra/data/she/nmr/H-F/1/audita.txt
$$ ##AUDIT TRAIL=  $$ (NUMBER, WHEN, WHO, WHERE, WHAT)
(   1,<2024-10-29 14:50:59.00 +0400>,<she>,<DPX200>,
      <created by zg, POWCHK disabled, PULCHK disabled
       configuration hash MD5:
       00 E9 B6 7A A2 85 ED C7 34 08 36 98 17 FE 4E 26
       data hash MD5: 16K
       68 07 FD 46 17 83 7D 35 35 FB E0 FD EB 13 F6 8C>)
$$ ##END=
$$ 
$$ hash MD5
$$ 1B 84 BF 8A 05 02 CC AC 41 11 D2 34 61 CD AC 65
##$RELAX= 
##$RELAX= 
##$RELAX= 
##$RELAX= 
##$RELAX= 
##$RELAX= 
$$ Bruker specific parameters
$$ --------------------------
##$DU= <F:/spectra>
##$EXPNO= 1
##$NAME= <H-F>
##$PROCNO= 1
##$TYPE= <nmr>
##$USER= <she>
##$AMP= (0..31)
100 100 100 100 100 100 100 100 100 100 100 100 100 100 100 100 100 100 
100 100 100 100 100 100 100 100 100 100 100 100 100 100 
##$AQSEQ= 0
##$AQ_mod= 1
##$AUNM= <au_zg>
##$AUTOPOS= <>
##$BF1= 200.13
##$BF2= 200.13
##$BF3= 200.13
##$BF4= 200.13
##$BF5= 200.13
##$BF6= 200.13
##$BF7= 200.13
##$BF8= 200.13
##$BYTORDA= 1
##$CFDGTYP= 0
##$CFRGTYP= 5
##$CHEMSTR= <none>
##$CNST= (0..31)
1 1 145 1 1 1 1 1 1 1 1 1 1 1 1 1 1 1 1 1 1 1 1 1 1 1 1 1 1 1 1 1 
##$CPDPRG= <>
##$CPDPRG1= <>
##$CPDPRG2= <>
##$CPDPRG3= <>
##$CPDPRG4= <mlev>
##$CPDPRG5= <mlev>
##$CPDPRG6= <mlev>
##$CPDPRG7= <mlev>
##$CPDPRG8= <mlev>
##$CPDPRGB= <>
##$CPDPRGT= <>
##$D= (0..31)
0 1.2 0 0 0 0 0 0 0 0.06 0 0.03 0 0 0 0 0.0002 0 0 0 0 0 0 0 0 0 0 0 0 
0 0 0 
##$DATE= 1730199058
##$DBL= (0..7)
120 120 120 120 120 120 120 120 
##$DBP= (0..7)
150 150 150 150 150 150 150 150 
##$DBP07= 0
##$DBPNAM0= <>
##$DBPNAM1= <>
##$DBPNAM2= <>
##$DBPNAM3= <>
##$DBPNAM4= <>
##$DBPNAM5= <>
##$DBPNAM6= <>
##$DBPNAM7= <>
##$DBPOAL= (0..7)
0.5 0.5 0.5 0.5 0.5 0.5 0.5 0.5 
##$DBPOFFS= (0..7)
0 0 0 0 0 0 0 0 
##$DE= 6
##$DECBNUC= <off>
##$DECIM= 24
##$DECNUC= <off>
##$DECSTAT= 4
##$DIGMOD= 1
##$DIGTYP= 9
##$DL= (0..7)
0 120 120 120 120 120 120 120 
##$DP= (0..7)
150 150 150 150 150 150 150 150 
##$DP07= 0
##$DPNAME0= <>
##$DPNAME1= <>
##$DPNAME2= <>
##$DPNAME3= <>
##$DPNAME4= <>
##$DPNAME5= <>
##$DPNAME6= <>
##$DPNAME7= <>
##$DPOAL= (0..7)
0.5 0.5 0.5 0.5 0.5 0.5 0.5 0.5 
##$DPOFFS= (0..7)
0 0 0 0 0 0 0 0 
##$DQDMODE= 0
##$DR= 18
##$DS= 0
##$DSLIST= <SSSSSSSSSSSSSSS>
$$ [...]
##$SUBNAM2= <"">
##$SUBNAM3= <"">
##$SUBNAM4= <"">
##$SUBNAM5= <"">
##$SUBNAM6= <"">
##$SUBNAM7= <"">
##$SUBNAM8= <"">
##$SUBNAM9= <"">
##$SW= 24.0689170037331
##$SWIBOX= (0..15)
0 0 2 0 0 0 0 0 0 0 0 0 0 0 0 0 
##$SW_h= 4816.95568400771
##$TD= 16384
##$TD0= 1
##$TE= 0
##$TE2= 300
##$TE3= 300
##$TEG= 300
##$TL= (0..7)
0 120 120 120 120 120 120 120 
##$TP= (0..7)
150 150 150 150 150 150 150 150 
##$TP07= 0
##$TPNAME0= <>
##$TPNAME1= <>
##$TPNAME2= <>
##$TPNAME3= <>
##$TPNAME4= <>
##$TPNAME5= <>
##$TPNAME6= <>
##$TPNAME7= <>
##$TPOAL= (0..7)
0.5 0.5 0.5 0.5 0.5 0.5 0.5 0.5 
##$TPOFFS= (0..7)
0 0 0 0 0 0 0 0 
##$TUNHIN= 0
##$TUNHOUT= 0
##$TUNXOUT= 0
##$USERA1= <user>
##$USERA2= <user>
##$USERA3= <user>
##$USERA4= <user>
##$USERA5= <user>
##$V9= 5
##$VALIST= <valist>
##$VCLIST= <CCCCCCCCCCCCCCC>
##$VD= 0
##$VDLIST= <DDDDDDDDDDDDDDD>
##$VPLIST= <PPPPPPPPPPPPPPP>
##$VTLIST= <TTTTTTTTTTTTTTT>
##$WBST= 1024
##$WBSW= 4
##$XGAIN= (0..3)
0 0 0 0 
##$XL= 0
##$YL= 0
##$YMAX_a= 529339
##$YMIN_a= -610637
##$ZGOPTNS= <>
##$ZL1= 120
##$ZL2= 120
##$ZL3= 120
##$ZL4= 120
##$ABSF1= 10
##$ABSF2= 0
##$ABSG= 5
##$ABSL= 3
##$ALPHA= 0
##$AQORDER= 0
##$ASSFAC= 0
##$ASSFACI= 0
##$ASSFACX= 0
##$ASSWID= 0
##$AUNMP= <proc_1d>
##$AZFE= 0.1
##$AZFW= 0.1
##$BCFW= 1
##$BC_mod= 2
##$BYTORDP= 1
##$COROFFS= 0
##$CY= 11.3945322036743
##$DATMOD= 1
##$DC= 2
##$DFILT= <>
##$DTYPP= 0
##$F1P= 15.6554695791079
##$F2P= 12.8336369535428
##$FCOR= 0.5
##$FTSIZE= 0
##$FT_mod= 4
##$GAMMA= 1
##$GB= 0.15
##$INTBC= 1
##$INTSCL= 1
##$ISEN= 128
##$LB= 0.24
##$LEV0= 0
##$LPBIN= 0
##$MAXI= 10000
##$MC2= 0
##$MEAN= 0
##$ME_mod= 0
##$MI= 1.114404
##$NCOEF= 0
##$NC_proc= 0
##$NLEV= 6
##$NOISF1= 3.799351
##$NOISF2= 2.8
##$NSP= 1
##$NTH_PI= 0
##$NZP= 0
##$OFFSET= 15.70392
##$PC= 1
##$PHC0= -26345.06
##$PHC1= 8.78743
##$PH_mod= 1
##$PKNL= yes
##$PPARMOD= 0
##$PSCAL= 0
##$PSIGN= 0
##$REVERSE= no
##$SF= 200.130013532006
##$SI= 16384
##$SIGF1= 3
##$SIGF2= 2
##$SINO= 400
##$SIOLD= 16384
##$SREGLST= <1H.CDCl3>
##$SSB= 0
##$STSI= 0
##$STSR= 0
##$SW_p= 3612.71676300578
##$SYMM= 0
##$S_DEV= 0
##$TDeff= 0
##$TDoff= 0
##$TI= <>
##$TILT= no
##$TM1= 0
##$TM2= 0
##$TOPLEV= 0
##$USERP1= <user>
##$USERP2= <user>
##$USERP3= <user>
##$USERP4= <user>
##$USERP5= <user>
##$WDW= 1
##$XDIM= 8192
##$YMAX_p= 0
##$YMIN_p= 0
$$ End of Bruker specific parameters
$$ ---------------------------------
##NTUPLES= NMR FID
##VAR_NAME=  TIME,          FID/REAL,        FID/IMAG
##SYMBOL=    X,             R,               I
##VAR_TYPE=  INDEPENDENT,   DEPENDENT,       DEPENDENT
##VAR_FORM=  AFFN,          ASDF,            ASDF
##VAR_DIM=   8192,          8192,            8192
##UNITS=     SECONDS,       ARBITRARY UNITS, ARBITRARY UNITS
##FACTOR=    0.0002076,     1,               1
##FIRST=     0,             0,               0
##LAST=      1.7004516,     0,               0
##MIN=       0,             -610637,         0
##MAX=       1.7004516,     529339,          0
$$ Real data points
##PAGE= N=1
##DATA TABLE= (X++(R..R)), XYDATA
$$ [...]
2046E48j270O76N27j426J249L27j636J453l85j57P48j307J036M97j965J500l67
$$ 548 -722 -46 481 -945 304 631 -1005 448 63 -94 654 -653 383 880 -1085 415 48
2063D8p58Q82m47N8O11j028J242n83n02J308j347R1J373j610K25P15p98N90o21
$$ 48 -710 172 -275 -217 394 -634 608 25 -477 831 -516 -425 948 -662 -437 278 -520 70 -551
2082e51O52Q33j687R86M14j281J165k55p54P65q09M90M35j140J227k35p09J581
$$ -551 101 934 -753 233 647 -634 531 276 -478 287 -522 -32 403 -737 490 255 -454 1127
2100A127j244m41R96q49N55k87m99J144j041J07J164j465P36N69j064J228k27
$$ 1127 -117 -558 438 -411 144 -143 -642 502 -539 -432 732 -733 3 572 -492 736 509
2117E09j149J184j183L71O20j086P85j45k17J281j124l47J276r84j01P21j187
$$ 509 -640 544 -639 -268 352 -734 51 -94 -311 970 -154 -501 775 -209 -310 411 -776
2134g76J105n78j43J047j139N99N03j342J669m23j068R15m24k13P20j175Q73l36
$$ -776 329 -249 -392 655 -484 115 618 -724 945 522 -546 369 -55 -268 452 -723 150 -186
2152a86o57J600k56j127J218q01N32K09j164Q75n83K55O43j294Q73K09j308J607
$$ -186 -843 757 501 -626 592 -209 323 532 -632 243 -340 -85 558 -736 137 346 -962 645
2170F45k68j128J244k87k13L42o96L53Q4p91J313r30j31J415j349P24N42j512
$$ 645 377 -751 493 206 -7 335 -361 -8 76 -715 598 -332 -463 952 -397 327 869 -643
2188f43J104n63k71R18j156L88L31q18R69L32j204R76m10J09N78j329M59K3k25
$$ -643 461 -102 -373 545 -611 -223 108 -710 259 591 -613 363 -47 62 640 -689 -230 -207 -432
2207d32J155r54l50J483j148K76O38r73L63L28n48L69n21j09N63p59Q30J26j087
$$ -432 723 -231 -581 902 -246 30 668 -305 58 386 -162 207 -314 -423 140 -619 211 337 -750
2226g50J391n07n23Q61o41M33p4r17J147m86l03P99j117M28P46q20N34J69o21
$$ -750 641 134 -389 472 -169 264 190 -727 420 -66 -369 430 -687 -259 487 -333 201 370 -251
2245b51O16o18K05O04j459J025K80j037R76k27n41Q69q30O66L66j074J399j054
$$ -251 365 -253 -48 556 -903 122 402 -635 341 114 -427 442 -388 278 644 -430 969 -85
2263h5m65J016q53J60P30r56P71l75l48J154o92j27N82j150O14N01j374J325k66
$$ -85 -550 466 -387 -227 503 -453 318 -57 -405 749 57 -70 512 -638 -24 477 -897 428 162
2282A62j91P72r95N17K04j142J016l18m17Q70j140J78R21p67M7P35q05M60l14
$$ 162 -29 743 -252 265 469 -673 343 25 -392 478 -662 -484 437 -330 -283 452 -353 107 -207
2301b07K99L51j077N13N96j330J211m94j89R61p96j37P44q19R33p08n59J374q48
$$ -207 92 443 -634 -121 475 -855 356 -138 -327 634 -162 -299 445 -374 559 -149 -708 666 -182
2320a82L1P78j167K89N46o32Q18o10K38J25j049P49O50j138M49J54n29Q08m50
$$ -182 -151 627 -540 -251 295 -337 481 -129 109 234 -815 -66 584 -554 -105 49 -480 328 -122
2339a22K54L61j091P75J59p55Q16q90N5J001j114M51N30o68N66l26o9O14r10N88
$$ -122 132 493 -598 177 336 -419 397 -493 -438 563 -551 -100 430 -238 328 2 -67 547 -363 225
2359B25J21q93N15O6n32O95k84N6R3n08O77p4m29Q59p54k93J217j289J99O58o42
$$ 225 346 -547 -32 34 -498 197 -87 -31 62 -446 231 157 -272 587 -167 -460 757 -532 -333 325 -317
2380c17L33l12J3O78m93j21P01j062Q74j34l08L41j59l07O86p94Q83n67L7M74
$$ -317 16 -296 -283 395 -98 -219 482 -580 294 160 -148 193 34 -273 413 -381 502 -65 -28 446
2400D46k32l72M99o86M76J43p38L13L17n70P69o00QO66r42L94K46q00J109p21
$$ 446 214 -158 341 -345 131 274 -464 -151 166 -404 365 -235 -227 439 -503 -109 137 -663 446 -275
2420b75L75K04o11M86K11o30L39j13j24Q02j130O51L26j004N07q8k09M29o79N44
$$ -275 100 304 -307 179 390 -240 99 -14 -138 664 -466 185 511 -493 14 -74 -283 146 -533 11
2440A1N32r52L03K55o90N30R7m44K54j69N5L23q42R37l3j98N81p40qN63l50q5
$$ 11 543 -409 -106 149 -541 -11 86 -358 -104 -273 -218 105 -737 200 167 -31 550 -190 -198 365 15 -70
2462g0j84Q3J30k19l4N97r63O34M42r23R38n46N9Q6j35J86l5l68N63l49n49Q65
$$ -70 -254 -171 -41 -260 -294 303 -660 -26 416 -507 431 -115 -56 30 -105 81 46 -322 241 -108 -657 208
2484B08J39q22P69k58N83l65p00O92ko88N46m84L69K17l67K83r6l89O92o78J64
$$ 208 347 -475 294 36 619 254 -446 246 244 -444 102 -382 -13 204 -163 120 24 -365 327 -351 -187
2505a87J27m10N09j28p2N30l57k35N67r29O91L70p86J26j56J34O97j037L77N13
$$ -187 -60 -470 39 -89 -161 369 12 -223 344 -585 106 476 -310 -184 -340 -206 491 -546 -169 344
2525C44q65R12m08k73L96l23L18J86o34N28k44r9O87q85N5N51o66O76k1l05L53
$$ 344 -521 391 -17 -290 106 -217 101 287 -347 181 -63 -162 525 -360 -305 246 -420 256 235 -70 283
2546B83m28Q6K99l90K94K92q11N57l4j55L18m75k78O26n46L07j27l34P81n15K19
$$ 283 -145 -59 240 -150 144 436 -375 182 148 -7 311 -164 -442 184 -362 -55 -182 -516 265 -250 -31
2567c1M47p22N86l7m89N20k9k63J12k65J1K60p21J086k94n52P07l05J17J57n20
$$ -31 416 -306 280 243 -246 274 245 -18 94 -171 -160 100 -621 465 171 -381 326 21 138 295 -225
2588b25N74j84m11L82j2m02M40m27M94j45n73M31M69q79P53o56L64M44q06N40
$$ -225 349 165 -246 136 124 -278 162 -265 229 84 -489 -58 411 -468 285 -371 -7 437 -369 171
2608A71j90m35Q17o05J64K52k45K22l65n1N66l85l58P12o13O70O8m42K77m9n94
$$ 171 -19 -454 363 -242 -78 174 -71 151 -214 -265 301 -84 -442 270 -343 327 395 -47 230 181 -413
2629d13N99l51l27R21o98K37R3l20L42k53l03O75o01N18q0j9L39n00k12N60j46
$$ -413 186 -165 -492 429 -269 -32 61 -259 83 -170 -473 202 -399 119 39 20 359 -141 -353 207 61
2650F1k3J69n09N96o26J90N15k34k88K79k59L05j76r8K84m28j3M27m20K52K44
$$ 61 38 207 -302 294 -332 -142 373 139 -149 130 -129 176 0 -98 186 -242 -255 172 -248 4 248
2671B48n56P19l04m53M98n74K32K58k26J48L57m18L20l61j45N57n31P3K45l76
$$ 248 -308 411 107 -346 152 -422 -190 68 -158 -10 347 -71 249 -112 -257 300 -231 -158 87 -289
2691b89R4k04N29P8m88L12M99q15L95p1l20K25r4K7N36n10L97p0n79L48O5l33
$$ -289 -195 -399 130 208 -280 32 531 -284 111 40 -280 -55 -149 -122 414 -96 301 231 -348 0 65 -268
2713b68M66o1J5R4o25M26j88m0M28k60q4N06q24M18j8k3N58o85L07Q5l81J37j9
$$ -268 198 137 152 246 -379 47 -141 -181 247 -13 -97 409 -415 3 -15 -38 520 -165 142 227 -154 -17 -36
2736c6m44N43M9k71L04j05j28M17m90K4k8J23P6j2J60J14n08M32j83l27N94m05
$$ -36 -480 63 112 -159 145 40 -88 329 -161 -137 -165 -42 34 22 182 296 -212 220 37 -290 304 -101
2758a01l3J12k32l9O02o87P03n83q5O44n98K41K12l06M36l30O9R1m28Q0P84r09
$$ -101 -134 -22 -254 -293 309 -378 325 -258 -343 301 -297 -56 156 -150 286 -44 25 116 -312 -232 552 -357
2780c57J19N43l85R7j16j00N65l05K35j43n00Q39m80j43K98k36k78N85m90L30
$$ -357 -238 305 -80 17 -99 -199 366 61 296 153 -347 492 12 -131 167 -69 -347 238 -252 78
2800G8j67l63R10l75j1L59p27M82K3n16L04K13r4R1J62m57L04m33K81k24l2M09
$$ 78 -89 -452 458 83 72 431 -296 186 209 -307 -3 210 116 207 369 -88 216 -217 64 -160 -192 217
2822B17m73J42P65o98j55K12K18j57k76R7J49l76K05K79k90L47j18l89K82k08
$$ 217 -256 -114 651 -47 -202 10 228 71 -205 -108 41 -335 -130 149 -141 206 88 -301 -19 -227
2842b27L0P9k30M01r7o0K10l04k42N63k14K06m0j81K10k39m4N12m20j42O49n42
$$ -227 -197 -118 -348 53 -44 -104 106 -198 -440 123 -91 115 75 -106 104 -135 -179 333 -87 -229 420 -122
2864a22R3J91k78L39k58J45l04o8O56m6k84K70j81j63L28o40L40R5k50R5R9k04
$$ -122 -29 162 -116 223 -35 110 -194 -262 394 348 64 334 153 -10 318 -322 18 113 -137 -42 57 -147
2886a47J19L0J71j10pR0m11k56N77n0mR6m12O25j73j37K49k93l82N78Q6n62P78
$$ -147 -28 2 173 63 56 146 -265 -521 56 6 2 98 -314 311 138 1 250 -43 -425 153 239 -323 455
2909D55l40K63m77l2J40j1m8O39l90m03L11o16N53n6n3N0o0L61j72n10O51J08
$$ 455 115 378 -99 -131 9 -2 -50 589 199 -204 107 -509 44 -12 -65 -15 -75 286 114 -396 255 363
2931C63l44M7O4k63J52m1L22m01M0K80k85j16J68j55L32K5m21M02n7m1L51o61
$$ 363 19 66 130 -133 19 -22 300 -101 -61 219 -66 -182 -14 -169 163 188 -233 169 112 71 422 -239
2953b39K48P2k50L50j21j15O04q06J73M50q58N57M5J16J52m28k4J08k95R9K05
$$ -239 9 81 -169 181 60 -55 549 -257 -84 366 -492 65 110 226 378 -50 -74 34 -261 -162 43
2974D3j23L2L65l85m6QJ34n3l54O76j93j39J56o6l16L30k45O3K18L4q3O4j42K76
$$ 43 -80 -48 317 -68 -114 -106 28 -25 -379 297 104 -35 121 55 -261 69 -176 -113 105 139 56 120 -22 254
2998B54n73J50M50k35J71N6o7k72L8q1J02k94N76j24n50N76m43K64j76L4O3K01
$$ 254 -319 -169 281 46 217 273 206 -66 -28 -109 -7 -301 275 151 -399 177 -266 -2 -178 -144 -81 120
3020A20m83N10o7m6j02J23L58k10k46J70Q5o77N43r3k76L22M2j94K04o2J5L5k26
$$ 120 -363 147 80 34 -68 55 413 203 -43 127 212 -465 78 -15 -291 31 73 -121 83 21 36 71 -155
3043a55M18j69k82L54m46K18L5l94P56m99J76J26q4J61m6l63N65Ol64J3l43K38
$$ -155 263 94 -188 166 -280 -62 -27 -421 335 -164 12 138 54 215 169 -194 371 377 13 26 -317 -79
3065g9l7L4K93j15j57M4n9k66O05j48l47K90j92L40k41q2M53n63l0N40j57nj76
$$ -79 -116 -82 211 96 -61 -17 -76 -342 263 115 -232 58 -134 206 -35 -117 336 -227 -257 283 126 121 -55
3088e5j16K53k93K16K7m90L96j00k84P67P6l84M7p1o6L68l33K44k84j42M26J2
$$ -55 -171 82 -211 5 32 -458 -62 -162 -446 321 397 13 60 -11 -77 291 -42 202 -82 -224 202 214
3110B14l89K16p6j08K88l91O26j62k60L72n39O30m92n0K22j97J76j60j77K20M70
$$ 214 -175 41 -35 -143 145 -246 380 218 -42 330 -209 421 -71 -121 101 -96 80 -80 -257 -37 433
3131D33o49J45k1p3R1k77K10J39L2N0J66j80Q1k02r6M96n61J90j13o5N02j78L3
$$ 433 -216 -71 -92 -165 -74 -351 -141 -2 30 80 246 66 147 -55 -151 345 -216 -26 -139 -204 298 120 153
3154A53l7m10L1K51j34K08m05J38M13m42P3M47n18M14j70o23R35j60k95L07l75
$$ 153 116 -294 -263 -12 -146 62 -343 -205 208 -234 -161 286 -232 182 12 -611 324 164 -131 176 -199
3175a99J09j29OL74j56l17L33J31m7J71m16J98K52l12L35m65L4J2r9N30k64l91
$$ -199 -90 -219 -213 161 5 -312 21 152 105 276 -140 58 310 -2 333 -132 -98 -86 -185 345 81 -310
3197c10N29q4j82K44l60k6L41n01L79k50P8K83l71M28j02k95j6L54l49M04j90
$$ -310 219 135 -47 197 -163 -189 152 -349 30 -220 -142 141 -230 198 96 -199 -215 139 -210 194 4
3218Dj01L20n34M56o3l82N37l7k13L42n96O42j15o47L08J3k62M50k90K06K54l09
$$ 4 -97 223 -311 145 82 -300 237 200 -13 329 -267 375 260 -387 -79 -66 -328 122 -168 38 292 -17
3240a7J43k00P5K85n26K08P1j66K29j32J1j16J29l82L73P2l20L49j94M1m8J4J18
$$ -17 126 -74 1 286 -240 -32 39 -127 102 -30 -19 -135 -6 -388 -15 57 -263 86 -108 -67 -115 -101 17
3263A7K67m83K85J26M4k93p4K19l89L28J19j14m59M34k5q7J14l52P54l93J14p
$$ 17 284 -199 86 212 256 -37 -111 108 -281 47 166 52 -407 27 2 -85 29 -323 431 38 152 145
3285A45k51pJ12J06J23k06N2N1l82K08P7l48M22k22k35P27j52n9K4l43J76rm66
$$ 145 -106 -113 -1 105 228 22 74 125 -257 -49 28 -320 102 -120 -355 372 220 161 185 -158 18 9 -457
3308d57Q20n51J79J09j67K54j22j35J40m8p8J27k44J44K36k45R3n0J05Kk14JL49
$$ -457 363 -188 -9 100 -67 187 65 -70 70 22 -56 71 -173 -29 207 -38 55 5 110 112 -102 -101 248
3331B48m19K07j43J32j12j24k04O40k99J08K18m37L84l0ON2m62L41k76J71J61
$$ 248 -171 36 -107 25 -87 -211 -415 225 -74 34 252 -185 199 169 175 227 -235 106 -170 1 162
3352A62j91j27K94j99k4L22j18l21J51j58K40m2j74J30R7j25K01j54K39k30j27
$$ 162 -29 -156 138 -61 -85 237 119 -202 -51 -209 31 -11 -185 -55 42 -83 118 -36 203 -27 -154
3373a54L62p12N3O09l44L06j96j08J82qp4L29n03M61J38m48L07k33j98J64k02
$$ -154 208 -504 -451 158 -186 120 -76 -184 -2 -10 -84 245 -258 203 341 -107 200 -33 -231 -67 -269
3394b69K96J94m62P07l97k75O70n70p2O9o76O80j34M00K6k31k29O72n41K9R1M3
$$ -269 27 221 -241 466 69 -206 464 -106 -178 -109 -785 -105 -239 161 187 -44 -273 399 -142 -113 -22 21
3416B1oj86K40Pm73M54j71q1K24J06m90L56m97M53J06m21N96j86k50J66q2J99
$$ 21 15 -171 69 76 -397 57 -114 -195 29 135 -355 1 -496 -43 63 -358 238 52 -198 -32 -114 85
3438H5P7j55j35L85m20J82o3k18K62k99J31L64l07J04J68l74N84n18j09M15o77
$$ 85 162 7 -128 257 -163 19 -44 -262 0 -299 -168 196 -111 -7 161 -213 371 -147 -256 159 -518
3459e18N28K18k95K8p9k94O47l07j69M33k32j37K28j88J43l9j15L44m61L81k4
$$ -518 10 228 -67 -39 -118 -412 235 -72 -241 192 -40 -177 51 -137 6 -33 -148 196 -265 116 92
3480I2m75O79m74K22J1j33M6j19j0M26k90l64P28m33K07p7J1Q4k7l53K64J6n5
$$ 92 -383 296 -178 44 55 -78 -32 -151 -161 265 -25 -389 339 -94 113 36 47 131 104 -249 15 31 -24
3503b4j6j33M02p8m90M05j03p3O9r9M15K43q17M30l87l88M68J71J37k22o0K30
$$ -24 -40 -173 229 151 -339 66 -37 -110 -41 -140 275 518 -299 131 -256 -644 -176 -5 132 -90 -150 80
3525H0L2n23O08o90L5R71o48J3L02l14L86l94J37O6j8p1L75l53K72l36k12Q06
$$ 80 112 -411 197 -493 -458 513 -135 -122 180 -134 252 -142 -5 61 43 -28 347 -6 266 -70 -282 524
3547E24o04k16L93o2J12l8k16O27p07M51K23q07K87M9l7K80m3k10j33K08L6j77
$$ 524 -80 -296 97 35 147 109 -107 520 -187 264 487 -320 -33 16 -21 259 216 6 -127 81 117 -60
3569f0q7K71L28m66k9o8K59K07m39j9n8l23Q07j97p8K09k01r8j85J74O4K9n83
$$ -60 -147 124 452 -14 -43 -111 148 355 -84 -103 -161 -484 323 126 48 257 56 -42 -227 -53 11 40 -543
3592e43O61k50KN20o80N02o6l04L45m04J40K45k50N7J15k33J97j17j06J81p3j61
$$ -543 118 -132 -130 390 -290 212 146 -158 187 -217 -77 168 -82 -25 90 -143 54 -63 -169 12 -61 -222
3614b22K91j73L63l72K24o8R5L63k51m48K08K35l37K47j62q4lJ05j44J85j88N08
$$ -222 69 -104 259 -113 111 43 138 501 250 -198 10 245 -92 155 -7 -91 -94 11 -133 52 -136 372
3636C72m49k51O80l94M1L18l37m3l1n3M41p0k52J62m93L92J34k45L90k91r7M6
$$ 372 -77 -328 352 -42 -1 317 -20 -63 -94 -147 294 224 -28 134 -359 33 167 -78 312 21 -76 -30
3658c0M9j19Q1l72O72l17k34M68l69k1O48l12j09J51k31M52l29p6j8l30N21n6
$$ -30 19 -100 -19 -391 281 -36 -270 198 -171 -192 456 144 35 186 -45 407 78 2 -16 -346 175 119
3680A19n41N19J16n31L43m32J36N04n04K45k99K67J39j55k09O73o88M01M11q68
$$ 119 -422 97 213 -318 25 -407 -271 233 -271 -26 -325 -58 81 -74 -283 390 -298 103 514 -354
3700c54O59n38K66J32k58j29J77l21L18O8q1j9J4K37j41m48L85J42l30J77j4j67
$$ -354 305 -233 33 165 -93 -222 -45 -366 -48 20 -61 -80 -66 171 30 -418 -33 109 -221 -44 -58 -225
3722b25M83m06N65k45l90L10l16JM01k08j64M43m11M08j07J15q7l78K40J92k40
$$ -225 258 -148 417 172 -218 92 -224 -223 178 -30 -194 249 -162 246 139 254 167 -211 29 221 -19
3743a9K79k48RO4o23J49P29q59M80M6J71l26k08K73K55q7L0R4o24K50j01j4J96
$$ -19 260 12 21 85 -538 -389 340 -519 -39 7 178 -148 -356 -83 172 85 115 209 -415 -165 -266 -280 -84
3766h4K51l43M85j83R9K86o50J84k83K38O27p59K7M71j33j95J64l96M19n21K91
$$ -84 167 -176 309 126 225 511 -139 45 -238 0 627 -132 -105 366 233 38 202 -194 225 -296 -5
3787ej00j04J18J09j54j03oR2L57l54K32j46o8O31o51k09N23k29k22L56m5r4J55
$$ -5 -105 -209 -91 18 -136 -239 -245 -153 204 -150 82 -64 -132 499 -152 -361 162 -67 -289 67 22 -72 83
3810H3m9k26M15m49N15n07K92J7j48J76j48k37K05j69J11L2l3J74k29K90Ll40
$$ 83 34 -192 223 -226 289 -218 74 91 -57 119 -29 -266 -61 -230 -119 -87 -120 54 -175 115 118 -222
3832b22M31k27k98N35Q2j92M18o49J19M15n84O10m20k88K64j96n8J74N3RJ29j78
$$ -222 209 -18 -316 219 301 109 527 -122 -3 412 -172 438 18 -270 -6 -202 -260 -86 -33 -24 105 -73
3854g3K91k82l08L83j3j53M78m27LopL13n00M32j45l27J85J44N6K20l60j46N64
$$ -73 218 -64 -372 11 -2 -155 323 -104 -101 -107 -114 199 -301 131 -14 -341 -156 -12 44 264 -96 -242 322
3877C22m59K11K0m91M46j1k03K58l63J30M03k70o2M7o3K85j67j96N81n06J80j26
$$ 322 -137 74 94 -397 49 38 -165 93 -270 -140 263 -7 -69 -22 -85 200 33 -163 418 -88 92 -34
3899c4j3L53n96J50J04k01L74o0k35M48j38k85K05m00J77J93m33O20j79j45J52
$$ -34 -47 306 -290 -140 -36 -237 137 77 -158 290 152 -133 72 -328 -151 42 -391 229 50 -95 57
3920E7j57K1M97o89L55o0m97P13j50m22N59j89k54L94l73L00O4m8j48j41L52r3
$$ 57 -100 -79 418 -271 84 24 -473 240 90 -332 227 38 -216 178 -195 105 169 121 -27 -168 184 91
3942I1k42L84l68mM12j91p3L13o49L20N3l58O40o30K99QO2r1K15k43j15Q8jJ42
$$ 91 -151 233 -135 -139 273 82 9 322 -327 -7 46 -312 328 -302 -3 5 67 -24 191 -52 -167 -79 -80 62
3966F2j75O4K59m21L96j58l39O68o04j00N27l86L24J49l22K23l71j6N08j72l81
$$ 62 -113 -49 210 -211 185 27 -312 356 -248 -348 179 -207 117 266 -56 167 -204 -220 288 116 -265
3987b65K70l38M35k13j35L74r2l36M53j63j11M27m34L22k59k44K74j74K55j3l26
$$ -265 5 -333 102 -111 -246 128 36 -300 153 -10 -121 306 -128 194 -65 -309 -35 -209 46 33 -293
4008b93K43K6l10O30j52k96L91p73N98j42N9q6J76j0L04l91q8L07j90J83k15J72
$$ -293 -50 -24 -334 296 144 -152 239 -534 64 -78 -19 -105 71 61 365 -26 -114 193 3 186 -29 143
4030A43o2j71J95l01j15L38m9m8P4l47M00J07N7j4Nm28M34j76o5k2n42O68nl21
$$ 143 81 -90 105 -196 -311 27 -22 -70 4 -343 57 164 221 207 212 -216 218 42 -23 -45 -587 81 76 -245
4054b45J34L00n91P73n91L35J45m28L97l26k45L32P9J05M47p35q9O88r07L38J26
$$ -245 -111 189 -402 371 -220 115 260 -168 229 -97 -342 -10 69 174 621 -114 -203 485 -422 -84 42
4075D2R6k83K2j0jj47N88n45M8L09n84N56k5l18P05l53n21M65j41J32L74m07J06
$$ 42 138 -145 -123 -133 -134 -281 307 -238 -190 119 -465 91 66 -252 453 100 -421 44 -97 35 409 2 108
4098A08K1l80J34L7o5pJ60m7K23l07N43n40l08Q16o53K31J45j99k1o4L3J52n1
$$ 108 129 -251 -117 -80 -145 -152 8 -39 184 -123 420 -120 -428 388 -265 -34 111 -88 -109 -173 -140 12 -39
4121c9k58N01m64J84K85m92L03O0j8n7j5J38m07k03R50m00k69J23kJ51J42l9L4
$$ -39 -297 204 -260 -76 209 -283 20 80 62 5 -10 128 -279 -482 468 68 -201 -78 -80 71 213 174 208
4144B08J83n42M48m0k62K94n03M34l87r9L25K95m95M79n33K50k21k58K01L24m09
$$ 208 391 -151 297 257 -5 289 -214 220 -167 -266 59 354 -141 338 -195 55 -166 -424 -223 101 -308
4165c08O33k35j28J17k50p1N22m72N73j70o64M46n21P05N9o19M82O2l24L67j29
$$ -308 325 90 -38 79 -171 -242 280 -192 381 211 -453 -7 -528 177 236 -383 99 161 -163 204 75
4186G5k97P17k56k43o04O42q1P5j77J17j6L1R1k42L06k7q5n4J0J02J33j32k9L9
$$ 75 -222 495 239 -4 -608 34 -47 28 -149 -32 -48 -17 74 -168 138 111 26 -28 -18 84 217 85 56 95
4210I5j13j18J76j79J21j34N25l66N0M3j48J57R3l34O42l82m96O64j47j37J50
$$ 95 -18 -136 40 -139 -18 -152 373 7 57 100 -48 109 202 -132 510 128 -368 296 149 12 162
4231A62j63P3j36k82J65J49k07M36k54qL08o68K28R6J7K6J98n11O72l41Q0m5l
$$ 162 -1 72 -64 -346 -181 -32 -239 197 -57 -65 243 -425 -197 -101 -84 -58 140 -371 301 -40 40 -5 -8
4254hR1m2l51N16k43R1nn58L55N8l3M80n12R6n0J95j44K6j62Q33o25N8j09j34
$$ -8 83 41 -310 206 -37 54 49 -509 -154 -96 -129 351 -161 -65 -115 80 -64 -38 -200 633 8 66 -43 -177
4278a77L68j68J34m1J8l15M35m49j42M75l50q3O6j85N18j37l5J05k52ON09n41
$$ -177 191 23 157 116 134 -181 254 -195 -337 138 -212 -295 -229 -414 104 -33 -68 37 -215 -209 300 -241
4300b41N04j46M0k12M3N34k10m89J74r8K16K13o39K24J4K28J57l71j22K27k28
$$ -241 263 117 157 -55 -12 522 312 -177 -3 -101 115 328 -311 -87 -73 155 312 -59 -181 46 -182
4321a82K30k5J03l18L0J9M57k83k78M26j2r1J8k45L05j48l71P55o44L43J3j7%
$$ -182 48 23 126 -192 -162 -143 314 31 -247 179 167 76 94 -151 154 6 -365 390 -254 89 102 85 85
4344H5j11m25O79M3l00M19o64O05j2n07O82l84l21N89n89K38k81M04O0l7jo1K9
$$ 85 -26 -451 228 271 -29 390 -274 331 319 -188 494 110 -211 378 -211 27 -254 150 210 173 172 111 140
4367A40j04m5q9L06k22j02P6M9N6M5k68K05Q5j8k60J24MJ98k08Q9P5m61j20N27
$$ 140 36 -9 -98 208 -14 -116 -40 9 65 110 -158 47 132 114 -146 -22 -18 180 -28 61 136 -325 -445 82
4391H2l29M35k90L09k5m21L33l8j90K06r2k7K28K4J1J75n44M62l78N8j51P8J63
$$ 82 -247 188 -102 207 182 -239 94 56 -134 72 -20 -47 181 205 216 391 -153 309 -69 -11 -162 -84 79
4414G9L91p18K15J02l76J13j20l1L63j73L67j29l05M60l39j44P5n4Q6M50n44K91
$$ 79 470 -248 -33 69 -307 -194 -314 -345 18 -155 212 83 -222 238 -101 -245 -170 -224 -138 312 -232 59
4436E9j53K9K08n3k56L46m09K64J98n91N02k12m4M48m18J78k6m74K92K48l82L30
$$ 59 -94 -65 143 90 -166 180 -229 35 233 -358 144 -68 -112 336 -82 96 70 -404 -112 136 -246 84
4458H4q6k28Pj59M51k05K33j23K41l3j22k17J57R8R9l70L06j37R8j35M2K05m00
$$ 84 -2 -230 -223 -382 69 -136 97 -26 215 182 60 -157 0 98 197 -173 133 -4 94 -41 1 206 -194
4481a94M52m20K45o5m8P9k8k15J67K54k35J04k11p1j0JK95o4m62L15J64l33O10
$$ -194 258 -162 83 18 -30 49 21 -194 -27 227 -8 96 -115 -186 -196 -195 100 36 -426 -111 53 -280 330
4504C30l05O7m1P6p6J26m64O34m70o1L79n33O29l0k16j61J76j47M56l85l1K90
$$ 330 25 92 51 127 51 177 -287 347 -123 -184 195 -338 291 261 45 -116 60 -87 369 -16 -47 243
4526B43k38j46K65j45R7m44M45j58K5K42j87l49P35n06Q3N12p65L95l48l67M69
$$ 243 5 -141 124 -21 76 -368 77 -81 -56 186 -1 -350 385 -121 -38 474 -291 104 -244 -611 -142
4547a42m5J27J80k93j0N82q60P84k76k71N13m59m8L96k60K30l36m5K42J3l0j22
$$ -142 -187 -60 120 -173 -183 399 -461 323 47 -224 289 -170 -218 178 -82 148 -188 -233 9 22 -8 -130
4569a30J81j84K26m70L27K27k64K63n33L20%m62N20R2m60N17l77L6K87m00L21
$$ -130 51 -133 93 -377 -50 177 -87 176 -357 -37 -37 -499 21 113 -347 170 -207 -171 116 -284 37
4590C7K65m69K18k60K98K80p03N08K57o80K70K29m08L04m33M18k9j13k89K98R
$$ 37 302 -167 51 -209 89 369 -334 174 431 -249 21 250 -158 146 -287 131 102 -11 -300 -2 7
4611GK39j26j78J04j88K05j16q3J19j18M1J74k1j93K74k99L63j00j90J70j5k73
$$ 7 246 120 -58 46 -142 63 -53 -136 -17 -135 -94 80 59 -134 140 -159 204 104 -86 84 69 -204
4633b04K31m5j42M32j71P1j48j16K26l83J06J09m34K17K18M0L5n8l13N89l80l4
$$ -204 27 -18 -160 272 101 172 24 -92 134 -249 -143 -34 -468 -251 -33 7 42 -16 -329 260 -120 -154
4655a54J75j87K66j06Q0j50j07R6M11l87o5r1J54L14l75J74Q7l31K05j30J04k2
$$ -154 21 -166 100 -6 74 -76 -183 -87 324 -63 -128 -219 -65 249 -126 48 135 -196 9 -121 -17 -39
4677c9J61k09J14m0K1P8m23L26j02j71M40j95rL86l44M28m76K2L4r5r9M49m05
$$ -39 122 -87 27 -13 8 86 -337 -11 -113 -284 156 -39 -48 338 -6 422 -54 -32 2 -93 -192 257 -148
4700a48k3k15L15O4J14N7m7l47L68J70n96O19k98N4j59r6k56N88k74K62j54r8
$$ -148 -171 -386 -71 -7 107 164 117 -230 138 308 -288 331 33 87 -72 -168 -424 164 -110 152 -2 -100
4722a00L82n10J80K87l29M53m34l19M87l54K81K80n38J31P2N9L3p1j07K88l88
$$ -100 282 -228 -48 239 -90 363 -71 -390 97 -257 24 304 -234 -103 -31 28 61 -10 -117 171 -217
4743b17J96j00j73K85K28j55J07k61j75M86l04J40l7l59J84j34L35K08m28J94
$$ -217 -21 -121 -294 -9 219 64 171 -90 -265 221 -83 57 20 -339 -155 -289 46 254 -174 20
4763B0J29m14M59k71J45Q7l27N95n83k59R69p03k26M90K58o37J82J97P58r16j01
$$ 20 149 -265 194 -77 68 155 -172 423 -160 -419 550 -153 -379 111 369 -268 -86 111 869 -47 -148
4784a48K64j38l3N4j30L99M8p77M49J40j99J54M5m2L91q54K80Mj79J89M4K50m31
$$ -148 116 -22 -55 -1 -131 268 316 -461 -12 128 -71 83 128 86 477 -377 -97 -93 -272 -83 -39 211 -220
4807b20L99RQ9l69J91r6J27R1m46J62K59k12J36k12K22r4j03J00l0M5M46n45r9
$$ -220 179 188 277 -92 99 3 130 221 -225 -63 196 -16 120 -92 130 36 -67 33 3 48 494 -51 -150
4830a50L44l19MJ04k09J20K92l86L17OL2M1k17nL27n72J82K12m4J3J05j98k9j17
$$ -150 194 -125 -121 -17 -226 -106 186 -200 117 123 155 196 -21 -26 301 -271 -89 123 79 92 197 -1 -30 -147
4854a47L49j73L00r4o96N51J93l32K38j11m28L29k0N2K61l19j5J78q7J74j78j88
$$ -147 202 29 329 235 -461 90 283 -49 189 78 -350 -21 -41 11 272 -47 -62 116 29 203 25 -163
4876a63L55k90M04m2n96M58j02p4M17k31J96n64K88j09J82j77K01K1k35K64l51
$$ -163 192 -98 306 264 -332 126 24 -50 367 136 332 -232 56 -53 129 -48 153 174 -61 203 -148
4897a48j9P8K23l06L82m10R4k8j30K94p4N8J04p9l2j24PQ3J38j64o7J81j55J80
$$ -148 -167 -89 134 -172 210 -200 -106 -134 -264 30 -44 14 118 39 7 -117 -110 -27 111 -53 -120 61 -94 86
4921H6k27M15K4j69k36k44N24j47j31J06k51j66N28m26L87m4K01m7l58J30L77
$$ 86 -141 274 298 129 -107 -351 173 26 -105 1 -250 -416 112 -314 73 29 230 183 -175 -45 332
4942C32l36Q6Q7l70K51m0j40M57l42K04L4m07N35Jk97k57j81K81J40QN5p0k03
$$ 332 -4 82 169 -201 50 10 -130 327 -15 189 223 -184 351 352 55 -202 -383 -102 38 46 101 31 -172
4965a72L74l42j36M83m59L31J17l40N3p1k90N17j20l3J39R3k17J87j3J4k17O6
$$ -172 202 -140 -276 207 -252 79 196 -144 -91 -162 -452 65 -55 -88 51 144 -73 114 101 115 -102 -36
4987c6Pl56M28j28N1M71n39O9K18pj98J02J3k40L02n10K08L4J98j18K0K55j46
$$ -36 -29 -385 43 -85 -34 437 -102 -33 185 178 -20 82 95 -145 157 -353 -145 -111 87 -31 -11 244 98
5010I8l9M6n0j13j57L18j4o1O0M4J62n08K94k39K89J50l66J25M0p5K70n58L48
$$ 98 59 105 55 -58 -215 103 89 28 88 132 294 -214 80 -159 130 280 -86 39 79 4 274 -284 64
5033F4N1j63P1K8l82K90J05j98J26j27J40K79k81N3j1l15K16j00K4M96k87ll06
$$ 64 115 -48 23 51 -331 -41 64 -134 -8 -135 5 284 3 56 45 -270 -54 -154 -130 366 79 76 -230
5056b30J60J7K81m0k04o3J81kK58j15j45Jk59k8J76J13n80M91j53r5M89l19J39
$$ -230 -70 -53 228 188 -16 -79 102 100 358 243 98 99 -160 -188 -12 101 -479 12 -141 -236 253 -66 73
5079G3M8rP1J6m61M10N8Jl02n7j8L13n13O37m37P5L9N2J10j19k88K55J70K3M04
$$ 73 121 112 183 199 -262 148 206 207 -95 -152 -170 143 -370 267 -170 -95 -56 -4 106 -13 -301 -46 124 147 551
5104E51l10j38J40l49L79Jm78J83J30m69M68l15j20N40o42N68Om5l5l53K03M30
$$ 551 241 103 243 -106 273 274 -204 -21 109 -360 108 -207 -327 213 -429 139 145 100 65 -288 -85 345
5126C45p20O84k98m99P35m04j49L85j99K13J03j77M2j86K20Q0j88R0k00J27L4
$$ 345 -375 309 11 -488 247 -157 -306 79 -120 93 196 19 61 -125 95 175 -13 77 -123 4 38
5147C8N1m56L42M05n34J82K00k48J87m38M57m7n98M76k91L60J97o47M31K01n34
$$ 38 89 -367 -25 380 -154 28 228 -20 167 -271 186 139 -459 17 -274 86 283 -364 67 268 -266
5168b66M64k79Q3K2l12M74l28J02Q6j52J23jk19R1K00l18L28N7l74M96n81L42
$$ -266 198 -81 2 24 -288 186 -142 -40 46 -106 17 16 -203 -112 88 -230 98 155 -219 277 -304 38
5190C8RlP2J68j51K78l28p2L00m62M26l63j41L74J9l23J76k11K70k13J10O5J23
$$ 38 47 44 116 284 133 411 83 11 311 -151 275 -88 -229 145 164 -159 17 -194 76 -137 -27 38 161
5213A61m53L02K3j02K75j97J60J96o16Q69m01k83L81l82J21j12k59M40j67J78
$$ 161 -292 10 33 -69 206 9 169 365 -251 618 217 -66 315 -67 54 -58 -317 123 -44 134
5233A34J05k61p7l9k97M11J12k35J62PK03q9k3j28J84l2kl06K37K14n46N8L32
$$ 134 239 -22 -99 -138 -435 -24 88 -147 15 22 225 136 113 -15 169 137 135 -171 66 280 -266 -208 124
5256A24o25O16j91k43N55k13J59L7l28L77j33J05L6l05l91P94o36J48P7K9R7r2
$$ 124 -501 115 -76 -319 236 23 182 219 -109 268 135 240 276 -29 -420 374 -262 -114 -37 -8 89 -3
5278ck49K76j90L14j28j63J96pk64M23l46K55o0j72r9O30n68j48M48l92L07k47
$$ -3 -252 24 -166 148 20 -143 53 46 -218 205 -141 114 54 -118 -217 413 -155 -303 145 -247 60 -187
5300a87L0M90m19P00k04j77j19k94R0M8q5j68O94l20n8l3R9m18P6K01j2j9M09
$$ -187 -157 333 -86 614 410 233 114 -180 -90 -42 -127 -295 399 79 21 -12 87 -331 -255 -54 -66 -85 324
5323C24k62M2N2k67j36N05l08L31n89K01K69J14n55N86l68Q4O4q7k67J47n2K32
$$ 324 62 104 156 -111 -247 258 -50 281 -308 -107 162 276 -279 307 -61 23 87 0 -267 -120 -172 60
5345F0k22M23rm06L30J64p80Q59n97Q5J66j74J28L6j15L12l55L5O3J31k65N81
$$ 60 -162 261 252 -154 176 340 -440 419 -178 -93 73 -101 27 63 -52 260 -95 -60 3 134 -131 450
5367D50p77P34o16L9L21m28O09k00l69N50k46J37j9n26j20M96mQK0n5K87n35N01
$$ 450 -327 407 -209 -170 151 -277 332 132 -237 313 67 204 185 -341 -461 35 31 39 59 4 291 -244 257
5390B57j83oo7K01m44L43j00q4J48l28K40k07j3M27o79M39M05q03O00l9m3l44
$$ 257 74 68 1 202 -242 101 1 -83 65 -263 -23 -230 -243 184 -495 -56 349 -454 146 107 64 -280
5412b80K69N2J61l24K40j98k21N00ll39K11k15n6J66p5J60j23O3j20K08j94L3
$$ -280 -11 41 202 -122 118 -80 -301 199 196 -143 68 -147 -203 -37 -112 48 -75 -12 -132 76 -118 -85
5434h5j52J93k42M28q3k76K0N46n44J35kL1L59l50J36P3k25LM0p3K02M6k57nk06
$$ -85 -237 -44 -286 142 59 -217 -197 349 -195 -60 -62 -31 328 -22 114 187 -38 -35 5 -68 134 180 -77 -82 -288
5459b88O3K81o3L9J25j55j58L63l13n6M6M9q3K04n9Q5k03K80q2j28L27k25l02
$$ -288 -225 56 -7 32 157 2 -156 207 -106 -162 -116 -67 -150 54 -5 80 -123 157 75 -53 274 49 -253
5482b53Q7J52op9Q4k89J56P1K37k5j49L29n01K19n3l16K49k1J79J80m45L01j9
$$ -253 -166 -14 -20 -99 -15 -304 -148 -77 160 135 -14 315 -186 33 -20 -336 -87 -108 71 251 -194 107 88
5505H8m2j27L19k43j74K31J4J1l10M78m31M8K70K01k26J04l79M29n17L56j46j74
$$ 88 46 -81 238 -5 -179 52 66 77 -233 245 -186 -138 132 333 107 211 -168 261 -256 100 -46 -220
5527b20J53L76l94Q0j44j99L37j5J88q6p3o2R5l41N21r9l43M97n95Q4N22k20K88
$$ -220 -67 309 -85 -5 -149 -348 -11 -26 162 76 3 -59 36 -305 216 117 -226 271 -324 -240 282 62 350
5550C50j83l51K52K1j45O0k85L03l9k74O14l93L46k05oJ27l59J08K37j86n8K02
$$ 350 167 -184 68 89 -56 4 -281 22 -17 -291 323 -70 276 71 65 192 -167 -59 178 -8 -66 136
5572A36j99K72j30j33KK50l20K70l57M6K08j22j63j63J66J18K80j53J45l4p4L19
$$ 136 -63 209 79 -54 -52 198 -122 148 -209 -163 45 -77 -240 -403 -237 -119 161 8 153 119 45 364
5594C64n92L48N3o03Q67m28j8p5q3L03P6j27K87o36L10r1j16J18j35m00O35k24
$$ 364 -228 120 173 -430 437 9 -9 -84 -167 136 212 85 372 -264 46 -45 -161 -43 -178 -578 57 -167
5616a67J25J26l98M83K83l67r6K06n89Q80n27K4K14k70K41L3m82N53m75L33J83
$$ -167 -42 84 -314 169 452 85 -11 195 -394 486 -41 -17 197 -73 168 201 -281 272 -203 130 313
5637C13n38L40j3j8l8k0K0P4m15L73R1m16M41k21j95L74m77J73p7K86L18k93R7
$$ 313 -225 115 102 84 46 26 46 120 -295 78 169 -247 194 -27 -222 152 -325 -152 -229 57 375 82 179
5660A79l7k30K80k86J72q3O5p1J89k43M10j57m22J78r2j26J79M44l87M02n46Q9
$$ 179 142 -88 192 -94 78 -5 60 -11 178 -65 345 188 -234 -56 -148 -274 -95 349 -38 364 -182 -93
5682i3L56m60K4J12o0N94l84k83M66l24R1K52m03L09km51k1J49K19m7k48L37j67
$$ -93 263 -197 -173 -61 -121 473 89 -194 272 -52 39 291 -112 197 195 -256 -277 -128 91 44 -204 133 -34
5705c4P7J48l87J72K88k48m0L13k63J84l92L28p2k75K06J26k26J45r1q2K49n1
$$ -34 43 191 -196 -24 264 16 -24 289 26 210 -182 146 74 -201 5 131 -95 50 -41 -123 126 75
5727G5l85N57n07RK17o5L58l92P4J08N6J6l76J02J32J68k48L36n14M84R6l44J3
$$ 75 -310 247 -260 -251 -34 -99 259 -133 -59 49 105 121 -255 -153 -21 147 -101 235 -279 205 301 -43 -30
5750c0K88m07J60k33J32K8j85J5l3L38N14p71r1P29o49O20m14k29O7K1Q2K80l0
$$ -30 258 -149 11 -222 -90 -62 -247 -232 -265 73 587 -184 -275 454 -195 425 11 -218 -151 -130 -48 232 202
5773B02m50M33n22L97j0j11J52k74K66rl40M38ok67J62k38K95J42k52L45j06k97
$$ 202 -248 185 -337 60 50 -61 91 -183 83 74 -266 172 166 -101 61 -177 118 260 8 353 247 -50
5795e0R5j43j07L94l44nK73o7R5q8K1J02k5j20j3q5K81j89k22O11l77j22J00l61
$$ -50 45 -98 -205 189 -155 -160 113 46 141 53 74 176 151 31 18 -67 214 25 -197 414 37 -85 15 -346
5819c46N43J32m48N05l30N4J35n04M9P77m33k23K82k57J76j1J9L8k10J35k3k44
$$ -346 197 329 -119 386 56 110 245 -259 -210 567 134 -89 193 -64 112 101 120 158 -52 83 60 -184
5841a84M69K1m49J62K2j39P2J54k75K96j49L14m87M72j93l90K77j89Q6J55l9J98
$$ -184 285 306 -143 19 41 -98 -26 128 -147 149 0 314 -173 299 106 -284 -7 -196 -110 45 6 204
5863B04L5k81K32l88k14Q16k30k21J28m49M77j86K62j20J70n33P47o13q6O32n80
$$ 204 239 -42 190 -198 -412 404 174 -47 81 -368 109 -77 185 65 235 -298 449 -164 -250 382 -198
5884a98L2L06m92Q69o26j17K85J65q2m8j27L31n14J4N64j88j50j58J31j1N5J24
$$ -198 -166 140 -352 517 -109 -226 59 224 142 94 -33 298 -216 -202 362 174 24 -134 -3 -14 41 165
5906A65J60j36k26L57j66l8J66m68M58k05j25K27m05K7M63m9k21J63K7k87L52
$$ 165 325 189 -37 320 154 116 282 -186 272 67 -58 169 -236 -209 254 205 -16 147 174 -113 239
5927B39m00j3K52l3k00J25K9r1L6J04j36K40k38J9J0M7n4N50j036P53k02n1K55
$$ 239 -161 -174 78 45 -155 -30 -1 -92 -56 48 -88 152 -86 -67 -57 -10 -64 486 -550 203 1 -50 205
5950B05O6j90N5l77K49L23l48k40K25j05Q9J52k26J32j60N93k47m42L15l47K40
$$ 205 271 81 136 -241 8 331 -17 -257 -32 -137 -48 104 -122 10 -150 443 196 -246 69 -278 -38
5971c8N1m41M49j25k39L30M8R2l65M0R1Qj78R7M70n78M28j53l3P7j41K59q1Nl01
$$ -38 13 -428 21 -104 -343 -13 35 127 -238 -198 -107 -99 -277 -180 290 -288 140 -13 -46 31 -110 149 68 73 -228
5996b28J17j39M66j86j37L46j66M59j020N67o3k23oK73j00J8L53l07J60p4k44
$$ -228 -111 -250 216 30 -107 239 73 532 -488 79 16 -207 -213 60 -40 -22 331 24 184 110 -134
6017a34J03j31K85o7J1j98K6K12r8O2K8K1l6K13l44J8J50l91K42K15l82L14k1
$$ -134 -31 -162 123 56 67 -131 -105 107 9 71 99 120 84 297 -47 -29 121 -270 -28 187 -195 119 98
6040I8k94J10P9j19oK69l57J98K10MPj22J11k1m88M85l10L00o0l50K31j68L82
$$ 98 -196 -86 -7 -126 -132 137 -220 -22 188 192 199 77 188 167 -321 164 -146 154 94 -256 -25 -193 189
6063A89l10J02J37p0j86J14Q2j25r1j66L84j55k4J17N5q8j28nR1L8j82RL79n26
$$ 189 -121 -19 118 48 -138 -24 58 -67 -158 -324 60 -95 -119 -2 53 -35 -163 -168 -77 -39 -221 -212 167 -359
6087c59N38k8j92J24M6m2J6k67K83j38j0J46j47j2K54l28K95j32J6j06o1J37J40
$$ -359 179 151 -41 83 129 87 103 -164 119 -19 -29 117 -30 -42 212 -116 179 47 63 -43 -104 33 173
6110A73k27J58Q9j42k1K3q8j0j84K80r3k74J41l5K33L48l77PJ35r5j05q7j78M27
$$ 173 -54 104 193 51 30 53 -35 -45 -229 51 -42 -316 -175 -210 23 371 -6 1 136 41 -64 -151 -329 98
6134I8N8k11p7k32M46N9Oj37j4K23j00p0k6o2k86K69oQ3K11m53L70k09j75J48
$$ 98 156 -55 -132 -364 82 141 147 10 -4 219 119 49 23 -39 -325 -56 -62 21 232 -221 149 -60 -235 -87
6158h7r2m4K56k64J84J84m34J76P5o4J25J09r8L67n06j6K01l41N6J02J0j43J97
$$ -87 -179 -223 33 -231 -47 137 -297 -121 -46 -110 15 124 26 393 -113 -129 72 -269 -213 -111 -101 -244 -47
6181d7J38n9n3K05o2p3Nm7k83K85j10L66l32o9M7K16M4M2j90o0J96l71Q2M08l66
$$ -47 91 32 -21 184 122 49 54 7 -276 9 -101 265 -67 -136 -89 127 171 213 23 -37 159 -212 -130 278 -88
6206h8K82j01j49J83k75L39j88l1pJ82m72K38j22J03N11o79L07L76k73l8Q3l02
$$ -88 194 93 -56 127 -148 191 3 -28 -35 147 -325 -87 -209 -106 405 -274 33 409 136 98 181 -121
6228a21j21J98j90O25j52k66j3N2J97l37m3K54pM5p0k2K42k68K99l04J54j50l08
$$ -121 -242 -44 -234 391 239 -27 -40 12 209 -128 -171 83 76 121 51 29 271 3 302 -2 152 2 -306
6251c06L24K45k69K7l1k18K40m1j3K22k26k10K21m8J74J32p2n67L36pL7J11j11
$$ -306 18 263 -6 21 -10 -228 12 -29 -42 180 -46 -256 -35 -83 91 223 151 -416 -80 -87 -50 61 -50
6274e0J59o11M25J08J19Q0m30R3J10j09o9J84L43m03q1k00L55P9J05m55k11N54
$$ -50 109 -502 -77 31 150 230 -200 -107 3 -106 -175 9 352 -51 -132 -332 23 102 207 -248 -459 95
6296I5n2P2j6k21K17L42m92L21j40q6k0l93L2O33k61l3L19k58k01O6j7K99k60
$$ 95 43 115 99 -122 95 437 -55 266 126 40 20 -373 -341 292 31 -2 317 59 -142 -76 -93 206 -54
6319e4J69J4p8K00k10L4J25l77K35K03o39L26j3N3J78k46rJ79k17p7L96m07J60
$$ -54 115 129 51 251 41 75 200 -177 58 261 -378 -52 -65 -12 166 -80 -89 90 -127 -204 192 -215 -55
6342e5K67k51J10k9J90J5l1k25j00J01L20m76J75l6j85L37k21K46q2m18N17o1
$$ -55 212 -39 71 42 232 247 216 -9 -109 -8 312 -164 11 -25 -210 127 -94 152 70 -348 169 108
6364A08m52K39N62n16K10nk81J67O8k91M16m77M69m65J25L23l14k02L45k39K12
$$ 108 -344 -105 457 -59 151 146 -135 32 100 -191 225 -252 217 -248 -123 200 -114 -316 29 -210 2
6385BK39k52N9r7j52L82j16o0N7j73L81j70m77N69k12n9L55l41j22R6L51n7m5
$$ 2 241 -11 48 -49 -201 181 65 5 62 -111 270 100 -377 192 -20 -79 276 -65 -187 -91 260 203 158
6408A58j35K71n90N23pk31K88n2k89J66j40p0J84j22j11K54k42J30Q9J72m9k07
$$ 158 23 294 -296 227 220 -11 277 225 -64 102 -38 -108 76 -46 -157 97 -145 -15 74 246 197 -10
6430a0m0J19j31K4o3J21M5l68K17J71j49l1J29j61K25l13K86o7p8l06L04k23K71
$$ -10 -50 69 -62 -38 -101 20 65 -303 -86 85 -64 -95 34 -127 98 -215 71 4 -74 -380 -76 -299 -28
6453b8r1M14l79J72j62L2R9j92K50j52J91q1J1LJ19k37J13j5j37L30k23M62n72
$$ -28 -119 295 -84 88 -74 -42 57 -135 115 -37 154 73 84 87 206 -31 82 67 -70 260 37 499 -73
6476g3J18j2o20P50p0k84K09P7j47r0N44l61k3J44j02j27L34j37m85K58J34k46
$$ -73 45 33 -587 163 93 -191 18 95 -52 -142 402 41 18 162 60 -67 267 130 -355 -97 37 -209
6498b09%J64J34j00J92j56J96j33nj22j05K86l09lK82j84J03J61l09K89p4k19
$$ -209 -209 -45 89 -11 181 25 221 88 83 -39 -144 142 -167 -170 112 -72 31 192 -117 172 98 -121
6520a21K28j30l39M51J16k86J46j36LJ46j20o3N6K33j25P9R2k11j90K23K71o24
$$ -121 107 -23 -362 89 205 -81 65 -71 -68 78 -42 -105 -49 184 59 138 230 19 -171 52 323 -301
6542c01L34l4J15p7O8l16M39j79o8R2MJ67j45k18j66J07L88k92K00j01l7L6O9
$$ -301 33 -1 114 37 105 -211 228 49 -19 73 77 244 99 -119 -285 -178 210 -82 118 17 -20 16 85
6565H5J33L9l98j62M69j03N3K0kJ51k05k90J90n7m8J56K10m25L47P0r7l99K57
$$ 85 218 257 -141 -303 166 63 116 136 134 285 80 -210 -20 -77 -125 31 241 -184 163 233 136 -263 -6
6588fj9m1P5l6k0k5J4j04K01K08r7m0l51J80%L53l7l38K61k13lj08J13k11J73
$$ -6 -25 -66 9 -27 -47 -72 -58 -162 39 247 150 110 -241 -61 -61 292 255 -83 178 -35 -38 -146 -33 -244 -71
6613g1j02O1J49j51L24p8O0R4k22l3J18m15L26kk89Q1j2R0J76k70j38L30r9J67
$$ -71 -173 -112 37 -114 210 132 192 286 64 31 149 -266 60 58 -231 -150 -162 -72 104 -166 -304 26 -73 94
6637I4j49k3N9j7L56l65M5j45K3J81L03m74P1J96n34M10M6K6L98m35Q7j38m1O6
$$ 94 -55 -78 -19 -36 320 -45 0 -145 -122 59 362 -112 -41 155 -379 31 77 103 501 66 153 15 -26 40
6661D0p4m8J00j70l42N41o02L60L04k30L60j95K36K64n88L65j18l91K99j78J2
$$ 40 -34 -82 18 -152 -494 47 -555 -195 109 -121 239 44 280 544 -44 321 203 -188 111 -67 -55
6682e5QR3o3k67K48J87k81J15N0k76L1L40q5q6m5L1j5j2K37l74Q9L56j61j98P4
$$ -55 -47 46 -17 -284 -36 151 -130 -15 35 -241 -210 130 45 -41 -86 -55 -70 -82 155 -219 -130 226 65 -133 -59
6707e9K23k57M33j93l12J98m00M09J10l57n8P06n04L42k86K9J85l00K14q4k22
$$ -59 164 -93 340 147 -165 33 -367 42 152 -205 -263 443 -61 281 -5 24 209 -91 123 39 -183
6728a83J69J63q9P0l45O7J41m6J6P5k17N64n60M93l36L9NP9j76L79j87Q1k77k39
$$ -183 -14 149 60 130 -215 -148 -7 -53 -37 38 -179 385 -175 318 -18 21 26 105 -71 308 121 202 -75 -314
6752c14M67J51k15n85M63R7M08p32J21K28p1l0j4RN2r3J51l8m03N80l41O7J12
$$ -314 153 304 89 -496 -33 64 472 -260 -139 89 18 -12 -26 -17 35 -58 93 55 -348 232 -109 -42 70
6775G0m0o7J56m12N10m08Qj27QL90k34K17m1l14L06pl33J42L26l04L23%n25L48
$$ 70 30 -37 119 -293 217 -191 -183 -310 -302 88 -146 71 30 -284 22 15 -318 -176 150 -154 169 169 -356 -8
6799hOK41j69q1N8K5J84k44k09L55l75J88L07n18K43O9r0L2R8j57j13N52m16L32
$$ -8 -2 239 70 -11 47 72 256 12 -197 158 -217 -29 278 -240 3 72 -18 14 112 -45 -158 394 -22 310
6823C10l26J09j13k11m1O08k56o2n3l7K78l03L7L29m2m27L06j28N11k87l79kJ70
$$ 310 -16 93 -20 -231 -272 336 80 18 -35 -72 206 -97 -60 269 227 -200 106 -22 489 202 -177 -179 -9
6846iN4o2K38m11l6J85Lj30M93j75l25J64K51o9k42O8k61M38J0m51K91k24J09
$$ -9 45 -17 221 -190 -226 -41 -38 -168 325 150 -175 -11 240 171 -71 -3 -264 174 184 -267 24 -200 -91
6869i1Kq2K01m0J12K31l18n5j03k23L54k17J12R8L6j25N42l87J62l41L76k71Q9
$$ -91 -89 -171 30 -10 102 333 15 -40 -143 -366 -12 -229 -117 -19 17 -108 434 47 209 -132 244 -27 62
6892F2j51L85n62K58R0K1k9K13l92M4J70Rj43j57P0R3K6J2j47Q5K62k01j06Q2
$$ 62 -89 296 -266 -8 82 103 74 287 -105 -61 109 118 -25 -182 -112 -19 7 19 -128 -43 219 18 -88 -6
6916fj3j35J18L41l32l3k31J25M33l46n5J61j70J3P9J68k7j79J13j10L6N8j37
$$ -6 -19 -154 -36 305 -27 -60 -291 -166 267 -79 -134 27 -143 -130 -51 117 90 -89 24 -86 -50 8 -129
6939a29O59n53J10n7k38M45p1j4q5k74j64L20R8l1L13m06k0K54m60J74P6O0L8
$$ -129 530 -23 87 30 -208 237 166 152 67 -207 -371 -51 47 16 329 -77 -97 157 -303 -129 -53 7 45
6962D5K0j39K64j35J87r0j28R7k29J48N4j68J02K1j01j22J99P1l04L31J48k69
$$ 45 65 -74 190 55 242 152 24 121 -108 40 94 -74 28 49 -52 -174 25 96 -208 123 271 2
6984Bk62R4J25j12M56j93j53J17n35K68J2L2K34p9o2j10r5N31j96N2j52k69L39
$$ 2 -260 -166 -41 -153 303 110 -43 74 -461 -193 -181 -149 85 6 -56 -166 -261 270 74 126 -26 -295 44
7007D4K5j82L37k33j50J8J75j57K38l4j24m6m5K78j60k85J70j18j14N07j62K37
$$ 44 69 -113 224 -9 -159 -141 34 -123 115 81 -43 -89 -134 144 -16 -301 -131 -249 -363 144 -18 219
7029B19k36m5R4L1K6l2q9J92l36PK05k93K13J05K3l28M54m17K35Q1j61J3j94K55
$$ 219 -17 -62 32 63 89 57 -32 160 -176 -169 36 -257 -44 61 84 -244 210 -207 28 109 -52 -39 -233 22
7053B2P5j11L50k58j95M11m70K6J60M2rj48J34j58n5qM59j51R4k8k05K69k08K05
$$ 22 97 -14 336 78 -117 294 -176 -150 10 52 43 -105 29 -129 -184 -192 267 116 210 182 -23 246 38 243
7077B43k52j75l20P05m17J91j47j94K99k95M48j24j10L21m7l27J58O6K19k04j08
$$ 243 -9 -184 -504 201 -216 -25 -172 -366 -67 -362 86 -38 -148 173 126 -201 -43 23 242 38 -70
7098g0Q3J81j80J36k9k61K88k62N16l99m37M29J27l97M82k36N1K60m60K38p8L1
$$ -70 13 194 14 150 121 -140 148 -114 402 3 -434 -5 122 -275 207 -29 22 282 -178 60 -18 13
7120A3N8l58M00m41L68P6k67K43k41J42p0r9K72o4k26P6K90k66qJ73l50O21l27
$$ 13 71 -287 113 -328 40 116 -151 92 -149 -7 -77 -176 96 32 -194 -118 172 -94 -102 71 -279 342 15
7143A5K13l01J44j71J65j12m42M03N0j36J36k95O5N8J78K43m38L34j86k50L64
$$ 15 228 -73 71 -100 65 -47 -489 -86 -36 -172 -36 -331 -266 -208 -30 213 -225 109 -77 -327 37
7164C7m20L07M8k49K38L85n73L02K4k69M28n55J45L37n47K41j49L46l9l53O1M86
$$ 37 -383 -76 -28 -277 -39 346 -227 75 99 -170 258 -297 -152 185 -362 -121 -270 76 37 -316 -255 231
7186B31Q7j86j9j30K00o6k11j6l00L20J9J03o0l4j5K74l08M58p2k44q8j87L93
$$ 231 318 132 113 -17 183 117 -94 -110 -410 -90 -71 32 -28 -62 -77 197 -111 347 275 31 -57 -244 149
7209A49o0k74j73N40j83JJ04k24K54L6k02R8k19K15r4n9K0J28ol5j99M47j86n37
$$ 149 89 -185 -358 182 -1 0 104 -120 134 170 -32 66 -153 62 -32 -91 -71 57 51 16 -183 264 78 -459
7233d59L27J3J61n7J04k06l7L9m0L83n46M29o8o9J06J07k88J94r7r8M66k53K1
$$ -459 -132 -119 42 -15 89 -117 -154 -115 -155 228 -318 111 43 -26 80 187 -101 93 -4 -102 364 111 132
7256A32N4j33J31o6j17Q3j4q5J32l16M77m48K93l68L00K5q6j16J93j39P7o9k33
$$ 132 186 53 184 118 1 84 70 -15 117 -199 278 -170 123 -245 55 80 -6 -122 71 -68 9 -60 -293
7279b93N39k69l17M58N2j95J41k83J4M34m87K87R8k34J95k05n8O0j12L35r5K31
$$ -293 246 -23 -340 118 170 -25 116 -167 -153 281 -206 81 179 -55 140 -65 -123 -63 -175 160 65 296
7301B96j45M1k20J5J34k54K18k51M84k82m5K94m00J86m8p2N4j03j2m1M29n87K12
$$ 296 151 192 -28 -13 121 -133 85 -166 318 36 -9 285 -115 71 23 -49 5 -98 -110 -151 278 -309 -97
7324i7m2M1K21l41L17J71k90k9p3j03L00k99J32P8j52M15l86j42L15o4j60N41
$$ -97 -139 -98 123 -218 99 270 -20 -49 -122 -225 75 -224 -92 -14 -166 249 -137 -279 36 -28 -188 353
7346C53n46J57k04J42M6k26L61Qk51J87m3k1j9j2J62r3J14r5m8j38M14j25k4j50
$$ 353 -193 -36 -240 -98 -52 -278 83 91 -160 27 -16 -37 -56 -68 94 1 115 20 -28 -166 248 123 99 -51
7370e1j2K35M6l1k59j09K24K32j93N4l16M63l88K72l95O35o29J71N00m83o6J31
$$ -51 -63 172 218 187 -72 -181 43 275 82 136 -180 283 -105 167 -228 407 -222 -51 449 -34 -100 31
7392C1K12m91j5K78K46m05J88J6p2J31l9J51R7l15M6R9l76O11o95K95J02r2J29
$$ 31 243 -248 -263 15 261 -144 44 60 -12 119 80 231 328 13 59 158 -218 393 -302 -7 95 3 132
7415A32l79L38k19J40l45M00q3O6M5k88K78k7K45k92K14j71K96m23K9K40n1l78
$$ 132 -247 91 -128 12 -333 67 -16 50 95 -193 85 58 303 11 225 54 350 -73 -44 196 145 -233
7437b33N25m74l36N87j8r6J62Q6k27j29J7M7J89k58L13k50J58k76L53k29J09q9
$$ -233 292 -182 -518 69 51 -45 117 203 -24 -153 -136 -89 100 -158 155 -95 63 -213 140 -89 20 -69
7459f9J10J3j84K32j73N4N7K07l84j23K06Q0k61N25k54j74M4K39n3j62kL5J14
$$ -69 41 54 -130 102 -71 -17 40 247 -137 -260 -54 26 -235 290 36 -138 -94 145 92 -70 -72 -37 77
7482G7J24q1j72qL03j65L9l75m0J67L05j66K87l78N3K8m09N36j26j70j81L29J06
$$ 77 201 120 -52 -60 243 78 117 -258 -298 -131 174 8 295 -83 -30 -2 -411 125 -1 -171 -352 -23 83
7505H3j25K05k1m78M46l17mL47k03K62p6M0l30J43LK30n68K97j23L80L5k61p9
$$ 83 -42 163 142 -336 110 -207 -211 136 -67 195 119 159 -171 -28 -25 205 -363 -66 -189 191 226 -35 -114
7528a14J03J7o1o9J81N5K61l90o0J98n8J5j45m6O1J18P9j25l4O1j58J85j0j57
$$ -114 -11 6 -55 -124 57 112 373 -17 -77 121 63 78 -67 -113 -52 66 145 20 -14 47 -111 74 64 -93
7552i3L00j32K34m00J59k06M51n57K68j62J33l65L29j6K49j00j59j00k3L42j30
$$ -93 207 75 309 -91 68 -138 313 -244 24 -138 -5 -370 -41 -57 192 92 -67 -167 -190 152 22
7573B2L2j44J56l72M14j83j83M61j80J31k29n4K01k06K88O0k19qK71m80L87m08
$$ 22 54 -90 66 -306 108 -75 -258 203 23 154 -75 -129 72 -134 154 214 -5 -13 258 -222 165 -243
7595b43J00J82m38K55l1K24j87k38N93Oj11j38P2L54k26j56J17M5j61j37Nj35
$$ -243 -143 39 -399 -144 -175 49 -138 -376 217 223 112 -26 46 400 174 18 135 180 19 -118 -113 -248
7617b48L96j87J37Pk0l02M6L24K42k16j09J86m24Q4J48l20J80M25k34J5j3j79
$$ -248 148 -39 98 105 85 -217 -171 153 395 179 70 256 -168 -84 64 -256 -76 349 115 130 117 -62
7639f2R2J2k6r4j95J28R2j47M53n02L83m4j44M74k4k25k47K49K8l58k90N73l74
$$ -62 30 42 16 -78 -273 -145 -53 -200 253 -249 134 90 -54 420 396 171 -76 173 201 -157 -447 126 -248
7662b48r4K44j9K24k91k28N25j40n6P2O2K01j02j27k5L64m62mO7O9p3j58K55J18
$$ -248 -342 -98 -117 107 -184 -412 113 -27 -83 -11 51 252 150 23 -2 362 -100 -104 -37 32 -41 -199 56 174
7686A74q9o8Rk50K38l23K5k5M43k50L44J4j59k91L12L7k82L57k35j82O5O9j30
$$ 174 85 17 26 -224 14 -309 -284 -309 134 -116 228 242 83 -208 104 141 -141 216 -19 -201 -136 -67 -197
7709a97K76l60M51J10l86K33k07J0n1l5K17m3j76J40K49l64J57J29k74N1K03l45
$$ -197 79 -281 170 280 -106 127 -80 -70 -121 -156 61 18 -158 -18 231 -133 24 153 -121 -70 133 -212
7731b12M72l73K76K61o92J72L6N1J29K0k06L05k18K37n91J07J5J68N0N2m74K05
$$ -212 260 -113 163 424 -268 -96 -60 -9 120 140 -66 239 21 258 -333 -226 -211 -43 7 59 -415 -210
7753b10M03k9j96K85l39k17L10K19k56j70J97J7k75K22J80j75P9j42l4k78K90
$$ -210 193 164 -32 253 -86 -303 7 226 -30 -200 -3 14 -261 -39 141 -34 45 -97 -131 -409 -119
7774a19K85J33l93L71m58n1L62l41J01j61M55l63J65m16O87j30k72J6q3M90l82
$$ -119 166 299 -94 277 -181 -232 130 -211 -110 -271 184 -179 -14 -430 257 127 -145 -129 -212 278 -104
7795a04J48r7J16J2l74M13l36L06j65n6K2r1J46j05P2K41Jq3k02R0rj38J79J33
$$ -104 44 -53 63 75 -299 114 -222 84 -81 -137 -115 -206 -60 -165 -93 148 149 66 -136 -46 -55 -193 -14 119
7819A19O0l21k02M70J94n25R9K59j70J35j85j32J8M8J82L63l10j44O2q4J48l4
$$ 119 179 -142 -344 126 320 -205 -106 153 -17 118 -67 -199 -181 -133 49 412 102 -42 20 -64 84 50
7841E0K29k87J63j27j26K01J31l94K44k22J76K64m69M0K24k33J07K29j19l31K73
$$ 50 279 -8 155 28 -98 103 234 -160 84 -138 38 302 -167 -127 97 -136 -29 200 81 -250 23
7862B3j91K71O8j74j15j5K06m77L16N50l35m12L89J11m9k1j62J83j56J27j11j29
$$ 23 -168 103 171 -3 -118 -133 73 -404 -88 462 127 -285 104 215 166 145 -17 166 10 137 26 -103
7884a03K01J15l42K80J06m18K69j75k06J24J55j20J19l0M1P0Q4j41p1j37J6k05
$$ -103 98 213 -129 151 257 -161 108 -67 -273 -149 6 -114 5 -25 16 86 170 29 -42 -179 -163 -368
7906c68L45J77l98J89P2j93J6J66K87l96k20K43J34k42N9J58j69M03k71J04p5
$$ -368 -23 154 -244 -55 17 -176 -160 6 293 -103 -323 -80 54 -188 -129 29 -140 263 -8 96 21
7927B1L9nl22j96L17O2L84k87j23J55j30k62M01l11K77j80J80j29J63m8K90j81
$$ 21 60 55 -267 -463 -146 -84 300 13 -110 45 -85 -347 54 -257 20 -160 20 -109 54 6 296 115
7949A15K34l02k72N10k21K83k16K6J02o8m02J72J07k40K12j93N14m63P4K0K6j56
$$ 115 349 47 -225 285 64 347 131 157 259 191 -211 -39 68 -172 40 -153 361 -102 -28 -8 18 -138
7971a38lJ62j38L7j3m3j3L30j88q1J89J3Q9qk31J72j62L38m38L17k29m5n6J97
$$ -138 -141 21 -117 -80 -93 -136 -149 181 -7 -88 101 114 203 195 -36 136 -26 312 -126 191 -38 -83 -139 58
7995E8j49L14j82J30k12k84L28o0Lr4J59j01M44l53K00j28j59J67n0L76l11l65
$$ 58 -91 223 41 171 -41 -325 3 -57 -54 -148 11 -90 354 1 201 73 -86 81 31 407 96 -269
8017b69N21o7l47n4J51J48k73K33J89m86K61j26K41n4J11l22J28M61l03o4k18
$$ -269 252 185 -162 -216 -65 83 -190 43 232 -254 7 -119 122 68 179 -143 -15 446 143 79 -139
8038a39K27J2p2r6Q1k2o2k8k7J93m73L79j21K0M01m31K69k62J55q4j41Q2J16L17
$$ -139 88 100 28 -68 13 -9 -71 -99 -126 67 -406 -27 -148 -128 273 -158 111 -151 4 -80 -221 -139 -23 294
8062B94r0p8m05M14L7k67R6J94j19K5J63k19n4L08j93Pj40J67k27mL90k10k98
$$ 294 204 126 -279 135 172 -95 1 195 76 101 264 45 -9 299 106 113 -27 140 -87 -91 299 89 -209
8085b09J67M0K1K33n9j27k84j7L21o2J39k48j52L8nK4L8J84l73M34l20K11n3K05
$$ -209 -42 -2 19 252 193 66 -218 -235 86 24 163 -85 -237 -199 -204 -180 -142 42 -331 103 -217 -6 -59 146
8109A46n41K47j23L90m21J2K75J29j71J81k18J7L42l01K59k24l01N65j3q2j86
$$ 146 -395 -148 -271 119 -302 -290 -15 114 -57 124 -94 -77 265 -36 223 -1 -302 263 250 168 -18
8130a8Mo8J80j79J83j26K69m43L57ql8j96kJ40R0J44r05L75K75j77M07k74m1L35
$$ -18 -14 -82 98 -81 102 -24 245 -198 159 151 113 -83 -85 55 145 289 -616 -241 34 -143 264 -10 -51 284
8154B84m54L1k5K24J48k18J03k22k35M14O7l47j14N84kJl23L33j91k32L46l50
$$ 284 -170 -139 -164 60 208 -10 93 -129 -364 50 117 -230 -344 240 238 239 -84 249 58 -174 172 -178
8176a78K04k00J84J57j8r1j4r0O6M4r3LJ10k58L48
$$ -178 26 -174 10 167 149 58 44 -46 20 64 -29 -26 84 -174 174
8191A74
$$ Imaginary data points
##PAGE= N=2
##DATA TABLE= (X++(I..I)), XYDATA
0@%%%qJ6j6J6k4M0n6O4q0J04j28J54j85K23k64L12l68M34n06N86o76P80q92J014
$$ 0 0 0 0 -8 8 -8 8 -16 24 -32 32 -48 56 -72 82 -103 120 -144 168 -200 234 -272 314 -362 418 -474 540
27E40j156J315j487J673j879K108k360K635k936L267l631M031m466M946n477O061
$$ 540 -616 699 -788 885 -994 1114 -1246 1389 -1547 1720 -1911 2120 -2346 2600 -2877 3184
43C184o710P435q244R152j0188J1381j2761J4380j6317J8683k1647K5483l0667
$$ 3184 -3526 3909 -4335 4817 -5371 6010 -6751 7629 -8688 9995 -11652 13831 -16836
56a6836L8096m9676P0293j17584L98954O0029r93913N21303N50320m64276l54423
$$ -16836 21260 -28416 41877 -75707 323247 383276 -610637 -89334 460986 -3290 -357713
67c57713M46615J39314l53063k4642K74834q6198n7364j8671m3231K02628J3163
$$ -357713 88902 228216 -124847 -149489 125345 39147 -18217 -36888 -80119 122509 135672
78A35672l42583R3332L45328j12488l85482J45821M23192k57292l58973L78123
$$ 135672 -206911 -113579 231749 119261 -266221 -120400 302792 45500 -313473 64650
88F4650J60799l35091n556K12513k4063j41040R271J18870l0179n3633k2340j1994
$$ 64650 225449 -109642 -115198 97315 73252 -67788 -58517 60353 30174 -23459 -45799 -57793
100e7793J79261m5484k89778K05793K36798k82671j02778K32496J7569j67346
$$ -57793 121468 75984 -213794 -8001 228797 -53874 -156652 75844 93413 -73933
110g3933K7523J24237j04583l4116J37011r6697k9104J36928j26793k9689J83004
$$ -73933 -46410 77827 -26756 -60872 76139 -20558 -49662 87266 -39527 -69216 113788
121A13788q6029j46974J10208J29896j24358j40986J87733O9058k12138P8336
$$ 113788 27759 -119215 -9007 120889 -3469 -144455 43278 112336 -99802 -21466
131b1466J14341j55038L7708J23265j21792p5739J59162L8264k24677O4157K46477
$$ -21466 92875 -62163 -24455 98810 -22982 -98721 60441 98705 -125972 -61815 184662
142A84662k39604j26382L49314o6647l05865J86405K08101k04462j45535K09161
$$ 184662 -54942 -181324 167990 101343 -204522 -18117 189984 -14478 -160013 49148
152D9148O8510k09675N5983J20013j39202L1243R4041j05201J2117O9278n4746
$$ 49148 117658 -92017 -36034 83979 -55223 -23980 70061 -35140 -23023 46255 -8491
163h491k0998N6365J3074j00087J8315J43767j08106j02274J58149M870j04755
$$ -8491 -29489 26876 39950 -60137 -41822 101945 -6161 -108435 49714 54584 -50171
174e0171M4230L3530l2351j1741M3179j0068p7522P9436M1092j29645O1355P2678
$$ -50171 -5941 27589 -4762 -16503 26676 16608 -60914 18522 59614 -70031 -8676 64002
186F4002j16087L5441Q1338q0836l1123P1421K4950q0073n407Q4649o3521k2389
$$ 64002 -52085 -16644 64694 -16142 -47265 24156 49106 -30967 -36374 48275 -15246 -37635
198c7635R8510p9522m3929J15963k2234p2105K8843M1394j5888m5725M5719J1728
$$ -37635 60875 -18647 -62576 53387 31153 -40952 -12109 29285 13397 -32328 13391 25119
210B5119p6484O4495L0164r4791N1130M0477p1401K3597M7602m0181n0733O3566
$$ 25119 -51365 13130 43294 -51497 -367 40110 -31291 -7694 39908 -273 -51006 12560
222A2560O6590j33451k2514J70519p0596j15753J13714L2340q3574L644O0236
$$ 12560 79150 -54301 -76815 93704 23108 -92645 21069 53409 -30165 -26521 33715
233C3715j1093o8403M8681M2682p7994K2292L2218n2301M6058J0314o7296L4133
$$ 33715 22622 -45781 2900 45582 -32412 -10120 22098 -30203 15855 26169 -41127 -6994
245f994M1116k1597l8366R305N8633m5467l5465P3708l3872l9178O2784j4325
$$ -6994 34122 12525 -25841 -16536 42097 -3370 -38835 34873 1001 -38177 24607 10282
257A0282l0429K1315P722m517j4664K4533n404m9933O7187J2734j00377N4255
$$ 10282 -20147 1168 8890 4373 -10291 14242 8838 -41095 26092 38826 -61551 -7296
269g296N8047p0622l548L9129k203k5175L240L7985l9643j8174O3479l7393k6325
$$ -7296 50751 -19871 -23419 15710 13507 -11668 -8428 29557 -10086 -28260 35219 -2174 -28499
282b8499M9653k9445m966L3443k2562p456N893J8565K294m5187L0212K2189m8204
$$ -28499 21154 -8291 -13257 20186 -2376 -9832 -3939 14626 16920 -28267 1945 24134 -24070
295b4070K9324Q179m1531L2801J1992k3141l355R762K3829l5167o838N6334n2101
$$ -24070 5254 13433 -28098 4703 16695 -6446 -9801 -39 23790 -11377 -18215 38119 -13982
308a3982k1117P5077l6825l9672M3995Q768j5622j5481J7047J5618l3068K1821
$$ -13982 -35099 39978 3153 -36519 7476 16244 622 -14859 2188 17806 -15262 6559
320F559Q927m2145L5565O703l9217L0276j963j7498J8625l126M070j4749l013
$$ 6559 15486 -26659 8906 15609 -23608 6668 4705 -12793 5832 2706 6776 -7973 -10986
333a0986M0660l2537k2397M3924j8998j0099J8184j4846N595J219L186P818k7792
$$ -10986 29674 -2863 -25260 18664 -334 -10433 7751 -7095 -1500 -281 2905 10723 -17069
346a7069K3671J3301m3829L3075Q154m7344L3915J6243l2667k59J4557J7022k5164
$$ -17069 6602 19903 -23926 9149 17303 -30041 3874 20117 -12550 -12809 1748 18770 -6394
359f394j1899M2251k4412j6183L7459k5992o440K1446j8158J1805j859j4725K0940
$$ -6394 -18293 23958 -454 -16637 20822 -5170 -11610 9836 -8322 3483 1624 -13101 7839
372G839o260J705J165k1794L3081j749l8414K9427M715j9791R348j500R320j2505
$$ 7839 1579 3284 4449 -17345 15736 13987 -24427 5000 9715 -10076 -728 -2228 7092 -5413
386e413q191L8789k5751k1108M1103j8115j0508J9283k0164P502R571j1804M967
$$ -5413 -13604 25185 -566 -21674 19429 1314 -9194 10089 -10075 -2573 6998 -4806 161
399A61p959J4518L030k6528K7990k95l1056L1633l377k2597J6703n203O009L1
$$ 161 -7798 6720 9750 -16778 11212 10917 -20139 11494 8117 -14480 2223 -2980 3029 3060
413C060j7242K2537l788j0937J8020j7779L563J5523k1845R269K614j2398J5253
$$ 3060 -14182 8355 4567 -6370 11650 -6129 -2566 12957 -8888 381 2995 -9403 5850
426E850j0281L637Q067k2680K5095N839l4185K3053O017j8037R744n640L979M54
$$ 5850 -4431 -794 7273 -15407 9688 15527 -18658 4395 10412 -7625 2119 -3521 458 912
440I12j0390J9394j1185r413K4484j6538Q74J3015k3688J5943P397k3080J2949
$$ 912 -9478 9916 -1269 -10682 13802 -2736 -1862 11153 -12535 3408 10805 -12275 674
453F74j523m33Q474j8847J4566O815k0195J7327k293j1118J1859j0738Q088K448
$$ 674 -849 -1282 7192 -11655 2911 9726 -10469 6858 4565 -6553 5306 -5432 2656 5104
467E104k0040K0191q11j3050J7979j5666K380K0757k4110K347J2567j0206M574
$$ 5104 -14936 5255 4444 -8606 9373 -6293 -3913 16844 -7266 -4919 7648 -2558 2016
480B016q259N124R780k1688J4535R631k1295J4051j838m937J4752k0979K804J9265
$$ 2016 -6243 -1119 8661 -13027 1508 11139 -10156 3895 2057 -2880 11872 -9107 -6303 12962
494A2962j8051J576K368j982J2689j6560J882J7596j7783M963O136j0225J0227
$$ 12962 -5089 -3513 -1145 -3127 9562 -6998 -5116 12480 -5303 -340 5796 -4429 5798
507E798j1199K16J6671k0483L835J2222j3136J2313n404j0218K0489r503o813
$$ 5798 -5401 -5185 11486 -8997 -5162 7060 -6076 6237 833 -9385 11104 1601 -5212
520e212Q432p487R353o027q718J7855j1618j693J4070j5597R299M460j6642J6451
$$ -5212 3220 -4267 5086 -941 -9659 8196 -3422 -5115 8955 -6642 2657 7117 -9525 6926
534F926l187j1586J1035p518O734K041j8392J8115M971j5633P868k944O880J101
$$ 6926 3739 -7847 3188 -4330 2404 4445 -13947 4168 9139 -6494 1374 -1570 5310 6411
548F411j9492J8341K041j9614J5557k421m309Q835j4130J0733R663j9050O428
$$ 6411 -13081 5260 7301 -12313 3244 823 -3486 5349 -8781 1952 11615 -7435 -1007
561a007L830p50L630j8137J2036J2712k2459O078P584l646O267j5846R900J6857
$$ -1007 2823 2073 5703 -12434 -398 12314 -10145 -4067 3517 -129 6138 -9708 192 17049
575A7049k7435M686J7158j3343j083j944O388O303j9435J0646J0603j5335Q573
$$ 17049 -10386 -5700 11458 -1885 -2968 -4912 1476 7779 -11656 -1010 9593 -5742 2831
588B831j807n855J3018j0436J85M618j0685J5110o156j4922K4500o172j4741J4621
$$ 2831 1024 -4831 8187 -2249 -2064 2554 -8131 6979 823 -14099 10401 4229 -10512 4109
602D109P15k117p178r16J7983j5354q078J7915j0728M050M439j6584J7839L791
$$ 4109 4824 2707 -4471 -5387 12596 -2758 -10836 7079 -3649 401 4840 -11744 6095 9886
616I886j8647P740L777M659p359j7796K7464L668l1264J2477J7049o195j4017
$$ 9886 -8761 -1021 2756 7415 56 -17740 9724 13392 -17872 -5395 11654 5459 -8558
629h558l414L2367j0961l5283L0352J3758k4507j760K902J3278j207k3496J6004
$$ -8558 -11972 20395 9434 -25849 4503 18261 -6246 -8006 -5104 8174 6967 -16529 -525
642e25J2874j3300k662j771J6031l64k9964J7287J9432j9746q178K960K0523M63
$$ -525 12349 -951 -3613 -5384 10647 10283 -19681 -2394 17038 -2708 -10886 -7926 12597 13060
656A3060l7987K1595L1795l4177j2022K3762R713j7462j9263K8132J0517l4250
$$ 13060 -24927 -3332 28463 -5714 -17736 6026 15739 -1723 -20986 7146 17663 -16587
668a6587R947J7377j0401Q2n719P318Q484j6546M134K539k974J3284j8668p674
$$ -16587 -6640 10737 336 418 -5301 2017 10501 -6045 -1911 628 -2346 10938 -7730 -15404
682a5404L0925q766k0518J0104J5359k853k5908J4285K7660l4912p360L1025j0112
$$ -15404 15521 6755 -13763 -3659 11700 8847 -17061 -2776 24884 -10028 -17388 13637 3525
695C525r269K392J55J1500p824n164O493k932J0329j0113j4179K7574k996k6329
$$ 3525 -5744 -3352 -3197 8303 479 -4685 1808 -1124 9205 -908 -15087 12487 9491 -16838
709a6838J1545J5800j474k1935j048L7839j6946l1688L0768J0684k1033o880Q894
$$ -16838 -5293 10507 9033 -12902 -13950 23889 6943 -24745 6023 16707 -4326 -11206 -2312
722b312J7732j6631j8273K5482M418j3604p23j019J6411m563k2179J7023Q750
$$ -2312 15420 -1211 -19484 5998 10416 -3188 -3911 -4930 11481 6918 -15261 1762 10512
735A0512j2734m660j072J9738k970l0615K0739K1560k2750j1433J3168J9253j7682
$$ 10512 -2222 -6882 -7954 11784 8814 -21801 -1062 20498 -2252 -13685 -517 18736 1054
748A054k5537L4600Q905l7632R428K0338o528j0212k539J7388k808j6641J4458
$$ 1054 -24483 10117 19022 -18610 -9182 11156 4628 -5584 -8123 9265 6457 -10184 4274
761D274q93q043J0344j0841J00J3967j0189n649M967R053K82k1782J3500J9567
$$ 4274 3381 -4662 5682 -5159 -5059 8908 -1281 -6930 -1963 7090 7372 -14410 -910 18657
775A8657k6940j276J9328q434o411j59Q748L690j7526R411R081j2597P615k195
$$ 18657 -8283 -9559 9769 1335 -5076 -5235 3513 7203 -10323 -912 8169 -4428 3187 992
789I92p101J3022n740p171O454j94L076q399j070J8435j3695q007J6532m444k765
$$ 992 -6109 6913 1173 -5998 456 262 3338 -5061 -6131 12304 -1391 -9398 7134 2690 -75
804g5j957j393J1353j0240o945J5700n934l622L551k679R129o286p562J3169o002
$$ -75 -2032 -3425 7928 -2312 -9257 6443 509 -3113 438 -2241 6888 602 -6960 6209 207
819B07j751M580r094P931J317j1056J0125J261n821K369k458R723m618j3367J6297
$$ 207 -1544 3036 -6058 1873 3190 -7866 2259 3520 -2301 68 -2390 7333 2715 -10652 5645
834E645jj3195P677Q95M04l275l817J3987p202j0045J6746o089p032J0526o174
$$ 5645 5644 -7551 126 1021 1425 -1850 -5667 8320 1118 -8927 7819 1730 -5302 5224 -950
849i50r59K482k197M312o501J976Q143j1021M687O206j0745O761j005m732P664
$$ -950 -1909 573 -1624 2688 -3813 -1837 6306 -4715 -28 6178 -4567 2194 1189 -3543 4121
864D121o978K14N470o482O039j453n772J0977o227k494P399o770K195M55n373
$$ 4121 -2857 -2643 2827 -3655 2384 931 -4841 6136 -91 -2585 4814 -1956 239 694 -4679
879d679R306o258m218J1399p698J137N066p423O355r35o469P758l756r43J946
$$ -4679 4627 -1631 -5849 5550 -2148 -1011 4055 -3368 2987 2052 -4417 3341 -415 -1358 588
894E88m965Q005k809p120J1843n159l645Q498p800L544K497r264P762m9o248N247
$$ 588 -4377 3628 819 -6301 5542 383 -3262 5236 -2564 980 3477 -5787 1975 1926 -4322 925
910I25k872L225J611q262R135p96p562Q440m131j622M956p822O158N50p657Q818
$$ 925 -1947 1278 2889 -5373 3762 2966 -4596 3844 -287 -1909 3047 -4775 1383 1933 -5724 3094
926C094k899k273O843p575K420M853p497M284j205k044N378q738M845O310j1703
$$ 3094 195 -2078 4765 -2810 -390 4463 -3034 1250 45 -1999 3379 -5359 -514 5796 -5907
941e907O566L020o789N965l848m23O007q830L113L917n681M220l783J570O650
$$ -5907 659 3679 -3110 2855 -993 -1416 4591 -4239 -1126 2791 -2890 1330 -2453 -883 5767
956E767j0678M664O380j0175M936N51l993N908p428K568O762r750M014L609m753
$$ 5767 -4911 -247 6133 -4042 894 1445 -2548 3360 -4068 -1500 5262 -4488 -474 3135 -1618
971a618M088l882R02N485r539M558K919p422O453k945j892P823q502K173O203
$$ -1618 2470 -1412 -510 4975 -4564 -6 2913 -4509 1944 -1001 -2893 4930 -3572 -1399 4804
986D804p856M110M39l659N594o067P24N603p559M404O24m692Q038n559j311P943
$$ 4804 -3052 1058 1497 -2162 3432 -2635 -1911 3692 -3867 537 1161 -3531 4507 -1052 -2363 5580
1002E580q470J803M463o654M855k570k183P645p081J036N628o457M631j269l303
$$ 5580 -2890 -1087 3376 -3278 1577 -993 -3176 4469 -2612 -1576 4052 -2405 2226 957 -2346
1017b346O767o798K49O548q770M121K206o061P558l531l258Q135o192J060L018
$$ -2346 4421 -2377 -2128 4420 -4350 -229 1977 -4084 3474 -57 -3315 4820 -1372 -312 2706
1032B706n956N353k670k803P138o819J553N156p192N615J32n407P257m648j200
$$ 2706 -3250 2103 -567 -3370 3768 -3051 -1498 3658 -3534 2081 2213 -3194 4063 -585 -1785
1047a785N372o830L826J105o286P329k526k817N874m986K559K142o658O779k667
$$ -1785 3587 -3243 583 1688 -4598 2731 205 -2612 3262 -1724 835 2977 -3681 3098 431
1062D31m759Q023n723m22M935n326L839J055n164O405k862j896M086n076L433
$$ 431 -4328 3695 -2028 -2450 2485 -2841 998 2053 -3111 3294 432 -1464 2622 -2454 979
1077I79O36o417P805k754l739P098m830Q35L104n775N914j517n149O932l804j373
$$ 979 1615 -4802 3003 249 -3490 3608 -1222 -387 2717 -3058 2856 1339 -3810 3122 -682 -2055
1093b055M125n071M005L56m391O357l394q89M219n908L850J605p773P230p92n246
$$ -2055 2070 -3001 1004 1360 -3031 3326 -68 -957 3262 -2646 1204 2809 -4964 2266 1474 -3772
1109c772N312k722J234K619n708N124k59m797N951m253m51M674p000M281K286
$$ -3772 1540 -1182 52 2671 -3037 2087 1828 -2969 2982 -1271 -1722 2952 -4048 233 2519
1124B519n863N079j708q87M155o075L416K627o762M808n74l587M884l943O68L947
$$ 2519 -3344 1735 27 -860 3295 -2780 636 3263 -3499 1309 735 -2852 2032 -1911 -1243 2704
1140B704n180L800l39l103O271n707n58O444p221J268L775l988K697j616l96M757
$$ 2704 -2476 1324 985 -2118 4153 -1554 -2112 4332 -2889 -1621 2154 -1834 863 -753 -1149 3608
1156C608n617K064L062n810M858j748l982O703m058k091N251l737K768r47k738
$$ 3608 -2009 55 3117 -2693 2165 417 -3565 3138 -920 -3011 2240 -1497 1271 324 -2414
1171b414P206n384k342P338n461p59L017l365L643k547j019N058n131K024L137
$$ -2414 4792 -592 -2934 4404 -1057 -1816 1201 -2164 1479 -1068 -2087 2971 -2160 -136 3001
1186C001o364N596l60n659N933k468j658L463l813L511j72l713N724k756k005
$$ 3001 -3363 2233 1873 -3786 2147 -321 -1979 1484 -2329 1182 1010 -2703 3021 265 -1740
1201a740N425n967K293K538o091M310q2k920M028l669J715L537o510M593Q78n307
$$ -1740 3685 -2282 11 2549 -3542 768 686 -2234 1794 -1875 -160 3377 -3133 1460 2338 -2969
1217b969N038k721j374M488m803J947J227k368M393n184J015P041q878J027P082
$$ -2969 2069 -652 -2026 2462 -2341 -394 833 -1535 2858 -2326 -1311 5730 -3148 -2121 4961
1232D961o859K39K487j301J618m069K817L013o010M926J28n355O613k812l453
$$ 4961 -1898 -1659 828 -473 1145 -2924 -107 2906 -3104 1822 1950 -3405 3208 396 -3057
1247c057N383l021J43J82j698N993n388j928Q528n500j988N114l340J394j426
$$ -3057 2326 -695 -552 -370 -2068 3925 -1463 -3391 5137 -363 -2351 2763 -577 817 -609
1262f09r41M465n318J374M011o336M742J386o562N833m55k977K885l236K107J019
$$ -609 -1550 2915 -2403 -1029 2982 -3354 1388 2774 -3788 2045 1590 -1387 1498 -1738 369 1388
1278A388m750M964j076k325L665m091L641J726p739N906K164o806L518l39L30
$$ 1388 -3362 1602 526 -1799 1866 -2225 1416 3142 -4597 1309 3473 -3333 185 -154 176
1293A76P92n047N616J171o775N787m72k546M064m633Q64L401l574Q06r87J307
$$ 176 968 -4079 1537 2708 -4067 1720 1248 -1298 2766 -1867 -1003 2398 -1176 -370 -1357 -50
1309e0L997r076L883Q972j0834l61P793k500l866q75N421m4q384P193K714q227
$$ -50 3947 -5129 -1246 7726 -3108 -3469 4324 1824 -2042 -2917 2504 2460 -5924 1269 3983 -4244
1325d244N346J80l347N012l196j412K602j303K344m402n7P847p760j594Q641m443
$$ -4244 1102 1282 -2065 2947 -249 -1661 941 -362 1982 -2420 -2477 5370 -2390 -3984 4657 214
1341B14j966J678J060K368o603J560O054o938J201L262m288L976j135k460N298
$$ 214 -1752 -74 986 3354 -3249 -1689 4365 -2573 -1372 1890 -2398 1578 443 -2017 3281
1356C281l621n73K082k596L167j976k677N454l560m7K578m495N248J98o437N702
$$ 3281 -340 -913 1169 -1427 1740 -236 -2913 2541 -1019 -1066 1512 -2983 2265 2463 -3974 1728
1372A728R93m214J064j26K878k926m188Q715k944n607P532j402k931K582j676
$$ 1728 2721 -1493 -429 -555 2323 -603 -4791 3924 980 -4627 2905 1503 -1428 1154 -522
1387e22J722r26j429L105n118L168M143q722L619O187p303J92L938K57l457k823
$$ -522 1200 274 -1155 1950 -3168 0 4143 -4579 -960 5227 -2076 -1884 2054 2311 -1146 -3969
1403c969P464r76q762P194J983o150M011K10j611J539j716K529j637j943M604
$$ -3969 3495 2519 -6243 951 2934 -3216 795 1005 -606 933 -783 1746 109 -1834 2770
1418B770n075M34O504p307r5N597l168n8J95R99J709n439L623K087n803L614K98
$$ 2770 -2305 -1871 4633 -2674 -2769 2828 -340 -398 -203 796 2505 -2934 689 2776 -3027 587 885
1435H85l212L684j941p95L591l033R45R69j797K718l533M00M077n437J584K519
$$ 885 -2327 1357 -584 -1379 2212 -821 124 1093 -704 2014 -1519 -1119 2958 -2479 -895 1624
1451A624m263L742L02l026K680j097P74j02l048M777k512l825O999k302l706M288
$$ 1624 -2639 1103 1405 -1621 1059 -38 736 634 -2414 2363 -149 -3974 3025 723 -2983 1305
1467A305r55j47j08n08K441l406P21M087o392K185L750o464L199K715l238J84
$$ 1305 350 203 95 -413 2028 -1378 -657 3430 -2962 -777 2973 -3491 -292 2423 -815 -631
1483f31N84J731p82m007N732j526n126O144j447l139L579j549L82N37j180K837
$$ -631 -47 1684 902 -3105 2627 1101 -4025 2119 672 -2467 1112 -437 -55 482 -698 2139
1499B139l350L04L963n451J215M442n766J718K223k297R23r49K186J39l990M204
$$ 2139 -1211 -907 3056 -2395 -1180 3262 -2504 -786 1437 -860 63 -886 1300 1439 -2551 1653
1515A653j36m894N194j339k966L373j291o85J457q55K065k760L55M144n310J677
$$ 1653 1517 -3377 1817 478 -2488 885 -406 -1091 366 -489 1576 -1184 -829 3315 -1995 -318
1531c18L306n519K226J655k982J779n11M91J306l037L077p38l582N571k312k738
$$ -318 2988 -2531 -305 1350 -1632 147 -364 127 1433 -1604 1473 735 -2847 2724 412 -2326
1547b326L552j486o99J421j387K013j398m17L558m309J198L037n124K837J458
$$ -2326 1226 -260 -959 462 -925 1088 -310 -727 2831 -1478 -280 2757 -2367 470 1928
1562A928l965J935N38q25J150k052L180j058l304N285k792k526M773k586j159
$$ 1928 -2037 -102 436 -389 761 -1291 1889 831 -2473 2812 20 -2506 2267 -319 -1478
1577a478K354j681J023n88j37K908m024J637K879n283K595J691l600J948m3n76
$$ -1478 876 -805 218 -370 -507 2401 -1623 14 2893 -2390 205 1896 -1704 244 201 -375
1593c75J013k363L082k7m049M955j333l131M251j889j410K345j574M93o79m22
$$ -375 638 -1725 1357 1330 -2719 2236 903 -2228 2023 134 -1276 1069 -505 -12 -691 -1113
1609a113L367l875J212L045m717J995K175l811J990j08p18J185k015K408m01k782
$$ -1113 2254 -1621 -409 2636 -2081 -86 2089 -1722 268 160 -558 627 -1388 1020 619 -2163
1625b163M224j482k321L972k358j100K512j983O31j31q26K752l224J072K750m441
$$ -2163 2061 579 -1742 2230 -128 -1228 1284 -699 -68 -199 -1025 1727 -1497 -425 2325 -2116
1641b116K259J954l610K250j10j725J982j881J368J01k409L739j417k293M297
$$ -2116 143 2097 -1513 737 627 -1098 884 -997 371 472 -1937 1802 385 -1908 2389
1656B389k717n84K700k442N85j97m68J960k412P84K761m153K097J987l850J992
$$ 2389 -328 -912 1788 -654 -69 -266 -734 1226 -1186 -402 2359 -1794 303 2290 -1560 432
1672D32L95k055J762j748J205N63k528L764j670k063M283j981j503K869k033j14
$$ 432 827 -1228 534 -1214 -9 554 -1974 1790 120 -1943 2340 359 -1144 1725 -308 -422
1688d22M95q16J821k268L46K742l834K224J837l766K545R2k127K029j599N85P78
$$ -422 73 -743 1078 -1190 -844 1898 -1936 288 2125 -1641 904 996 -1131 898 -701 -116 662
1705F62k225K407o95j656L349j713j337K942k112N29L06j481J699j586J01K300
$$ 662 -1563 844 149 -1507 1842 129 -1208 1734 -378 151 457 -1024 675 -911 -810 1490
1721A490k801J183J560k805J885L22j559K074j742L49O29j823K343r57j981L236
$$ 1490 -1311 -128 1432 -1373 512 834 -725 1349 -393 -44 585 -1238 1105 148 -1833 1403
1737A403j364r43K784k628Q41J045k274J523l34r22J965k294J395Q66k549K408
$$ 1403 39 -904 1880 -748 93 1138 -1136 387 53 -869 1096 -1198 197 1063 -1486 922
1753I22l2j755J763j151m8P89k134K411k93k019K594j125q52K551k270O00J071
$$ 922 890 -865 898 -253 -301 488 -1646 765 472 -1547 1047 -78 -930 1621 -649 -49 1022
1770A022j609J168r30j24J474k409J081J536l199J902R72j639J868j124m94J832
$$ 1022 -587 581 -349 -473 1001 -1408 -327 1209 -1990 -88 884 -755 1113 -11 -505 1327
1786A327k463J498J3j832K286j095p34K327k068N99J178j721J818r74r18K425
$$ 1327 -1136 362 375 -1457 829 -266 -1000 1327 -741 -142 1036 -685 1133 159 -759 1666
1802A666k264l4J759k417J485J44r47J607q69o37J866k042J115P0j454K084j328
$$ 1666 -598 -632 1127 -1290 195 339 -608 999 130 -507 1359 -683 432 502 -952 1132 -196
1819a96q02J969j708L12J611k187J873m93j336K069j655J43J601k350J437M2j781
$$ -196 -998 971 -737 -425 1186 -1001 872 379 -957 1112 -543 -400 1201 -1149 288 330 -1451
1836a451K574j051o79J769j556N33M92j667J822q21j006J643j368N09J157j975
$$ -1451 1123 72 -607 1162 -394 139 631 -1036 786 -35 -1041 602 -766 -257 900 -1075
1852a075J588K69j646J815j334K96R33j949J458L36k195K536q45j074J926j453
$$ -1075 513 782 -864 951 -383 -87 846 -1103 355 691 -1504 1032 187 -887 1039 -414
1868d14L20J174j644R84o41n82J678j911O82J311k027J200K25j142J967j479k0
$$ -414 -94 1080 -564 420 -221 -803 875 -1036 -354 957 -1070 130 355 -787 1180 -299 -319
1885c19J647k316O36Q61j483J446o62o21J708j610R47N11j857J842m68j249J958
$$ -319 1328 -988 -352 509 -974 472 -190 -811 897 -713 234 745 -1112 730 262 -987 971
1902I71j186n92J270j451J543n01j182K453j182n83J292j335P74J44j403J855
$$ 971 -215 -807 463 -988 555 54 -1128 1325 143 -440 852 -483 291 435 -968 887
1918H87j438o27K182j698N78J061k012J625K16j779J695j137L02N72j406J500
$$ 887 -551 -1178 1004 -694 -116 945 -1067 558 774 -1005 690 -447 -145 427 -979 521
1934E21O6k170K173l74p04J174j122Q35K60j948K070q58j182J950j333K49J213
$$ 521 587 -1583 590 216 -488 686 -436 399 659 -1289 781 -77 -1259 691 -642 -393 820
1951H20j352R64j39q99J477j055m91J756j887N05J016j076P91j185L65J641j730
$$ 820 -532 432 293 -606 871 -184 -675 1081 -806 -301 715 -361 430 -755 -390 1251 -479
1968d79J51J262j738J117m62m60J369j711N83J419k025J134L78j185J447r77l74
$$ -479 -328 934 -804 313 -149 -609 760 -951 -368 1051 -974 160 538 -647 800 -177 -551
1985e51J007p63O28J71j623K129j247p44K173j105k83R03r98J003o96r52J845
$$ -551 456 -307 321 492 -1131 998 -249 -993 1180 75 -208 695 -303 700 4 -948 897
2002H97j562j79J888j794P95j06l93J378q95k32Q64j275J026M21k126J886L2j435
$$ 897 -665 -844 1044 -750 45 -61 -454 924 29 -203 661 -614 412 833 -1293 593 625 -810
2020h10J310m38j93L63r47J372m60j035K056j363n2O57j249Q25J23r18J588n27
$$ -810 500 62 -131 232 -715 657 197 -838 1218 -145 -197 460 -789 36 159 -759 829 302
2038C02o72J170r35K18O98j282P29l55l65J221j407P23O81j512J190N33j346P79
$$ 302 -370 800 -135 83 781 -501 228 -127 -492 729 -678 45 726 -786 404 937 -409 370
2056C70p08L41O21j337N81M71j222J099m0l60J071j080M24O48j707J480m37j390
$$ 370 -338 3 624 -713 -132 339 -883 216 176 -184 887 -193 231 879 -828 652 215 -1175
2074a175J937j117p27J406q02K42M26m34J019j189P3J278j614N05P36j338J203
$$ -1175 762 -355 -1082 324 -478 -236 190 -244 775 -414 -341 937 -677 -172 564 -774 429
2091D29k56p29J289j099L92N67j201R93k88r64J623r67j08N35p15Q78m06q88J742
$$ 429 173 -556 733 -366 26 593 -608 385 97 -867 756 -211 -319 216 -499 379 -27 -915 827
2110H27r30l31J303j286K47O90j263R58J12p84P80q28Q03N9r07J036j83q25J009
$$ 827 -103 -434 869 -417 -170 520 -743 215 327 -457 323 -505 298 357 -550 486 303 -522 487
2129D87q10J06O93j393N04R61j174R61n35L42N60r91J96Q23j399J081k66p92J189
$$ 487 -323 -217 476 -917 -413 548 -626 335 -200 142 702 -289 -93 730 -669 412 146 -646 543
2148E43q28K80O72j517J076K35q52J066q65l29P66m83j48K78m7M39l41m02J105
$$ 543 -285 -5 667 -850 226 461 -391 675 -190 -519 247 -236 -384 -106 -153 286 -55 -457 648
2167F48j236K50J112j361N05N20p79O20l75N8M78p59J046p83p45J313j94o20J112
$$ 648 -588 -338 774 -587 -82 438 -341 279 -96 -38 440 -319 727 -56 -801 512 318 -302 810
2186H10j006J20O79j228J006n70l07J155j137M38O38r57O50K55r11Q04n51rP32
$$ 810 -196 -76 603 -625 381 -189 -496 659 -478 -40 598 -359 291 546 -365 439 -112 -121 611
2205F11j005O04M7j081J697r12n50J325r21j1P20j126L36K59l32Q12p52J61J023
$$ 611 -394 210 257 -824 873 -39 -589 736 -185 -196 524 -602 -266 -7 -339 473 -279 -118 905
2224I05j602J019K78j274Q95j32o02R27p91L79M49j317J465n62m19P20o60J13
$$ 905 -697 322 600 -674 221 89 -513 414 -377 2 451 -866 599 37 -382 338 -322 -209
2242b09Q13r69N50k54n40J187j143L29R62j606J035L03q49Q91n28j07M80q62Q22
$$ -209 604 -365 185 -69 -609 578 -565 -236 726 -880 155 458 -391 500 -28 -135 345 -517 305
2261C05k12n68J375p45n54J175l96o13R82j075M14j57q41J340o97j4N52p23L51
$$ 305 93 -475 900 155 -399 776 380 -233 749 -326 88 -69 -910 430 -267 -281 271 -452 -101
2280a01Q57j308J020m20Q0L90r91M35N63j209Q58L4r79J439q31l6Q04q57J72O0
$$ -101 756 -552 468 48 128 518 -473 -38 525 -684 174 208 -771 668 -163 -199 605 -252 -80 -20
2300b0l68P28q70K49O26o25M64J23r13J007J22p86M35m68L61K02j119J355l37
$$ -20 -388 340 -530 -281 345 -280 184 307 -606 401 523 -263 172 -296 65 267 -852 503 166
2319A66o86J399r60J50M48p13M25p6n61P09n83Q2N57n43N2N68r80N59K81p03J017
$$ 166 -520 879 -81 69 517 -196 229 153 -408 301 -282 -200 357 -186 -134 434 -546 13 294 -409 608
2340F08r76K39L72q06P51m04l56R61l35m84Q79p90M23K52r11Q50k40k43P06j193
$$ 608 -368 -129 243 -563 188 -216 -572 389 54 -430 449 -341 82 334 -577 273 33 -210 496 -697
2360f97L13O59q49N70K6m06Q41l95j9L31p34N24J57j024J123m39m17Q68n08j59
$$ -697 -384 275 -574 -4 22 -384 457 62 43 374 -360 164 321 -703 420 -19 -436 432 -76 -235
2380b35L36j99M21k18j97K11k99K28N94j179M70K7j64M46m48J96O4p44R84j65
$$ -235 101 -98 323 105 -92 119 -180 48 642 -537 -67 -40 -204 242 -206 -10 54 -690 294 129
2400A29n54Q22p76N8Q96j043O71J76q06P20q9m85O27m70O1Q09j159N13l3m11O69
$$ 129 -425 397 -379 -321 575 -468 203 379 -427 293 204 -281 346 -124 -63 746 -413 100 67 -344 325
2421C25k31L6K28o78O80j26p90J012l92n32Q45m16j39N38n86L62m3l15M10m16
$$ 325 94 130 358 -320 360 234 -556 456 64 -468 377 -39 -178 360 -226 136 93 -222 188 -228
2441b28k28O37o69K87J56j09K83N8n67P47p22M36K98o66M58J04p29M41l45PK39
$$ -228 -456 181 -488 -201 -45 -154 129 187 -380 367 -355 81 379 -287 171 275 -454 -13 -358 -351 -112
2462a12j91N09k71k73P44m01M4L80q97O68n6l85j05M33m71J007q13M33R9o94O63
$$ -112 -303 206 -65 -338 406 5 49 429 -468 200 144 -241 -346 87 -384 623 -190 243 342 -352 311
2483C11l04j83N90p00J36L57m59M01r9o60R75l74J61M29q33L05K68r23P71j31
$$ 311 7 -176 414 -286 -150 207 -252 149 50 -610 365 -9 152 581 -252 53 321 -602 169 38
2503C8j88L82l07J72J15k37J60J25m85N40n26k8O67o31j9M69q91J007n41N4O28
$$ 38 -150 232 -75 97 212 -25 135 260 -225 315 -211 -239 428 -203 -222 247 -644 363 -178 -124 504
2524E04o78J85L72q38P09q3p36P80n30o7Q53o71L38K4m56P84l03l84O04m59m3
$$ 504 -174 11 383 -455 254 171 -565 215 -315 -382 471 -200 138 162 -294 490 187 -197 407 -52 -95
2545i5m5k82O05j22j56O06q03NO92p63P35r5l13L07n04L25K88r85R50m12j90Q83
$$ -95 -140 -422 183 61 -95 511 -292 -287 405 -358 377 282 -31 276 -228 97 385 -600 350 -62 -252 631
2567F31o99l61Q31l71j45R7n24O76j91k93O00j84n7L51o04M35m7k04R0k11J66
$$ 631 -68 -429 402 31 -114 -17 -541 135 -56 -349 251 67 10 361 -243 192 145 -59 31 -180 -14
2588a4J72o42N08J71k96M38j46k66M04p96L75K80m54M19j33j14J19k31N8N12m45
$$ -14 158 -484 24 195 -101 337 191 -75 329 -467 -92 188 -266 153 20 -94 25 -206 -148 364 -81
2609h1M13P3q21O30j58J6jn01J37K73k03K40l6k18N05n24J13M77l28j3O22j042
$$ -81 332 405 -416 214 56 72 71 -430 -293 -20 -223 17 -19 -237 268 -256 -143 334 6 -7 615 -427
2631d27N87l19j52P97r63R59l89n57R47m75k6K55n37K54j43l62J084q09P7L97
$$ -427 160 -159 -311 486 -477 482 93 -464 483 8 -18 237 -300 -46 -189 -551 533 -276 -199 198
2651A98k71L10j09k34O10n79m04O73k83k67O12n66L51K31j91L55m63j49L76k34
$$ 198 -73 237 128 -106 504 -75 -479 194 -89 -356 256 -310 41 272 81 436 -27 -176 200 -34
2671c4j2Q6l04P4L0J84O2J27j77K91n83M48K9l75L25j7r2j8k91N45K2k58J70l15
$$ -34 -46 40 -264 -190 -160 24 86 213 36 327 -256 192 221 -154 171 154 62 44 -247 298 320 62 232 -83
2695h3J50K82m03o4L93k84J33j56k25K83j32J29J71n26O17m13l8O26o15l80O30
$$ -83 67 349 -54 -118 275 -9 124 -32 -257 26 -106 23 194 -332 285 -128 -166 460 -155 -535 95
2716I5k44q5J92J3J89Kl80M40j78k21K32m30J24K13k39K67K7j48N40l60J81j38
$$ 95 -149 -234 -42 -29 160 162 -218 222 44 -177 55 -375 -251 -38 -277 -10 17 -131 409 49 230 92
2738I2n06O52k62l04O38n83N3M42n73P60m52l51O51m34J86J76m62J65K07l35M24
$$ 92 -414 238 -24 -328 310 -273 -220 222 -351 409 -43 -394 257 -177 9 185 -277 -112 95 -240 184
2759A84l90J77J70m10P54k95k26J88K50k15l4k7j10M17q55P50k74k94K11m9l48
$$ 184 -206 -29 141 -269 485 190 -36 152 402 187 153 126 16 433 -422 328 54 -240 -29 -78 -426
2780d26P95n90K28L56o43L59j12J49J07k10n8L34m81L31J31o03L35K16n21M87
$$ -426 369 -221 7 363 -280 79 -33 116 223 13 -45 289 -192 139 270 -333 2 218 -303 184
2800A84m50M3L59l75Q6Q7q7O77n54j8M47l53n9M1k10L76k00k05K93O4j64K33k16
$$ 184 -266 -223 136 -239 -153 -66 -153 524 -30 -48 399 46 -13 28 -182 194 -6 -211 82 146 -18 215 -1
2823aL77k83j25N4k79M03L33o46J71J51k41M11k93j57K41l85J49L39j31M67n11
$$ -1 376 93 -32 22 -257 146 479 -167 4 155 -86 325 32 -125 116 -269 -120 219 88 555 44
2844D4P6R6m91K79J64l89J97j27M5N12m88K0R1K09J06k03l88J38l6J70K54m00
$$ 44 120 216 -275 4 168 -221 -24 -151 -106 406 -82 -62 29 238 344 141 -247 -109 -145 25 279 -121
2866a21L11J48p16M09kk68L32m75Q47j65m84P5J07j12K77l24J27K86m90K59k11
$$ -121 190 338 -378 31 29 -239 93 -382 465 300 -184 -109 -2 -114 163 -161 -34 252 -238 21 -190
2887a90P5L04k08m7K83l90J9L20k15nK89j67O9l13K38r9l66O67j90l57O4J70k2
$$ -190 -115 189 -19 -66 217 -173 -154 166 -49 -54 235 68 137 -176 62 -37 -403 264 74 -283 -219 -49 -71
2910g1K61l06K70l45l10O81j55k72L65j61J17m16j0P08l52J88J86l01J83l22l64
$$ -71 190 -116 154 -191 -501 180 25 -247 118 -43 74 -342 -352 356 4 192 378 77 260 -62 -426
2931d26N60qn88N89k55L82r9j55J44l19K0K84k76L1O30n80J81K74l62L7J2k11
$$ -426 134 126 -462 127 -128 254 155 0 144 -175 -155 129 -147 -116 514 -66 115 389 27 64 76 -135
2953a35K6R8LJ51p0J93k98l05J022p31m09P09J39m13K36m09N28o90q4P21j96k19
$$ -135 -109 -11 -8 143 73 266 -32 -337 685 -46 -455 254 393 -20 216 -193 335 -355 -439 282 86 -133
2975a33J53J88j4J02o68K99J48k00L69l30N6M29q24J59L48l00L04m67M05J64j11
$$ -133 20 208 194 296 -372 -73 75 -125 244 -86 -30 399 -425 -266 82 -218 86 -381 24 188 77
2996G7R7l85J7L43j99j24P0l9L71n33q3K78J86J28o7j37J67j23k44M50l60q7K03
$$ 77 174 -211 -194 149 -50 -174 -104 -143 228 -305 -388 -110 76 204 137 0 167 44 -200 250 -110 -197 6
3019Fk11K31J33j08k6l25K39M21m29O1K77n84jM33l14M07k39rJ14m4Mm0k39K76
$$ 6 -205 26 159 51 25 -300 -61 360 -69 -8 269 -315 -316 117 -197 210 -29 -38 76 32 36 -4 -243 33
3043C3L50n27L72k21R2N8l37K42k27l02O12j84q9P7R3j05K89n83M58j48J99j26
$$ 33 383 -144 228 7 99 157 -180 62 -165 -467 145 -39 -128 -51 42 -63 226 -357 101 -47 152 26
3065B6k17M96j0n93M79M3m28L50m17N40j26k31J60J06j42K37o65K05M11m14O1
$$ 26 -191 305 295 -298 181 224 -204 146 -271 269 143 -88 72 178 36 273 -392 -187 224 -190 -129
3086a29r8J00K35k29k10P56r7m87L52k84K57J03j03P1k42j67K16l06L15R7NQ3
$$ -129 -227 -127 108 -121 -331 425 328 -159 193 -91 166 269 166 237 -5 -172 44 -262 53 150 155 238
3108B38l52J70n2k88M72k4n02L23J1j8K7lK39m3k54J29r3j07L04l64m3K09o00
$$ 238 -114 56 4 -284 188 164 -338 -15 -4 -22 5 2 241 198 -56 73 -20 -127 177 -187 -230 -21 -621
3131f21P21J52p85O19K8j84J95K1m04j8J65K77J00l53J79m43K78L41n31M49n04
$$ -621 100 252 -533 86 114 -70 125 146 -258 -276 -111 166 266 -87 92 -351 -73 268 -263 186 -318
3152c18J63M84l45k15Q06j033M25K09k44K38l58L8q2L28m6L50o03lL95k27j44
$$ -318 -155 329 -16 -231 575 -458 -33 176 -68 170 -188 -150 -232 96 50 400 -203 -206 189 -38 -182
3173a82J17k17N02n78M29K22m52L38l72K84J23k12J15p4j20R8J65n21N05n97L31
$$ -182 -65 -282 220 -358 71 293 -159 179 -193 91 214 2 117 43 -77 21 186 -335 170 -427 -96
3194i6L34j65j13L86l86n1L12m71O13n52J52P0l07M40j08j46K31k19M0M13o32
$$ -96 238 73 -40 346 -40 -91 221 -250 363 -189 -37 33 -274 166 58 -88 143 -76 -36 377 -255
3215b55M48l47q7L45k85q9N50o07M71J50o89P10n40J35K14k63Q6jl56P34j28k37
$$ -255 193 -154 -241 104 -181 -270 280 -327 144 294 -395 315 -225 -90 124 -139 -53 -54 -410 324 196 -41
3237d1L38n53J64J85l19K13O5k16K26j14l0M60o54J88N32n42L82l09j84N07k62
$$ -41 297 -256 -92 93 -226 -13 52 -164 62 -52 -82 378 -276 -88 444 -98 284 -25 -209 298 36
3258C6j08J13l76K82L24o13N64j21p5M5l67L92J71n01L39j36r7K10j04j11O7l4
$$ 36 -72 41 -335 -53 271 -342 222 101 26 71 -296 96 267 -234 105 -31 -128 82 -22 -133 -66 -100
3280a00K98j60j5j12J81j33k26K96j52k64L67J12j62J28J17r8O1R2k51j23M21
$$ -100 198 38 23 -89 92 -41 -267 29 -123 -387 -20 92 -70 58 175 77 138 230 -21 -144 277
3301B77j96Qk13O8L79n93P58m63l9K08o58J74M98n34J60j21L9N27k09l8O35o15
$$ 277 81 89 -124 -56 323 -270 488 25 -14 194 -464 -290 208 -326 -166 -287 -248 279 70 32 667 52
3323E2J4M24m86J72N2m44K49j33l92J001p01K76j93j96N14J23m21L80m88J61J19
$$ 52 66 490 4 176 228 -216 33 -100 -492 509 -192 84 -109 -305 209 332 -89 291 -197 -36 83
3344H3j91K09m80M62j2j95J10j01k49N97m13J83P3m94K07M06m25R9K34q1R9l39
$$ 83 -108 101 -379 83 71 -124 -14 -115 -364 233 -180 3 76 -418 -211 195 -230 -131 103 22 121 -218
3366b18K76j35jJ11R0k41M62l02o4Q8J66k19J51m51K82l09N5P07p21J00J81m90
$$ -218 58 -77 -78 33 123 -118 344 42 -22 66 232 13 164 -287 -5 -314 -259 448 -273 -173 8 -482
3388d82M23n5k55O10l73k7L90l86L94N3k92M0K94k58l09M53k0j45m34N63k45J07
$$ -482 -59 -114 -369 241 -132 -159 231 -155 239 292 0 40 334 76 -233 220 200 55 -379 184 -61 46
3410D6j63M9%L26p34L33M98n52L38j11n6j58j02J25J97k30N62j51n92M68n91M03
$$ 46 -117 -68 -68 258 -476 -143 355 -197 141 30 -26 -184 -286 -161 36 -194 368 217 -375 93 -498 -95
3432i5K86l62L81k50m31Q11j66l57J44K15J17l65l26N39o4j52L5R6m4J79k09J99
$$ -95 191 -171 210 -40 -471 340 174 -183 -39 176 293 -72 -398 141 77 -75 -40 56 12 191 -18 181
3454A81l62L07J27j75l48K29j64K80r3j7M03k81m5K72l36k32L70k35N77l31m54
$$ 181 -181 126 253 78 -270 -41 -205 75 -18 -35 368 87 42 314 -22 -254 116 -119 458 127 -327
3475c27M20J01o28M96j35K38J31l73K08l74r8L79k70K75q1R9q4K94m91L25l90
$$ -327 93 194 -434 62 -73 165 296 -77 131 -243 -341 38 -232 43 -38 61 -23 271 -220 105 -285
3496b85L03P0n30K12K49k46K87k29L45j39k41K97j48j60L08l32M62k5m58J2M75
$$ -285 18 88 -442 -230 19 -227 60 -169 176 37 -204 93 -55 -215 93 -239 223 198 -260 -248 227
3517B27k90r4J43Q1L38n73M48k21m35L83L32o47O41l63l64N41l24K75j62k79O88
$$ 227 -63 -157 -14 67 405 -168 280 59 -376 7 339 -308 333 -30 -394 147 -177 98 -64 -343 345
3538C45q7n36M38k88L03kj13k4m2l9J09l31M33l4j10J51M2l77M53n4n03L22Rl03
$$ 345 258 -278 160 -128 175 173 60 36 -6 -45 64 -267 166 132 22 173 215 -162 291 237 -266 56 65 -238
3562b38K32j52O25o05K85J36l48j38N12p74J33L10o6N5r6j0m7P0K7K35m94M89
$$ -238 -6 -158 467 -138 147 283 -65 -203 309 -465 -332 -22 -88 -33 -129 -139 -186 -116 -89 146 -348 141
3584A41k46L8M32l97K3K26m85L69O0j49N22o91J82L66l02j68K73k74L6n7J36J29
$$ 141 -105 -67 365 -32 -9 217 -268 101 161 12 534 -157 25 391 89 -79 194 -80 -44 -101 35 164
3606A64j20j42K80m32L88R4k11Pl92K29K61k67R2j86M45M2l90L91Q2o22L09Jj28
$$ 164 44 -98 182 -250 138 232 21 28 -364 -135 126 -141 -49 -235 210 252 -138 253 335 -287 22 23 -105
3629a05J94q1l52L67k39M30L0l99O56m15j86j01K05J40n2n49P74m25k17N95j63
$$ -105 89 8 -344 23 -216 214 244 -155 501 86 -100 -201 4 144 92 -457 317 -108 -325 270 107
3650A07q1J11m61J41L37l47M65o3n87M70kk09M38n62K67m19M10L43l68l4K08o87
$$ 107 26 137 -324 -183 154 -193 272 209 -378 92 90 -119 319 -243 24 -395 15 358 -10 -44 164 -523
3672e23M26K88n26N04k09J00j4k1O2K09m80K59k3k51K55j79O56o44L9K42l08k1
$$ -523 -97 191 -335 169 -40 60 46 25 87 296 -184 75 52 -199 56 -123 533 -111 -72 170 -138 -159
3694a59L19l5lj22p8j03L51k51K75j85J9L37l15J90O4n15J90k27K02M78o41M37
$$ -159 160 125 122 0 -78 -181 170 -81 194 9 28 365 50 240 304 -211 -21 -248 -46 432 -209 228
3716B28j38l0N3j90r0N72l28J79o2r6M2l09K9k0J16O3L24m89J75j45K16k12j64
$$ 228 90 60 113 -77 -167 405 77 256 194 98 140 -169 -140 -160 -44 19 343 -146 29 -116 100 -112 -276
3739b76K78L21p11N72q9l89M70k98J9J35j61L85J69q51O19k15p3L89n35q6L42
$$ -276 2 323 -388 184 95 -294 176 -122 -103 32 -129 256 425 -426 193 -22 -95 294 -241 -327 15
3760A5k76K22j20K87J64l00l52P54p08M89j64O2K09m28k08M59m33K30N94o17k47
$$ 15 -261 -39 -159 128 292 -8 -360 394 -314 175 11 73 282 -146 -354 105 -328 -98 496 -121 -368
3781c68M23R3p5l89K67M93l96j4K44l21J47K94k34J84n67oM39k45M26l46p08O36
$$ -368 55 148 73 -316 -49 444 48 34 278 -43 104 398 164 348 -219 -225 214 -31 395 49 -659 -23
3803b3q6r6K83j02Q4k24m3L51l03j12M61k39L5Q2n38N72J12k13L58m22Q7K89m62
$$ -23 -109 -205 78 -24 60 -164 -207 144 -159 -271 190 -49 -14 68 -470 102 214 1 359 -63 24 313 -149
3826a49O2L08l89R9L8O5K5l1L64m5k98J88j19k9Pk47K89j17k19M24j18l96J20
$$ -149 -87 221 -168 -69 -31 34 59 28 392 347 49 237 118 89 96 -151 138 21 -198 226 108 -288 -168
3849a68L07k80K1O5J95l2k64K72j4r7K69l74PL81p05N75j73l84O42j81j14K51
$$ -168 139 -141 -120 -55 140 108 -156 116 102 5 274 -100 -93 288 -417 158 -15 -399 243 62 -52 199
3871A99n85L51M7k44O29j49k57p3j12K0L80n04J75J42P5K12o35K35n0J50K87p83
$$ 199 -386 -35 12 -232 397 248 -9 -82 -194 -174 206 -298 -123 19 94 306 -329 -94 -144 6 293 -490
3893d90K67M40m19J81J24m80L12J49j92K66l5j10k9o4M18k25R0O2k93j70L57p2
$$ -490 -223 217 -202 -21 103 -377 -65 84 -108 158 123 13 -16 -80 338 113 203 265 -28 -198 159 87
3915H7j94M21o23M24m1l70M80k81L23O6m88O11m32p2L8J31j42qj45L13J73m37
$$ 87 -107 314 -309 115 74 -296 184 -97 226 292 -196 415 -17 -89 -51 80 -62 -70 -215 98 271 -166
3937a66K32l22M39o8j48J26J37n13K53o1l65P52k28j56L76m06L77n66J40M60p01
$$ -166 66 -256 183 115 -33 93 230 -283 -30 -91 -456 296 68 -88 288 -118 259 -307 -167 293 -408
3958d08J87K87j83K29j48k8L40k45j25K89m57K9N54n40K16L6m69N94k13Q0R4n07
$$ -408 -221 66 -117 112 -36 -64 276 31 -94 195 -262 -233 321 -219 -3 33 -436 158 -55 25 119 -388
3980c88N68l56P9m9L00n30L56J18k40N23m80M07k73j41M17m41o0J58P0J33l95
$$ -388 180 -176 -97 -146 154 -376 -20 98 -142 381 -99 308 35 -106 311 -130 -190 -32 38 171 -224
4001b24J8L27l41M36k90j04L61J50n16L54k6l02M77l76l13O51m97J02K90l54L92
$$ -224 -206 121 -220 216 -74 -178 183 333 -183 171 145 -157 320 -56 -369 282 -215 -113 177 -177 215
4022B15k54R6R3o19P53l24j66L08M4q1N0m24L04l6o82Q80p7m49P28p16J75L20
$$ 215 -39 57 150 -469 284 -40 -206 102 146 65 115 -309 -5 -41 -723 157 80 -369 359 -357 -182 138
4044A38l69K86ok17L67p4m16O72l05O3j08J5J69j72r9K16K97m93L52m45K4J19
$$ 138 -231 55 49 -168 199 125 -291 381 76 139 31 46 215 43 -56 160 457 -36 316 -129 -105 14
4066A4k18N61m06J77m2k54L36k06l61N06l53L43M15m50k5J09o45L05K36j23L11
$$ 14 -204 357 -49 128 86 -168 168 -38 -399 107 -246 97 512 62 37 146 -499 -194 42 -81 230
4087B30o02L84J3m08L81L06n39j0j32M23K77l20k90J04k67L95l70J56K49m3Q3
$$ 230 -372 12 25 -383 -2 304 -235 -245 -377 46 323 3 -287 -183 -450 -55 -425 -269 -20 -63 20
4108B0J47l43P3l0J53J64o18M4O12k35L83j43l81L31j31l2L86l92k26K38j91J12
$$ 20 167 -176 -103 -133 20 184 -434 -390 222 -13 370 227 -154 177 46 14 400 8 -218 20 -171 -59
4130e9k59M39M1k66K35l4k95M35l1o36O94l07k46K65j13M63l49L2K43l69J34j31
$$ -59 -318 121 162 -104 131 97 -198 237 206 -430 264 -43 -289 -24 -137 326 -23 9 252 -117 17 -114
4152a14O8M4M19n69P1j10l07N64k0J7N9l31L65j16l53Q82o64p9Q5r5K92J14n88
$$ -114 -46 -2 417 -152 -81 -191 -498 66 46 63 122 -209 156 40 -313 569 -95 -174 -89 -184 108 222 -366
4175c66N93j62J35k63r5J30j7L0j88K26j63K93l11N9N4k03M58r3m67K70j83L35
$$ -366 227 65 200 -63 -158 -28 -45 -15 -203 23 -140 153 -158 -99 -45 -248 210 117 -350 -80 -263 72
4197G2K83p04M61J15k50N1k08K51K57m64L38l19P6J1k71J20L34k54N5K12k54r8
$$ 72 355 -349 112 227 -23 28 -180 71 328 -136 202 -117 -41 -30 -301 -181 153 -101 -46 166 -88 -186
4219a86L23l33K82m14K94M55o63K02q5J13K82m84J46L50m44N06n6m65QK48J30
$$ -186 137 -196 86 -328 -34 421 -242 -40 -125 -12 270 -214 -68 282 -162 344 288 -177 -169 79 209
4240B09j46l2k38N56p40J26N23p17P05j64l41O24l77J30j39j94K45j3j25K60k59
$$ 209 63 31 -207 349 -391 -265 258 -459 246 82 -259 365 -12 118 -21 -215 30 17 -108 152 -107
4261a07k77O36l26N5J27l74J31L62l86M14l74m3O03o13L28l7l34K98k12N2L69
$$ -107 -384 252 -74 -19 108 -266 -135 227 -159 255 -119 -162 441 -172 156 119 -215 83 -129 -77 292
4282B92o35O89o40J79J58k04J01N00n72K56jk27L75j5j35k50j37M14J04n65L00
$$ 292 -343 346 -294 -115 43 -161 -60 440 -132 124 123 -104 271 256 121 -129 -266 148 252 -313 -13
4303a3K29l93L01j80J22k1k65L55J25n62N83m67k3O7j41M88j2l75O47o88L93P7
$$ -13 216 -177 124 -56 66 45 -220 135 260 -302 281 -186 -209 -142 -283 205 193 -182 465 -223 170 247
4325B47j86M5m1J2L8K96n40J29J07o0j83K04l0K09k13j97N6ML64k93p0N46n37
$$ 247 61 106 65 77 115 411 -129 0 107 47 -136 68 38 247 34 -163 -107 -103 261 -32 -102 444 -93
4348i3L16l75n4M60j59M0r5j73K91P0n13M78k79J19n8m4Q1j60l74P06j79o8L23
$$ -93 223 -152 -206 254 95 135 40 -133 158 228 -285 193 -86 33 -25 -69 12 -148 -522 184 5 -63 260
4371B60n85L31j30j7L10n7j10R6k57L38K9n47N4L46j60J31j12J15K70p07M57K7
$$ 260 -325 6 -124 -141 169 112 2 98 -159 179 208 -339 -285 61 -99 32 -80 35 305 -402 55 82
4393H2m49N17l19J09L08l65J34l9rn1k26L07J94l26k31O52n08K39k1k69N31j85
$$ 82 -367 150 -169 -60 248 -117 17 -22 -31 -82 -308 -1 193 -133 -364 288 -220 19 -2 -271 260 75
4415G5j73J76j0M45n37J7J79j03k03N01k69j85K47l63k1J11k0O34o90K18o1k22
$$ 75 -98 78 68 513 -24 -7 172 69 -134 367 98 -87 160 -203 -224 -113 -133 501 -189 29 -32 -254
4437b54K03K4j74K60m2PK56m11M17j13j86M53n13j1J13rM0K61m78j7M46n20M67
$$ -254 -51 -27 -201 59 17 24 280 -131 286 173 -13 440 -73 -84 29 20 60 321 -157 -174 272 -248 219
4460B19j77K9J54l36p7N06k92J89l00k0R9L5j47P7j49L74m13K25L9m71M17J01
$$ 219 42 71 225 -111 -188 318 26 215 -85 -105 -6 29 -118 -41 -190 184 -229 -4 35 -436 -19 82
4482H2k44J81ml25N68k60K0J48l07O4P33p19R2N2Pk7k71p3N17n95M69L31n20Q2
$$ 82 -162 19 15 -310 258 -2 18 166 -141 -77 656 -63 29 81 88 61 -210 -283 234 -361 108 439 -81 1
4506AR0N2k33k09M15j53QO11q15J79K75l26k23N26n00M71L8m13J85m06M38J38
$$ 1 91 143 -90 -299 116 -37 -29 582 -233 -54 221 -105 -328 198 -302 169 207 -206 -21 -427 11 149
4528A49k63N4K42j6j97l53J52N56k75N6R0k09j80J27M2Q5j37J82n9m68M97l22
$$ 149 -114 -60 182 166 -31 -384 -232 324 49 105 195 -14 -194 -67 -25 60 -77 105 46 -422 75 -247
4550b47K22M19n93L55J53m24J36j26l0K98l28M01p6j55j04K80n73M77Q0l00M84
$$ -247 -25 394 -199 156 309 -115 21 -105 -135 163 -165 236 160 5 -99 181 -392 85 165 -135 349
4571C49o01L83j22k4K12m9r7K07m63K97o0q6L43j15l77%J97k33M79n17K74k15
$$ 349 -252 131 9 -15 197 148 51 258 -205 92 32 -54 289 174 -203 -203 -6 -239 240 -277 -3 -218
4593b18K8O27o71J15K86l33K19J8j35o2M81m84M09k07K05k65k56L42K9l63N18
$$ -218 -190 437 -234 -119 167 -166 53 71 -64 -126 355 -129 280 73 278 13 -243 99 128 -235 283
4614B83k40J22n3l00M02J14n56K65k13j00P95p58J88K56m50J80j38P2N85n07Q5
$$ 283 43 165 112 -188 214 328 -228 37 -176 -276 519 -239 -51 205 -245 -65 -203 -131 454 -53 32
4635C2J06j12J76J76j92k3k71J74J16n92M86K1k64r8L64j67N1K4QR9k67J64K89
$$ 32 138 26 202 378 186 163 -108 66 182 -410 76 97 -167 -265 99 -68 -17 7 15 114 -153 11 300
4658C00m88J22j10O9L26n74K85J62j21o7Pn2K79j49J90m4q2J11k37J04L19n24
$$ 300 -188 -66 -176 -107 219 -355 -70 92 -29 -96 -89 -141 138 -11 179 135 53 164 -73 31 350 -174
4680a74K09n8l3p4K20k56J82j14l4K67j10p7J66k90M15j04m69N86l56j2K2j05
$$ -174 35 -23 -56 -130 90 -166 16 -98 -132 135 25 -52 114 -176 239 135 -334 252 -104 -116 -94 -199
4702a99J91q1l2M35l04k15R8o2L49o4j92rk2o6K29r3j10L66p42M10%K95j85l5
$$ -199 -8 -89 -121 314 10 -205 -107 -169 180 116 -76 -85 -107 -173 56 -37 -147 219 -523 -113 -113 182 -3 -38
4726c8k60M98l18P5J55r9M38l21o0L18j73qk08K79n7o9k51M11l06q0K43J50j01
$$ -38 -298 200 -118 -43 112 13 451 130 70 388 215 207 -1 278 221 152 -99 312 6 -74 169 319 218
4749B18k48J79J19k13m65O72l33k48Q90p59K78k18K21J41l39O6r6p4M19j74p3
$$ 218 -30 149 268 55 -410 262 -71 -319 571 -188 90 -128 93 234 -105 -39 -135 -209 210 36 -37
4770c7J79l14M33j65j62K28m0r2J13j22J6n22N21l6J4J95n8l26O8K04l84M57o5
$$ -37 142 -172 261 96 -66 162 122 30 143 21 37 -485 36 0 14 209 151 -175 -107 97 -287 170 105
4793A05k83k9M59l40K22l26J8N81n10p9J95jL16k53k9M32o74K59K33k88j04p8
$$ 105 -178 -207 252 -88 134 -192 -174 407 -103 -182 13 12 328 75 46 478 -196 63 296 8 -96 -174
4815a74J57K51l39O9K38l26L55n21rM40j70N2J00j24R1Q3n61Q85m94PJ92k65J5
$$ -174 -17 234 -105 -36 202 -124 231 -290 -299 141 -29 23 123 -1 90 173 -388 497 3 10 202 -63 -48
4838d8j0K05n0l47K25L17n44K79J22k26J35N3m27J76J1MJ22j66K75r0l01N82l91
$$ -48 -58 147 97 -250 -25 292 -252 27 149 -77 58 111 -316 -140 -129 -125 -3 -169 106 16 -285 297 -94
4861i4K46K9n1k28K13j47L28p1m30K22m72J68O77n97L53p3j09J53l54M6L04m90
$$ -94 152 181 130 -98 115 -32 296 225 -205 17 -455 -287 390 -207 146 73 -36 117 -237 -191 113 -377
4883c77L56%j97M55l07J74q0o45O83L7N8j41J21r8K82n39K14J54m69L79J67m67
$$ -377 -21 -21 -218 237 -70 104 24 -621 62 99 157 16 137 39 321 -218 -4 150 -319 60 227 -240
4905b40K88m4J24L18l79j10k1o6Q4P7l60L66M5N6K64o96M03o2j87K62m55N80P3
$$ -240 48 4 128 446 67 -43 -64 -130 -46 31 -329 37 82 138 402 -294 109 47 -140 122 -333 247 320
4928C20n52K70j08m40K70K08j01K78l15J4L10l51O9K3J82J68k53j81K95p6M7l18
$$ 320 -232 38 -70 -510 -240 -32 -133 145 -170 -156 154 -197 -128 -105 77 245 -8 -189 106 30 77 -241
4950b41O0J06J67k7q8k50K99j24L3K61k98J46K29k77Q3K0n69M65l05j68L79J29
$$ -241 -181 -75 92 65 -23 -273 26 -98 -65 196 -102 44 273 -4 79 99 -470 -5 -310 -478 -99 30
4972C0J2P1j22J60l33n0O08m25pJ53j58J55Q5j21K0r2M5J09k71M4n9r5K51j36
$$ 30 42 113 -9 151 -182 -232 376 -49 -56 97 -61 94 179 58 78 -14 31 140 -131 -87 -146 -241 10 -126
4996a26j46K04L4J88k26o2L60j36j61L36k41l40J11p9K52J4k17q7L98j69J22o7
$$ -126 -272 -68 -34 154 -72 -134 226 90 -71 265 24 -316 -205 -284 -32 -18 -235 -322 76 -93 29 -38
5018c8K79k26k78M59j79k14M03n96N2M16j14K52l16K7M26k43m83N53n65K89K64
$$ -38 241 15 -263 196 17 -197 206 -390 -338 78 -36 216 -100 -73 353 110 -373 180 -385 -96 168
5039A68o03J87J44j37L86J57l76K30m35L36m3R0J41k54N8Q7j43r1j3q1K34j42
$$ 168 -435 -248 -104 -241 145 302 -74 156 -279 57 14 104 245 -9 49 136 -7 -98 -111 -192 42 -100
5061a00N6J57k6r6j87J28P03m56m21L08P6j87N7j92j62N61k32Q7k29j04M65l21
$$ -100 -44 113 87 -9 -196 -68 635 179 -242 66 142 -45 12 -180 -342 219 -13 74 -155 -259 206 -115
5083a15J80J60l92j00K89k14K35l28K69J85l57K13j7m9J47k70Q9K08j56J75J19
$$ -115 65 225 -167 -267 22 -192 43 -285 -16 169 -188 25 8 -41 106 -164 -75 133 -23 152 271
5104B71l11Km9J68R5r6j27N4j12K68j60l71L70M8j26M64m48L52k27l46L43r9k36
$$ 271 -40 -38 -87 81 176 80 -47 7 -105 163 3 -368 2 50 -76 388 -60 292 65 -281 62 -37 -273
5127b73M09k31J53N95o26L36m2j69K15l53m6K29n49L73j00j04N15n30K62O3k90
$$ -273 136 -95 58 653 27 363 321 152 367 14 -32 197 -352 21 -79 -183 332 -198 64 127 -163
5148a63R9J77k48N40p82J77Q2J52k83M57l89K52Jj30L63m37R8j48L27j10j59j40
$$ -163 -64 113 -135 405 -377 -200 -118 34 -249 208 -181 71 72 -58 305 -132 -34 -182 145 35 -124 -264
5170b64M88j43P4M2k46L15k2k45r7R7j7q8M0r5J68j34J56J23j66J08l69K75O7
$$ -264 224 81 155 197 -49 266 244 -1 -98 -1 -18 -106 -66 -161 7 -127 29 152 -14 94 -275 0 67
5193F7k89O22j03j11m61K56j4j1j0K06j86J49j62K29m05J67J4P1j51j03K63J2
$$ 67 -222 400 297 186 -275 -19 -33 -44 -54 152 -34 115 -47 182 -223 -56 -42 29 -122 -225 38 50
5215E0l0k10L33m69L84j21L49k43l74M97l44O17k69l35l32P54k44Q6j36Q9K42
$$ 50 20 -190 143 -326 58 -63 286 43 -331 166 -178 439 170 -165 -497 257 13 99 -37 52 294
5236B94l56M10m60K79n2K09l88L05j97p5K15l28J71j04m1J20n9k60R00n40l1J79
$$ 294 -62 348 -112 167 115 324 -64 241 44 -31 184 -144 27 -77 -118 2 -57 -317 583 43 12 191
5258A91l68J97J54k79M86m63l5K05m66M93rj38P7K7j51K50l24L46J70m39J48k18
$$ 191 -177 20 174 -105 381 -82 -117 88 -378 115 106 -32 45 72 -79 171 -153 193 363 -76 72 -146
5280a46k07M63k68n8L48j82L60k07Q0j51Pj48J69M9Ok00K02j68N1l10N18l67n9
$$ -146 -353 110 -158 -216 132 -50 310 103 183 32 39 -109 60 109 115 -85 117 -51 0 -310 208 -159 -218
5303b18L93p8j77n7k96J45J38Pn8R2J17n5n1M5k8k5J22k09K30J07j80J99j22m2
$$ -218 175 97 -80 -137 -433 -288 -150 -143 -201 -109 8 -47 -98 -53 -81 -106 16 -193 37 144 -36 163 41 -1
$$ [...]
8191F7
##END NTUPLES=NMR FID
##END=
