##TITLE=1H_Pr NCS-C
 CDCl3
 8 sc, 
 16.02.2022
##JCAMPDX= 6.0         $$ Bruker NMR JCAMP-DX V2.0
##DATA TYPE= NMR FID
##DATA CLASS= NTUPLES
##ORIGIN= UXNMR, Bruker Analytische Messtechnik GmbH
##OWNER= root
$$ XWIN-NMR		Version 3.5
$$ Wed Feb 16 13:32:14 2022 Russian Standard Time (UT+4h)  she@DPX200
##.OBSERVE FREQUENCY= 200.131346
##.OBSERVE NUCLEUS= ^1H
##.DELAY= (6, 6)
##.ACQUISITION MODE= SIMULTANEOUS
##.ACQUISITION SCHEME= undefined
##.AVERAGES= 8
##.DIGITISER RES= 18
##SPECTROMETER/DATA SYSTEM= spect
##.PULSE SEQUENCE= zg30
##.SOLVENT NAME= CDCl3
##.SHIFT REFERENCE= (INTERNAL, CDCl3, 0, 15.7039)
##AUDIT TRAIL= $$ (NUMBER, WHEN, WHO, WHERE, WHAT)
$$ ##TITLE= Audit trail, XWIN-NMR		Version 3.5
$$ ##JCAMPDX= 5.01
$$ ##ORIGIN= Bruker BioSpin GmbH
$$ ##OWNER= she
$$ F:/spectra/data/she/nmr/H-F/1/audita.txt
$$ ##AUDIT TRAIL=  $$ (NUMBER, WHEN, WHO, WHERE, WHAT)
(   1,<2022-02-16 13:30:44.95 +0400>,<she>,<DPX200>,
      <created by zg, POWCHK disabled, PULCHK disabled
       configuration hash MD5:
       00 E9 B6 7A A2 85 ED C7 34 08 36 98 17 FE 4E 26
       data hash MD5: 16K
       4E 32 8F DB AD CF 10 62 0C 4D 21 49 F5 0A 7C 21>)
$$ ##END=
$$ 
$$ hash MD5
$$ FC A2 F3 E1 7E 3E 68 E8 EA 2F 5C 55 4C 24 7E 33
##$RELAX= 
##$RELAX= 
##$RELAX= 
##$RELAX= 
##$RELAX= 
##$RELAX= 
$$ Bruker specific parameters
$$ --------------------------
##$DU= <F:/spectra>
##$EXPNO= 1
##$NAME= <H-F>
##$PROCNO= 1
##$TYPE= <nmr>
##$USER= <she>
##$AMP= (0..31)
100 100 100 100 100 100 100 100 100 100 100 100 100 100 100 100 100 100 
100 100 100 100 100 100 100 100 100 100 100 100 100 100 
##$AQSEQ= 0
##$AQ_mod= 1
##$AUNM= <au_zg>
##$AUTOPOS= <>
##$BF1= 200.13
##$BF2= 200.13
##$BF3= 200.13
##$BF4= 200.13
##$BF5= 200.13
##$BF6= 200.13
##$BF7= 200.13
##$BF8= 200.13
##$BYTORDA= 1
##$CFDGTYP= 0
##$CFRGTYP= 5
##$CHEMSTR= <none>
##$CNST= (0..31)
1 1 145 1 1 1 1 1 1 1 1 1 1 1 1 1 1 1 1 1 1 1 1 1 1 1 1 1 1 1 1 1 
##$CPDPRG= <>
##$CPDPRG1= <>
##$CPDPRG2= <>
##$CPDPRG3= <>
##$CPDPRG4= <mlev>
##$CPDPRG5= <mlev>
##$CPDPRG6= <mlev>
##$CPDPRG7= <mlev>
##$CPDPRG8= <mlev>
##$CPDPRGB= <>
##$CPDPRGT= <>
##$D= (0..31)
0 1.2 0 0 0 0 0 0 0 0.06 0 0.03 0 0 0 0 0.0002 0 0 0 0 0 0 0 0 0 0 0 0 
0 0 0 
##$DATE= 1645003844
##$DBL= (0..7)
120 120 120 120 120 120 120 120 
##$DBP= (0..7)
150 150 150 150 150 150 150 150 
##$DBP07= 0
##$DBPNAM0= <>
##$DBPNAM1= <>
##$DBPNAM2= <>
##$DBPNAM3= <>
##$DBPNAM4= <>
##$DBPNAM5= <>
##$DBPNAM6= <>
##$DBPNAM7= <>
##$DBPOAL= (0..7)
0.5 0.5 0.5 0.5 0.5 0.5 0.5 0.5 
##$DBPOFFS= (0..7)
0 0 0 0 0 0 0 0 
##$DE= 6
##$DECBNUC= <off>
##$DECIM= 32
##$DECNUC= <off>
##$DECSTAT= 4
##$DIGMOD= 1
##$DIGTYP= 9
##$DL= (0..7)
0 120 120 120 120 120 120 120 
##$DP= (0..7)
150 150 150 150 150 150 150 150 
##$DP07= 0
##$DPNAME0= <>
##$DPNAME1= <>
##$DPNAME2= <>
##$DPNAME3= <>
##$DPNAME4= <>
##$DPNAME5= <>
##$DPNAME6= <>
##$DPNAME7= <>
##$DPOAL= (0..7)
0.5 0.5 0.5 0.5 0.5 0.5 0.5 0.5 
##$DPOFFS= (0..7)
0 0 0 0 0 0 0 0 
##$DQDMODE= 0
##$DR= 18
##$DS= 0
##$DSLIST= <SSSSSSSSSSSSSSS>
$$ [...]
##$SUBNAM2= <"">
##$SUBNAM3= <"">
##$SUBNAM4= <"">
##$SUBNAM5= <"">
##$SUBNAM6= <"">
##$SUBNAM7= <"">
##$SUBNAM8= <"">
##$SUBNAM9= <"">
##$SW= 18.0517287032376
##$SWIBOX= (0..15)
0 0 2 0 0 0 0 0 0 0 0 0 0 0 0 0 
##$SW_h= 3612.71676300578
##$TD= 16384
##$TD0= 1
##$TE= 0
##$TE2= 300
##$TE3= 300
##$TEG= 300
##$TL= (0..7)
0 120 120 120 120 120 120 120 
##$TP= (0..7)
150 150 150 150 150 150 150 150 
##$TP07= 0
##$TPNAME0= <>
##$TPNAME1= <>
##$TPNAME2= <>
##$TPNAME3= <>
##$TPNAME4= <>
##$TPNAME5= <>
##$TPNAME6= <>
##$TPNAME7= <>
##$TPOAL= (0..7)
0.5 0.5 0.5 0.5 0.5 0.5 0.5 0.5 
##$TPOFFS= (0..7)
0 0 0 0 0 0 0 0 
##$TUNHIN= 0
##$TUNHOUT= 0
##$TUNXOUT= 0
##$USERA1= <user>
##$USERA2= <user>
##$USERA3= <user>
##$USERA4= <user>
##$USERA5= <user>
##$V9= 5
##$VALIST= <valist>
##$VCLIST= <CCCCCCCCCCCCCCC>
##$VD= 0
##$VDLIST= <DDDDDDDDDDDDDDD>
##$VPLIST= <PPPPPPPPPPPPPPP>
##$VTLIST= <TTTTTTTTTTTTTTT>
##$WBST= 1024
##$WBSW= 4
##$XGAIN= (0..3)
0 0 0 0 
##$XL= 0
##$YL= 0
##$YMAX_a= 100557
##$YMIN_a= -77343
##$ZGOPTNS= <>
##$ZL1= 120
##$ZL2= 120
##$ZL3= 120
##$ZL4= 120
##$ABSF1= 10
##$ABSF2= 0
##$ABSG= 5
##$ABSL= 3
##$ALPHA= 0
##$AQORDER= 0
##$ASSFAC= 0
##$ASSFACI= 0
##$ASSFACX= 0
##$ASSWID= 0
##$AUNMP= <proc_1d>
##$AZFE= 0.1
##$AZFW= 0.1
##$BCFW= 1
##$BC_mod= 2
##$BYTORDP= 1
##$COROFFS= 0
##$CY= 11.3945322036743
##$DATMOD= 1
##$DC= 2
##$DFILT= <>
##$DTYPP= 0
##$F1P= 2.36226072786647
##$F2P= -0.459571619588291
##$FCOR= 0.5
##$FTSIZE= 0
##$FT_mod= 4
##$GAMMA= 1
##$GB= 0.15
##$INTBC= 1
##$INTSCL= 1
##$ISEN= 128
##$LB= 0.24
##$LEV0= 0
##$LPBIN= 0
##$MAXI= 10000
##$MC2= 0
##$MEAN= 0
##$ME_mod= 0
##$MI= 1.114404
##$NCOEF= 0
##$NC_proc= 0
##$NLEV= 6
##$NOISF1= 3.799351
##$NOISF2= 2.8
##$NSP= 1
##$NTH_PI= 0
##$NZP= 0
##$OFFSET= 15.70392
##$PC= 1
##$PHC0= -16387.75
##$PHC1= 11.20078
##$PH_mod= 1
##$PKNL= yes
##$PPARMOD= 0
##$PSCAL= 0
##$PSIGN= 0
##$REVERSE= no
##$SF= 200.130013532006
##$SI= 16384
##$SIGF1= 3
##$SIGF2= 2
##$SINO= 400
##$SIOLD= 16384
##$SREGLST= <1H.CDCl3>
##$SSB= 0
##$STSI= 0
##$STSR= 0
##$SW_p= 3612.71676300578
##$SYMM= 0
##$S_DEV= 0
##$TDeff= 0
##$TDoff= 0
##$TI= <>
##$TILT= no
##$TM1= 0
##$TM2= 0
##$TOPLEV= 0
##$USERP1= <user>
##$USERP2= <user>
##$USERP3= <user>
##$USERP4= <user>
##$USERP5= <user>
##$WDW= 1
##$XDIM= 8192
##$YMAX_p= 0
##$YMIN_p= 0
$$ End of Bruker specific parameters
$$ ---------------------------------
##NTUPLES= NMR FID
##VAR_NAME=  TIME,          FID/REAL,        FID/IMAG
##SYMBOL=    X,             R,               I
##VAR_TYPE=  INDEPENDENT,   DEPENDENT,       DEPENDENT
##VAR_FORM=  AFFN,          ASDF,            ASDF
##VAR_DIM=   8192,          8192,            8192
##UNITS=     SECONDS,       ARBITRARY UNITS, ARBITRARY UNITS
##FACTOR=    0.0002768,     1,               1
##FIRST=     0,             0,               0
##LAST=      2.2672688,     0,               0
##MIN=       0,             -77343,          0
##MAX=       2.2672688,     100557,          0
$$ Real data points
##PAGE= N=1
##DATA TABLE= (X++(R..R)), XYDATA
0@%%%%%%%%%%%%%%%qJ6j6J6j6K4l2L2m0M8n6O4p2Q4r2J04j20J36j57J81k00K24
$$ 0 0 0 0 0 0 0 0 0 0 0 0 0 0 0 0 -8 8 -8 8 -8 16 -16 16 -24 24 -32 32 -40 44 -48 56 -64 72 -85 96 -104 120
37A20k56K88l20L52l92M37m83N34n89O50p17P90q71R59j058J168j287J422j574
$$ 120 -136 152 -168 184 -208 229 -254 280 -309 341 -376 414 -457 502 -556 612 -675 747 -827
56h27J746j943K171k440K762l153L644m282N142o370Q281j1673J9440o9862J4223
$$ -827 919 -1024 1147 -1293 1469 -1684 1960 -2322 2820 -3550 4731 -6942 12498 -57364 -43141
71d3141J34116o3893q4830J4869O7722j0343p647L692k1727j3190M1544K8926
$$ -43141 90975 27082 -57748 -42879 24843 14500 6853 10545 -11182 -24372 17172 46098
83D6098m1538m2921L8080L1546j8812k3488J1048M775j3538J3448J1414k6689
$$ 46098 4560 -38361 -281 31265 12453 -11035 13 4788 -8750 4698 16112 -10577
95a0577r111K4558P858l0089N329L0515k2551k7874L0429K9189l3319k5736M0782
$$ -10577 -19688 4870 12728 -17361 -12032 18483 -4068 -31942 -1513 27676 -5643 -31379 9403
108I403J5195l7472o245L5111N216l2551L126K5936r380j5396J0847R186j9072
$$ 9403 24598 -12874 -19119 15992 21208 -11343 -8217 17719 8339 -7057 3790 12976 -6096
121f096k723K8030p553l4049O543L5712m998l7112N190K5895n353j2417N935L796
$$ -6096 -8819 19211 11658 -22391 -15848 19864 14866 -22246 -17056 8839 3486 -8931 -2996 800
135H00j2533N289J7970r265j2319J0861R066j3558m372K2300J084k3881j276K2743
$$ 800 -11733 -6444 11526 2261 -10058 803 9869 -3689 -8061 14239 15323 -8558 -9834 12909
149A2909M419k2639m416J6043J302q314m37K230q389o72J5383j707j7357k003
$$ 12909 17328 -5311 -9727 6316 7618 -696 -1133 1097 -7292 -7964 7419 5712 -11645 -13648
163a3648J5244M588j1343n39N259l004l14P113L535q070l019O547J181P94K656
$$ -13648 1596 6184 -5159 -5698 -439 -3443 -3757 3356 6891 -1179 -4198 2349 3530 4324 6980
178F980l726q566L807J6050m335k0929r80K0666O993k0130j1264J2031R466m441
$$ 6980 3254 -5312 -1505 14545 10210 -10719 -11699 8967 15960 -4170 -15434 -3403 6063 1622
192A622o573J60m59M22P346O8q758j767J0135M745r062k644P637K894l704j711
$$ 1622 -4951 -4791 -5250 -4828 2518 2586 -6172 -7939 2196 6941 -2121 -4765 2872 5766 2062 351
208C51K509j049J63M144j994n656k37N427K01o093Q0L168j894l348J617L146l999
$$ 351 2860 1811 1974 6118 4124 -1532 -1769 3658 3859 -2234 -2154 1014 -880 -4228 -2611 535 -3464
225c464k115N412J260n707j781P267K942m956j032K286P48J054K879j169n626
$$ -3464 -5579 -167 1093 -4614 -6395 872 3814 -1142 -2174 112 860 1914 4793 3624 -2002
240b002K270O348j886o005J089N362k887n635K682L702l318m476L007L281m374
$$ -2002 268 6616 4730 -1275 -186 5176 2289 -3346 -664 3038 -280 -4756 -1749 1532 -2842
255b842k666L116K169j598k82J061k598N41O197Q61o019j372O605K137m491l32
$$ -2842 -5508 -2392 -223 -1821 -2103 -1042 -3640 -3099 3098 3959 -2060 -3432 3173 5310 819 487
271D87K742j19j705R76L46l190N13L738j826n696r1N593m73n237K47K893j197
$$ 487 3229 3110 1405 2381 2727 -463 50 3788 1962 -3734 -3825 1768 1295 -3942 -3695 -802 -1999
288a999k282K770K136l146n34L116L47j739J783K811k446j574L438J248k958o23
$$ -1999 -4281 -1511 625 -2521 -3055 61 408 -1331 452 3263 817 -757 2681 3929 971 348
304C48L735J59m597n85L167K98k730o56O98j834m41K156l23k893P5K911q63k394
$$ 348 4083 4242 -355 -940 2227 2525 -205 -861 -163 -1997 -2438 -282 -605 -3498 -3423 -512 -1375 -3769
322c769K089K409j352j400K179J295j588P55K390m17k100L80K116m81j151Q11
$$ -3769 -1680 729 -623 -2023 156 1451 -137 618 3008 2591 491 871 2987 2506 1355 2166
338B166j25k102n18J973k14k839j79J684q10k294M79J951l96q94R4j39J58J806
$$ 2166 2041 -61 -579 1394 1180 -1659 -1838 -154 -964 -3258 -2779 -828 -1224 -2118 -2024 -2163 -2005 -199
356a99J511j445j232J753J600m57m12J113L18j505m0J338Q9j331m44L99r28p63
$$ -199 1312 -133 -1365 388 1988 1531 1119 2232 2550 1045 1005 2343 2432 1101 657 1056 128 -635
374f35N00k09j173k74R29o83j591N36J766L56j017n52M15P48J563R82j050j204
$$ -635 -135 -344 -1517 -1791 -862 -1545 -3136 -2600 -834 -478 -1495 -2047 -1632 -884 679 1661 611 -593
392e93P95K200M65j270m92M44J81l5J14p33j329K60J040o46j968p20J068Q75m64
$$ -593 202 2402 2867 1597 1105 1549 1730 1695 1809 1076 -253 7 1047 401 -1567 -2287 -1219 -344 -808
411h08j427r41Q09J485O48o84p80L44J171Q59p7R4O95K01m99q1O29Q93j2j370
$$ -808 -2235 -3176 -2367 -882 -234 -918 -1698 -1354 -183 676 599 693 1388 1589 1090 1009 1638 2531 2519 1149
431A149j439Q14J918q99k802o88J861Q54j690j728R4J351Q73p99j351l78J167
$$ 1149 -290 524 2442 1543 -1259 -1947 -86 768 -922 -2650 -2556 -1205 -332 -1131 -2482 -2860 -1693
448a693K152J152j760k698J190M185J305k599j984J179J947M51r03j125l41L40
$$ -1693 459 1611 -149 -2847 -1657 2528 3833 1234 -750 429 2376 2827 1924 799 458 798
464G98M52L44j177k165j41K411O92l091j988J933K119p16j777j14J166Q87r9l6
$$ 798 1250 1594 417 -1748 -1889 522 1214 -1877 -3865 -1932 187 -529 -2306 -2420 -1254 -367 -466 -502
482e02Q56L85p74L3J253Q91j18p1p25j275P65K127r3k808j635J435K098o79l315
$$ -502 354 739 -35 -2 1251 2142 2024 1953 1228 -47 718 2845 2752 -56 -1691 -256 1842 1163 -2152
501b152j568K749K686j920l526L9K852J562q17j693o27J408K177Q46r96j687l53
$$ -2152 -3720 -971 1715 -205 -3731 -3692 -840 722 -95 -1788 -2415 -1007 1170 2016 1020 -667 -1020
518a020K324K694j029l270j5K591J80j906m89Q53k50r82k63K35l61r77k16J187
$$ -1020 1304 3998 2969 -301 -316 2275 2455 549 60 913 663 -319 -582 -347 -708 -1685 -1901 -714
536g14M94j598p81J609N86j106O39J750o89j818J140L023L75k644j633K090L017
$$ -714 -220 -1818 -2599 -990 -404 -1510 -871 879 190 -1628 -488 2535 2910 266 -1367 723 3740
553C740l93k912r04J126L81P9M26j511k416R90K918r81l785n16L298J993k075
$$ 3740 3347 435 -469 657 1038 1117 1543 32 -2384 -1394 1524 543 -3242 -3758 -460 1533 -542
570e42k923N28K902R46j423%Q00n12K1K008P92j969j009J568J368n67j173l53
$$ -542 -3465 -2937 -35 911 -512 -512 288 -224 -203 1805 2597 628 -381 1187 2555 1988 815 462
588D62L79j76q10Q5Q48q88j894L13J836o34k058J12J958N82j092q17L02J154P03
$$ 462 841 665 -145 -60 788 -100 -1994 -1681 155 -479 -2537 -2425 -467 115 -977 -1794 -1492 -338 365
607C65J20K27q4q56M46K111K65k031p09J544P07p37o98n21k53K45L61p67p12n6
$$ 365 485 712 628 -228 218 2329 2594 563 -146 1398 2105 1368 670 149 -104 141 502 -265 -977 -1033
627a033k0k9P3m77l82O50J046j66q27j69Q33J021K73l69K25M89m89k22J231P44
$$ -1033 -1053 -1082 -1009 -1486 -1868 -1218 -172 -338 -1165 -1334 -501 520 793 424 649 1138 649 427 1658 2402
647B402j228j006O74L40n29L6l62j204j47J233o9j617n27R13N80m21p85j0R58
$$ 2402 1174 168 842 1182 653 689 327 -877 -1024 209 140 -1477 -2004 -1091 -511 -932 -1717 -1727 -769
666g69R94j69p77l26Q72J420L91r26n97Q51N15k08%n9n05j06N53n91j165L28Q78
$$ -769 225 56 -721 -1047 -175 1245 1636 710 113 964 1479 1271 1271 1212 707 601 1154 563 -602 -274 604
687F04r83j069N06M45p36j74N64k19m18K84P82J57j12J07M45J48JN15M34n9k86
$$ 604 -379 -1448 -942 -497 -1233 -1407 -843 -1062 -1480 -1196 -414 -257 -369 -262 183 331 332 847 1281 1222 936
708I36J32j27k86N54L50j008q90N85K48r51k56N39l82r80K58N19k82k27M70J25
$$ 936 1068 941 655 1209 1559 551 -339 246 494 -457 -713 -174 -556 -1536 -1278 -759 -1041 -1268 -798 -673
728f73m14K57P95L15k43j3N15J52n6L41N35l00m66J74k0k43J21J92p49q19L43
$$ -673 -1087 -830 -35 280 37 24 539 691 635 976 1511 1211 745 919 899 656 777 969 220 -599 -256
749b56L58o94n20L42J66o04k13L81K63l1J31J43j21K59O14L87j61PL70J14r0J22
$$ -256 102 -592 -1112 -770 -604 -1208 -1421 -1040 -777 -808 -677 -534 -655 -396 218 605 444 451 821 935 845 967
771I67M08k21n16j2R4l41j23R2l28o08k36K06k8k77jJ2k52j43M28M04j9pK21J38
$$ 967 1375 1154 638 626 720 379 256 348 20 -588 -824 -618 -646 -923 -924 -912 -1164 -1307 -879 -475 -494 -501 -280 -142
795a42J78M57L66o5j34J73R8j1J12J14k48m76j45N7j62k69p0j63m39k75K14J55
$$ -142 36 493 859 794 660 833 931 920 1032 1146 898 422 277 334 172 -97 -167 -330 -769 -1044 -830 -675
817f75j98j86J32J7N0K20L91Q5O3K92J06O2K48M47P9l44r6J22J39mj61j76m16
$$ -675 -873 -1059 -927 -910 -860 -640 -249 -164 -101 191 297 359 607 1054 1133 789 693 815 954 950 789 613 197
840A97l13O8O1m20k86J1n3k93n8K96R7r4L6J68jJ56N51K52m8n0K02J11K94J74
$$ 197 -116 -48 13 -407 -693 -682 -735 -1028 -1086 -790 -693 -787 -751 -583 -584 -428 123 375 327 277 479 590 884 1058
864A058P7k45m17J55K12j39l32k37k29k89o4J87k21l66j10J01K1j9J33QO3K69
$$ 1058 1135 890 473 628 840 701 369 132 -97 -386 -450 -263 -484 -850 -960 -859 -838 -857 -724 -716 -653 -384
886c84K20j25J5N96M27n2k93J08L55J29M9k5l40m66J04M15j97o87k00J17j25l22
$$ -384 -164 -289 -274 322 749 697 404 512 867 996 1045 1020 680 214 318 733 536 -151 -351 -234 -359 -681
908f81n9J10j68o5J21j10j4L34J56P6J96J19k6J18N30L27k08k37J47J71k6N0J25
$$ -681 -740 -630 -798 -863 -742 -852 -866 -532 -376 -300 -104 15 -11 107 637 964 756 519 666 837 811 861 986
931I86m17o93j4P47j98q78k97L42p2m10J15K53k95k10M36K07k39L3O18L38j44
$$ 986 569 -124 -138 609 411 -467 -764 -422 -494 -904 -789 -536 -831 -1041 -605 -398 -637 -604 14 352 208
952B08k25K04M13K91nk01j32J32O9j5n8j53l33l85Q6K68k43p02p3L45o6m65K35
$$ 208 -17 187 600 891 886 685 553 685 754 739 681 528 195 -190 -104 164 -79 -781 -854 -509 -575 -1040 -805
975h05M41k99k96N20M26m25p8P83N23m42k53L08M32JM3P0k96k71n0L54m2m97n04
$$ -805 -364 -663 -959 -439 -13 -438 -516 267 790 348 95 403 835 836 879 949 653 382 332 686 644 147 -357
998c57M6K20j35l19l45N2K88n0l59J65N17k7m49L10O30j85q6O83L23n94j58O44
$$ -357 -311 -91 -226 -545 -890 -838 -550 -600 -959 -794 -277 -304 -753 -443 187 2 -84 599 922 328 170 814
1020H14K36l98J7K29k15n53j76M94Q3p56m87K50L02l93j70Q2k06j1L35L2j97K94
$$ 814 1050 652 669 898 683 130 -46 448 531 -225 -712 -462 -160 -553 -723 -641 -847 -858 -523 -491 -688 -394
1042c94K29r4J68M92k32n3O82L93q22l07O48K89k76k14l5k14l68M3L23j28o79
$$ -394 -165 -259 -91 401 169 116 798 1191 369 62 710 999 723 509 474 260 -108 -65 258 130 -549
1063e49k46N73r5p57J46O74j86n39M04M85k46L0M40L7k22M54L00j48l8K76k26
$$ -549 -795 -222 -317 -1074 -928 -254 -440 -979 -575 -90 -336 -306 134 171 -51 403 703 555 517 793 567
1084E67k07J67J41n9j81k53k38k09k7K47m2n29l74M67J20m78MO59j15l53L21M91
$$ 567 360 527 668 609 428 175 -63 -272 -299 -52 -94 -623 -997 -530 -410 -888 -884 -225 -340 -693 -372 119
1106A19k83m6O08R7l57K21N23r8k54M7N5k66K2J23j47l03k55Qn7k14j9J87k01
$$ 119 -164 -210 398 495 138 359 882 784 530 577 632 366 388 511 364 61 -194 -186 -243 -457 -476 -289 -490
1129d90m27J90K43j65j6N45m4l71K73O34j48k12M67L29l92j31M89K2l01o7J50
$$ -490 -917 -727 -484 -649 -665 -120 -164 -535 -262 372 224 12 479 808 416 285 774 796 495 428 578
1150E78k96j80J45R4m49m04R5J32k31j66K72Lm09J7M80K2j59K59L41k86l0N45
$$ 578 282 102 247 341 -108 -512 -417 -285 -516 -682 -410 -407 -816 -799 -319 -297 -456 -197 144 -142 -172 373
1172C73K27k84O4L22q5k85K84J89m74j57J17nl85JM8j82l38k5J46n3j79J27J88
$$ 373 600 316 380 702 617 332 616 805 331 174 291 286 -99 -98 -50 -232 -570 -595 -449 -502 -681 -554 -366
1195c66j66j99M31L18j57qM51o6k39L56L58j75j70K36Pk71K3J96k13k86k6o4k15
$$ -366 -532 -731 -300 18 -139 -147 304 238 -1 355 713 538 368 604 611 340 363 559 346 60 34 -30 -245
1218b45j00O7Ql03j33J32J99j38K6J69j8r9L15L27n2r3K86Q5k08K05L42j21k96
$$ -245 -345 -278 -270 -573 -706 -574 -375 -513 -487 -318 -336 -435 -120 207 155 62 348 433 225 430 772 651 355
1241C55P1Q8k30o6R8l6m07j59J02o4k24L0J2n5k24J58K41o5k0K56N0j20J29M17
$$ 355 426 514 284 218 316 280 -127 -286 -184 -248 -472 -442 -430 -485 -709 -551 -310 -375 -395 -139 -89 -209 -80 337
1265C37M1r7R2J31o3j8K19Nl11q8J26j33k83Q0O8l13k81M3J44k11RN2%k34J38
$$ 337 378 281 373 504 441 423 642 647 336 248 374 241 -42 38 106 -207 -488 -445 -301 -512 -503 -451 -451 -685 -547
1290e47L28J05j62J63K39q2O5K72J75j22j42J60M2j12P7Q5k58j94k2M2j41j20
$$ -547 -219 -114 -276 -113 126 44 109 381 556 434 292 452 494 382 459 544 286 92 70 112 -29 -149
1312a49rj50k14O3J02m7j01O4J07r4M5K82J17k8JK54N9p9K50J03j05j18Q9lj12
$$ -149 -158 -308 -522 -459 -357 -404 -505 -441 -334 -428 -383 -101 16 -12 -11 243 302 223 473 576 471 353 442 439 327
1337C27m5J3j07k88k5K2q9j08l3k2j91p1K54Nn7P1O0L6R5J37K21Ml7J28N4l1J42
$$ 327 282 295 188 -100 -125 -103 -192 -300 -333 -355 -546 -617 -363 -358 -415 -344 -284 -248 -153 -16 205 209 172 300 354 323 465
1364D65J41q2k52pR3q1j47L5j80k22m5O3J7j98%q8Rn8J96O2J6L2J36Q8j1J86K03
$$ 465 606 524 272 265 358 277 130 165 -15 -237 -282 -219 -202 -400 -400 -488 -479 -537 -341 -279 -263 -231 -95 -7 -18 168 371
1391C71l3n2R5J16o3OJMk38q7N9o4q2j32k3k37o0J4P3k1r0m3L3O7L5J92N4J3Q8
$$ 371 338 286 381 497 434 440 441 445 207 120 179 115 33 -99 -122 -359 -419 -405 -332 -353 -443 -486 -453 -386 -351 -159 -105 -92 -4
1420dJ62K8L2J35R2o6nQ3k4j17PL5k08j83K7L7j17j61o4m4j34N1J10n9L3j7M8
$$ -4 158 186 218 353 445 379 374 457 433 316 323 358 150 -33 -6 31 -86 -247 -311 -355 -489 -438 -328 -387 -354 -371 -323
1447c23Q3J35M4Q4J7J04N6J14J16lo0k6j1L4j3j28k8j4j93j02J6J0j81m2J6j02
$$ -323 -240 -105 -61 23 40 144 200 314 430 427 367 341 330 364 351 223 195 181 -12 -114 -98 -88 -269 -311 -295 -397
1473c97j48R9J44K3o0L5R7Q7J04M3K06J0j1J3J23J3J0J4Jj54m9L4j12o1kj66j53
$$ -397 -545 -446 -302 -279 -339 -304 -207 -120 -16 27 233 243 232 245 368 381 391 405 406 252 203 237 125 64 62 -104 -257
1500b57l0J09j66r4Q9qj50J14K27K8l3k7J53O8L5J56J51K2j54N5J39J0j40N0%
$$ -257 -287 -178 -344 -438 -349 -357 -507 -393 -166 -138 -171 -198 -45 23 58 214 365 387 233 288 427 437 297 347 347
1525C47j36k14O8Pj63j43Pq0KJ8K2j12j1J0kR6J78K1j0L6J27J14N3P9P3k9l7m6
$$ 347 211 -3 65 72 -91 -234 -227 -307 -305 -287 -265 -377 -388 -378 -380 -284 -106 -85 -95 -59 68 182 235 314 387 358 321 275
1553B75O6R8j69l4Rj66j93J34Kk60r7O7j23l2M6P8n3J1J11MJ21J14L3M9JQ2K7
$$ 275 341 439 270 236 245 79 -114 20 22 -238 -335 -268 -391 -423 -377 -299 -352 -341 -230 -226 -105 9 42 91 92 174 201
1580B01J70m2K8L2p8j25M6N4j33n9n1r6j49KN6j38q8Q2j2r2J04N5m0J02L3J65
$$ 201 371 329 357 389 311 186 232 286 153 94 43 -53 -202 -200 -144 -282 -370 -288 -300 -392 -288 -233 -273 -171 -138 27
1606B7N5m4R9J0N0J0J04R6m0o6j9M6j77k1J17j53j68J8m2k13MR3j9j40nP7l7R6
$$ 27 82 38 137 147 197 207 311 407 367 301 282 328 151 130 247 94 -74 -56 -98 -311 -307 -214 -233 -373 -378 -301 -338 -242
1634b42O0N5j1J20R0L6O4P4Q0m7m1L1J43n8j49q2J31j52p2P2m1j75j26N8j01k4
$$ -242 -182 -127 -138 -18 72 108 172 246 326 279 238 269 412 354 205 123 254 102 30 102 61 -114 -240 -182 -283 -307
1660c07J04k0j20k6J16qN8J34N0M5L3J58LK1O9n7K6K3l9J24j39j19j00R3q6j19
$$ -307 -203 -223 -343 -369 -253 -261 -203 -69 -19 26 59 217 220 241 310 253 279 302 263 387 248 129 29 122 36 -83
1686h3M4k5j94r0J47p0j40J26J54j48o2J99N4K7R6J24n8K8P6N9N1k8n9P0k4j12
$$ -83 -39 -64 -258 -348 -201 -271 -411 -285 -131 -279 -341 -142 -88 -61 35 159 101 129 205 264 315 287 228 298 274 162
1712A62Q2m2r3j88J24j13j68N2L7j22j32J20M4r9N3J35j4j26J96N8J16P5K6m0
$$ 162 244 202 109 -79 45 -68 -236 -184 -147 -269 -401 -281 -237 -336 -283 -148 -162 -288 -92 -34 82 157 183 143
1736A43O4L2R5O4j38j4l1k7o9J1j1j19j48j%o0lJ3l1j15k9J52L9j1OR9J9N2J29
$$ 143 207 239 334 398 260 246 215 188 119 130 119 0 -148 -149 -149 -209 -212 -199 -230 -345 -374 -222 -183 -194 -188 -89 -70 -18 111
1765A11Q0q0R0O6j0k5N2M4q1m4q4J9j12o7Qo2r2j1O7r8j03J18Mr1K5J03O4j1Q9
$$ 111 191 111 201 267 257 232 284 328 247 203 119 138 26 -41 -33 -95 -187 -198 -131 -229 -332 -214 -210 -301 -276 -173 -109 -120 -31
1794c1J01Kj5Q8Q1L3l1Q4j5o8N1j7o5j38j6l6qj17L8n3j00j04R0K1l0lP4p3J6
$$ -31 70 72 57 145 226 259 228 312 297 229 280 263 198 60 44 8 0 -117 -79 -132 -232 -336 -246 -225 -255 -258 -184 -257 -241
1823b41J57O7J0K7J08J8J3O6P3pn5N1%r4m0m6j8j31j19P9n4q4N2k7o9p2Q9N7m4
$$ -241 -84 -17 -7 20 128 146 159 225 298 291 236 287 287 193 153 107 89 -42 -161 -82 -136 -220 -168 -195 -264 -336 -247 -190 -234
1852b34L9L3L9K8K8J26P5k5R1k9J5L2O1J5o1o2NJ5q0l7m2p7j46j1kQm3n3M6n8
$$ -234 -195 -162 -123 -95 -67 59 134 109 200 171 186 218 279 294 233 171 176 191 111 74 32 -45 -191 -202 -204 -196 -239 -292 -246 -304
1882c04P7Q4K5L4Q7k6ON1J09N9m7K4M0j8K5M1k4l7n2n2n6m2o3l1r5m0Kk4J5J2
$$ -304 -227 -143 -118 -84 3 -23 -17 34 143 202 155 179 219 201 226 267 243 206 154 102 46 4 -59 -90 -185 -225 -223 -247 -232 -220
1912b20M%k3Q4oJ12N7nJ7O4L1J01j4Jk8P8Oj26L0O0j08j19J0Kp0j02K6o1o0n6
$$ -220 -216 -216 -239 -155 -161 -49 8 3 20 84 115 216 202 203 175 253 259 133 163 223 115 -4 6 8 -62 -164 -138 -199 -259 -315
1942c15J04L6j4K9K8J0k1K02j0KN4K5L8J0M9O3m8p0K2Lm9k0r8k1k5r0Nm0l6p1
$$ -315 -211 -175 -189 -160 -132 -122 -143 59 49 51 105 130 168 178 227 290 242 172 194 197 148 128 30 9 -16 -106 -101 -141 -177 -248
1972b48%j9J6M9O9ro1J02MO3N2J00K5j0L5M1K5KmK6r3j3j5No4o4p8o3l2lO2q1
$$ -248 -248 -267 -251 -202 -133 -142 -203 -101 -97 -34 18 118 143 133 168 209 234 236 232 258 165 152 137 142 78 14 -64 -127 -159 -162 -100 -181
2004a81on7N4o3P4M2OP3RN9OP5J40k7n4J2K1N6k1ql7r1M0o9J0r4q1Qj04qQR0o4
$$ -181 -187 -244 -190 -253 -179 -137 -131 -58 -49 10 16 91 231 204 150 162 183 239 218 210 173 82 122 53 63 -31 -112 -104 -208 -216 -208 -118 -182
2037a82o2P8K8k6M1P3J08j06N6J10J2JP5K7q7M8K1o6J0k2o9Qp8Qm2j9j27J8m6
$$ -182 -244 -166 -138 -164 -123 -50 58 -48 8 118 130 131 206 233 146 194 215 149 159 137 68 76 -2 6 -36 -55 -182 -164 -210
2066b10m1k2J17K7p7Q0K9QJ1J13J0K8lL9P0k0P7L1r4mJkq4Ll2n7q0J0m7r2mj1
$$ -210 -251 -273 -156 -129 -206 -126 -97 -89 -78 35 45 73 70 109 179 159 236 267 173 169 170 168 84 87 55 -2 -82 -72 -119 -211 -215 -226
2098b26N4j6k0O0J3m8J7R4R7J0k4P6M2k9L9N3L1Oor3J1o4J1j7n5n1o1o5J4pl5
$$ -226 -172 -188 -208 -148 -135 -183 -166 -72 25 35 11 87 129 100 139 192 223 229 223 130 141 77 88 71 16 -35 -96 -161 -147 -154 -189
2129a89Jm0j9L0L4LR3QL9M3N6m9R8O9l5l4RJ1J03Qn8p8q6Nk4Ml4k9n3k8l8j1M1
$$ -189 -188 -228 -247 -217 -183 -180 -87 -79 -40 3 59 10 108 177 142 108 117 128 231 239 181 103 17 22 -2 2 -32 -61 -114 -142 -180 -191 -150
2162a50l8rK3M3K9P7J8K9m7N8J03P9n9J9nk1o0Q6m2On3qp4j00P1n7j6o3J6J5n6
$$ -150 -188 -197 -174 -131 -102 -25 -7 22 -25 33 136 215 156 175 170 149 89 175 133 139 86 78 4 -96 -25 -82 -98 -161 -145 -130 -186
2193a86L9nRJ3J4JJ03njP3rN9RJ02m8j0N9n7j3J4m0o8Qm7o5k9n0K0o0Qp6Q1j6
$$ -186 -147 -152 -143 -130 -116 -115 -12 -17 -18 55 46 105 114 216 168 158 217 160 147 161 121 53 61 14 -51 -80 -130 -110 -170 -162 -238 -157 -173
2226a73rJ2M4N4l1R0RnQ3K1Q1JK9m0J4k8j3k5k2mn0j4l9q9K7k9l9L9q2K2k8QM9
$$ -173 -182 -170 -126 -72 -103 -13 -4 -9 74 95 176 177 206 166 180 152 139 114 92 88 38 24 -15 -104 -77 -106 -145 -106 -188 -166 -194 -186 -137
2259a37k9O1L5L4%R4k9P2J9K0k7k8Q2j1n6k5L3k3m3j2k8n8p7J1mk4JpK8no0R4
$$ -137 -166 -105 -70 -36 -36 58 29 101 120 140 113 85 167 156 100 75 108 85 42 30 2 -56 -133 -122 -126 -150 -149 -156 -128 -133 -193 -99
2291i9J1L5LN2L8K3K1pQ4K3k4o4k8O7M7p7o1Rk5m8K3j1r1Mn0J3Kmj0j2P5o7L6
$$ -99 -88 -53 -50 2 40 63 84 77 161 184 160 96 68 135 182 105 44 53 28 -20 3 -8 -99 -95 -145 -132 -130 -134 -144 -156 -81 -148 -112
2324a12J08J8L7j2N8Pj7O7lj8Mkm6K1P0j24p0k7N7j4j31LP9n7j24M9P8kN3q1Q8
$$ -112 -4 14 51 39 97 104 87 154 151 133 137 135 89 110 180 56 -14 -41 16 2 -129 -126 -47 -104 -228 -179 -101 -103 -50 -131 -43
2355d3n5OO6O4J7J5K9pM6J9N7j02M1o0j1%l1Rp3j4k2o8K6oq1k1L2NN7K4LL0L0
$$ -43 -98 -92 -26 38 55 70 99 92 138 157 214 112 153 93 82 82 51 60 -13 -27 -49 -117 -91 -97 -178 -199 -167 -162 -105 -81 -78 -48 -18
2388a8J0rQ2oQ0m9N0k2oM0l0Nm5k4l8K4m4k5J1o4ll4l9L9J0j1j4jQ4l0O6l5M5
$$ -18 -8 -17 65 59 139 90 140 118 112 152 122 127 82 58 20 44 0 -25 -14 -78 -81 -115 -154 -115 -105 -116 -130 -131 -47 -77 -11 -46 -1
2421aR2n2Q6PJ3lm4M2n7M7Lm2j22N3l4p0M7m8n8%l5kK7L8J9k2J5K7j5J28n3O7
$$ -1 91 39 125 132 145 142 98 140 83 130 133 91 -31 22 -12 -82 -35 -83 -141 -141 -176 -178 -151 -113 -94 -116 -101 -74 -89 39 -14 53
2453E3l8L6P1k0M0J3l7K6j3j10R1m7jj00L1rm6q4K7j4kJ3Qo7P2J8k5O0N4K6O0
$$ 53 15 51 122 102 142 155 118 144 131 21 112 65 64 -36 -5 -14 -60 -144 -117 -131 -133 -120 -112 -179 -107 -89 -114 -54 0 26 86
2484H6l9j6O2M1J5l7K9K3k8k9j1l3n8J2n0qn7%k9N1m8K4l8m1M4J13l9J2M9m4M0
$$ 86 47 31 93 134 149 112 141 164 136 107 96 63 5 17 -33 -41 -98 -98 -127 -76 -124 -100 -138 -179 -135 -22 -61 -49 0 -44 -4
2515dK7M4J9QnK1J1qN6m6o0mq0L6j6j0m2m4j5l3K1P0n6KRL4o3O0K0M0PL8QK8L2
$$ -4 23 67 86 94 89 110 121 113 169 123 63 59 -21 15 -1 -11 -53 -97 -112 -145 -124 -54 -110 -108 -99 -65 -128 -68 -48 -8 -1 37 45 73 105
2550A05J9J9m9L0k1Ok7n3k3No9L0p0L6j1l2L8q1L9k5j4Q1J3p7N7Q8m6J4L6K7N7
$$ 105 124 143 94 124 103 109 82 29 6 11 -58 -28 -98 -62 -73 -105 -67 -148 -109 -134 -148 -67 -54 -131 -74 14 -32 -18 18 45 102
2581A02k1P9n8L2m4j0L2n0J3l2m1k1k6mk1Mn3j1K7o3J4M8j9Q7Knk3Q0P2r9R2q
$$ 102 81 160 102 134 90 80 112 62 75 43 2 -19 -45 -49 -70 -66 -119 -130 -103 -166 -152 -104 -123 -36 -34 -39 -62 18 90 -9 83 75
2613G5L9J1l5M9m9J2n8j0K4l9k2j1o2J6l9J2j0m2N0l0Km2P2O6l7O4m8J08n9P2
$$ 75 114 125 90 139 90 102 44 34 58 19 -3 -14 -76 -60 -99 -87 -97 -139 -89 -119 -117 -159 -87 -21 -58 6 -42 66 7 79
2643G9N9J3o7J0L3n4J5k0k2Ro3j4j4jMoKn2mK9m7KM9m1Q4J8l0K9K4pK7Q3k2M2
$$ 79 138 151 84 94 127 73 88 68 46 55 -8 -22 -36 -37 -33 -39 -37 -89 -93 -64 -111 -109 -60 -101 -17 1 -29 0 24 17 44 127 105 147
2677A47l7qkrK7m8jk8Pn0%p0j6MJ6o7K5Opj5L2J5K4M5J7Jj9P5M9opO6p3l4L3m4
$$ 147 110 102 100 91 118 70 69 41 48 -2 -2 -72 -88 -84 -68 -135 -110 -104 -111 -126 -94 -79 -55 -10 7 8 -11 64 113 107 100 166 93 59 92 48
2713D8L5rj05M4Lm8k8L0m6jn3OO7n2jN4p2M0Q6L6l6L0N5n8O3nM3m2L1l9MmL7n2
$$ 48 83 74 -31 13 16 -32 -60 -30 -76 -77 -130 -124 -57 -109 -110 -56 -128 -88 -2 34 -2 28 83 25 88 83 126 84 115 76 80 76 113 61
2747F1j4p9k0j7J0P1q4l0k1M4K2k8j5P1k6JL3J8nOP9J8n3oO3l9O2m1M2p6QN8r8
$$ 61 47 -32 -52 -69 -59 12 -72 -102 -123 -79 -57 -85 -100 -29 -55 -54 -21 -3 -8 -2 77 95 42 36 99 60 122 81 123 47 55 113 15
2780A5Om1n1M8j5l6l3L7m2j6L6K4NM1P7o5QNN9J9j0L7m5L3OJ9l3n2j8Ol1K3q4
$$ 15 21 -20 -71 -23 -38 -74 -107 -70 -112 -128 -92 -68 -63 -22 55 -10 -2 3 62 81 71 108 63 96 102 121 88 36 18 24 -7 16 -68
2813f8jkm0J7QL2k6pK4Nm1O0J13j11M3M8J0QKj3M3L1m5p5O4j7mn5k3J6j9n0J9
$$ -68 -69 -71 -111 -94 -86 -54 -80 -87 -63 -58 -99 -39 74 -37 6 54 64 72 74 61 104 135 90 15 79 62 58 3 -20 -4 -23 -73 -54
2846e4pl8JKK3Km6L8oL4J7k0Q4K0J2k8M7L3j0l5pK5n1N5l2K4Oj09j8j9P%l6k7
$$ -54 -61 -99 -98 -96 -73 -71 -117 -79 -85 -51 -34 -54 30 50 62 34 81 114 104 69 62 87 36 91 59 83 89 -20 -38 -57 -50 -50 -86 -113
2880a13O2o7L5K4j1L0l5Q4l8j0P3rk0L6j3N3N6p9lN9r9J2j9Mom1K1l7k3N6p3M5
$$ -113 -51 -118 -83 -59 -70 -40 -75 9 -29 -39 34 25 5 41 28 81 137 58 55 114 15 27 8 12 6 -35 -14 -51 -74 -18 -91 -46
2912d6l7J7k9j9N3M2j4K8oM5j9L5K8K7Om0j4k7K5K3k4m5K0k5rRl5ln9O9l0o2j1
$$ -46 -83 -66 -95 -114 -61 -19 -33 -5 -11 34 15 50 78 105 111 71 57 30 55 78 54 9 29 4 -5 4 -31 -34 -93 -24 -54 -116 -127
2945a27L3J02p2K9K0J1K1J1L5nqK0Lk1J2Nk7K8l0j0J8n1mk4J7%o4N0o6k0Q4q3
$$ -127 -94 8 -64 -35 -15 -4 17 28 63 58 50 70 73 52 64 69 42 70 40 30 48 -3 -7 -31 -14 -14 -78 -28 -94 -114 -30 -113
2977a13j3P5p2J07KjJ3N6pj6L9p5O0K9J9j6lj0k5M9m7k3l6n7K7m4N5n1l6J9rM7
$$ -113 -126 -51 -123 -16 -14 -15 -2 54 47 31 70 -5 55 84 103 87 84 74 49 98 51 28 -8 -65 -38 -82 -27 -78 -114 -95 -104 -57
3009e7j8K9KM8l9L6K2K4Nj8j6j5N3J8OL6j19N0J1j2m2j7J7j2q7O2l8L1n8O6Kl2
$$ -57 -75 -46 -44 4 -35 1 23 47 52 34 18 3 56 74 80 116 -3 47 58 46 4 -13 4 -8 -95 -33 -71 -40 -98 -32 -30 -62
3041f2pk4O0K1mL8QjM8K9p9M1kK4j0L1r3rj3K0k1J0p8K3L3k9l9l6QkK4l8N4K8
$$ -62 -69 -93 -33 -12 -16 22 30 29 77 106 27 68 66 90 80 111 18 9 -4 16 -5 5 -73 -50 -17 -46 -85 -121 -113 -115 -91 -129 -75 -47
3075d7L1L8o8R9no8L5J05l7J4m3L6n7NL8n4j9m3LKOl2N1m5l1lJ9k9lK5LJ7L8j9
$$ -47 -16 22 -46 53 48 -20 15 120 83 97 54 90 33 38 76 22 3 -40 -37 -35 -29 -61 -10 -55 -86 -89 -70 -99 -102 -77 -74 -57 -19 -38
3109c8N0K2l2N7O3m5J8k3K2j5l0j5JK6m5k5p7L3Nn0K0J3rj8N7l4O4o0J7N5l1M9
$$ -38 12 34 2 59 122 77 95 72 94 79 49 34 35 61 16 -9 -86 -53 -48 -98 -78 -65 -74 -92 -35 -69 -5 -65 -48 7 -24 25
3141B5k9N6J2L3o7K0JL9n2Rl8kN9m5l7k8QL5m8j7K6J7l1J3oj2k0oN1L4O7m9k2
$$ 25 -4 52 64 97 30 50 51 90 38 47 9 7 66 21 -16 -44 -36 -1 -49 -66 -40 -23 -54 -41 -47 -59 -79 -85 -34 0 67 18 -4
3174dJ5L4O0l5l2N3j9j5K7o5J8m9K3m1j9o3L5%j9RRK5l0K3J9j8L0K8J5J0J4L1
$$ -4 11 45 105 70 38 91 72 57 84 19 37 -12 11 -30 -49 -112 -77 -77 -96 -87 -78 -53 -83 -60 -41 -59 -29 -1 14 24 38 69
3206F9lK2p5O3J1jk7nnn3M4p5oK1J2k0k5mj6o4Q2K0j8j7M0K1L3j0LL9o1P8n0K5
$$ 69 66 88 13 76 87 86 59 54 49 -4 40 -35 -41 -20 -8 -28 -53 -57 -73 -137 -55 -35 -53 -70 -30 -9 24 14 17 56 -5 73 23 48
3240D8J3K6Rp3L8l3JL4n3k0L1m2m9L0o1L2j0l2J2N8n6K0K8rP4m6M8M6k9K0K7l4
$$ 48 61 87 96 23 61 28 29 63 10 -10 21 -21 -70 -40 -101 -69 -79 -111 -99 -41 -97 -77 -49 -58 16 -30 18 64 35 55 82 48
3272D8M6k0jj3j6l7L8o2%j2k7K1k6lj5L2k2N9j3k8k8Q2L9q6N2rL3MK4j6J2NJ4
$$ 48 94 74 73 60 44 7 45 -17 -17 -29 -56 -35 -61 -64 -79 -47 -69 -10 -23 -51 -79 3 42 -44 8 -1 32 36 60 44 56 61 75
3305G5p0N5k2L9k2j5p4lK5l2m1Rl1K2k3lj7M9jL8K5K0J0kj3pJ16J7l2k5%J8l3
$$ 75 5 60 38 77 55 40 -34 -37 -12 -44 -85 -76 -107 -85 -108 -111 -128 -79 -80 -42 -17 3 13 11 -2 -9 107 124 92 67 67 85 52
3338E2j0l2L0l9k0K5Mm7OK4k4q2KL6OJ4j0L4m1J03Jn5nK5R1J8n1nj8K1J2Nn7Q
$$ 52 42 10 40 1 -19 6 10 -37 -31 -7 -31 -113 -111 -75 -69 -55 -65 -31 -72 31 32 -23 -28 -3 88 106 55 50 32 53 65 70 13 21
3372B1J4j1jj2j19P7nk0mm5j7P2jm4N8mQ8p4LN2lqN5Jpl9J7K7j4j8J0n9j4K0J4
$$ 21 35 24 23 11 -108 -31 -36 -56 -60 -105 -122 -50 -51 -95 -37 -41 47 -27 -24 28 25 17 72 73 66 27 44 71 57 39 49 -10 -24 -4 10
3407A0om9j6N0j03J27j12M5l6K9Q6o3J5j0M9l5N3k0JK9M5k8K8J8o0K7n5M0m9l1
$$ 10 4 -45 -61 -11 -114 13 -99 -54 -90 -61 25 -38 -23 -33 16 -19 34 14 15 44 89 61 89 107 47 74 19 59 10 -21
3437b1L5q7J9j3l8L4K7l6JJRL3j6K9qJ5JP6n6L4K1J4j3j6k6K2K2j6M8p8ok8JJ6
$$ -21 14 -73 -54 -67 -105 -71 -44 -80 -79 -78 -69 -36 -52 -23 -31 -16 -15 61 5 39 60 74 61 45 19 41 63 47 95 17 11 -17 -16 0
3471@m0jL5r4N3KLk5M2Qk0m2Q2J6q9J07k2mRQK0J0m3O7q9N3m4oN0r6Pj0K5j2j1
$$ 0 -40 -41 -6 -100 -47 -45 -42 -67 -25 -17 -37 -79 3 19 -70 37 15 11 20 28 48 58 15 82 -7 46 2 -4 46 -50 -43 -53 -28 -40 -51
3506e1k3J0L8l6P5r6N9rpP6Plk8L5pK3j6K3o5K1JK1m8L5K6q5pJ0o3N2QMLn4%j9
$$ -51 -74 -64 -26 -62 13 -83 -24 -33 -40 36 43 40 12 47 40 63 47 70 5 26 27 48 0 35 61 -24 -31 -21 -84 -32 -24 -20 -17 -71 -71 -90
3542i0M6l3L0M9j5J7N6NJ0l9KJ0KJ4pL0o4l2%K2J2m7n7J8L8j0j4k8J5q5J06m3
$$ -90 -44 -77 -47 2 -13 4 60 65 75 36 38 48 50 64 57 87 23 -9 -9 13 25 -22 -79 -61 -23 -33 -47 -75 -60 -145 -39 -82
3574h2N0J8k8L3j1M3n1J41p7R1o6j4M0n6M3j0k1o5K3m5K4Ll2O9o3J7p5RL3m7R
$$ -82 -32 -14 -42 -9 -20 23 -28 113 36 127 61 47 87 31 74 64 43 -22 1 -44 -20 -17 -49 20 -43 -26 -101 -92 -59 -106 -97
3605i7P8j7M5lL4q6L9N0j9K6k1m5O4O8j17M1jk0K1m2l2RJ0k0rj0RJ4k2J7L2k8
$$ -97 -19 -36 9 6 40 -46 -7 43 24 50 29 -16 48 116 -1 40 39 19 40 -2 -34 -25 -15 -35 -44 -54 -45 -31 -53 -36 -4 -32
3637c2m5k2P5J2L9L5M5o8l2M7K7n9N7k2m1Lk1l3k1O9j0l2m5j2k1R6o0J3J0jj8
$$ -32 -77 -99 -24 -12 27 62 107 39 7 54 81 22 79 57 16 19 -2 -35 -56 13 3 -29 -74 -86 -107 -11 -71 -58 -48 -49 -67
3668f7K9K4J2lM2l9N2l3j2J21q0L4o9P1m7nl6j8k5j6J8Q8p0nk4ql6jL7pM8l5M2
$$ -67 -38 -14 -2 -5 37 -2 50 17 5 126 46 80 11 82 35 30 -6 -24 -49 -65 -47 41 -29 -34 -58 -66 -102 -103 -66 -73 -25 -60 -18
3701a8L6jk0M1j4K1jl9N6QM3p3jJ2k1%m9L8n1J2J6Kp4M2j1K0l7mjj4Q1K4o4L9
$$ -18 18 17 -3 38 24 45 44 5 61 69 112 39 38 50 29 29 -20 18 -33 -21 -5 -3 -77 -35 -46 -26 -63 -67 -68 -82 -1 23 -41 -2
3735bL2m8P1m0K8j8K4j9K0j4%l1L6k9Ql4%j4Kn6K2j3j7P3rl1k9P3kM8M9n7J4o
$$ -2 30 -18 53 13 41 23 47 28 48 34 34 3 39 10 18 -16 -16 -30 -28 -84 -62 -75 -92 -19 -28 -59 -88 -15 -17 31 80 23 37 31
3769C1k2J1qL9k9P0r2K9j3k3opK4n1L7n2K0J6mmj2j2M3J5nK3l4rL2j2R0q6M5l7
$$ 31 9 20 12 51 22 92 0 29 16 -7 -13 -20 4 -47 -10 -62 -42 -26 -30 -34 -46 -58 -15 0 -5 18 -16 -25 7 -5 85 -1 44 7
3803Gj9J18l7j5n1J9k9K7j0po6K8L9k0p8L9j8jj2M1J5j2M5K4j4J4l1J1NK3J4k3
$$ 7 -12 106 69 54 3 22 -7 20 10 3 -63 -35 4 -16 -94 -55 -73 -74 -86 -45 -30 -42 3 27 13 27 -4 7 12 35 49 26
3835B6J2L9m6K1jk6jj3qn6L8mn4N0n7P1m1KN9l3Rn5L9M5q6J9O9j17J50j3Mm6L5
$$ 26 38 77 31 52 51 25 24 11 3 -53 -15 -19 -73 -23 -80 -9 -50 -48 11 -22 -13 -68 -29 16 -70 -51 18 -99 51 38 42 -4 31
3868C1k5J5L0n3qJ2rqml5l4K1O3j2m9M9j2j6J6K4L2m1j5Q9k1jJ4l0j9k3J05m9
$$ 31 6 21 51 -2 -10 2 -7 -15 -19 -54 -88 -67 -4 -16 -65 -16 -28 -44 -28 -4 28 -13 -28 61 40 39 53 23 4 -19 86 37
3900C7l9M2M0n8J4k4km4L5mnj1l9l4L9j2L3kk8M8mN5o6L6K8j0J8Nj4j4J8K8m5
$$ 37 -2 40 80 22 36 12 10 -34 1 -3 -8 -19 -58 -92 -53 -65 -32 -34 -62 -14 -18 37 -29 7 35 25 43 48 34 20 38 66 21
3933B1L1l1k9ML4k0Qm4l2L3qn0J7K4l6O2K3Mql0K6MNj0M1J8k1n0O6k1K5m2%k0
$$ 21 52 21 -8 -4 30 10 18 -26 -58 -25 -33 -83 -66 -42 -78 -16 7 11 3 -27 -1 3 8 -2 39 57 36 -14 52 31 56 14 14 -6
3967fL6n6m3O6j7ml6n1Q8n0K5PK6j7J0PKO7m6J0J8m0J00l9K8r3J5K6J5kr9M8p4
$$ -6 30 -26 -69 -3 -20 -24 -60 -111 -23 -73 -48 -41 -15 -32 -22 -15 -13 54 8 18 36 -4 96 57 85 -8 7 33 48 46 -53 -5 -79
4000g9O4%m3Q5q5jL3qm6OM3MK6j3J6J6j0l6R6q2Q1o5L8l0M2lm8M4lJ1n8K7n6l2
$$ -79 -15 -15 -58 27 -58 -59 -26 -34 -80 -74 -31 -27 -1 -14 2 18 8 -28 68 -14 67 2 40 10 52 49 1 45 42 53 -5 22 -34 -66
4034f6J0j7L2m0JN4m7k6P1K1ooLk9L9L4pN6k8KJ4r5J8N9n6L2j2J5n7j2N2m6q8
$$ -66 -56 -73 -41 -81 -80 -26 -73 -99 -28 -7 -13 -19 -16 -45 -6 28 21 77 49 51 65 -30 -12 47 -9 23 11 26 -31 -43 9 -37 -125
4067a25O7J6oMkJk1k8L7Q4n4k5N7J9k4rN4n8N0L2k1m0N6j6l5nj6K0ml7m9J16q0
$$ -125 -58 -42 -48 -44 -46 -45 -66 -94 -57 27 -27 -52 5 24 0 -9 45 -13 37 69 48 8 64 48 13 8 -8 12 8 -29 -78 38 -42
4100d2j6M6n8pO1j5K2MJo0J18lm5kMJN8o1K7N2k4q5J0L7o0P4r7N5k6k5K5L4m7
$$ -42 -58 -12 -70 -77 -16 -31 -9 -5 -4 -64 54 51 6 4 8 9 67 6 33 85 61 -24 -14 23 -37 37 -60 -5 -31 -56 -31 3 -44
4133d4%M3r7K9N2L7K2p9L7J0K3k7J3nK0on0M8Nj4l0L1m1n2K2Qk5N3Rm1j7QOJ7
$$ -44 -44 -1 -98 -69 -17 20 42 -37 0 10 33 6 19 14 34 28 -22 26 31 17 -13 18 -23 -75 -53 -45 -70 -17 -8 -49 -66 -58 -52 -35
4167c5j0l0L1K1oP2n0M8k6M6j8J8L0n4k3L2Nnm3j9L5k8Pl8P7j25J4N9j2qL4m0
$$ -35 -45 -75 -44 -23 -29 43 -7 41 15 61 43 61 91 37 14 46 51 46 3 -16 19 -9 -2 -40 37 -88 -74 -15 -27 -35 -1 -41
4199d1L3Jp2J00n1O9k9J7j7L1o4P0q5P4J2J7k1rNm4Qj6%nK5q4Q0J2r4mK3K9m4
$$ -41 -8 -7 -79 21 -30 39 10 27 10 41 -23 47 -38 36 48 65 44 35 40 -4 4 -12 -12 -17 8 -76 4 16 -78 -82 -59 -30 -74
4232g4L4J8jL2ok3J00q9M3L1j5kn9LK3m7K2J1j4L0m4m6K6j6M4m4L0M6l8nk8P7
$$ -74 -40 -22 -23 9 3 -20 80 -9 34 65 50 48 -11 -8 15 -32 -10 1 -13 17 -27 -73 -47 -63 -19 -63 -33 13 -25 -30 -58 19
4264A9Rl4NK8l2lL6lK2o3J1J1m9O5k7J2p2R5o0J2L6m8J1j9J7M1n8%J4oM5l4j1
$$ 19 28 -6 -1 27 -5 -8 28 25 47 -16 -5 6 -43 22 -5 7 -65 30 -30 -18 18 -30 -19 -38 -21 20 -38 -38 -24 -30 15 -19 -30
4297c0N1j0N0n6K6MJ6K8l5lM8p0K5k5Jn8O6n2N5o0K3pj8K7k0j1q8R6m4K7N9J9
$$ -30 21 11 61 5 31 35 51 79 44 41 89 19 44 19 20 -38 28 -24 31 -29 -6 -13 -31 -4 -24 -35 -123 -27 -71 -44 15 34
4329C4n8K0L7o1O3j2Qj3rj8K7K0Nn5J5j2j5j5mL1j7m9P5l0%k4L1knK8N4j1Onl1
$$ 34 -24 -4 33 -28 35 23 31 18 9 -9 18 38 43 -12 3 -9 -24 -39 -43 -12 -29 -78 -3 -33 -33 -57 -26 -28 -33 -5 49 38 44 39 8
4364Hk6J4K5l4L8qK3l3O4q2J2rk3p4P2nLrL2J3nj2k9kJ6M4l6J4L4L7Ln7M6j14
$$ 8 -18 -4 21 -13 25 17 40 7 71 -11 1 -8 -31 -105 -33 -38 -35 -44 -12 1 -4 -16 -45 -47 -31 13 -23 -9 25 62 65 8 54 -60
4398f0J11l6O1r3M9p7O5l3J0oJ2j6k0mKk8jJ8K6ML4p7J7O8k4j7jO0n2l2J06k3
$$ -60 51 15 76 -17 32 -45 20 -13 -3 -9 3 -13 -33 -37 -35 -63 -64 -46 -20 -16 18 -59 -42 26 2 -15 -16 44 -8 -40 66 43
4430D3J5mo0K9ML5n4j2j9K8J4m5k9J7J8k0m4L5K6Rlj4m3J12l7l2N3k0M3q7O7M0
$$ 43 58 54 -6 23 27 62 8 -4 -23 5 19 -26 -55 -38 -20 -40 -84 -49 -23 -14 -17 -31 -74 38 1 -31 22 2 45 -42 25 65
4462F5l8rl2L3Oq8P1kqj0j9j5ON1k2k0K6L2n7M6m3R4q3M6jJ0Nn8J9K7K4mj5n1
$$ 65 27 18 -14 19 25 -63 8 6 -2 -12 -31 -46 -40 11 -11 -31 -5 27 -30 16 -27 67 -16 30 29 39 44 -14 5 32 56 52 37 -14
4496a4L6o4L4L0p0L2nnl0K8m6L6j8L0l2k0N6JK6j7J6J1J1k2Rk7J1k2ML6k0L9n6
$$ -14 22 -42 -8 22 -48 -16 -21 -26 -56 -28 -74 -38 -56 -26 -58 -78 -22 -21 5 -12 4 15 26 4 13 -14 -3 -25 -21 15 -5 34 -22
4529b2L2L4l9qk6K6lOmk5M6k4m9P0Km3K0K4k4m7N0M3J2n8N9n6N7j9n5N7j0m5J4
$$ -22 10 44 5 -3 -29 -3 -6 0 -4 -29 17 -7 -56 14 16 -27 -7 17 -7 -54 -4 39 51 -7 52 -4 53 34 -21 36 26 -19 -5
4562el6J1O2j2k3j9k5L0l8O5m1K4poN5n2kL4M1k4ko8Q6l7L0q1O7j4oPk8Oj3K5
$$ -5 -41 -30 32 20 -3 -22 -47 -17 -55 10 -31 -7 -14 -20 35 -17 -19 15 56 32 30 -38 48 11 41 -40 27 13 7 14 -14 -8 -21 4
4596Dnl5K4N3r2M4k4N9m7Mm0M8Pm1M7j3N4o5J2L5N2j2n3l6L9l9k1L2Rkm5p5R0
$$ 4 -1 -36 -12 41 -51 -7 -31 28 -19 -15 -55 -7 0 -41 6 -7 47 -18 -6 29 81 69 16 -20 19 -20 -41 -9 0 -2 -47 -122 -32
4629c2RM6j0o1Rjm8J17j0r6N8L5Rk9j0K9K5K5n8j6L7Jp0P7j9l3K4m1P0p9J5qJ4
$$ -32 -23 23 13 -48 -39 -40 -88 29 19 -77 -19 16 25 -4 -14 15 40 65 7 -9 28 29 -41 36 17 -16 8 -33 37 -42 -27 -35 -21
4662b1om2L0k0RO7K6m8j4J1jj5L7j6P6l9J9p1M6m2LQ6r7k1M0M0j4l7mKjnK6m1
$$ -21 -27 -69 -39 -59 -50 17 43 -5 -19 -8 -9 -24 13 -3 73 34 53 -18 28 -14 -11 75 -22 -43 -3 37 23 -14 -18 -16 -17 -22 4 -37
4696c7J3k0l9OP4qJ1K3l0N7p9kN0l6K9M7lm1J2Mm6P2o4k5nRk0K7L0k7M3p9K5Q
$$ -37 -24 -44 -83 -77 -3 -11 0 23 -7 50 -29 -31 19 -17 12 59 56 15 27 31 -15 57 -7 -32 -37 -28 -48 -21 9 -18 25 -54 -29 -21
4730b1K0ok1qL1j2O6kpk1k5K5mpK4m8ON7j07O3j7j1Ok2N6o7M2o4K2jJ1O4m8N6
$$ -21 -1 -7 -28 -36 -5 -17 49 47 40 19 -6 19 15 8 32 -16 -10 47 -60 3 -14 -25 -19 -41 15 -52 -10 -74 -52 -53 -42 22 -26 30
4764C0l1j9M0L2o1K1j9M8jj5kj7M8o0kM6n6Kp2J05l0K1J5n2mkoM3jkm2J2oM3Q
$$ 30 -1 -20 20 52 -9 12 -7 41 40 25 23 6 54 -6 -8 38 -18 -16 -88 17 -13 8 23 -29 -33 -35 -41 2 1 -1 -43 -31 -37 6 14
4799A4JJ4k8M7n0O4p9L3N1l3pn9K1L9k4K2q1K3j3L8L5m6LJ9n7P8r6P6L2l5qNj9
$$ 14 15 29 1 48 -2 62 -17 16 67 34 27 -32 -11 28 4 26 -55 -32 -45 -7 28 -18 -15 4 -53 25 -71 5 37 2 -6 -1 -20
4832b0j0J05Njn5n2j3O3Kk5lj6J6j0m3kK0K5k6L9pOk7kK3m3P2K9k8M6p3j1N3m7
$$ -20 -30 75 80 79 24 -28 -41 22 24 -1 -4 -20 -4 -14 -57 -59 -39 -14 -40 -1 -8 -2 -29 -31 -8 -51 21 50 22 68 -5 -16 37 -10
4866a0K1L8n0MJ3o6Q4j1N3p3k9K8M3j04l5L2N2j1Mmo1O8L4K3p6N5k8N1m8P1r8
$$ -10 11 49 -1 3 16 -50 34 23 76 3 -26 2 45 -59 -94 -62 -10 -21 -17 -21 -82 -14 20 43 -33 22 -6 45 -3 68 -30
4897c0Q0j9M4l3p4jJ9O1k6K1l0k3J0l0qJJ8n8O4k2jk2PM1l6K5K0Ml1J21r4L5j1
$$ -30 50 31 75 42 -32 -33 -14 47 21 42 12 -11 -1 -31 -39 -38 -20 -78 -14 -36 -37 -59 -52 -11 -47 -22 -2 2 -29 92 -2 33 22
4930B2M4l6rm8M8Ll8M2q4Q6k8j5OJ8Jnl0j7K2J2m1L9J3K3p9P0m3O2m8QL3m1O3
$$ 22 66 30 21 -27 21 24 -14 28 -56 30 2 -13 -7 11 12 7 -23 -40 -18 -6 -47 -8 5 28 -51 19 -24 38 -10 -2 31 -10 53
4963E3n9j7K7K8k3K7l1l9NJ1J1l2K1mppML1k4K1J3j8rL9l4N4k4k0P1k3j8o3N6
$$ 53 -6 -23 4 32 9 36 5 -34 -29 -18 -7 -39 -18 -22 -29 -36 -32 -1 -25 -4 9 -9 -18 21 -13 41 17 -3 68 45 27 -36 20
4996B0n3N7kJ8q1J2K1l9N0Op5O2j9MK4p9J0N6k6K5pM5k2j1M3m7koN3Rl1nRj5K
$$ 20 -33 24 22 40 -41 -29 -8 -47 3 9 -66 -4 -23 -19 5 -74 -64 -8 -34 -9 -16 29 7 -4 39 -8 -10 -16 37 46 15 10 19 4 6
5031Fn5J8j4J06j20mM8j5M3n2J4j8MJ5J6j2J5lM6n5j3P9J2o8K0l2mO0lj6O1p9
$$ 6 -49 -31 -45 61 -59 -63 -15 -30 13 -39 -25 -43 -39 -24 -8 -20 -5 -8 38 -17 -30 49 61 -7 13 -19 -23 37 34 18 79 0
5063@M7k1o0mN7o9J6l5Q1l5J5J3J9o6J2M6m5j0L5M6j1m7l7P4K5Ml4K4Rk8j5j7
$$ 0 47 26 -34 -38 19 -50 -34 -69 12 -23 -8 5 24 -42 -30 16 -29 -39 -4 42 31 -16 -53 21 46 50 16 40 49 21 6 -11
5095a1rN8n3JK9n4lK3K1mOn5M2m2K3pJ2N0qOl6QRLJpL2m3j5J2J6N5n6kK6Qo3j7
$$ -11 -20 38 -15 -14 15 -39 -42 -19 2 -2 4 -51 -9 -51 -28 -35 -23 27 19 25 -11 -3 6 9 10 3 35 -8 -23 -11 5 60 4 2 28 36 -27 -44
5133d4L9k2J9o4RJ35p4qL2K1q3j8J08m5RN0n5lM6lk8L1p3l5M1J0K3m4%QL5k5m4
$$ -44 -5 -27 -8 -72 -63 72 -2 -10 22 43 -40 -58 50 5 14 64 9 6 52 49 21 52 -21 -56 -15 -5 18 -26 -26 -18 17 -8 -52
5166e2M8K4K7q8P6p4L8j4k5O4j9Pj8l1N2J0o0K4l1Q1n2O4Nn4q8N5L3m4L7PK4o0
$$ -52 -4 20 47 -41 35 -39 -1 -15 -40 24 5 12 -6 -37 15 25 -35 -11 -42 39 -13 51 56 2 -86 -31 2 -42 -5 2 26 -34
5198c4N5Rn6J5k5OP9l3j6nK7Mk9J6M8q5P0l8k2M9k9nj6QJ7K0nq6O0J5o3M2n1R0
$$ -34 21 30 -26 -11 -36 -30 49 16 0 -5 22 26 -3 13 61 -24 46 8 -14 35 6 1 -15 -7 10 30 25 -61 -1 14 -49 -7 -58 32
5232C2n7K1qN0k1rK5r1Q6P8j20M1k7m0L6L6p1O4l3j5j9K2j1n0J9%R5o6j9L8l1
$$ 32 -25 -4 -12 38 17 8 33 -58 28 106 -14 27 0 -40 -4 32 -39 25 -8 -23 -42 -20 -31 -81 -62 -62 33 -33 -52 -14 -45
5263d5J9J3%j6Kj3N9K2J3o0L4m7P0n8K4J1l3k9J6j6L4K3k4J0qo2OL0PO4q8P9m5
$$ -45 -26 -13 -13 -29 -27 -40 19 41 54 -6 28 -19 51 -7 17 28 -5 -34 -18 -34 0 23 -1 9 1 -61 -55 -25 -18 46 -42 37 -8
5296hJ6nl7N4k3Pn3K8mrO0L%p3L4J2k4%Q4n0j1J5l0l6L0K2o1M2k9J2P9p1J5J9
$$ -8 8 3 -34 20 -3 4 -49 -21 -25 -34 26 29 29 -44 -10 2 -22 -22 62 12 1 16 -14 -50 -20 2 -59 -17 -46 -34 45 -26 -11 8
5330Hk9J6k0Q9pm1k6k8O6kl2N9m6NPl2k9QL6rk4M8q3M5K2kMn4M2k3K9j1N6o1J5
$$ 8 -21 -5 -25 64 57 16 -10 -38 28 26 -6 53 7 12 19 -13 -42 -34 2 -7 -31 17 -66 -21 1 -1 3 -51 -9 -32 -3 -14 42 -19 -4
5365dQM2m5J9J2k1j9l5R2Pl0j8q3M5J0rL2l6J0mLj9K0%J2J4lJ7kj7QQ3q1JK5K7
$$ -4 4 46 1 20 32 11 -8 -43 49 56 26 8 -75 -30 -20 -29 3 -33 -23 -27 -24 -43 -23 -23 -11 3 0 17 15 -2 6 89 8 9 34 61
5401F1m3qj0K0MLo6L1L8l8rm8K8l5NK1K7K0j7k4M4k5O7l3l8K1N6o6Q1p8M7l7j5
$$ 61 18 10 0 20 24 27 -39 -8 30 -8 -17 -65 -37 -72 -67 -46 -19 1 -16 -40 4 -21 46 13 -25 -4 52 -14 67 -11 36 -1 -16
5434a6M2K3l9l3O6k7on6M6pJ1o0L2K3j7j4J9L4n0Jj2L2L0k1rON0k8k3J1K6m6O4
$$ -16 26 49 10 -23 43 16 10 -46 0 -7 4 -56 -24 -1 -18 -32 -13 21 -29 -28 -40 -8 22 1 -8 -2 48 20 -3 8 34 -12 52
5467E2o6Mlj8M2Pn0K4M1l9m9K4PJ8L7p1j4M9roPj7J3M5O0q1j5M1K8m7j0K2j5J0
$$ 52 -14 -10 -13 -31 11 18 -32 -8 33 -6 -55 -31 -24 -6 31 -40 -54 -5 -14 -20 -13 -30 -17 28 88 7 -8 33 61 14 4 26 11 21
5501B1L9m3p7O2k8K0K3L4r6m5N3l8j3O6K0L3l5L0oK2j9M7J6j09J7K2J1J0m2mK
$$ 21 60 17 -60 2 -26 -6 17 51 -45 -90 -37 -75 -88 -22 -2 31 -4 26 20 42 23 70 86 -23 -6 16 27 37 -5 -9 -7
5532gK1j4k9lK0n1M4M1J4n8PM7k7n0qO4o4K0K3l7P6k9K9rJ4J2k3L8r9P2m5L7j6
$$ -7 14 0 -29 -32 -12 -63 -19 22 36 -22 -15 32 5 -45 -53 11 -53 -33 -10 -47 29 0 29 20 34 46 23 61 -38 34 -11 26 10
5565A0k2jJ8k9P3n0J4m2L7j9K7j4m3L9j5J5L8j0k9kN1n5m8N1J3kl6L4J5JJm4L3
$$ 10 -12 -13 5 -24 49 -1 13 -29 8 -11 16 2 -41 -2 -17 -2 36 26 -3 -5 46 -9 -57 -6 7 5 -31 3 18 19 20 -24 9
5598Ij9K0p3Q4rm7K4J5n0M6rk4L1Jn1M5M7j9lMo1K2P2lm5jj4J5M1J6j02kLN5k7
$$ 9 -10 10 -63 21 12 -35 -11 4 -46 0 -9 -33 -2 -1 -52 -7 40 21 18 22 -39 -17 55 52 7 6 -8 7 48 64 -38 -40 -37 18 -9
5633in3J6k4N2l9K3M0k3J5PqK1k0n4O9L1n5qK0J1K8k2J4k9K4l5j9L1l0Q5j14R3
$$ -9 -62 -46 -70 -18 -57 -34 6 -17 -2 5 -3 18 -2 -56 13 44 -11 -19 1 12 40 18 32 3 27 -8 -27 4 -26 59 -55 38
5665C8m1J6oln5N1oj4OJ2M0mn5Ll1N3rJL6Pn6j4M0k3K8J5J3j9o2O8k2l0l0J9O7
$$ 38 -3 13 7 4 -51 0 -6 -20 -14 -2 38 34 -21 -18 -49 4 -5 -4 32 39 -17 -31 9 -14 14 29 42 23 -39 29 7 -23 -53 -34 33
5700C3l8LqM6p8N4jQN6m7pM0m2n7J9L7o2QK5K8J8m6m6R6n2J2j2JLK1K0m4%J1J7
$$ 33 -5 -2 -10 36 -42 12 11 19 75 28 21 61 19 -38 -19 18 -44 -36 -11 17 35 -11 -57 39 -13 -1 -13 -12 -9 12 32 -12 -12 -1 16
5735A6k3k3J1j3M4K3k1N3m2J5p8M3K9Pj6k3j9j8j5O0K8k2q0M8K8n5J11o7k4l4
$$ 16 -7 -30 -19 -32 12 35 14 67 25 40 -38 5 34 41 25 2 -17 -35 -50 10 38 16 -64 -16 12 -43 68 1 -23 -57
5765e7P7ok1K3k3j7ORk5R2j5l2J9M4j22M9J0l0J5K6p5N8Ql6j0kJ3k9K0QOl3L8
$$ -57 20 14 -7 16 -7 -24 -18 -9 -34 58 43 11 30 74 -48 1 11 -19 -4 22 -53 5 13 -23 -33 -35 -22 -51 -31 -23 -17 -50 -12
5798a2K3m5K6j9M5k6NLn7Q9n3N7qnp9L7L3j9Jjj3QK3n6L7KL4n4pM8K4l0K6n0n8
$$ -12 11 -34 -8 -27 18 -8 -3 0 -57 32 -21 36 28 23 -56 -19 14 -5 -4 -5 -18 -10 13 -43 -6 -4 30 -24 -31 17 41 11 37 -13 -71
5833g1Q8lJ2K7n8j8O4l9m3Q4k9m5j3P7l6M3k9j8J8j6jk9Kk1L9j7RkM9l6M2o0L1
$$ -71 17 14 26 53 -5 -23 41 2 -41 43 14 -31 -44 33 -3 40 11 -7 11 -5 -6 -35 -33 -54 -15 -32 -23 -25 24 -12 30 -30 1
5866AN0n2K8Lm6N6m6M4l6K1p6N7J4l7Nj3J4J4J2m2M2Nk6K8m3L1o5N2LLK1j6p3
$$ 1 51 -1 27 30 -16 40 -6 38 2 23 -53 4 18 -19 -14 -27 -13 1 13 -29 13 18 -8 20 -23 8 -57 -5 -2 1 22 6 -67
5899f7J37m7oLn7O8lmMl6mj2M6o1JL6nk6M7JL7q4K3L9r5P8K0p6Q0J2o8j0P4k6
$$ -67 70 23 17 20 -37 31 28 24 28 -8 -12 -24 22 -39 -38 -2 -7 -33 14 15 52 -32 -9 30 -65 13 33 -43 37 49 -19 -29 45 19
5933A9rl4j5O9m6L3o1M6k7L8L3r8j2K7%M4JJ7l7j7L6O3r0M6j7j0ORN2q6P3o1K3
$$ 19 10 -24 -39 30 -16 17 -44 2 -25 13 46 -52 -64 -37 -37 7 8 25 -12 -29 7 70 -20 26 9 -1 5 14 66 -20 53 -8 15
5966A5l9JL8kj8k6lJ9jJ6qRj4j5J6Mj7jK0L7Pn0LoO5k9p7L9N0j0Mnk7K9p0L8n7
$$ 15 -24 -23 15 13 -5 -31 -34 -15 -16 0 -8 1 -13 -28 -12 -8 -25 -26 -6 31 38 -12 -9 -15 50 21 -56 -17 33 23 27 22 -5 24 -46 -8 -65
6003f5L2pM4q%J2p1Q9k0Jqpl1M6N3m5N3n8M4o4J2P1r0J0J4K5klQm3l1O2j9K9k1
$$ -65 -33 -40 4 -4 -4 8 -63 26 6 7 -1 -8 -39 7 60 15 68 10 54 -10 2 73 -17 -7 7 32 30 27 35 -8 -39 23 4 33 12
6038A2k3KNl1Q1p3L1m7JN4o4N5oK3m2K6K4J1k9k9K2qJ3j8J5Jj2k9J3jPlm4M9J
$$ 12 -11 -9 -4 -35 46 -27 4 -43 -42 12 -52 3 -3 20 -22 4 28 39 10 -19 3 -5 8 -10 5 6 -6 -35 -22 -23 -16 -19 -63 -14 -13
6073a3K0j6k4rN0l1KN8p9N4L8l1Mn4jJ00k8K0m5k6L0j9j9k5J2J7L8l9J1Kn5N5
$$ -13 7 -9 -33 -42 8 -23 -21 37 -42 12 50 19 23 -31 -32 68 40 60 15 -11 19 0 -19 -44 -32 -15 23 -16 -5 -3 -58 -3
6105cK7k0M2j5k6j5oJ0m3N0N1n1k6K5N7l0l5J8l0k6P0q1Q8k5k2p9Q8l4N8l9P3
$$ -3 24 4 46 31 5 -10 -16 -6 -49 1 52 1 -25 0 57 27 -8 10 -20 -46 24 -57 31 6 -16 -95 -7 -41 17 -22 51
6136E1l6k4j1J2L9jk5j4K5k6K9m2M9o7L1m9L3M1RL1k9kJ4r3P2j9pm0Q0l0K7m8
$$ 51 15 -9 -20 -8 31 30 5 -9 16 -10 19 -23 26 -41 -10 -59 -26 15 24 55 26 24 38 -55 17 -2 -9 -49 31 1 28 -20
6168b0%L4NJK9o6K8n7JR5q3O4l7J7%L5j5j6l3oOl7j5P5m8J6L7o7N8qO0l7JJ3o9
$$ -20 -20 14 19 20 49 -17 11 -46 -45 50 -33 31 -6 11 11 46 31 15 -18 -24 -18 -55 -70 5 -43 -27 10 -57 1 -7 53 16 17 30 -39
6203c9j1Q8k7m2O9j6j5J9j5K2l2kl4J7l3K8M0j9oJ1Ml0j8L7rK5k1j3M8l4L5%k8
$$ -39 -50 38 11 -31 38 22 7 26 11 33 1 -1 -35 -18 -51 -23 17 -2 -8 3 7 -23 -41 -4 -13 12 -9 -22 26 -8 27 27 -1
6236aN%k9O7Rl6j8O2l9L6m7pK7l8Q6j13P4o1K1k2j6NK1j5Lk0L9lrJ6j6L8Kk6K6
$$ -1 4 4 -25 42 51 15 -3 59 20 56 9 2 29 -9 77 -36 38 -23 -2 -24 -40 -35 -14 -29 -26 -46 -7 -10 -19 -3 -19 19 21 -5 21
6271B1jl7P4l9j3L7j9m1L1Rj5k6m2O6l5M8j4ML9q2kpN2K7o3k0L9j8l6K3O0m3J4
$$ 21 20 -17 57 18 5 42 23 -18 13 22 7 -19 -61 5 -30 18 4 8 47 -35 -37 -44 8 35 -28 -48 -9 -27 -63 -40 20 -23 -9
6304iO5q6M4J2k8L3j8l6L9k3lNMl3O4l6j0J9L8l6Nj5LRj1l1k2O8m9K6K9%mK3n5
$$ -9 56 -30 14 26 -2 31 13 -23 16 -7 -10 -5 -1 -34 30 -6 -16 3 41 5 10 -5 -2 7 -4 -35 -57 11 -38 -12 17 17 13 36 -19
6339a9J5pn4K5P0o8j2O9ml2j3oL8k6%MkoL1k4k6MQ6J2o0N3k6n9L2qO7r2P9p9J18
$$ -19 -4 -11 -65 -40 30 -38 -50 19 15 -17 -30 -36 2 -24 -24 -20 -22 -28 3 -21 -47 -43 43 55 -5 48 22 -37 -5 -13 54 -38 41 -38 80
6374H0o0k8O7j02L2kJ4Qj8M7j4n4OK0o4K6J1J4l7M2n2P5k0K5j8nOj6K9L6k4m5
$$ 80 20 -8 59 -43 -11 -13 1 9 -9 38 24 -30 -24 -4 -68 -42 -31 -17 -54 -12 -64 11 -9 16 -2 -7 -1 -17 12 48 24 -21
6406b1L0L8j7m8J2J7qj5Qo2N2Q6o9jM6n6k6J6J0M1j3j3j5j8L4M5j3m2l0M9l2j2
$$ -21 9 47 30 -18 -6 11 3 -12 -4 -66 -14 72 3 2 48 -8 -34 -18 -8 33 20 7 -8 -26 8 53 40 -2 -32 17 -15 -27
6438b7M8o8M1k9L0j1K0L3n2n6K9N6l4k1J6J6RM8r6K0N0m2J1M9j7l1l6N1j1K4j9
$$ -27 21 -47 -6 -35 -5 -16 4 37 -15 -71 -42 14 -20 -41 -25 -9 0 48 -48 -28 22 -20 -9 40 23 -8 -44 7 -4 20 1
6469Al0L5m0N1n0J1K8jn3j1L3%QJ0ll3O6l2pl2N8k4K2j3OJ3J6j0k9J6j3M7p1L8
$$ 1 -29 6 -34 17 -33 -22 6 5 -48 -59 -26 -26 -18 -8 -11 -44 22 -10 -17 -49 9 -15 7 -6 0 13 29 19 -10 6 -7 40 -31 7
6503GJ1jn0K0j0N4l3K7jo1J3j8J3M7kl8J5k8P0n6J6L0o5L4K1Nr0M3L7m2J1rP1
$$ 7 18 17 -33 -13 -23 31 -2 25 24 -37 -24 -42 -29 18 16 -22 -7 -35 35 -21 -5 25 -40 -6 15 20 -70 -27 10 -32 -21 -30 41
6536D1o6J0L9o5K0MJ5mRK3o4K0oJL3o0P2L9m8O2k0l2m0N3j8n2M7j9NL3o8K6k5
$$ 41 -25 -15 24 -41 -21 -17 -2 -6 3 26 -38 -18 -24 -23 10 -50 22 61 13 75 55 23 -17 36 18 -34 13 -6 -1 32 -36 -10 -35
6569c5J0P5l0m0k3N7O1p8J9Mkl8K0k6P6oo0m3N9PQNJ0j1l0j1M4k4K9r7O9m4J7
$$ -35 -25 50 20 -20 -43 14 75 -3 16 20 18 -20 0 -26 50 44 -16 -59 0 7 15 20 30 19 -11 -22 22 -2 27 -70 -1 -45 -28
6602b8K5o0J9Q1ok5rPK5k0ppM6m8j2l1P9j3M3n4j6L5k4nL5Oo4L7J7l9jMj1rJ3
$$ -28 -3 -63 -44 37 31 6 -3 4 29 9 2 -5 41 -7 -19 -50 29 16 59 5 -11 24 0 -5 30 36 -28 9 26 -13 -14 -10 -21 -30 -17
6637a7j5j4K5j1K2j5qJ3J6j9M4jn1P7pl6plj4J5nM9pl2N1p3M6K8m1k3K3j5KkL8
$$ -17 -32 -46 -21 -32 -10 -25 -33 -20 -4 -23 21 20 -31 46 39 3 -4 -7 -21 -6 -11 38 31 -1 50 -23 23 51 10 -13 10 -5 -3 -5 33
6672C3l8J4j8J9mjK0j9QqJ6qpj7M0L2n8j8Qk2K3L6j8K0n5P2m8k3L8n5N3Nj7K8
$$ 33 -5 9 -9 10 6 5 25 6 14 6 22 14 7 -10 30 62 4 -14 -6 -28 -5 31 13 33 -22 50 2 -21 17 -38 15 20 3 31
6706C1pk7M5j1K1j5l5j3J4J2MlLj0qj8k0M5Kj7l7K1Rj7J6Rk6k2K3j2N6k6j5Nk9
$$ 31 24 -3 42 31 52 37 2 -11 3 15 19 16 19 9 1 -17 -37 8 10 -7 -44 -23 -14 -31 -15 -6 -32 -54 -31 -43 13 -13 -28 -23 -52
6741e2J00o5L6J1m3O9l9l0L3j4J1K1jp3L4J1m1M4N2n2J3o7J0M6l5L3JJ7k1j2n0
$$ -52 48 -17 19 30 -13 56 17 -13 20 6 17 38 37 -36 -2 9 -32 12 64 12 25 -42 -32 14 -21 12 13 30 9 -3 -53
6772e3M0M9m6Nl7K0L2m8qM8J1m3K7MM5j2PJ4k6mj8K3J6l8m4K4K6K6l1k9L8K0j8
$$ -53 -13 36 -10 -5 -42 -22 10 -38 -46 2 13 -30 -3 1 46 34 41 55 29 25 7 30 46 8 -36 -12 14 40 9 -20 18 38 20
6805B0l9J4L3m2OK5n1LK5Mj3%k2O4m8M2m9J5m2P5Mk6j8j3L7j0K4om0N4p2L8L0
$$ 20 -19 -5 28 -14 -8 17 -34 -31 -6 -2 -15 -15 -37 27 -21 21 -28 -13 -55 20 24 -2 -20 -33 4 -6 18 12 -28 26 -46 -8 22
6838B2l6K9m6L9M6k3l2l2KM3J3l5L2m0J2N4k8n6K6Rj9Qm6O1L1m3J8%l7RpM0j6
$$ 22 -14 15 -31 8 54 31 -1 -33 -31 12 25 -10 22 -18 -6 48 20 -36 -10 -1 -20 -12 -58 3 34 -9 9 9 -28 -19 -26 14 -2
6871bN4m5j6J2J2N7q6K1K0o1J9k4l1N5m5L2N0jn6J4K3k4j6K4MqL3j3L0q8M3m1
$$ -2 52 7 -9 3 15 72 -14 7 27 -34 -15 -39 -70 -15 -60 -28 22 21 -35 -21 2 -22 -38 -14 -10 -18 15 2 32 -56 -13 -54
6903e4L3ML7o3O4j5J7kk9ln6O9J7k3k4P7o3l6O1PMJ2o6L4j7O2l1K6n6O3J7q9K
$$ -54 -21 -17 20 -43 21 6 23 21 -8 -11 -67 2 19 -4 -28 49 -14 -50 11 18 22 34 -32 2 -15 47 16 42 -14 49 66 -23 -21
6936b1LJ8j3k2R0qj06O5J5l0nM9l8K3m1K6n3P2nn1O3m2jJ7j5L4pOn2j2O3%J1q1
$$ -21 -18 0 -13 -35 55 47 -59 6 21 -9 -14 35 -3 20 -21 5 -48 24 19 -32 31 -11 -12 5 -10 24 17 23 -29 -41 22 22 33 -48
6970d8K4NK2m2N2Nj1l4k7R6j1m2P2k5r2%L8J9jk3Q1m5l1M6NkJ3k5nk3J6kOl6k
$$ -48 -24 -19 3 -39 13 18 7 -27 -54 42 31 -11 61 36 -56 -56 -18 1 0 -23 58 13 -18 28 33 31 44 19 14 -9 7 5 11 -25 -27
7005b7j8P4j5kl4j1jP3l3k0PM7n2Qp8J26ok0J0k6k3%j3M1%m6KN5j5l0nl3L9P9
$$ -27 -45 29 14 12 -22 -33 -34 39 6 -14 -7 40 -12 -4 -82 44 38 18 28 2 -21 -21 -34 7 7 -39 -37 18 3 -27 -32 -65 -26 53
7039E3n2j7M1o4M2Nk0nk9O4Nj9l3j2pN9Om9OJ02p2kM2j8o2NK5n3J8P2p3J8J3j0
$$ 53 1 -16 25 -39 3 8 -12 -17 -46 18 23 4 -29 -41 -48 11 17 -32 -26 76 4 2 44 26 -36 -31 -6 -59 -41 31 -42 -24 -11 -21
7073b1NL8o1L4L2p5k4P3Nl2J4k7N2rK6k3k3M7m6M9l2j9Pl4K7J0L6J4n7J5o2O0
$$ -21 -16 22 -39 -5 27 -48 -72 1 6 -26 -12 -39 13 4 30 7 -16 31 -15 34 2 -17 -10 -44 -17 -7 29 43 -14 1 -61 -1
7105aj8Pp3LQ3m6O9Kl1pj7k2N9K1k6Qj2J7m2M4q4Q5m5L1L1l6Q4p8%K2o1Mj1O6
$$ -1 -19 -12 -85 -82 1 -45 24 26 -5 -12 -29 -51 8 29 3 11 -1 16 -26 18 -66 19 -26 5 36 0 84 6 6 28 -33 -29 -40 26
7139B6n3Pj6L0n2O8mJ4J0n4j3j1kR1j29J00K5k4Kl0J1k6K7k2qj3N9m0jL0J0Nj6
$$ 26 -27 -20 -36 -6 -58 10 6 20 30 -24 -37 -48 -50 41 -88 12 37 13 15 -15 -4 -30 -3 -25 -33 -46 13 -27 -28 2 12 17 1
7172Aj7M0m7J06q7J0j5L7j6j9L9k9L6m4K3n7O1l4j5NK7kj3k8O8rn4K0RrN5l6l2
$$ 1 -16 24 -23 83 -4 6 -9 28 12 -7 32 3 39 -5 18 -39 22 -12 -27 -22 5 3 -10 -38 30 21 -33 -13 -4 -13 42 6 -26
7205b6j3Q7m8nk3O1l3p4O5j8N9l1k4JN0l6J8kj0k6K1K3m0j9Oj9LO5l9M9J5n5K5
$$ -26 -39 48 0 -5 -28 33 0 -74 -9 -27 32 1 -23 -22 28 -8 10 8 -2 -28 -7 16 -24 -43 -37 -56 -53 12 -27 22 37 -18 7
7238Gj2k5J1QO1o1k4M8kRk2Nk0J2l2L8M9q7M0l8L4l1N6m9M2l1K7L1m1Pn3M4lJ4
$$ 7 -5 -30 -19 -11 50 -11 -35 13 11 20 -2 3 -17 -5 -37 1 50 -37 3 -35 -1 -32 24 -25 17 -14 13 44 3 10 -43 1 -2 12
7272A2J9l4M6o5pK7LK2m8M6j3j5J4k4nR0m3m0k5OJ6l4M8J9M9p1M7k7pk5J05m9
$$ 12 31 -3 43 -22 -29 -2 1 23 -25 21 8 -7 7 -17 -22 68 25 -15 -40 -34 -18 -52 -4 15 64 -7 40 13 6 -19 86 37
7304C7o3N1J4l9PK3l3pQM0Lm7J4j0pK2k6Jk0N1j9K1m5J8j9L4n0J7L4K4j9Lo2J2
$$ 37 -26 25 39 0 7 30 -3 -10 -2 38 41 -6 8 -2 -9 13 -13 -12 -32 19 0 21 -24 -6 -25 9 -41 -24 10 34 15 18 -44 -32
7338c2N2k0L5lo2m0O0L8j5mpM5n7K9J7m3L4o0N1Jj6k5K3l8L4l7Q4o5J7M5p4N1
$$ -32 20 0 35 32 -30 -70 -10 28 13 9 2 47 -10 19 36 -7 27 -33 18 19 3 -22 1 -37 -3 -40 44 -21 -4 41 -33 18
7370A8j9Mjm3M8J7l3K7rJ7j1p4J6M8J8%j7k3l1L9j7J1Oj4K4jMK9l4rl6O7J0k5
$$ 18 -1 3 2 -41 7 24 -9 18 9 26 15 -59 -43 5 23 23 6 -17 -48 -9 -26 -15 -9 -23 1 0 4 33 -1 -10 -46 21 31 6
7404Fj6L0nn5R6l8l3Qj9P6n3K5mk1j8L6oL2r0R4n2J9m4R8n7k0P0m3M3l7k0K5J8
$$ 6 -10 20 15 -40 56 18 -15 -7 -26 50 -3 22 18 -3 -21 15 9 41 -49 45 -7 12 -32 66 9 -11 59 16 59 22 2 27 45
7437D5k5n5K6j3O3j7o2pk6M7J6l4M1j2N0k6Nn1K6K9o2O8p0O1Pj9j3L0jk4K9k1
$$ 45 20 -35 -9 -22 41 24 -38 -45 -71 -24 -8 -42 -1 -13 37 11 16 -35 -9 20 -42 26 -44 17 24 5 -8 22 21 -3 26 5
7469Ek4oK2NK5l0m1M1J3K0k6J0p1RN4n3P4m0k2J0J0pkM5n2K8m7J6K6kML1k3m3
$$ 5 -19 -25 -3 2 27 -3 -44 -3 10 30 4 14 -57 -48 6 -47 27 -13 -35 -25 -15 -22 -24 21 -31 -3 -50 -34 -8 -10 -6 25 2 -41
7503d1j0M6N3m8l6L2ql2K9K3k0lj7N7Pm9PNj2R1j07N6kpk0pk5PM9m0N8k2j4k9
$$ -41 -51 -5 48 0 -36 -4 -12 -44 -15 8 -12 -15 -32 25 32 -17 -10 -5 -17 74 -33 23 21 14 -6 -13 -38 -31 18 -22 36 14 0 -29
7537b9O0k8J8nn3N6m7N2Pj5l8P0o4N4r7O3MRK5j6m1NL0pm1M6n4K9K8Mo4L0pl1
$$ -29 31 3 21 16 -37 19 -28 24 31 16 -22 48 -16 38 -59 4 8 17 42 26 -15 -10 20 13 -28 18 -36 -7 21 25 -39 -9 -16 -47
7571d7J1RK6lj3k1L4j0mK0k1pL9n1N7M0k6l0L8m2M5qk5l0J4j2nO7k9mK8l6J5l9
$$ -47 -36 -27 -1 -4 -17 -38 -4 -14 -18 2 -19 -26 13 -38 19 59 33 3 41 -1 44 36 11 -19 -5 -17 -22 45 16 12 40 4 19 -20
7605b0L6j4L0q0M7L0p5M9J1j2ln1J00o8OK4rM0k2l0RK1k4RJ4mk4j6J3K8mo4N4
$$ -20 16 2 32 -48 -1 29 -46 3 14 2 -1 -52 48 -20 -14 10 1 41 19 -11 -2 19 -5 4 18 14 -10 -26 -13 15 11 -53 1
7638Al5J0K5l5O0n3NjpL1%n1L8j8M4k7L7Ko9M5l3M9ql5j4N9j6qj0J6K4rm5M5M6
$$ 1 -34 -24 1 -34 26 -27 -22 -23 -30 1 1 -50 -12 -30 14 -13 24 26 -43 2 -31 18 10 -25 -39 20 4 -4 -14 2 26 17 -28 17 63
7673F3r0j2j1P1J3Ql9n5M5L5p4N1N0p5nL5klj1K0m1lJ9j0L5lk7K0j2K4l4K7J4
$$ 63 -27 -39 -50 21 34 42 3 -52 -7 28 -46 5 55 -20 -25 10 8 5 -6 14 -27 -30 -11 -21 14 11 -16 4 -8 16 -18 9 23
7706B3k9Qkn1M0k7NM8OK7l3pK7L2m8rl3mJ8Rk1QRm9Q9p4M0l4P0q4qK4J1L3l4L0
$$ 23 -6 2 0 -51 -11 -38 -33 15 21 48 15 8 35 67 19 10 -23 -27 -9 0 -21 -13 -4 -53 36 -38 2 -32 38 -46 -54 -30 -19 14 -20 10
7742A0j1J6k4k3L1j2o3O5KoK4qK8k8O9l2k6Om3m1M8J3j3K7l6%PK3pQm2M5K1k1
$$ 10 -1 15 -9 -32 -1 -13 -76 -11 -9 -15 9 1 29 1 70 38 12 18 -25 -66 -18 -5 -18 9 -27 -27 -20 3 -4 4 -38 7 28 7
7776Gk5L0l3K8L4m2Lj1L0J8j9J1m6QJ2o1P5r4M1N4n2K6J5k9m3N0jJJ9K3k6jL2
$$ 7 -18 12 -21 7 41 -1 2 -9 21 39 20 31 -15 -7 5 -56 19 -75 -34 20 -32 -6 9 -20 -63 -13 -14 -13 6 29 3 2 34
7809C4J8r1Q8l5L8Rq7mQO7l1lj2rJ4l5JL2L9j9K9m1jl1J1K2j5K9p1M0M1l1P2m2
$$ 34 52 -39 49 14 52 61 -26 -30 -22 45 14 11 -1 -10 4 -31 -30 2 41 22 51 10 9 -22 -11 11 -4 25 -46 -6 35 4 76 34
7843C4r7L7L1J8J7n5j9L2l9J03l1l2J7kJ8j1m5LL1m9L2m9K6QM1l5j9j0M7j8Ml0
$$ 34 -63 -26 5 23 40 -15 -34 -2 -41 62 31 -1 16 14 32 21 -24 -21 10 -39 -7 -56 -30 -22 19 -16 -35 -45 2 -16 -12 -42
7875d2N9n%L6p0K6J6n0l3R5n8LM5n0N9k1m6M2l3K0j1O6j11L1l2N8NL0j8Jm0J8
$$ -42 17 12 12 48 -22 4 20 -30 -63 32 -26 -23 22 -28 31 10 -36 6 -27 -7 -18 48 -63 -32 -64 -6 -1 29 11 12 -28 -10
7907a0K6o7O6l9M8l7m7R3km5J2n4O7J2k9K2j4J7n4O8k9P1r3M5j2pm3QL1j8J8k0
$$ -10 16 -51 15 -24 24 -13 -60 33 31 -14 -2 -56 11 23 -6 16 2 19 -35 33 4 75 -18 27 15 8 -35 -27 4 -14 4 -16
7939a6N8p1N9Qk1n7j2M8j7L0j2jm3P1k1l6L7l4K4k1k4M8J2Mm0Roj2J6M1m0L4m5
$$ -16 42 -29 30 38 17 -40 -52 -4 -21 9 -3 -4 -47 24 3 -33 4 -30 -6 -27 -51 -3 9 13 -27 -18 -24 -36 -20 21 -19 15 -30
7972c0N7p7Q2n4K6Mj5J5qK0j6m5L2k7J0pJ7j4k4mL5P4m9k9k4N7j6J2k4NL3K5J0
$$ -30 27 -50 32 -22 4 8 -7 8 0 20 4 -41 -9 -36 -26 -33 -16 -30 -54 -58 -23 51 2 -27 -51 6 -10 2 -22 -17 16 41 51
8005E1n0j4O2o3Q7rp1j8j4MO9l3j1M5Lo2PL7J3m6K8J0J9m0lk4J4k4O2n7J6Pk3
$$ 51 1 -13 49 -14 73 64 -7 -25 -39 -35 34 1 -10 35 38 -24 -17 20 33 -13 15 25 44 4 1 -23 -9 -33 29 -28 -12 -5 -28
8038b8L6rO5j07O6k7rj2M2j8MM0j6J1j4q8O8L7ql9L7n5J4K8L2n0J8k6J3jM0%j23
$$ -28 8 -1 64 -43 23 -4 -13 -25 17 -1 3 43 27 38 24 -64 4 41 33 -6 31 -24 -10 18 50 0 18 -8 5 4 44 44 -79
8071g9R3qqLn3K6RjL5q6M9lj8M9l9j3M7jL3m0M6m3Kk0N3K5m3%K8j7o0O9m1l1O5
$$ -79 14 6 -2 1 -52 -26 -17 -18 17 -69 -20 -23 -41 8 -31 -44 3 2 35 -5 41 -2 0 -20 33 58 15 15 43 26 -34 35 -6 -37 28
8106B8n7l1L5N3lj7pnJ5k6K8Pl8L0l5K0n4P3n0J5J5jJLJ4l8l2O1l4M3k9pL9k6
$$ 28 -29 -60 -25 28 25 8 1 -4 11 -15 13 20 -18 12 -23 -3 -57 16 -34 -19 -4 -5 -4 -1 13 -25 -57 4 -30 13 -16 -23 16 -10
8140a0Q7n2m7N6k7M5n2r1R3J5k1Pj0K5j7Rn1L1P3r2K1P9q7k5RM2lJpkqL7J0m9
$$ -10 77 25 -22 34 7 52 0 -91 2 17 -4 3 -7 18 1 10 -41 -10 63 -29 -8 71 -16 -41 -32 10 7 8 1 -1 -9 28 38 -11
8174a1RL1j1nn8N2O5p0j4M1k3M2r5L0O4l6O
$$ -11 -2 29 18 13 -45 7 72 2 -12 29 6 48 -47 -17 47 11 17
8191A7
$$ Imaginary data points
##PAGE= N=2
##DATA TABLE= (X++(I..I)), XYDATA
0@%%%%%%%%%%%%%%%%%%%%%%%%%%%lPj2J6j6J6j6J6j8K2k5K9l2L5l9M2m8N4n7O4
$$ 0 0 0 0 0 0 0 0 0 0 0 0 0 0 0 0 0 0 0 0 0 0 0 0 0 0 0 0 -3 4 -8 8 -8 8 -8 8 -10 12 -13 16 -16 19 -20 22 -26 28 -29 35
47C5p1P7q6R4j03J14j24J35j50J66j82K01k22K45k73L04l35L64l86L70j95p40
$$ 35 -36 41 -45 49 -54 60 -64 71 -79 87 -95 106 -116 129 -144 160 -175 189 -197 173 -22 -762
69g62J0283R1036o4176j13724L9929P4261j2085l1724j578n576j0115L5615K4788
$$ -762 9521 100557 36381 -77343 -37414 36847 24762 -6962 -8540 -14116 -24231 11384 36172
82C6172m9305l1590L9687M0833k5806l2192K0696J1862j0292O356R558j6001j5171
$$ 36172 -13133 -44723 -5036 35797 9991 -22201 -1505 10357 65 6421 15979 -22 -15193
95a5193K7461R521l1057J203K5288j2667l0563K3862L1938l6828k6308L5890J9555
$$ -15193 12268 21789 -9268 -8065 17223 4556 -26007 -2145 29793 -7035 -33343 2547 22102
108B2102l5973j4603L9265N405l3373J892K5872j865k0360J0232J3896j6646p11
$$ 22102 -13871 -28474 10791 16196 -17177 -15285 10587 8722 -11638 -1406 12490 -4156 -4867
121d867K1857l747k9849O371L8411r884l7400O567K9757m254k3282O594Q094j2666
$$ -4867 16990 13243 -16606 -10235 28176 18292 -19108 -12541 17216 12962 -10320 -3726 4368 -8298
135h298K228J3586n633j6530P605J3602j3165m615J7203K246j9910k242K5604
$$ -8298 -6070 7516 1883 -14647 -7042 6560 -6605 -11220 5983 8229 -11681 -13923 11681
148A1681K749k2394k145J7649N499j2532j191N807n892P51J0511j421j6614k228
$$ 11681 14430 -7964 -10109 7540 13039 507 -684 5123 -769 -18 10493 9072 -7542 -9770
162i770J7663J326j3590k973N695ml565N981J144r484q51O940L202k956Q87L83
$$ -9770 7893 9219 -4371 -7344 -1649 -1653 -5218 763 1907 -7577 -8428 -1488 1714 -1242 -355 28
178B8o764N022J3274l577j7515J53K3085M694k1462r741J4777J2617r006r922
$$ 28 -6736 -1714 11560 7983 -9532 -9379 13706 18400 -3062 -12803 1974 14591 5585 -4337
192d337J801K092J337K097j523p784j872J0004J794r230k859P446L596n986j015
$$ -4337 -2536 -444 893 2990 1467 -6317 -8189 1815 3609 -5621 -8480 -1034 2562 -3424 -4439
207d439L668PP06K740m4m880R26P176k99n108j31M158n86m414K211K445l891k494
$$ -4439 -771 -764 -58 2682 2638 -2242 -1316 5860 5561 453 322 4480 3894 -520 1691 4136 245 -2249
225b249L625J669p015k160P280J407o475k743M203J732j432J752p46l356K065
$$ -2249 1376 3045 -3970 -6130 1150 2557 -3918 -6661 -2458 -726 -2158 -406 -1152 -4508 -2443
240b443N770k69n731J872N618j667l902K181M355k896l820L440K124l919k949
$$ -2443 3327 3058 -2673 -801 4817 3150 -752 1429 5784 2888 -932 2508 4632 713 -2236
255b236L211J888l769j004R14k221l76M229O51o869j386P252J934m995j427M372
$$ -2236 975 2863 -906 -1910 -996 -3217 -3593 636 1287 -5582 -6968 284 2218 -2777 -4204 168
271A68J115k120J456J317j518O64L395n44n108Q76N928o18n517r16M016q63l582
$$ 168 1283 -837 619 1936 418 1082 4477 3933 -1175 -299 5629 5011 -506 -1422 2594 1731 -1851
288a851J620J489k917j970K231N90k411R92J725k137j200L212J660l183j6M500
$$ -1851 -231 1258 -1659 -3629 -1398 -808 -3219 -2227 -502 -2639 -3839 -627 1033 -2150 -2166 2334
304B334K26l970L49M782O49l543K5K008p46j199J646M21l429o36K507q07k813
$$ 2334 2560 -1410 -1061 3721 4370 827 852 2860 2114 915 2561 2982 -447 -1083 1424 617 -2196
321b196M75K144j820k260J620R38j388LK005k31k012J036K562o2q92R01R73j077
$$ -2196 -1721 423 -1397 -3657 -2037 -1099 -2487 -2484 -479 -710 -2722 -1686 876 814 -78 823 1796 719
339G19J27K324k9k046j30J881o37k293O04J389j180j739q5l5p59Q93Q86k106j728
$$ 719 846 3170 3141 1095 965 2846 2209 -84 520 1909 729 -1010 -1095 -1130 -1889 -996 -110 -2216 -3944
358c944J528K181p26j354J158J043n84k20J671J035q03j13P18K54j09M30M8r14
$$ -3944 -2416 -235 -961 -2315 -1157 -114 -698 -918 753 1788 985 872 1590 1844 1735 2165 2213 1299
376A299RP58j102j523M97J192o49k058o23L92L97M99p8j194j130J102K202N1j331
$$ 1299 1308 2066 964 -559 -62 1130 481 -1577 -2200 -1808 -1411 -912 -990 -2184 -3314 -2212 -10 41 -1290
395a290j91J371P44J03N58q4m14O09J408l84j825q9J569O46j318j934m31J025
$$ -1290 -1481 -110 634 737 1295 1211 797 1406 2814 2430 605 516 2085 2731 1413 -521 -952 73
413G3O28o71j395o95l7N16M35l26l38J44K95L0K50P71P13L19n35o94J453K151
$$ 73 701 30 -1365 -2060 -2097 -1581 -1146 -1472 -1810 -1666 -1371 -1341 -1091 -320 393 712 177 -517 936 3087
433C087m85k521o7K619P81k056j817O45J520m0j775j613K2J090Q89k64k303k066
$$ 3087 2602 81 14 2633 3414 1358 -459 186 1706 1666 -109 -1722 -1700 -610 279 15 -2288 -4354
451d354J560L624L90l460j581K382K402J28j079m62O55R42Q01L13p47j378M99
$$ -4354 -2794 830 1220 -2240 -3821 -1439 963 1091 12 -450 205 1147 1948 2261 1514 136 635
468F35K546K59l353j702K445J952j973k589oJ384J66j133m72M97k1j043P7J663
$$ 635 3181 3440 87 -1615 830 2782 809 -1780 -1786 -402 -236 -1369 -1841 -1344 -1365 -2408 -2331 -668
486f68P11p24k63J85j03J032K051M0k157p70K211K104r48l043p13L092K012k784
$$ -668 43 -681 -944 -759 -862 170 2221 2261 104 -666 1545 3649 2701 -342 -1055 2037 4049 1265
504A265l808P70L045M92k277k086j07J458J368l24j744j340O00K534J882j567
$$ 1265 -2543 -1773 1272 1764 -513 -2599 -2706 -1248 120 -204 -1948 -3288 -2688 -154 1728 161
520A61k755Q57L388M41j966J15J583j1p72K30N30n01p22M3R44k17j951p85J403
$$ 161 -2594 -1737 1651 2092 126 241 1824 1813 1041 1271 1801 1300 578 621 1565 1348 -603 -1388 15
539A5K94j766q5J361j069j934J138K717l60k996p55L132K760j105k816O4K408
$$ 15 309 -1457 -1542 -181 -1250 -3184 -2046 671 311 -2685 -3440 -308 2452 1347 -1469 -1405 1003
556A003R80k96K73p86j549J245K627j150l685l3L430R61l139k908R18K741J66
$$ 1003 1983 1687 1960 1174 -375 870 3497 2347 -1338 -1371 2059 3020 -119 -3027 -2109 632 798
573G98k407o48Q89k39k41J569M52k003m60K269J511r08r28M83R38K68l21L71Q03
$$ 798 -1609 -2257 -1368 -1607 -1848 -279 173 -1830 -2290 -21 1490 582 -346 137 1075 1343 1022 1393 2196
592B196p08j464N88J697r40k235K38J886l32j989j012O42P68N4l82l24k79m50
$$ 2196 1488 24 612 2309 1369 -866 -628 1258 926 -1063 -2075 -1433 -665 -611 -993 -1317 -1596 -2046
610b046N90J851J56k048j49K362J038j074m94L93L84N84L74n17n92O4K52k91j88
$$ -2046 -1456 395 551 -1497 -1646 716 1754 680 186 579 963 1547 1921 1404 812 876 1128 837 649
629F49n32m65K91M21q14j157k15O56N86j92o29j79N05J0j6J080P63r15n52J205
$$ 649 117 -348 -57 364 -450 -1607 -1822 -1166 -580 -772 -1401 -1580 -1075 -1065 -1081 -1 762 -153 -705 500
649E00Q68l16J11J15o78J80J322j33j705n23J198K48j055j055J41P22J65r62j039
$$ 500 1368 1052 1163 1278 600 780 2102 1969 264 -259 939 1187 132 -923 -782 -60 105 -857 -1896
668a896n6P92R28j04j003m71R02J007l3j19L87o7K67P59j52o69N70J023p87j057
$$ -1896 -1952 -1160 -232 -336 -1339 -1810 -908 99 66 -53 334 267 534 1293 1141 472 1042 2065 1278 221
688B21O51N37q94m75L65m04p70Q6L79l74n81j07K41lj59L96N15k22k68M30M81
$$ 221 872 1409 515 40 405 1 -769 -683 -304 -678 -1259 -1366 -1125 -1128 -1287 -891 -376 -598 -866 -436 45
709D5M1N54N62n05n33Q22P52o06l18N41k18q66J01L54m59n17J04k72o23K6L65
$$ 45 86 640 1202 697 164 986 1738 1132 814 1355 1137 271 372 726 267 -250 -146 -418 -1041 -1015 -650
730f50n3o41j00M45J36j48L57O11j93l35N03O68p0K45M88l84m59N63O66n27o38
$$ -650 -703 -1344 -1444 -999 -863 -1011 -654 -43 -236 -571 -68 600 530 775 1263 879 420 983 1649 1122 484
751D84M07J07p57m04K91rm25m17j87j22p6K95J8k94j10L35K37Q0K80M32o6j00
$$ 484 891 998 241 -163 128 119 -306 -723 -910 -1032 -1108 -813 -795 -1089 -1199 -864 -627 -547 -267 165 99 -1
773aL64M35j6J17L03j15m58M6M46r0m51j68j13m26l43J90J24m51m29m0M8k8K07
$$ -1 363 798 782 899 1202 1087 629 675 1121 1031 580 412 299 -127 -470 -280 -156 -607 -1036 -1076 -1028 -1056 -849
796h49J28j34m3K15L66K39J87K73M7p9K24M09J43j08q7M8k78j69J72Lm12l78j12
$$ -849 -721 -855 -898 -683 -317 -78 109 382 429 350 574 983 1126 1018 931 979 701 532 704 707 295 -83 -195
819a95j38k25l9J2k25k43R1k8r5K78M16J16l77J09O06L94J0J59P5L4m7K43K97
$$ -195 -333 -558 -597 -585 -810 -1053 -962 -990 -1085 -807 -391 -275 -652 -543 63 457 467 626 701 735 688 931 1228
842A228k17l65L9N5l75k37R8q7m32k16j62j30j11K83j19k17k10K26K96K23K23
$$ 1228 1011 646 685 740 365 128 226 139 -293 -509 -671 -801 -912 -629 -748 -965 -1175 -949 -653 -430 -207
863b07R2p0k1M50N04J36j75k8J25l8P9K12j80l99j99J13j77l01m8j48k64j29k6
$$ -207 -115 -185 -206 244 748 884 709 681 806 768 847 1059 879 480 281 394 217 -84 -132 -280 -544 -673 -699
886f99k08j08K88K17k82k11J89N39K18J08M0k6N1L94N34j5m12ML08j6k85jk4k59
$$ -699 -907 -1015 -727 -510 -792 -1003 -814 -275 -57 51 91 65 116 510 1044 1029 617 621 929 913 628 627 603 344
910C44k38l9k82k57M2jk22j88n2q1R0L35J81k51j11L59L91J60O7K81q1k48L68
$$ 344 106 67 -215 -472 -430 -431 -653 -841 -893 -974 -884 -549 -368 -619 -730 -371 20 180 247 528 447 199 567
933E67P34J7q48j36M86R7n11j06J25l69l64J25l2m84j62L84Om39k23J98M84J63
$$ 567 1301 1318 470 334 820 917 406 300 425 56 -308 -183 -215 -699 -861 -477 -471 -910 -1133 -935 -451 -288
955b88k6j78J03L56L55J27M3P4j7KK07M29k46n77l7M18p5o00m6K53m41n92K14
$$ -288 -314 -492 -389 -33 322 449 492 566 549 551 758 1187 941 364 327 745 670 70 24 277 -164 -756 -542
978e42K44n00l16N53K88n84l25M51O18kp4J09L2J01K93M46J27k86j98K58L27r0
$$ -542 -298 -798 -1114 -561 -273 -857 -1182 -731 -113 -115 -189 -80 -48 53 346 792 919 633 435 693 1020 930
1000I30l73k42m0J97j41n30j24K97k03o82R5M53k55l55M19L31o03j15Q02L39l98
$$ 930 557 315 275 472 331 -199 -323 -26 -229 -911 -816 -363 -618 -973 -554 -223 -826 -941 -139 200 -198
1021a98Q2M98Rk42K58N53J67n85k63L83K74l78l00J2j30k66J47j00m55r6K19k97
$$ -198 -116 382 391 149 407 960 1127 542 279 662 936 558 258 270 140 -126 21 -79 -534 -630 -411 -708
1043g08r0K67k19j44N75L03o02j97Q98N79l49k16L07J08j44K76L16m4o02o4N55
$$ -708 -798 -531 -750 -894 -319 -16 -618 -815 83 662 313 97 404 512 368 644 960 916 314 250 805
1064H05j05q16PN48k97p77J76L29m50k66K89j9l48L10L88l27k0M32L7j01K45N23
$$ 805 700 -116 -109 439 142 -635 -459 -130 -580 -846 -557 -576 -924 -614 -226 -553 -573 -141 -104 -205 40 563
1086E63L4j55%K0Q8J01K39%n30k84L47J53o48k49L97j80o03P5L16l65k59M66J24
$$ 563 597 442 442 462 550 651 890 890 360 76 423 576 -72 -321 76 -104 -707 -632 -316 -681 -940 -474 -350
1109c50m41P8O26J0k98K57K33K4K30K78K7l06K8K22P4o1q8R7k96l69pJ84k62k82
$$ -350 -791 -713 -87 -77 -375 -118 115 139 369 647 674 368 396 618 692 631 543 640 344 -25 -32 152 -110 -392
1133c92K01j02o26Q3M94j22l82K81M07l64j00N64K83k39Q3L49K7q4L21R6j98l00
$$ -392 -191 -293 -919 -836 -342 -464 -846 -565 -158 -522 -622 -58 225 -14 69 418 445 361 682 778 580 280
1155B80J68K02j33k50P3r8m19j57K43m3m34PJ56l58j34M22L11m53P0M33Jj75L77
$$ 280 448 650 517 267 340 242 -177 -334 -91 -134 -568 -561 -405 -763 -897 -475 -164 -617 -547 -114 -113 -288 89
1178H9L05j47j13M01J34j91P5Q1o9k65pK23j63l32j6Mk83l05K22J26l07j57K03
$$ 89 394 247 134 535 669 478 553 634 565 300 293 516 353 21 5 9 -274 -579 -357 -231 -538 -695 -492
1201d92p4k12K39M46j51j90L52K19j33K32L18r0j54J85J70l3j78J54o2k96j75
$$ -492 -566 -778 -539 -93 -244 -434 -82 137 4 236 554 464 310 495 665 632 454 608 546 250 75
1222G5P3O5k89k40N6j28j99P7K78k51k31K36J33k10J25M12j7j99K16L03L6o2L29
$$ 75 148 213 -76 -316 -260 -388 -587 -510 -232 -483 -714 -478 -345 -555 -430 -18 -35 -234 -18 285 321 259 588
1245E88K5j97L2J73o2j53r0M2k17k42N8L5k33k28N0Lj85p8L68j15j75O8K93p5
$$ 588 613 416 448 621 559 406 316 358 141 -101 -43 -8 -241 -469 -419 -416 -601 -679 -311 -426 -601 -533 -240 -315
1269c15P8L15J63j39J3L10Nm5O8J96j96j38O9K36l03j64p4o8k54p2K30j47k56
$$ -315 -237 78 241 102 115 425 430 385 453 649 453 315 384 620 317 153 79 11 -243 -315 -85 -232 -488
1292d88j16J75n6j30K65J08p9q0L02J40k6J65K02m8r0J84J59j5q6l6k2j87p0J31
$$ -488 -604 -429 -485 -615 -350 -242 -321 -401 -99 41 15 180 382 334 244 428 587 572 486 450 428 241 171 302
1316C02q6l30o8J5j61r2Q2k1j73q7J97j0k0J80J27p2JK31K00OR4J09J4j13J37
$$ 302 216 -114 -182 -167 -328 -420 -338 -359 -532 -619 -422 -432 -452 -272 -145 -217 -216 15 215 221 315 424 438 325 462
1341D62J20o1j01k9p1j39n8Mo7k50j53J3p4n1N4Qj53J9J46M2K6J46J94lo7J32
$$ 462 582 521 420 391 320 181 123 127 60 -190 -343 -330 -404 -455 -401 -393 -546 -527 -381 -339 -313 -167 27 24 -43 89
1367H9J97N6L0R5j3j33K8J54m4j85j01l0r6j25J9q5j94o6K4k6m1M8Q0j7r3J51
$$ 89 286 342 372 467 454 321 349 503 459 274 173 143 47 -78 -59 -144 -338 -404 -380 -406 -447 -399 -319 -336 -429 -278
1393b78R8J38KJ87J08j42O5K35J12q4J2%j09o2MJ9j34j43r2n9o2k9o3j29n1K6
$$ -278 -180 -42 -40 147 255 113 178 413 525 441 453 453 344 282 286 305 171 28 -64 -123 -185 -214 -277 -406 -457 -431
1419d31L7LL5M7Q5J4K6J63J37oJ75J16j44k3K44O6m9j44K0q4l5l9j3j71k16n0
$$ -431 -394 -391 -356 -309 -224 -210 -184 -21 116 110 285 401 257 234 478 544 495 351 371 287 252 213 200 29 -187 -237
1445b37J6j5q2r0k3K2o3N7R2M7N0N3R1R2J64O0M4M9K6j4q8J92J73k99p8Lo7j35
$$ -237 -221 -236 -318 -408 -431 -409 -472 -415 -323 -276 -226 -173 -82 10 174 234 278 327 353 339 251 443 616 317 239 242 175 40
1473D0k4po4k06j26P2J3q2m3R5n5k3O2J47R6nJ45N3L9J4J86J07n8l1N7j27J04
$$ 40 16 9 -55 -261 -387 -315 -302 -384 -427 -332 -387 -410 -348 -201 -105 -110 35 88 127 141 327 434 376 345 402 275 379
1500C79N3j86j54o4J5j09o7O1n7k24p9L5K2j3jJ33j0m4O9K02L6LO7K27j0o5J69
$$ 379 432 246 92 28 43 -66 -133 -72 -129 -353 -432 -397 -375 -388 -389 -256 -266 -310 -241 -39 -3 0 67 294 284 219 388
1527C88K5q8k0mK3r1Op3j35j43Pr5oM4j42j33l5J38k8P9O6j1R6k9K9K48O6l1R8
$$ 388 413 325 305 301 324 233 239 166 31 -112 -105 -200 -206 -162 -304 -437 -472 -334 -362 -283 -217 -228 -132 -161 -132 116 182 151 249
1556B49J28o9pJ23O7k17l9N8n9r6n0Rk01o8l5n8o2N7r3k8K8l1J13J41J1l2R8N2
$$ 249 377 308 301 424 491 274 235 293 234 138 88 97 -104 -172 -207 -265 -327 -270 -363 -391 -363 -394 -281 -140 -129 -161 -63 -11
1584a1J04R0Q4R8j10R8L3j15P7P2j12j80O2m1j95l6J2o5j78rQ3l4m6rJj8O0J47
$$ -11 93 183 267 365 255 353 386 271 348 420 308 128 190 149 -46 -82 -70 -135 -313 -322 -239 -273 -319 -328 -327 -345 -285 -138
1612a38Q2L9j02J43J50l3J21J45p5p7j8J25q2m2Q1q5k14j8Rj70k5M2n2j52J6L9
$$ -138 -56 -17 -119 24 174 141 262 407 332 255 237 362 280 238 319 234 20 2 11 -159 -184 -142 -194 -346 -330 -291
1638b91M0r5K7P6K4N9J72M3K5j0N9J56k0J4J57n9j07q1J44p4p3ml7k39m4O9j23
$$ -291 -251 -346 -319 -243 -219 -160 12 55 80 70 129 285 265 279 436 377 270 189 333 259 186 182 145 -94 -138 -69 -192
1665a92n2l4k0m1j4P7J2M9l6J16J4O9Q2J27R4q6L2J32M5j19J29m5j50m9J08n6
$$ -192 -244 -278 -298 -339 -353 -276 -264 -215 -251 -135 -121 -52 30 157 251 165 197 329 374 255 384 339 189 140 248 192
1691A92j59j7nj41j38R5k4r3o1N4l1l7R4Q9R6J4m2J01R0M6P5J46q9l8Q5L9o1n
$$ 192 33 16 11 -130 -268 -173 -197 -290 -351 -297 -328 -365 -271 -182 -86 -72 -114 -13 77 123 198 344 255 217 302 341 280 275
1719B75O5j53j15pN3j30l9o8o1j39N4P1n4o1N8K3JK0J54N2Jj6R8R6j5R4N2j4j10
$$ 275 340 187 72 65 118 -12 -51 -119 -180 -319 -265 -194 -248 -309 -251 -228 -227 -207 -53 -1 0 -16 82 178 163 257 309 295 185
1748A85Q4J5m3p9J6n2j52l2%Jj26Jo4l8k3M2O9p0M3P8L0L2J53J0Pj7N7J70j8r
$$ 185 269 284 241 162 178 126 -26 -58 -58 -57 -183 -182 -246 -284 -307 -265 -196 -266 -223 -145 -115 -83 70 80 87 70 127 297 279 270
1778B70M2l9m4mm9M0j12n5k9j82j4M1m7j20P8m4j0kP4J4j3QJ07N7K7Q5P3RkP3
$$ 270 312 273 229 225 176 216 104 49 20 -162 -176 -135 -182 -302 -224 -268 -278 -280 -206 -192 -205 -197 -90 -33 -6 79 152 161 159 232
1808B32Q2k5k5J6j2r3m3J3j7p6q6l7j13q5O6K4r1n1N4J4PJ08K6P2p7O3J03P5L0
$$ 232 314 289 264 280 268 175 132 145 128 52 -34 -71 -184 -269 -203 -179 -270 -321 -267 -253 -246 -138 -112 -40 -117 -54 49 124 154
1837A54L7N0m2JP2Qp8Km3j08l0K7mj25n8l4j3r1K6L5o2J9pP6O1P4M1K2j2L9Q0
$$ 154 191 241 199 200 272 280 202 204 161 53 23 50 46 -79 -137 -171 -184 -275 -249 -214 -276 -257 -264 -188 -127 -53 -12 10 -2 37 117
1868A17J17k1k6Q8m4L5n4Om1o0j0o8j07l3L4p6r5N6n6oqK7N7jm3R0J18JK4J16
$$ 117 234 213 187 275 231 266 212 218 177 117 107 39 -68 -101 -67 -143 -238 -182 -238 -244 -252 -225 -168 -169 -212 -122 -4 -3 21 137
1898A37n0N3R3L6m9kqO3o5o7K4o2q7o5k9j8p4j0j1o2n2M8L5k0J38K8q9O8Q0O3
$$ 137 87 140 233 269 220 218 210 273 208 141 165 103 16 -49 -78 -96 -170 -180 -191 -253 -305 -257 -222 -242 -104 -76 -165 -97 -17 46
1928D6K1M2L6L8m2J1J03L3j28M4l4l5j06J01j12p5Qn2n7l7j9M6r9L1MM5L1Q3J9
$$ 46 67 109 145 183 141 152 255 288 160 204 170 135 29 130 18 -57 -49 -101 -158 -195 -214 -168 -267 -236 -232 -187 -156 -73 -54
1957e4k7N4J5J42K6J7K1Q7j12L1N3Op0l1n0n3k4m5op9p7k2J2k8k3L6M3j00R1N7
$$ -54 -81 -27 -12 130 156 173 194 281 169 200 253 259 189 158 108 55 31 -14 -20 -99 -176 -198 -186 -214 -237 -201 -158 -258 -167 -110
1987a10N9J4rN0K4J29pK6L7j8M6r0Q1n1k4j5m9q7n0on8N7j42l2mK3n4L2P6NoM5
$$ -110 -51 -37 -46 4 28 157 150 176 213 195 241 151 232 181 157 142 93 6 -44 -50 -108 -51 -193 -225 -229 -206 -260 -228 -152 -147 -153 -108
2019a08J24k2K9P9L6n2J00O9J3l2o6J0r3N0MOn5j64Mq7M9o1N4n2j04J8J5J01p7
$$ -108 16 -6 23 102 138 86 186 255 268 236 170 180 87 137 141 147 92 -72 -68 -155 -106 -167 -113 -165 -269 -251 -236 -135 -212
2048b12J17j9J0N1J63o9Q0J7K3N1No7P6J4l2p7L2m7p1m2k3p2m8l9J5m4j0O8q1
$$ -212 -95 -114 -104 -53 110 41 121 138 161 212 217 150 226 240 208 131 163 116 45 3 -20 -92 -140 -179 -164 -208 -218 -150 -231
2077b31NM7L9k0J53o4M9P5L1O9K3O8m1k8K7mnJ1j04J6p0om8o1M9r7q1Q4ll7K1
$$ -231 -226 -179 -140 -160 -7 -71 -22 53 84 153 176 244 203 175 202 198 193 204 100 116 46 40 -8 -69 -20 -117 -198 -114 -117 -154 -133
2108a33j14O6j7O8P8mK0O6K8JQ6J1l6M4pP9r3Ql6L1o8p3mn2rql4n2p6L9O8o4J8
$$ -133 -247 -181 -198 -130 -52 -56 -36 30 58 59 145 156 120 164 157 236 143 151 115 146 78 5 1 -51 -60 -68 -102 -154 -230 -191 -123 -187 -169
2141a69N6K5l6J12L3N9n9L4P9l4O3N6m7J6o7L8k5k2l7q0no2Kk9j7n0J5l3k2M3
$$ -169 -113 -88 -124 -12 21 80 21 55 134 100 163 219 172 188 121 159 134 112 75 -5 -10 -72 -70 -99 -116 -166 -151 -184 -206 -163
2171a63K7j6RO7L2m0Q0O8K7l3O4M8l8J8N8pj7o2Lj3l7o6l0Nj03mk5M5l0m8o3J20
$$ -163 -136 -152 -143 -76 -44 -84 -4 64 91 58 122 170 132 150 208 201 184 122 125 112 75 9 -21 -16 -119 -123 -148 -103 -133 -181 -244 -124
2203a24o5R5k5J4N7O3k6P2N1Q5q6M5k9K4Ml4j2j3j4k9J2l1k8l0m5n8l7j9O0k7
$$ -124 -189 -94 -119 -105 -48 15 -11 61 112 197 111 156 127 151 155 121 109 96 82 53 65 34 6 -24 -69 -127 -164 -183 -123 -150
2233a50j6K4lk0Q4J6MJ04K3O6q8J16N0q2l5M4K1j7mJ5j12q8O8m0Qo2n1J0m9j2
$$ -150 -166 -142 -145 -165 -81 -65 -61 43 66 132 44 160 210 128 93 137 158 141 137 152 40 -48 20 -20 -12 -74 -125 -115 -164 -176
2263a76L7l9k8NO8N4m1P9O2M8l5R2K7m0K1O2n3nl4K9q3K7j2l5mj55L9J8o9q1P9
$$ -176 -139 -178 -206 -201 -133 -79 -120 -41 21 69 34 126 153 113 134 196 143 138 104 133 50 77 65 30 26 -129 -90 -72 -141 -222 -143
2294a43n7J4L0N6Oo5O6R5M3l8N1K5M9J5Jl0K4mnpk6j8o4o5M8n1j7n2n0O2Kn2K9
$$ -143 -200 -186 -156 -100 -94 -159 -93 2 45 7 58 83 132 147 148 118 142 138 133 126 100 82 18 -47 1 -50 -67 -119 -169 -107 -105 -157 -128
2327a28plOM3N%N6lM3L7N5J3L0p4Q6Mm3L1n7L2r3J2n7J1m5J5q1k8K2l9K2j9MN2
$$ -128 -135 -138 -132 -89 -84 -84 -28 -31 12 49 104 117 147 73 159 163 120 151 94 126 33 45 -12 -1 -46 -31 -112 -140 -118 -157 -135 -154 -150 -98
2361i8l8P6L4J7jK6M0J7O1nM2l1p0M8O2q4p3om5JLm6jm6Pl2MK6o3P5Oj9L5J7M0
$$ -98 -136 -60 -26 -9 -10 16 56 73 134 129 171 140 70 118 180 96 23 17 -28 -27 -24 -70 -71 -117 -110 -142 -138 -112 -175 -100 -94 -113 -78 -61 -21
2396b1O3O6rQm2Q1rK3qo4M5l6M3m0q3j0o5L5l2lL2n2o9k6QK1N0n5L3K2L7J8J09
$$ -21 42 108 99 107 65 146 137 160 152 88 133 97 140 100 17 7 -58 -23 -55 -58 -26 -78 -147 -173 -165 -144 -94 -149 -116 -94 -57 -39 70
2429G0l0M9lPm0R8Pk5j2MMp1rN6j25L3q7l9N7k4m3j2J5l6jK3P6NPl4J1P0Q8j0
$$ 70 40 89 86 93 53 151 158 133 121 125 129 58 49 105 -20 13 -74 -113 -56 -80 -123 -135 -120 -156 -157 -134 -58 -53 -46 -80 -69 1 89 79
2463G9M2n0o7J06K4l4rl0jk1p1N2J3q4q3J2JK8ll0oMP7p8R4PK1Mj3M0N7lJ7K2
$$ 79 121 71 4 110 134 100 91 61 60 39 -32 20 33 -51 -134 -122 -121 -93 -96 -126 -132 -128 -51 -129 -35 -28 -7 -3 -16 24 81 78 95 117
2497A17J7k7j6K5j0qm0j2n1K2p0N1p4k2P0o8m8K3N0m9n2J12K5K3j0O1P%L8QP9
$$ 117 134 107 91 116 106 98 58 46 -5 17 -53 -2 -76 -98 -28 -96 -144 -121 -71 -120 -172 -60 -35 -12 -22 39 46 46 84 92 171
2528A71j8m5J0K3K7j11L1m5j3k4m1k9MK4n0r6N0m2Q6q8O4L5RN9k9N9K1J1J6J2
$$ 171 153 108 118 141 168 57 88 43 30 6 -35 -64 -60 -36 -86 -182 -132 -174 -88 -176 -112 -77 -68 -9 -38 21 42 53 69 81
2558H1L6Kl9Q5r0L3J0n8J3m2n3j4j6jm6k0K1k9M3j3J8l1L4J8JPN6K2M3J5m3K7
$$ 81 117 119 80 165 75 108 118 60 73 31 -22 -36 -52 -53 -99 -119 -98 -127 -84 -97 -79 -110 -76 -58 -57 -50 6 28 71 86 43 70
2590G0K1L9o7N5pp2MqK0o1m6N2p9K4l2k4nL8p6N6K4o7P7qN9JL3k0L1J09L4p3l1
$$ 70 91 130 63 118 111 39 43 35 55 -6 -52 0 -79 -55 -87 -111 -116 -78 -154 -98 -74 -141 -64 -72 -13 -12 21 1 32 141 175 102 71
2623G1L5%k8KL6m2o9j9m1K5jn4j5Mm6j7MP6M6p3K4L8%P2j3K3oK6N5l7K8Ok5mL4
$$ 71 106 106 78 80 116 74 5 -14 -55 -30 -31 -85 -100 -96 -142 -159 -155 -79 -33 -106 -82 -44 -44 28 15 38 32 58 113 76 104 110 85 81 115
2658A15o4J4mr0L6o5J8M8j03L3o6K0L0Lk4jM9k3K1J3K9M8J9j3J9J3L1j4P8k7o6
$$ 115 51 65 61 -29 7 -58 -40 8 -95 -62 -128 -108 -78 -75 -99 -100 -51 -74 -53 -40 -11 37 56 43 62 75 106 92 170 143 77
2689G7rJJ2l8l6J0m7k7M8j28J1Q7p7m7M9N8jJ2K5m4M0P2k3R5m8M1n1j5O9n6O1
$$ 77 68 69 81 43 7 17 -30 -57 -9 -137 -126 -39 -116 -163 -114 -56 -57 -45 -20 -64 -24 48 25 120 72 113 62 47 116 60 121
2720A21p3l2J8l1rql9J1l2J4k1j8J1Mj3l8O7k7N4K4QM0mmL1N3m3L3RK8j31N8k6
$$ 121 48 16 34 3 -6 -14 -53 -42 -74 -60 -81 -99 -88 -84 -97 -135 -68 -95 -41 -17 -9 31 27 23 54 107 64 97 106 134 3 61 35
2753C5ON9j35j5oL0k8k6n0OM3J4qo9Q5Qj1O3N7l4J9J8NK4LJJJ5Pp5J9k2LK5o5
$$ 35 41 100 -35 -50 -56 -26 -54 -80 -130 -124 -81 -67 -75 -144 -59 -51 -62 1 58 24 43 61 66 90 93 94 95 110 117 42 61 39 42 67 2
2788Bn8K8%j01N8m6M9m7N5k6Pl8N2l0N1K0L8L7j4k7J6P4K1o8Q5l7q1Q2m5j4m5
$$ 2 -56 -28 -28 -129 -71 -117 -68 -115 -60 -86 -79 -117 -65 -95 -44 -24 14 51 37 10 26 100 121 53 138 101 20 102 57 43 -2
2819bRl5K0q5K4lo0P2l5j9jPO7K0j5K2O9kM5j02M9Q1o8L3k0M0o0J4m7J1J4j7o3
$$ -2 7 -28 -8 -93 -69 -72 -132 -60 -95 -114 -115 -108 -41 -21 -36 -14 55 53 98 -4 45 126 58 91 71 111 51 65 18 29 43 26 -37
2852c7j1ok2J5l2kl2N7l6N5KRO6m9N4j8NQ1J0j6J9l4l5L3l0J0n0N3n4rL6j13K8
$$ -37 -48 -54 -76 -61 -93 -95 -127 -70 -106 -51 -49 -40 26 -23 31 13 18 99 109 93 112 78 43 76 46 56 6 59 5 -4 32 -81 -53
2885e3p6K1pL7k5OJ1kLQK9K9MO5l1P3jj7JOK3l1LJ7Ro8Qm2k4j0l0kJ5l2lL2n1
$$ -53 -129 -108 -115 -78 -103 -97 -86 -88 -85 -77 -48 -19 -15 50 19 92 91 74 75 81 104 73 76 93 102 34 42 0 -24 -34 -64 -66 -51 -83 -86 -54 -105
2922a05J8L7n6K2O0j7J7J12j09P7J6Qk9pN1p2OJ8rLL9m2j7pn9NK2n9rPK7k0k6
$$ -105 -87 -50 -106 -84 -24 -41 -24 88 -21 56 72 80 51 44 95 23 29 47 38 41 80 38 21 14 -45 -40 -18 -77 -86 -79 -52 -72 -98
2955i8J2L4Lk8M8N6j0J8O4o1J5L9o5j4M1J8njm4K8o5L7o4k1rj0l2L4k5L5j2J5
$$ -98 -86 -52 -49 -77 -29 27 17 35 99 38 53 92 27 13 54 72 67 66 22 50 -15 22 -42 -63 -72 -82 -114 -80 -105 -70 -82 -67
2987f7pM2J3rK2P3kJ2l5L9l4L2M0q2M2l9Qn4Ll2L7n6J8p6M9L3j8j8l1K2j4lK7
$$ -67 -74 -32 -19 -28 -6 67 65 77 42 81 47 79 119 37 79 40 48 -6 -3 -35 2 -54 -36 -112 -63 -30 -48 -66 -97 -75 -89 -92 -65
3020f5P8k9M2jL0k6L9j9K5K7k4qk1J0J0j7Ok7m9l4L3k2m1J2Jk9M8m0j1M6j2oM4
$$ -65 13 -16 26 25 55 29 68 49 74 101 77 69 48 58 68 51 57 30 -19 -53 -20 -42 -83 -71 -70 -99 -51 -91 -102 -56 -68 -74 -30
3053c0K1J7M0k7J4j6P6k7j5J6k4k8L8j3p6L1l8K1k3KLrl3OJ0j5P4o7K2Lj3M1k3
$$ -30 -9 8 48 21 35 19 95 68 53 69 45 17 55 42 -34 -3 -41 -20 -43 -41 -38 -47 -80 -74 -64 -79 -5 -72 -50 -47 -60 -19 -42
3086d2N7L4K5k6j3Qk0M9m6J9j6J2L5l6n9l2K5l5l5J8K0Pp2O4K5j4M1m2N4J3l4
$$ -42 15 49 74 48 35 43 23 72 26 45 29 41 76 40 -19 -51 -26 -61 -96 -78 -58 -51 -123 -59 -34 -48 -7 -49 5 18 -16
3117a6K6M0L6K2l2k3K5l9J1pNj0j2j7m7M1k1l4o9N8j6j5j2K1K5j0L4j8L1J3K6
$$ -16 10 50 86 108 76 53 78 39 50 43 48 38 26 9 -38 3 -18 -52 -121 -63 -79 -94 -106 -85 -60 -70 -36 -54 -23 -10 16
3148A6JM5J3L2n6M6J0o1L9J1l3l0jj8k3R9j30j8K7j6jm9LL7n6L7K5m8L7OJ6K2
$$ 16 17 62 75 107 51 97 107 46 85 96 63 33 32 14 -9 90 -40 -58 -31 -47 -48 -97 -94 -57 -113 -76 -51 -99 -62 -56 -40 -18
3180a8L0J6L5J1jojL4jo6Q3q4K3ok9k8o9P1o5l5Q2o1M4l2mJ1K4j4K6L3mNK3J3
$$ -18 12 28 63 74 73 67 66 100 99 33 116 32 55 49 20 -8 -77 -6 -71 -106 -24 -85 -41 -73 -77 -66 -42 -56 -30 3 -1 4 27 40
3214D0M6n9M2j8m4M4Kk3J8l0k9J0KOp0NL3o3N0k2J9J1l4O1ONk6l9R2l0O3K0Qm4
$$ 40 86 27 69 51 7 51 53 30 48 18 -11 -1 1 7 -63 -58 -25 -88 -38 -60 -41 -30 -64 -3 3 8 -18 -57 35 5 68 88 96 52
3248E2J7Ol4K0L4p1l6KK9m3K1n2mL5n2L2K0m6L7k6%qM1m2Q2J3J7N1j15R2j4L2
$$ 52 69 75 41 61 95 24 -12 -10 19 -24 -3 -55 -59 -24 -76 -44 -24 -70 -33 -59 -59 -67 -26 -68 14 27 44 95 -20 72 58 90
3280I0l6JJ7pn5J9llm7RJ8p2Qk4J8J7m1jP2jm8RPQ6p1M6prL1J6J8M3m8K0m6j4
$$ 90 54 55 72 65 10 29 26 23 -24 -15 3 -69 -61 -85 -67 -50 -91 -92 -20 -21 -69 -60 -53 33 -38 8 1 -8 23 39 57 100 52 72 26 12
3316A2P9p0%k2l6j1J5NRRp0Pj2N0OJ9j14P9J04p9M7l0M1NmL9l3M7n2%l1K5n2J3
$$ 12 91 21 21 -1 -37 -48 -33 -28 -19 -10 -80 -73 -85 -35 -29 -10 -124 -45 59 -20 27 -3 38 43 39 78 45 92 40 40 9 34 -18 -5
3350eJo2N5q6N3m0J3L7k9j1l8M9J2L3J6l1M4k4Q3o6N8nJ6K6m3j4M6k9k5n4M5n8
$$ -5 -4 -66 -11 -97 -44 -84 -71 -34 -63 -74 -112 -63 -51 -18 -2 -33 11 -13 70 4 62 57 73 99 56 42 88 59 34 -20 25 -33
3382c3J2On5M1m1K3k3k4N3j8j5j2L4K1j4M4J3Pk2ML1J8K2Qj3j8j6M6j0mn1j2k0
$$ -33 -21 -15 -70 -29 -70 -47 -70 -94 -41 -59 -74 -86 -52 -31 -45 -1 12 19 -3 1 32 50 72 80 67 49 33 79 69 65 14 2 -18
3415a8m2N6m5J0l6J8L4o1K0M1k5O1l2M0kMpmM2L0m3J8oj8J0KK7m3lk2k3jl0j3
$$ -18 -60 -4 -49 -39 -75 -57 -23 -84 -64 -23 -48 13 -19 21 19 23 16 12 54 84 41 59 53 35 45 47 74 31 28 6 -17 -18 -48 -61
3449f1JJ0Q2p4j5K6j2J5nJ5k8O3j0k8K4N4n1K9N8n2m5J10k3o8k3M6lj9l8k0J5
$$ -61 -60 -50 32 -42 -57 -31 -43 -28 -33 -18 -46 17 7 -21 3 57 6 35 93 41 -4 106 83 15 -8 38 35 16 -22 -42 -27
3480b7o2J5O5l7jN7n8jK9qJ4J3l3K3Q0n2K6j4J8M4n4M0k0Lm8pm0K5J4l3rL9n8
$$ -27 -89 -74 -9 -46 -47 10 -48 -49 -20 -28 -14 -1 -34 -11 69 17 43 29 47 91 37 77 57 60 12 5 -35 -10 4 -29 -38 1 -57
3513e7l8K4rL9Ql9Nl2M4N9j1L6j0K1j4N1k7L1l0KL0Op6l8K7j5nj0%k4K3j9lN9
$$ -57 -95 -71 -80 -41 -33 -72 -67 -99 -55 4 -7 29 19 40 26 77 50 81 51 53 83 89 13 -25 2 -13 -18 -28 -28 -52 -29 -48 -51 8
3547Hm2l0K3J6mk4K2M9j7J3qL1k3L1LJ1nK7p2Q3r1l2jmK5j9n1J6M8J8r9kM7PM9
$$ 8 -34 -64 -41 -25 -29 -53 -31 18 1 14 6 37 14 45 48 59 54 81 9 92 1 -31 -32 -36 -11 -30 -81 -65 -17 1 -98 -100 -53 -46 3
3582C%J6l5L8j3N3m6%K0O7o1J1K4k6m3M3on5KN8p8O3r2k4k0L1m0N2J6K0m8Q4p
$$ 3 3 19 -16 22 9 62 16 16 36 103 42 53 77 51 8 51 45 -10 -8 50 -28 35 -57 -81 -101 -70 -110 -58 -42 -22 -70 14 7
3615Gk3N7Lq1P7P9n5k7NL7k9k5K6J9j6p5n0R4q1L8m2Om1P5j7Mk2NMl6O8M8l9L5
$$ 7 -16 41 44 -37 40 119 64 37 42 79 50 25 51 70 54 -21 -71 23 -58 -20 -62 -56 -97 -22 -39 -35 -57 -52 -48 -84 -16 32 -7 28
3649B8LJ5k8J8lL1%l9KK7j4Nj0J4l5Pm7K5n1k6M6l3j1j9N4K6Kj6mJ7L0J1J5J7
$$ 28 31 46 18 36 33 64 64 25 27 54 40 45 35 49 14 21 -26 -1 -52 -78 -32 -65 -76 -95 -41 -15 -13 -29 -33 -16 14 25 40 57
3683E7L2rl6L0m8nK5n8K0m1R6o7K3jm4%l4P0o8%O2J7oj01L0M6l7R2l1J0L4l7L
$$ 57 89 80 44 74 26 21 46 -12 8 -33 63 -4 19 18 -26 -26 -60 10 -58 -58 4 21 15 -86 -56 -10 -47 45 14 24 58 21 24
3716B4KJN0m9Kj0j3J2o5L4LJ4K6j05L4J5m9K2L6k8p2O2L3j7J6K2m4Q5P2q8l0J
$$ 24 26 27 77 28 30 20 7 19 -46 -12 -9 5 31 -74 -40 -25 -74 -52 -16 -44 -116 -54 -21 -38 -22 0 -44 41 113 25 -5 -4
3748dM6RKm1k4O0k9k4J6L7k7m0K5p7K6jj6O2q7N1J9q9L3N5l9L6RL0P0q1L1j3K6
$$ -4 42 51 53 12 -12 48 19 -5 11 48 21 -19 6 -71 -45 -46 -62 0 -87 -36 -17 -106 -73 -18 -57 -21 -12 18 88 7 38 25 51
3781E1k1QQk6M6j4j5nl4Ok2m8LjKJ8j8Pj4jkL8qK2j0O7j5M6n1j2J5M8k8J6m1J8
$$ 51 30 38 46 20 66 52 37 32 -2 4 -18 -66 -63 -64 -62 -44 -62 -55 -69 -70 -72 -34 -42 -20 -30 37 22 68 17 5 20 68 40 56 15 33
3817C3J3o0M3m5Lk6J1M2k5l2p2M9N8k7k4P7l2nNj7L2j3J3O1j9j2M7o3M3pj5nj2
$$ 33 46 -14 29 -16 -13 -39 -28 14 -11 -43 -115 -66 -8 -35 -59 18 -14 -19 -14 -31 1 -12 1 62 43 31 78 15 58 51 36 31 19
3850A9k3J0n3j1J4o9M5M4o9M3K7K0q2O2J9J5Lk7P1rJ8n6QK3j1oO1j9m2k3Mj5L8
$$ 19 -4 6 -47 -58 -44 -113 -68 -24 -93 -50 -23 -3 -85 -23 -4 11 14 -13 58 49 67 11 19 42 31 25 86 67 25 2 6 -9 29
3883B9mn4rlk6j8j2QM9q1M2N9n1K6P6p0M2K9L1n7J0O8mk8lRq5N9%k5J7j8pN1n1
$$ 29 25 -29 -38 -41 -67 -85 -97 -89 -40 -121 -79 -20 -71 -45 31 -39 3 32 63 6 16 84 80 52 49 58 -27 32 32 7 24 6 -1 50 -1
3918aL6j25N4o3P7oj8k2P1L3l9k0M6J1nj9Q1l9k1K8q6M8n5M5pK8j3mm4Qj8%K7
$$ -1 35 -90 -36 -99 -22 -28 -46 -68 3 36 -3 -23 23 34 29 10 91 52 31 59 -27 21 -34 11 4 32 19 15 -29 -21 -39 -39 -12
3951a2n4K4j6J8%K8Lj2oO0m7R7pj3n7PN1j1n8Q2l2pk4J3q8L9l1L5j3J9Rn0N8m4
$$ -12 -66 -42 -58 -40 -40 -12 -9 -21 -27 33 -14 83 76 63 6 13 64 53 -5 77 45 38 14 27 -61 -22 -53 -18 -31 -12 -3 -53 5 -39
3985c9OL5p2N6J1j6kN0lm2O6K6j16J58j39Q6j9k9L8j4m5k4J6J3m1K9m3M5l4j7
$$ -39 -33 2 -70 -14 -3 -19 -21 29 26 -16 50 76 -40 118 -21 65 46 17 55 41 -4 -28 -12 1 -40 -11 -54 -9 -43 -60
4015f0n0N2L1j8Om9O0j6P2K1o1M4k7k4M5P6j3r2J2lM0Qn2j8rJ7lo2P9j1p0K2P
$$ -60 -110 -58 -27 -45 -39 -88 -28 -44 28 49 -12 32 5 -19 26 102 89 -3 9 6 46 54 2 -16 -25 -8 -11 -73 6 -5 -75 -53 -46
4048d6K4RJ2l3Rk3K0M5J4Mj4L8p2nJ10n6k5K6J3q8N7Kl6N5k8k5j6kMl0J7lP0o4
$$ -46 -22 -13 -1 -34 -25 -48 -28 17 31 35 21 59 -13 -18 92 36 11 37 50 -38 19 21 -15 40 12 -13 -29 -31 -27 -57 -40 -43 27 -37
4082c7J2K6k2O3m7l4N8PK3j0J6jq7Q7k3rl4K9l6K9k5p1O8p2K5L6K3o5Pj9L6K7
$$ -37 -25 1 -21 42 -5 -39 19 26 49 39 55 54 -33 54 31 22 -12 17 -19 10 -15 -86 -18 -90 -65 -29 -6 -71 -64 -83 -47 -20
4114b0M2j3K1o3M5K0K3l1M4m2K2j2k5P0k5n3j8L9j6L5j4l5mk5l6J3P6p5NN9n7
$$ -20 22 9 30 -33 12 32 55 24 68 26 48 36 11 81 56 3 -15 24 8 43 29 -6 -10 -35 -71 -58 18 -57 -52 7 -50
4145e0Q8m7pK5rl1L7J5j1j4MK6K0K2j8l9J7j8j5M7o2L8k2m2MJ1l4J4rM1J1qrq
$$ -50 38 -9 -16 9 0 -31 6 21 10 -4 0 26 46 68 50 11 28 10 -5 42 -20 18 -4 -46 -42 -31 -65 -51 -60 -19 -8 -16 -25 -33
4179c3P0p8O2k0N0k9l2P4K0k8m1j9KJ9k6L4K5j8j02N5J8kn7KK5n3%P5RNk9kO8
$$ -33 37 -41 21 1 51 22 -10 64 84 56 15 -4 -2 17 -9 25 50 32 -70 -15 3 1 -56 -54 -29 -82 -82 -7 2 7 -22 -24 44
4212D4n1N4l0k1kL7l5K2L0M7p1m6j6L9pNmk6l5jM3m7K8K2K0k1rKJ9K6j0j7L0N1
$$ 44 -7 47 17 -4 -6 31 -4 18 48 95 24 -22 -38 1 -6 -1 -5 -31 -66 -67 -24 -71 -43 -21 -1 -22 -31 -29 -10 16 6 -11 19 70
4246G0jm4j5J3M8k4m3K7k4M9j3n2jj2qkL9k2l6J9J1m1K5j3LK7M8l1k3P6n4J3m2
$$ 70 69 25 10 23 71 47 4 31 7 56 43 -9 -10 -22 -30 -32 7 -15 -51 -32 -21 -62 -37 -50 -47 -20 28 -3 -26 50 -4 9 -33
4279c3J5M0j8L0j6jmqj2m0M9l5K3k4k2MN3k7J4m1N1j4J2njK4ppJ2NmK4k6m2O0
$$ -33 -18 22 4 34 18 17 13 5 -7 -47 2 -33 -10 -34 -56 -52 1 -26 -12 -53 -2 -16 -4 -9 -10 14 7 0 12 17 13 37 11 -31 29
4314B9%m0O7n4Kj9rK8knj9K1qj3j1N7m4j4oO5m5J3M7Ol1Nj2j2P3m7K0l2Lm5N6
$$ 29 29 -11 56 2 4 -15 -24 4 2 -3 -22 -1 -9 -22 -33 24 -20 -34 -40 25 -20 -7 40 46 15 20 8 -4 69 22 42 10 13 -32 24
4349B4M7o9L1k1o0M5p7Q4l5K9nk7k4K1j3kJ9Q2l8K2%J5j2Qo5K3M4k2L8o1P3n2
$$ 24 71 2 33 12 -48 -3 -80 4 -31 -2 -7 -34 -58 -37 -50 -52 -33 49 11 33 33 48 36 44 -21 2 46 24 62 1 74 22
4381B2l1l5M9j6J7m3l0L7OoJ2l1K2J9L9q2N2K5n6M8j3PL7m3J6J3Pj3m7R0nq5O
$$ 22 -9 -44 5 -11 6 -37 -67 -30 -24 -30 -18 -49 -27 -8 31 -51 1 26 -30 18 5 12 49 6 22 35 42 29 -18 72 67 -18 -12
4414a2N3q0J3K1l2M7k1o0K0K2LJ9ll9M2j4L5lj9O8l9Mj6O3m3rN4n8M0j01N8k6
$$ -12 41 -39 -26 -5 -37 10 -11 -71 -51 -29 -26 -7 -10 -49 -7 -21 14 11 -8 60 21 25 9 72 29 20 74 16 56 -45 13 -13
4446a3K4j2r7L8M3Jk2J2M4On4L2NqL7n4K3K7%l8NM%L2j1rJ8Nl0J1n8qM6k5j6Q
$$ -13 11 -1 -98 -60 -17 -16 -38 -26 18 24 -30 2 7 -1 36 -18 5 32 32 -6 -1 3 3 35 24 15 33 38 8 19 -39 -47 -1 -26 -42 -34
4482c4J5l0k9L7K9l6j5K4M3m3L7LM8M1j23N8M5l0m7Q1n9L2n3M3m6j0J7L6q3K3
$$ -34 -19 -49 -78 -41 -12 -48 -63 -39 4 -39 -2 1 49 90 -33 25 70 40 -7 74 15 47 -6 37 -9 -19 -2 34 -49 -26
4512b6NJ0j6oMJ9j1jm0O2l1L1J4l3K1q5R3L2kJ1o0M0j0Lm0rJ8mJ1qL3j2l5Mr0
$$ -26 -21 -11 -27 -33 -29 -10 -21 -22 -62 0 -31 0 14 -19 2 -83 10 42 40 51 -9 31 21 24 -16 -25 -7 -11 0 -8 25 13 -22 -18 -108
4547a08Q9j2J8l7N2J7o2O0Lj7J2Rj9L3m6O2o2P3n8K9k3L6m9m6P5n0k6lP0k8L1
$$ -108 -19 -31 -13 -50 2 19 -43 17 20 3 15 24 5 38 -8 54 -8 65 7 36 13 49 0 -46 29 -21 -47 -50 20 -8 23
4578B3l0Lol7N8j7J8L2J0k1K2n7P1m8K6J6r1RN5o7M5j4j7lP0r3j7P9l0m7QN1l5
$$ 23 -7 -4 -10 -47 11 -6 12 44 54 33 55 -2 69 21 47 63 -28 -19 36 -31 14 0 -17 -20 50 -43 -60 19 -11 -58 -50 1 -34
4611c4Jl0K7K7ONm0N1J2k5om2J24l4l2L5q9N1lj1K4m8N1k5l1J1oK2k6pJ1L0l4
$$ -34 -33 -63 -36 -9 -3 2 -38 13 25 0 -6 -48 76 42 10 45 -44 7 4 -7 17 -31 20 -5 -36 -25 -31 -9 -35 -42 -31 -1 -35
4644c5J9KQmjNlM8l8qN3k9j9j4N5L0j7Nl0j7K3j8o8R1o6M1l3L2n0ML6k9L9lk2
$$ -35 -16 -14 -6 -10 -11 -6 -9 39 1 -7 46 17 -2 -16 39 69 52 57 27 10 33 15 -53 38 -28 13 -20 12 -38 -34 2 -27 12 9 -13
4679a3mR5l8L0p4L5j2k5M6o6N2m8j0O0m1J5Qn6M6K0k1K9j3lo3L8l5Lj1N2j3MK6
$$ -13 -17 78 40 70 -4 31 19 -6 40 -26 26 -22 -32 28 -13 2 10 -46 0 20 -1 28 15 12 -51 -13 -48 -45 -56 -4 -17 -13 13
4712A3J6M5n7J2J4pkj0j8J9k3k4O1j7j2Pn5K9k0j0j7KpK0PJ5J6k4L8j3k0K9K1
$$ 13 29 74 17 29 43 36 34 24 6 25 2 -22 39 22 10 17 -38 -9 -29 -39 -56 -54 -61 -41 -34 -19 -3 -27 11 -2 -22 7 28
4745B8l5K6J5j8l6J07l2j4rl3K7p5N8K9k9mn3J5N5n9k3M0J2J0j5N0m9Qn0Kj3O4
$$ 28 -7 19 34 16 -20 87 55 41 32 -1 26 -49 9 38 9 5 -48 -33 22 -37 -60 -20 -8 2 -13 37 -12 -4 -54 -52 -65 -1
4777aJ0OJ7pk7OjRK6l5LJ7Mj0J5n2J6J0J3l6j5j6O3l3m3R6m6K6p5J37m1j0p0L0
$$ -1 9 15 32 25 -2 4 3 12 38 3 6 23 27 17 32 -20 -4 6 19 -17 -32 -48 15 -18 -61 35 -11 15 -60 77 36 26 -44 -14
4811a4M6nj8L3l0J3k1j9j4MJ8J1m8L3o3M1jK9Rk8J2m9L9K9k4K1K1j6J0L6K5l0
$$ -14 32 27 9 42 12 25 4 -15 -29 -25 -7 4 -44 -11 -74 -33 -34 -5 4 -24 -12 -61 -22 7 -17 4 25 9 19 55 80 50
4843E0l6l3KM6k6K2l6OK8m4K3L8r8L0k2j0K4l6M9j8J1mRk0LM9l8J01p4L0rl9M8
$$ 50 14 -19 -17 29 3 25 -11 -5 23 -21 2 40 -58 -28 -50 -60 -36 -72 -23 -41 -30 -34 -25 -45 -42 7 -31 70 -4 26 17 -22 26
4876B6L3k7k0RKl6J3j4J7j2Qj7NM6p3j2K5J8M0Rn5j6ML4k2J4RP9r9J1J8k1K0K8
$$ 26 59 32 12 21 23 -13 0 -14 3 -9 -1 -18 -13 33 -40 -52 -27 -9 31 40 -15 -31 -27 7 -15 -1 8 87 -12 -1 17 -4 16 44
4910D4p1N4n4N0on2N2l2ol1M2j0k2K8k6mQ3p6N9k0j9K7oK5k4L6m0%oK2l7M2j9
$$ 44 -27 27 -27 23 17 -35 17 -15 -21 -52 -10 -20 -42 -14 -40 -44 39 -37 22 2 -17 10 4 29 5 41 1 1 -5 17 -20 22 3
4943Cj7qL0k4m0N4%l4oj6M5k7LNj2M0QJQjqLl4P3M3m7k1M4m5nM9m2K5n7j4o1J07
$$ 3 -14 -22 8 -16 -56 -2 -2 -36 -42 -58 -13 -40 -37 -32 -44 -4 4 5 13 12 4 7 -27 46 89 42 21 65 20 15 64 22 47 -10 -24 -85 22
4980B2m1PjL9j6k1mk8K6J1Qn2Q1o2QNL3J5k1j3kK8k2J1K2Lm8j8M8ql8J1M2n7J6
$$ 22 -19 -12 -13 26 10 -11 -15 -43 -17 -6 2 -50 31 -31 -23 -18 15 30 9 -4 -6 22 0 11 33 36 -12 -30 18 10 -28 -17 25 -32 -16
5015a6j3K6K1J0n6M3m9P9p8J09j45P0NpK2p6P5m2K9J8j6k3N3k2RJ0j01P6p7N8
$$ -16 -29 -3 18 28 -28 15 -34 45 -33 76 -69 1 6 -1 21 -55 20 -22 7 25 9 -14 39 17 26 36 -65 11 -66 -8
5045hn2OOL8j2PM9p1mJ6J9MO6o7M7k1pJ2l3PNJ8%j6j5j3RL6l6k1J4n1M5K8K7q1
$$ -8 -60 -54 -48 -10 -22 -15 34 -37 -41 -25 -6 -2 64 -3 44 23 16 28 -5 2 7 25 25 9 -6 -19 -10 26 -10 -31 -17 -68 -23 5 32 -49
5081d9P4q7KN0PL2o9K3kj9L9L9m1N5o3L3L6o0J8QM5m5kj1J6o5J2Ol6L5Mj5oL9
$$ -49 25 -62 -60 -10 -3 29 -40 -17 -19 -38 1 40 -1 54 -9 24 60 0 18 26 71 26 24 13 29 -36 -24 -18 -54 -19 -15 -30 -36 3
5115CJl9nK1J08q4l3RL6l5K9N4k0k2j6n0N3K0ql9N6o5j8P0l5l2N1j0j2Nj0J7l7
$$ 3 4 -35 -40 -19 89 5 -28 -19 17 -18 11 65 45 23 7 -43 10 30 22 -17 39 -26 -44 26 -9 -41 10 0 -12 -7 -17 0 -37
5148c7K4RNKQLL1k3l8%j3m2P3j3j3O6n3m1%O9n2J9K2n6J1M4k8L2o2N9k0J3K2p2
$$ -37 -13 -4 1 3 11 14 45 22 -16 -16 -29 -71 2 -11 -24 42 -11 -52 -52 17 -35 -16 6 -50 -39 5 -23 9 -53 6 -14 -1 21 -51
5182e1O8k5M9m2J6k9K7kj1JNl8L3j4J0N9n4m9QK1k0JJ6oJ2k6L7j5k2M0J7J2m1
$$ -51 17 -8 41 -1 15 -14 13 11 0 1 6 -32 1 -13 -3 56 2 -47 -39 -18 -38 -37 -21 -27 -15 -41 -4 -19 -41 -1 16 28 -13
5215a3M8k9l9N7lK2m0rk0R2j17R6ln2L3j9j0%k0j4mk8M6K1j8j7kK8L6n4JM4k5
$$ -13 35 6 -33 24 21 43 3 -6 -26 66 -51 45 42 -10 23 4 -6 -6 -26 -40 -44 -72 -26 -5 -23 -40 -42 -14 22 -32 -31 13 -12
5248a2M5kk0l2K8j3L0Pmm8M2KpKj5k9mN0m8K4j9M2l0L0rk5nJ8j6QJ7L0n2L0M6
$$ -12 33 31 11 -21 7 -6 24 31 27 -21 21 23 16 18 3 -26 -30 20 -28 -4 -23 19 -11 19 10 -15 -20 -2 -18 -10 7 37 -15 15 61
5283F1o3jm8M7K0q1P9Jo9P1m5j0M5Jj7l4O4qk8j9K4J5L9j5Mp5M2RL7l8K3KL1k5
$$ 61 -2 -3 -51 -4 16 -65 14 15 -54 17 -28 -38 7 8 -9 -43 21 13 -15 -34 -10 5 44 29 33 -42 0 9 46 8 31 33 64 39
5317C9l2j4KM9m3l5R0q4l8P8o4M2q3Q0K9o4L6MK0rK6o3K5K4L6n5O8j6l3moK5q
$$ 39 7 -7 -5 44 1 -34 56 -28 -66 12 -52 -10 -93 -13 16 -48 -12 -8 12 3 29 -34 -9 15 51 -4 64 48 15 11 5 30 22
5350B2%L0m9K6k6j3J1l6R0q0pnRO0p4P6m2nk2PoK8N4l3J1L0o1oJ8OM0m8K2k4M1
$$ 22 22 52 3 29 3 -10 1 -35 55 -25 -32 -37 -28 32 -42 34 -8 -13 -35 -28 -34 -6 48 15 26 56 -5 -11 7 13 53 5 27 3 44
5385D4o1O6m7n7N1k6O1m1J2L6p7Q2l8K3k0l7O1j4J4l5L5J4o3N4j3j4k1P2p0M4
$$ 44 -17 49 2 -55 -4 -30 31 -10 2 38 -39 43 5 28 8 -29 32 18 32 -3 32 46 -17 37 24 10 -11 61 -9 35
5415C5m7MJK0qo7Q9l4l9m7Q8pK9k0j4P4q9j0L7K8j8k2mL2k0P7l8k2n1O8l3J9K3
$$ 35 -12 -8 -7 13 5 -62 27 -7 -46 -93 -5 -12 17 -3 -17 57 -32 -42 -5 23 5 -17 -21 11 -9 68 30 8 -43 25 -8 11 34
5448C4l8kKlm6K4J8k0P0p5k0M1j2L7k7M5Jmk2J7K5m7J5lj8jK9l1%j0k1O6q0O5
$$ 34 -4 -6 -4 -7 -53 -29 -11 -31 39 -36 -56 -15 -27 10 -17 28 29 25 3 20 45 -2 13 10 -8 -9 20 -11 -11 -21 -42 24 -56 9
5482Im9K7N5l4l8K5JK2n8JJ1K9J8l6L9m6O7m5OQ8q6J6j7l7M5JL3%r8K2O2nn7Q
$$ 9 -40 -13 42 8 -30 -5 -4 18 -40 -39 -28 1 19 -17 22 -24 43 -2 4 92 6 22 5 -32 13 14 47 47 -51 -29 33 28 -29 -21
5516b1J1k6M2L3o2OJ1O7l7om0jJ4M4q3N3k4Pk7O3pMl1rpL8Ml1mJ5M0m6Lj6RpJ3
$$ -21 -10 -36 6 39 -23 -17 -6 61 24 18 -22 -23 -9 35 -48 5 -19 -12 -39 24 17 21 -10 -19 -26 12 16 -15 -19 -4 36 -10 -7 -23 -14 -21 -8
5553hl6O5kQj5NK8rk0J8k7J9M3J2o7J8j8k0k9j5L9M1n1M9J9j01k7J9L2M5J3n2
$$ -8 -44 21 19 27 12 17 45 36 16 34 7 26 69 81 14 32 14 -6 -35 -50 -11 30 -21 28 47 -54 -81 -62 -30 15 28 -24
5585b4M4k0j0J0qr%P7q5N7kk3L8j2nl6O5p3K1j9L8k9j9Ok8R6j09M0j0n4K3R5q5
$$ -24 20 0 -10 0 -8 -17 -17 60 -25 32 30 7 45 33 28 -8 57 -16 5 -14 24 -5 -24 -18 -46 50 -59 -19 -29 -83 -60 35 -50
5618e0N6l5nL1Ql3O4n0J0l9M4k9KO2nml1J1jK9pl8Kn4M2J1k0L6l3kK1l0K9M0k0
$$ -50 6 -29 -34 -3 5 -28 36 -14 -4 -43 1 -28 -26 36 31 27 -4 7 6 35 28 -10 -8 -62 -20 -9 -29 7 -26 -28 -7 -37 -8 32 12
5653A2j6MJ3l9M8j6k1M1J0nl5J2nM5p1J1J9m3lM3J9m3k0k9N3jj3M6j1j0mk9O6
$$ 12 -4 0 13 -26 22 6 -15 26 36 31 -4 8 3 48 -23 -12 7 -36 -39 4 23 -20 -40 -69 -16 -17 -30 16 5 -5 -9 -38 28
5686B8mk3J7m1N9k9oK8n8J4K6L3p9Q1l9q2Q4m2L4o8L6K1o0N0Pkp5N6L8oJ5RK5
$$ 28 24 1 18 -23 36 7 1 29 -29 -15 11 44 -35 46 7 -75 9 -33 1 -67 -31 -10 -70 -20 -13 -15 -90 -34 4 -2 13 22 47
5719D7q3J9j1N2k1J6K5m0j5ML1m6K2p2O8l6L8n3J0LM1l1J4ML0J1p2P6J6r3M7N0
$$ 47 -36 -17 -28 24 3 19 44 4 -11 -7 24 -22 0 -72 -4 -40 -2 -55 -45 -42 -1 -32 -18 -14 16 27 -45 31 47 -46 1 51
5751E1l9m4N0Jj3j0L1r3M5M6k9qJ3j3m9QN0k0K6Qm1J9N1m2l6L8K0lj6L3k9K0N
$$ 51 12 -32 18 19 6 -4 27 -66 -21 25 -4 -12 1 -12 -61 -53 -3 -23 3 11 -30 -11 40 -2 -38 0 20 17 1 34 5 25 30
5784C0k8L8o4K9m0L1k1Pl8P9k9j2N4l7l1kqL4K0kj8j7M0Ko%l7L7k9O2J2l3o7N3
$$ 30 2 40 -24 5 -35 -4 -25 -18 -56 23 -6 -18 36 -1 -32 -34 -42 -8 12 10 -8 -25 15 17 11 11 -26 11 -18 44 56 23 -44 9
5818Im7L6L4l7m6P6p1J7L6qol6L2j9j2lJ7j5K2%M3k8K3m0PL2m1N7j2l6L3J1M7
$$ 9 -38 -2 32 -5 -51 25 -46 -29 7 -1 -7 -43 -11 -30 -42 -45 -28 -43 -21 -21 22 -6 17 -23 -16 16 -25 32 20 -16 17 28 75
5851G5n6Poj5m5O0K2p6N9k8m4M9Kko3N9J6j07J30p3M6J1ok4N9o4M0L4j4J6m3j7
$$ 75 19 26 20 5 -40 20 42 -34 25 -3 -47 2 4 2 -61 -2 14 -93 37 -36 10 21 15 -9 50 -14 26 60 46 62 19 2
5883Bj0J7%k4N2n1K2OK9p8P1j4o2M4LRj7O3n4L9k8j2M3k9j7nO8j00L5kL8m9L0
$$ 2 -8 9 9 -15 37 -14 8 14 43 -35 36 22 -40 4 7 16 -1 62 8 47 19 7 50 21 4 -1 67 -33 2 0 38 -11 19
5916A9J1n5L7l4N2o2nN7l0OJj7J8nJ2L7J1m0k1j1N6J3l1K2p7M8L2n6O5k6j4k7
$$ 19 30 -25 12 -22 30 -32 -37 20 -10 -4 -3 -20 -2 -7 5 42 53 13 -8 -19 37 50 19 41 -36 12 44 -12 53 27 13 -14
5948a4L7K6l9ll0KJ5K9m7PM2j5j2k5L0m9N6j3N7p0m7J01k3j7k3M4k2K8k2NK4m9
$$ -14 23 49 10 7 -23 -21 -6 23 -24 -17 25 10 -2 -27 3 -46 10 -3 54 -16 -63 38 15 -2 -25 19 -3 25 3 8 32 -17
5980a7K9J8lj8m5L8p8L3OR1j5K9o7L7l5n0O4p3Q1pJ5k3QkL0k3M4l3j8q6O9K6M
$$ -17 12 30 27 9 -36 2 -76 -43 -37 54 39 68 1 38 3 -47 17 -56 25 18 33 10 18 16 46 23 67 34 16 -70 -1 25 29
6013B9nK3p1n2Q3Pl1j9P5n0jJ9m4L9L4k3K2k8J1k5nK4P7p3Lm4O5j3m1J0L1n4N3
$$ 29 24 47 -24 -76 7 14 -17 -36 39 -11 -12 7 -37 2 36 13 35 7 18 -7 -12 12 89 16 19 -25 40 27 -14 -4 27 -27 26
6046B6o2NQrJ2J4l6N9m1jm4P7k3jJ6O9o3J1L0l4L4l0K8pj4o4L9K2k6qk3KL0N0
$$ 26 -36 -31 -23 -32 -20 -6 -42 17 -24 -25 -69 8 -15 -16 0 69 6 17 47 13 47 17 45 38 24 -40 -1 21 -5 -13 -36 -34 -4 46
6080D6q8j0N5k6MK3n3M5j1k3L0M4n3j6M8rNk4pO5m0NL2m4M4n8M5on3O5l4L5j4
$$ 46 -42 -52 3 -23 -19 4 -49 -4 -15 -38 -8 36 -17 -33 15 6 11 -13 -20 45 5 10 42 -2 42 -16 29 23 -30 35 1 36 22
6113B2o3M6JKn3M0Ln2O2J3L2o8R0o2j1JJ3n1L1l1RK2k6L6kl4M1j7k3J5j0J2J3
$$ 22 -41 5 6 8 -45 -5 -2 -54 8 21 53 -15 75 13 2 3 16 -35 -4 -35 -26 -4 -30 6 4 -30 11 -6 -29 -14 -24 -12 1
6146A%k9K3K2J7mk5nL5l5Oj9K0nK2J2Ll7JK9l9m1K9O7r1P5k9m0J7j0K0J9l6NN6
$$ 1 1 -28 -5 17 34 30 5 0 35 0 6 -13 7 2 24 36 39 2 3 32 -7 -48 -19 48 -43 32 3 -37 -20 -30 -10 9 -27 -22 34
6181C4Jq6N9j3J4K9n7N2k5O8n1lK6L5r4K3l6K0O5o4M0jo7J9J7l8J7%k5J6L2l3
$$ 34 35 -51 8 -5 9 38 -19 33 8 76 25 22 48 83 -11 12 -24 -4 61 -3 37 36 -31 -12 5 -33 -16 -16 -41 -25 7 -26
6213b6L9k5jnR0m9n4J1JOk7J2M5m0oj5pO7j5k2L1j4K6Mqm1J6rjM8j5o3K2N3n9
$$ -26 13 -12 -13 -18 72 23 -31 -20 -19 -13 -40 -28 17 -23 -29 -44 -51 16 1 -21 10 -4 22 26 18 -23 -7 -16 -17 31 16 -47 -25 28 -31
6248c1L5k9L3k7L4J5k4J3K7j11P8l3L8l5j0L4k2JK9l8M2kml6M9m6K3j9L2Ok4p
$$ -31 4 -25 8 -19 15 30 6 19 46 -65 13 -20 18 -17 -27 7 -15 -14 15 -23 19 17 13 -23 26 -20 3 -16 16 22 -2 -9
6280ikM1kn7K4Mj7RqJ4J0j9j3J8Ok2M7j2l9M7l6L3rn3J7J1l2Q6JPr8J56n8mRk5
$$ -9 -11 30 28 -29 -5 -1 -18 -9 -17 -3 7 -12 -25 -7 -1 -23 24 12 -27 20 -16 17 8 -45 -28 -17 -49 37 38 45 -53 103 45 41 50 25
6316B5%qml0P0o9n1J13l7J0J1k4k6K3J1l7N9n2M3Ko9L6J3n4P3o9P0n9M9lK1rK6
$$ 25 25 17 13 -17 53 -16 -67 46 9 19 30 6 -20 3 14 -23 36 -16 27 29 -40 -4 9 -45 28 -41 29 -30 19 16 37 28 54
6349E4p6K2j4K1L0oKl2M8r2L9M9p1O0m2j7O1p3K4qK8Kj9k0L0MJ3lpNm4K2K5n5
$$ 54 -22 0 -14 7 37 31 33 1 49 -43 -4 45 -26 34 -8 -25 36 -37 -13 -21 7 9 -10 -30 0 4 17 14 7 12 -32 -10 15 -40
6383d0M2j5LJ1J8m2K9nk8L5J7J6o0K1j7K3M6l6L3o0J7l7K9O4p2N2m3lRk6L8l9
$$ -40 2 -13 -10 1 19 -23 6 1 -27 8 25 41 -19 2 -15 8 54 18 51 -9 8 -29 0 64 -8 44 1 -2 7 -19 19 -20
6415b0L1K8q3kK0J0n1RP1ol2L8j4k4j0M8l7J1JrL7k7J4Oj2jN4o0L5m1J4NM0l1
$$ -20 11 39 -44 -46 -26 -16 -67 -58 13 7 -25 13 -1 -25 -35 13 -24 -13 -12 -21 16 -11 3 9 -3 -4 50 -10 25 -16 -2 3 43 12
6449A2l7O0p5L5jO1q1k1L8nj4J2K5j6N4oj9Oj9qL5r3J33k8o4pJ7mjk0l6Q3l5L1
$$ 12 -25 35 -40 -5 -6 55 -26 -47 -9 -14 -28 -16 9 -7 47 41 22 28 9 1 36 -57 76 48 -16 -23 -6 -10 -11 -31 -67 16 -19 12
6483A2j6mJ6m3pOL0pM4n9N3k0j3J0J6l0j4j9O0k8N5kKk1j3ql1j7K6JK3j4LMj9
$$ 12 -4 -8 8 -35 -42 -36 -6 -13 31 -28 25 5 -8 2 18 -12 -26 -45 15 -13 42 40 42 21 8 0 -31 -48 -22 -21 2 -12 -9 -5 -24
6518b4k2O5j6K7p9R9k3o9M5k3Q7r1K2K1o6rM6M7j6p5P3o6N1KK9j4L8r4J4M0J3
$$ -24 -46 19 3 30 -49 50 27 -42 3 -20 67 -24 -2 19 -47 -56 -10 37 21 -54 19 -47 4 6 35 21 59 -35 -21 19 32
$$ [...]
8191A
##END NTUPLES=NMR FID
##END=
