##TITLE=1H_Pr NCS-Bzl
 200.13MHz,CDCl3 ,
 8 sc
 
 13.8.2025
##JCAMPDX= 6.0         $$ Bruker NMR JCAMP-DX V2.0
##DATA TYPE= NMR FID
##DATA CLASS= NTUPLES
##ORIGIN= UXNMR, Bruker Analytische Messtechnik GmbH
##OWNER= pz
$$ XWIN-NMR		Version 3.5
$$ Wed Aug 13 16:23:15 2025 Russian Standard Time (UT+4h)  she@DPX200
##.OBSERVE FREQUENCY= 200.1313
##.OBSERVE NUCLEUS= ^1H
##.DELAY= (6, 6)
##.ACQUISITION MODE= SIMULTANEOUS
##.ACQUISITION SCHEME= undefined
##.AVERAGES= 8
##.DIGITISER RES= 18
##SPECTROMETER/DATA SYSTEM= spect
##.PULSE SEQUENCE= zg30
##.SOLVENT NAME= CDCl3
##.SHIFT REFERENCE= (INTERNAL, CDCl3, 0, 14.3821)
##AUDIT TRAIL= $$ (NUMBER, WHEN, WHO, WHERE, WHAT)
$$ ##TITLE= Audit trail, XWIN-NMR		Version 3.5
$$ ##JCAMPDX= 5.01
$$ ##ORIGIN= Bruker BioSpin GmbH
$$ ##OWNER= she
$$ F:/spectra/data/she/nmr/H-C/1/audita.txt
$$ ##AUDIT TRAIL=  $$ (NUMBER, WHEN, WHO, WHERE, WHAT)
(   1,<2025-08-13 16:22:10.21 +0400>,<she>,<DPX200>,
      <created by zg, POWCHK disabled, PULCHK disabled
       configuration hash MD5:
       00 E9 B6 7A A2 85 ED C7 34 08 36 98 17 FE 4E 26
       data hash MD5: 16K
       D8 EF 33 86 5A 6E E3 28 72 C7 1B 27 DC 59 80 A2>)
$$ ##END=
$$ 
$$ hash MD5
$$ 51 40 08 01 A3 D3 66 00 28 EB 63 98 AD 12 B3 2C
##$RELAX= 
##$RELAX= 
##$RELAX= 
##$RELAX= 
##$RELAX= 
##$RELAX= 
$$ Bruker specific parameters
$$ --------------------------
##$DU= <F:/spectra>
##$EXPNO= 1
##$NAME= <H-C>
##$PROCNO= 1
##$TYPE= <nmr>
##$USER= <she>
##$AMP= (0..31)
100 100 100 100 100 100 100 100 100 100 100 100 100 100 100 100 100 100 
100 100 100 100 100 100 100 100 100 100 100 100 100 100 
##$AQSEQ= 0
##$AQ_mod= 1
##$AUNM= <au_zg>
##$AUTOPOS= <>
##$BF1= 200.13
##$BF2= 200.13
##$BF3= 200.13
##$BF4= 200.13
##$BF5= 200.13
##$BF6= 200.13
##$BF7= 200.13
##$BF8= 200.13
##$BYTORDA= 1
##$CFDGTYP= 0
##$CFRGTYP= 5
##$CHEMSTR= <none>
##$CNST= (0..31)
1 1 145 1 1 1 1 1 1 1 1 1 1 1 1 1 1 1 1 1 1 1 1 1 1 1 1 1 1 1 1 1 
##$CPDPRG= <>
##$CPDPRG1= <>
##$CPDPRG2= <>
##$CPDPRG3= <>
##$CPDPRG4= <mlev>
##$CPDPRG5= <mlev>
##$CPDPRG6= <mlev>
##$CPDPRG7= <mlev>
##$CPDPRG8= <mlev>
##$CPDPRGB= <>
##$CPDPRGT= <>
##$D= (0..31)
0 0.7 0 0 0 0 0 0 0 0 0 0.03 0 0 0 0 0 0 0 0 0 0 0 0 0 0 0 0 0 0 0 0 
##$DATE= 1755087729
##$DBL= (0..7)
120 120 120 120 120 120 120 120 
##$DBP= (0..7)
150 150 150 150 150 150 150 150 
##$DBP07= 0
##$DBPNAM0= <>
##$DBPNAM1= <>
##$DBPNAM2= <>
##$DBPNAM3= <>
##$DBPNAM4= <>
##$DBPNAM5= <>
##$DBPNAM6= <>
##$DBPNAM7= <>
##$DBPOAL= (0..7)
0.5 0.5 0.5 0.5 0.5 0.5 0.5 0.5 
##$DBPOFFS= (0..7)
0 0 0 0 0 0 0 0 
##$DE= 6
##$DECBNUC= <off>
##$DECIM= 32
##$DECNUC= <off>
##$DECSTAT= 4
##$DIGMOD= 1
##$DIGTYP= 9
##$DL= (0..7)
0 120 120 120 120 120 120 120 
##$DP= (0..7)
150 150 150 150 150 150 150 150 
##$DP07= 0
##$DPNAME0= <>
##$DPNAME1= <>
##$DPNAME2= <>
##$DPNAME3= <>
##$DPNAME4= <>
##$DPNAME5= <>
##$DPNAME6= <>
##$DPNAME7= <>
##$DPOAL= (0..7)
0.5 0.5 0.5 0.5 0.5 0.5 0.5 0.5 
##$DPOFFS= (0..7)
0 0 0 0 0 0 0 0 
##$DQDMODE= 0
##$DR= 18
##$DS= 0
##$DSLIST= <SSSSSSSSSSSSSSS>
$$ [...]
##$SUBNAM0= <"">
##$SUBNAM1= <"">
##$SUBNAM2= <"">
##$SUBNAM3= <"">
##$SUBNAM4= <"">
##$SUBNAM5= <"">
##$SUBNAM6= <"">
##$SUBNAM7= <"">
##$SUBNAM8= <"">
##$SUBNAM9= <"">
##$SW= 18.0517328524113
##$SWIBOX= (0..15)
0 0 2 0 0 0 0 0 0 0 0 0 0 0 0 0 
##$SW_h= 3612.71676300578
##$TD= 16384
##$TD0= 1
##$TE= 0
##$TE2= 300
##$TE3= 300
##$TEG= 300
##$TL= (0..7)
0 120 120 120 120 120 120 120 
##$TP= (0..7)
150 150 150 150 150 150 150 150 
##$TP07= 0
##$TPNAME0= <>
##$TPNAME1= <>
##$TPNAME2= <>
##$TPNAME3= <>
##$TPNAME4= <>
##$TPNAME5= <>
##$TPNAME6= <>
##$TPNAME7= <>
##$TPOAL= (0..7)
0.5 0.5 0.5 0.5 0.5 0.5 0.5 0.5 
##$TPOFFS= (0..7)
0 0 0 0 0 0 0 0 
##$TUNHIN= 0
##$TUNHOUT= 0
##$TUNXOUT= 0
##$USERA1= <user>
##$USERA2= <user>
##$USERA3= <user>
##$USERA4= <user>
##$USERA5= <user>
##$V9= 5
##$VALIST= <valist>
##$VCLIST= <CCCCCCCCCCCCCCC>
##$VD= 0
##$VDLIST= <DDDDDDDDDDDDDDD>
##$VPLIST= <PPPPPPPPPPPPPPP>
##$VTLIST= <TTTTTTTTTTTTTTT>
##$WBST= 1024
##$WBSW= 4
##$XGAIN= (0..3)
0 0 0 0 
##$XL= 0
##$YL= 0
##$YMAX_a= 487561
##$YMIN_a= -523039
##$ZGOPTNS= <>
##$ZL1= 120
##$ZL2= 120
##$ZL3= 120
##$ZL4= 120
##$ABSF1= 10
##$ABSF2= 0
##$ABSG= 5
##$ABSL= 3
##$ALPHA= 0
##$AQORDER= 0
##$ASSFAC= 0
##$ASSFACI= 0
##$ASSFACX= 0
##$ASSWID= 0
##$AUNMP= <proc_1d>
##$AZFE= 0.1
##$AZFW= 0.1
##$BCFW= 1
##$BC_mod= 2
##$BYTORDP= 1
##$COROFFS= 0
##$CY= -3
##$DATMOD= 1
##$DC= 2
##$DFILT= <>
##$DTYPP= 0
##$F1P= 0
##$F2P= 0
##$FCOR= 0.5
##$FTSIZE= 0
##$FT_mod= 4
##$GAMMA= 1
##$GB= 0.15
##$INTBC= 1
##$INTSCL= 1
##$ISEN= 128
##$LB= 0.25
##$LEV0= 0
##$LPBIN= 0
##$MAXI= 10000
##$MC2= 0
##$MEAN= 0
##$ME_mod= 0
##$MI= 1.114404
##$NCOEF= 0
##$NC_proc= 0
##$NLEV= 6
##$NOISF1= 3.799351
##$NOISF2= 2.8
##$NSP= 1
##$NTH_PI= 0
##$NZP= 0
##$OFFSET= 14.38212
##$PC= 1
##$PHC0= -1560.186
##$PHC1= 11.79228
##$PH_mod= 1
##$PKNL= yes
##$PPARMOD= 0
##$PSCAL= 0
##$PSIGN= 0
##$REVERSE= no
##$SF= 200.129724274929
##$SI= 16384
##$SIGF1= 3
##$SIGF2= 2
##$SINO= 400
##$SIOLD= 16384
##$SREGLST= <1H.CDCl3>
##$SSB= 0
##$STSI= 0
##$STSR= 0
##$SW_p= 3205.1282051282
##$SYMM= 0
##$S_DEV= 0
##$TDeff= 0
##$TDoff= 0
##$TI= <>
##$TILT= no
##$TM1= 0
##$TM2= 0
##$TOPLEV= 0
##$USERP1= <user>
##$USERP2= <user>
##$USERP3= <user>
##$USERP4= <user>
##$USERP5= <user>
##$WDW= 1
##$XDIM= 8192
##$YMAX_p= 0
##$YMIN_p= 0
$$ End of Bruker specific parameters
$$ ---------------------------------
##NTUPLES= NMR FID
##VAR_NAME=  TIME,          FID/REAL,        FID/IMAG
##SYMBOL=    X,             R,               I
##VAR_TYPE=  INDEPENDENT,   DEPENDENT,       DEPENDENT
##VAR_FORM=  AFFN,          ASDF,            ASDF
##VAR_DIM=   8192,          8192,            8192
##UNITS=     SECONDS,       ARBITRARY UNITS, ARBITRARY UNITS
##FACTOR=    0.0002768,     1,               1
##FIRST=     0,             0,               0
##LAST=      2.2672688,     0,               0
##MIN=       0,             -523039,         0
##MAX=       2.2672688,     487561,          0
$$ Real data points
##PAGE= N=1
##DATA TABLE= (X++(R..R)), XYDATA
0 0 0 0 0 0 0 0 0 0 0 0 0 -7 8 -8 8 -11 16 -16 24 -24 32 -33 43 -48 57 -67 77 -90 101 -117 134 -154 173 -196
34 -196 221 -250 278 -313 349 -388 432 -479 531 -587 650 -717 792 -872 962 -1058 1166 -1285
52 -1285 1415 -1564 1729 -1918 2134 -2382 2671 -3017 3439 -3960 4630 -5519 6770 -8649 11790
67 11790 -18008 35004 -183368 -523039 5608 487561 368711 -22073 -9358 237463 282854
78 282854 201939 212612 30507 -249821 -166284 141131 37995 -368763 -442952 -132459 11331
89 11331 -98837 -138600 -59886 -1775 81432 213185 262135 142097 53132 174900 271091
100 271091 120924 -25967 -5337 -38977 -184458 -169792 -25910 -127570 -383819 -272678
110 -272678 85949 94735 -173825 -150754 177358 302209 115557 47779 208926 233526 83878
121 83878 63233 123181 -3282 -187966 -116784 30248 -131705 -365807 -225514 46041 -3685
132 -3685 -203839 -142491 114822 204495 108375 77737 128271 152229 186850 201932 80289 -88005
144 -88005 -81039 60283 22101 -213851 -286192 -130115 -55818 -127728 -134154 -47727 -18641 -18118
156 -18118 104586 225053 134820 20576 123625 254366 162521 -11618 -18513 43144 -49877
167 -49877 -159680 -96560 -54611 -189733 -263970 -103132 58414 -14255 -129483 -23907 151546
178 151546 171642 122396 120486 115561 88422 108845 147249 53726 -123992 -137591 -13647 -22439
190 -22439 -171251 -227290 -130757 -51586 -65514 -51880 9510 23421 42414 134116 183358 119608
202 119608 64284 114250 152613 57147 -41846 -17990 -9533 -106352 -169418 -115297 -67280 -123841
214 -123841 -160783 -68219 21937 11313 13964 78081 114782 105028 119168 156423 116288 21984
226 21984 19291 68173 10784 -108643 -137657 -82579 -74409 -134679 -141339 -78495 -47161 -34039
238 -34039 17840 61575 62733 72700 128171 158622 99403 48500 78552 83020 1302 -67448 -65000
251 -65000 -56895 -103597 -141288 -107966 -79258 -90779 -66198 -3691 29477 32751 60117 114361
263 114361 124239 89235 92018 110689 69207 6568 -10165 -7670 -48258 -114204 -120286 -82906 -88902
276 -88902 -109713 -83345 -36975 -7652 14687 52542 84232 79032 86473 126641 121570 61662 26666
289 26666 34086 26340 -33595 -89390 -88663 -81951 -101154 -102895 -83183 -66507 -46740 -9034 38222
302 38222 55662 51724 82512 121202 108595 73689 61225 60056 31827 -19492 -45155 -51906 -80907
315 -80907 -105256 -96405 -83646 -79511 -67487 -32588 6967 22971 40737 79146 96568 87677 86242
328 86242 90546 77638 37575 1936 -6472 -25644 -66743 -89205 -89992 -88762 -86393 -75424 -49533
341 -49533 -26745 -10304 27558 64470 71454 73646 87294 96879 84997 53938 32926 19056 -13484
354 -13484 -44452 -59090 -74240 -88601 -94090 -82484 -60028 -47362 -30043 3296 29770 47948
366 47948 69219 85680 89526 78316 66122 63563 43601 4336 -22647 -39260 -56094 -72239
378 -72239 -85925 -85080 -76287 -66466 -41940 -15496 1975 24872 50099 70083 80575 78885 77110
391 77110 72617 50607 26414 7492 -15108 -36951 -60053 -77367 -80369 -77305 -67585 -53151 -45433
404 -45433 -26921 9568 41014 55464 56595 61962 81318 86537 67548 42417 17664 -988 -12841
417 -12841 -30542 -53060 -77057 -91343 -75443 -49541 -42166 -43691 -33435 3462 47841 63294
429 63294 57891 56926 64220 76482 74181 47113 14456 -12668 -26146 -26562 -38628 -67771 -90574
442 -90574 -86769 -51803 -22239 -26510 -32690 -7846 38250 71520 68095 53268 56499 64982 63611
455 63611 48743 19321 -10460 -32879 -41688 -38241 -50635 -80083 -85953 -58397 -25372 -15425 -20855
468 -20855 -2115 36996 57973 58863 59486 65431 65321 46812 26853 20807 5765 -24828 -49108 -56255
482 -56255 -53546 -58201 -67181 -56504 -36046 -24353 -9699 15199 41615 51627 42609 48269 74173
495 74173 76621 44145 7877 127 10689 -5626 -45049 -65700 -63376 -57454 -52392 -43968 -29964
508 -29964 -25452 -21875 12761 58046 64763 37751 26940 57640 85752 58086 5322 -14428 -7178
521 -7178 -6486 -27319 -54543 -66933 -68711 -57271 -29150 -12813 -21369 -25597 2829 54312 75637
534 75637 48054 23619 41150 69345 62830 17487 -17834 -17375 -14335 -29122 -48080 -58928 -59891
547 -59891 -55894 -42424 -14906 -614 -7850 -604 35454 66223 61075 36236 36833 55387 45276
560 45276 13700 -4637 -8456 -21305 -46577 -56629 -42069 -40612 -55213 -51433 -23091 3939 9571
573 9571 9780 29207 50919 52512 47903 47945 45698 31853 8097 -4385 -5024 -18330 -43171 -59071
587 -59071 -55214 -38199 -33167 -40218 -32628 -9220 12768 27066 34478 42508 45511 40749 46491 53678
601 53678 35011 -353 -19639 -10122 -4215 -33404 -66931 -62286 -37207 -25696 -30176 -29552 -11151
614 -11151 9721 25133 41822 47626 38623 35543 44052 49398 32402 -73 -15511 -13537 -18172
627 -18172 -33916 -50211 -54656 -44123 -33366 -25726 -16501 -6967 8305 24741 35600 43822 47775
640 47775 42199 36407 32989 27843 13735 -10196 -25346 -25665 -31788 -44491 -49790 -43857 -32392 -26349
654 -26349 -18226 688 15193 21286 31308 43158 47655 42485 34512 32236 23831 4285 -9229
667 -9229 -15863 -25819 -38659 -47680 -44237 -34871 -31963 -27379 -15028 -1445 14976 28319 33289 36221
681 36221 39288 43589 43035 29068 11733 3352 -4751 -15469 -28265 -39698 -43765 -42187 -37279 -27964
695 -27964 -22757 -16256 -497 17394 28336 32498 34594 41392 42916 34286 25747 16647 3281 -9402
709 -9402 -19799 -27244 -34527 -42708 -42174 -34379 -28876 -21235 -9814 2003 14454 24823 33447 40153
723 40153 38062 34774 34354 27473 14047 488 -10681 -17604 -27143 -36861 -39178 -38720 -35553 -26792 -17713
738 -17713 -8590 1984 14111 27173 33906 34120 36248 37777 32025 22828 11159 796 -8083 -20207
752 -20207 -28520 -33699 -38343 -37151 -31509 -25246 -17018 -7387 4417 17603 24181 29635 36589 37444 33524
767 33524 27930 20262 12329 353 -12175 -19654 -27484 -34166 -35328 -34712 -31019 -24113 -15254 -3075
781 -3075 6645 13821 23953 32516 34888 34598 30601 26729 20446 8836 -2203 -11164 -21372 -27875
795 -27875 -31741 -34509 -33178 -29581 -21215 -10874 -3352 5467 17366 25106 30126 32876 32243 30811 24435
810 24435 15941 7945 -2793 -13742 -20809 -27205 -31592 -33079 -32433 -25908 -18863 -11983 -1374 9159
824 9159 16427 23614 29602 33306 32709 26607 21725 16585 6041 -4054 -13437 -21676 -26943 -30556 -31084
839 -31084 -28750 -26109 -19537 -7923 979 9076 16590 23601 30171 31480 29363 27167 20894 11841 4579
854 4579 -4444 -13677 -21900 -28196 -29191 -29382 -28996 -22861 -15570 -8893 284 10353 19398 25354 26061 28625
870 28625 30553 25907 18959 10640 1256 -6239 -13516 -20495 -25656 -31452 -31139 -24295 -19288 -14524 -7783
885 -7783 1211 11908 19407 24741 28398 26952 24657 24675 20261 10078 -2019 -9271 -12780 -19315 -27534
900 -27534 -28913 -27484 -25950 -20251 -11396 -2556 2686 7544 19047 28722 28137 24771 23883 22932 17936
915 17936 7775 -1133 -7769 -16908 -22547 -24215 -26529 -27463 -25371 -19296 -9384 -2209 3991 11790 17953
930 17953 23651 28514 27604 23443 19713 14506 8239 -2025 -10607 -13500 -20466 -28943 -28540 -22664 -18916
945 -18916 -18993 -15177 -1265 10193 12252 16324 24298 27554 24908 22047 21842 16793 2145 -7163 -6668
960 -6668 -10746 -21871 -30408 -28405 -20759 -18483 -17438 -10304 -2002 5518 14296 20761 24479 23748 22051
975 22051 23218 21190 13644 3912 -6230 -12209 -12829 -16994 -25353 -30661 -26068 -14995 -10611 -11498 -3792
990 -3792 8427 15172 18350 23077 27449 23730 16190 16449 18212 5782 -10524 -15093 -11737 -15546 -27627
1005 -27627 -30021 -20205 -15422 -15433 -8898 2060 9560 11615 16516 25676 27202 20828 17688 17015 11721
1020 11721 3118 -5790 -11089 -15763 -21221 -23084 -23637 -22547 -17170 -11495 -7223 -602 9102 16433 18186
1035 18186 18087 23629 26806 19212 10817 8735 5465 -4610 -14996 -16068 -15770 -23981 -28456 -19643 -10550
1050 -10550 -10631 -11073 -792 13698 17034 14701 19931 24907 21645 16369 14095 10857 238 -10224
1064 -10224 -11273 -11826 -19657 -25306 -23499 -17607 -13073 -10547 -4953 1945 7208 15534 21737 20337 18469
1079 18469 19459 19720 14004 4805 -312 -4396 -12543 -18406 -17292 -18925 -23246 -21905 -12539 -4223 -4489
1094 -4489 -1631 10160 18380 17415 17624 21754 21565 14393 8009 7984 3024 -9437 -15173 -14150 -16106 -21232
1110 -21232 -22811 -16223 -10204 -9625 -4066 5970 10491 12525 17229 21559 20929 15499 13846 13027 4998
1125 4998 -3682 -6577 -9872 -16396 -20579 -19801 -16581 -16714 -14185 -5249 427 2272 7865 16147 19606
1140 19606 17628 16100 19040 16165 7049 2178 -260 -6395 -13970 -17320 -15847 -17633 -20924 -16358 -7941
1155 -7941 -5466 -3126 4023 12186 15342 14210 17467 20876 15785 9996 8659 5279 -2866 -10311 -12139
1170 -12139 -12733 -18177 -20591 -15561 -12320 -10884 -6585 1280 7409 9139 12076 18745 19988 15148 13932
1185 13932 13358 8310 595 -4547 -6774 -11236 -17509 -17674 -14719 -15839 -15257 -8928 -2109 1372 3695
1200 3695 10342 16844 15939 14936 16681 15591 10084 4065 1642 -1599 -9600 -15067 -13858 -14963 -17899
1215 -17899 -16519 -11140 -6148 -3962 387 8045 12235 12078 15427 18457 16397 11731 8366 7007 1592
1230 1592 -6091 -9648 -11082 -14927 -17506 -15572 -13348 -11095 -8603 -2274 4591 6335 8872 14701 17239
1245 17239 15591 13460 12693 10262 3827 -1543 -3517 -8132 -14425 -15762 -14351 -14060 -14930 -11936 -4750
1260 -4750 -489 1545 6764 12432 14091 14242 14947 15696 12224 6065 3385 1145 -5561 -10847 -12774 -13343
1276 -13343 -14800 -16161 -12844 -7971 -6036 -2237 4270 8757 11015 12254 15234 16501 13026 9490 8220
1291 8220 3724 -2259 -6348 -9130 -11911 -15417 -15840 -12979 -11220 -10053 -5278 571 4037 7059 10567
1306 10567 14557 15077 12865 12843 11547 6097 1639 -1787 -5027 -9658 -14029 -14173 -12875 -13934 -12628 -7655
1322 -7655 -3645 -624 3316 8391 12181 12653 13079 14756 12880 8998 5616 2503 -1554 -6621 -10254
1337 -10254 -11341 -13059 -14716 -13144 -10032 -7562 -4536 -71 5070 8350 10049 13178 14429 12428 10786
1352 10786 9323 6225 1493 -3491 -6318 -8200 -12386 -13979 -13070 -11993 -10335 -7681 -3304 1401 3684
1367 3684 6949 11459 13159 12670 12527 11104 8694 4942 914 -1762 -6038 -10284 -11409 -12291 -13089 -12024
1383 -12024 -9736 -5834 -2927 73 5113 8489 9697 11687 13083 12473 10390 6935 4941 1844 -3309
1398 -3309 -6548 -8677 -10858 -12616 -12723 -10933 -8103 -6218 -3715 1574 5204 7554 9845 11376 12686
1413 12686 11793 9325 7867 4204 236 -3117 -5959 -8859 -10474 -12052 -11857 -10372 -8283 -4699 -2208
1428 -2208 736 4906 8255 9985 10795 10978 11240 9427 5943 3473 797 -3278 -6896 -8936 -9642 -10527
1444 -10527 -11929 -10341 -6509 -4281 -2530 1007 5213 8370 9663 10141 11291 10827 8475 5873 3419
1459 3419 487 -3214 -7191 -8836 -9185 -10664 -10850 -9587 -7036 -3864 -1624 1284 4843 7888 9197
1474 9197 10077 10023 10330 8328 4927 2652 413 -3201 -6313 -9006 -9643 -9493 -10463 -9419 -6211 -3509 -1095
1491 -1095 1378 4574 8073 8925 9020 9904 9763 7853 4709 1546 -429 -3173 -6951 -8338 -9362 -9674
1507 -9674 -9364 -8783 -5718 -3046 -824 1922 5347 7619 8917 9212 8902 8961 7287 4194 1460 -899
1523 -899 -3197 -6162 -8708 -9054 -8889 -9069 -7772 -5493 -2682 23 1758 4564 8003 8905 8941 8810 8259
1540 8259 6957 4177 792 -737 -3529 -6522 -8081 -9020 -8857 -8470 -7962 -4933 -1914 108 2334 5051
1556 5051 7417 8860 8723 8301 8029 5995 3313 1226 -1809 -3745 -6183 -8169 -8546 -8604 -8328 -6895 -4738
1573 -4738 -2263 897 2838 5067 7216 8168 8749 8259 7184 6044 3479 372 -1779 -3894 -6229 -7807
1589 -7807 -8602 -8231 -7602 -6805 -4138 -1500 291 2983 5071 7014 8355 8079 8107 7407 5403 2935 766
1606 766 -1887 -4216 -6342 -7839 -8151 -8142 -7721 -5837 -4390 -1934 780 2769 5021 6952 8265 8468 7669
1623 7669 6747 5237 2859 159 -1711 -4173 -5745 -7290 -8211 -7631 -7187 -6005 -3831 -1411 846 2944
1639 2944 5018 6755 8150 7602 7420 6490 4651 2723 83 -1859 -3882 -6134 -7458 -7739 -7616 -7010
1655 -7010 -5502 -3747 -1206 975 2900 5361 6666 7275 7503 6872 6024 4883 2179 239 -1962 -3972
1671 -3972 -5793 -6927 -7487 -7152 -6418 -5262 -3522 -1319 1077 3122 4798 6333 7260 7188 7051 5797 4134
1688 4134 2380 97 -2072 -3847 -5778 -6999 -7260 -7125 -6085 -5186 -3629 -759 1066 2975 4970 6064
1704 6064 6893 7236 6605 5848 4055 1984 173 -2279 -3955 -5735 -6662 -7007 -6688 -6183 -4788 -2980 -1259
1721 -1259 998 3014 4264 6142 6530 6786 6407 5150 3888 1902 62 -1934 -3790 -5413 -6299 -6658
1737 -6658 -6310 -5729 -4663 -3033 -741 718 2796 4575 5559 6493 6422 5838 5201 3519 1573 69 -2167
1754 -2167 -3583 -5203 -6226 -6301 -6136 -5663 -4474 -2643 -754 1061 2681 4353 5707 6305 6313 5964 4784
1771 4784 3317 1739 -147 -1705 -3692 -5042 -5154 -6293 -5853 -5159 -4108 -2786 -575 1222 2839 4246
1787 4246 5184 6034 5847 5331 4612 3546 1638 -33 -1549 -3417 -4549 -5643 -5843 -5517 -4884 -3771 -2790
1804 -2790 -734 915 2623 3988 5151 5282 5713 5311 4119 3312 1027 -577 -1542 -3180 -4612 -5154
1820 -5154 -5792 -5296 -4912 -3919 -2073 -522 1118 2509 3999 4843 5475 5537 4965 3841 2483 1171 -231
1837 -231 -2226 -3240 -4574 -5232 -5190 -5073 -4385 -3207 -2197 -269 1348 2664 3867 5118 5613 5416 4705
1854 4705 3676 2868 1013 -559 -1711 -3408 -4256 -5098 -5372 -4434 -4155 -3242 -1674 -528 1392 2784 3725
1871 3725 4509 5358 5154 4913 3885 2328 1118 -485 -2038 -3309 -4397 -5306 -5220 -4940 -3996 -2674 -1830
1888 -1830 -269 1372 2979 3700 4439 4811 4899 4291 3118 2611 1299 -599 -2016 -3067 -3991 -4973 -5034 -4376
1906 -4376 -4039 -2914 -1579 -457 1274 2687 3626 4356 4934 4720 4448 3380 2119 1304 -278 -1824 -3060
1923 -3060 -4218 -4523 -4828 -4939 -4020 -2879 -1525 -159 1233 2792 3892 4143 4508 4996 4355 3315 2059
1940 2059 804 -312 -1730 -3579 -3852 -4326 -4875 -4458 -3855 -2617 -1291 -316 1163 2763 3485 4088 4388
1957 4388 4489 4280 3008 1850 843 -403 -1892 -3271 -4051 -4012 -4344 -4394 -3625 -2634 -1409 -96 1195
1974 1195 2647 3816 3880 4132 4562 4030 3250 1714 590 -423 -1984 -3180 -3734 -4228 -4353 -4170 -3720 -2527
1992 -2527 -1276 -306 1282 2579 3558 4237 3959 4423 4168 2690 1517 929 -644 -1586 -3060 -3733 -3875
2009 -3875 -4483 -3998 -3414 -2177 -1239 -269 1209 2416 3336 3982 3976 4071 3715 2964 1546 692 -754 -1720 -2861
2028 -2861 -3619 -4019 -4190 -3933 -3646 -2672 -1373 58 991 2206 3411 3811 3718 4129 3523 2872 1753 580
2046 580 -656 -1760 -3154 -3777 -3808 -4115 -4041 -3344 -2335 -1407 98 1176 2309 2825 3831 4220 3755 3647
2064 3647 2927 1787 563 -358 -1751 -2432 -3566 -3519 -3861 -3806 -3353 -2390 -1126 91 1315 1946 3113 3795
2082 3795 3674 3683 3496 2759 1782 651 -142 -1441 -2878 -3424 -3385 -3660 -3770 -3224 -2058 -1034 -235 1105 1797
2101 1797 2752 3405 3630 3593 3390 2233 1609 826 -651 -1553 -2382 -3214 -3586 -3645 -3441 -2731 -2152 -1251 183
2120 183 1033 2038 2755 3437 4032 3237 2996 2376 1899 408 -477 -1269 -2457 -3547 -3606 -3654 -3229 -3071 -2021
2139 -2021 -835 34 873 2107 2871 3289 3435 3444 3556 2195 1195 411 -527 -1627 -2530 -2864 -3296 -3369 -3114
2158 -3114 -2687 -1989 -1016 273 995 1890 2685 2732 3567 3422 2534 2561 1598 167 -687 -1381 -2129 -2844 -3503 -3317
2178 -3317 -2943 -2908 -1838 -613 -53 979 1695 2884 3228 3288 2874 3039 2309 1256 104 -786 -1566 -2573
2196 -2573 -3117 -2974 -3237 -3270 -2673 -1934 -777 144 948 2042 2861 3231 3330 3222 2815 1973 1196 149 -516
2215 -516 -1578 -2102 -2658 -3405 -3339 -2898 -2607 -1341 -1049 139 1430 1674 2443 2963 3247 3066 2691 2073 1384
2234 1384 110 -997 -1188 -2275 -3028 -3117 -3212 -3170 -2330 -2011 -594 293 928 2104 2990 3143 3021 2932 2565
2253 2565 2003 1241 430 -580 -1643 -2528 -2757 -3177 -3191 -3075 -2115 -1283 -874 213 1297 2029 2597 3216 3197
2272 3197 3309 2698 1724 1384 146 -899 -1637 -2531 -2795 -3242 -2872 -2339 -2277 -1675 -537 172 1351 1898 2764
2291 2764 2736 3158 2737 2591 2081 859 -40 -665 -1367 -2302 -2712 -3091 -2963 -2957 -2169 -1542 -628 363 1003 1949
2311 1949 2788 2688 3015 3097 2670 1865 945 -153 -966 -1909 -2309 -2415 -2804 -2833 -2541 -2130 -1403 -404 513 1255
2331 1255 1564 2542 3190 3096 2673 2480 1987 1054 104 -908 -1620 -1949 -2858 -2884 -2884 -2446 -2431 -1328 -412 451 1049
2352 1049 1880 2710 2606 2641 2658 2030 1415 638 -128 -885 -1701 -2307 -2581 -3013 -2836 -2224 -1879 -1340 -685 51
2372 51 1485 2050 2415 2730 3013 2792 2131 1457 994 69 -930 -1613 -2149 -2699 -2992 -2578 -2232 -1833 -1280 -436
2392 -436 723 1047 1713 2303 2863 2738 2403 2108 1412 813 14 -970 -1403 -2176 -2791 -2862 -2637 -2480 -2126 -1063
2412 -1063 -341 470 1235 1793 2413 2482 2997 2450 1889 1412 821 -115 -1056 -2011 -1980 -2157 -2568 -2524 -2204 -1542 -1287
2433 -1287 -187 562 1405 1877 2126 2509 2822 2443 1875 1593 879 -45 -646 -1693 -2051 -2653 -2768 -2505 -2095
2452 -2095 -1770 -981 -344 829 1318 2028 2316 2611 2546 2390 1965 1070 784 -133 -985 -1573 -2408 -2403 -2375 -2773 -2230
2473 -2230 -1625 -951 12 593 1555 1896 2115 2556 2794 2265 2106 1173 394 -261 -1090 -1770 -2279 -2455 -2893 -2457
2493 -2457 -1812 -1092 -942 -96 637 1573 2026 2421 2444 2167 2142 1793 1123 488 -351 -1187 -1532 -2460 -2344 -2460
2513 -2460 -2214 -2021 -1272 -500 -82 847 1161 2094 2377 2485 2277 2304 1798 985 356 -236 -1059 -1949 -2012 -2581
2533 -2581 -2225 -2154 -2042 -1174 -575 165 973 1507 2068 2349 2427 2330 2113 1760 1032 338 -624 -1184 -1739 -2351 -2563
2554 -2563 -2432 -2197 -1558 -1428 -632 284 914 1710 1921 2288 2581 2179 1982 1497 680 84 -554 -1160 -1795 -2099
2574 -2099 -2373 -2362 -2151 -1781 -1289 -606 204 931 1359 2369 2321 2323 2293 2088 1466 756 240 -948 -1297 -1632 -2624
2595 -2624 -2331 -2370 -2187 -1533 -1181 -614 225 1094 1463 2073 2426 2483 1864 1781 1500 605 -238 -522 -1433 -1902 -2364
2616 -2364 -2510 -2099 -2079 -1838 -967 -186 143 1131 1582 2004 2101 2223 1973 1686 1352 597 -170 -982 -1486 -1900
2636 -1900 -2499 -2641 -2661 -1983 -1363 -923 -171 406 1323 1579 2073 2439 2262 2218 1974 1310 447 -53 -713 -1589
2656 -1589 -1804 -2455 -2223 -2101 -2026 -1559 -1024 -186 707 1249 1742 2040 2225 2377 2121 1561 1079 469 -133 -1060
2676 -1060 -1535 -1710 -2111 -2420 -2331 -1766 -1292 -1135 -120 496 1279 1643 2091 2508 2343 2148 1579 1115 357 -173
2696 -173 -937 -1534 -1983 -2080 -2417 -2144 -1978 -1452 -579 -174 670 1176 1647 2108 2142 2101 2107 1528 735 273 -410 -823
2718 -823 -1345 -2185 -2034 -1962 -1936 -1693 -1437 -668 364 647 1270 1829 2215 2290 2074 1759 1491 1008 214 -525 -1101
2739 -1101 -1689 -2013 -2116 -2169 -1894 -1753 -1141 -684 149 1013 937 1688 2104 2460 2345 1867 1212 1063 -76 -382
2759 -382 -1122 -1659 -1892 -2075 -2181 -1851 -1391 -1087 -374 407 785 1472 1612 2123 2387 1988 1420 1359 948 28
2779 28 -498 -1246 -1402 -2207 -2163 -2058 -1905 -1116 -1172 -580 374 1049 1384 1786 2047 1777 1970 1889 985 729 -160
2800 -160 -854 -1213 -1794 -1803 -2141 -2192 -1873 -1266 -922 -197 607 1096 1280 1895 2269 2201 2036 1569 1000 501 -224
2821 -224 -540 -1360 -1794 -1895 -2062 -1691 -1669 -1473 -621 -149 560 1427 1588 2014 2020 2060 2044 1258 865 644 -326 -897
2843 -897 -1202 -1649 -1848 -2191 -2072 -1777 -1379 -858 173 362 1019 1443 1790 2230 2108 1803 1145 865 511 -212
2863 -212 -1001 -1568 -1701 -2040 -2127 -1734 -1688 -1232 -677 -117 870 1366 1618 1879 2309 2076 1886 1572 558 364
2883 364 -466 -1122 -1429 -1827 -2075 -2190 -2057 -1641 -1088 -538 -60 873 1230 1642 2142 1958 1846 1782 1215 606
2903 606 78 -34 -680 -1712 -1768 -2008 -1622 -1884 -1438 -994 -309 342 729 1325 1677 1989 2184 2265 1911 1084
2923 1084 775 415 -524 -1040 -1646 -2036 -1792 -1685 -1711 -1395 -897 -315 250 928 1174 1704 1816 1911 1825 1603 1226
2944 1226 601 -239 -445 -1244 -1514 -2121 -2178 -1819 -1764 -1320 -694 -424 268 1187 1390 1553 2014 2024 1626 1582 872
2965 872 554 -55 -594 -1297 -1737 -2016 -1932 -2027 -1582 -1333 -681 -96 393 828 1242 1812 1972 2012 1862 1434 847
2986 847 628 -78 -865 -1108 -1491 -1709 -2175 -1591 -1805 -1269 -798 -100 490 891 1464 1731 1704 1689 1918 1517 948
3007 948 378 -120 -983 -1224 -1657 -1743 -1784 -2217 -1783 -1012 -746 -163 808 864 1632 1901 1736 1695 1514 1215 779
3028 779 467 -273 -657 -1081 -1591 -1834 -1715 -1776 -1447 -1009 -248 21 505 1084 1228 1873 1918 1872 1789 1215 722
3049 722 522 -200 -721 -1277 -1614 -1450 -1630 -1880 -1485 -877 -487 -1 523 1159 1557 1854 1818 2041 1512 1304
3069 1304 612 261 -118 -810 -1445 -1323 -1698 -1913 -1286 -1261 -984 -438 123 731 959 1379 1596 1697 1743 1723 913
3090 913 488 213 -677 -695 -1269 -1514 -1755 -1591 -1656 -1082 -928 -683 48 390 1158 1652 1574 1754 1622 1542 844
3111 844 333 54 -259 -871 -1267 -1635 -1916 -1751 -1528 -1110 -636 -125 391 424 1477 1433 1508 1328 1599 1451 813
3132 813 609 -40 -492 -1054 -1149 -1399 -1796 -2019 -1464 -1041 -681 -225 165 787 1132 1565 1519 1667 1306 1278 1029
3153 1029 360 -176 -604 -1027 -1408 -1457 -1850 -1428 -1178 -1059 -511 -136 717 799 1299 1170 1687 1486 1259 738
3173 738 712 324 -212 -735 -1007 -1277 -1626 -1718 -1579 -1358 -859 -593 115 449 801 1151 1449 1341 1431 1303 913
3194 913 576 55 7 -594 -946 -1210 -1634 -1711 -1496 -1212 -792 -527 29 579 983 1104 1513 1544 1546 1359 1168 797
3216 797 273 -282 -459 -1004 -1639 -1835 -1494 -1394 -1182 -682 -180 48 573 924 1229 1434 1255 1282 1382 861
3236 861 474 57 -281 -874 -1121 -1099 -1747 -1594 -1241 -1150 -617 -14 -16 524 903 1446 1452 1344 1417 1252 882 452
3258 452 -83 -355 -556 -827 -1544 -1423 -1437 -1165 -1124 -687 -456 5 623 777 1241 1412 1517 1431 1015 926 462
3279 462 107 -578 -816 -1031 -1252 -1517 -1181 -1218 -1097 -599 -167 114 547 781 947 1442 1505 1062 1201 680 429
3300 429 -164 -226 -753 -975 -1339 -1333 -1558 -1257 -739 -711 -107 320 544 1205 1186 1253 1450 889 1269 848 264 -30
3322 -30 -714 -790 -1028 -1352 -1131 -1160 -1272 -728 -265 -177 251 423 866 925 1370 919 1213 898 524 463 -231 -395
3344 -395 -468 -1002 -1291 -1142 -1205 -906 -855 -418 -298 129 767 919 1006 1339 1265 1266 897 456 48 -70 -430 -949
3366 -949 -907 -1271 -1448 -1075 -1193 -719 -318 -103 482 407 1128 1126 1010 1281 1204 993 554 -130 -158 -384 -919 -1008
3388 -1008 -992 -899 -1169 -997 -720 -354 -224 334 541 905 761 857 1412 1012 678 572 242 -164 -403 -1057 -860
3409 -860 -990 -1105 -1140 -777 -712 -119 -175 239 665 890 1073 1042 1071 1186 755 305 201 -270 -78 -767 -1094 -916
3431 -916 -1239 -1170 -747 -705 -569 151 589 348 808 889 1278 993 772 668 120 -179 -42 -360 -882 -1060 -1112
3452 -1112 -1170 -850 -762 -241 -220 434 270 808 857 1050 920 710 1001 277 171 182 -225 -465 -618 -1150 -1122 -986
3474 -986 -737 -754 -331 -171 210 337 661 770 885 935 936 567 600 237 154 -108 -279 -691 -955 -1134 -847 -828
3496 -828 -612 -573 -295 46 498 644 776 723 679 679 388 810 302 -68 -111 -445 -633 -728 -735 -781 -778 -244 -541 61
3520 61 140 249 606 762 876 891 922 718 555 278 -307 -436 -661 -357 -812 -503 -638 -589 -588 -437 -182 108
3542 108 299 674 719 868 726 425 647 473 336 -76 -396 -794 -609 -622 -742 -462 -634 -459 -178 -33 162
3563 162 214 543 720 633 752 430 580 434 91 89 -3 -662 -693 -786 -702 -847 -575 -316 -235 9 70 466 609
3586 609 901 644 534 852 350 100 7 155 -350 -499 -653 -664 -668 -385 -670 -366 -265 -47 276 431 533
3607 533 627 760 772 716 406 227 143 108 -356 -72 -498 -436 -440 -587 -638 -244 -56 -274 158 404 415 773 485
3630 485 323 467 523 122 48 27 -422 -347 -657 -417 -536 -616 -467 -212 -73 32 97 365 406 476 634 564 686
3653 686 507 76 -43 -28 -162 -66 -543 -377 -332 -520 -340 -41 -109 224 115 232 411 570 670 282 220 247
3675 247 69 179 -101 -350 -154 -173 -448 -440 -365 -191 95 63 -206 346 354 508 504 156 372 77 328 179 67
3698 67 236 -97 -356 -508 -366 -459 -565 -443 -157 -38 -22 96 -173 524 364 249 374 397 154 226 117 -103
3720 -103 -320 -245 5 -253 -518 -373 -369 -328 -240 110 435 112 166 308 526 144 220 -6 -77 70 -102 -32 -112
3743 -112 -12 -652 -200 -163 -210 -89 115 212 -115 76 158 248 168 388 98 -39 -128 -72 199 -445 -152 -155 -169 -401
3767 -401 -138 -124 -309 -114 -111 68 -16 274 345 320 -60 60 -78 1 -34 162 -160 -307 -493 -28 -151 -349 -21
3790 -21 -128 131 6 58 61 42 52 292 240 -50 120 18 243 24 -238 -182 -523 -185 -104 -19 -263 -185 -10 -362
3814 -362 -263 114 17 131 115 294 163 213 -17 -107 174 -205 -159 -185 -280 -180 -1 -235 -64 11 190 -109 88
3837 88 118 218 -71 110 250 163 -145 370 -54 62 -82 -98 -30 -308 -179 129 -147 67 -127 170 187 75
3859 75 -69 75 -85 75 213 136 126 -71 75 142 26 -101 17 -20 -77 -102 111 -34 -167 -36 101 -116
3881 -116 -103 -174 -17 -240 230 94 151 71 183 136 -77 152 118 -45 -281 179 -176 -151 -98 81 -43 -87 -33
3904 -33 31 225 99 188 133 107 38 132 204 361 -139 -213 -117 -83 -331 -100 -72 -126 39 -100 -68 238 253 321 275 9
3930 9 205 229 232 43 24 -95 14 75 -62 -303 -214 -169 -430 -306 -109 27 -40 -27 -39 70 145 176 383 47 33
3955 33 145 120 164 -306 -104 48 -428 -391 -260 -299 -105 -92 -85 -134 149 92 207 134 153 145 199 439 246 21 22 -325
3981 -325 -458 -172 -303 -287 -119 -278 -216 -9 -295 119 157 -45 349 248 345 373 7 289 -203 -240 -165 -216 -406
4004 -406 -263 -541 -190 -175 -36 62 -1 369 475 444 155 131 564 90 79 158 59 -238 -260 -192 -105 -374 -157 -118
4028 -118 -144 62 -43 232 373 240 395 381 474 349 278 127 326 -43 -472 -379 -284 -315 -78 -478 -506 -214 -361
4051 -361 233 -43 329 317 213 375 257 182 -26 -7 -167 -123 -256 -270 -428 -442 -294 -328 -150 -412 -218 134
4073 134 348 292 396 454 217 553 302 119 123 -91 -93 -254 -361 -186 -459 -453 -313 -343 -437 -341 176 289 35 210
4097 210 237 262 465 441 88 304 249 44 -341 -443 -628 -767 -578 -522 -418 -181 -198 -63 379 285 493 306
4119 306 458 606 159 283 6 400 -99 -172 -608 -580 -273 -450 -277 -481 -361 156 11 403 376 569 366
4140 366 473 356 604 435 -109 -213 -132 -279 -715 -218 -432 -308 -249 -361 -34 108 73 561 347 606 598 603
4162 603 271 332 272 183 62 -66 -253 -431 -729 -961 -681 -439 -226 -344 88 324 337 345 529 549 581 557 351
4185 351 503 291 -139 -159 -654 -537 -534 -642 -430 -354 -433 52 54 209 624 473 845 545 582 565 358 43 157
4208 157 -176 -225 -520 -686 -608 -557 -674 -571 -371 -102 -74 214 241 757 831 433 468 752 426 394 85 -387 -538
4231 -538 -532 -776 -842 -679 -711 -615 -416 -147 -211 286 398 846 517 766 405 552 488 305 -51 -18 -307 -476 -644
4254 -644 -839 -784 -705 -345 -544 -366 49 399 409 541 809 636 662 440 443 344 -31 -231 -300 -1012 -682 -684 -784
4277 -784 -654 -763 -380 -170 86 143 356 617 747 515 749 721 588 241 127 -314 -253 -552 -788 -671 -685
4298 -685 -641 -469 -462 -200 44 375 435 587 726 883 1058 528 527 25 -103 -216 -266 -699 -623 -795 -669 -625 -318
4321 -318 -431 -94 68 356 744 749 975 851 952 588 289 -112 -284 -60 -428 -603 -843 -682 -977 -859 -643
4342 -643 -250 -157 430 265 604 935 850 656 752 530 610 198 -43 -233 -344 -904 -714 -951 -808 -598 -631 -615
4364 -615 -125 134 331 539 814 737 736 733 641 442 274 91 -191 -510 -810 -865 -1150 -664 -879 -305 -327 -36 532
4387 532 171 738 911 980 735 757 708 401 136 -43 -650 -667 -673 -784 -872 -764 -752 -526 -197 87 247 565 848
4410 848 942 790 763 967 577 57 32 -159 -624 -821 -775 -1031 -648 -1143 -899 -601 137 -72 340 798 646
4431 646 1008 1027 730 838 537 383 105 -288 -462 -666 -841 -683 -598 -660 -792 -107 -238 143 311 320 577 877
4453 877 935 1062 872 443 453 124 -169 -395 -758 -686 -926 -1160 -726 -439 -215 -72 179 305 687 862 984
4474 984 813 424 796 625 500 25 -22 -537 -855 -795 -1018 -798 -908 -745 -424 -283 262 321 611 996 1088
4495 1088 880 950 1002 436 163 -98 -190 -662 -747 -649 -816 -1026 -838 -712 -466 83 146 516 765 703 926 821
4517 821 667 691 222 38 273 -317 -534 -982 -921 -1076 -1063 -704 -614 -496 249 204 626 935 747 1001 957 1033
4539 1033 813 914 347 -147 -346 -680 -824 -1107 -944 -928 -1107 -303 40 102 350 614 1302 947 974 934 933 786
4561 786 598 358 -41 -122 -546 -797 -835 -1079 -852 -587 -402 -297 -48 335 1112 878 1045 879 713 917 704
4582 704 405 -32 80 -617 -649 -736 -938 -1162 -977 -956 -826 -220 -104 168 707 872 854 1067 855 758 945 428
4604 428 160 -338 -350 -706 -993 -804 -871 -1001 -642 -498 -212 114 421 699 687 953 885 940 684 830 289 264
4626 264 -279 -612 -616 -748 -1264 -673 -958 -825 -549 -192 237 506 726 893 1010 1111 1222 956 631 189 128
4647 128 -268 -455 -934 -979 -1127 -1163 -942 -713 -570 90 368 329 864 904 1062 1145 858 872 712 343 -79 -303
4669 -303 -605 -1120 -823 -950 -923 -883 -620 -296 62 98 730 728 908 933 707 911 538 617 268 149 -421 -441 -844
4692 -844 -963 -1240 -880 -527 -674 -351 -152 67 402 728 835 1069 958 913 907 321 80 -114 -380 -321 -789
4713 -789 -989 -1039 -879 -939 -488 -314 200 208 727 492 970 1223 1085 901 717 588 201 -102 -356 -900 -1096
4734 -1096 -881 -950 -1218 -808 -414 -374 248 433 630 944 760 1144 900 987 716 538 185 -228 -596 -953 -1020
4755 -1020 -900 -1087 -791 -891 -492 45 -102 381 812 766 1107 1100 1220 1020 687 250 49 -146 -755 -1056 -1034
4776 -1034 -879 -1145 -1019 -577 -549 -47 193 248 620 863 997 1148 935 647 670 203 33 -177 -798 -984 -922
4797 -922 -1201 -986 -1307 -674 -428 -185 58 704 986 769 1056 958 962 955 633 255 124 -458 -764 -914 -894 -900 -914
4820 -914 -1004 -911 -580 138 132 298 632 1103 1255 1248 929 993 426 427 259 -237 -622 -880 -1042 -1389 -1023 -952 -539
4843 -539 -666 173 603 643 777 1025 920 730 1264 716 336 116 -199 -710 -860 -945 -1026 -1310 -987 -765 -775
4864 -775 -302 -6 427 709 658 973 1228 1168 830 493 265 -124 -277 -727 -744 -1077 -1014 -1068 -1105 -869 -585 -15
4886 -15 175 600 543 984 1110 1067 1243 1026 824 591 -22 -301 -406 -802 -903 -1078 -1060 -1039 -933 -495 -361 7
4908 7 522 475 846 1165 1026 1153 1082 549 210 124 -240 -522 -861 -1148 -1118 -927 -1074 -1123 -466 -447 -9 688 806
4931 806 993 947 1314 973 1024 767 327 -7 -222 -903 -713 -1132 -1244 -1326 -1118 -698 -562 -271 143 508 927
4952 927 801 1273 1158 1158 770 506 244 -77 -368 -787 -1064 -941 -946 -946 -1131 -953 -335 -203 62 592 1105 1020
4974 1020 1186 1049 952 935 763 166 -172 -541 -533 -856 -1141 -1279 -1279 -1066 -436 -542 -385 94 858 832 1186 1357
4996 1357 990 1123 637 654 147 211 -537 -622 -1083 -1191 -1255 -1260 -980 -772 -302 -351 309 829 878 873 1034 1045 1036 894
5020 894 556 2 -62 -569 -599 -869 -1277 -868 -1146 -801 -577 -613 148 391 692 1059 1076 1282 1061 1104 741 445
5042 445 -121 -36 -206 -993 -1270 -1108 -1164 -982 -814 -426 -361 19 346 409 1144 1169 1282 1079 975 636 493 151
5064 151 -279 -610 -847 -887 -1426 -1212 -1123 -894 -451 -366 355 419 541 779 1178 1242 1004 934 834 403 188 -336
5086 -336 -754 -706 -1091 -1190 -1455 -1197 -923 -304 -145 96 511 1049 677 1094 1249 1101 981 521 308 18 -438
5107 -438 -615 -888 -1352 -1306 -1300 -1147 -916 -244 121 377 343 804 870 1047 1065 1172 861 398 297 -136 -619 -714
5129 -714 -1110 -1084 -1126 -1174 -1042 -581 -455 -187 290 789 895 984 1252 1316 1165 921 604 89 -228 -549 -602 -813
5151 -813 -857 -1042 -1172 -779 -675 -442 -164 233 669 830 1152 1323 1159 778 951 393 166 -234 -381 -567
5171 -567 -1107 -1380 -1126 -1000 -759 -485 -281 100 408 807 802 901 1343 1309 832 608 579 376 -123 -429 -736 -1103
5193 -1103 -1213 -1289 -1124 -631 -658 -187 -97 717 759 846 952 1077 988 854 795 721 95 -353 -682 -928 -1061 -1139 -1077
5216 -1077 -1289 -868 -563 -549 318 553 678 917 1178 1023 987 1000 469 322 -89 -391 -432 -890 -1081 -751 -1034
5237 -1034 -935 -677 -357 -356 244 566 682 1021 1011 1203 1160 638 660 281 42 -502 -324 -1033 -1101 -1100 -935 -1106 -829
5260 -829 -520 -249 118 448 739 900 1078 1088 957 802 857 428 -79 -276 -477 -1045 -1002 -1335 -1123 -849 -974
5281 -974 -521 -17 219 587 958 770 1232 1202 982 739 521 469 173 -256 -772 -797 -1114 -1117 -965 -1005 -782 -380
5303 -380 -176 -2 701 916 1195 1163 1534 861 729 716 351 7 -489 -624 -959 -864 -685 -1107 -951 -762 -385
5324 -385 73 309 435 987 1152 894 896 727 796 638 336 -29 -453 -1044 -687 -1196 -1145 -1089 -783 -830 -499 121
5346 121 289 608 819 647 1045 1177 1312 916 489 427 -116 -351 -951 -817 -1072 -1237 -1292 -729 -837 -446 -122
5367 -122 368 481 485 1011 1193 1098 1044 901 680 151 -345 -532 -618 -735 -1205 -1168 -712 -654 -798 -275 202 377
5389 377 425 887 1090 1038 1012 817 721 460 184 -178 -421 -1041 -752 -1053 -986 -1121 -651 -700 -253 101 157 622
5411 622 902 976 971 908 761 790 121 16 -131 -579 -676 -1013 -1171 -687 -948 -526 -416 -211 169 506 505 1137 918
5434 918 1113 903 757 536 350 -124 -302 -550 -620 -947 -875 -974 -899 -608 -616 46 -107 524 458 665 1069 1150 986
5457 986 874 722 472 -193 -332 -358 -757 -950 -1136 -978 -942 -600 -455 -170 194 505 834 833 945 1175 906
5478 906 707 539 382 -88 -209 -510 -799 -1019 -1062 -1135 -1046 -1028 -442 -243 14 545 622 1028 921 1091 822 792
5500 792 376 200 -50 -173 -734 -956 -1015 -1203 -1222 -1134 -586 -193 103 180 395 643 996 1002 1021 989 949 473 275
5523 275 -21 -678 -805 -1000 -854 -1312 -783 -1025 -666 -190 -221 149 884 829 770 1120 1024 977 825 389 241 -121
5545 -121 -492 -381 -592 -713 -1022 -774 -1061 -620 -301 35 311 743 757 975 1025 809 858 656 241 213 165 -396
5567 -396 -892 -766 -779 -854 -670 -660 -222 -86 29 89 411 545 887 1086 704 949 704 314 -118 -279 -124
5588 -124 -612 -594 -970 -858 -699 -785 -564 -157 32 212 663 760 746 997 590 777 708 433 78 -129 -384 -664
5610 -664 -981 -898 -997 -942 -705 -478 -219 -120 125 669 1111 670 996 908 762 482 305 108 -423 -591 -952 -893
5632 -893 -776 -600 -784 -551 -307 -101 -32 333 624 716 920 993 1083 518 461 336 92 -257 -210 -568 -707 -724
5654 -724 -885 -796 -892 -511 -148 -14 376 614 644 763 957 529 599 171 406 -17 -193 -440 -731 -588 -732
5675 -732 -906 -552 -547 -158 -22 336 507 365 719 963 737 527 644 560 268 -60 -179 -456 -852 -927 -857 -1089
5697 -1089 -582 -551 -435 -268 363 402 603 640 666 606 591 743 295 103 214 -336 -456 -743 -949 -605 -702 -816
5719 -816 -457 45 -151 455 189 751 1069 1077 1048 784 286 461 6 14 -309 -312 -695 -728 -1086 -951 -683 -741 -177
5742 -177 -110 114 523 314 774 752 842 919 771 428 93 -14 -358 -587 -722 -1178 -886 -900 -587 -493 -381 272
5764 272 48 392 709 817 1013 649 728 490 277 112 28 -268 -712 -564 -718 -1031 -535 -596 -363 -230 -59
5785 -59 -49 373 794 610 861 757 424 685 445 -176 177 -459 -486 -638 -828 -697 -846 -456 -308 -238 31
5806 31 496 503 539 724 930 771 591 226 463 91 -94 -231 -537 -570 -904 -881 -556 -667 -149 -299 -41 183
5828 183 439 578 711 1018 839 690 532 389 174 -47 -437 -303 -699 -692 -482 -693 -493 -261 -136 212 -56
5849 -56 791 590 692 780 742 619 571 103 54 -486 -237 -566 -824 -832 -692 -468 -629 -345 -196 -121 195 607 508
5872 508 674 703 646 729 459 183 151 -451 -412 -609 -709 -805 -863 -419 -532 -336 -65 166 361 338 483 500 588
5895 588 571 608 332 260 -273 -145 -326 -220 -455 -641 -859 -701 -402 -471 16 239 173 635 506 530 567 580 471
5918 471 594 -20 -80 -550 -394 -454 -445 -606 -740 -589 -495 -189 -112 307 185 395 631 607 693 524 452 490 46
5941 46 -73 -138 -202 -573 -604 -382 -614 -413 -551 -291 -184 59 -11 491 193 605 510 605 437 195 360 10
5963 10 -321 -251 -441 -809 -334 -574 -503 -280 -397 23 338 500 286 601 808 682 632 295 152 70 143 20
5985 20 -350 -430 -458 -575 -680 -260 -318 -119 108 68 229 303 537 444 427 385 301 176 130 129 -234 -369 -486 -232
6009 -232 -732 -675 -308 -95 4 -42 124 211 474 598 447 636 473 441 387 326 -48 -313 -400 -720 -397 -520 -586
6032 -586 -360 -185 -45 86 448 516 223 510 666 651 924 677 274 -110 -188 -306 -451 -541 -440 -379 -644 -188
6054 -188 -271 -186 114 289 229 337 561 524 755 406 440 393 30 -89 -95 -425 -363 -643 -405 -472 -334 -147 35
6077 35 3 76 278 423 469 545 369 351 530 182 29 -145 -172 -156 -759 -646 -812 -426 -546 -374 -144 -115 142
6100 142 115 694 519 505 505 398 420 260 71 -452 -226 -175 -241 -656 -765 -297 -407 -282 -198 165 -27 198 626
6123 626 468 371 454 431 183 71 -243 9 -148 -504 -493 -395 -375 -616 -151 -204 -167 202 174 189 304 785 466
6146 466 618 537 560 62 37 -16 -151 -396 -645 -321 -476 -381 -294 -394 -78 275 193 137 257 282 546 593 186
6169 186 9 13 13 -202 -407 -420 -331 -393 -482 -68 -317 -275 -56 131 54 19 362 504 426 581 630 422 201 -140
6193 -140 46 -52 -330 -573 -788 -428 -356 -457 -417 96 311 365 320 477 329 515 319 265 -12 -41 -81 27 -149
6216 -149 -367 -609 -698 -328 -222 -120 -327 0 81 233 377 364 657 725 452 402 373 442 -45 -120 -397 -522 -240
6239 -240 -517 -273 -487 -413 -165 -68 257 83 241 391 549 245 551 142 116 195 -66 110 177 -424 -325 -304
6261 -304 -405 -522 -230 -200 -165 -183 99 487 246 204 360 354 444 445 256 -152 -142 -324 -316 -423 -405 -244 -194 -363 -262
6286 -262 -91 -130 76 270 774 406 434 312 401 317 242 296 87 -202 -309 -389 -225 -494 -198 -267 -305 -76 -193
6309 -193 29 43 243 386 547 358 540 215 355 -63 -29 -195 -208 -543 -320 -633 -47 -311 -318 222 285 369
6331 369 309 418 482 293 116 60 55 249 104 88 -14 -212 -264 -392 -59 -187 -253 -192 -192 17 13 503 222 375
6355 375 554 532 437 209 -85 115 43 -213 -299 -392 -622 -276 -334 -218 -71 25 96 -169 247 143 200 305 170
6378 170 163 193 36 -168 -134 -374 -170 -53 -166 -460 -142 -231 -194 -119 30 319 376 266 557 178 258 336 237 463
6402 463 62 -142 -44 -454 -151 -210 -364 -237 -216 24 91 199 89 330 269 231 371 28 332 307 254 -11 178
6425 178 -205 -486 -205 -290 -219 -140 -184 -297 303 -36 -63 227 159 515 547 356 349 227 115 -80 -34 -298 -248 -138
6449 -138 -468 -35 -393 -226 -285 -226 -17 30 36 373 387 570 36 -49 -30 78 -24 -247 -311 -328 -437 -262 -297 -310
6473 -310 -201 -207 -201 -309 306 39 430 270 394 350 95 269 140 -99 254 -439 -317 -255 -347 -495 -351 262
6495 262 -239 -15 216 97 153 439 -15 171 509 8 308 46 -191 -161 -186 -245 -444 -502 -171 -561 -463 -7
6517 -7 -195 374 370 352 487 501 409 369 213 324 -62 188 2 -362 -41 -425 -169 -242 -702 -165 -510 76 102
6540 102 196 215 89 453 372 229 328 186 34 -64 -356 -283 -429 -541 -144 -384 -284 -310 -205 230 86 382
6562 382 249 536 276 213 619 317 32 -73 7 -209 -9 -413 -384 -437 -389 -429 -32 -213 -295 76 243 44
6584 44 233 575 408 362 24 215 -62 -253 41 -96 -130 -254 -297 -82 -323 -262 -291 28 -134 97 271 28
6606 28 455 374 308 346 422 59 -212 -202 300 -322 -224 -405 -255 -458 -270 -46 -101 -51 274 270 332 365 498 20
6630 20 434 212 -95 -144 -50 -423 -364 -250 -311 -357 -453 -54 -242 -139 47 347 255 441 491 266 232 19 372
6653 372 -94 -59 -168 -211 -310 -144 -298 -257 -292 -362 -477 125 -113 90 327 545 333 304 360 213 333 13 -218
6676 -218 81 -196 -363 -273 -259 -168 -274 -338 -169 208 159 105 354 397 532 524 337 570 372 223 134 -54 -121 -293
6700 -293 -199 -280 -376 -51 -178 54 -237 77 58 242 94 243 473 271 -21 404 -323 35 -90 -144 -236 -536
6722 -536 -299 -769 -38 -341 -26 -46 87 68 283 432 363 401 188 271 -54 81 -152 11 -134 -549 -563 -268
6744 -268 -216 -119 -286 -127 -50 293 263 547 549 512 534 101 246 -34 101 -109 -126 -400 -351 -620 -219 -551 -328
6767 -328 -138 -95 397 -58 229 449 414 389 222 177 304 313 150 -36 -130 -490 -462 -211 -424 -298 -486 -146 -98
6790 -98 -139 285 270 254 485 297 373 446 -68 350 -18 -29 -119 -587 -94 -256 -457 -393 -510 -248 -118 86 303
6813 303 -197 668 484 377 334 545 359 284 -120 210 -14 -401 -66 -631 -398 -213 -407 -136 -112 -145 192
6834 192 137 502 234 316 356 322 229 227 -65 -125 -117 -74 -285 -495 -319 -486 -343 -99 -69 22 125 155 235 531 455
6859 455 397 515 473 65 -88 -98 -331 -286 -559 -491 -507 -567 -84 -115 -88 -23 307 418 575 652 592 335 245 55
6883 55 106 -26 -165 -365 -112 -345 -351 -561 -459 -258 120 -79 -10 275 252 279 453 281 607 534 420 49 59
6906 59 -165 -596 -478 -510 -425 -383 -161 -312 -262 -172 102 199 190 375 448 441 455 316 325 323 112 -619 -196 -294 -333 -461
6932 -461 -291 -553 -280 -303 151 114 120 263 131 512 493 300 307 353 -47 -146 -112 -426 -272 -579 -653 -443 -245 -127
6956 -127 -365 -6 192 224 384 485 542 321 267 455 409 -12 -147 58 -203 -397 -265 -589 -743 -279 -316 -158
6978 -158 147 215 5 470 606 267 449 298 333 122 -67 6 -514 -46 -294 -332 -395 -252 -586 -343 -192 147
7000 147 24 189 629 515 399 407 540 444 122 85 -85 -242 -479 -637 -230 -439 -831 -298 -264 42 -300 340
7022 340 350 485 470 376 467 420 307 102 -167 -185 -407 -248 -210 -454 -486 -380 -353 23 -81 27 379 459 269
7045 269 343 500 395 243 504 322 70 -153 -374 -218 -422 -508 -379 -372 -405 -156 15 -43 78 108 353 237
7067 237 423 532 392 527 -40 117 -435 -464 -439 -631 -531 -425 -548 -327 -202 46 227 214 353 541 504
7088 504 452 465 203 16 62 -246 -451 -244 -573 -385 -154 -384 -534 -474 -233 152 2 234 343 423 488 625
7110 625 476 682 47 161 -93 40 -222 -358 -495 -669 -450 -329 -317 -179 -13 48 176 191 455 625 189
7131 189 667 250 356 532 73 -268 -353 -267 -171 -287 -289 -394 -144 -229 12 -168 228 249 630 394 326 518 120
7154 120 266 -15 117 -229 -241 -297 -369 -610 -331 -460 -392 192 -4 244 324 504 309 540 199 417 282 127
7176 127 -42 114 -271 -168 -262 -389 -562 -495 -489 -155 -194 242 183 534 494 503 367 404 464 251 54 254 -110 -146
7200 -146 -832 -420 -399 -474 -339 -313 -202 -109 -64 77 294 502 455 280 454 359 136 207 16 168 -208 -98 -438
7223 -438 -668 -549 -267 -367 -353 8 31 258 320 296 445 414 -250 441 239 331 16 -447 -118 -474 -443 -373 -343
7246 -343 -365 -162 -348 -44 142 175 15 638 512 556 628 289 241 184 30 81 -70 -300 -514 -614 -528 -736 -493
7269 -493 -319 132 137 59 446 822 531 375 368 242 342 -5 61 -73 -213 -357 -305 -390 -338 -371 -184 -168 -263 330
7293 330 251 510 355 446 608 242 526 353 -147 -225 -303 -285 -459 -495 -768 -344 -166 -46 -181 87 213 166
7315 166 316 452 486 304 20 205 326 -26 124 -121 -262 -271 -201 -650 -468 -372 -235 -76 -5 117 50 366
7337 366 457 517 459 390 171 5 -10 -35 -309 -550 -198 -676 -420 -284 -239 -305 -179 -165 265 44 431 575 484
7360 484 672 397 274 410 -15 13 -120 -370 -775 -551 -532 -553 -298 37 31 -71 175 195 500 432 447 530 366
7383 366 493 47 376 -229 -35 -296 -370 -468 -485 -708 -349 -221 -224 -12 291 461 530 443 392 359 204 308 -3
7406 -3 -191 -164 -186 -567 -341 -534 -612 -493 -281 -112 43 106 182 291 313 242 616 505 264 403 247 292 -1
7429 -1 -356 -147 -334 -717 -663 -817 -129 -231 -35 -75 122 297 342 377 354 543 275 179 232 -164 59 19 -529
7452 -529 -609 -929 -639 -365 -499 -210 -75 135 244 58 228 518 571 349 656 132 247 63 -120 -267 -324
7473 -324 -590 -395 -707 -255 -180 -316 127 65 237 178 603 653 547 406 212 309 9 -138 -70 -291 -377 -545
7495 -545 -503 -356 -525 -190 -290 90 292 501 358 480 450 560 431 223 365 18 173 -146 -85 -367 -296
7516 -296 -351 -371 -339 -62 -138 50 213 370 246 350 192 506 510 299 560 -33 -121 -86 -190 -382 -163 -284 -267
7539 -267 -388 -273 -9 0 2 361 214 557 252 842 500 245 219 44 -90 29 -613 -303 -259 -285 -151 -190 -2
7562 -2 -188 170 -52 528 217 476 341 275 176 218 97 12 -242 68 -404 -423 -331 -429 -528 -493 -108 69 183 253
7586 253 275 441 366 410 541 259 131 215 283 -458 -275 -272 -362 -432 -425 -504 -75 -118 -191 -66 52 397 548 235 705
7611 705 401 238 62 217 52 -111 -179 -264 -310 -517 -501 -593 -164 -261 233 -26 86 196 478 214 415 324
7633 324 492 193 21 209 -124 -44 -498 -346 -358 -237 -217 -275 -125 20 -60 290 172 439 703 535 68 474
7655 474 330 56 -186 49 -136 -165 -114 -345 -438 -253 -143 -185 -1 159 255 405 506 329 442 113 138 392
7677 392 23 77 -308 -542 -455 -179 -255 -339 -350 -104 -182 91 290 329 357 460 237 264 234 574 69 -15 133 -302
7701 -302 -345 -188 -571 -668 -252 -447 82 -268 103 104 347 283 301 402 343 456 557 -52 -107 -101 -361 -237 -251 -175
7725 -175 -393 -567 -389 -271 -50 15 257 307 587 478 499 350 295 273 84 -99 -123 -72 -279 -388 -181 -345
7747 -345 -370 -164 -150 -140 243 6 197 211 603 273 319 290 18 -96 -189 -101 -114 -149 -600 -475 -543 -300 -332 -112
7771 -112 206 57 300 466 50 197 326 443 316 224 42 133 -22 -539 -352 -422 -355 -376 -282 -285 -374 40 251
7794 251 -43 242 263 368 275 375 330 196 -62 56 -95 -181 -330 -582 -449 -295 -334 -90 -303 -113 53 127
7816 127 338 311 655 237 449 400 149 123 -149 -13 -248 -244 -723 -411 -586 -137 -204 -26 214 177 477 52
7838 52 543 445 172 326 217 -122 294 -11 -362 -509 -470 -149 -352 -283 -443 -202 -90 41 -14 373 420 431
7860 431 839 720 462 -5 370 -405 -380 30 -120 -370 -409 -722 -307 -306 16 -59 110 88 88 427 119 359 340
7883 340 184 79 183 25 -41 -204 -369 -155 -235 -320 -246 -326 -334 121 -77 244 247 341 768 434 222 260 381 41
7907 41 50 -126 -178 -469 -381 -387 -341 -365 -469 16 0 259 155 287 129 245 286 574 228 228 51 231 -108 -546
7931 -546 -309 -470 -374 -208 -163 -105 -110 -21 -71 54 479 264 265 315 375 346 242 195 -228 -132 -171 -118 -242 -445 -287
7956 -287 -298 -332 -31 85 17 236 225 410 332 396 329 -75 222 -35 -58 209 -264 -439 -244 -267 -200 -72 -62 -257
7980 -257 -226 -137 183 454 468 144 341 658 330 174 -44 -64 -405 -182 -189 -220 -389 -358 -243 -48 -161 182 181
8003 181 409 208 416 129 307 609 169 141 266 -83 -87 -404 -170 -263 -717 -280 -459 -142 51 277 186 243
8025 243 85 283 461 400 417 -234 131 177 31 -162 -22 -372 -411 -406 -260 -28 159 -69 27 178 342 292 294
8048 294 396 45 -15 392 301 -5 16 -389 -212 -184 -451 -218 -166 -245 -127 -106 85 40 172 -44 250 83 340
8071 340 205 163 360 -117 -52 -130 -336 -328 -281 -298 -272 -62 -92 -260 149 31 399 496 555 294 373 28 -11 60 -48
8096 -48 -245 -66 -80 -458 -349 -384 -428 -127 -372 -87 139 344 85 289 371 374 372 151 203 245 -181 63 -58 -324
8120 -324 -175 41 -113 -173 -44 -26 -75 205 175 106 527 338 159 78 331 104 12 -213 -26 -21 -229 -492 -358
8143 -358 9 -276 -284 -22 68 121 55 329 363 141 -11 223 352 -8 213 -154 -189 -105 -13 -515 -552 -311 -153
8166 -153 -290 82 75 274 149 -1 -60 98 183 211 284 118 36 -115 -188 -299 -154 -106 -331 -224 -59 -303 -46
8189 -46 173 159
8191A59
$$ Imaginary data points
##PAGE= N=2
##DATA TABLE= (X++(I..I)), XYDATA
0 0 0 0 0 0 0 0 0 0 1 -8 8 -8 16 -16 24 -26 32 -41 49 -64 73 -89 105 -126 146 -170 199 -229 267 -305 349
31 349 -397 451 -511 577 -651 729 -818 914 -1020 1137 -1262 1401 -1550 1715 -1896 2092
47 2092 -2306 2543 -2800 3085 -3398 3747 -4133 4566 -5055 5613 -6250 6993 -7868 8915
61 8915 -10202 11820 -13929 16810 -20990 27642 -39913 70164 -310883 -237096 341003 -97815
73 -97815 -463744 -302660 95619 139815 144931 163062 100889 8471 217309 433649 301728
84 301728 -81949 -166109 90998 190968 -101040 -298600 -224791 -163102 -189194 -115042 -62591
95 -62591 -156192 -176050 62981 225807 122332 60052 184858 219207 136163 149681 217481
106 217481 79127 -167881 -133290 97347 6788 -343715 -373469 -59657 36223 -192844 -243281
117 -243281 13398 126409 28415 75668 221120 177120 69933 164674 284386 113545 -127550
128 -127550 -42214 141382 -7768 -293904 -279025 -55159 -25690 -190959 -217466 -81457 7113
139 7113 62342 121565 86970 27162 124163 290388 245728 18601 -43096 99576 113924 -56240
151 -56240 -156921 -130998 -136200 -182769 -132364 -50591 -119474 -190135 -31161 158789 115699 4782
163 4782 80784 220402 181302 81687 127870 152406 -4238 -112641 -17412 48403 -109984
174 -109984 -278023 -197978 -37299 -52933 -132728 -100787 -24557 23395 91369 165689 134586
185 134586 38086 82121 223550 192615 8705 -66776 2939 22127 -75516 -147756 -135178
196 -135178 -141840 -150784 -84664 -34582 -67957 -69179 39274 136817 104314 59922 133073 184612
208 184612 105985 41049 75780 81095 -25415 -116915 -83859 -49755 -121114 -169890 -123010 -81199
220 -81199 -79121 -45878 23890 44270 21766 76803 174759 155488 65156 62309 120414 100389
232 100389 -3699 -60175 -43126 -61234 -113487 -118652 -107422 -121431 -111748 -49500 2518 -9278
244 -9278 -6085 80380 141081 104689 76065 111876 131724 78107 15692 12145 836 -63858 -100270
257 -100270 -88033 -98478 -127362 -116745 -67506 -40919 -45113 -5768 64346 78155 67006 97818
269 97818 135366 116151 62666 50125 66029 24350 -48321 -70036 -68416 -89110 -110672 -106106
281 -106106 -88987 -84981 -63416 -1074 33383 21480 41529 102257 131714 102409 68157 78883
293 78883 82354 36008 -8163 -28550 -56711 -84662 -93581 -89592 -96294 -107958 -76427 -21282 -5712
306 -5712 -3709 34057 81742 98623 87220 89126 102667 80400 42427 27409 7364 -32445 -65896
319 -65896 -77685 -81197 -96905 -104347 -77171 -53003 -45163 -17260 25698 54210 62230 71422 99075
332 99075 108362 80403 58375 50330 27727 -5659 -36399 -56832 -74703 -94882 -92182 -76094 -76554
345 -76554 -69720 -34862 3183 26092 37958 59938 88391 92606 83558 81937 68859 41203 14375
358 14375 -7756 -26770 -55284 -80963 -83987 -83241 -85149 -71661 -49489 -28699 -8618 16345 52145
371 52145 73620 71657 76822 86723 80612 61363 35727 12236 -8409 -35496 -54797 -67162 -83501
384 -83501 -88054 -76990 -62972 -46215 -28203 -3588 26777 45467 59030 76999 84269 80682 68737
397 68737 50832 35682 16104 -9505 -33443 -60048 -76912 -72199 -67323 -72064 -71946 -53611 -15519
410 -15519 15310 24523 35906 54234 71835 85916 82788 64102 41340 20274 12414 4490 -29188
423 -29188 -67125 -82962 -72100 -54478 -57649 -68980 -54588 -21130 15422 39299 42887 46388 59749
436 59749 74202 85649 73291 37194 7698 -1908 409 -12172 -55656 -90274 -82372 -54713 -41248
449 -41248 -51086 -55762 -26402 14015 38988 50528 52398 54904 62919 70003 70975 49400 7858 -14785
463 -14785 -11318 -15184 -44179 -78281 -81360 -56656 -45849 -49520 -38495 -12720 12943 26285 37970
476 37970 60471 72196 61394 51514 50971 46179 25601 -6460 -24068 -31081 -48723 -63289 -61882
489 -61882 -54884 -53411 -55402 -36436 5275 27933 20563 20942 48045 81144 78251 45555 29695
502 29695 33316 25196 4129 -18081 -36755 -55378 -70271 -57880 -33671 -39827 -61505 -49370 3358
515 3358 47377 37871 13748 30694 68954 80899 60049 30850 16021 8970 29 -6136 -24418
528 -24418 -59720 -79098 -61568 -29209 -22491 -48915 -53186 -7123 42402 50326 29224 24419 53745
541 53745 73725 59117 34445 17498 5148 -7421 -20110 -26262 -39863 -66537 -71417 -43658
553 -43658 -20992 -26248 -36187 -13046 30516 44503 34189 40170 57321 58375 40672 28313 30947
566 30947 16556 -19259 -36950 -31620 -32289 -50105 -64968 -52490 -30190 -23781 -18042 1289 21210
579 21210 31540 35319 45172 60068 56445 35604 21088 19069 16703 -2503 -33768 -47996 -43303
592 -43303 -41037 -45187 -47009 -40004 -26718 -14280 6787 31707 34446 25635 34063 59492 68774 39632
606 39632 5360 6411 17881 3086 -29279 -50768 -49013 -42351 -42350 -37886 -32277 -31105 -16404 11773
620 11773 33135 35026 27706 34848 54658 56279 38021 18303 6607 2544 -6506 -24996 -39024
633 -39024 -47350 -48443 -42274 -37710 -30508 -18942 -9159 3974 22886 37360 42518 38937 38570 46800
647 46800 42025 22101 6219 -2206 -10751 -25831 -40045 -41786 -41520 -45808 -40345 -25879 -14353 -5599
661 -5599 5066 22494 35854 37257 39715 46787 43111 30268 18010 10045 2478 -13775 -31750
674 -31750 -38072 -40616 -40640 -38197 -37247 -30955 -17196 181 15434 20966 24567 37381 46531 44912 37263
689 37263 26866 18226 9827 -2044 -14083 -27788 -40480 -41060 -36760 -36566 -35906 -28812 -13151 2742
703 2742 10629 19828 32025 37632 39473 40803 37312 28800 15565 4628 -2633 -15375 -28760 -35225
717 -35225 -39293 -39807 -37128 -31144 -21396 -12916 -2757 13449 25598 29861 34513 38456 40473 35951
731 35951 24374 15423 6228 -6522 -16516 -25757 -35045 -38863 -38338 -33654 -27858 -23927 -12198 3386
745 3386 13693 21568 28928 35071 38927 36877 30987 24881 14333 3173 -5576 -17454 -27385 -34085
759 -34085 -36609 -34914 -33605 -29509 -18250 -7585 1650 12359 22432 30850 34895 34637 34552 31317 21856
774 21856 13247 2648 -9042 -18185 -26242 -31409 -34729 -36981 -32185 -23095 -15901 -8033 2690 13551
788 13551 24478 29466 32737 35266 32590 27446 21005 10858 -51 -9730 -18601 -24878 -31912 -36161
802 -36161 -32529 -28222 -23362 -15195 -5671 5401 15219 22335 29062 32852 32133 30958 26582 18043 8654
817 8654 -1233 -10174 -18202 -27088 -31051 -31476 -32254 -28403 -20612 -12471 -3049 4410 13983 24755 29267
832 29267 30619 31597 28595 24059 17022 7399 -1252 -11784 -20973 -24392 -28798 -32233 -30872 -26456 -18120
847 -18120 -10265 -3310 6851 16381 21697 28481 31846 30095 26766 20808 15202 7242 -4112 -12275
861 -12275 -18524 -26323 -29964 -29214 -27295 -23801 -19720 -10787 1393 9308 15441 21828 26572 29820 30341
876 30341 26125 20100 11097 2874 -1987 -10648 -21421 -27463 -29602 -27876 -25167 -22749 -16111 -9108 -938
891 -938 11156 19772 21842 23984 27355 30389 26639 16722 9480 3860 -6053 -13614 -18772 -24155 -29052
906 -29052 -31199 -25122 -16132 -13793 -10572 264 12097 19835 22594 24726 28025 26260 21694 18629
920 18629 10811 376 -8106 -14647 -18611 -24080 -28459 -27573 -24552 -19723 -11378 -4623 1148 10113 18526
935 18526 23847 25513 25600 27138 22940 12500 7019 4061 -4607 -16941 -25068 -23221 -21627 -26796 -27323
950 -27323 -17710 -9684 -5061 2296 13050 20735 19230 21314 29879 29866 18711 8818 6297 4631 -5096
965 -5096 -17823 -22786 -24029 -25646 -23877 -20660 -17028 -12513 -5367 5543 15068 18187 20395 22354 24780
980 24780 27460 22858 10829 1382 -1827 -3077 -11462 -24841 -27749 -22680 -21745 -21929 -16295 -8023 -2127
995 -2127 1246 12365 24956 23443 17088 21306 28312 23521 8194 -755 1171 -4322 -17523 -23062
1009 -23062 -21614 -22580 -24975 -22025 -12159 -5531 -4324 2979 14349 20499 21580 21949 23270 22559 16891
1024 16891 10747 4713 -3181 -9167 -14214 -21212 -23933 -22092 -20121 -19841 -17040 -6760 3736 6078
1038 6078 8446 17819 24970 23162 19436 20138 20302 9150 -1740 -2100 -3782 -16045 -25793 -23998 -16735
1053 -16735 -18257 -22540 -14973 -3147 908 4964 13122 19897 20105 18276 22303 23861 14538 4462
1067 4462 1226 -1392 -7842 -16172 -20961 -21737 -22167 -18923 -13810 -12332 -8722 1177 10262 14234 15346
1082 15346 19282 23088 20424 16429 15296 9618 -914 -7146 -8292 -11487 -20458 -25792 -19383 -14127
1096 -14127 -16030 -13282 -3455 4271 6806 10345 18928 23203 17826 16008 18887 15499 5212 -2032
1110 -2032 -4014 -8024 -16744 -20670 -18152 -18421 -19376 -14755 -7832 -2289 388 7262 15846 17587 16312
1125 16312 19323 20464 15388 9307 5747 2342 -5979 -13168 -13875 -16158 -21322 -20373 -14726 -11115 -9709
1140 -9709 -5465 4930 11436 11054 14318 20757 20281 15589 13110 11930 6301 -3319 -7269 -7662 -14273
1155 -14273 -20778 -19252 -15512 -14569 -14202 -8179 889 4085 6073 13721 18820 17328 15479 16436 15909 9102
1171 9102 1177 -580 -4157 -12252 -16411 -16177 -16189 -17973 -16501 -9275 -3871 -2932 2593 11084 14197 14881
1187 14881 16116 18467 16764 10385 7388 5214 -2135 -9338 -11320 -13071 -16427 -19509 -16562 -10697 -9620
1202 -9620 -7419 656 7022 9058 11735 16453 18901 15940 12316 12310 8911 839 -4804 -6597 -9859 -15577
1218 -15577 -18138 -15629 -13643 -14281 -9707 -2598 1677 3865 8755 15133 17080 14857 14655 15603 10684
1233 10684 5000 1586 -2433 -7974 -13487 -14700 -13835 -16524 -16346 -11044 -6012 -3517 -18 6158 11576
1248 11576 12861 13639 16977 16235 11421 8568 6999 1862 -4846 -9748 -10917 -12983 -17273 -16539 -12416
1263 -12416 -10669 -8380 -3217 3282 6860 8609 12931 17092 15570 12898 11972 10215 5019 -1330 -4728
1278 -4728 -7316 -12547 -15543 -14514 -13766 -13652 -11382 -5934 -619 2069 5404 11193 14410 13915 14460 14413
1294 14413 11688 7666 2963 617 -3916 -10331 -12381 -12653 -14369 -15279 -12575 -8571 -4959 -2651 2643
1309 2643 8469 10357 11948 14695 15368 12856 9668 7109 5067 -1322 -6704 -8395 -10812 -14114 -15004
1324 -15004 -13422 -10962 -9268 -6593 -346 3962 6175 9809 13233 14450 13538 11816 10977 7544 1842
1339 1842 -1596 -4098 -8741 -12121 -13569 -13075 -12764 -12053 -8546 -3670 -1050 2472 7645 10842 12212 12373
1355 12373 13464 13230 9657 5350 3145 -812 -5742 -9126 -11053 -12200 -13684 -13542 -10081 -6992 -5175
1370 -5175 -970 3813 7362 9700 11508 13305 13052 10397 9054 6627 1894 -1839 -5559 -8190 -10599
1385 -10599 -13148 -12842 -11192 -10737 -7731 -3551 432 3621 5996 10108 12667 12271 11483 11339 8805 5236
1401 5236 1366 -1634 -4527 -8868 -11678 -11433 -11328 -11604 -10048 -6782 -3263 353 3408 6812 9863 10982
1417 10982 11869 11786 10013 7958 4329 1288 -1844 -5331 -8015 -10748 -12027 -11491 -9816 -8695 -6754 -3178
1433 -3178 1082 4449 6310 9150 11381 11333 10458 9746 7948 4841 319 -3015 -4602 -7334 -10855 -11507
1449 -11507 -10646 -9325 -8173 -6413 -2035 1187 3742 6392 9331 10994 11021 9648 9050 7706 3968 2
1465 2 -2617 -5245 -7399 -9783 -11248 -9994 -9380 -7631 -5297 -2251 1589 4562 5982 8771 10817 10919
1481 10919 9468 7686 6459 4666 -214 -3296 -5047 -7446 -9644 -10720 -10379 -8098 -6785 -5595 -1554
1496 -1554 2291 4487 5891 8288 9962 10411 8748 7260 6060 3135 -94 -3280 -5523 -6993 -9303
1511 -9303 -10470 -9092 -7888 -6559 -4585 -1741 2190 4958 6201 7848 9769 9864 8849 6730 4929
1526 4929 3098 -768 -3883 -5580 -7334 -8700 -10037 -9546 -7259 -5437 -4035 -1246 2438 5230 6302
1541 6302 7690 9183 9819 7958 6247 4886 2299 -596 -3953 -5460 -7118 -8965 -9707 -8731 -7225 -5363
1557 -5363 -3566 -942 2381 5131 6313 7974 9006 8687 7916 5971 4407 2235 -991 -3788 -5791
1572 -5791 -7578 -8083 -8975 -8412 -6601 -4795 -2974 -350 2374 5136 6722 7556 8468 8741 7539 5689
1588 5689 4046 1638 -1039 -4257 -5863 -6977 -8344 -8999 -7931 -6668 -4869 -2813 -429 2985 4545
1603 4545 6414 7712 8365 8339 7205 5282 3609 1336 -1687 -3657 -5588 -7174 -7944 -8501 -7577 -5930
1619 -5930 -4340 -2214 185 2348 4903 6420 7411 8262 7852 6707 5636 3250 1170 -1255 -4088 -5749
1635 -5749 -6796 -7825 -7823 -7527 -6050 -4102 -2536 55 2901 4583 6262 7391 7738 8069 6515 5014
1651 5014 3252 1099 -1720 -3718 -5470 -6548 -7429 -7673 -6897 -5604 -4275 -2017 513 2382 4747 6159
1667 6159 6890 7893 7440 6141 5086 2688 706 -1715 -3666 -5300 -6887 -7408 -7270 -6713 -5431 -3771
1683 -3771 -1973 397 2823 4483 6066 6659 7134 6975 6097 4359 3106 826 -1572 -3736 -5198 -6279
1699 -6279 -7195 -7370 -6187 -5153 -3851 -1512 344 2493 4534 5645 6790 7229 6500 5768 4427 2498
1715 2498 647 -1524 -3647 -4891 -6047 -6639 -6694 -6184 -5014 -3540 -1504 376 2437 4048 5684 6438
1731 6438 6675 6629 5461 4270 2590 441 -1655 -3253 -4886 -5936 -6531 -6586 -5805 -4774 -3398 -1447 454
1748 454 2228 3978 5402 6292 6327 6108 5404 3775 2332 615 -1522 -3065 -4575 -5677 -6193 -6388 -5697
1765 -5697 -4367 -3013 -1288 686 2090 4019 5348 5607 6218 5960 4957 3991 1930 340 -1384 -3443
1781 -3443 -4458 -5391 -6087 -5898 -5344 -4432 -2854 -1286 390 2251 3975 4806 5848 5827 5692 4949 3324
1798 3324 1857 583 -1772 -3345 -4032 -5610 -5684 -5833 -5203 -4047 -2749 -1184 728 2128 3836 4626
1814 4626 5339 5750 5501 4285 3100 1748 177 -1595 -3448 -4265 -4839 -5754 -5411 -5050 -3777 -2312 -938
1831 -938 869 2304 3699 4848 5249 5315 5070 4295 2828 1656 151 -1517 -3195 -4557 -4975 -4956 -5222
1848 -5222 -4480 -3599 -2325 -640 1056 2194 3732 4803 4993 5232 4840 4282 2778 1348 -385 -1616
1864 -1616 -2812 -4225 -4699 -5044 -5195 -4402 -3585 -1985 -584 809 2497 3514 4448 5215 4990 4610 3932
1881 3932 2722 1389 -363 -1390 -2811 -4036 -4879 -4827 -4736 -4217 -3539 -1962 -429 928 2200 3664 4498
1898 4498 5018 4900 4355 4090 2537 1140 -125 -1319 -2906 -3843 -4606 -4912 -4755 -4244 -3088 -2012 -551
1915 -551 1003 2418 3405 4285 5039 4643 4595 3538 2506 1279 -310 -1573 -2767 -4057 -4601 -5089 -4563
1932 -4563 -3865 -3339 -2227 -337 886 2292 3320 4023 4921 4470 4034 3706 2363 1125 -179 -1856 -2564
1949 -2564 -3690 -4522 -4646 -4335 -3685 -2743 -1773 -625 999 2196 3003 4188 4782 4511 3921 3215 2721 1365
1967 1365 -461 -1698 -2688 -3555 -4212 -4516 -4508 -3465 -2967 -1710 -299 1068 2087 2946 4010 4795 4445 3517
1985 3517 3238 2407 1266 -568 -2035 -2536 -3644 -4352 -4307 -3892 -3505 -2711 -1712 -196 1432 2127 3084 4191
2003 4191 4178 4445 3872 2846 2292 1039 -285 -1483 -2597 -3575 -3877 -4469 -3845 -3591 -2576 -1394 -571 1190
2021 1190 2124 2841 3962 4472 4169 3782 3588 2249 1524 -337 -1724 -2708 -3665 -4265 -4249 -3809 -3314 -2617 -1840
2040 -1840 -297 1138 1632 2650 3697 4301 3986 3587 2986 2332 1087 -308 -1381 -2582 -3059 -3770 -4070
2057 -4070 -3825 -3103 -2741 -1689 -228 628 2218 2950 3570 4195 3752 3590 2998 2075 1151 -5 -1473 -2474
2075 -2474 -3178 -3376 -4105 -3892 -3088 -2552 -1737 -638 944 1861 2711 3398 3768 3654 3302 2713 2282 868 -237
2094 -237 -1665 -2257 -2849 -3789 -3921 -3541 -3106 -2417 -1183 -563 911 2157 2613 3542 3720 3622 3337 2662 1947
2113 1947 984 -481 -1445 -2403 -3338 -3675 -3388 -3633 -3133 -1954 -1495 -461 707 1947 2366 3149 3460 3898
2131 3898 3554 2724 1720 672 -83 -1474 -2131 -2715 -3352 -3461 -3236 -3043 -1947 -1400 -676 884 1769 2687
2149 2687 3295 3541 3446 3179 2396 1980 461 -373 -877 -2309 -2942 -3175 -3234 -3062 -2866 -2194 -1119 -60 531
2168 531 1985 2605 3176 3587 3319 3017 2871 1540 603 -200 -1380 -2314 -2703 -3110 -3365 -3649 -2769 -1967 -928
2187 -928 -340 1236 2055 2460 3095 3360 3575 3068 1974 1835 699 -549 -1263 -2013 -2775 -3142 -3296 -3202 -2656
2206 -2656 -2196 -1105 17 969 1599 2593 3028 3338 3101 2643 2478 1290 247 -94 -1303 -2322 -2883 -3151
2224 -3151 -3229 -3130 -2850 -1926 -816 -383 946 1724 2590 3030 3016 3224 2965 2224 1591 623 -393 -1471 -2257
2243 -2257 -2685 -2950 -3450 -2957 -1987 -1933 -1001 -197 947 1928 2535 2696 3241 2864 2729 2081 1308 257 -771
2262 -771 -1622 -2097 -2605 -3373 -3014 -2692 -2368 -1689 -927 286 1049 1713 2536 3117 3177 2847 2671 2341 1207 442
2282 442 -467 -1455 -2479 -2562 -2641 -3206 -2815 -2250 -1765 -855 -185 795 2032 2130 2737 3020 3408 2583 1945 1512
2302 1512 484 -590 -1424 -2019 -2654 -3135 -2941 -2795 -2394 -1928 -976 198 1016 1824 2571 3153 3035 2901 2446
2321 2446 1987 1286 198 -485 -1273 -2159 -2412 -3029 -2711 -2529 -2408 -1419 -752 -305 1093 1878 2208 2904 3004
2340 3004 2886 2637 1820 1011 325 -613 -1885 -2250 -2805 -2770 -2795 -2615 -2041 -1559 -766 555 1219 1990 2411 2416
2360 2416 2831 2884 2402 1733 1013 329 -664 -1538 -2111 -2652 -3050 -2836 -2646 -2185 -1247 -744 45 891 2008 2233
2380 2233 2829 2558 2527 2421 1717 739 61 -843 -1347 -2152 -2731 -2723 -2687 -2706 -2082 -1397 -587 116 943 1830 2384
2401 2384 2433 2703 2451 2065 1826 1069 186 -606 -1546 -2243 -2478 -3039 -2464 -2416 -2161 -1378 -646 272 1214 1788
2421 1788 2279 2609 2558 2485 2495 1808 855 -37 -481 -1338 -2148 -2763 -2614 -2553 -2616 -1803 -1193 -37 422 905 1761
2442 1761 2650 2395 2661 2731 1886 1844 604 68 -1007 -1735 -2164 -2540 -2839 -2505 -2309 -2032 -1380 -335 404
2461 404 1018 1741 2173 2755 2433 2695 1887 1500 942 -328 -1064 -1164 -2023 -2610 -2802 -2487 -2309 -1922 -1284 -156
2481 -156 313 1024 2046 2260 2544 2702 2293 1967 1574 486 -62 -705 -1621 -2009 -2521 -2643 -2433 -1773 -1769 -893
2501 -893 -224 537 1467 1630 2160 2583 2497 2279 1595 1180 546 21 -747 -1719 -2230 -2185 -2494 -2241 -1888 -1694 -1027
2522 -1027 -364 552 1326 1860 1956 2748 2579 2091 1840 1116 423 -175 -860 -1426 -2140 -2459 -2364 -2243 -1952 -1482
2542 -1482 -1034 -292 765 1713 1761 2198 2332 2296 2192 1487 1075 304 -314 -1168 -1505 -2213 -2202 -2453 -2306 -1791
2562 -1791 -1226 -651 -78 656 1603 1895 2099 2474 2547 2128 1763 1056 410 -290 -1188 -1723 -1917 -2424 -2485 -2256
2582 -2256 -1524 -1162 -609 327 883 1220 1857 2436 2619 2578 2234 1641 1101 43 -594 -1060 -1829 -2030 -2335 -2686
2602 -2686 -2357 -1987 -1217 -494 181 738 1336 1868 2003 2296 2269 1866 1470 1132 125 -267 -1238 -1654 -2332 -2063
2622 -2063 -2247 -2232 -1669 -1039 -620 -78 978 1257 2151 2447 2254 2392 1811 1348 640 40 -824 -1095 -1850 -2191
2642 -2191 -2158 -2220 -1975 -1639 -1071 -91 253 1029 1547 2179 2397 2145 2006 2039 1311 532 58 -588 -1519 -1757 -2052
2663 -2052 -2306 -1963 -2233 -1330 -824 -507 688 983 1292 2056 2257 2320 2178 1904 1514 858 -276 -643 -1476
2682 -1476 -1894 -2124 -2328 -2150 -1869 -1436 -1067 -224 237 1071 1390 1806 2541 2067 2169 1697 1336 292 -141
2701 -141 -921 -1500 -1783 -2318 -2111 -2186 -2114 -1494 -1047 -83 527 976 1725 1953 2292 2193 1752 1610 1375 649 -261
2722 -261 -550 -1382 -1801 -1998 -2355 -1895 -1535 -1318 -869 103 620 1073 1585 2246 2040 1885 2215 1560 904 401
2742 401 16 -878 -1473 -1979 -2308 -2271 -2087 -1936 -1204 -908 -72 628 1151 1602 2099 2070 2423 1969 1502 1131 94
2763 94 -414 -1017 -1542 -1884 -2167 -2234 -1989 -1487 -1063 -492 88 686 1520 1888 2307 2171 1960 1798 1313 726 321
2784 321 -532 -1255 -1585 -1705 -2074 -1950 -2185 -1596 -984 -565 97 621 1421 1803 1966 2085 2007 1790 1013 850
2804 850 -174 -555 -1111 -1659 -2353 -1988 -1912 -1694 -1531 -1019 -365 83 889 1465 1777 2177 2097 1693 1420 1423 242
2825 242 -166 -475 -1109 -1692 -2025 -2003 -2063 -1820 -1338 -848 -261 305 1021 1314 1847 2156 2243 1992 1821 1171 731
2846 731 -7 -616 -1078 -1717 -2145 -2357 -1907 -1558 -1651 -884 -136 375 1186 1551 1808 2065 2527 1874 1496 911
2866 911 366 -206 -691 -1591 -1976 -2254 -1807 -1868 -1701 -1371 -642 69 642 1011 1352 2071 1921 1945 1741 1499 1208
2887 1208 444 -298 -754 -1122 -1802 -2166 -2149 -1756 -1627 -1099 -624 215 548 1141 1565 1786 2113 1816 1600 1472
2907 1472 795 174 -202 -993 -1503 -1844 -1943 -1923 -1633 -1610 -1044 -448 335 977 1122 1497 1986 2049 1982 1843 1363
2928 1363 632 393 -363 -988 -1218 -1675 -2044 -2098 -2037 -1498 -1152 -431 376 922 1437 1637 1895 2121 1710 1307
2948 1307 1231 602 66 -126 -854 -1295 -1799 -2171 -1776 -1811 -1800 -1009 -448 192 760 1127 1570 1894 1997 1656 1351
2969 1351 1031 996 300 -788 -732 -1203 -1756 -1954 -2068 -1663 -1154 -945 -476 -70 1027 1455 1632 1811 2120 1929
2989 1929 1538 1029 826 -275 -662 -1040 -1497 -1718 -2097 -1975 -1775 -1378 -641 -458 205 836 1256 1715 1938
3008 1938 1931 2044 1449 1010 804 -307 -496 -962 -1383 -1551 -1773 -1969 -1299 -1219 -739 -372 405 1293 1498 1848
3028 1848 1705 1930 1698 1250 753 214 -156 -803 -992 -1616 -1784 -2012 -1786 -1539 -1085 -761 -156 256 879 1199
3048 1199 1580 1707 1745 1380 1402 851 353 -400 -795 -957 -1374 -1633 -1753 -1686 -1308 -1080 -622 -127 483 1078 1519
3069 1519 1627 1988 1814 1630 1225 923 387 -144 -491 -1170 -1360 -1833 -1908 -1459 -1312 -989 -501 -46 390 1054
3089 1054 1296 1511 1871 1674 1524 1107 784 161 -459 -751 -1009 -1382 -1721 -1845 -1405 -1283 -1035 -593 -9 781
3109 781 1266 1860 1396 1803 1812 1212 1281 498 -115 -303 -898 -1425 -1337 -1477 -1736 -1626 -1229 -854 -657 -95 813
3130 813 987 1470 1292 1544 1514 1456 792 868 55 -563 -876 -1217 -1427 -1612 -1687 -1446 -1130 -505 -374 120 616
3151 616 1128 1404 1508 1655 1460 1242 523 483 322 -536 -1357 -1150 -1776 -1715 -1518 -1507 -1088 -730 -284 572 771
3172 771 1227 1359 1688 1630 1517 1118 733 499 -139 -542 -738 -1036 -1492 -1519 -1736 -1390 -1172 -678 -290 237 683
3193 683 969 1355 1447 1510 1453 1063 705 314 -11 -821 -1142 -1530 -1242 -1612 -1644 -1481 -951 -487 -179 318 863
3214 863 1089 1340 1532 1509 1343 1057 739 422 -83 -686 -722 -1159 -1682 -1554 -1287 -1042 -798 -405 240 279 989
3235 989 922 1638 1531 1362 1271 913 720 62 4 -842 -976 -1236 -1364 -1311 -1305 -1361 -957 -512 -277 476 989 1305
3257 1305 1616 1627 1425 1463 1217 751 91 -72 -788 -1146 -1140 -1172 -1509 -1227 -1050 -806 -381 209 556 856 1031
3278 1031 1151 1501 1555 1264 981 574 162 -415 -619 -983 -1109 -1408 -1528 -1309 -1115 -840 -411 158 540 1035
3298 1035 1170 1536 1128 1340 1305 905 566 86 -440 -652 -1057 -1288 -1322 -1408 -1279 -1120 -567 -492 315 427 777
3319 777 1189 1228 1453 1473 1172 916 494 116 -400 -633 -1026 -825 -1469 -1486 -1249 -757 -620 -236 246 584 842
3340 842 1153 1462 1488 1185 1165 613 461 81 -203 -438 -1115 -1038 -1184 -1415 -1171 -655 -556 -191 207 676 1011
3361 1011 1210 914 1060 1205 1077 545 108 -168 -533 -965 -1183 -1054 -1186 -1165 -1154 -459 -617 -333 352 566
3381 566 945 968 1305 1459 1211 779 448 81 160 -232 -516 -1002 -691 -1055 -1285 -678 -585 -295 -171 185 468
3402 468 632 740 938 1100 1097 886 493 355 187 -348 -884 -943 -1236 -1121 -978 -908 -540 -197 101 134 426 689
3424 689 838 817 1108 828 801 585 166 -176 -233 -739 -880 -1085 -1120 -769 -539 -631 -271 172 531 726 882 685
3446 685 953 999 792 875 340 255 -65 -398 -465 -885 -1069 -870 -773 -1038 -668 -203 -76 501 497 854 937 717 1013
3469 1013 755 505 275 -15 -198 -359 -852 -1110 -746 -1063 -630 -734 -535 11 155 154 382 1085 1058 946 829
3490 829 986 674 298 -257 -178 -578 -666 -840 -866 -667 -806 -684 -323 -260 503 482 473 634 863 575 696 728 318
3513 318 161 -216 -296 -457 -757 -780 -876 -814 -666 -620 -63 -29 115 313 430 587 922 841 718 531 445 -90 116
3536 116 -316 -394 -733 -672 -767 -983 -651 -616 -250 -190 150 302 547 608 644 742 543 674 486 355 79 -278 -634
3559 -634 -582 -770 -838 -730 -567 -228 49 -61 177 263 691 731 485 507 757 463 250 446 -75 -188 -469 -666
3581 -666 -462 -738 -728 -509 -272 -147 -297 -108 314 652 561 810 773 839 534 262 76 -85 -140 -291 -689 -461
3603 -461 -668 -676 -376 -310 -76 -22 245 278 391 498 426 793 399 197 396 -144 -143 -261 -543 -650 -666 -750 -574
3626 -574 -284 -252 -255 179 30 108 333 531 425 322 432 696 340 283 -13 -381 -351 -398 -597 -757 -361 -256
3648 -256 -126 -227 74 -79 242 315 469 630 271 553 322 30 -15 -217 -545 -489 -618 -517 -466 -367 -468 -479
3670 -479 -310 -23 -43 173 643 432 570 354 432 281 22 58 -75 -46 -306 -298 -495 -316 -255 -292 -262 -21 99
3693 99 73 222 566 212 388 599 593 202 45 -34 -114 34 -344 -335 -341 -187 -358 -490 -179 -77 -65 -84 232 227 484
3718 484 277 512 206 271 121 222 36 190 -49 -113 -665 -455 -83 -259 -52 100 -200 182 372 28 651
3739 651 264 78 254 94 362 164 -64 120 -180 -287 -323 -537 -129 -245 -28 -391 47 84 310 206 187
3760 187 329 167 246 244 -58 112 49 -273 -494 -96 -104 -258 -130 -454 -180 186 -121 98 133 158 86 390 193
3783 193 126 243 215 4 -37 -216 -162 -293 -158 -58 -95 -106 -198 74 -280 25 162 136 -69 -76 80 347 189
3806 189 40 -28 -272 -272 125 -202 -279 -159 -177 -82 -200 83 -22 99 172 -77 -18 106 -9 -112 37 261 -62
3829 -62 172 43 -191 220 55 213 -97 -331 225 -69 10 -63 -300 110 26 223 195 130 -35 306 84 -53
3851 -53 175 25 -102 -187 -96 62 48 -241 -136 -216 114 -198 -79 68 157 -245 -32 -34 105 112 59 -407 147 99
3875 99 96 234 -65 61 -112 -154 -131 -239 31 178 17 -64 11 48 247 -105 -302 73 -157 30 158 111 40
3898 40 -218 212 -415 36 158 -307 -83 -152 9 257 147 -226 150 269 48 -26 -165 93 295 132 29
3919 29 -120 -122 -69 156 -186 -227 -166 -145 -72 8 22 -141 -194 322 283 104 138 -51 353 -179 283 68 -84 16
3943 16 -144 -164 -122 -116 -160 -291 -23 -217 -51 164 -50 164 181 185 425 61 293 124 76 194 -54 96 -5
3966 -5 -251 -287 -256 -130 -259 -215 -42 13 23 263 75 -87 201 127 -16 67 137 220 -57 -83 -289 -252 -240 -346 -301
3991 -301 -201 -251 -131 42 -58 257 373 552 337 110 73 63 124 -252 -126 -204 -187 -237 -140 -171 -45 -315 -305
4014 -305 93 -31 52 83 381 172 344 286 259 253 74 55 -65 -10 -110 -323 -337 -429 -360 -112 -113 -35 -101 189 192 431
4040 431 229 305 451 182 158 46 -17 70 -362 66 -167 -373 -337 -392 -302 -262 -66 21 338 418 581 582 200 100
4064 100 286 48 247 220 -97 -544 -407 -519 -324 -534 -537 -140 -123 -144 142 71 301 357 643 630 160 256 85
4087 85 300 -211 -68 -247 -481 -718 -456 -455 -325 -335 -204 -114 175 388 376 621 359 420 295 -4 16 -11 -92
4110 -92 -350 -355 -405 -277 -827 -291 -639 -111 -37 128 290 284 261 293 489 269 554 365 -155 -37 231 -236 -312
4133 -312 -462 -507 -586 -506 -565 -311 -135 5 255 544 599 599 725 265 402 302 235 -114 -327 -296 -698 -669 -761 -410
4157 -410 -531 -530 -312 137 43 315 301 457 785 599 432 236 450 231 -234 -505 -213 -503 -572 -509 -599 -456
4179 -456 -205 203 6 99 157 623 776 587 517 664 475 375 463 -147 -168 -310 -722 -536 -710 -502 -173 -502
4201 -502 -72 -168 144 68 461 492 744 536 519 477 99 -46 245 -240 -222 -789 -792 -457 -629 -551 -344 -193 -163
4224 -163 290 512 768 699 821 715 405 404 120 294 -6 -464 -545 -658 -732 -771 -689 -528 -389 -54 13 150 397
4247 397 730 608 791 768 345 442 365 90 -85 -230 -663 -649 -416 -254 -375 -829 -499 -59 31 386 474 750
4269 750 793 1226 660 714 380 385 25 -143 -91 -106 -517 -606 -809 -525 -481 -646 -368 -44 115 277 752 813 756
4292 756 848 545 236 286 264 -43 -53 -660 -486 -613 -781 -875 -453 -320 -359 13 368 577 553 673 980 891 890
4315 890 408 665 217 -282 -346 -760 -547 -948 -1032 -825 -752 -508 113 -177 509 396 581 879 703 781 770 555
4337 555 252 64 -79 -338 -422 -769 -861 -985 -879 -571 -406 -444 -55 397 879 635 777 1046 896 673 384
4358 384 264 57 -348 -472 -835 -885 -989 -943 -556 -615 -621 -96 240 254 641 824 882 905 989 674 417 346 -157
4381 -157 -99 -147 -588 -897 -872 -602 -775 -549 -490 28 155 382 613 638 930 1130 790 502 429 157 98 -351
4403 -351 -593 -665 -831 -994 -664 -857 -568 -319 131 214 674 850 832 534 487 682 463 388 -36 -367 -331 -565
4425 -565 -696 -854 -854 -923 -763 -339 -497 -54 480 405 692 784 924 922 631 500 429 44 9 -188 -748 -792 -967
4448 -967 -749 -1181 -651 -478 31 132 243 773 659 844 828 1019 555 734 436 234 -166 -345 -442 -925 -967
4469 -967 -1104 -746 -734 -517 -228 219 317 397 852 787 949 1015 948 586 394 -44 90 -524 -804 -890 -1119 -967
4491 -967 -852 -685 -372 14 100 426 848 833 777 847 1055 834 553 525 159 -377 -503 -903 -834 -1012 -851 -645
4513 -645 -752 -194 -269 280 506 767 584 1115 1117 864 770 614 155 -249 -261 -711 -953 -982 -1401 -874 -934 -632
4535 -632 -264 -87 146 255 926 769 1021 1097 1005 808 691 79 128 -345 -736 -633 -856 -832 -934 -553 -633 -409
4557 -409 -261 47 396 732 1018 1036 1267 869 867 482 194 144 -611 -773 -1011 -906 -1010 -797 -963 -557 -601 178
4579 178 -52 499 905 1239 1158 1221 930 451 370 538 -62 -431 -482 -962 -791 -800 -854 -781 -749 -268 -146 68 691
4602 691 945 1127 939 1026 1126 729 674 2 -122 -523 -574 -1045 -1096 -907 -935 -883 -504 -64 108 418 549 770
4624 770 840 1053 888 946 531 471 257 -44 -416 -764 -687 -855 -1243 -883 -832 -337 -308 86 308 786 808 906 1276
4647 1276 1039 791 607 101 20 -253 -199 -734 -875 -797 -1188 -1070 -498 -341 -468 266 451 660 841 1103 1028
4668 1028 841 1087 752 375 47 -380 -454 -482 -1303 -824 -1057 -950 -581 -487 -288 8 574 598 702 987 1088
4689 1088 949 1032 554 431 -18 -375 -455 -803 -1016 -779 -849 -999 -666 -473 35 290 331 747 1155 687 956
4710 956 972 705 578 361 -34 -266 -753 -635 -1038 -1179 -807 -1215 -406 -404 -144 121 719 831 831 1090 1056 842
4732 842 853 452 87 -342 -333 -847 -940 -1095 -1081 -1082 -1171 -570 -565 -138 155 508 862 903 977 1130 948 704 651 199
4756 199 386 -397 -851 -1177 -1241 -1049 -980 -960 -689 -145 0 344 287 988 1072 1072 1173 1055 690 321 -37 -173
4778 -173 -552 -561 -1164 -871 -1044 -626 -739 -541 -422 162 359 655 1130 1068 1073 1110 990 591 348 205 -406 -635
4800 -635 -902 -1124 -1171 -1090 -982 -681 -172 -54 322 762 640 1151 1068 1256 1229 724 617 342 12 -114 -651
4821 -651 -1074 -826 -1191 -1195 -711 -492 -494 6 263 580 598 841 1284 1410 866 1085 541 223 132 -84 -766 -706
4843 -706 -853 -1118 -908 -689 -925 -461 -185 180 178 568 982 1139 1200 968 828 615 371 6 -460 -1018 -994
4864 -994 -1234 -985 -1186 -925 -707 -450 -141 265 713 806 994 1063 1327 1165 880 642 48 -348 -446 -534 -1097
4885 -1097 -1052 -1027 -1175 -1168 -481 -419 -90 452 454 765 1174 992 1008 1010 873 316 390 -101 -483 -810 -964 -1102 -1345
4908 -1345 -1104 -1132 -497 -365 -49 218 797 1000 843 1463 1035 995 923 192 133 -145 -801 -672 -992 -1073 -1150 -1143
4930 -1143 -804 -678 -262 251 722 528 940 1149 1087 1047 1090 612 635 67 -298 -547 -1124 -909 -1188 -1283 -1045
4951 -1045 -995 -704 -92 130 466 821 1128 1198 1020 1111 1047 799 412 149 -97 -612 -696 -1151 -984 -1075 -1008 -517
4973 -517 -404 -235 329 737 661 1138 1004 1039 1360 1317 537 252 -221 -483 -760 -1278 -1136 -1256 -953 -785 -856
4994 -856 -460 -100 461 609 858 1065 1021 1292 1130 810 198 227 -138 -487 -658 -1000 -883 -1293 -966 -1024 -845
5015 -845 -448 -233 288 641 815 1220 1086 803 1096 842 595 99 -277 -428 -886 -1062 -962 -1043 -969 -777 -835
5036 -835 -61 -14 384 846 810 1260 1145 1033 1187 815 474 268 -159 -535 -648 -792 -1150 -1191 -1008 -772 -588
5057 -588 -215 -7 320 571 989 1191 1259 1160 1055 871 380 129 -245 -555 -849 -1016 -1229 -1505 -1134 -777 -774
5078 -774 -246 231 417 818 691 1147 984 986 1043 790 580 -23 -89 -370 -769 -843 -1107 -1173 -966 -759 -273 -241
5100 -241 47 529 680 1024 1312 929 966 991 784 498 58 -196 -578 -886 -1006 -1107 -1029 -992 -643 -144 24
5121 24 353 665 574 757 1227 1024 1004 648 478 326 239 -653 -545 -990 -1199 -1067 -1118 -970 -584 -541 -196 232
5143 232 633 810 528 1069 1018 1118 843 660 -79 -3 -246 -591 -675 -1058 -1125 -1217 -1057 -512 -339 -210 86 805
5165 805 830 934 1081 1226 1046 948 575 196 110 -238 -753 -897 -1125 -1003 -681 -965 -658 -337 -29 452 724
5186 724 1076 1128 1152 1156 1161 655 470 333 -51 -248 -726 -851 -1144 -986 -696 -807 -677 -581 277 261 573 763 1183
5209 1183 1139 1093 963 747 439 263 -194 -438 -959 -878 -726 -881 -905 -1042 -786 -373 172 459 646 719 1257
5230 1257 1190 867 994 606 665 421 -177 -755 -698 -942 -1348 -888 -741 -814 -689 -284 11 369 735 1238 1034
5251 1034 907 1142 893 910 459 -39 -348 -621 -570 -977 -1179 -873 -1083 -660 -344 -203 -112 405 658 1027 1090
5272 1090 1168 1038 1106 539 142 112 -299 -391 -1143 -932 -889 -1514 -1063 -547 -441 -325 -62 423 375 1107 842 979
5294 979 1058 965 671 350 -79 -494 -340 -675 -877 -1296 -919 -1056 -782 -516 -176 61 741 656 1126 1226 847
5315 847 1301 917 767 566 22 -198 -387 -671 -1054 -1141 -1272 -824 -586 -627 -34 208 631 846 1026 1244 1050
5336 1050 945 605 472 237 -227 -413 -603 -799 -1144 -1072 -1056 -653 -793 -509 52 182 474 442 1075 999 1169
5357 1169 1391 726 734 369 -362 -413 -499 -993 -990 -1022 -1163 -1047 -623 -522 16 -23 491 684 871 1425 1056 1050 698
5380 698 420 216 -275 -289 -558 -770 -1161 -1105 -1102 -905 -729 -253 -109 334 374 666 1150 951 961 937 427 538
5402 538 132 -24 -415 -816 -841 -1093 -976 -1281 -889 -655 -309 -155 321 539 803 845 1066 916 656 603 485
5423 485 189 -335 -383 -715 -811 -904 -1047 -909 -893 -213 -434 -38 315 550 1167 1162 809 1111 986 558 286 85
5445 85 -521 -555 -809 -908 -999 -993 -1030 -726 -541 -340 332 656 473 906 793 1000 959 824 783 72 485 -311 -527
5468 -527 -655 -1269 -1110 -894 -750 -676 -697 -449 54 208 620 852 925 846 703 862 632 305 51 -303 -544
5489 -544 -763 -819 -911 -874 -696 -781 -364 -209 104 277 780 985 991 875 985 887 718 304 -127 -179 -477 -689 -1001
5512 -1001 -1078 -928 -660 -634 -349 15 438 309 712 780 875 1158 722 617 693 534 -29 -514 -467 -676 -741 -862
5534 -862 -948 -763 -548 -382 -292 132 662 768 703 979 1145 693 526 446 682 -204 -329 -386 -488 -776 -987 -816
5556 -816 -802 -711 -151 -104 114 831 907 658 963 943 878 815 436 311 -241 -87 -508 -645 -860 -1013 -927 -656 -687
5579 -687 -634 -17 278 771 903 836 1039 912 546 662 641 50 145 -455 -621 -679 -1123 -796 -826 -751 -731 -401 -2
5602 -2 249 47 797 1144 1084 1048 918 769 450 410 9 -363 -503 -747 -1058 -997 -1171 -481 -487 -285 314 249 456
5625 456 517 854 974 686 920 694 246 88 26 -513 -558 -773 -844 -742 -740 -641 -414 -177 342 -217 236 694
5647 694 959 1071 890 660 786 404 110 -24 -321 -752 -664 -742 -717 -624 -555 -619 -192 66 584 445 815 697
5669 697 1136 624 504 518 322 134 -267 -297 -725 -776 -984 -1052 -1001 -723 -300 -255 23 355 363 946 965 750 570
5692 570 690 321 387 -22 44 -484 -592 -821 -888 -505 -782 -634 -479 -72 -162 261 631 566 777 831 595 1060
5714 1060 591 246 -189 -168 -217 -641 -803 -928 -594 -590 -581 -125 -397 162 546 556 544 782 738 993 534 380 182
5737 182 -102 -218 -314 -462 -1124 -851 -870 -491 -644 87 -35 149 450 689 703 779 756 828 515 144 221 -127
5759 -127 -432 -482 -498 -792 -610 -903 -879 -618 -127 72 244 377 358 519 742 557 853 448 203 163 -45 -523
5781 -523 -490 -518 -887 -882 -669 -999 -364 31 127 271 349 361 914 843 652 693 291 346 85 -160 -471 -452 -804 -879
5805 -879 -658 -508 -622 -394 -222 54 440 462 556 725 600 589 860 484 371 25 -293 -218 -669 -589 -807 -630
5827 -630 -1028 -607 -344 63 -62 421 625 765 857 1055 635 410 510 282 354 -170 -390 -395 -571 -965 -774
5848 -774 -572 -477 -400 -53 224 238 297 907 840 785 626 699 585 507 -9 88 -472 -532 -483 -438 -873 -686 -522 -634
5872 -634 -316 -23 375 276 642 701 920 762 697 577 145 211 -61 -345 -355 -485 -796 -489 -623 -696 -627 53
5894 53 482 -94 339 399 678 613 931 574 456 207 202 -99 -276 -590 -742 -605 -665 -495 -406 -103 -71 42 508
5917 508 591 607 761 856 672 540 557 -62 90 -328 -294 -517 -575 -759 -572 -756 -320 -222 -47 195 53 570
5939 570 276 727 554 402 441 422 288 -120 -15 -339 -462 -557 -526 -855 -502 -377 -143 -109 -76 361 374 336 512
5962 512 389 526 294 217 330 -169 -251 -352 -669 -497 -540 -620 -366 -608 -413 -76 74 311 571 552 471 911
5984 911 515 579 376 121 -9 -342 -541 -60 -769 -512 -614 -351 -590 -199 -46 -61 362 501 457 644 561
6005 561 201 575 381 -56 24 -199 -533 -539 -539 -610 -609 -408 -209 -163 -66 335 331 439 397 707 437 473 233 -12 22
6030 22 -55 -383 -598 -313 -684 -565 -180 -442 -102 -372 -59 378 448 464 501 558 611 493 452 115 142 -215 -410
6053 -410 -568 -288 -403 -461 -499 -437 -259 66 -144 28 161 236 517 664 398 517 183 211 26 -160 -298 -426
6075 -426 -741 -532 -495 -500 -611 -336 -244 -103 325 540 519 488 547 585 303 217 337 81 -286 -346 -412 -340 -708 -680
6099 -680 -594 -451 -312 -382 124 163 342 245 388 325 639 531 143 317 143 -436 -213 -236 -669 -530 -614 -424
6121 -424 -439 -304 -314 -50 291 103 461 723 613 282 479 430 168 -248 -357 -97 -281 -477 -266 -749 -329
6142 -329 -415 -69 -137 69 166 561 419 287 505 369 412 333 15 101 -46 13 -278 -505 -302 -257 -511 -531 -50
6165 -50 -18 -12 291 367 390 515 533 622 466 242 37 141 -16 -263 -283 -239 -280 -457 -708 -204 -347 -118 -25 -21 368
6190 368 197 607 297 339 352 44 -175 111 -153 6 -306 -173 -352 -515 -443 -574 -186 18 -119 171 446
6211 446 69 553 371 477 337 402 80 -163 116 -422 -504 -457 -254 -489 -283 -322 26 -172 82 298 -138
6232 -138 379 422 204 168 404 315 112 -86 -94 -314 -461 -260 -299 -13 -320 -591 -412 -34 -122 153 95 444 387
6255 387 702 160 379 247 -102 35 -180 64 -578 -193 -420 -261 -266 -564 -493 57 -43 140 -60 291 616
6276 616 248 165 329 224 339 119 -143 -298 -323 -578 -479 -397 -509 -209 -82 -163 -38 341 284 345 443 775 390
6299 390 516 72 176 154 -123 -373 -615 -362 -428 -343 -460 -92 -187 10 -23 150 235 474 349 335 435 201
6321 201 184 320 -14 -234 -303 -374 -516 -391 -615 -263 -295 -268 -85 150 170 297 290 323 410 443 260 177 219 -94
6345 -94 87 -30 -416 -424 -143 -414 -471 -326 -205 -219 -56 -56 105 116 189 491 429 398 279 369 -2 -142 -245 -63
6369 -63 -199 -461 -235 -224 -246 -317 -41 -29 446 185 489 423 94 141 316 184 38 -202 -222 -108 -255 -259 -292 -684
6393 -684 -199 -212 -406 -115 -44 461 240 256 375 433 351 235 182 24 -438 -165 -72 -260 -597 -695 -367 -197 -368
6416 -368 -322 -328 169 18 111 275 246 379 161 277 34 136 299 68 -53 -187 -249 -327 -344 -210 -418 -176 -106
6439 -106 123 -18 84 226 406 331 310 348 175 260 -15 -286 -100 -168 -529 -277 27 -113 -516 22 -150 -155
6461 -155 137 282 363 297 505 329 476 141 -38 -86 -13 -63 -210 -262 -365 -323 -214 -404 -334 -14 -14 99 -97
6484 -97 198 556 281 458 550 297 219 -85 -220 -212 -205 -478 -353 -466 -598 -164 -254 103 133 90 273 112 394
6507 394 464 336 315 483 50 -90 -313 -293 -288 -328 -117 -377 -49 -253 -172 -217 -202 317 262 198 81 538 373 234
6531 234 59 196 46 -209 -101 -257 -559 -387 -637 -198 -236 12 128 -119 176 182 309 561 380 380 97 372
6553 372 -82 1 49 -318 -133 -386 -208 -608 -512 -208 -140 -120 -124 23 140 315 139 171 367 164 378 66 -103
6576 -103 -27 -218 -313 -235 -381 -194 -115 -64 -22 -203 107 35 337 161 364 553 345 300 -9 145 25 -154 -60
6599 -60 -164 -362 -337 -202 -245 -198 -61 17 16 205 119 231 349 384 173 481 217 414 -229 -410 -207 -148 -468
6622 -468 -335 -209 -342 -113 -18 186 -20 -6 283 91 278 603 347 311 191 329 170 -155 -334 -130 -423
6643 -423 -377 -621 -175 -525 -186 -40 -53 -63 66 292 362 411 369 136 282 -120 67 270 -245 -334 -370 -354 -413
6666 -413 -235 -163 -177 9 228 -5 159 73 210 235 367 380 110 76 -66 -134 -206 -266 -90 -409 -424 -216 -398
6689 -398 -395 105 -33 -164 170 124 534 592 268 349 230 22 12 -67 -306 -372 -414 -530 -486 -554 -141 -260 4 209
6713 209 289 290 518 282 260 387 -10 239 210 24 -194 -362 -454 -462 -2 -370 -116 -289 -233 -42 -116 140 228 440
6737 440 471 164 448 84 425 73 -23 -2 -33 -193 -373 -251 -284 -162 -246 -155 -107 101 300 -48 261 543 484
6760 484 372 485 169 229 160 -155 -297 -589 -390 -567 -230 -559 -439 -284 -42 -44 -24 117 423 595 296 366
6782 366 265 534 -5 -109 -91 -268 -186 -387 -341 -316 -261 -258 57 -42 209 57 552 407 419 331 -105 272 -15
6805 -15 -28 -102 -174 -428 -215 -313 -406 -288 -271 -72 -34 70 -61 389 375 376 422 235 346 272 409 -170 -212 -86 -332
6830 -332 -220 -354 -610 -295 -462 -264 -93 -166 129 249 335 518 293 502 318 222 181 -37 -165 -300 -477
6851 -477 -488 -343 -517 -169 -75 -74 -134 135 150 41 224 293 483 450 304 95 337 11 -164 -323 -495 -558 -212
6874 -212 -383 -465 -314 -223 125 385 214 283 208 398 298 550 309 171 95 96 -21 -84 -240 -420 -473 -238 -286
6897 -286 -246 -206 -115 128 83 157 560 438 408 499 350 200 53 -26 -425 -231 -274 -157 -564 -367 -460 -223 -49
6920 -49 189 165 227 288 421 442 505 213 128 63 166 45 -381 -234 -468 -634 -288 -273 -221 -197 -268 136 -18 158
6944 158 304 201 795 485 551 547 367 221 40 -219 -191 -474 -256 -387 -327 -22 -196 -43 -41 177 3 128
6966 128 403 341 558 264 144 301 349 157 117 -399 -169 -449 -597 -274 -252 -125 -32 314 451 257 309 229
6988 229 190 430 465 21 -140 138 63 -435 -118 -280 -568 -526 -342 -102 -160 -57 5 220 146 247 373 510
7010 510 297 337 359 262 76 88 -442 -412 -548 -627 -352 -267 -180 -99 49 -39 99 152 244 465 371 220 562 224
7034 224 298 112 67 -43 -348 -419 -427 -115 -242 47 -241 -234 -52 224 366 462 666 341 500 468 180 261 -88
7057 -88 -35 -323 -188 -415 -577 -369 -245 -387 136 0 4 350 403 225 514 207 232 231 354 41 -118 13 -203
7080 -203 -171 -527 -503 -520 -492 -417 -188 171 255 287 213 643 202 450 503 107 114 -70 -121 -92 -257 -471 -490 -525 -305
7105 -305 -187 -301 20 23 -13 71 232 137 319 748 400 155 145 47 121 -284 -244 -401 -218 -716 -229 -398 -248
7128 -248 -142 129 56 42 278 226 459 126 356 453 360 -12 -2 -451 -350 -336 -371 -632 -136 -409 -361 -201 -46
7151 -46 139 200 433 333 279 490 473 189 292 160 138 -174 -192 -362 -579 -528 -296 -412 -304 -220 -182 101 24
7174 24 355 -42 727 454 590 473 564 203 1 -105 -431 -528 -692 -500 -340 -221 -75 -95 -2 546 205 393
7196 393 705 424 570 280 479 82 74 128 -348 -313 -329 -245 -153 -183 -108 -159 -90 -170 78 297 288 498 172 740 202
7221 202 178 12 162 -62 -174 -65 -306 -519 -257 -423 -402 -167 -116 106 133 207 309 279 742 300 595 358
7243 358 293 132 25 25 -315 -257 -369 -337 -618 -252 97 -150 191 188 435 338 399 869 667 380 516 383 49
7266 49 -442 -323 -304 -552 -381 -402 -319 -193 -332 -106 -26 333 226 482 285 668 413 76 266 -215 90 39
7288 39 -122 -293 -241 -178 -438 -228 -247 -176 -312 252 340 251 346 298 394 116 383 257 239 -117 -27 -162 -368 -425
7312 -425 -501 -564 -507 -82 -350 -5 -212 328 351 459 447 500 293 292 257 232 -238 -160 -280 -811 -367 -585 -590 -451
7336 -451 -431 -148 -220 61 284 307 699 623 506 309 532 -70 69 -76 -69 -475 -520 -725 -467 -627 -565 -238 -69
7359 -69 -36 272 251 736 511 473 365 402 138 239 70 -383 -317 -342 -450 -242 -387 -422 -670 -445 -248 -259 58
7382 58 191 451 613 534 391 475 366 71 80 -275 -15 -376 -378 -498 -350 -508 -772 -208 -235 -196 446 240 319
7405 319 481 357 626 584 240 257 -6 -280 -222 -253 -445 -425 -255 -409 -627 -303 -115 255 358 201 526 426
7427 426 112 315 578 213 146 60 -178 -333 -258 -512 -800 -344 -770 -243 -338 -170 165 292 167 744 258
7448 258 377 193 502 440 151 -192 -330 -308 -273 -440 -546 -75 -205 -99 -166 -45 139 201 349 409 603 578
7470 578 487 393 262 62 -97 -356 -113 -333 -632 -584 -567 -263 -292 -42 -109 -19 454 444 282 678 339 349 510
7493 510 456 -55 -8 -262 -437 -204 -520 -575 -434 -313 -322 -447 76 143 359 87 375 604 466 465 261 512 363
7516 363 -8 36 -278 -249 -739 -420 -329 -509 -384 -19 9 116 359 498 633 243 554 204 205 58 12 16 77
7539 77 -486 -176 -395 -496 -444 -388 -274 77 -3 -108 527 149 517 778 360 267 212 99 -241 103 -118 -617
7561 -617 -368 -468 -270 -477 -284 -63 -30 183 504 452 502 627 384 502 545 212 -107 -14 8 -25 -51 -255 -719
7584 -719 -147 -408 -395 -234 -181 121 253 189 385 250 428 548 601 324 97 145 -311 -344 -169 -534 -526 -376 -414
7607 -414 94 -151 -267 102 373 372 352 420 547 496 509 406 208 -69 -301 -104 -98 -391 -201 -484 -278 -398 107
7630 107 -209 188 202 278 294 73 104 296 599 244 159 -333 -153 -343 -306 -437 -618 -429 -653 -103 -198 -377
7652 -377 -172 171 280 379 223 494 491 215 76 263 -86 -352 -199 -490 -243 -322 -347 -276 -194 -150 -72 129 112
7675 112 442 541 544 317 227 217 147 277 -292 -219 -53 -471 -401 -427 -568 -344 -325 13 -192 139 425 351 440 376
7699 376 172 525 202 352 268 -221 90 -131 -343 -347 -240 -169 -453 -515 127 -88 -20 410 363 544 564 480 105
7722 105 205 317 -6 -144 -230 -441 -417 -529 -348 -270 -235 -261 -235 96 111 389 248 413 369 107 276 379 138
7745 138 62 218 -258 -272 -306 -391 -505 -336 -218 -129 -9 208 177 -86 346 570 402 537 310 276 -50 -68 -66
7768 -66 -296 -268 -239 -357 -306 -254 -350 -277 -110 208 245 49 451 356 270 509 133 209 319 77 48 -41 -269 -374
7792 -374 -338 -579 -416 -591 -399 -145 248 186 367 523 343 340 154 392 238 54 3 -218 -355 -248 -513 -24
7814 -24 -211 -242 -511 -231 145 430 140 439 288 475 558 436 121 210 386 189 -318 -428 -194 -298 -286 -385
7836 -385 -226 49 40 71 199 147 238 352 295 155 353 301 203 145 -6 51 -154 -610 -400 -295 -289 -332 -251 -212 40
7861 40 507 152 497 546 319 348 459 551 262 -58 -16 -158 -291 -430 13 -332 -345 -200 -122 35 78 57 140
7884 140 293 307 230 75 351 210 214 265 -348 -94 -128 -453 -520 -93 -374 -230 -296 117 -78 137 89 455 170
7907 170 373 225 645 420 311 400 -309 -20 -298 -474 -259 -530 -336 -233 -157 114 275 173 214 46 356
7928 356 142 188 334 -35 73 164 63 -265 -427 -444 -497 -261 -439 -380 -142 -46 -1 -159 305 295 316 430 224
7951 224 228 135 -107 -6 -112 -170 -302 -194 -327 -388 -90 -199 -270 190 169 242 430 174 285 531 -14 510 58
7974 58 28 51 -302 -114 -383 -212 -224 -258 -359 -94 -232 438 38 205 33 406 61 370 388 238 126 206
7996 206 135 -182 -252 -120 -269 -357 -435 -176 -403 -138 72 -6 506 173 381 276 177 -10 152 102 -124 63
8018 63 -146 -459 -89 -161 -423 -392 -423 -191 -14 -1 -36 22 266 102 105 215 232 151 458 210 73 -471 -194 -246
8042 -246 -244 -335 -487 -516 -269 1 56 22 280 468 311 309 410 59 190 247 22 -121 -310 -212 -448 -385 -674 -132
8066 -132 -67 34 -107 296 59 170 415 338 486 271 46 -51 395 77 -120 82 -377 -182 -282 -338 -398 -353
8088 -353 -140 -9 -56 160 107 142 429 168 179 15 168 169 189 -50 -194 -369 -37 -112 -393 -197 -269 -338 -234
8111 -234 -224 154 388 574 294 98 346 138 331 110 42 61 -79 -444 -299 -338 -592 -271 -136 -218 72 216
8133 216 272 255 106 225 425 384 14 173 134 184 -131 13 -338 -460 -289 -257 -244 -288 -253 -172 314 56 355
8156 355 179 203 482 202 361 153 25 -74 170 -105 -192 -144 -240 -217 -133 -398 268 193 -51 164 526 640 362
8179 362 409 38 20 121 122 38 -224 -329 -377 29 -470 -162
8191a62
##END NTUPLES=NMR FID
##END=
