##TITLE=1H_Pr NCS-A
 200.13MHz,CDCl3,
 8 sc
 
 7.7.2025
##JCAMPDX= 6.0         $$ Bruker NMR JCAMP-DX V2.0
##DATA TYPE= NMR FID
##DATA CLASS= NTUPLES
##ORIGIN= UXNMR, Bruker Analytische Messtechnik GmbH
##OWNER= pz
$$ XWIN-NMR		Version 3.5
$$ Mon Jul  7 14:06:15 2025 Russian Standard Time (UT+4h)  she@DPX200
##.OBSERVE FREQUENCY= 200.1313
##.OBSERVE NUCLEUS= ^1H
##.DELAY= (6, 6)
##.ACQUISITION MODE= SIMULTANEOUS
##.ACQUISITION SCHEME= undefined
##.AVERAGES= 8
##.DIGITISER RES= 18
##SPECTROMETER/DATA SYSTEM= spect
##.PULSE SEQUENCE= zg30
##.SOLVENT NAME= CDCl3
##.SHIFT REFERENCE= (INTERNAL, CDCl3, 0, 14.3821)
##AUDIT TRAIL= $$ (NUMBER, WHEN, WHO, WHERE, WHAT)
$$ ##TITLE= Audit trail, XWIN-NMR		Version 3.5
$$ ##JCAMPDX= 5.01
$$ ##ORIGIN= Bruker BioSpin GmbH
$$ ##OWNER= she
$$ F:/spectra/data/she/nmr/H-C/1/audita.txt
$$ ##AUDIT TRAIL=  $$ (NUMBER, WHEN, WHO, WHERE, WHAT)
(   1,<2025-07-07 14:04:17.75 +0400>,<she>,<DPX200>,
      <created by zg, POWCHK disabled, PULCHK disabled
       configuration hash MD5:
       00 E9 B6 7A A2 85 ED C7 34 08 36 98 17 FE 4E 26
       data hash MD5: 16K
       67 C6 7A B6 AB E3 0A A6 81 9C 5E 38 42 F2 58 80>)
$$ ##END=
$$ 
$$ hash MD5
$$ 25 5D 40 E5 3C FF 3D DC AD 39 EE 29 57 EB 82 5F
##$RELAX= 
##$RELAX= 
##$RELAX= 
##$RELAX= 
##$RELAX= 
##$RELAX= 
$$ Bruker specific parameters
$$ --------------------------
##$DU= <F:/spectra>
##$EXPNO= 1
##$NAME= <H-C>
##$PROCNO= 1
##$TYPE= <nmr>
##$USER= <she>
##$AMP= (0..31)
100 100 100 100 100 100 100 100 100 100 100 100 100 100 100 100 100 100 
100 100 100 100 100 100 100 100 100 100 100 100 100 100 
##$AQSEQ= 0
##$AQ_mod= 1
##$AUNM= <au_zg>
##$AUTOPOS= <>
##$BF1= 200.13
##$BF2= 200.13
##$BF3= 200.13
##$BF4= 200.13
##$BF5= 200.13
##$BF6= 200.13
##$BF7= 200.13
##$BF8= 200.13
##$BYTORDA= 1
##$CFDGTYP= 0
##$CFRGTYP= 5
##$CHEMSTR= <none>
##$CNST= (0..31)
1 1 145 1 1 1 1 1 1 1 1 1 1 1 1 1 1 1 1 1 1 1 1 1 1 1 1 1 1 1 1 1 
##$CPDPRG= <>
##$CPDPRG1= <>
##$CPDPRG2= <>
##$CPDPRG3= <>
##$CPDPRG4= <mlev>
##$CPDPRG5= <mlev>
##$CPDPRG6= <mlev>
##$CPDPRG7= <mlev>
##$CPDPRG8= <mlev>
##$CPDPRGB= <>
##$CPDPRGT= <>
##$D= (0..31)
0 0.7 0 0 0 0 0 0 0 0 0 0.03 0 0 0 0 0 0 0 0 0 0 0 0 0 0 0 0 0 0 0 0 
##$DATE= 1751882657
##$DBL= (0..7)
120 120 120 120 120 120 120 120 
##$DBP= (0..7)
150 150 150 150 150 150 150 150 
##$DBP07= 0
##$DBPNAM0= <>
##$DBPNAM1= <>
##$DBPNAM2= <>
##$DBPNAM3= <>
##$DBPNAM4= <>
##$DBPNAM5= <>
##$DBPNAM6= <>
##$DBPNAM7= <>
##$DBPOAL= (0..7)
0.5 0.5 0.5 0.5 0.5 0.5 0.5 0.5 
##$DBPOFFS= (0..7)
0 0 0 0 0 0 0 0 
##$DE= 6
##$DECBNUC= <off>
##$DECIM= 32
##$DECNUC= <off>
##$DECSTAT= 4
##$DIGMOD= 1
##$DIGTYP= 9
##$DL= (0..7)
0 120 120 120 120 120 120 120 
##$DP= (0..7)
150 150 150 150 150 150 150 150 
##$DP07= 0
##$DPNAME0= <>
##$DPNAME1= <>
##$DPNAME2= <>
##$DPNAME3= <>
##$DPNAME4= <>
##$DPNAME5= <>
##$DPNAME6= <>
##$DPNAME7= <>
##$DPOAL= (0..7)
0.5 0.5 0.5 0.5 0.5 0.5 0.5 0.5 
##$DPOFFS= (0..7)
0 0 0 0 0 0 0 0 
##$DQDMODE= 0
##$DR= 18
##$DS= 0
##$DSLIST= <SSSSSSSSSSSSSSS>
$$ [...]
##$SUBNAM0= <"">
##$SUBNAM1= <"">
##$SUBNAM2= <"">
##$SUBNAM3= <"">
##$SUBNAM4= <"">
##$SUBNAM5= <"">
##$SUBNAM6= <"">
##$SUBNAM7= <"">
##$SUBNAM8= <"">
##$SUBNAM9= <"">
##$SW= 18.0517328524113
##$SWIBOX= (0..15)
0 0 2 0 0 0 0 0 0 0 0 0 0 0 0 0 
##$SW_h= 3612.71676300578
##$TD= 16384
##$TD0= 1
##$TE= 0
##$TE2= 300
##$TE3= 300
##$TEG= 300
##$TL= (0..7)
0 120 120 120 120 120 120 120 
##$TP= (0..7)
150 150 150 150 150 150 150 150 
##$TP07= 0
##$TPNAME0= <>
##$TPNAME1= <>
##$TPNAME2= <>
##$TPNAME3= <>
##$TPNAME4= <>
##$TPNAME5= <>
##$TPNAME6= <>
##$TPNAME7= <>
##$TPOAL= (0..7)
0.5 0.5 0.5 0.5 0.5 0.5 0.5 0.5 
##$TPOFFS= (0..7)
0 0 0 0 0 0 0 0 
##$TUNHIN= 0
##$TUNHOUT= 0
##$TUNXOUT= 0
##$USERA1= <user>
##$USERA2= <user>
##$USERA3= <user>
##$USERA4= <user>
##$USERA5= <user>
##$V9= 5
##$VALIST= <valist>
##$VCLIST= <CCCCCCCCCCCCCCC>
##$VD= 0
##$VDLIST= <DDDDDDDDDDDDDDD>
##$VPLIST= <PPPPPPPPPPPPPPP>
##$VTLIST= <TTTTTTTTTTTTTTT>
##$WBST= 1024
##$WBSW= 4
##$XGAIN= (0..3)
0 0 0 0 
##$XL= 0
##$YL= 0
##$YMAX_a= 916269
##$YMIN_a= -1168790
##$ZGOPTNS= <>
##$ZL1= 120
##$ZL2= 120
##$ZL3= 120
##$ZL4= 120
##$ABSF1= 10
##$ABSF2= 0
##$ABSG= 5
##$ABSL= 3
##$ALPHA= 0
##$AQORDER= 0
##$ASSFAC= 0
##$ASSFACI= 0
##$ASSFACX= 0
##$ASSWID= 0
##$AUNMP= <proc_1d>
##$AZFE= 0.1
##$AZFW= 0.1
##$BCFW= 1
##$BC_mod= 2
##$BYTORDP= 1
##$COROFFS= 0
##$CY= -3
##$DATMOD= 1
##$DC= 2
##$DFILT= <>
##$DTYPP= 0
##$F1P= 0
##$F2P= 0
##$FCOR= 0.5
##$FTSIZE= 0
##$FT_mod= 4
##$GAMMA= 1
##$GB= 0.15
##$INTBC= 1
##$INTSCL= 1
##$ISEN= 128
##$LB= 0.25
##$LEV0= 0
##$LPBIN= 0
##$MAXI= 10000
##$MC2= 0
##$MEAN= 0
##$ME_mod= 0
##$MI= 1.114404
##$NCOEF= 0
##$NC_proc= 0
##$NLEV= 6
##$NOISF1= 3.799351
##$NOISF2= 2.8
##$NSP= 1
##$NTH_PI= 0
##$NZP= 0
##$OFFSET= 14.38212
##$PC= 1
##$PHC0= -1200.838
##$PHC1= 11.79238
##$PH_mod= 1
##$PKNL= yes
##$PPARMOD= 0
##$PSCAL= 0
##$PSIGN= 0
##$REVERSE= no
##$SF= 200.129724274929
##$SI= 16384
##$SIGF1= 3
##$SIGF2= 2
##$SINO= 400
##$SIOLD= 16384
##$SREGLST= <1H.CDCl3>
##$SSB= 0
##$STSI= 0
##$STSR= 0
##$SW_p= 3205.1282051282
##$SYMM= 0
##$S_DEV= 0
##$TDeff= 0
##$TDoff= 0
##$TI= <>
##$TILT= no
##$TM1= 0
##$TM2= 0
##$TOPLEV= 0
##$USERP1= <user>
##$USERP2= <user>
##$USERP3= <user>
##$USERP4= <user>
##$USERP5= <user>
##$WDW= 1
##$XDIM= 8192
##$YMAX_p= 0
##$YMIN_p= 0
$$ End of Bruker specific parameters
$$ ---------------------------------
##NTUPLES= NMR FID
##VAR_NAME=  TIME,          FID/REAL,        FID/IMAG
##SYMBOL=    X,             R,               I
##VAR_TYPE=  INDEPENDENT,   DEPENDENT,       DEPENDENT
##VAR_FORM=  AFFN,          ASDF,            ASDF
##VAR_DIM=   8192,          8192,            8192
##UNITS=     SECONDS,       ARBITRARY UNITS, ARBITRARY UNITS
##FACTOR=    0.0002768,     1,               1
##FIRST=     0,             0,               0
##LAST=      2.2672688,     0,               0
##MIN=       0,             -1168790,        0
##MAX=       2.2672688,     916269,          0
$$ Real data points
##PAGE= N=1
##DATA TABLE= (X++(R..R)), XYDATA
$$ [...]
$$ plain form
2604 -4348 -3474 -1896 -466 747 2544 3468 4428 5398 5168 5029 4637 3334 2597 1123 -670 -1818 -3518
2621 -3518 -4320 -4974 -5244 -5196 -4545 -4099 -2830 -1536 -6 1712 2958 3795 4776 5120 5135 5108 4037 3138 1737
2640 1737 211 -965 -2394 -3713 -4387 -5247 -5345 -4880 -4156 -3323 -2130 -926 268 1902 3215 4477 4802
2657 4802 5128 4994 4231 3966 2794 1306 -242 -1797 -3207 -3955 -4599 -4857 -5062 -4973 -3978 -2844 -1366 -131
2675 -131 1191 2279 3508 4445 5182 5204 4746 3987 3187 2180 1041 -429 -2100 -3456 -4476 -4764 -4903
2692 -4903 -4704 -4212 -3700 -2612 -947 220 1968 3045 3468 4384 4889 4948 4618 3633 2569 1484 17
2709 17 -1287 -2323 -3675 -4370 -4879 -5073 -4370 -3705 -2824 -1594 -565 805 2237 3321 4283 4706 4604 4670
2727 4670 4131 3316 2528 974 -617 -1746 -3068 -3719 -4382 -4818 -4607 -4489 -3770 -2188 -1180 27 1564
$$ packed form
2604d348Q74J578J430J213J797R24R60R70k30j39l92j303p37j474j793j148j700
2621c518q02o54k70M8O51M46J269J294J530J718J246Q37R81L44J5k7j071q99j401
2640A737j526j176j429j319o74q60r8M65P24Q33J193J204J194J634J313J262L25
2657D802L26j34p63k65j172j488j548j555j410p48o44k58k05Q9R95J134J478J235
2675a31J322J088J229R37P37K2m58p59q00j007j139j470j671j356j020k88j39
2692d903J99M92N12J088J665J167J748J077M23R16N05N9l30r85j064j085j467
2709A7j304j036j352o95n09j94P03O65Q81J230J029J370J432J084R62M23j02O6
2727D670n39q15p88j554j591j129j322o51o63m36K11J18P19J582J008J207J537
$$ plain form
2744 1564 2473 3572 4265 4384 4622 4323 3590 2805 1488 265 -817 -2411 -3279 -4055 -4619 -4761 -4122 -3929
2762 -3929 -3072 -2110 -985 831 1908 2901 3923 4023 4439 4519 4000 3477 2438 709 -116 -1539 -2537 -3319
2780 -3319 -4309 -4624 -4600 -4305 -3294 -2389 -1699 -169 928 2002 3335 4095 4370 4535 3916 3629 2872 1883
2798 1883 651 -604 -2158 -2835 -3668 -4212 -4342 -4459 -4055 -3049 -1997 -785 544 1328 2668 3473 4088
2815 4088 4626 4331 3923 3475 2125 1400 280 -1238 -1977 -3196 -3934 -4253 -4308 -4040 -3274 -2889 -1534 -150
2833 -150 837 1945 3028 3439 4206 4321 4084 3924 3007 1863 830 -503 -1678 -2611 -3428 -3894 -4253 -4288
2851 -4288 -3820 -3182 -2187 -1043 -40 1278 2228 3013 4026 4103 3926 3837 3264 2402 1430 193 -794 -2067
2869 -2067 -3188 -3448 -3913 -4075 -3967 -3494 -2906 -1764 -627 538 1612 2521 3301 3887 4204 4031 3647 2866
$$ packed form
2744A564R09J099O93J19K38k99p33p85j317j223j082j594q68p76n64j42O39J93
2762c929Q57R62J125J816J077R93J022J00M16Q0n19n23j039j729q25j423r98p82
2780c319r90l15K4K95J011R05O90J530J097J074J333P60K75J65o19k87p57r89
2798A883j232j255j554o77q33n44j30j17M04J006J052J212J329P84J340Q05O15
2815D088N38k95m08m48j350p25j120j518p39j219p38l19n5K68P66L85J355J384
2833a50R87J108J083M11P67J15k37j60r17j144j033j333j175r33q17m66l59l5
2851d288M68O38R95J144J003J318R50P85J013P7j77q9n73q62r72j237r87j273
2869b067j121k60m65j62J08M73N88J142J137J165J074R09P80N86L17j73l84p81
$$ plain form
2887 2866 1813 980 -10 -1253 -2383 -3297 -3858 -4072 -3934 -3755 -3018 -2356 -1339 -120 1105 2238 3010
2904 3010 3386 3760 3910 3883 3393 2505 1291 448 -757 -1766 -2364 -3326 -3891 -4085 -3985 -3399 -2586 -1758 -718
2923 -718 203 1114 2564 3200 3671 4163 3748 3330 3046 2000 1225 38 -1208 -1964 -3097 -3557 -3610 -3989 -3636
2942 -3636 -3100 -2556 -1353 -262 538 1886 2578 3054 3846 3977 3693 3244 2434 1666 811 -481 -1144 -2234
2960 -2234 -3151 -3586 -3749 -3704 -3103 -2833 -1950 -1088 -265 1235 2310 2719 3666 3904 3544 3602 2984 2401 1409 113
2980 113 -892 -1880 -2681 -3012 -3603 -3828 -3445 -3338 -2567 -1279 -835 490 1428 2165 3104 3720 3812 3762 2922 2671
3000 2671 1970 793 -154 -1112 -2330 -2979 -3472 -3655 -3409 -3415 -2874 -2095 -1139 -32 1387 1619 2710 3284 3496
3019 3496 3782 3485 2735 2298 1325 272 -422 -1731 -2450 -3138 -3768 -3710 -3596 -3069 -2487 -1782 -745 188 1266
$$ packed form
2887B866j053q33r90j243j130r14n61k14J38J79P37O62J017J219J225J133P72
2904C010L76L74J50k7m90q88j214q43j205j009n98r62n65j94J00N86Q13Q28J040
2923g18R21R11J450O36M71M92m15m18k84j046p75j187j246p56j133m60n3l79L53
2942c636N36N44J203J091Q00J348O92M76P92J31k84m49q10p68q55j292o63j090
2960b234r17m35j63M5O01K70Q83Q62Q23J500J075M09R47K38l60N8o18n83r92j296
2980A13j005r88q01l31n91k25L83J07P71J288M44J325R38P37R39O16R2n0q40k51
3000B671p01j177r47r58j218o49m93j83K46oN41P79R56J107J419K32J091N74K12
3019C496K86k97p50m37r73j053o94j309p19o88o30N8J14N27N82P05J037R33J078
$$ plain form
3038 1266 2377 2954 3314 3453 3418 3154 2899 1826 932 210 -950 -1854 -2589 -3237 -3357 -3594 -3381 -2721 -2149
3057 -2149 -1284 -256 744 1551 2511 2949 3484 3621 3375 2962 2310 1607 839 -298 -1364 -2105 -3006 -3344
3075 -3344 -3588 -3469 -3231 -2692 -1935 -1050 142 1106 2075 2554 3228 3444 3486 3385 2881 2022 1055 333 -574 -1671
3095 -1671 -2423 -3105 -3558 -3661 -3184 -2917 -2102 -1202 -500 376 1475 2259 2882 3457 3330 3353 2968 2452 1891 636
3115 636 -337 -1206 -2228 -2632 -3044 -3441 -3337 -3335 -2745 -1838 -1015 -6 945 1476 2518 3189 3264 3656 3109 2559
3135 2559 2114 1210 520 -407 -1669 -2341 -2883 -3289 -3140 -3346 -3034 -2296 -1655 -630 343 1031 2109 2777 2885
3154 2885 3498 3352 3000 2644 1659 779 82 -1068 -1718 -2419 -3138 -3248 -3406 -3363 -2616 -2111 -1278 -117 557
3173 557 1637 2691 2663 3520 3505 3103 2856 2074 1459 668 -459 -1497 -2092 -2810 -3144 -3208 -3352 -2797 -2372 -1677
$$ packed form
3038A266J111N77L60J39l5k64k55j073q94p22j160r04p35o48j20k37K13O60N72
3057b149Q65J028J000Q07R60M38N35J37k46m13o52p03p68j137j066p41r01l38
3075c344k44J19K38N39P57Q85J192R64R69M79O74K16M2j01n04q59r67p22r07j097
3095a671p52o82m53j03M77K67Q15R00P02Q76J099P84O23N75j27K3l85n16n61j255
3115F36r73q69j022m04m12l97J04KN90R07Q23J009R51N31J042O71P5L92n47n50
3135B559m45r04o90r27j262o72n42m06J49k06L12P38O41J025R73O88J078O68J08
3154B885O13j46l52l56r85q80o97j150o50p01p19j10j58M3P47N05Q33J161O74
3173E57J080J054k8Q57j5m02k47p82o15p91j127j038n95p18l34o4j44N55M25O95
$$ plain form
3193 -1677 -484 232 1008 2020 2326 3061 3390 3162 3051 2645 1777 1251 83 -757 -1366 -2599 -2947 -3285
3211 -3285 -3450 -2932 -2826 -2286 -1229 -557 661 1650 2256 2711 3050 3110 3476 3012 2166 1774 740 -226 -1143
3230 -1143 -1884 -2600 -2917 -3618 -3130 -2915 -2551 -1770 -1051 -304 799 1715 2395 3014 3086 3132 3159 2523 2126 1389
3250 1389 200 -488 -1564 -2087 -2667 -3207 -3371 -3085 -2989 -2324 -1160 -565 330 1202 1763 2661 2989 3265 3202
3269 3202 2827 2362 1764 766 120 -853 -1728 -2455 -3092 -3192 -3065 -3014 -2488 -2064 -1220 -216 652 1459 2197 2773
3289 2773 3116 3233 3005 2912 2159 1266 513 -433 -1171 -2038 -2641 -3081 -3113 -3345 -2863 -2309 -1683 -645 20 859
3309 859 1690 2438 3228 3393 3032 2929 2318 1853 1105 186 -732 -1434 -2382 -2838 -2996 -3056 -2998 -2684 -2153 -1193 -386
3330 -386 553 1420 2093 2523 3111 3110 3073 2909 2201 1498 655 -120 -992 -1905 -2618 -2942 -3220 -2998 -2740 -2399 -1790
$$ packed form
3193a677J193P16P76J012L06P35L29k28j11m06q68n26j168q40o09j233l48l38
3211c285j65N18J06N40J057O72J218R89O06M55L39O0L66m64q46l92j034r66r17
3230a143p41p16l17p01M88K15L64P81P19P47J103R16O80O19P2M6K7o36l97p37
3250A389j189o88j076n23n80n40j64K86R6O65J164N95Q95Q72N61Q98L28K76o3
3269C202l75m65n98r98o46r73q75p27o37j00J27N1N26M24Q44J004Q68Q07P38N76
3289B773L43J17k28r3p53q93p53r46p38q67o03m40l2k32M82N54O26J038O65Q39
3309H59Q31P48P90J65l61j03o11m65p48r19r18p02r48m56j58o0N8L14N31R60Q07
3330c86R39Q67O73M30N88jl7j64p08p03q43p75q72r13p13l24k78K22K58L41O09
$$ plain form
3351 -1790 -923 -176 912 1648 2427 2661 2709 3143 3183 2429 1915 966 82 -659 -1215 -2083 -2421 -3053 -3151 -2980
3371 -2980 -2679 -1949 -1426 -678 389 1264 1819 2626 2765 2905 3110 2731 2254 1601 767 133 -765 -1735 -2173
3390 -2173 -2691 -2874 -2902 -2909 -2511 -1645 -1009 -209 699 1421 2259 2527 2862 3032 2619 2521 2018 1194 468 -361 -1305
3411 -1305 -1810 -2574 -2873 -2889 -3172 -2548 -1956 -1584 -678 139 961 1814 2442 2691 2937 2840 2717 2349 1610 1029
3431 1029 165 -1021 -1275 -2086 -2711 -2820 -2967 -2917 -2304 -1996 -1066 -329 305 1306 1983 2440 2755 2819 2598 2482
3451 2482 1995 1204 511 -429 -947 -1880 -2210 -2498 -3019 -3074 -2612 -2430 -1694 -608 -134 912 1587 2028 2662
3470 2662 2878 2952 2754 2163 1731 1072 104 -421 -1106 -1953 -2340 -2743 -2722 -2647 -2425 -1968 -1129 -668 440 1045
3490 1045 1766 2443 2704 2729 2797 2426 1954 1567 539 5 -730 -1493 -2154 -2581 -3048 -2657 -2516 -2251 -1622 -981
$$ packed form
3351a790Q67P47J088P36P79K34M8M34M0p54n14r49q84p41n56q68l38o32r8J71
3371b980L01P30N23P48J067Q75N55Q07J39J40K05l79m77o53q34o34q98r70m38
3390b173n18j83k8pL98Q66O36Q00R08P22Q38K68L35J70m13r8n03q24p26q29r44
3411a305n05p64k99j6k83O24N92L72R06Q17Q22Q53O28K49K46r7j23l68p39n81
3431A029q64j186k54q11o25j09j47N0O13L08R30P37O34J001O77M57L15O4k21j16
3451B482m87p91o93r40n18r33l30k88n21n5M62J82P36J086M74J046O75M41O34
3470B662K16P4j98n91m32o59r68n25o85q47l87m03K1P5K22M57Q39M61J108O05
3490A045P21O77K61K5O8l71m72l87j028n34p35p63o61m27m67L91J41K65O29O41
$$ plain form
3510 -981 -156 635 1207 1931 2469 2819 2889 2636 2094 1831 1152 573 -378 -1095 -1769 -2294 -2697 -2716 -2640 -2618 -1982
3531 -1982 -1474 -472 285 921 1714 2042 2511 2872 2604 2435 2216 1572 897 148 -669 -1370 -1847 -2454 -2546 -2722
3551 -2722 -2713 -2240 -1730 -1011 -397 393 1266 2000 2362 2811 2813 2682 2352 1861 1309 678 -209 -903 -1605 -2134 -2485
3572 -2485 -2716 -2736 -2421 -2217 -1301 -724 -4 736 1312 1873 2526 2709 2608 2643 2075 1588 1049 156 -607 -1230
3592 -1230 -2069 -1997 -2554 -2642 -2376 -2237 -1800 -1067 -465 388 1074 1526 2068 2548 2645 2778 2367 1788 1489 586 12
3613 12 -727 -1428 -1889 -2452 -2836 -2403 -2510 -1989 -1325 -967 -375 454 1092 1970 2238 2392 2762 2495 2107 1793
3633 1793 981 379 -309 -1112 -1692 -2197 -2440 -2462 -2451 -2554 -1816 -1222 -595 290 811 1304 1918 2268 2564 2483 2391
3654 2391 2171 1442 845 309 -676 -1311 -1928 -2360 -2393 -2548 -2468 -1972 -1719 -976 -256 199 986 1917 2030 2435
$$ packed form
3510i81Q25P91N72P24N38L50P0k53n42k63o79n79r51p17o74n25m03j9P6K2O36
3531a982N08J002P57O36P93L28M69L61k68j69k19o44o75p49q17p01m77o07r2j76
3551b722RM73N10P19O14P90Q73P34L62M49Kj31l30m91n52o31q87o94p02n29l51
3572b485k31k0L15K04R16N77P20P40N76N61O53J83j01L5n68m87n39q93p63o23
3592a230q39P2n57q8K66J39M37P33O02Q53O86M52N42M80R7J33m11n79k99r03n74
3613A2p39p01m61n63l84M33j07N21O64L58N92Q29O38Q78K68J54L70k67l88l14
3633A793q12o02o88q03n80n05k43k2J1j03P38N94O27Q85N21M93O14L50K96q1r2
3654B391k20p29n97n36r85o35o17m32l3j55Q0M96K53P43P20M55P87R31J13M05
$$ plain form
3674 2435 2625 2385 2450 1650 1161 625 -143 -781 -1277 -2110 -2294 -2465 -2503 -2077 -1788 -1524 -739 -33 614 1353
3694 1353 1848 2137 2369 2347 2438 2076 1527 1032 223 -645 -960 -1670 -2146 -2205 -2437 -2435 -2052 -1891 -978 -440 108
3715 108 884 1580 2041 2452 2247 2612 2264 1822 1453 715 -49 -693 -1294 -1829 -2134 -2390 -2377 -2258 -2066 -1622
3735 -1622 -891 -275 598 1253 1617 2182 2238 2443 2454 1886 1812 1038 291 -317 -958 -1483 -2045 -2310 -2527 -2444 -2152
3756 -2152 -1682 -1133 -700 40 614 1164 1603 2065 2402 2405 2130 1928 1395 769 177 -473 -1213 -1617 -1986 -2257
3776 -2257 -2322 -2301 -1961 -1520 -914 -339 355 898 1492 1771 2343 2455 2156 1941 1631 1205 533 49 -733 -1286
3796 -1286 -1902 -2206 -2513 -2396 -1956 -1791 -1489 -818 -94 552 1290 1686 1867 2311 2445 2241 1915 1457 1015 295
3816 295 -263 -706 -1544 -1900 -2254 -2339 -2012 -2147 -1614 -962 -539 -1 923 1306 1739 2222 2110 2320 2191 1596
$$ packed form
3674B435J90k40O5q00m89n36p68o38m96q33j84j71l8M26K89K64P85P06O47P39
3694A353M95K89K32k2R1l62n49m95q09q68l15p10m76n9k32KL83J61R13N38N48
3715A08P76O96M61M11k05L65l48m42l69p38p64o44o01n35l05k56J3J19J92M44
3735a622P31O16Q73O55L64N65N6K05J1n68p4p74p47o08o41n25n62k65k17Q3K92
3756b152M70N49M33P40N74N50M39M62L37Lk75k02n33o26n92o50p40m04l69k71
3776b257o5K1L40M41O06N75O94N43N94K79N72J12k99k15l10m26o72m84p82n53
3796a286o16l04l07J17M40J65L02O71P24O46P38L96J81M44J34k04l26m58m42p20
3816B95n58m43q38l56l54q5L27j35N33O52M23N38R24L83M33M83j12K10j29n95
$$ plain form
3836 1596 1357 705 159 -585 -1189 -1778 -1801 -2369 -2213 -2125 -1987 -1376 -993 -403 513 997 1310 1929 2072 2316
3856 2316 2229 1868 1554 1118 292 31 -620 -1393 -1724 -2317 -2363 -2089 -2034 -1672 -1243 -814 -3 590 1199 1798 1967
3877 1967 1999 2132 1884 1895 1357 773 158 -513 -1093 -1374 -1904 -2230 -2065 -2266 -1774 -1268 -1128 -389 274 808
3897 808 1394 1740 1919 2187 2065 2095 1746 1183 491 145 -748 -1082 -1577 -2007 -2069 -2220 -2241 -1516 -1427 -1011 -105
3918 -105 206 768 1456 1617 2170 2256 2127 1877 1331 905 526 -294 -751 -1500 -1848 -2024 -1947 -2190 -2059 -1328 -1229
3939 -1229 -427 -83 671 1278 1546 2004 2082 2155 2071 1670 1355 789 101 -435 -1177 -1424 -1812 -1898 -2090 -2038 -1933
3960 -1933 -1456 -951 -378 250 746 1116 1859 1960 2050 1926 1826 1424 1111 427 -100 -722 -1160 -1405 -1838 -1996
3980 -1996 -1957 -2034 -1610 -1205 -789 -155 519 988 1475 1752 1942 2190 1973 1724 1417 745 387 -283 -892 -1420
$$ packed form
3836A596k39o52n46p44o04n89k3n68J56Q8J38O11L83N90R16M84L13O19J43K44
3856B316q7l61l14m36q26k61o51p73l31n93m6K74N5L62M29M29Q11N93O09N99J69
3877A967L2J33k48J1n38n84o15o71n80k81n30l26J65k01M92N06J40P39O63N34
3897H08N86L46J79K68j22L0l49n63o92l46q93l34m95m30o2j51k1P25Q9M16R06
3918a05L11N62O88J61N53Q6j29k50n46m26l79q20m57p49l48j76P7k43J31P31R9
3939a229Q02L44P54O07K68M58P8P3q4m01l15n66o88n36p42k47l88q6j92N2J05
3960a933M77N05N73O28M96L70P43J01R0j24j00m02l13o84n27o22m38k45m33j58
3980a996L9p7M24M05M16O34O74M69M87K77J90K48k17k49l07o72l58o70o09n28
$$ plain form
4000 -1420 -1741 -1872 -1963 -1971 -1519 -1411 -1175 -405 17 619 1217 1656 1701 2061 1985 1766 1773 1174 848 100 -560 -913
4022 -913 -1487 -1800 -1966 -2021 -2007 -1531 -1288 -748 -324 346 885 1229 1768 2060 2010 1917 1755 1322 992 553 18
4043 18 -484 -1101 -1552 -1805 -2016 -2102 -1844 -1428 -1149 -668 -227 578 981 1278 1757 1803 1930 2111 1587 1295 1032
4064 1032 126 -318 -766 -1314 -1686 -1868 -2001 -1720 -1801 -1387 -923 -740 125 619 1108 1620 1724 1787 1713 1722 1613
4085 1613 1040 408 99 -390 -1076 -1361 -1712 -1936 -1932 -1654 -1588 -1220 -721 -68 294 831 1395 1726 1797 2039 1752
4106 1752 1662 1451 1030 452 1 -622 -1095 -1325 -1817 -1854 -1832 -1840 -1560 -1143 -615 179 309 960 1245 1574 1759
4127 1759 1912 1723 1491 1062 649 266 -380 -779 -1100 -1556 -1837 -1916 -1924 -1628 -1282 -897 -553 -74 693 1160 1500
4148 1500 1816 1839 1812 1779 1559 982 479 -25 -460 -925 -1277 -1358 -1949 -1998 -1730 -1580 -1211 -701 -259 328 731
$$ packed form
4000a420l21j31r1qM52J08K36P70M22O02N98M39M5L60p6k19Pn99l26p48o60l53
4022i13n74l13j66n5J4M76K43N40M24O70N39L44N39K92n0r3j62m33l30m39n35
4043A8n02o17m51k53k11q6K58M16K79M81M41Q05M03K97M79M6J27J81n24k92k63
4064A032r06m44m48n48l72j82j33K81q1M14M64J83Q65M94M89N12J04O3p4Rj09
4085A613n73o32l09m89o86k85l51k24MK78O6L68M99O53L62N37N64L31P1K42k87
4106A752r0k11m21n78m51o23m73k30m92l7K2qK80M17N28P94J30O51K85L29J85
4127A759J53j89k32m29m13l83o46l99l21m56k81p9qK96L46L85L44M79P67M67L40
4148A500L16K3k7l3k20n77n03n04m35m65l52q1n91m9K68J50L69N10M42N87M03
$$ plain form
4169 731 1167 1420 1793 1900 1814 1452 1151 1025 299 -237 -639 -1189 -1468 -1876 -1901 -1741 -1647 -1490 -1040 -501 136
4190 136 397 901 1341 1557 1675 1835 1834 1494 1262 675 128 -226 -715 -1184 -1519 -2033 -1798 -1752 -1632 -1181 -888
4211 -888 -277 331 614 1044 1567 1562 1820 1667 1706 1346 1014 511 -35 -624 -855 -1286 -1681 -1798 -1713 -1564 -1444
4232 -1444 -1318 -748 81 305 901 1196 1494 1812 1791 1657 1547 975 684 420 -223 -617 -1068 -1334 -1673 -1636
4252 -1636 -1857 -1571 -1312 -936 -397 39 578 812 1184 1707 1817 1662 1601 1571 1046 788 190 -198 -640 -1237
4272 -1237 -1451 -1602 -1759 -1736 -1390 -1174 -721 -342 216 774 1104 1472 1536 1643 1787 1400 1147 938 367 95
4292 95 -382 -983 -1239 -1538 -1706 -1671 -1529 -1415 -963 -506 -293 245 715 1269 1608 1535 1869 1589 1449 1171 806
4313 806 361 -136 -748 -1144 -1370 -1745 -1729 -1563 -1550 -1369 -947 -656 160 535 883 1240 1450 1687 1886 1541 1341
$$ packed form
4169G31M36K53L73J07q6l62l01j26p26n36m02n50k79m08k5J60R4J57M50N39O37
4190A36K61N04M40K16J18J60jl40k32n87n47l54m89m69l35n14K35M6J20M51K93
4211h88O11O08K83M30N23nK58j53L9l60l32n03n46n89k31m31l95j17Q5J49J20
4232a444J26N70Q29K24N96K95K98L18k1j34j10n72k91k64o43l94m51k66l39L7
4252a636k21K86K59L76N39M36N39K34L72N23J10j55o1l0n25k58n98l88m42n97
4272a237k14j51j57K3L46K16M53L79N58N58L30L68O4J07J44l87k53k09n71k72
4292I5m77o01k56k99j68L5J42J14M52M57K13N38M70N54L39p3L34k80j40k78l65
4313H06m45m97o12l96k26l75J6J66J3J81M22K91Q16L75L48L57K10K37J99l45k00
$$ plain form
4334 1341 1174 420 284 -415 -938 -1183 -1526 -1652 -1618 -1764 -1531 -990 -795 -172 158 568 1224 1206 1453 1816
4354 1816 1526 1368 1512 750 465 -46 -629 -936 -1402 -1513 -1589 -1575 -1575 -1383 -925 -541 -118 275 709 1008 1465
4375 1465 1674 1630 1448 1376 1165 776 264 -72 -648 -821 -1408 -1574 -1591 -1669 -1478 -1316 -949 -537 -87 408 911
4396 911 1214 1630 1736 1558 1539 1411 1107 470 94 -180 -644 -1208 -1320 -1647 -1680 -1555 -1560 -1129 -837 -303 362
4417 362 602 997 1419 1642 1662 1542 1442 1406 803 445 45 -547 -927 -1409 -1533 -1738 -1515 -1701 -1275 -1073 -669
4438 -669 -63 396 799 1116 1326 1629 1736 1630 1451 1156 654 319 -158 -638 -880 -1410 -1455 -1647 -1436 -1401 -1151
4459 -1151 -764 -429 -115 498 1110 1103 1537 1706 1599 1614 1332 906 571 200 -424 -531 -1241 -1460 -1503 -1704 -1657
4480 -1657 -1254 -1102 -530 -328 87 623 1120 1417 1650 1569 1558 1574 1004 959 254 -149 -509 -801 -1229 -1200 -1625
$$ packed form
4334A341j67p54j36o99n23k45l43j26L4j46K33N41J95O23L30M10O56j8K47L63
4354A816k90j58J44p62k85n11n83l07m66j11p6J4%J92M58L84M23L93M34K99M57
4375A465K09m4j82p2k11l89n12l36n76j73n87j66j7p8J91J62L67M12M50M95N03
4396I11L03M16J06j78j9j28l04o37l76k74m64n64j12l27l3J25nM31K92N34O65
4417C62K40L95M22K23K0j20j00l6o03l58m00n92l80m82j24k05K23j86M26K02M04
4438f69O06M59M03L17K10L03J07j06j79k95n02l35m77m80k42n30m5j92K11L5K50
4459a151L87L35L14O13O12pM34J69j07J5k82m26l35l71o24j07p10k19m3k01M7
4480a657M03J52N72K02M15N36M97K97K33q1j1J6n70m5p05m03l60k92m28K9m25
$$ plain form
4501 -1625 -1858 -1400 -1274 -1015 -399 -194 292 635 1147 1613 1467 1606 1563 1165 977 913 37 -81 -551 -1025
4521 -1025 -1509 -1346 -1524 -1498 -1536 -1148 -799 -407 44 496 959 1432 1482 1695 1780 1477 1120 1220 611 136 -281
4542 -281 -948 -1118 -1315 -1778 -1511 -1592 -1350 -989 -762 -298 44 648 1008 1202 1408 1647 1549 1440 963 850 422
4563 422 -168 -651 -949 -1084 -1506 -1397 -1649 -1414 -1265 -1034 -456 -22 379 719 1240 1442 1727 1476 1524 1339
4583 1339 955 822 313 -159 -537 -1071 -1377 -1282 -1748 -1623 -1562 -1237 -798 -351 -47 418 897 1040 1528 1673
4603 1673 1645 1520 1331 950 550 130 -365 -838 -1231 -1376 -1450 -1633 -1461 -1529 -913 -822 -489 314 629 1111 1218
4624 1218 1412 1486 1501 1434 1212 793 288 -27 -618 -949 -1193 -1471 -1679 -1497 -1398 -1229 -827 -554 -54 186 753
4645 753 1213 1378 1375 1658 1489 1369 929 531 334 -210 -776 -1054 -1364 -1647 -1472 -1657 -1411 -872 -877 -334 223
$$ packed form
4501a625k33M58J26K59O16K05M86L43N12M66j46J39m3l98j88o4q76j18m70m74
4521a025m84J63j78K6l8L88L49L92M51M52M63M73N0K13Q5l03l57J00o09m75m17
4542b81o67j70j97m63K67q1K42L61K27M64L42O04L60J94K06K39r8j09m77j13m28
4563D22n90m83k98j35m22J09k52K35J49K31N78M34M01L40N21K02K85k51M8j85
4583A339l84j33n09m72l78n34l06R5m66J25O1L25M39M47L04M65M79J43M88J45
4603A673k8j25j89l81m00m20m95m73l93j45p4j83J72o8O16R1L33Q03L15M82J07
4624A218J94P4J5o7k22m19n05l15n91l31k44k78k08J82R9J69M02K73N00K40N67
4645G53M60J65lK83j69j20m40l98j97n44n66k78l10k83J75j85K46N39nN43N57
$$ plain form
4666 223 499 877 1266 1310 1579 1611 1448 1478 941 551 -71 -429 -899 -1182 -1429 -1605 -1488 -1685 -1321 -1055 -707
4687 -707 -246 286 792 1100 1313 1508 1557 1468 1223 796 720 594 -107 -493 -1008 -1199 -1456 -1607 -1688 -1378 -1286 -947
4709 -947 -495 -176 377 934 951 1421 1699 1492 1513 1217 933 765 184 -267 -588 -1040 -1387 -1589 -1617 -1538 -1270
4730 -1270 -1260 -702 -257 271 603 918 1191 1470 1561 1630 1572 1276 832 330 215 -430 -883 -1272 -1561 -1647 -1569 -1472
4752 -1472 -1248 -902 -567 -99 433 752 1057 1427 1637 1705 1511 1394 1036 895 146 -221 -650 -969 -1303 -1682
4772 -1682 -1684 -1800 -1435 -1086 -870 -343 -35 448 997 1218 1458 1590 1462 1527 1564 1074 653 67 -345 -786 -1013
4793 -1013 -1362 -1648 -1670 -1767 -1490 -1142 -576 -448 135 674 1046 1378 1434 1532 1816 1448 1218 981 515 -65 -641
4814 -641 -804 -1133 -1317 -1605 -1700 -1497 -1239 -975 -512 67 428 727 1194 1474 1610 1680 1590 1297 1208 780 300
$$ packed form
4666B23K76L78L89M4K69L2j63L0n37l90o22l58m70k83k47j76J17j97L64K66L48
4687g07M61N32N06L08K13J95M9q9k45m27p6j26p01l86n15j91k57j51q1L10R2L39
4709i47M52L19N53N57J7M70K78k07K1k96k84j68n81m51l21m52l47k02k8P9K68
4730a270J0N58M45N28L32L15K73K79R1O9n8k96m44n02j15o45m53l89k89q6P8R7
4752a472K24L46L35M68N32L19L05L70K10O8j94j17l58j41p49l67m29l19l34l79
4772a682kj16L65L49K16N27L08M83N49K21K40J32j28O5L7m90m21n86m12m41k27
4793a013l49k86k2r7K77L48N66J28N83N39L72L32N6R8K84l68k30k37m66n80n76
4814f41j63l29j84k88r5K03K58K64M63N79L61K99M67K80J36P0r0k93q9m28m80
$$ plain form
4835 300 -284 -754 -1058 -1423 -1657 -1579 -1652 -1436 -1060 -810 -295 -12 583 940 1222 1447 1429 1536 1442 1293 993
4856 993 499 108 -411 -782 -1240 -1515 -1660 -1650 -1695 -1307 -1009 -622 -183 116 648 1117 1232 1572 1702 1641 1321
4877 1321 1125 709 412 -40 -618 -922 -1218 -1619 -1505 -1741 -1462 -1178 -855 -381 0 342 829 1288 1518 1664
4897 1664 1527 1589 1323 1092 690 352 -452 -546 -1106 -1472 -1461 -1661 -1646 -1344 -1137 -853 -283 111 755 937 1345
4918 1345 1680 1654 1755 1518 1266 764 466 40 -445 -586 -1162 -1449 -1633 -1498 -1586 -1377 -1020 -673 -194 307
4938 307 874 1236 1403 1707 1412 1438 1544 937 772 363 -105 -329 -941 -1204 -1476 -1676 -1591 -1373 -1066 -691 -425
4959 -425 -89 513 898 1440 1391 1655 1695 1504 1442 914 491 101 -326 -846 -1224 -1396 -1554 -1705 -1619 -1449 -1066
4980 -1066 -578 -308 251 673 1077 1668 1593 1791 1762 1426 1268 779 223 -106 -520 -950 -1182 -1560 -1622 -1564 -1571 -1310
$$ packed form
4835C00n84m70l04l65k34P8p3K16L76K50N15K83N95L57K82K25j8J07r4j49l00
4856I93m94l91n19l71m58k75j45J0m5L88K98L87M39K99N32M69J15L40J30o1l20
4877A321j96m16k97m52n78l04k96m01J14k36K79K84L23M74L81L42M87M59K30J46
4897A664j37O2k66k31m02l38q04r4n60l66J1k00J5L02K07K84N70L94O44J82M08
4918A345L35k6J01k37k52n02k98m26m85j41n76k87j84J35q8K09L57L47M79N01
4938C07N67L62J67L04k95K6J06o07j65m09m68k24o12k63k72k00Q5K18L07L75K66
4959d25L36O02L85N42m9K64M0j91o2n28m23l90m27n20l78j72j58j51Q6J70L83
4980a066M88K70N59M22M04N91p5J98k9l36j58m89n56l29m14m30k32l78o2N8pK61
$$ plain form
5002 -1310 -808 -381 3 336 871 1227 1579 1799 1699 1708 1407 1198 567 166 -234 -707 -1004 -1422 -1591 -1702
5022 -1702 -1683 -1326 -1123 -865 -313 26 393 1084 1105 1556 1744 1593 1451 1225 969 471 59 -384 -846 -1209
5042 -1209 -1514 -1679 -1699 -1608 -1364 -1007 -649 -272 177 654 1162 1416 1729 1657 1824 1424 1130 834 124 -204 -652
5063 -652 -1083 -1440 -1356 -1663 -1786 -1605 -1319 -792 -396 -113 429 1025 1111 1498 1576 1658 1583 1303 1029 623 55 -210
5085 -210 -820 -933 -1411 -1522 -1622 -1651 -1495 -859 -774 -332 296 700 908 1334 1470 1625 1501 1308 1188 859 418
5106 418 -22 -451 -1227 -1308 -1513 -1704 -1622 -1595 -1446 -753 -477 -103 359 765 1058 1350 1617 1598 1555 1400 1007 537
5128 537 273 -215 -669 -919 -1399 -1620 -1618 -1613 -1255 -1059 -676 -307 197 465 1062 1272 1279 1701 1693 1441 1101 761 456
5151 456 53 -335 -697 -1292 -1359 -1598 -1712 -1589 -1424 -920 -531 -58 320 593 1360 1379 1658 1633 1478 1264 988
$$ packed form
5002a310N02M27L84L33N35L56L52K20j00Rl01k09o31m01m00m73k97m18j69j11
5022a702J9L57K03K58N52L39L67O91K1M51J88j51j42k26k56m98m12m43m62l63
5042a209l05j65k0R1K44L57L58L77M49M77N08K54L13p2J67m00k94k96p10l28m48
5063f52m31l57Q4l07j23J81K86N27L96K83N42N96Q6L87P8Q2p5k80k74m06n68k65
5085b10o10j13m78j11j00k9J56O36Q5M42O28M04K08M26J36J55j24j93j20l29m41
5106D18m40m29p76q1k05j91Q2K7J49O93K76L74M62M06K93K92K67j9m3j55l93m70
5128E37k64m88m54k50m80k21KNL58J96L83L69N04K68N97K10PM22qk52l40l40l05
5151D56m03l88l62n95o7k39j14J23J65N04L89M73L78K73P67J9K79k5j55k14k76
$$ plain form
5172 988 717 400 -132 -730 -779 -1390 -1580 -1745 -1729 -1468 -1144 -838 -359 89 435 975 1142 1494 1741 1640 1585
5193 1585 1113 834 473 31 -287 -788 -976 -1364 -1538 -1622 -1508 -1355 -1141 -593 -192 64 611 1245 1292 1446
5213 1446 1676 1660 1380 1300 803 70 12 -509 -876 -914 -1432 -1715 -1559 -1585 -1251 -965 -751 -141 501 804 1113
5234 1113 1301 1494 1627 1410 1204 931 819 -16 -278 -670 -1045 -1383 -1516 -1479 -1527 -1232 -1182 -627 -370 226 482
5255 482 898 1321 1387 1642 1476 1473 1271 902 591 -30 -635 -830 -1220 -1381 -1705 -1626 -1365 -1307 -920 -561 -59 139
5277 139 692 1090 1207 1438 1469 1553 1284 1098 717 99 -258 -498 -1100 -1326 -1449 -1468 -1436 -1444 -1127 -617 -404 23
5299 23 494 834 1227 1437 1545 1498 1442 1076 911 622 99 -390 -726 -1042 -1404 -1587 -1549 -1477 -1240 -925 -671 -290
5321 -290 195 604 1060 1222 1416 1393 1511 1332 1128 785 225 3 -542 -635 -1208 -1225 -1539 -1657 -1323 -1128 -680
$$ packed form
5172I88k71l17n32n98m9o11j90j65J6K61L24L06M79M48L46N40J67L52K47j01n5
5193A585m72k79l61m42l18n01j88l88j74q4J14J53K14N48M01K56N47O34M7J54
5213A446K30j6k80q0m97p33n8n21l67l8n18k83J56k6L34K86K14O10O42L03L09
5234A113J88J93J33k17k06k73j12q35k62l92l75l38j33L7m8K95N0N55K57N96K56
5255D82M16M23O6K55j66lk02l69l11o21o05j95l90j61l24P9K61N8L87L59N02J98
5277A39N53L98J17K31L1Q4k69j86l81o18l57k40o02k26j23j9L2qL17N10K13M27
5299B3M71L40L93K10J08m7n6l66j65k89n23m89l36l16l62j83L8P2K37L15K54L81
5321b90M85M09M56J62J94k3J18j79k04l43n60k22n45r3n73j7l14j18L34J95M48
$$ plain form
5342 -680 -521 -191 401 800 982 1351 1273 1346 1505 1297 982 667 261 -88 -641 -796 -1370 -1347 -1334 -1349 -1451 -1123
5364 -1123 -728 -355 148 417 810 1188 1529 1403 1669 1376 1115 749 583 74 -479 -629 -1010 -1207 -1395 -1411
5384 -1411 -1466 -980 -834 -549 -109 55 637 1018 1210 1365 1342 1311 1147 929 678 97 -272 -571 -827 -1120 -1414
5405 -1414 -1516 -1374 -1266 -1232 -586 -409 201 370 775 969 1209 1487 1428 1361 1127 840 546 59 -294 -780 -849
5426 -849 -1172 -1232 -1323 -1233 -1151 -1075 -600 -266 123 604 970 1199 1202 1389 1488 1282 1130 736 289 60 -323 -932 -1171
5449 -1171 -1191 -1559 -1397 -1173 -1100 -719 -414 132 384 630 997 1229 1195 1505 1318 1114 883 643 224 -174 -556
5470 -556 -993 -1039 -1224 -1436 -1264 -1209 -675 -599 -273 10 142 934 1205 1212 1203 1323 1065 1007 760 466 16 -440 -593
5493 -593 -985 -1296 -1299 -1332 -1214 -1159 -898 -613 -48 183 623 800 1062 1589 1368 1212 1258 800 694 344 -172 -481
$$ packed form
5342f80J59L30N92L99J82L69p8P3J59k08l15l15m06l49n53j55n74K3J3j5j02L28
5364a123L95L73N03K69L93L78L41j26K66k93k61l66j66n09n53j50l81j97j88j6
5384a411n5M86J46K85M40J64N82L81J92J55k3l1j64k18k51n81l69k99k56k93k94
5405a414j02J42J08L4O46J77O10J69M05J94K40K78n9o7k34k87k94m87l53m86o9
5426h49l23o0r1R0Q2P6M75L34L89M81L66K29LJ87R9k06j52l94m47k29l83o09k39
5449a171k0l68J62K24P3L81L05N46K52K46L67K32l4L10j87k04k31k40m19l98l82
5470e56m37m6j85k12J72N5N34P6L26K83J32P92K71PrJ20k58n8k47k94m50m56j53
5493e93l92l11ll3J18N5K61K85N65K31M40J77K62N27k21j56M6m58j06l50n16l09
$$ plain form
5515 -481 -798 -1080 -1208 -1277 -1287 -1142 -1098 -660 -435 34 232 781 1008 1163 1262 1357 1068 1090 863 584 107 -163
5537 -163 -656 -979 -1081 -1231 -1305 -1339 -992 -730 -626 -308 104 571 914 1089 1401 1248 1289 1180 1049 660 246
5558 246 65 -493 -668 -938 -1059 -1319 -1372 -1268 -1094 -817 -355 -135 204 530 859 1100 1224 1221 1229 1145 796 572
5580 572 40 -214 -266 -691 -1052 -1212 -1215 -1319 -1236 -812 -755 -236 175 327 701 966 947 1246 1347 1168 945 725
5602 725 447 132 -433 -487 -795 -1002 -1342 -1350 -1256 -962 -737 -567 -100 217 459 778 1074 1416 1189 1139 1105 993
5624 993 627 394 -92 -429 -696 -955 -1079 -1242 -1201 -1085 -863 -821 -446 -22 279 620 764 1028 1375 1293 1235
5645 1235 857 744 422 50 -254 -663 -842 -1019 -1157 -1062 -1267 -1097 -852 -487 -267 54 338 735 1046 1285
5665 1285 1286 1107 1148 835 586 376 -33 -282 -570 -880 -1011 -1271 -1158 -1011 -879 -738 -473 -203 199 515 846
$$ packed form
5515d81l17k82j28o9j0J45M4M38K25M69J98N49K27J55R9R5k89K2k27k79m77k70
5537a63m93l23j02j50p4l4L47K62J04L18M12M67L43J75L12j53M1j09j31l89m14
5558B46j81n58j75k70j21k60n3J04J74K77M62K20L39L26L29K41J24lQq4l49k24
5580E72n32k54n2m25l61j60lj04Q3M24N7N19M11J52L74K65j9K99J01j79k23k20
5602G25k78l15n65n4l08k07l40qR4K94K25J70M67L17K42L19K96L42k27n0l4j12
5624I93l66k33m86l37k67k59j24j63M1J16K22M2L75M24L01L41J44K64L47q2n8
5645A235l78j13l22l72l04m09j79j77j38R5k05J70K45L65K20L21K84L97L11K39
5665A285Jj79M1l13k49k10m09k49k88l10j31k60J13J47J32J41K65K70M02L16L31
$$ plain form
5686 846 1057 1124 1316 1201 990 862 558 248 -129 -161 -681 -910 -1108 -1133 -1160 -1109 -958 -449 -463 -1 216 600
5708 600 871 971 1263 1173 1240 871 746 258 125 -455 -655 -816 -1001 -1164 -1181 -1080 -1027 -787 -450 -427 -6 290
5730 290 819 958 1091 1277 1242 1032 825 493 193 80 -330 -510 -789 -1046 -987 -1092 -1015 -955 -633 -439 -79
5751 -79 325 626 861 1041 1206 1117 1174 984 713 397 282 -136 -479 -787 -1013 -1040 -984 -929 -928 -805 -454 -171 -94
5774 -94 413 648 706 1040 1125 1112 1141 830 676 532 147 -279 -602 -861 -869 -1219 -1074 -864 -1009 -793 -528 -274
5796 -274 110 498 561 1021 1142 1007 988 799 791 643 234 -31 -266 -517 -888 -1044 -1143 -890 -1122 -788 -587 -442
5818 -442 -82 283 515 834 960 1002 1162 911 956 651 426 218 -58 -388 -696 -947 -1053 -1038 -1084 -844 -610
5839 -610 -490 -257 137 347 591 706 901 1187 854 905 700 523 365 119 -368 -572 -736 -1005 -938 -1125 -1199
$$ packed form
5686H46K11O7J92j15k11j28l04l10l77l2n20k29j98k5k7N1J51N09j4M62K17L84
5708F00K71J00K92r0O7l69j25m88j33n80k00j61j85j63j7J01N3K40L37K3M21K96
5730B90N29J39J33J86l5k10k07l32l00j13m10j80k79k57N9j05P7O0L22J94L60
5751g9M04L01K35J80J65q9N7j90k71l16j15m18l43l08k26k7N6N5JJ23L51K83P7
5774i4N07K35N8L34Q5j3K9l11j54j44l85m26l23k59ql50J45K10j45K16K65K54
5796b74L84L88O3M60J21j35j9j89qj48m09k65k35k51l71j56r9K53k32L34K01J45
5818d42L60L65K32L19J26M2J60k51M5l05k25k08k76l30l08k51j06J5m6K40K34
5839f10J20K33L94K10K44J15J95K86l33N1k05j77j58k46m87k04j64k69O7j87p4
$$ plain form
5860 -1199 -783 -720 -406 -165 154 386 539 844 976 883 913 900 833 574 143 -109 -238 -408 -710 -834 -978
5881 -978 -1051 -868 -957 -471 -319 -15 301 514 623 992 858 1046 923 725 728 318 90 -33 -532 -641 -773
5902 -773 -903 -1026 -987 -954 -660 -419 -345 95 235 337 675 1026 861 927 798 700 596 242 80 -411 -481 -481 -891
5925 -891 -916 -1079 -943 -731 -671 -413 8 43 417 764 905 1098 1019 1008 957 826 667 217 25 -146 -502 -724
5947 -724 -819 -805 -1041 -977 -735 -659 -262 -56 74 401 555 766 1056 937 786 747 483 342 291 -134 -332 -589
5969 -589 -891 -887 -906 -926 -921 -655 -512 -215 -92 225 456 726 734 868 965 903 694 535 391 86 -127 -360 -638
5992 -638 -760 -918 -881 -772 -888 -750 -556 -276 181 399 606 726 893 1088 832 810 856 600 193 -41 -226
6013 -226 -489 -591 -791 -918 -657 -821 -831 -699 -450 -82 155 494 725 791 915 858 953 741 566 334 284 67
$$ packed form
5860a199M16O3L14K41L19K32J53L05J32r3L0j3o7k59m31k52j29j70l02j24j44
5881i78p3J83q9M86J52L04L16K13J09L69j34J88j23j98Lm10k28j23m99j09j32
5902g73j30j23L9L3K94K41P4M40J40J02L38L51j65O6j29r8j04l54j62m91p0%m10
5925h91k5j63J36K12O0K58M21L5L74L47J41J93p9j1n1j31j59m50j92j71l56k22
5947g24r5J4k36O4K42P6L97K06J30L27J54K11K90j19j51l9k64j41n1m25j98k57
5969e89l02Mj9k0NK66J43K97J23L17K31K70QJ34R7o2k09j59j44l05k13k33k78
5992f38j22j58L7J09j16J38J94K80M57K18K07J20J67J95k56k2M6k56m07k34j85
6013b26k63j02k00j27K61j64j0J32K49L68K37L39K31O6J24n7R5k12j75k32n0k17
$$ plain form
6035 67 -646 -525 -877 -967 -784 -1070 -1038 -604 -597 -336 -33 183 534 729 837 916 877 853 872 588 403 92 -348
6058 -348 -436 -643 -757 -951 -934 -681 -734 -550 -477 -81 -81 239 563 625 762 1180 977 757 533 486 139 -80 -385
6081 -385 -557 -765 -716 -1110 -1055 -849 -666 -581 -322 -10 48 409 571 751 866 984 929 768 568 406 74 -156
6103 -156 -276 -621 -769 -987 -823 -787 -875 -846 -444 -215 77 292 424 628 792 833 1047 930 666 592 345 53
6125 53 -202 -600 -639 -693 -934 -750 -922 -840 -654 -441 -38 -16 346 618 710 874 942 952 753 735 467 289 45
6148 45 -316 -610 -751 -973 -973 -881 -862 -798 -551 -386 -157 258 340 582 717 908 797 855 822 510 419 138 -78
6171 -78 -418 -424 -749 -694 -1030 -920 -824 -677 -401 -216 -4 304 492 642 733 1023 896 944 828 553 418 -33
6193 -33 -110 -503 -676 -935 -743 -869 -1074 -800 -658 -328 -134 -22 396 600 789 882 1011 959 780 682 601 225
$$ packed form
6035F7p13J21l52r0J83k86L2M34PK61L03K16L51J95J08P9l9k4J9k84j85l11m40
6058c48q8k07j14j94J7K53n3J84P3L96%L20L24O2J37M18k03k20k24m7l47k19l05
6081c85j72k08M9l94N5K06J83Q5K59L12N8L61J62J80J15J18n5j61k00j62l32k30
6103a56j20l45j48k18J64L6q8K9M02K29K92K15J32K04J64M1K14j17k64p4k47k92
6125E3k55l98l9n4k41J84j72Q2J86K13M03K2L62K72R2J64O8J0j99j8k68j78k44
6148D5l61k94j41k22%R2J9O4K47J65K29M15Q2K42J35J91j11N8l3l12r1k81k16
6171g8l40ol25N5l36J10R6J47K76J85K12L08J88J50R1K90j27M8j16k75j35m51
6193c3p7l93j73k59J92j26k05K74J42L30J94J12M18K04J89R3J29n2j79r8q1l76
$$ plain form
6215 225 -4 -334 -546 -736 -710 -880 -1011 -901 -689 -360 -335 -166 125 479 768 1002 684 994 995 828 508
6236 508 232 162 -8 -321 -610 -904 -1011 -913 -951 -898 -552 -583 -259 0 359 452 667 751 943 889 666 736 632
6259 632 440 114 -403 -210 -550 -651 -872 -1051 -1013 -806 -570 -460 -267 108 284 701 786 989 990 772 881
6280 881 727 387 192 105 -94 -376 -698 -872 -989 -1016 -1044 -655 -462 -345 -29 29 445 527 933 1000 781 971
6302 971 869 608 298 305 -238 -394 -611 -618 -918 -956 -773 -838 -645 -342 -288 -129 325 577 822 960 823 938
6324 938 893 680 428 379 52 -272 -477 -631 -620 -1040 -919 -880 -763 -720 -493 18 198 325 578 864 934 963
6346 963 964 848 746 520 263 148 -245 -567 -675 -886 -873 -1055 -967 -696 -431 -350 -74 143 517 680 884 1050
6368 1050 993 896 936 509 313 147 -118 -536 -610 -722 -975 -900 -854 -870 -651 -438 -202 15 266 579 908 1050
$$ packed form
6215B25k29l30k12j90K6j70j31J10K12L29K5J69K91L54K89K34l18L10Jj67l20
6236E08k76p0j70l13k89k94j07R8l8N3L46l1L24K59L59R3K15Q4J92n4k23P0j04
6259F32j92l26n17J93l40j01k21j79L8K07K36J10J93L75J76M17Q5K03Jk18J09
6280H81j54l40j95q7j99k82l22j74j17k7k8L89J93J17L16N8M16Q2M06O7k19J90
6302I71j02k61l10Pn43j56k17pl00l8J83o5J93L03N4J59M54K52K45J38j37J15
6324I38m5k13k52m9l27l24k05j54J1m20J21L9J17M3K27N11J80J27K53K86P0K9
6346I63Jj16j02k26k57j15l93l22j08k11J3j82Q8K71K65Q1K76K17L74J63K04J66
6368A050n7r7M0m27j96j66k65m18p4j12k53P5M6j6K19K13K36K17K51L13L29J42
$$ plain form
6390 1050 973 1025 965 940 594 174 43 -290 -464 -732 -598 -1079 -958 -1005 -803 -544 -253 -248 71 328 524 990
6412 990 951 1043 891 969 671 321 162 -44 -398 -585 -870 -970 -958 -887 -839 -740 -442 -236 -93 291 509 632
6434 632 909 980 1021 918 771 500 434 23 7 -295 -620 -736 -1050 -950 -827 -780 -508 -430 -333 75 215 598
6456 598 743 772 922 928 816 740 628 197 40 -134 -367 -654 -946 -870 -922 -907 -797 -613 -411 2 49 483 501
6479 501 867 1231 979 906 776 566 245 250 11 -364 -521 -790 -877 -870 -840 -876 -469 -434 -330 75 359 658 645
6502 645 900 975 989 746 777 612 388 205 -275 -366 -831 -812 -693 -959 -933 -617 -605 -352 -174 112 316 658
6524 658 906 914 954 868 651 623 486 111 -12 -498 -535 -728 -674 -856 -827 -786 -773 -511 -340 -34 280 541 665
6547 665 767 836 956 825 837 537 440 373 -198 -402 -657 -790 -818 -1042 -826 -765 -697 -325 -77 82 363 512
$$ packed form
6390A050p7N2o0k5l46m20j31l33j74k68J34m81J21m7K02K59K91NL19K57J96M66
6412I90l9R2j52P8k98l50j59k06l54j87k85j00J2P1M8R9K98K06J43L84K18J23
6434F32K77P1M1j03j47k71o6m11j6l02l25j16l14J00J23M7K72P8R7M08J40L83
6456E98J45K9J50Oj12p6j12m31j57j74k33k87k92P6n2J5J10J84K02M13M7M34J8
6479E01L66L64k52p3j30k10l21Nk39l75j57k69q7PL0l6M07L5J04M05K84K99j3
6502F45K55P5J4k43L1j65k24j83m80r1m65J9J19k66K6L16J2K53J78K86K04L42
6524F58K48QM0q6k17k8j37l75j23m86l7j93N4j82K9M1J3K62J71L06L14K61J24
6547F65J02O9J20j31J2l00r7o7n71k04k55j33k8k24K16O1O8L72K48J59K81J49
$$ plain form
6569 512 820 951 904 917 733 721 527 414 -135 -338 -571 -571 -766 -868 -844 -1047 -768 -624 -408 -113 289 473
6591 473 600 829 938 802 880 786 721 265 306 -98 -362 -630 -807 -861 -921 -780 -876 -520 -299 -230 -45 245 457
6614 457 656 882 773 821 734 778 443 404 259 -241 -328 -539 -787 -920 -1001 -869 -676 -590 -395 -81 70 476
6636 476 745 854 1014 991 890 830 654 481 325 -58 -239 -515 -779 -711 -865 -843 -823 -688 -459 -268 94 192
6658 192 482 702 743 990 717 879 709 416 614 141 -148 -540 -584 -729 -848 -913 -760 -659 -564 -323 -156
6679 -156 8 501 512 737 825 769 958 906 458 495 229 -17 -307 -542 -762 -811 -746 -700 -766 -716 -545 -361 70
6702 70 37 372 575 668 764 900 565 700 623 245 163 31 -463 -541 -627 -778 -844 -919 -722 -583 -351 -177 110
6725 110 254 413 766 654 929 912 789 797 462 316 84 -305 -292 -576 -852 -745 -898 -921 -713 -668 -563 -14
$$ packed form
6569E12L08J31m7J3j84j2j94j13n49k03k33%j95j02K4k03K79J44K16K95M02J84
6591D73J27K29J09j36P8r4o5m56M1m04k64k68j77n4o0J41r6L56K21O9J85K90K12
6614D57J99K26j09M8q7M4l35l9j45n00q7k11k48j33q1J32J93Q6J95L14J51M06
6636D76K69J09J60k3j01o0j76j73j56l83j81k76k64O8j54K2K0J35K29J91L62R8
6658A92K90K20M1K47k73J62j70k93J98m73k89l92m4j45j19o5J53J01R5K41J67
6679a56J64M93J1K25Q8n6J89n2m48L7k66k46k90k35k20m9O5M6o6N0J71J84M31
6702G0l3L35K03R3R6J36l35J35p7l78q2j32m94p8q6j51o6p5J97J39K32J74K87
6725A10J44J59L53j12K75j7j23Ql35j46k32l89J3k84k76J07j53k3K08M5J05N49
$$ plain form
6747 -14 73 308 516 800 764 748 773 707 520 426 185 -137 -339 -671 -730 -744 -889 -864 -583 -806 -408 -311 -1 133
6771 133 383 598 855 906 818 869 599 473 254 -158 -126 -229 -521 -507 -792 -865 -789 -709 -566 -319 -252 50 258
6794 258 484 598 783 812 907 703 539 380 214 9 -152 -514 -535 -672 -789 -871 -633 -598 -330 -79 -90 180
6816 180 173 476 821 639 687 757 780 488 344 123 -40 -245 -421 -725 -809 -751 -793 -694 -636 -529 -166 13 173
6839 173 448 447 766 786 761 863 611 590 292 -2 -115 -177 -430 -625 -822 -734 -899 -717 -462 -291 -90 86
6861 86 325 558 731 729 706 626 706 531 391 219 44 -338 -405 -586 -674 -869 -816 -715 -491 -385 -351 -57 136
6884 136 357 537 780 586 781 667 549 550 164 90 -119 -331 -544 -653 -838 -723 -921 -650 -540 -264 -283
6905 -283 32 320 383 636 685 738 754 592 678 417 255 168 -254 -382 -515 -473 -687 -684 -510 -626 -439 -213 -186
$$ packed form
6747a4Q7K35K08K84l6j6K5o6j87r4k41l22k02l32n9j4j45K5K81k23L98R7L10J34
6771A33K50K15K57N1q8N1k70j26k19m12L2j03k92J4k85p3P6Q0J43K47O7L02K08
6794B58K26J14J85K9R5k04j64j59j66k05j61l62k1j37j17q2K38L5K68K51j1K70
6816A80pL03L45j82M8P0K3k92j44k21j63k05j76l04q4N8m2R9N8J07L63J79J60
6839A73K75jL19K0k5J02k52k1k98k94j13o2k53j95j97Q8j65J82K55J71K01J76
6861H6K39K33J73kk3q0Q0j75j40j72j75l82o7j81q8j95N3J01K24J06L4K94J93
6884A36K21J80K43j94J95j14j18Jl86p4k09k12k13j09j85J15j98K71J10K76j9
6905b83L15K88O3K53M9N3J6j62Q6k61j62q7m22j28j33M2k14LJ74j16J87K26K7
$$ plain form
6928 -186 347 324 404 507 810 781 564 673 567 336 93 -7 -271 -452 -397 -711 -712 -648 -758 -407 -285 -259 108
6951 108 156 376 523 676 641 687 463 604 379 214 187 -179 -314 -569 -649 -721 -674 -860 -625 -416 -374 -173 52
6974 52 152 345 582 548 710 578 660 496 251 265 -9 -64 -306 -540 -541 -708 -770 -622 -579 -291 -332 -62 165
6997 165 214 648 471 623 568 525 606 482 448 6 -135 -17 -249 -614 -639 -673 -630 -492 -548 -494 -171 -75 254 388
7021 388 488 685 518 748 405 702 432 241 -44 -97 -248 -537 -533 -757 -435 -587 -470 -399 -219 -209 3 336
7043 336 217 555 454 676 771 594 593 354 39 -108 -199 -385 -584 -543 -622 -477 -651 -369 -257 -288 -20 52 140
7066 140 366 340 499 648 722 658 432 314 -55 -67 -71 -429 -417 -560 -548 -641 -642 -492 -319 -202 147 279 424 393
7090 393 588 653 488 475 556 379 264 -33 -279 -420 -499 -483 -527 -472 -432 -492 -347 -251 -89 115 247 379 454 617
$$ packed form
6928a86N33k3Q0J03L03k9k17J09j06k31k43j00k64j81N5l14jO4j10L51J22K6L67
6951A08M8K20J47J53l5M6k24J41k25j65k7l66j35k55q0p2M7j86K35K09M2K01K25
6974E2J00J93K37l4J62j32Q2j64k45J4k74n5k42k34jj67o2J48M3K88m1K70K27
6997A65M9M34j77J52n5m3Q1j24l4m42j41J18k32l65k5l4M3J38n6N4L23R6L29J34
7021C88J00J97j67K30l43K97k70j91k85n3j51k89Mk24L22j52J17P1J80J0K12L33
7043C36j19L38j01K22R5j77jk39l15j47r1j86j99M1p9J45j74K82J12l1K68P2Q8
7066A40K26k6J59J49P4o4k26j18l69j2ml58J2j43J2r3jJ50J73J17L49J32J45l1
7090C93J95O5j65j3Q1j77j15k97k46j41p9J6m4N5M0o0J45R6J62K04J32J32P5J63
$$ plain form
7114 617 596 550 401 330 317 294 -16 -102 -297 -557 -655 -381 -622 -588 -553 -461 -79 -26 279 213 400 662 478 581
7138 581 410 419 423 140 107 -125 -257 -375 -499 -484 -387 -386 -562 -181 -163 -195 -107 78 404 266 394 525 615 402
7162 402 434 435 136 10 -146 -211 -419 -400 -706 -500 -492 -450 -373 -151 -97 -24 233 140 370 461 590 625 388 437 260
7187 260 42 -105 -134 -335 -481 -450 -504 -484 -454 -368 -160 -263 59 234 364 216 461 452 507 468 435 521 156 -3
7211 -3 80 -77 -332 -386 -620 -422 -510 -433 -457 -231 -128 -113 102 414 301 394 551 307 547 418 295 307 88
7234 88 1 -303 -368 -382 -476 -631 -536 -231 -332 -198 -47 120 176 337 385 451 480 574 408 305 326 372 -111 -57 -160
7259 -160 -394 -502 -577 -449 -354 -323 -335 -289 101 148 214 235 517 552 496 558 403 468 301 25 -45 -204 -215 -147 -562
7284 -562 -458 -470 -333 -217 -252 -202 58 -7 294 289 359 346 386 438 347 303 308 -32 -251 -187 -247 -440 -354 -519 -431 -304
$$ packed form
7114F17k1m6j49p1j3k3l10q6j95k60r8K74k41L4L5R2L82N3L05o6J87K62j84J03
7138E81j71RMk83l3k32j32j18j24J5R7Jj76L81J8l2Q8J85L26j38J28J31R0k13
7162D02L2Jk99j26j56o5k08J9l06K06QM2P7K22N4P3K57r3K30R1J29L5k37M9j77
7187B60k18j47k9k01j46L1n4K0L0Q6K08j03L22J75J30j48K45rN5l9l3Q6l65j59
7211cQ3j57k55n4k34J98q8P7k4K26J03J5K15L12j13R3J57k44K40j29j23J2k19
7234H8q7l04o5j4r4j55R5L05j01J34J51J67N6J61M8O6K9R4j66j03K1M6m83N4j03
7259a60k34j08p5J28R5L1j2M6L90M7O6K1K82L5n6O2j55O5j67k76p0j59j1O8m15
7284e62J04j2J37J16l5N0K60o5L01nP0j3M0N2r1m4Nl40k19O4o0j93Q6j65Q8J27
$$ plain form
7310 -304 -255 -323 -30 146 312 384 411 488 433 306 411 432 362 -104 19 -132 -293 -257 -324 -404 -496 -363 -468 -250
7334 -250 -71 -3 151 36 176 384 325 579 324 366 347 379 31 68 -200 -205 -441 -565 -260 -253 -146 -235 -63 42
7358 42 67 177 213 296 356 498 552 418 369 128 116 -61 -63 -344 -210 -385 -457 -350 -474 -323 -286 -390 -122 -60
7382 -60 151 222 288 248 387 411 527 260 359 244 39 -117 -308 -293 -394 -454 -497 -323 -263 -46 -216 73 160 158
7406 158 405 319 340 268 385 318 387 10 67 -18 -75 -327 -185 -260 -400 -500 -243 -382 -351 -73 3 242 182 407
7430 407 333 431 167 454 415 271 158 -119 -53 -182 -161 -282 -342 -353 -331 -192 -263 -165 -79 -147 49 110 372 320 362
7455 362 340 282 297 171 86 -33 100 -112 -288 -289 -422 -499 -343 -297 -312 -90 -184 173 234 290 354 266 401 231 436
7480 436 394 70 -67 -161 -76 -137 -239 -200 -233 -253 -66 -185 -85 -140 -51 82 252 462 245 380 310 256 463 249
$$ packed form
7310c04M9o8K93J76J66P2K7P7n5j27J05K1p0m66J23j51j61L6o7q0r2J33j05K18
7334b50J79O8J54j15J40K08n9K54k55M2j9L2l48L7k68nk36j24L05PJ07q9J72J05
7358D2K5J10L6Q3O0J42N4j34m9k41j2j77kk81J34j75p2J07j24J51L7j04K68O2
7382f0K11P1O6m0J39K4J16k67R9j15k05j56j91J5j01o0m3J74O0K17j70K89Q7k
7406A58K47q6K1p2J17o7O9l77N7q5n7k52J42p5j40j00K57j39L1K78P6K39o0K25
7430D07p4R8k64K87l9j44j13k77O6j29K1j21o0j1K2J39p1R8Q6o8J96O1K62n2M2
7455C62k2n8J5j26q5j19J33k12j76jj33p7J56M6j5K22r4L57O1N6O4q8J35j70K05
7480D36m2l24j37r4Q5o1j02L9l3k0J87j19J00n5Q9J33J70K10k17J35p0n4K07k14
$$ plain form
7504 249 270 -4 22 -250 -362 -253 -411 -310 -383 -262 25 -292 -12 21 89 169 227 367 277 348 302 251 112 10
7528 10 -11 33 -315 -128 -259 -320 -337 -346 -183 -243 -211 51 150 80 139 368 275 223 125 227 207 160 34 -15 -157 -140
7554 -140 -236 -186 -304 -401 -317 -83 -286 -94 -87 154 89 188 128 384 417 257 274 327 159 -100 -117 -143 -202 -231 -275 -339
7580 -339 -178 -328 -174 -66 159 41 192 338 189 191 176 193 265 183 56 245 11 26 5 -267 -158 -461 -421
7603 -421 -405 -198 -82 -167 -75 161 205 258 273 180 544 375 241 244 323 227 -76 -114 -76 -284 -313 -276 -403 -152 -181
7628 -181 68 -94 -83 -114 71 137 371 120 242 248 193 203 -37 57 -126 -164 -241 -181 -207 -355 -248 -237 -202 -174 -156
7653 -156 -34 179 120 235 169 158 270 388 284 247 92 141 -177 -124 -122 -200 -331 -288 -417 -340 -71 -127 2 -59
7677 -59 139 197 180 280 211 382 357 77 64 193 -89 -103 -260 -244 -148 -424 -225 -331 -165 -306 -82 -25 38 202
$$ packed form
7504B49K1k74K6k72j12J09j58J01p3J21K87l17K80L3O8Q0N8J40r0P1m6n1j39j02
7528A0k1M4l48J87j31o1j7rJ63o0L2K62R9p0N9K29r3n2r8J02k0m7j26m9j42J7
7554a40r6N0j18r7Q4K34k03J92PK41o5R9o0K56L3j60J7N3j68k59j7k6n9k9m4o4
7580c39J61j50J54J08K25j18J51J46j49Kj5J7P2q2j27J89k34J5k1k72J09l03M0
7603d21J6K07J16q5R2K36M4N3J5r3L64j69j34LP9r6l03l8L8k08k9L7j27K51k9
7628a81K49j62J1l1J85O6K34k51J22On5J0k40R4j83l8p7O0k6j48J07J1L5K8J8
7653a56J22K13n9J15o6j1J12J18j04l7j55M9l18N3Kp8j31M3j29P7K69n6J29o1
7677e9J98N8j7J00o9J71k5k80j3J29k82j4j57J6R6k76J99j06J66j41K24N7O3J64
$$ plain form
7701 202 226 245 347 214 346 144 -53 217 -8 -13 -120 -200 41 -190 -494 -341 -356 -193 -176 123 153 118 145
7724 145 103 106 291 204 293 59 192 126 -244 -132 -94 -106 -226 -125 -241 -260 -333 -330 -80 -3 7 54 224 230 322 256
7750 256 163 228 189 73 7 -74 -25 -268 -241 -230 -437 -37 -227 -142 -102 -208 -56 83 89 302 82 231 285 251 80
7775 80 74 149 -30 191 -225 -222 -125 -199 -178 -205 -311 -63 -200 -4 18 207 198 161 178 245 163 199 116 194 226 60 -28
7802 -28 -103 -79 -60 -205 -214 -55 -154 -47 -61 -75 18 220 161 242 173 290 234 66 153 111 117 -68 -318 -135 -172 -97 -151
7829 -151 -213 -220 -257 -44 -25 -37 117 84 304 157 371 226 225 234 99 35 179 90 -91 -233 -238 -104 -319 -179 -151
7854 -151 -70 -148 -88 -54 -103 101 123 140 190 292 195 146 194 159 -49 -210 -3 -206 -197 -263 -183 -155 -244 -254 37 28 25 61
7882 61 -10 231 344 335 161 52 59 104 113 -79 -70 -200 -10 -255 -349 -49 -239 -108 -199 10 78 114 103 373 222
$$ packed form
7701B02K4J9J02j33J32k02j97K70k25nj07q0K41k31l04J53j5J63J7K99L0l5K7
7724A45m2LJ85q7Q9k34J33o6l70J12L8j2j20J01j16j9p3LK50P7J0M7J70OR2o6
7750B56r3O5l9j16o6q1M9k43K7J1k07M00j90Q5M0j06J52J39OK13k20J49N4l4j71
7775H0oP5j79K21m16LR7p4K1k7j06K48j37J96K2J89rl7J7O7q2L6q3P8L2j66q8
7802b8p5K4J9j45rJ59r9J07j4j4R3K02n9Q1o9J17n6j68Q7m2Oj85k50J83l7P5n4
7829a51o2pl7K13J9j2J54l3K20j47K14j45jRj35o4J44q9j81j42nJ34k15J40K8
7854a51Q1p8O0L4m9K04K2J7N0J02r7m9M8l5k08j61K07k03Ro6Q0K8q9j0K91rlL6
7882F1p1K41J13rj74j09PM5Rj92Rj30J90k45r4L00j90J31r1K09O8L6j1K70j51
$$ plain form
7907 222 111 285 106 78 10 26 16 -231 -154 -147 -215 -91 -108 -266 -353 -103 49 -201 103 -3 40 171 2 134
7931 134 235 53 157 100 12 154 -70 -39 -85 -338 -84 -234 -156 -56 -71 -42 -1 -27 195 253 147 171 -4 287
7955 287 153 61 13 7 -38 -83 -100 -112 -262 -181 -169 -140 -84 -77 22 -38 27 285 33 116 69 -49 206 -47 138 85 5
7982 5 -64 -69 -281 -152 -254 -100 -144 -82 -281 -35 62 -112 178 80 115 140 94 147 257 61 226 163 22 -103 -287
8007 -287 -269 -118 -245 -153 -174 -48 90 72 -125 139 41 112 22 151 158 71 381 84 67 77 -12 -26 -55 -130 -142 -206
8033 -206 -210 -141 -36 -103 -93 206 148 171 193 173 298 36 215 147 103 -80 153 -122 -149 -222 -270 -320 -141 -273 -23
8058 -23 -48 34 32 4 3 229 25 50 189 139 96 207 148 71 -94 -170 -377 -306 -144 -162 -46 -236 -50 13 -31 58
8084 58 26 197 101 17 150 88 84 108 -12 98 -100 -110 -152 -112 -146 -45 -152 -307 -84 -226 -90 -194 120 229
$$ packed form
7907B22j11J74j79k8o8J6j0k47P7Po8J24j7j58q7K50J52k50L04j06M3J31j69J32
7931A34J01j82J04n7q8J42k24L1m6k53K54j50P8J00j5K9M1k6K22N8j06K4j75K91
7955B87j34r2m8om5m5j7j2j50Q1J2K9N6PR9o0O5K58k52Q3m7j18K55k53J85n3q0
7982Eo9nk12J29j02J54m4O2j99K46R7j74K90r8L5K5m6N3J10j96J65o3j41j25j84
8007b87J8J51j27R2k1J26J38j8j97K64r8P1r0J29Pq7L10k97j7J0q9j4k9p5j2o4
8033b06mO9J05o7J0K99n8K3K2k0J25k62J79o8m4j83K33k75k7p3m8n0J79j32K50
8058b3k5Q2kk8jK26k04K5J39n0m3J11n9p7j65p6k07P1J62j8J16j90J86O3m4Q9
8084E8l2J71r6q4J33o2mK4j20J10j98j0m2M0l4J01j07j55K23j42J36j04L14J09
$$ plain form
8108 229 128 -59 193 46 149 196 -212 39 -10 -5 -117 -183 -255 -157 -256 -211 -79 -149 -73 73 -88 378 -3 96
8132 96 24 232 60 142 166 123 220 31 106 -131 -38 -86 -156 -131 -56 -145 -154 -53 72 -160 -63 104 102 75 57 93 55
8159 55 78 153 134 71 -34 -46 -64 -17 -40 -153 -35 -82 0 -90 -2 170 187 228 153 270 -36 114 -21 62 -58 -74
8185 -74 18 83 50 -39 -197 -169
$$ packed form
8108B29j01j87K52j47J03M7m08K51m9Nj12o6p2R8r9M5J32p0P6J46j61M66l81R9
8132I6p2K08j72Q2K4m3R7j89P5k37R3m8p0K5P5q9rJ01J25k32R7J67kk7j8L6l8
8159E5K3P5j9o3j05j2j8M7k3j13J18m7Q2r0Q8J72J7M1p5J17l06J50j35Q3j20j6
8185g4R2O5l3q9j58K8
8191a69
$$ Imaginary data points
##PAGE= N=2
##DATA TABLE= (X++(I..I)), XYDATA
$$ plain form
0 0 0 0 0 0 0 0 8 -8 8 -8 16 -16 24 -32 40 -48 64 -80 96 -114 136 -168 193 -232 272 -320 368 -431 496
29 496 -567 649 -739 841 -953 1075 -1210 1360 -1525 1702 -1901 2115 -2352 2608 -2889 3195
45 3195 -3530 3897 -4297 4737 -5217 5748 -6333 6978 -7701 8509 -9418 10455 -11641
58 -11641 13018 -14643 16591 -18976 21974 -25878 31187 -38873 51037 -73271 127039 -521223
70 -521223 -289933 898607 38577 -713612 -604686 54803 223737 180650 87531 23995
80 23995 44722 392890 368425 -12936 -84425 340090 469163 -66062 -568026 -151941 371764
91 371764 101789 -441334 -514550 -246320 39513 83301 -34242 -198787 -213800 112904 373152
102 373152 153040 8308 217746 310393 133208 22216 110503 137327 -7822 -16681 -28455
$$ packed form
0@%%%%%%Qj6J6j6K4l2M0n6P2q8J12j44J76k10K50l04L61m25N04n92O88p99R27
29D96j063J216j388J580j794K028k285K570k885L227l603M016m467M960n497O084
45C195o725P427q194R034r954J0965j2081J3311j4679J6210j7927J9873k2096
58a1641K4659k7661L1234l5567M0950m7852N7065p0060Q9910j24308K00310o48262
70e21223K31290J188540q60030p52189J08926O59489J68934m3087r3119o3536
80B3995K0727L48168k4465l81361p1489M24515J29073n35225n01964M16085N23705
91C71764k69975n43123p3216K68230K85833M3788j17543j64545j5013L26704K60248
102C73152k20112j44732K09438R2647j77185j10992Q8287K6824j45149q859j1774
$$ plain form
113 -28455 -295678 -326129 3396 39661 -268046 -391959 -152824 114188 74950 -33182 43860
124 43860 67142 56699 232805 355440 172958 -62171 51367 307836 103566 -278802
134 -278802 -126557 183501 -2107 -370616 -367539 -73494 42129 -94640 -151046 -122706 -92036
145 -92036 99422 254588 115087 -22211 101465 280251 231339 32259 23317 154071 85403
156 85403 -109054 -172376 -85639 8378 -72253 -250092 -275150 -162712 -16370 75897 -18631
167 -18631 -132589 -23403 154151 191679 133158 115524 153863 123199 62322 85435 73830
178 73830 3689 -17988 -80541 -180169 -157790 -55498 -36837 -156394 -245668 -119509 44664
189 44664 52784 26294 32179 47369 94119 132176 169363 188564 101322 19327 38042 40843 -275
$$ packed form
113b8455k67223l0451L29525L6265l07707j23913K39135K67012l9238j08132P7042
124D3860K3282j0443J76106J22635j82482k35129J13538K56469k04270l82368
134b78802J52245L10058j85608l68509L077K94045J15623j36769n6406K8340L0670
145i2036J91458J55166j39501j37298J23676J78786m8912j99080q942J30754o8668
156H5403j94457o3322Q6737R4017q0631j77839k5058J12438J46342R2267r4528
167a8631j13958J09186J77554L7528n8521j7634L8339l0664o0877K3113j1605
178G3830p0141k1677o2553r9628K2379J02292J8661j19557q9274J26159J64173
189D4664Q120k6490N885J5190M6750L8057L7187J9201q7242q1995J8715K801m1118
$$ plain form
202 -275 -36450 -62938 -96523 -168021 -175679 -79217 -59988 -103820 -81236 -59099 -24235 69888 123052
215 123052 107015 63978 60589 140465 170739 105928 55232 14641 -8073 -8816 -60436 -93961
227 -93961 -79057 -102137 -121197 -124128 -132512 -76115 -5247 14277 12268 -4458 43599 140794 137724
240 137724 101283 101375 73853 72930 86075 34039 -20907 -50933 -60461 -66829 -122972 -130615 -66163
253 -66163 -72526 -102865 -91371 -66262 19823 88862 63790 44839 52240 84341 145925 136152 78757
266 78757 43996 12528 17271 6873 -56043 -63104 -63063 -117007 -124165 -99409 -74543 -36843 -40064
279 -40064 -48964 -23144 19627 104709 135568 63753 44951 81575 98803 112463 74875 9452
291 9452 -18225 -45844 -53267 -43592 -69222 -84803 -103636 -127775 -81222 -30362 -18026 2983 -5333
$$ packed form
202b75l6175k6488l3585p1498p658R6462J9229m3832K2584K2137L4864R4123N3164
215A23052j6037m3037l389P9876L0274o4811n0696m0591k2714p43n1620l3525
227i3961J4904k3080j9060k931q384N6397P0868J9524k009j6726M8057R7195l070
240A37724l6441R2k7522r23J3145n2036n4946l0026r528o368n6143p643O4452
253f6163o363l0339J1494K5109Q6085O9039k5072j8951P401L2101O1584r773n7395
266G8757l4761l1468M743j0398o2916p061M1n3944p158K4756K4866L7700l221
279d0064q900K5820M2771Q5082L0859p1815j8802L6624J7228J3660l7588o5423
291I452k7677k7619p423R675k5630j5581j8833k4139M6553N0860J2336K1009q316
$$ plain form
304 -5333 1842 71557 106962 100550 89488 67407 67960 61306 40590 46596 8937 -57951 -70416
317 -70416 -79137 -81058 -55692 -71380 -97184 -87835 -58973 -7086 18652 16082 44232 61513 65391
330 65391 88687 85886 80855 87176 46914 7526 3835 -4791 -16942 -49823 -93046 -94831 -81319
343 -81319 -65134 -49339 -66338 -57189 -6736 10020 20248 52810 72877 85091 78137 58034
355 58034 61957 66751 60093 38039 -16767 -46635 -35959 -47969 -63510 -68598 -84531 -81195 -63150
368 -63150 -49261 -19402 6466 15800 22870 29198 62840 101735 89667 62733 47757 30504 36388
381 36388 39670 3966 -32731 -56773 -72812 -70628 -64045 -53244 -49573 -70729 -65152 -21422 14301
394 14301 42262 47757 27607 39402 75612 90487 81483 49855 23791 19288 7308 -5352 -19306
$$ packed form
304e333P175O9715L5405o412j1062k2081N53o654k0716O006l7659o6888j2465
317g0416q721j921K5366j5688k5804R349K8862N1887K5738k570K8150J7281L878
330F5391K3296k801n031O321m0262l9388l691q626j2151l2881m3223j785J3512
343h1319J6185J5795j6999R149N0453J6756J0228L2562K0067J2214o954k0103
355E8034L923M794o658k2054n4806k9868J0676j2010j5541n088j5933L336J8045
368f3150J3889K9859K5868R334P070O328L3642L8895j2068k6934j4976j7253N884
381C6388L282l5704l6697k4042j6039K184O583J0801L671k1156N577M3730L5723
394A4301K7961N495k0150J1795L6210J4875r004l1628k6064m503j1980j2660j3954
$$ plain form
407 -19306 -47683 -59644 -69162 -89635 -69445 -31079 -26530 -35087 -38464 -14172 38273 65895 64439
420 64439 52507 39302 59467 78908 57230 35688 13733 -14392 -18133 -27071 -48343 -52857 -60557
433 -60557 -68855 -68133 -61174 -26647 -2244 -11476 731 22899 36630 64814 72931 59952 57420
446 57420 44538 34038 34142 17342 150 -23858 -51900 -48413 -51327 -65219 -52059 -49887 -53821
459 -53821 -32364 -16583 73 23180 31621 47506 53921 42469 56250 69052 59388 39585 -1800
472 -1800 -17103 7256 -4039 -39650 -59583 -69255 -58404 -48798 -45986 -28306 -27286 -24069 9461
485 9461 21761 27313 53844 62265 57726 45120 29062 46692 56603 22809 -13812 -37723 -34775
498 -34775 -18969 -37755 -55618 -57729 -70770 -52352 -13796 -5941 -3998 641 10239 37667 51496
$$ packed form
407a9306k8377j1961r518k0473K0190L8366M549q557l377K4292N2445K7622j456
420F4439j1932j3205K0165J9441k1678k1542k1955k8125l741q938k1272m514p700
433f0557q298P22O959L4527K4403r232J2207K2168J3731K8184Q117j2979k532
446E7420j2882j0500J04j6800j7192k4008k8042L487k914j3892J3160K172l934
459e3821K1457J5781J6656K3107Q441J5885O415j1452J3781J2802r664j9803m1385
472a800j5303K4359j1295l5611j9933r672J0851R606K812J7680J020L217L3530
485I461J2300N552K6531Q421m539j2606j6058J7630R911l3794l6621k3911K948
498c4775J5806j8786j7863k111j3041J8418L8556P855J943M639R598K7428J3829
$$ plain form
511 51496 56256 63061 48003 35934 31916 17485 19270 13281 -23455 -44909 -50384 -50633 -39212 -40255
525 -40255 -46142 -47105 -49435 -16730 28351 28815 14240 16192 38401 70398 64500 36227 35006 34330
539 34330 18608 2991 -13614 -18521 -26330 -44096 -47430 -56529 -64639 -32126 -6878 -23427 -34313
552 -34313 -10908 33096 54323 35458 27408 43552 53613 53567 37763 17857 14128 3598 -14438
565 -14438 -25384 -41025 -45108 -33962 -40432 -55530 -54118 -30704 1902 8482 -3295 6560 28261
578 28261 46343 57168 47262 36439 39138 32474 19361 10346 248 -11480 -30564 -45629 -42954
591 -42954 -42788 -44429 -32616 -31036 -37484 -24579 2680 28244 35401 22621 22781 41272 53907 55245
605 55245 41019 19036 6226 -1395 -1357 -3596 -29726 -50150 -44368 -42671 -45066 -36737 -23499 -12569
$$ packed form
511E1496M760O805j5058j2069m018j4431J785n989l6736k1454n475k49J1421j043
525d0255n887r63k330L2705M5081M64j4575J952K2209L1997n898k8273j221o76
539C4330j5722j5617j6605m907p809j7766l334r099q110L2513K5248j6549j0886
552c4313K3405M4004K1227j8865q050J6144J0061m6j5804j9906l729j0530j8036
565a4438j0946j5641m083J1146o470j5098J412K3414L2606O580j1777R855K1701
578B8261J8082J0825r906j0823K699o664j3113r015j0098j1728j9084j5065K675
591d2954J66j641J1813J580o448J2905K7259K5564P157j2780J60J8491J2635J338
605E5245j4226k1983j2810p621L8k239k6130k0424N782J697k395Q329J3238J0930
$$ plain form
619 -12569 -14436 -12220 14618 37890 44426 43964 31141 28024 43009 45424 32267 9828 -14255
632 -14255 -17215 -14714 -25273 -35462 -45128 -46681 -37988 -39088 -30318 -6078 2987 5115 10272 16751
646 16751 39845 56851 46602 31680 23419 27387 31931 12516 -7063 -15291 -30232 -33780 -32656
659 -32656 -42637 -40614 -33484 -32583 -24937 -17361 -1243 22562 24508 22431 30310 35762 47300 47606 28697
674 28697 21105 15076 2199 -3414 -15182 -27344 -30793 -40680 -43145 -39448 -38132 -20622 -9136 -16038
688 -16038 -6404 11145 26195 42357 39168 30409 32675 32783 36276 31543 9756 -2770 -13452 -24869
702 -24869 -21634 -27947 -40011 -38173 -40324 -37643 -22591 -12289 1055 9360 7477 18465 31412
715 31412 40666 50791 38730 19627 19652 19898 17373 7425 -17439 -30999 -32958 -33791 -28913 -33562 -38948
$$ packed form
619a2569j867K216K6838K3272O536m62j2823l117J4985K415j3157k2439k4083
632a4255k960K501j0559j0189r666j553Q693j100Q770K4240R065K128N157O479
646A6751K3094J7006j0249j4922q261L968M544j9415j9579q228j4941l548J124
659c2656r981K023P130R01P646P576J6118K3805J946k077P879N452J1538L06j8909
674B8697p592o029j2877n613j1768j2162l449r887k465L697J316J7510J1486o902
688a6038R634J7549J5050J6162l189q759K266J08L493m733k1787j2526j0682j1417
702b4869L235o313j2064J838k151K681J5052J0302J3344Q305j883J0988J2947
715C1412R254J0125j2061j9103K5K46k525r948k4864j3560j959q33M878m649n386
$$ plain form
730 -38948 -29243 -24167 -15957 3444 13075 21208 28008 23748 29034 41493 44594 37735 16676 1141
744 1141 4321 1759 -7494 -20272 -40331 -42994 -31911 -30548 -29628 -26214 -20484 -7102 903 8555
758 8555 23580 31728 35167 34892 27154 29604 35175 25356 11393 -3071 -14721 -16087 -19805 -28506
772 -28506 -34686 -39711 -35574 -26819 -23821 -13683 -497 4114 11476 20683 26807 35990 40127 34849
786 34849 26946 18939 16020 13496 1458 -10475 -21255 -32454 -32479 -29571 -31568 -29962 -27657 -24367
800 -24367 -12673 566 11363 19580 22288 26308 31005 32055 35705 34319 20899 9403 257 -7315
814 -7315 -8069 -13322 -27490 -38210 -40851 -32101 -20783 -19209 -17472 -12354 -4674 11933 24791 27042
828 27042 30715 31309 27078 28182 27815 23588 14847 -2076 -14236 -18535 -20689 -19590 -27329 -40052 -36791
$$ packed form
730c8948R705N076Q210J9401R631Q133O800m260N286J2459L101o859k1059j5535
744A141L180k562r253j2778k0059k663J1083J363R20L414N730J3382Q005P652
758H555J5025Q148L439k75p738K450N571r819j3963j4464j1650j366l718q701
772b8506o180n025M137Q755K998J0138J3186M611P362R207O124R183M137n278
786C4849p903q007k919k524j2038j1933j0780j1199k5K908j997J606K305L290
800b4367J1694J3239J0797Q217K708M020M697J050L650j386j3420j1496r146p572
814g315p54n253j4168j0720k641Q750J1318J574J737N118P680J6607J2858K251
828B7042L673N94m231J104l67m227q741j6923j2160m299k154J099p739j2723L261
$$ plain form
843 -36791 -26848 -17891 -6780 -3615 -801 9653 18555 28284 34446 32078 31510 26027 16801 16976 12785
858 12785 890 -8245 -22121 -29657 -26435 -27248 -28150 -28497 -29824 -19872 -9262 -1499 11532 15697 17077
873 17077 26103 28584 31068 35124 26410 17012 10582 2454 -900 -9097 -20249 -23658 -30951 -33939 -26849
888 -26849 -26145 -21688 -11985 -9558 -2369 8496 16467 27590 29530 25612 28128 25755 23763 23032 10273
903 10273 41 -6732 -18085 -20212 -20571 -27340 -29007 -31334 -29316 -17799 -10018 -1376 6063 5052
917 5052 13526 26373 29294 32808 30533 21022 17610 13532 9433 5555 -8267 -19213 -24624 -30110
931 -30110 -24934 -21383 -27173 -25631 -20640 -12594 2461 10065 12889 18230 20431 25440 30800 29097 27338
946 27338 18982 6214 2712 -1785 -8283 -11575 -22511 -32926 -31762 -26379 -18820 -16464 -18506 -11328
$$ packed form
843c6791R943Q957J1111L165K814J0454Q902R729O162k368n68n483r226J75m191
858A2785j1895r135j3876p536L222q13r02l47j327R952J0610P763J3031M165J380
873A7077R026K481K484M056q714r398o430q128l354q197j1152l409p293k988P090
888b6849P04M457R703K427P189J0865P971J1123J940l918K516k373j992p31j2759
903A0273j0232o773j1353k127l59o769j667k327K018J1517P781Q642P439j011
917E052Q474J2847K921L514k275r511l412m078m099l878j3822j0946n411n486
931c0110N176L551n790J542M991Q046J5055P604K824N341K201N009N360j703j759
946B7338q356j2768l502m497o498l292j0936j0415J164N383P559K356k042P178
$$ plain form
960 -11328 -1122 7711 19437 23214 22209 25366 25457 25398 25103 17685 10131 1693 -8620 -13407 -16782
975 -16782 -20816 -23538 -29599 -30828 -22574 -16027 -10232 -2985 843 6580 15671 22755 27246 27174 25435
990 25435 23896 18142 12662 9406 1600 -7169 -13984 -21761 -25937 -24883 -23950 -22569 -21670 -19439 -11347
1005 -11347 -1309 7445 13969 16480 18828 24208 26348 27032 25181 16891 8475 3709 -2233 -7933 -13419
1020 -13419 -19390 -24724 -29201 -27793 -19954 -15441 -13005 -8004 -3851 3916 15947 22596 24524 22895
1034 22895 20622 22438 23266 18476 11575 653 -8330 -11955 -16239 -18116 -19924 -26992 -28636 -23324 -16905
1049 -16905 -7664 -1418 1040 5216 10757 19996 28936 26611 22472 20611 15139 13266 11168 2358 -6316
1064 -6316 -15249 -21384 -20574 -21757 -22281 -21178 -22893 -18283 -8337 -1497 7145 11952 12286 18478 23347 24606
$$ packed form
960a1328J0206Q833J1726L777j005L157R1n9k95p418p554q438j0313m787l375
975a6782m034k722o061j229Q254O547N795P247L828N737R091P084M491p2j739
990B5435j539n754n480l256p806q769o815p777m176J054R33J381Q99K231Q092
1005a1347J0038Q754O524K511K348N380K140O84j851q290q416m766n942n700n486
1020a3419n971n334m477J408P839M513K436N001M153P767J2031O649J928j629
1034B2895k273J816Q28m790o901j0922q983l625m284j877j808p068j644N312O419
1049a6905R241O246K458M176N541R239Q940k325m139j861n472j873k098q810q674
1064f316q933o135Q10j183n24J103j715M610R946O840Q642M807L34O192M869J259
$$ plain form
1080 24606 26026 21640 15277 9897 2381 -924 -4919 -14232 -18500 -22784 -27623 -22803 -18490 -16699 -12392
1095 -12392 -9529 -1914 8045 12063 18422 22361 20814 22809 22213 18018 16720 9957 1215 -4270 -12211
1110 -12211 -16073 -16883 -21347 -22822 -23873 -23193 -14576 -8974 -4439 4236 6883 9734 18197 22507 25237
1125 25237 24426 18319 15332 10918 6521 4516 -4123 -14233 -18187 -22319 -21776 -18653 -20252 -18775 -15844
1140 -15844 -12029 -1703 7708 11880 15204 14962 18084 24608 24127 21293 15801 5947 1171 -152 -5291
1155 -5291 -10941 -18184 -23128 -23154 -22984 -18662 -12079 -11466 -8597 -2181 4068 13340 19780 20001 19626 18637 18908
1172 18908 20232 15978 8717 351 -7104 -9941 -12573 -16979 -19245 -21902 -23948 -19546 -12898 -7525 -2863
1187 -2863 879 6025 11671 16590 22230 23382 19845 17427 15158 10920 6996 1527 -5618 -12063 -17454
$$ packed form
1080B4606J420m386o363n380p516l305l995r313m268m284m839M820M313J791M307
1095a2392K863P615R959M018O359L939j547J995n96m195j298o763q742n485p941
1110a2211l862q10m464j475j051O80Q617N602M535Q675K647K851Q463M310K730
1125B5237q11o107k987m414m397k005q639j0110l954m132N43L123j599J477K931
1140a5844L815J0326R411M172L324k42L122O524m81k834n492r854m776j323n139
1155e291n650p243m944k6J70M322O583O13K869O416O249R272O440K21l75r89K71
1172A8908J324m254p261q366p455k837k632m406k266k657k046M402O648N373M662
1187b863L742N146N646M919N640J152l537k418k269m238l924n469p145o445n391
$$ plain form
1202 -17454 -19366 -19348 -20029 -19327 -17336 -13897 -7783 -1250 4319 10675 14731 16275 19019 20836 20189 18881
1218 18881 15315 8332 1146 -3366 -5722 -9816 -16681 -20406 -21629 -21533 -17543 -12712 -10066 -6294 -1422
1233 -1422 4451 11377 16539 19784 20833 18236 16457 16213 14092 10080 2083 -7108 -11031 -13368 -15542
1248 -15542 -16685 -19773 -21934 -19076 -13584 -6613 -1075 1710 6422 10584 13897 20552 23288 19926 16348
1263 16348 11864 8492 7362 2444 -4271 -11562 -18569 -18489 -17130 -17440 -16502 -17010 -15060 -7127 -514 5654
1279 5654 11004 11894 14264 18067 19699 21102 17634 11520 7562 1591 -2715 -4407 -10721 -16268 -18841
1294 -18841 -21133 -18634 -15363 -12871 -8983 -6499 -2038 6583 11362 14807 18337 17229 17602 18124 14470
1309 14470 12037 7589 559 -4241 -9661 -13529 -14465 -17725 -18769 -17989 -17852 -12429 -5886 -2568 2426
$$ packed form
1202a7454j912J8o81P02J991L439O114O533N569O356M056J544K744J817o47j308
1218A8881l566o983p186m512k356m094o865l725j223R6L990M831K646L772M872
1233a422N873O926N162L245J049k597j779k44k121m012p997r191l923k337k174
1248a5542j143l088k161K858N492O971N538K785M712M162L313O655K736l362l578
1263A6348m484l372j130m918o715p291p007Q0J359l10R38n08J950P933O613O168
1279E654N350Q90K370L803J632J403l468o114l958n971m306j692o314n547k573
1294a8841k292K499L271K492L888K484M461Q621M779L445L530j108L73N22l654
1309A4470k433m448p030m800n420l868r36l260j044P80J37N423O543L318M994
$$ plain form
1324 2426 6479 9964 15458 17916 18902 19502 15462 12574 9251 3436 801 -3388 -10546 -14782 -18040
1339 -18040 -18954 -16191 -15260 -14212 -11534 -8499 -1370 5796 9377 13435 14845 14935 17830 18554 16442 13384
1355 13384 6289 440 -2907 -6105 -8602 -13137 -19010 -19567 -18529 -15285 -9913 -7804 -5818 -1066 3864
1370 3864 10640 16036 17171 17012 15323 14305 14827 12015 6836 1175 -6029 -10399 -11293 -13555 -15540 -17680
1386 -17680 -18435 -15734 -11208 -5842 -492 2407 5156 9816 13862 17771 19344 16801 13546 11017 8202
1401 8202 5165 518 -5166 -10565 -14648 -15979 -16100 -15850 -15113 -12997 -10811 -6077 3 5109 8757 11841
1417 11841 13961 15686 17061 16986 14400 10374 6005 1869 -2494 -6849 -10033 -13288 -16242 -17107 -17134 -14652
1433 -14652 -10568 -7162 -3724 194 4422 9519 13787 15949 16744 15258 13535 12837 9586 5783 1420
$$ packed form
1324B426M053L485N494K458R86O00m040k888l323n815k635m189p158m236l258
1339a8040r14K763R31J048K678L035P129P166L581M058J410R0K895P24k112l058
1355A3384p095n849l347l198k497m535n873n57J038L244N372K109J986M752M930
1370C864O776N396J135j59j689j018N22k812n179n661p204m370q94k262j985k140
1386a7680p55K701M526N366N350K899K749M660M046L909J573k543l255k529k815
1401H202l037m647n684n399m083j331j21K50P37K116K186M734O080N106L648L084
1417A1841K120J725J375p5k586m026m369m136m363m355l184l255k954q65k7K482
1433a4652M084L406L438L918M228N097M268K162P95j486j723o98l251l803m363
$$ plain form
1448 1420 -4756 -9609 -12177 -13781 -14313 -15382 -16331 -14482 -11125 -5977 182 3172 5933 9573 12046
1463 12046 15563 18020 16499 13812 9425 5725 3980 392 -4441 -8956 -14588 -16311 -15099 -14473 -12913
1478 -12913 -11401 -10581 -5976 50 5177 10124 11479 12561 14261 14673 15922 15119 9178 4515 82
1493 82 -3784 -5133 -8762 -13325 -15645 -17194 -15472 -11559 -9637 -6389 -3354 -398 5668 10268 12699
1508 12699 15338 14715 13562 13525 11390 9035 5077 -1198 -5188 -8344 -11810 -12501 -14348 -15823 -14178 -12666
1524 -12666 -9260 -4253 -974 3129 7016 9103 12937 14883 14915 15328 12276 8634 6473 2236 -1215
1539 -1215 -4521 -9570 -12534 -14334 -15441 -13849 -12374 -10471 -7390 -4904 -410 5512 8422 11335 13619
1554 13619 13353 13967 13718 11849 9584 4622 -416 -3588 -7249 -9351 -10979 -14278 -15319 -14546 -12583 -7848
$$ packed form
1448A420o176m853k568j604n32j069r49J849L357N148O159K990K761L640K473
1463A2046L517K457j521k687m387l700j745l588m833m515n632j723J212O26J560
1478a2913J512Q20M605O026N127M947J355J082J700M12J249q03n941m663m433
1493H2l866j349l629m563k320j549J722L913J922L248L035K956O066M600K431
1508A2699K639o23j153l7k135k355l958o275l990l156l466o91j847j475J645J512
1524a2666L406N007L279M103L887K087L834J946L2M13l052l642k161m237l451
1539a215l306n049k964j800j107J592J475J903L081K486M494N922K910K913K284
1554A3619k66O14k49j869k265m962n038l172l661k102j628l299j041P73J963M735
$$ plain form
1570 -7848 -4304 -2394 981 4323 8707 13298 14648 14716 13187 10651 9854 8138 4349 -107 -5361 -9496
1586 -9496 -11137 -12097 -12440 -13096 -14105 -12271 -8328 -3889 1082 4058 5670 8754 11850 14173 15324 13744
1602 13744 10629 7485 4705 2334 -896 -5151 -9198 -12551 -14093 -13071 -12334 -11455 -9590 -7211 -3652
1617 -3652 786 5465 8784 10538 11613 12675 13262 12848 11110 7663 3192 -543 -3351 -6371 -9031
1632 -9031 -11666 -13718 -13872 -12614 -10689 -7855 -4637 -1560 1885 5016 8726 11697 12888 13349 12719 10530
1648 10530 8940 6801 2880 -708 -4556 -8222 -10595 -12059 -12488 -12084 -12085 -10109 -7563 -4314 569 4492
1664 4492 6559 8995 10533 12180 14022 12918 10549 7264 3459 1210 -1332 -5042 -8044 -11425 -13645
1679 -13645 -12847 -11818 -10127 -7733 -6375 -3528 736 4704 9078 10856 10945 11945 11691 11307 10940 7100
$$ packed form
1570g848L544J910L375L342M384M591J350O8j529k536p97j716l789m456n254m135
1586i496j641r60l43o56j009J834L943M439M971K976J612L084L096K323J151j580
1602A3744l115l144k780k371l230m255m047l353j542J022P37Q79J865K379L559
1617c652M438M679L319J754J075J062N87m14j738l447m471l735k808l020k660
1632i031k635k052j54J258J925K834L218L077L445L131L710K971J191M61o30k189
1648A0530j590k139l921l588l848l666k373j464m29M04jJ976K546L249M883L923
1664D492K067K436J538J647J842j104k369l285l805k249k542l710l002l381k220
1679a3645P98J029J691K394J358K847M264L968M374J778Q9J000k54l84l67l840
$$ plain form
1695 7100 2733 -841 -4688 -6182 -7933 -10592 -12222 -13603 -12864 -9178 -6469 -3879 -730 1179 4482
1710 4482 8956 11195 12876 12253 10595 9743 8090 5758 3663 -1601 -5546 -7882 -10388 -10682 -10895 -12365
1726 -12365 -11422 -9512 -6686 -2088 744 3399 6516 8206 10688 12688 11905 11520 9329 6043 4043
1741 4043 1021 -2502 -4911 -8398 -10995 -11666 -12269 -10821 -9236 -8196 -4978 -2041 802 4905 7777
1756 7777 9757 11445 11175 11070 10733 8352 6612 3084 -1028 -3811 -6646 -8734 -9697 -11214 -12111 -10944
1772 -10944 -9587 -6337 -2941 -434 2171 4714 7300 10491 11927 11753 11166 8642 6407 5068 2306
1787 2306 -866 -4529 -8157 -9899 -10587 -10696 -9887 -9992 -9062 -6124 -2705 1389 4598 6106 7589 9447
1803 9447 11028 12017 11058 8736 5498 2539 489 -1633 -4836 -7688 -10152 -11787 -11464 -9598 -8116 -6782
$$ packed form
1695G100m367l574l847j494j751k659j630j381P39L686K709K590L149J909L303
1710D482M474K239J681o23j658q52j653k332k095n264l945k336k506k94k13j470
1726a2365R43J910K826M598K832K655L117J690K482K000p83l85k191l286k000
1741D043l022l523k409l487k597o71o03J448J585J040L218K937K843M103K872
1756G777J980J688k70j05l37k381j740l528m112k783k835k088r63j517q97J167
1772a0944J357L250L396K507K605K543K586L191J436j74n87k524k235j339k762
1787B306l172l663l628j742o88j09Q09j05R30K938L419M094L209J508J483J858
1803I447J581R89r59k322l238k959k050k122l203k852k464j635L23J866J482J334
$$ plain form
1819 -6782 -5104 -2375 1336 5109 8003 9418 9902 10175 10493 10061 8445 5574 2022 -1334 -3921 -6075
1835 -6075 -7999 -9691 -10818 -11167 -10405 -8017 -5348 -2899 -413 2237 4747 7409 9976 10917 10289 9961
1851 9961 8439 6503 4640 1498 -1480 -4556 -7503 -8682 -10041 -10389 -9852 -9164 -7801 -4937 -2493 829
1867 829 4086 5950 8023 9416 10037 10565 9697 8037 5817 2492 -19 -2107 -5111 -7179 -9084 -10962
1883 -10962 -10840 -9731 -8218 -5541 -4009 -1944 1524 4100 7180 9638 9516 9774 9325 8201 7751 5553
1899 5553 2036 -1261 -4375 -6159 -7036 -9159 -9956 -10020 -10270 -7676 -4817 -2663 543 2274 4066 7151
1915 7151 9165 10608 10662 8408 7359 5957 3747 2143 -1183 -4966 -6987 -8800 -9273 -8870 -9432 -8750
1931 -8750 -7243 -5327 -1739 1472 3666 6245 7098 8336 10416 10164 9066 7469 4374 2432 399
$$ packed form
1819f782J678K729L711L773K894J415M84K73L18m32j616k871l552l356k587k154
1835f075j924j692j127l49P62K388K669K449K486K650K510K662K567R41o28l28
1851I961j522j936j863l142k978l076k947j179j359l48N37O88J363K864K444L322
1867H29L257J864K073J393O21N28q68j660k220l325k511k088l004k068j905j878
1883a0962J22J109J513K677J532K065L468K576L080K458j22K58m49j124m50k198
1899E553l517l297l114j784q77k123p97o4k50K594K859K154L206J731J792L085
1915G151K014J443N4k254j049j402k210j604l326l783k021j813m73M03n62O82
1931h750J507J916L588L211K194K579Q53J238K080k52j098j597l095j942k033
$$ plain form
1946 399 -2517 -4417 -7199 -9527 -9536 -9873 -8945 -6950 -5965 -3962 -1111 1435 4627 6950 8060 9546 9328
1963 9328 8781 8515 6511 4385 2270 -1304 -3738 -5558 -7811 -8309 -9193 -9761 -8497 -7228 -4799 -1835
1979 -1835 103 2656 4875 6392 8541 9641 9449 8836 7183 5030 3318 915 -1579 -3760 -6767
1994 -6767 -8457 -8982 -9292 -8146 -7470 -6562 -4404 -1815 1124 4036 6046 7272 8157 8652 9369 8691 6815
2011 6815 4805 1669 -784 -2483 -4437 -6693 -8241 -9591 -9589 -8245 -6501 -4688 -3203 -1187 1467 4219
2027 4219 6519 8259 8516 8413 8184 7650 6220 4297 1468 -1666 -4078 -5664 -6892 -7892 -8815 -9133
2043 -9133 -8218 -6547 -4014 -1701 306 2313 4681 6315 8225 9387 8710 7885 6295 4698 3115 838
2059 838 -1776 -4120 -6597 -7857 -8376 -8915 -7974 -7129 -6007 -3829 -1097 1439 3852 5443 6909 8214
$$ packed form
1946C99k916j900k782k328rl37R28J995R85K003K851K546L192K323J110J486k18
1963I328n47k66k004k126k115l574k434j820k253m98q84n68J264J269K429K964
1979a835J938K553K219J517K149J100j92o13j653k153j712k403k494k181l007
1994f767j690n25l10J146O76R08K158K589K939K912K010J226Q85M95P17o78j876
2011F815k010l136k453j699j954k256j548j350KJ344J744J813J485K016K654K752
2027D219K300J740K57j03k29n34j430j923k829l134k412j586j228j000r23l18
2043i133R15J671K533K313K007K007K368J634J910J162o77q25j590j597j583k277
2059H38k614k344k477j260n19n39R41Q45J122K178K732K536K413J591J466J305
$$ plain form
2075 8214 8591 8801 7870 5791 4147 1752 -796 -2483 -4636 -6716 -7516 -8630 -8803 -7600 -6694 -4221
2091 -4221 -2517 -719 2172 4097 5900 8224 8640 8169 7664 6345 5315 3845 1101 -1152 -4021 -6039
2107 -6039 -6578 -7760 -8441 -7766 -7756 -6270 -3759 -1632 1103 2929 4227 6207 7563 8233 8837 7349 5604
2124 5604 4234 2023 368 -1428 -4218 -6157 -7626 -8381 -7534 -7218 -6539 -5170 -3963 -878 2000 3649
2140 3649 5671 6828 6965 7920 8025 7074 6142 3195 849 -560 -2983 -4383 -5863 -7970 -8129 -8024 -7176
2157 -7176 -5223 -3926 -2462 -85 1703 4304 6151 7073 7806 7838 6794 6604 4885 2664 910 -1801
2173 -1801 -3914 -5103 -6729 -7255 -7699 -7834 -6590 -5389 -3678 -1059 755 2707 4925 6049 7239 7905
2189 7905 7465 6940 5666 3494 2165 -99 -2032 -3775 -6012 -7261 -7495 -7738 -6989 -5708 -4507 -2862
$$ packed form
2075H214L77K10r31k079j644k395k548j687k153k080q00j114j73J203R06K473
2091d221J704J798K891J925J803K324M16m71n05j319j030j470k744k253k869k018
2107f039n39j182o81O75J0J486K511K127K735J826J298J980J356O70O04j488j745
2124E604j370k211j655j796k790j939j469p55Q47L16O79J369J207L085K878J649
2140C649K022J157J37R55J05r51r32k947k346j409k423j400j480k107j59J05Q48
2157g176J953J297J464K377J788K601J847R22P33L2j044j90j719k221j754k711
2173a801k113j189j626n26m44j35J244J201J711K619J814J952K218J124J190O66
2189G905m40n25j274k172j329k264j933j743k237j249k34k43P49J281J201J645
$$ plain form
2205 -2862 -636 1532 4000 5343 6519 7101 7177 7129 6717 5061 3191 1147 -1469 -3046 -4538 -5869
2221 -5869 -6963 -7754 -7601 -6612 -5110 -3224 -1573 120 2042 3954 5814 7070 7571 7097 6360 5376 4440
2238 4440 2736 397 -1703 -4033 -5525 -6238 -6681 -6914 -7075 -6282 -4913 -2861 -633 1492 3027 4327
2254 4327 5656 6959 7698 7281 6223 4897 3193 1744 -77 -2196 -3938 -5880 -6955 -6938 -6877 -6414 -5215
2271 -5215 -4207 -2447 -152 1750 4002 5220 5819 6895 6931 6610 6146 4521 2543 664 -1458 -2953
2287 -2953 -4414 -5957 -6583 -7356 -7102 -5620 -4724 -3285 -1074 253 2353 4380 5307 6702 7034 6659 5997
2304 5997 4895 3672 2187 -162 -1974 -3422 -5621 -6187 -6521 -6939 -5983 -5595 -4513 -2211 -717 1547
2320 1547 3496 4379 5716 6392 6562 6940 5939 4252 2849 969 -937 -2067 -4241 -5623 -6526 -7124
$$ packed form
2205b862K226K168K468J343J176N82P6m8m12j656j870k044k616j577j492j331
2221e869j094p91J53R89J502J886J651J693J922J912J860J256N01m74p37r84r36
2238D440j704k339k100k330j492p13m43k33j61P93J369K052K228K125J535J300
2254D327J329J303P39m17j058j326j704j449j821k119j742j942j075J7O1M63J199
2271e215J008J760K295J902K252J218N99J076L6l21m64j625j978j879k122j495
2287b953j461j543o26p73K54J482Q96J439K211J327K100K027R27J395L32l75o62
2304E997j102j223j485k349j812j448k199n66l34m18R56L88J082K302J494K264
2320A547J949Q83J337O76J70L78j001j687j403j880j906j130k174j382r03n98
$$ plain form
2336 -7124 -6405 -5471 -4892 -3111 -1867 -415 2348 4027 5260 6375 6337 6446 6148 5276 4171 2260 -217
2353 -217 -1619 -3291 -4674 -5132 -6559 -7039 -6323 -5683 -3867 -2196 -1062 1041 2609 4134 5843 6396
2369 6396 6603 6558 5154 4534 3340 1406 -4 -2332 -4201 -4919 -6108 -6407 -5987 -6095 -5153 -3324 -2017
2386 -2017 46 1727 3218 4521 5579 6290 6519 6024 5237 4038 2080 765 -1017 -2998 -4048 -5379
2402 -5379 -6396 -6269 -6173 -5383 -4179 -2785 -1212 640 2148 4188 5257 5796 6381 6055 5403 4606 3671
2419 3671 1825 84 -2145 -3540 -4622 -5608 -5918 -6325 -6090 -4941 -3860 -2072 -36 1312 2733 4233
2435 4233 5376 6367 6435 5961 5182 3938 2560 1412 -505 -2362 -4047 -5332 -5817 -6009 -5708 -5342 -4407
2452 -4407 -3224 -1443 506 2355 3553 4549 5514 6041 6440 5896 4793 3318 1715 96 -1189 -2686
$$ packed form
2336g124P19R34N79J781J244J452K763J679J233J115l8J09k98q72j105j911k477
2353b17j402j672j383m58j427m80P16O40J816J671J134K103J568J525J709N53
2369F396K07m5j404o20j194j934j410k328j869p18j189k99M20j08R42J829J307
2386b017K063J681J491J303J058P11K29m95p87j199j958j315j782j981j050j331
2402e379j017J27R6P90J204J394J573J852J508K040J069N39N85l26o52p97r35
2419C671j846j741k229j395j082r86l10m07K35J149J081J788K036J348J421J500
2435D233J143R91O8m74p79j244j378j148j917j857j685j285m85j92L01L66R35
2452d407J183J781J949J849J198R96R65N27L99n44j103j475j603j619j285j497
$$ plain form
2468 -2686 -4159 -5358 -6218 -6238 -5649 -4850 -3444 -2346 -1036 749 2360 4142 5271 5575 5901 5694 5204
2485 5204 4360 2937 1204 -613 -2301 -3324 -4402 -5626 -6066 -5925 -5494 -4547 -3156 -1850 33 1481
2501 1481 2753 4354 5143 5917 5971 5283 4738 3633 1956 1023 -1075 -2660 -3841 -5295 -5656 -5601 -5721 -4864
2519 -4864 -3961 -3039 -1046 694 2119 3816 4526 5240 5897 5553 5382 4471 2884 1472 -241 -1971 -2840
2536 -2840 -4243 -5252 -5497 -6025 -5376 -4341 -3499 -1930 -464 691 2676 4061 4879 5536 5472 5279 4933
2553 4933 3530 2529 1188 -987 -2400 -3681 -4761 -4875 -5505 -5653 -4927 -4438 -2709 -975 324 1744
2569 1744 3271 3922 5418 5615 5741 5239 4131 2911 1982 368 -930 -2526 -4380 -4807 -5288 -5438 -4790
2586 -4790 -4681 -3776 -2166 -788 1131 2493 3503 4572 4970 5271 5553 4812 3851 2607 836 -497 -1677
$$ packed form
2468b686j473j199q60k0N89P99J406J098J310J785J611J782J129L04L26k07m90
2485E204q44j423j733j817j688j023j078j224m40J41M31R47J391J306J883J448
2501A481J272J601P89P74N4o88n45j105j677r33k098j585j181j454l61N5j20Q57
2519d864R03R22J993J740J425J697P10P14O57l44j71r11j587j412j713j730q69
2536b840j403j009k45n28O49J035Q42J569J466J155J985J385Q18O57o4j93l46
2553D933j403j001j341k175j413j281j080j14o30j48P26M89J729J734J299J420
2569A744J527O51J496J97J26n02j108j220r29j614j298j596j854m27m81j50O48
2586d790J09R05J610J378J919J362J010J069L98L01K82p41r61j244j771j333j180
$$ plain form
2603 -1677 -3161 -4093 -4881 -5798 -5357 -4904 -3974 -2762 -1707 -113 1351 2703 4197 4855 5284 5304 5094 4042
2621 4042 3427 1995 468 -829 -2568 -3702 -4450 -5102 -5283 -4925 -4608 -3548 -2252 -935 790 1989
2637 1989 3010 4040 4880 5325 5234 4699 3874 2397 1030 51 -1429 -2971 -3751 -4808 -5405 -4969 -4504 -3891
2655 -3891 -3103 -1782 -286 1108 2613 3805 4463 4898 4962 4867 4260 3399 1926 783 -976 -2015 -3076
2672 -3076 -4040 -4909 -5187 -5184 -4623 -3621 -2267 -1051 180 1536 2945 3844 4758 5025 4949 4446 3736 2900 1779
2691 1779 224 -1239 -2674 -3789 -4170 -4807 -4983 -4570 -4198 -3109 -1776 -528 1032 2195 2937 4200
2707 4200 4667 4971 4896 4085 3380 2382 694 -341 -1613 -2963 -3825 -4648 -4993 -4483 -4403 -3804 -2463 -1513 -43
2726 -43 1365 2262 3756 4226 4512 4805 4355 3788 2983 1466 454 -873 -2272 -3178 -3810 -4645 -4565 -4713 -4339
$$ packed form
2603a677j484r32p88r17M41M53R30J212J055J594J464J352J494O58M29K0k10j052
2621D042o15j432j527j297j739j134p48o52j81L58L17J060J296J317J725J199
2637A989J021J030Q40M45r1n35q25j477j367r79j480j542p80j057n97M36M65O13
2655c891P88J321J496J394J505J192O58M35O4r5o07q61j473j143j759j039j061
2672c076r64q69k78LN61J002J354J216J231J356J409Q99R14K67p6n03p10q36j121
2691A779j555j463j435j115l81o37j76M13L72J089J333J248J560J163P42J263
2707D200M67L04p5q11p05r98j688j035j272j350q62q23l45N10Q0N99J341R50J470
2726d3J408Q97J494M70K86K93m50n67q05j517j012j327j399r06o32q35Q0j48L74
$$ plain form
2745 -4339 -2914 -2073 -723 488 1568 2934 3861 4510 4934 4616 4055 3502 2370 1220 98 -1657 -2560
2762 -2560 -3649 -4429 -4387 -4478 -4469 -3587 -2804 -1747 45 1045 2125 3308 3631 4283 4744 4256 4059 2881 1464
2781 1464 647 -578 -1597 -2591 -3861 -4333 -4352 -4566 -3697 -3033 -2345 -1152 83 1436 2748 3541 3942 4410
2799 4410 4035 4062 3636 2270 1404 49 -1313 -2078 -3231 -3818 -4127 -4567 -4305 -3395 -2866 -1378 -596 413
2817 413 1964 2758 3737 4393 4249 4230 3804 3024 2231 881 -379 -1364 -2583 -3493 -3850 -4491 -4278 -3771 -3293
2836 -3293 -2233 -1135 -106 1220 2217 3126 3827 4073 4040 3973 3464 2386 1602 386 -705 -1745 -2963
2853 -2963 -3618 -4332 -4263 -3889 -3579 -2630 -1614 -670 289 1423 2652 3479 3945 4099 4106 3631 3201 2330 1167
2872 1167 -106 -1434 -2413 -2940 -3753 -4198 -3990 -3783 -3357 -2333 -1037 -137 859 1803 2962 3604 4091 4275
$$ packed form
2745d339J425Q41J350J211J080J366R27O49M24l18n61n53j132j150j122j755r03
2762b560j089p80M2r1RQ82P83J057J792J000J080J183L23O52M61m88j97j178j417
2781A464q17j225j019r94j270m72j9k14Q69O64O88J193J235J353J312P93M01M68
2799D410l75K7m26j366q66j355j362p65j153n87l09m40K62R10N29J488P82J009
2817D13J551P94R79O56j44j9m26p80p93j350j260r85j219r10l57o41K13N07M78
2836c293J060J098J029J326R97R09P01K46l3o7n09j078p84j216j091j040j218
2853b963o55p14O9L74L10R49J016R44R59J134J229Q27M66J54Pm75m30q71j163
2872A167j273j328r79n27q13m45K08K07M26J024J296R00R96R44J159O42M87J84
$$ plain form
2890 4275 3865 3326 2589 1600 784 -421 -1564 -2727 -3437 -3723 -3985 -3946 -3387 -2966 -2128 -992 300 1356
2908 1356 2411 2958 3563 3951 3856 3898 3057 1989 1241 -31 -912 -1750 -2912 -3497 -4024 -4210 -3729 -3227 -2492
2927 -2492 -1390 -504 612 1892 2600 3380 3787 3900 3839 3293 2588 1899 819 -485 -1201 -2343 -3003 -3433
2945 -3433 -3883 -3778 -3379 -2965 -1987 -957 -87 1190 1936 2869 3620 3586 3855 3573 3014 2352 1447 215 -663
2964 -663 -1894 -2785 -3091 -3721 -3786 -3380 -3405 -2475 -1616 -812 625 1536 2399 3137 3438 3674 3874 3353 2806 1848
2984 1848 547 -109 -1088 -2257 -2757 -3397 -3991 -3727 -3500 -2802 -1839 -1108 -105 668 1783 2840 3341 3614
3002 3614 3660 3251 3134 2515 1422 347 -658 -1761 -2436 -3041 -3486 -3508 -3666 -3446 -2431 -1649 -734 405
3020 405 1066 2116 2877 3269 3741 3625 3249 2871 1941 1195 336 -979 -1716 -2595 -3265 -3698 -3504 -3523 -2710 -2278
$$ packed form
2890D275m10n39p37r89q16j205j143j163p10k86k62L9N59M21Q38J136J292J056
2908A356J055N47O05L88r5M2q41j068p48j272q81q38j162n85n27j86M81N02P35
2927b492J102Q86J116J280P08P80M07J13o1n46p05o89j080j304p16j142o60m30
2945c433m50J05L99M14R78J030Q70J277P46R33P51l4K69k82n59o62r05j232q78
2964f63j231q91l06o30o5M06k5R30Q59Q04J437R11Q63P38L01K36K00n21n47r58
2984A848j301o56r79j169n00o40n94K64K27O98R63P31J003P73J115J057N01K73
3002C614M6m09j17o19j093j075j005j103o75o05m45k2j58K20J015P82R15J139
3020D05O61J050P61L92M72j16l76l78r30p46q59j315p37q79o70m33J94j9Q13M32
$$ plain form
3040 -2278 -1402 -311 635 1669 2585 2946 3378 3565 3313 3262 2371 1534 753 -578 -1336 -2131 -2919 -3253 -3654
3059 -3654 -3568 -3228 -2809 -1909 -859 -186 1158 1918 2703 3276 3465 3430 3328 2845 2197 1338 255 -822 -1795
3078 -1795 -2540 -3084 -3314 -3434 -3315 -3066 -2409 -1460 -481 555 1528 2218 2662 3330 3529 3489 3248 2367 1470 675
3098 675 -32 -1161 -1869 -2514 -3183 -3517 -3449 -3151 -2612 -1735 -1195 -238 845 1809 2760 3249 3309 3562 3440 3026
3118 3026 2370 1224 484 -703 -1501 -1950 -2931 -3266 -3431 -3399 -2962 -2241 -1594 -717 351 1062 2199 2861 3304
3137 3304 3585 3277 2988 2509 1788 1105 175 -887 -1811 -2487 -3067 -3270 -3461 -3423 -2793 -2285 -1283 -276 570
3156 570 1710 2336 2869 3467 3448 3196 3012 2238 1556 660 -498 -1280 -2160 -2843 -3193 -3493 -3346 -2843 -2551 -1857
3176 -1857 -799 -12 954 1999 2512 3186 3291 3264 3375 2540 1870 1380 75 -788 -1581 -2407 -2767 -3337 -3489
$$ packed form
3040b278Q76J091R46J034R16L61M32J87k52n1q91q37p81j331p58p95p88l34m01
3059c654Q6L40M19R00J050O73J344P60P85N73J89l5j02m83o48q59j083j077r73
3078a795p45n44k30j20J19K49O57R49R79J036R73O90M44O68J99m0k41q81q97p95
3098F75p07j129p08o45o69l34O8K98N39Q77N40R57J083R64R51M89O0K53j22m14
3118C026o56j146p40j187p98m49r81l35j65L2M37P21O47Q77J068P11J137O62M43
3137C304K81l08k89m79p21o83r30j062r24o76n80k03j91L8O30N08J002J007Q46
3156E70J140O26N33N98j9k52j84p74o82q96j158p82q80o83l50l00J47N03K92O94
3176a857J058P87R66J045N13O74J05k7J11q35o70m90j305q63p93q26l60n70j52
$$ plain form
3195 -3489 -3088 -2921 -2152 -1356 -632 331 1238 2125 2917 3287 3196 3474 2625 2323 1844 929 -93 -1196 -1873
3214 -1873 -2702 -3082 -3230 -3102 -2855 -2662 -1625 -1251 -24 902 1581 2377 2870 3174 3396 3354 2623 2072 1100
3233 1100 430 -364 -1424 -2235 -2833 -3334 -3196 -3188 -3008 -2128 -1615 -853 331 1127 1805 2606 2879 3148 3314 2910
3253 2910 2574 1888 913 88 -1132 -1766 -2349 -2947 -3099 -3290 -3063 -2654 -1830 -1123 -270 597 1331 2229 2771
3272 2771 3050 3466 3023 2757 1997 1432 672 -331 -1302 -1862 -2632 -3082 -3152 -3363 -2746 -2226 -1886 -771 153
3291 153 962 2046 2423 2871 3128 3232 3017 2522 1886 1141 219 -779 -1554 -2210 -2760 -3158 -3247 -2987 -2620 -1929
3311 -1929 -1260 -613 331 1259 1954 2848 3004 3050 3103 2744 2151 1730 651 -191 -986 -1803 -2404 -2632 -3091 -3200
3331 -3200 -2826 -2273 -1778 -986 20 793 1259 2260 2891 3037 3234 3067 2556 2000 1158 318 -239 -1543 -1928
$$ packed form
3195c489M01J67P69P96P24R63R07Q87P92L70r1K78q49l02m79r15j022j103o77
3214a873q29l80j48J28K47J93J037L74J227R26O79P96M93L04K22m2p31n51r72
3233A100o70p94j060q11n98n01J38QJ80Q80N13P62J184P96O78Q01K73K69J66m04
3253B910l36o86r75q25j220o34n83n98j52j91K27M09Q24P07Q53Q67P34Q98N42
3272B771K79M16m43k66p60n65p60j003r71n60p70m50p0k11O17N20L40J115R24
3291A53Q09J084L77M48K57J04k15m95o36p45r22r98p75o56n50l98q9K60L67O91
3311a929O69O47R44R28O95Q94J56M6N3l59n93m21j079q42p95q17o01k28m59j09
3331c200L74N53M95P92J006P73M66J001O31J46J97j67n11n56q42q40n57j304l85
$$ plain form
3350 -1928 -2684 -3133 -2907 -2888 -2787 -2229 -1284 -759 415 1051 1807 2420 2569 3166 3033 2742 2436 1617 765 23
3370 23 -987 -1426 -2233 -3029 -3106 -2835 -2872 -2374 -1783 -1222 -256 549 1441 2193 2508 3110 3248 2724 2702 2091 1154
3391 1154 538 -357 -1354 -1873 -2559 -2820 -3039 -3176 -2618 -2265 -1655 -605 197 768 1837 2274 2829 3210 2928
3410 2928 2829 2382 1576 1014 69 -681 -1333 -2115 -2666 -2826 -3060 -2813 -2344 -2070 -1148 -270 344 1587 2053 2509
3430 2509 2749 2878 2973 2769 2005 1372 639 -346 -775 -1969 -2341 -2692 -2858 -2896 -2542 -2258 -1604 -718 -387 816
3450 816 1484 1995 2698 2762 2774 2806 2307 1907 1171 344 -513 -1359 -2016 -2264 -2855 -2966 -2820 -2495 -1925 -1258 -804
3471 -804 312 962 1542 2522 2613 2736 3009 2454 2069 1393 630 -23 -662 -1688 -2332 -2583 -2733 -2645 -2746 -2169
3491 -2169 -1821 -1125 -314 524 1197 2024 2542 2597 2969 2667 2426 1849 1330 409 -339 -1244 -1738 -2397 -2661 -2802
$$ packed form
3350a928p56m49K26J9J01N58R45N25J174O36P56O13J49N97j33k91l06q19q52p42
3370B3j010m39q07p96p7K71l7M98N91N61R66Q05Q92P52L15O02J38n24k2o11r37
3391A154o16q95r97n19o86k61k19j37N58L53O10J050Q02N71J069M37N55L81k82
3410B928r9m47q06n62r45p50o52p82n51j60k34K47M69K74R22Q78O14J243M66M56
3430B509K40J29R5k04p64o33p33r85m29j194l72l51j66l8L54K84O54Q86L31J203
3450H16O68N11P03O4J2L2m99m00p36q27q57q46o57k48n91j11J46L25N70O67M54
3471h04J116O50N80R80R1J23K73n55l85o76p63o53o39j026o44k51j50Q8j01N77
3491b169L48O96Q11Q38O73Q27N18N5L72l02k41n77n19r21p48r05m94o59k64j41
$$ plain form
3511 -2802 -2825 -2446 -1955 -1380 -681 147 756 1580 2301 2597 2852 2680 2699 2281 1712 972 281 -640 -1346 -1991
3531 -1991 -2400 -2380 -2603 -2789 -2086 -1910 -999 -335 482 1182 1844 2177 2702 2875 2696 2428 1769 1353 651 -139
3551 -139 -890 -1392 -2246 -2632 -2733 -2620 -2388 -2188 -1558 -848 -68 802 1406 1990 2516 2438 2609 2615 2090 1729 989
3572 989 191 -519 -1419 -1744 -2206 -2504 -2645 -2512 -2503 -1838 -1116 -582 280 880 1560 2349 2350 2677 2791 2140 2029
3593 2029 1439 737 -59 -891 -1517 -2017 -2352 -2713 -2600 -2579 -2207 -1445 -1019 74 746 1301 1740 2194 2515 2745
3613 2745 2595 2060 1814 1119 524 -288 -1204 -1470 -2111 -2655 -2428 -2370 -2235 -1692 -1435 -665 28 654 1511 1870
3633 1870 2357 2663 2422 2322 2170 1411 817 238 -655 -1138 -1731 -2383 -2450 -2690 -2671 -1974 -1654 -985 -290 247
3653 247 996 1710 2006 2455 2584 2402 2329 1687 1256 692 -120 -598 -1566 -2206 -2331 -2313 -2628 -2276 -1855 -1506 -704
$$ packed form
3511b802k3L79M91N75O99Q28O09Q24P21K96K55j72J9m18n69p40o91r21p06o45
3531a991m09K0k23j86P03J76R11O64Q17P00O62L33N25J73j79k68o59m16p02p90
3551a39p51n02q54l86j01J13K32K00O30P10P80Q70O04N84N26p8J71On25l61p40
3572I89p98p10r00l25m62k98j41J33RO65P22N34Q62O00O80P89JL27J14o51j11
3593B029n90p02p96q32o26n00l35l61J13K1L72P62M26J093O72N55M39M54L21K30
3613B745j50n35k46o95n95q12r16k66o41n44K27N8J35N43K57P70O93O26Q57L59
3633A870M87L06k41j00j52p59n94n79q93m83n93o52o7k40J9O97L20O69O95N37
3653B47P49P14K96M49J29j82p3o42m31n64q12m78r68o40j25J8l15L52M21L49Q02
$$ plain form
3674 -704 -155 575 1330 1598 2218 2464 2587 2509 1975 1393 1043 216 -230 -969 -1702 -2088 -2501 -2575 -2315 -1920 -1881
3695 -1881 -1140 -586 335 1004 1634 1891 2264 2529 2513 2168 1919 1102 769 -108 -449 -1293 -2067 -2188 -2475 -2412
3715 -2412 -2435 -2004 -1387 -870 -46 501 887 1630 2119 2411 2496 2471 2050 1769 957 331 -16 -966 -1474 -1904 -2357
3736 -2357 -2342 -2480 -2437 -1698 -1310 -432 134 719 1383 1782 2291 2468 2408 2146 2053 1282 713 192 -553 -1231 -1527
3757 -1527 -2099 -2339 -2401 -2138 -1990 -1433 -1016 -386 170 1084 1563 1754 2350 2370 2198 2155 1737 1249 752 -136 -841
3778 -841 -1168 -1886 -2018 -2394 -2432 -2119 -1908 -1375 -731 -175 340 1192 1682 2212 2429 2274 2258 1637 1521 1045 240
3799 240 -251 -871 -1652 -1985 -2157 -2292 -2156 -2106 -1884 -1100 -683 53 872 1389 1889 2111 2244 2408 2270 1628
3819 1628 1437 529 129 -474 -1280 -1593 -2041 -2463 -2341 -2226 -1800 -1397 -891 -154 380 840 1493 2101 2292 2295
$$ packed form
3674g04N49P30P55K68O20K46J23p8n34n82l50q27m46p39p33l86m13p4K60L95L9
3695a881P41N54R21O69O30K57L73K65j6l45k49q17l33q77l41q44p74j21k87O3
3715b412k3M31O17N17Q24N47L86P43M89K92Q5k5m21k81q12o26l47r50n08m30m53
3736b357J5j38M3P39L88Q78N66N85O64L99N09J77o0k62r3p71n69n21p45o78k96
3757a527n72k40o2K63J48N57M17O30N56R14M79J91N96K0j72m3m18m88m97q88p05
3778h41l27p18j32l76l8L13K11N33O44N56N15Q52M90N30K17j55j6o21j16m76q05
3799B40m91o20p81l33j72j35J36N0K22P84M17P36Q19N17N00K22J33J64j38o42
3819A628j91r08m00o03q06l13m48m22J22J15M26M03N06P37N34M60O53O08J91L
$$ plain form
3839 2295 2274 1843 1600 1161 465 -169 -954 -1391 -1616 -2073 -2383 -2311 -2166 -1581 -1320 -579 172 602 1018 1703
3859 1703 1953 2165 2211 1974 1962 1290 626 400 -354 -970 -1461 -1870 -2085 -2079 -2150 -1814 -1479 -1305 -375 144 902
3880 902 1350 1587 2104 2234 2308 2008 1580 929 714 -80 -700 -1266 -1677 -2039 -1978 -2256 -1894 -1714 -1337 -794 -184
3901 -184 329 1019 1539 1836 2195 2056 2060 1844 1489 1035 442 -253 -779 -1344 -1741 -1992 -2256 -2212 -2060 -1713 -1069
3922 -1069 -556 -94 578 978 1588 2176 2092 2154 1973 1508 1323 762 51 -331 -1188 -1479 -1774 -2089 -2058 -1930 -1887
3943 -1887 -1347 -1008 -356 303 933 1223 1946 1984 1948 2040 1962 1552 1152 228 -13 -413 -1176 -1600 -1915 -2088 -2030
3964 -2030 -2004 -1543 -1131 -884 -394 497 983 1573 1788 1906 1846 2057 1736 1317 890 345 -317 -745 -1099 -1764
3984 -1764 -1846 -1928 -2126 -1797 -1557 -1101 -529 -84 613 1209 1433 1929 2052 1913 1880 1577 1221 866 178 -439 -890
$$ packed form
3839B295k1m31k43m39o96o34p85m37k25m57l10P2J45N85K61P41P51M30M16O85
3859A703K50K12M6k37j2o72o64k26p54o16m91m09k15Op1L36L35J74R30N19P58
3880I02M48K37N17J30P4l00m28o51k15p94o20n66m11l62O1k78L62J80L77N43O10
3901a84N13O90N20K97L59j39Mk16l55m54n93o95n26n65l97k51k64M4J52L47O44
3922a069N13M62O72M00O10N88q4O2j81m65j85n61p11l82q57k91k95l15L1J28M3
3943a887N40L39O52O59O30K90P23L8l6R2p8m10m00r24k41m00p63m24l15j73N8
3964b030K6M61M12K47M90Q91M86N90K15J18o0K11l21m19m27n45o62m28l54o65
3984a764q2q2j98L29K40M56N72M45O97N96K24M96J23j39l3l03l56l55o88o17m51
$$ plain form
4005 -890 -1444 -1760 -1701 -2036 -2037 -1775 -1408 -738 -288 193 781 1143 1565 1877 1928 1971 1761 1482 1078 632 -114 -525
4027 -525 -1147 -1761 -1654 -2071 -1862 -1815 -1714 -1108 -787 -198 491 1104 1346 1930 1939 1896 1832 1539 1262 863 171 -205
4049 -205 -672 -1393 -1575 -1953 -1916 -1807 -1570 -1513 -1081 -617 3 464 936 1523 1634 1790 2076 1744 1349 1225 493
4070 493 150 -430 -979 -1351 -1813 -1950 -1824 -1895 -1562 -1311 -887 -225 326 707 1378 1442 1474 1775 1936 1571 1520
4091 1520 868 357 -12 -739 -1160 -1314 -1922 -1773 -1753 -1834 -1439 -1091 -600 -182 314 1265 1404 1565 1864 1721
4111 1721 1677 1710 1073 742 154 -431 -656 -1220 -1569 -1702 -1860 -1917 -1559 -1352 -759 -390 159 634 1112 1275 1823
4132 1823 1908 1746 1735 1422 1109 650 60 -503 -794 -1519 -1400 -2023 -1849 -1742 -1671 -1016 -739 -221 333 917 1181
4153 1181 1718 1855 1841 1820 1449 1306 873 294 -187 -713 -1088 -1418 -1642 -1892 -1604 -1778 -1297 -1023 -601 57
$$ packed form
4005h90n54l16N9l35jK62L67O70M50M81N88L62M22L12N1M3k10k79m04m46p46m11
4027e25o22o14J07m17K09M7J01O06L21N89O89O13K42N84Rm3o4k93k77l99o92l76
4049b05m67p21j82l78L7J09K37N7M32M64O20M61M72N87J11J56K86l32l95j24p32
4070D93l43n80n49l72m62j37J26p1L33K51M24O62N51L81O71O4L2L01J61l65n1
4091A520o52n11l69p27m21j54o08J49K0q1L95L48M91M18M96R51J39J61K99j43
4111A721m4L3o37l31n88n85k25n64l49j33j58n7L58K07N93L69N49M75M78J63N48
4132A823Q5j62j1l13l13m59n90n63k91p25J19o23J74J07P1O55K77N18N54N84K64
4153A181N37J37j4k1l71j43m33n79m81n26l75l30k24k50K88j74M81K74M22O58
$$ plain form
4173 57 414 725 1360 1602 1850 1945 1519 1515 1376 776 257 -416 -801 -1198 -1720 -1693 -1837 -1782 -1507 -1268 -918 -235
4195 -235 163 688 1174 1340 1750 1918 1730 1628 1431 1119 506 51 -600 -971 -1181 -1718 -1731 -1751 -1672 -1343 -1095
4216 -1095 -718 -217 336 785 1252 1455 1826 1791 1607 1590 1147 853 415 -298 -679 -929 -1488 -1649 -1682 -1789 -1486
4237 -1486 -1457 -690 -451 -44 443 710 1262 1717 1442 1757 1666 1348 1010 834 113 -315 -760 -1243 -1427 -1748
4257 -1748 -1792 -1650 -1450 -1149 -582 -330 162 689 909 1480 1723 1686 1937 1399 1284 1177 359 -53 -595 -981
4277 -981 -1299 -1601 -1852 -1623 -1769 -1460 -1032 -900 -195 236 924 1291 1576 1748 1924 1502 1591 1325 644 296
4297 296 -155 -566 -1032 -1385 -1750 -1679 -1790 -1546 -1114 -900 -535 -12 487 847 1418 1604 1767 1660 1488 1298
4317 1298 968 514 246 -458 -863 -1062 -1413 -1618 -1798 -1803 -1333 -1236 -769 -45 277 741 1105 1428 1526 1835 1716
$$ packed form
4173E7L57L11O35K42K48R5m26mj39o00n19o73l85l97n22K7j44N5K75K39L50O83
4195b35L98N25M86J66M10J68j88j02j97l12o13m55o51l71k10n37j3k0P9L29K48
4216a095L77N01N53M49M67K03L71l5j84j7m43k94m38p13l81k50n59j61l3j07L03
4237a486K9P67K39M07M87K67N52M55k75L15r1l18l38j76p21m28m45m83j84l21
4257a748m4J42K00L01N67K52M92N27K20N71K43l7K51n38j15j07q18m12n42l86
4277i81l18l02k51K29j46L09M28J32P05M31O88L67K85J72J76m22Q9k66o81l48
4297B96m51m11m66l53l65P1j11K44M32K14L65N23M99L60N71J86J63j07j72j90
4317A298l30m54k68p04m05j99l51k05j80nM70R7M67P24L22M64L64L23R8L09j19
$$ plain form
4338 1716 1541 1317 839 518 -45 -444 -927 -1393 -1483 -1760 -1775 -1509 -1297 -906 -384 25 357 942 1038 1574 1691
4359 1691 1592 1637 1372 1164 940 234 -240 -474 -1114 -1442 -1599 -1794 -1517 -1494 -1097 -655 -262 150 351 849 1067
4380 1067 1586 1565 1708 1734 1321 1088 539 102 -288 -851 -1155 -1268 -1541 -1520 -1762 -1483 -1104 -819 -313 370 658
4401 658 1079 1390 1507 1799 1608 1486 1183 800 363 -116 -408 -807 -1187 -1478 -1630 -1770 -1604 -1143 -1055 -655
4421 -655 -79 285 881 1205 1183 1585 1681 1538 1554 1101 551 404 -183 -795 -1007 -1351 -1522 -1545 -1756 -1413 -1330 -984
4443 -984 -286 15 447 905 1149 1446 1675 1605 1618 1272 871 677 241 -268 -608 -1194 -1298 -1655 -1991 -1333 -1369
4464 -1369 -1038 -565 -329 74 741 964 1358 1530 1562 1660 1385 1108 789 366 -227 -458 -997 -1187 -1543 -1604 -1612
4485 -1612 -1564 -1270 -900 -673 -164 518 813 1148 1399 1525 1752 1631 1259 1078 651 74 -100 -635 -923 -1087
$$ packed form
4338A716j75k24m78l21n63l99m83m66r0k77j5K66K12L91N22M09L32N85R6N36J17
4359A691r9M5k65k08k24p06m74k34o40l28j57j95K77K3L97M42L93M12K01M98K18
4380A067N19k1J43K6m13k33n49m37l90n63l04j13k73K1k42K79L79K85N06O83K88
4401F58M21L11J17K92j91j22l03l83m37m79k92l99l80k91j52j40J66M61Q8M00
4421f55N76L64N96L24k2M02R6j43J6m53n50j47n87o12k12l44j71k3k11L43Q3L46
4443i84O98L01M32M58K44K97K29p0J3l46m01j94m36n09l40n86j04l57l36O58l6
4464a369L31M73K36M03O67K23L94J72L2R8k75k77l19m23n93k31n39j90l56o1q
4485a612M8K94L70K27N09O82K95L35K51J26K27j21l72j81m27n77j74n35k88j64
$$ plain form
4505 -1087 -1451 -1636 -1621 -1683 -1234 -707 -408 37 491 965 1387 1249 1719 1561 1427 1501 855 549 201 -360 -799
$$ packed form
4505a087l64j85J5o2M49N27K99M45M54M74M22j38M70j58j34P4o46l06l48n61m39
$$ [...]
8191e3
##END NTUPLES=NMR FID
##END=
