##TITLE=1H_PrNCS-5g
 200.13MHz,CDCl3,
 8 sc
 
 10.7.2025
##JCAMPDX= 6.0         $$ Bruker NMR JCAMP-DX V2.0
##DATA TYPE= NMR FID
##DATA CLASS= NTUPLES
##ORIGIN= UXNMR, Bruker Analytische Messtechnik GmbH
##OWNER= pz
$$ XWIN-NMR		Version 3.5
$$ Thu Jul 10 16:41:00 2025 Russian Standard Time (UT+4h)  she@DPX200
##.OBSERVE FREQUENCY= 200.1313
##.OBSERVE NUCLEUS= ^1H
##.DELAY= (6, 6)
##.ACQUISITION MODE= SIMULTANEOUS
##.ACQUISITION SCHEME= undefined
##.AVERAGES= 8
##.DIGITISER RES= 18
##SPECTROMETER/DATA SYSTEM= spect
##.PULSE SEQUENCE= zg30
##.SOLVENT NAME= CDCl3
##.SHIFT REFERENCE= (INTERNAL, CDCl3, 0, 14.3821)
##AUDIT TRAIL= $$ (NUMBER, WHEN, WHO, WHERE, WHAT)
$$ ##TITLE= Audit trail, XWIN-NMR		Version 3.5
$$ ##JCAMPDX= 5.01
$$ ##ORIGIN= Bruker BioSpin GmbH
$$ ##OWNER= she
$$ F:/spectra/data/she/nmr/H-C/1/audita.txt
$$ ##AUDIT TRAIL=  $$ (NUMBER, WHEN, WHO, WHERE, WHAT)
(   1,<2025-07-10 16:39:04.15 +0400>,<she>,<DPX200>,
      <created by zg, POWCHK disabled, PULCHK disabled
       configuration hash MD5:
       00 E9 B6 7A A2 85 ED C7 34 08 36 98 17 FE 4E 26
       data hash MD5: 16K
       54 75 BC D4 8E EB EF F7 8A C0 DB AA 85 61 68 88>)
$$ ##END=
$$ 
$$ hash MD5
$$ 9B B6 37 9A 10 DD 5B E2 9E 7C E4 8A AC 7A 2F 81
##$RELAX= 
##$RELAX= 
##$RELAX= 
##$RELAX= 
##$RELAX= 
##$RELAX= 
$$ Bruker specific parameters
$$ --------------------------
##$DU= <F:/spectra>
##$EXPNO= 1
##$NAME= <H-C>
##$PROCNO= 1
##$TYPE= <nmr>
##$USER= <she>
##$AMP= (0..31)
100 100 100 100 100 100 100 100 100 100 100 100 100 100 100 100 100 100 
100 100 100 100 100 100 100 100 100 100 100 100 100 100 
##$AQSEQ= 0
##$AQ_mod= 1
##$AUNM= <au_zg>
##$AUTOPOS= <>
##$BF1= 200.13
##$BF2= 200.13
##$BF3= 200.13
##$BF4= 200.13
##$BF5= 200.13
##$BF6= 200.13
##$BF7= 200.13
##$BF8= 200.13
##$BYTORDA= 1
##$CFDGTYP= 0
##$CFRGTYP= 5
##$CHEMSTR= <none>
##$CNST= (0..31)
1 1 145 1 1 1 1 1 1 1 1 1 1 1 1 1 1 1 1 1 1 1 1 1 1 1 1 1 1 1 1 1 
##$CPDPRG= <>
##$CPDPRG1= <>
##$CPDPRG2= <>
##$CPDPRG3= <>
##$CPDPRG4= <mlev>
##$CPDPRG5= <mlev>
##$CPDPRG6= <mlev>
##$CPDPRG7= <mlev>
##$CPDPRG8= <mlev>
##$CPDPRGB= <>
##$CPDPRGT= <>
##$D= (0..31)
0 0.7 0 0 0 0 0 0 0 0 0 0.03 0 0 0 0 0 0 0 0 0 0 0 0 0 0 0 0 0 0 0 0 
##$DATE= 1752151143
##$DBL= (0..7)
120 120 120 120 120 120 120 120 
##$DBP= (0..7)
150 150 150 150 150 150 150 150 
##$DBP07= 0
##$DBPNAM0= <>
##$DBPNAM1= <>
##$DBPNAM2= <>
##$DBPNAM3= <>
##$DBPNAM4= <>
##$DBPNAM5= <>
##$DBPNAM6= <>
##$DBPNAM7= <>
##$DBPOAL= (0..7)
0.5 0.5 0.5 0.5 0.5 0.5 0.5 0.5 
##$DBPOFFS= (0..7)
0 0 0 0 0 0 0 0 
##$DE= 6
##$DECBNUC= <off>
##$DECIM= 32
##$DECNUC= <off>
##$DECSTAT= 4
##$DIGMOD= 1
##$DIGTYP= 9
##$DL= (0..7)
0 120 120 120 120 120 120 120 
##$DP= (0..7)
150 150 150 150 150 150 150 150 
##$DP07= 0
##$DPNAME0= <>
##$DPNAME1= <>
##$DPNAME2= <>
##$DPNAME3= <>
##$DPNAME4= <>
##$DPNAME5= <>
##$DPNAME6= <>
##$DPNAME7= <>
##$DPOAL= (0..7)
0.5 0.5 0.5 0.5 0.5 0.5 0.5 0.5 
##$DPOFFS= (0..7)
0 0 0 0 0 0 0 0 
##$DQDMODE= 0
##$DR= 18
##$DS= 0
##$DSLIST= <SSSSSSSSSSSSSSS>
$$ [...]
##$SUBNAM0= <"">
##$SUBNAM1= <"">
##$SUBNAM2= <"">
##$SUBNAM3= <"">
##$SUBNAM4= <"">
##$SUBNAM5= <"">
##$SUBNAM6= <"">
##$SUBNAM7= <"">
##$SUBNAM8= <"">
##$SUBNAM9= <"">
##$SW= 18.0517328524113
##$SWIBOX= (0..15)
0 0 2 0 0 0 0 0 0 0 0 0 0 0 0 0 
##$SW_h= 3612.71676300578
##$TD= 16384
##$TD0= 1
##$TE= 0
##$TE2= 300
##$TE3= 300
##$TEG= 300
##$TL= (0..7)
0 120 120 120 120 120 120 120 
##$TP= (0..7)
150 150 150 150 150 150 150 150 
##$TP07= 0
##$TPNAME0= <>
##$TPNAME1= <>
##$TPNAME2= <>
##$TPNAME3= <>
##$TPNAME4= <>
##$TPNAME5= <>
##$TPNAME6= <>
##$TPNAME7= <>
##$TPOAL= (0..7)
0.5 0.5 0.5 0.5 0.5 0.5 0.5 0.5 
##$TPOFFS= (0..7)
0 0 0 0 0 0 0 0 
##$TUNHIN= 0
##$TUNHOUT= 0
##$TUNXOUT= 0
##$USERA1= <user>
##$USERA2= <user>
##$USERA3= <user>
##$USERA4= <user>
##$USERA5= <user>
##$V9= 5
##$VALIST= <valist>
##$VCLIST= <CCCCCCCCCCCCCCC>
##$VD= 0
##$VDLIST= <DDDDDDDDDDDDDDD>
##$VPLIST= <PPPPPPPPPPPPPPP>
##$VTLIST= <TTTTTTTTTTTTTTT>
##$WBST= 1024
##$WBSW= 4
##$XGAIN= (0..3)
0 0 0 0 
##$XL= 0
##$YL= 0
##$YMAX_a= 848937
##$YMIN_a= -930757
##$ZGOPTNS= <>
##$ZL1= 120
##$ZL2= 120
##$ZL3= 120
##$ZL4= 120
##$ABSF1= 10
##$ABSF2= 0
##$ABSG= 5
##$ABSL= 3
##$ALPHA= 0
##$AQORDER= 0
##$ASSFAC= 0
##$ASSFACI= 0
##$ASSFACX= 0
##$ASSWID= 0
##$AUNMP= <proc_1d>
##$AZFE= 0.1
##$AZFW= 0.1
##$BCFW= 1
##$BC_mod= 2
##$BYTORDP= 1
##$COROFFS= 0
##$CY= -3
##$DATMOD= 1
##$DC= 2
##$DFILT= <>
##$DTYPP= 0
##$F1P= 0
##$F2P= 0
##$FCOR= 0.5
##$FTSIZE= 0
##$FT_mod= 4
##$GAMMA= 1
##$GB= 0.15
##$INTBC= 1
##$INTSCL= 1
##$ISEN= 128
##$LB= 0.25
##$LEV0= 0
##$LPBIN= 0
##$MAXI= 10000
##$MC2= 0
##$MEAN= 0
##$ME_mod= 0
##$MI= 1.114404
##$NCOEF= 0
##$NC_proc= 0
##$NLEV= 6
##$NOISF1= 3.799351
##$NOISF2= 2.8
##$NSP= 1
##$NTH_PI= 0
##$NZP= 0
##$OFFSET= 14.38212
##$PC= 1
##$PHC0= -1130.877
##$PHC1= -79.20749
##$PH_mod= 1
##$PKNL= yes
##$PPARMOD= 0
##$PSCAL= 0
##$PSIGN= 0
##$REVERSE= no
##$SF= 200.129724274929
##$SI= 16384
##$SIGF1= 3
##$SIGF2= 2
##$SINO= 400
##$SIOLD= 16384
##$SREGLST= <1H.CDCl3>
##$SSB= 0
##$STSI= 0
##$STSR= 0
##$SW_p= 3205.1282051282
##$SYMM= 0
##$S_DEV= 0
##$TDeff= 0
##$TDoff= 0
##$TI= <>
##$TILT= no
##$TM1= 0
##$TM2= 0
##$TOPLEV= 0
##$USERP1= <user>
##$USERP2= <user>
##$USERP3= <user>
##$USERP4= <user>
##$USERP5= <user>
##$WDW= 1
##$XDIM= 8192
##$YMAX_p= 0
##$YMIN_p= 0
$$ End of Bruker specific parameters
$$ ---------------------------------
##NTUPLES= NMR FID
##VAR_NAME=  TIME,          FID/REAL,        FID/IMAG
##SYMBOL=    X,             R,               I
##VAR_TYPE=  INDEPENDENT,   DEPENDENT,       DEPENDENT
##VAR_FORM=  AFFN,          ASDF,            ASDF
##VAR_DIM=   8192,          8192,            8192
##UNITS=     SECONDS,       ARBITRARY UNITS, ARBITRARY UNITS
##FACTOR=    0.0002768,     1,               1
##FIRST=     0,             0,               0
##LAST=      2.2672688,     0,               0
##MIN=       0,             -930757,         0
##MAX=       2.2672688,     848937,          0
$$ Real data points
##PAGE= N=1
##DATA TABLE= (X++(R..R)), XYDATA
$$ [...]
1846b44J72L4O5k61L11l42L49j79lJ78J70k18Q0M9j29L51k76n6J30j37j50J82
1868G6N6j72J5l38L58J66j89n0k0L03j51j17N8m7J37j72J63j02j04k9R1M97m61
1891c2J64l11L35j14J0L9K1j58j90J84o2l8R0K7J56K8j14N6l75K73m20L03K04
1914G6j3nJ01j36J41k06J45j9k35J95j75Q2L9j5o5l00L22J48J13p2Lj71R1J49
1938A93k47j22R9K08k8p3K4n9K26j33l45K99j02J53J2j53j07K78J37k06m6j79
1960a71lO6n5K45k59J08n8K36j5k19K97k84L11m86L73R5k26K7m4J92j17L11j48
1983A76l5l06j54L76q2j88K98k80J84m8O8K64k19J4k05L10j48J72m02M74l91K18
2005I6k12J11m8j37J96J13k19L28k22q0R0l68M38r1K83l03j42J77j9Q3j42J35
$$ y = [-244, -72, -38, 27, -234, 77, -265, 84, -95, -98, 80, 250, 32, 112, 161, 32, 383, 107, 51, 181, 44, -106, 76, 132, -40, -25, -363, -5, 161, -28, -78, -98, 205, 54, -63, -5, -52, 85, -87, 76, -26, -130, -159, -68, 429, -32, 132, -179, 156, 42, 52, 91, 112, -46, -236, -52, -114, -152, -62, -35, 121, 149, 35, 91, -284, -11, -431, -128, 76, 63, 58, 159, 23, 164, -42, 103, 84, -151, 44, -131, -49, -10, -25, -90, -390, -68, 80, 193, 121, 124, -47, 44, 193, -54, -176, -77, 131, 103, 30, 54, -5, 221, 88, -257, 42, -60, 93, 105, -48, -155, 123, 260, 54, 8, -171, -174, -108, -163, 82, -177, -69, -127, 109, 94, -125, 172, -112, 199, -287, 86, 181, -45, -18, -62, 130, 13, 324, 176, 141, -165, -319, 57, -25, -213, 85, -195, -11, -59, 9, 273, 54, 68, -137, 173, 25, 197, -205, 269, -122, 96, -116, -5, -53, -190, 6, 119, -100, 228, 6, -74, 16, -352, 86, -5, 278, -25, -167, 10, -9, 74, -68, 67]
2027F7j68L1J44Mk02K49l5l61L66j25J88k11Q2L8j22J75j47pK87j52K53l17j96
2050a59O5L83j01q4J23k08r4J10k24J79j61L3kJ66j51K4j91L19m5Q5j64J71Qk06
2074a24K33M1j37J3k66J84J42l82K67J1J1l8j0M4P6j29J09J1j72L42k16J78l46
2097a58K00J26k72P2J60k15l23L19J43k1k42K74l62K65j87K78N8k08j11L20P1
2118A87k33n5J72l6k2lN1j39J12O3J7k04j30J70j31P1j7r5K62K0Q9J09k37k77
2142b56L17J01m08N13j95j43J69oj55J16j73J30J03j32j22K69k66M60j18o7m8
2163H9Q8j69k11K95l8j09J67j43K64k33o5K15l28J40o3K30j43J20r1n8R5o5k04
2186b17M32k3k25n7J18r3Q7P2k52R0Q9k17L8O3K40N0k55J08j7k3N4q8K50q3L4
$$ y = [67, -101, -70, 74, 78, -124, 125, 90, -271, 95, -30, 158, -53, 29, 67, -55, 120, -27, -34, 253, 101, 354, 37, -159, -94, 289, 188, 104, 227, 19, -75, 35, -189, -10, -171, -138, -140, 26, -125, -101, -292, 27, -18, 67, -97, 74, 82, -124, 109, 150, 13, 26, -240, -56, 86, -296, -29, -18, -7, -45, -55, -11, 65, -64, 45, 56, -116, 226, 10, 188, -158, 42, 168, -104, -32, 128, -87, -410, -91, 52, 31, -211, 63, -299, -34, -221, 57, 115, -93, -204, 116, 187, -46, -101, 71, 35, 13, 10, 61, -78, 34, 97, 114, -90, -220, -50, -181, -110, -127, -222, 40, 60, 149, 258, 21, -256, 61, 162, -246, 267, 72, -71, 98, 92, -63, 53, -120, 10, 113, -19, -141, 128, -138, 322, 204, 137, 89, 177, 8, -203, 92, 54, -55, 112, -31, 233, 0, -65, 150, -178, -38, -101, 129, -14, 106, 15, -43, 52, -13, -217, 215, 192, -33, -90, 28, -65, 22, 94, -158, -68, 21, -196, -158, -95, 145, 195, -60, 48, 31, 8, 62, -26, 224, 141, 175]
2211A75k41rJ92r6K19l04K80l63R2J66l3j4j22j14PJ06J83k55J97K52l46q2L9
2234g1K04o4m4J9q0J10k2j91K66l59K69j38pJ76J73l50L6K86p6l6j57Q6Q6j62
2258d6n6L05l07%L85l65n6m5N3J15J7j8p5K10k99L48m23N6L33k24J25Q7J04j43
2282H1j4l59K07K97l09J33j85o6j81K51L46l50K92k4oL9k9o9J02K5M8k98J5J75
2306A21k97K05l2n8o7l33M49L3m3o4N2J62j75K11K18m15l7J52j01l6J39J31k37
2329b2K80k58k62J46Q1k74K78J15j43l19M41Q0Q4L8l78Q1K56k4q3j04N1k02K28
2352I0j34J9K2J82L5k77k20L16j08J43k61L5j53J85Q7K62j62l5j25J15l14K03
2374i5Q7L50k71O6K8k91J57j54J33J37o0n62M47m2K17k44K30k63J76qP0q8k4j15
$$ y = [175, -66, -75, 117, 21, 240, -64, 216, -147, -55, 111, 78, 64, -58, -172, -165, -59, 124, -131, 66, 318, -28, -110, -71, 133, 69, 25, 44, -36, 74, 52, -139, 127, -232, 37, -101, -108, 68, 241, -109, -73, 213, 137, 101, -56, 30, 116, -46, -102, 203, -104, -104, 281, -84, -140, -185, -132, -17, 0, -18, -93, 117, -182, 166, -257, -201, 132, -92, 33, 120, 224, 81, 67, -292, -85, 212, -97, 36, -149, -215, -396, -145, 201, -149, 143, 119, 113, 152, 123, 54, 156, 181, 229, -69, -54, 121, -176, 29, -3, -61, -128, -461, -12, 21, -22, -86, -34, 128, -47, 164, 382, -33, -70, 82, -19, -55, 84, 215, -22, 258, 0, -262, -116, -35, -309, -31, 84, -59, -378, 63, 143, 227, 265, -113, -32, 224, 200, 117, 13, 64, -138, 90, -44, -25, -3, 179, 214, -63, -283, 33, -75, 68, -193, -158, -311, -126, -39, 223, 61, 26, -99, 16, -298, -95, -8, 342, 71, 137, 165, -126, 31, -123, 10, 147, 87, -475, -28, -70, 147, -97, 133, -130, 46, 38, 108, 20, -4, -119]
2398a19K83l76k49M16l3J00q4n7K8J49o9j12J12l05J65K05Q4m8J15q9k42l4L1
2421a29L54k00N1P7j15j03Q3o4j24N09l42q2J86Q5k23p0J42N4L10l66p9m5Q2J85
2445A76k83J89J6Q5n28L13l6K56j80j02j66K72m8k0P3k0J95k70M9K13m04K04K72
2468B56m8j16l79L08PJ34j02k67K15L02k24j11j14j60L0L65j62k4J85J67m64M8
2490a54J14j39L71N4l76k27N40k28P4K37m64J45J13K1j51PK41lk75l2P7o7L73
2513B51k70PK4P0j38K40l00R8N9j02K6k00J41o8L59k15K58j64M1O5n78J37J70
2536h9J13m6K07n5l04L40m25L05K1L2j79K32J33m93J47L0r8J99m7J17n7O4o4j47
2560f4L7M5q8m9J05m0j52L60j22j90J67R6j19J1Q1j72L57l83M1J4MPJ60m1k7J53
$$ y = [-119, 164, -212, -461, -45, -78, 22, -62, -119, -91, 58, -11, -123, -11, -316, -151, 54, 138, 90, 205, 116, -126, -160, -129, 225, 25, 76, 153, 38, -65, 18, -46, -170, 339, -3, -85, 101, 186, -37, -107, 35, 89, 399, 33, -46, -91, -9, 176, -107, 82, 98, 183, -345, -32, -68, 188, 8, -94, -260, 12, -36, -56, 17, -3, 192, -78, -29, 184, -220, -16, 256, 208, 92, -287, 21, 28, 162, 60, -207, 8, 310, 86, -25, -139, -299, -269, 96, -66, -90, 95, 262, -202, -154, -40, -179, 192, 246, -130, -357, 183, -45, 29, 266, -198, -53, 60, 81, -70, -63, 178, 175, -100, -132, -55, -122, 251, -19, -12, 12, 82, -56, 184, -116, -18, 41, -61, -35, -235, -94, -162, 197, -18, 240, 76, 117, 182, -396, -259, -89, 24, -22, 185, 130, -174, 166, -259, 46, 67, 99, -80, 152, 285, -208, -61, -31, -129, 70, 23, 140, 83, 147, 83, -64, -27, 18, -70, -119, -14, -54, -206, 154, 32, -158, 9, 105, -14, -3, 78, -94, 263, -120, -79, -65, -61, -54, 106, 65, 38, 191]
2586A91l16L02k42J81k29m9j16L77j99R2%J86j56j93K81k07P1j43L37l02K57l26
2608b03K24O5L9j54rn8j40M32n4k08J0Q1J10j93J33k0J92k35J6j64L7K32k67J40
2632Fk0J25k29L53j31J9o1k87K23J86r6J20q2k0j56Q2M7O7n9P2k1j92k14K58p0
2657h0J34k99R0L05l7k22k54L58L4J3k93O53k93k09p6JK86j54n7j91M35m4l51
2680b51L15k13O6k11L49j16M5Qm8q6J82r0J81p9l2r7j23k7N9J85k79K46q4N0R6
2705D6M2P8j72o9K78l86R8o4L2J44k66N45l14o1K77r4n8k5k18R0M2J30J07j75
2729Gj08L08l07N12m00J06m7n8J41n5o9l9J90l85Q3J64p4k5q3j32L22K1j40O7
2753ak5n0k37M68k31L91j77l22J46R4m7K30j97q0K56m39J12L9j15L5K88m5j4k10
$$ y = [191, -125, 177, -65, 116, -113, -162, -278, 99, -100, -8, -8, 178, 22, -171, 110, -97, -26, -169, 168, -134, 123, -203, 21, 86, 125, -29, -38, -96, -236, 196, 142, -66, -56, 25, 135, -58, 75, 55, 247, 12, 28, -136, -99, 133, -134, 6, -14, 111, -118, 235, 104, 123, 62, -225, -2, 184, 88, 208, 126, 106, -50, 32, 79, 146, 87, 159, 138, -54, -268, -10, -80, 54, -245, -155, 150, 113, -109, -363, -5, 29, 42, -251, 402, 109, -100, -176, -175, 111, -43, -100, -291, 144, 100, -251, 64, -149, -83, -294, 55, -61, -16, -8, -56, -142, 40, -50, 131, 52, 20, -77, -200, -227, -168, 17, -262, -16, -100, -50, 46, 88, 166, -6, -75, 203, -183, -85, -149, -117, 27, -239, 306, -8, -69, 208, 114, 56, 31, -187, -97, -55, 75, 182, 7, -101, 207, -100, 412, 12, 118, 71, 13, 154, 99, 30, -9, 181, -204, -121, 43, -31, -56, -139, -271, 51, 72, -68, -1, -26, -76, -313, 155, -76, 315, 138, -184, -38, 56, 9, 239, 42, -38, 218, -221, -109, -70, -185, -150, 138, 93, 79, -131]
2777a31J50J57jj9J3l56K24q8L27k74k03K67j51O0K5j61R9pK49l07O6j08m6P0
2801a45Q7k1OK39l46K67Kj00k26J03J03j70K65J80l37k7J3N2r6J00q0L94l00M8
2825A1J35j42J74l16R5L9J70M6j05m3%J89j61j63J26O1j07l99M96r3k86L29j32
2848g6j47L53q7J15j79J34l22J67K40j49j0j13K83j28j19j60L23l89K57j94J46
2869e5m5Q5J67k26j3J87m7q2J8N8K12n58K76L57l22n9j28M7K83o2Q3Nm30J32J68
2894E1m60M78jM5j6J88j09o2J14l52J10or2J6m1K36j95L5R7j06p0l6j6K02J55
2919A65k97J8qK94j67L59m36J61j88L61j96l91L78Q4j35n5K22r7K31j54j66O0
2941D3j28Q9K4O8J30k47J17k98K67j19J0J38k42K37k27J41N2OP1l09Q5L47j82
$$ y = [-131, 19, 176, 175, 156, 169, -187, 37, -51, 276, 2, -201, 66, -85, -25, 0, -161, -62, -69, 180, -127, -61, -169, -215, -145, -58, -79, -73, 166, -180, 87, 89, -11, -237, -134, -31, -201, 64, 244, -93, -120, -107, -55, -151, -51, -131, 263, -37, 11, 146, 4, 178, -138, -43, -4, 166, 212, 107, 64, 64, 253, 92, -71, 55, 116, 9, -390, 106, 13, -273, 56, -76, -223, 130, 43, 158, -21, 113, -209, -42, 198, 49, 39, -74, 209, 81, -38, -198, 125, -264, -7, -201, -55, -100, -15, 152, -74, -87, 100, 53, -29, -11, 47, 259, -299, -23, 334, 12, -47, -175, -128, 155, 93, 176, 181, -249, -117, 51, -409, 69, 68, 113, 97, 285, 176, 114, 228, -124, -14, -20, -112, -96, -137, 99, -96, -61, 36, -70, -140, -176, -192, 10, 165, -132, -114, -122, 172, 5, 364, -72, 89, -99, 262, 66, -325, 53, 137, 2, -53, 169, 72, 303, 149, -17, 43, -85, 4, 28, 96, 226, -21, 96, -202, 65, -54, -44, 94, -148, 89, -138, 3, 55, 61, 132, -177, -92, 255, 73]
2964G3k8j21NK75K9k75p4K86J17l01K41k60J80L2l10K97j20J3Rr6J4M9Q3l52N
2989b29J82K94j51k47K02P5Nl0j94p5J84J46o4m1m6L4j34rJ30j45K25l09J50R1
3013D4l47M58k95J94j16K7J85k08j46L36l12K65k4j40N3J65q0j82j0j47K46Lm1
3036g2j9J08o7O3P2j60J73M9m1k66K50K8l9K02k87j73N0J56J29k70L39J7j48j89
3060i5J33j01J04K47l2j37j46L83k42m45K33L19k80n2J92j66L52n86K20J07j99
3081a91J30j20Q4J9N5P8j95K12k3J68j29j68l7L6K8K10j70J48j34p6J16k64Q7
3104a36rJ05J78l32l5K34KJ71k74K43l80J21J87rk22L13k79q2J93q2J19R4j29
3127iJ99p9j65M32n34M50j61p9j46k3J06N5j36r0J86k65J51N9j03J60j1L44k14
$$ y = [73, 45, -76, -71, 204, 233, -42, -116, 170, 287, -14, 227, -33, 147, 179, -131, 166, 46, 59, 68, -28, -14, 35, 118, -234, -229, -47, 247, 96, -151, 51, 126, 131, 101, -93, -168, 16, 162, 98, 57, 11, 45, -89, -98, 32, -113, 112, -197, -47, 44, -303, 155, -140, 54, -62, -35, 150, -58, -204, 132, -180, 85, 61, -79, -26, 139, 59, -123, -133, -280, -34, -31, -72, -91, 17, -50, 13, 85, -75, 98, 147, 106, -160, 90, 118, 79, 281, -6, -179, -129, 27, 156, -114, 225, 242, 94, -95, 38, -63, 41, 288, 256, 119, -27, 356, 114, -331, -98, 221, -59, -111, 81, -85, 267, -319, -99, 8, -191, -61, -181, -97, -78, -23, 55, -140, 72, 49, 217, 88, -80, -117, -81, -53, 157, -13, 135, 1, -75, 41, -223, -136, -145, -40, 138, -194, -229, 5, 7, 178, -96, 147, -233, -112, 75, 66, -156, 157, -122, -204, -11, -93, 26, 120, -9, 190, 111, -54, 378, -156, 294, 133, 54, -92, -115, -9, 46, -90, -180, 6, -259, -108, -49, -152, 8, -3, 341, 127]
3150A27j42J41K10l42l10L85j83J62j79J72J26k92J1M0J35j44L16m85N3L39k52
3171a12P5l52M16j8J73N8k71n7K92k35nJ29j25K05L3p9m30L54k18l3L48j72k13
3194b37P6O2j71J76J50j87J99p8J99k29o0L4N4j8q4R2j35J6J34K57l26K13j16
3217B1M9L2k82K61p8Q0m3J67k82K65o5k54N9R7j4j3R7m9jj84K37l61J46j7L27
3242A95k71J83k4k96J31J42r9j91J60p5K20j93K6M3r4K91k05j16K25K10m01J79
3264D0L1L9j37J08o9j14j9L32M6m32K56j20P3j3K38j48p8j67K6J60o8j38J34j30
3288a50J92j77R0j56J74J77j58k55J92K86j53j59j5J89l9Q4j05r0JL15l39K20
3310A24k44J2J38K13m03N2nK36j17j10J14N7j95K44J85k01j13J28J76k06j61R6
$$ y = [127, -15, 126, 336, -6, -316, 69, -114, 48, -131, 41, 167, -125, -114, -74, 61, -83, 233, -252, -199, 140, -112, -37, -389, 27, 9, 182, 240, -31, -88, 204, -31, -36, 93, -32, 173, 206, 127, -303, 51, -167, -200, 148, -24, -237, -161, -99, -270, -94, 56, -131, 68, -10, 189, -40, -100, -66, -12, -30, -114, -22, -157, -141, -7, 250, -76, 137, 21, 70, 102, -180, 81, 3, 83, 40, 207, -75, 190, 125, -129, -70, 27, 13, 0, 97, 48, 47, -137, 100, -261, -115, -132, 195, -76, 107, 83, -213, -82, 60, -39, -230, -70, -145, 75, -118, -92, -49, -143, 148, -57, -173, 52, 262, -139, 40, 71, 110, -27, 81, 12, -102, -121, 211, 257, -175, 81, -39, 34, 21, 259, 111, 33, -134, -108, 52, -16, -154, -20, -150, 42, -135, -45, -201, -27, 150, -8, -263, -71, 215, 62, -97, -112, 77, 38, 122, 17, -73, -72, 243, -96, 124, -120, -108, 30, 243, -160, -108, -113, 123, 6, -104, 10, 67, -128, 116, 301, 100, -13, 115, 291, 85, -76, 20]
3332B0J19j32Nj71J53R9j70J44J09l73K8M45k24m8k72K54l2pL8j80n4K40q5J32
3356C8pj32J00J77j20J05l78K66L5j23QJ3j64j0J3J65L10l30j41K61j22L8pl7
3380d2R4N7nj68qJ01Q1O8j86L8o2m9K19m5j31R7J37J0p4J09k94LO8k05K79J66
3406B58l67K11j5l63K68qK51l59J02k07J1J18K81k90Op0L02o0J04Q9k22J23o7
3429I6j98K05pm3j86J58l7J71P4j22l44K12J99J01O7j86j50L05k92j17R9j7J81
3452A69L6kj69L5m4p8R9j42Q6M4J8r6p0K19j19pJ34P9k07K17k68J97k86M6J25
3477A6k20J98p0L3j8P4k53J07J16j42QJ50J32n2j33K25k15K70l30P6J3l2k2j12
3501a81J16p6m9OJ43J49j98K74l37j7J41QL5K26j4o9N6p0J7j53L85k78k01J32
$$ y = [20, 139, 7, 12, -159, -6, 93, -77, 67, 176, -197, -169, 276, 52, 4, -268, -14, -46, -53, -15, -195, -249, -9, -94, 38, 31, -101, -1, 176, 56, 161, -217, 49, 84, -39, -31, -18, -182, -192, -179, -14, 296, -34, -175, 86, -36, 2, -5, -42, 52, 109, 104, -64, -72, 29, 110, 178, -8, 30, -32, -81, 138, 93, -38, 59, 196, 206, 132, 241, -53, -50, 18, -187, 92, 258, -109, 102, 87, -276, -8, -16, 235, -124, -22, -229, -218, -100, 181, -109, -103, -173, 129, 69, 173, 262, 40, 163, 96, -102, 103, 96, 53, -133, 25, -12, 159, 233, 111, -233, -21, 178, 279, 346, 160, 10, 315, 23, -94, 5, -12, 169, 205, 203, 34, 69, 25, -53, 46, -96, -10, 34, 52, -44, -114, 105, -14, -21, 113, 192, -15, 202, -66, 131, -155, -109, 16, -204, -6, -76, -43, -61, 13, -240, -133, -17, -159, -151, -1, 131, 79, -54, 171, -44, 226, -104, -28, -15, -47, -69, -181, -65, -141, -190, -184, -41, 108, -90, 184, -153, -170, -29, -21, 14, 240, 226, 157, 213, 143, 160, 7, 392, 114, -87, 45]
3525D5k08K66Mj46n4K01k28M0L14j56k96J46L69l82k12K10N5j24K35l16L32j49
3547e4J26j17n9J4K30K5j60k9NJ35j50J5j20K00O0j31j64L02M4j88m18L44r9L77
3571A88j14l9K1j27j94L92O0k86K73l67j38qJ87N1J23J45k37N3M4%j51J76J39
3594A91k14k03P1J02j52L72k29K13l62M07k66j33K75k24L24N9k25O8Pk29J05K07
3616A64k43j1J71Pk2p6L47k60l34K26l1P2r0P2J33j52m3k0K73k60J50o6jk43K57
3641B0k09J41O1J35J2l90M17j21m5M4k79K85p3p8j9K40K2j05j94K87r3k59k5J27
3665i9N6M9J60l84R4j4M7K68j71k7q9K72m8JJ6l48K26J63l64J24L2N9L56m81l6
3690a38N6K91r5l11j7L51n3n8q5J13l9j51L4K1K06l12P2lK06K28m69M4J38p8J29
$$ y = [45, -163, 103, 107, -39, -93, 108, -120, -80, 234, 78, -218, -72, 297, -85, -297, -87, -32, -156, 79, -237, 95, -54, 72, -45, -104, -90, 140, 165, 5, -24, -19, 116, -34, -19, -139, 61, 121, -10, -174, 128, 172, -16, -434, -90, -189, 188, 74, 35, 56, -71, -265, 127, 187, -99, 174, -193, -331, -339, -152, -101, 22, 167, -70, -17, 27, 27, -124, 52, 191, -23, -226, -155, -53, -205, 167, -62, 151, -211, 196, -70, -203, 72, -152, 172, 231, 6, 74, 81, -148, -43, 164, -79, -90, 81, 88, 66, -10, 337, 77, -257, -31, -62, 10, -80, -8, 125, -27, -70, -90, 183, -77, 73, 7, 6, -237, 20, -189, -48, 13, 148, 160, -230, 187, 66, 21, 65, -214, 71, -2, -80, -99, 141, 163, 58, -136, 151, 58, -201, -226, -99, -43, 6, 166, -218, -124, -138, -91, 177, 6, -21, -110, 162, 114, 115, 131, -217, 9, 172, -192, -68, -36, 23, 379, -102, -138, -82, 209, 114, -197, -214, 137, 84, 26, -59, 54, 15, -136, -102, -81, 125, -187, -115, -118, 88, 316, -153, -109, 29, -49, 80]
3715H0k84J85J57l33j7J31L3%J68k11O4J36k6j63k12L45L9k30L2l2O9q4K58j14
3739ip0L18N7j33k17J52j4j65J93k17J53j03k50J72K19J47k95p8K7P6R2j65o5
3762a75J56j19K10J64j77j10J4O1l07M85k0l38K18J09R4j39J65k37l3J25l27K08
3784B7J73m3j22j29n7J65p3L9J02J76m80L31J8j59q0J13k44K63K50l67j08k2k8
3807b55J48J67j34R5K6o3J79j44M6j20J03n7k6k57J74k0L91j31p0l30K19K51j49
3830D3J65k02k2M30m08j14R3j65M22j43k40L89j87o3k2l85N86j87L3k16L2l5J05
3853i1L9k5k3J58j9m1M3K55m92K55N9K53m17p7K3J35j8K55l50L88j81q0l6J46
3877A59Q2l02M9ml6J64k88n2J92j89J72L71l05p6L69m39M6r4j06M11j22jK16j91
$$ y = [80, -204, -19, 138, -195, -212, -81, -48, -48, 120, -91, -27, 109, 83, -80, -292, 53, 92, -138, -106, -138, -69, -153, 105, -9, -79, 239, 296, 163, -54, 98, 84, -81, 112, -105, 48, -55, -305, -133, 86, 233, -62, -140, -113, -37, 55, -110, -175, -19, -138, 72, 236, 59, -51, -37, 24, -283, 202, 182, -156, 62, 171, 265, 126, 291, 54, 21, 146, -181, 27, 200, 157, 35, -94, -151, 14, -59, -20, 82, 258, -222, 109, 127, -32, -112, 1, -243, 20, 270, -97, -205, -227, -255, -107, 60, -74, 21, 47, -16, 163, 19, 65, -55, 48, -9, -35, -292, -118, -138, 253, 122, 52, -278, -59, 192, 43, 208, 6, -16, 414, 6, -108, -15, -180, 242, 99, -141, 248, 61, -2, -24, -409, 177, -10, 23, -193, -161, -196, -91, -52, -77, -100, 58, 39, -2, 41, 296, -196, 59, 118, 371, -46, -123, -100, 35, 17, 272, -78, 310, 129, 49, 13, 159, 241, -61, -12, -16, -52, 112, -176, -228, -36, -225, -53, 318, 13, -63, 306, -133, -87, -181, -287, 124, 2, 1, 217, 26]
3901B6J20k36J71Q7J52l17K45m11n8J21n7L78l41j60K49J5M9M9l32J93J6K45o0
3924A44J17l41j43J02K62l92K26l0k18K21L4j58J09j89K51k7K35q9k59J4J16Q3
3946F8m3l78J26J38j8L34l50r2j21L82J1L2j70M7K54r9m04P9O4J07L5L5M3M2r2
3971C0o2J77L5k04J11j16j5J46j03J19k68K77j63j79J83q9j53K75m9P8q6J17%
3994F1J31j63P1o6J9j16R6J83l64J47j48rn1K52k18K12P9qj36J48k53N2O9p6M4
4019d4o3L20o4m3q4p5J25kk78K28l2L1k44N9J12k36L98j41J15j11m0k23K85J41
4043A34p2m0J43l71J73q5K0M29m26J24K4j12K15P3k15P9j93R9j07r9N60n39q0
4066b66M75o4Kj5j38k55K06K85k08J77l39L9j03K44J2r1j4P5nl6J30j59J71l44
$$ y = [26, 146, -90, 81, 168, 320, 3, 248, -163, -221, -100, -157, 221, -120, -280, -31, -16, 33, 82, -250, -57, -41, 204, 144, 261, -80, -223, -121, 141, -251, -25, -55, -273, -52, -18, -176, -67, -256, -5, -32, 203, 114, -145, -131, -15, 68, 25, -353, -227, -89, -107, 227, -123, -215, -336, 46, 57, 89, -81, -34, 220, 121, -283, -204, -140, -33, 2, 37, 80, 122, 30, -32, 145, 180, -24, 87, -29, -44, 102, -1, 118, -150, 127, -36, -215, -32, -121, -274, 1, -48, 30, -56, 61, 61, 192, 29, 100, 34, 53, -63, 33, 216, -148, -1, -149, -158, -209, 43, -175, 37, 116, 108, -28, 120, -133, -81, -12, -88, -44, -107, 213, 149, 106, 22, -53, 72, 70, -208, 20, -12, 19, -225, -166, -54, -290, 108, -33, 82, -29, -69, -292, -7, 134, 62, 22, 165, -206, -33, -118, -98, 331, -95, 29, 53, -59, 156, 229, 14, 93, -100, -1, -108, -207, 353, -186, -266, 209, 145, 147, 132, -6, -261, -55, 230, 22, 199, -140, -101, -204, 40, 52, -39, -53, 22, 17, -19, 111, -48, 123, -221]
4090b21K95j72q3J88J16n4m04J89J19p1J3j23J81j77O2J98O9j0J23J20k52j17
4112a1MM3j1j94L14k43K35k73L53l44p2L03j05P1o7J81k80J24k51Q7K86j22j36
4135a08J49k2j4j85L13k83M2l36K90J15jK51j6r9j93J6k2q4j05K95j90L51q0q5
4159aq2j88K71j45j7J04L66k06O1j60j23Q6p3p6j53N24l68O3L63p7l43J8OK51
4183A01L5K07n05j7J96k02m9L00j07k45R0J85J50l63J99J16j44K00m07lM37n98
4205d24O75j79j73K36l40K84k57MJ02N2J71l8k36k0k9M0J59n7J6J9N3lJj03j41
4230a88J86M8j62M35l31j20K58j02j88L88r8j56Q0n5j18K2J89L2J70k0Pk61K26
4253B42k52j83J46O2K25j92o9K2j29N24n78K02q3o7J96n3j75q7O8L01j51r6K87
$$ y = [-221, 74, -98, -181, 7, 123, 69, -335, -146, -27, -98, -85, -208, -27, -204, -142, 56, 125, 115, 238, 358, 106, -11, -7, 36, 25, -169, 145, -98, 137, -136, 217, -127, -199, 104, -1, 70, 3, 184, -96, 28, -223, -136, 150, 28, -108, 41, 19, 5, -180, 133, -150, -108, -444, -154, -39, -40, 211, 195, 96, -97, -81, -103, -187, -292, 3, -187, 164, 84, -1, -83, -271, 0, -145, -162, -58, 308, 102, 163, 3, -120, -34, -107, -183, -336, 188, -180, -117, 246, 169, -174, -156, -150, 101, 136, 343, -162, -179, 17, -185, -234, 66, -41, -286, -196, -11, 139, -224, -25, 91, -53, 147, -260, -263, 174, -424, 251, 72, -101, 135, -205, 79, -178, -174, -72, -20, 151, 113, -123, -143, -172, -132, 27, -30, -14, 5, 58, 55, 56, -47, -188, -2, 46, -116, 319, -12, -132, 126, 24, -164, 224, 126, -30, 50, -5, -123, -101, 88, 120, 290, 270, 277, 16, 242, -10, -193, -47, 15, 240, 48, -21, 1, -128, 396, -182, 20, -63, -130, 66, 13, -162, -249, -181, 120, -31, -127, 160]
4276A60k56K03k76r2K09J53k45L00J4l8q3Q8k41Q7l38L74L0K27l31K31J22j22
4298A76k27J40j41j00K36J6j00j8k5r9L32k56Q8J35k11K7M4K1n7j86q1M18o3J13
4322A82O2K6l32j07K95n3l4q2O1j35L21k97nK91p5P7j37j31J35k1K74l06o9k5
4346h5P7J02j03N4j96K98k15P6o5k2J56j45j76J22M76n14j32K62K01o2k03K06
4368A12j5l44J72Q3L1L1j86j5J48j31J79j30q1N1j2j10L48j95J68j28J31k1K97
4391C83m92J41l2L0k6n9R5j8j98R0j26J32J97n0k16J8J09K53k58K99l48j05K93
4414A12j41j7j67M21k4k08m2j09K16J4k17L17J80k39j95j48O24l41m2l2K53j51
4436F4p2o5K7j59J38K0R8j44K62J29m04P0mj6j15L65j19j39j67m9J26J05K7P1
$$ y = [160, -96, 107, -169, -261, -52, 101, -144, 156, 170, 132, 49, 137, -104, -17, -355, 19, 49, 276, -55, 176, 298, 176, -51, 89, -52, -152, 84, 100, 0, -18, -43, -142, 190, -66, 22, 157, -54, -27, 17, 38, -19, -205, -286, 132, 69, 182, 244, 270, -62, -169, 126, 73, 39, -43, 18, -117, 204, -93, -98, 193, 118, 195, 58, -73, 62, 41, 315, 9, -60, -85, -8, 94, -9, 45, -151, 147, -68, 8, -57, -79, 77, -68, -244, -122, 354, -160, -292, -30, 171, 109, -94, 112, 97, -247, -75, 8, 39, 70, -116, -131, 17, -114, 65, -65, -146, -95, -107, -217, 131, -64, 104, -24, 107, 86, 383, -109, 32, 0, 30, 4, -55, 40, 22, -176, -86, -212, -80, 117, 67, -149, -131, -22, 231, -27, 272, -76, -181, 112, -29, -46, -213, 208, 184, -24, -66, -175, 41, 55, -162, 155, 335, 96, -99, -247, 377, 36, -6, -38, 215, 64, -8, -73, -46, -205, -67, -47, 51, -93, 169, 298, -106, -36, -40, -56, -171, 194, 75, -64, -231, -280, -154, -49, -22, 49]
4460D9m1j80J63l9K89j87k02J82K14j43o6k77J73M40j69o6k02L35m13Q6K25r4
4482G7k37oM66l49K92j19j92RJ62qq0j35L49k77N7k6Q0K44j62l9q8K09j23j79
4506g5K5j2j07R7o9k0q8L8L99l76P7J92j32j16L56k85K06k39Q9m3K00p0O7l5J07
4531A86L5l14j17nK92n0K02l23K38j16j0j17r2K99l84J79L00j32o3j3l2J37j92
4554i2J98j68J01k62K69l24M38k7j64J47j76M9k6J89l8J9q8j29K10j30m7L28n13
4577b36L99l14J91K97l69j54K87m7P2M8r0j71J6J15Q1r1j7L2m49M02K01l64M16
4600B55k60j81K09l4j05K48m6N8p0k9Q2j63m5J26j73K5L36k47j06J57K03j43j68
4623g1j01K42j29J2J31k0r3k09L91j64K31k43L8j06j02K21k68J72p6o6J94q5J6
$$ y = [49, 8, -172, -9, -48, 241, 54, -148, 34, 248, 105, 39, -238, -65, 375, 206, 140, -62, 273, -140, -54, 171, 77, -160, -166, 300, -49, 243, 124, -68, -59, 103, 95, 15, -120, 229, -48, 9, -17, 63, 307, 145, 106, 18, 227, 104, -75, -50, -62, -169, -72, -141, -161, -249, -211, 188, -188, -111, 81, -51, -167, 189, -96, 110, -129, -40, -83, 117, 47, 114, 79, 186, 221, -93, -210, -215, 77, 27, 229, -94, 144, 28, 18, -99, -191, 108, -276, -97, 203, 71, 8, -5, -37, 100, -92, 106, -62, 39, -223, 46, -278, 160, 133, -31, 116, -60, -11, -37, 152, 114, 133, 45, -84, 126, -4, -51, 277, -236, 163, -151, 40, 337, -32, -186, 101, 54, 126, 174, 84, -87, -71, 44, 125, 34, 17, 49, -400, 2, 203, -161, 255, -5, -186, 23, -11, -116, 132, 86, 144, 74, 45, 127, -36, -81, 45, -128, -103, 233, -14, -120, 37, 240, 97, -71, -172, 70, -59, -47, 84, 64, -29, -238, 153, -11, 220, -23, 15, -91, -193, 28, -240, -68, -144, -210, -16, -101, -85]
4646h5J09j26J57l42M25j9k80J81m54P08m36J54KK8k25J50J3K54k20ML19l52J62
4669A27L2p4J11J0k17k20J34J88Q5j82L6J38r4p7m8r4k0L35k93L28k73J61j5q5
4693glq4N3N3N2r6L6J61k20L8l4lR6m4J72k32P0R5l8L9j67K47j7j24j09lJ13K9
4721G3r4j62O9PL3K8r7J63j11j20P2K21l65K23L33q8l25P3K55l39J32J70M3j65
4745B9P5J9k05M7m3J05J63l47K12m0k63L63M9K1l07r1K51l03L44o3M4O9j29nj75
4770a80K77L5L0M8l0k22j96K02J6j2l3J84j39o0J05N2P6J15k36j7J39Q2n39K08
4794i5P5j76K06k58J44K39pk60K2r5n8J09L5J32k52J56Q7m8r9M21j85l1j09l4
4818h1L6q9J67N5k62J43K00m21J11K81o3J12j04Rj1R5r8k4J27k46P1k7l7l9N1
$$ y = [-85, 24, -102, 55, -287, 138, 119, -161, 20, -434, 274, -162, -8, -6, 22, -203, -53, -40, 214, -6, -2, 317, -35, 127, 159, 85, 196, 206, -11, -231, -97, 91, 176, -6, 30, 168, 74, -3, -51, -145, -165, 170, -123, 205, -68, 93, 78, -7, -10, -94, -41, 12, 64, -32, 4, 165, -55, -17, -51, -54, 42, -2, 170, -62, 8, 103, 65, 104, -63, 184, 167, 43, -66, -69, 44, 73, -21, -183, -114, -107, -74, -46, -143, 20, -91, -211, -139, 82, -283, -60, 273, 185, -140, -67, 188, -151, -19, 151, 194, 29, 104, 123, -82, -35, -78, 27, 190, -157, 55, 15, -248, 115, 164, 185, -122, -213, 38, -265, 79, 16, 60, 129, 0, -5, -180, 97, 132, 162, 210, 180, -42, -238, -36, -20, -32, -65, 119, -20, -80, 25, 77, 153, 268, 32, 15, 154, 236, -303, -95, -20, -196, 10, -248, -104, 135, 128, -132, -110, -205, -263, -154, -119, 13, -239, -83, 4, -44, -143, 278, 93, 62, -47, -81, -45, -134, 33, 88, -174, -31, 169, -252, -141, 140, 77, 189, 85, 94, 83, 178, 80, 56, 183, -63, 8, -19, -56, -95, -44]
4843d4k5K28k71k24M24l51L96K8L3j67m7J57p0j90J0J75J6o0K23k05K37P0k31
4866A12m1J2j85J46M9j04j53K19j93K08Q2m02QN7M03M0k09k06K04o7m2j18N7K23
4890A00l17J49J28J03q4J07l64L41j67j39J00L3N6o2O6m5R2j17k01K7Q7K7J40
4913F0J25k3k91J70l5K90m21R1M3J03j74J6R7o3R5o3r8r7q0N53k67k40L68r1j19
4938e1l6q0K77l6j15K92m92M90l13Q6j80J30j4p9K17k65j30K17N4K23j87J93l77
4961a76k02M88J54J5j99j61P1J40j65k38K96q2J00j98P8J01o1L33l60O5O0p4J00
4984H5P8Qj2n2k36J10K97j35j16N1j72m2L30k72O1r9o6J3j05M12J16l12J66l01
5008a93K65L5l8k69M64j93k97M12o8k77J53k4k99K19R2j11K16k98K01J41k4O8
$$ y = [-44, -69, 159, -112, -336, 88, -263, 133, 161, 194, 27, -20, 137, 67, -123, -113, 62, 78, 18, 241, 36, 273, 343, 112, 71, 83, -102, 44, 93, -11, -164, 55, -138, 70, 152, -250, -242, -185, 218, 258, 49, -157, 47, -20, -62, -180, -123, 100, -217, -68, 60, 163, 79, 186, -178, 163, -4, -143, -43, -10, 46, -16, 50, 5, 97, -20, -221, -194, -107, -80, 60, 185, 162, -129, 41, 6, 296, -125, -34, 9, 112, -62, -46, 51, -12, 83, 20, -78, -175, -255, 298, 31, -209, 159, 68, -51, -87, -167, 110, 74, -41, 251, -241, 249, -64, 22, -158, -28, -42, -121, 96, -169, -299, -82, -28, 195, 8, 201, -176, -378, 110, 264, 279, 80, -81, -10, 130, -35, -273, 23, -59, 41, -157, -79, 22, -39, 294, -66, -1, 59, -15, 85, 163, 171, 159, 107, -129, -19, 278, 143, 27, 78, -94, -136, 194, -78, -17, -116, -182, -169, -274, 138, 254, -58, 108, -193, 72, 107, 69, -200, 264, 71, -226, 186, 118, -159, -6, -30, -329, -110, -18, -129, 87, -211, -10, 131, 107, 175]
5030A75l10K4N0K36k51J66k26ON0RJ39k16L79l07J70NN8o8k75K10R0j70J19%K5
5055H8Jj48Q0j50J88R1j30K52k79M0J85j27q1j04n3J63r3j34rL49l21L23j32m2
5079d3J36j89R0k06r6O40k93j92J14O9j46J38lj6j28L31k56j1l03L17m9m3K86
5102A47j02L1R2j03n1l5k32L55j34qP4o3k3r6M1j8K07Lj57L05l71K37J14k25q
5127b0J17j50K21j94R6PJ06l2j32k00J18K06Q6k66j21K88k28J91l2l67J25K72
5149I1N9j38M1k16J21k49L89j01q9K84k63L11k7l44N4p5K99p6p2K57j44m8J92
5172B56n9k80J68Q6k14p0o8J48j84L97o6k02K20o6J78k38k84K43J22o7Q0l54L7
5195b17L59n2k35J92jn4L6m1j18K0L50l77J36k92L92p4L18l47M3n8k68K89J62
$$ y = [175, -135, -111, -61, 175, -76, 90, -136, -130, -80, -71, 68, -148, 231, -76, 94, 99, 157, 89, -186, 24, 114, -56, 63, 63, 88, 89, -59, 21, -129, 59, 150, 20, 272, -7, 33, 218, 91, 10, -94, -147, 16, -77, -211, -220, 129, -192, 131, -1, -43, 93, -96, -6, -212, -308, 332, 39, -153, -39, 30, -116, 22, 19, 3, -125, 206, -50, -61, -364, -47, -96, -139, 147, 45, 76, 168, 65, 14, -21, -253, 102, -32, -40, 34, -29, -52, -148, -107, -125, 82, 85, -72, 233, -138, 99, 213, -12, -20, 97, -53, 168, -26, 70, 77, 183, 151, 19, -181, -63, 143, 229, -37, -158, 130, -98, 93, 61, -306, -181, 91, 150, 12, 53, -163, -42, -291, 98, -3, -92, 192, -71, 240, 213, -131, -77, -152, 147, 71, -1, 256, 112, 64, 256, 197, -83, 85, 171, -43, -113, -181, -33, -217, 180, 114, -88, 132, 66, 244, 6, -278, -35, 87, 20, 100, -254, -217, 142, 90, -145, 47, 46, -8, 28, -13, -131, -111, 239, -138, -2, -294, 98, 24, 342, -5, 38, -20, -288, 1, 163]
5218A63o7j23R9n2K3m8K60k58Q1m01K36K00l51M18k91J84j55p6K03P7q8J8j53
5241a01K27p3M0l04k4J74J43j41k0J24j05q8K47p9%M9r9M1p8J45p4O5J26L4k90
5266f1k6J88j92n7P2l92M94j42o6J39K08K1j87j34N9J62J91l23J83p9j7N3qk30
5290a44J97k15l9J05O2j12J60j65K79J28m97J10J37j84J83J32j90m98N37K46j82
5311E0k09J51q5K73L7k86n3K3J03N5J78j27p2j72j03K58L14j77k06J67j57J04
5333F6m7K2j53L18j50J43L8l77L10k83m0J06j0J42K94m44k02L63j42K67j93k50
5355b22L25j85r8L00l05L25k58q8M04k73R7rj22K87l60L78j61P9k23R9J52M7j65
5378B4m2R4m3j97K68j17l3J87R9j61k61O2j5L6J64J29m60J53Q9K34m03J03j18
$$ y = [163, 96, -27, 72, 20, 43, -5, 255, -3, 78, -323, -87, 113, -238, 180, -111, 73, -82, -158, 45, 122, 34, 52, -101, 126, 53, 93, -211, -235, -61, 82, -59, -79, 45, -60, -148, 99, 20, 20, 69, -30, 11, -67, 78, 4, 69, 195, 229, -61, -87, 101, -91, -148, -76, -468, 26, -116, -182, -43, 165, 186, -1, -135, -76, 86, 277, -46, 137, 58, 41, 94, 86, -144, 53, -162, -201, -96, -34, -146, 14, -151, 128, 256, -241, -131, 6, -178, 5, 137, -53, -551, -14, 232, 50, -159, -8, -93, 180, 217, -69, -122, -99, 4, 59, 237, 110, 38, -134, -237, 21, 335, 158, -48, 119, -38, 66, 19, 41, -112, 206, 56, 199, 237, -140, 170, -113, -153, -47, -57, 85, 379, -65, -267, 96, -46, 221, 28, -222, 103, -82, -180, 120, -185, 140, -118, -206, 198, -75, 22, 13, -109, 178, -182, 196, 35, 114, -109, -10, 142, 189, 24, -18, 76, 33, -164, 104, -13, -46, 141, 240, 79, -182, -120, -135, -99, 65, 194, -266, -113, -24, 210, -193, -90, -208]
5401b08L15j36K43j65J8J41P6j65m03J84R4M1o5l3J38j98Q3K18l04K50k49J21
5423dM8K33j52k59L26O1k08j86m5L13Km35J89J05L9j77N2R7k07M38k3m05M3K25
5447G0J29j03n7Nq7J73nj60J16j96K27L4j47l03J88P8j17L39j99m8J17P7p6n2
5471CK57k74M5K33l62K03j35J3on1K13k25l7L43m9m90M07j15N7j93J53K86j63
5494A13j94K83k50J4oP0o1j9j24N4J38j12J52l55M33k03k89J44J46K61k67j37
5516b09J78l12K99K02k04K21q5n6o0o3j64J87Ko6N3k08K41J59j08K21k52l6n9
5539a19K55k41R9J26j05J18j2l13K56K5j70M5k12L90n7r8j10R3n0J10k03J24L18
5562B69k87M6r8j40M15l86j3M7L18j52k31J65J79n08M58J05j28P0j01j11J46j82
$$ y = [-208, 107, -29, 214, 49, 67, 208, 284, 119, -284, -100, -6, 35, -30, -63, 75, -123, -40, 178, -126, 124, -125, -4, 44, 277, 125, -134, 192, 253, 45, -141, -186, 127, 129, -306, -117, -12, 27, -150, -98, -1, -208, 230, 207, -198, -155, 70, 199, 96, 39, 44, -43, 130, 125, -35, 81, -115, 112, 146, -1, -304, -116, -38, -155, 184, -15, -63, 54, 131, 55, 3, 260, -14, 31, 264, -98, 105, -30, -17, -23, -74, 139, -86, -123, 220, 171, -319, 88, -27, 30, -163, -10, 276, 113, -81, 202, -48, -34, -40, 30, -31, -50, -174, -120, 18, -94, 58, -297, 136, -67, -356, -212, -66, 195, -72, -209, -31, -343, -44, 158, -46, 175, 90, 34, -26, -89, -253, -66, -64, -130, -77, -285, -44, 115, 7, 228, -24, -60, -119, 136, -105, -6, 120, 15, 133, 121, -192, 64, 89, -81, -36, -248, 142, 85, -13, -123, -30, -80, 30, -173, -49, 269, -18, 28, -70, -210, 205, -181, -194, -147, 171, 19, -212, -47, 132, -376, 82, 187, 59, 129, 28, -83, 63, -119]
5584a19J21j47n7J96k32J70L51l03l2R2J48j72l8J11j34K55j82J89k89P4q8K47
5606A61l81J49R0k06J43J52k19J81p5K24j70j37M8l25M99j7JNj9j31P5O6j79J01
5630C6j60J21k54J6K03l5m5o0M92k61%j00L69k02K9j14j70N13l55j76L40j23j77
5653a13Q5j7N4o4J62M4k46K5R5k84K74q8L45k10q2K30j7k68j4J49P2k9l54K98
5677D7ll9N1qJ22j19k31J03J43O1N8k92K63j25j6J04j28k8Q0J01k42O9J17o3M5
5702G0O6p2j17K33j30k07L59L3r2j26P1LJ43l85k2K65n3M8k32R8j02J94J38j16
5726F7j71pn4l1L24j6j56K0r9R6L29m54J69J78l3J41j66k37O1J8j81J92P4K5p7
5751A2j58m2J45j60K11O6K05k02j27J87m11J56J34L70o04L25O5j35j47K81m28
$$ y = [-119, 2, -145, -202, -6, -238, -68, 283, -20, -52, 40, 188, 16, -22, 89, -45, 210, 28, 217, -72, 2, -86, 161, -220, -71, 19, -187, -44, 108, -111, 70, -5, 219, 49, -88, -40, -365, 134, 117, 118, 123, 104, -27, 48, 114, -65, 36, -124, -3, -257, -241, -38, -73, -118, -178, 314, 53, 53, -47, 322, 120, 149, 35, -135, 378, 23, -153, 187, 64, -113, -28, -45, 9, -55, 107, 151, -95, -70, 25, -259, 15, -73, 272, 62, -20, 210, 193, -75, -89, 60, 132, 103, -251, 47, 44, 5, 56, 48, 170, 51, -180, -77, 66, 127, 185, -107, 156, 31, 15, 119, -9, -37, 43, 144, -98, -29, 88, 25, 70, 136, 64, -53, 180, 50, -157, 202, 235, 143, 17, 88, 91, 234, -151, -173, 92, 39, 87, -145, -47, -149, 45, 183, 67, -104, -111, -165, -196, 128, 112, -44, -24, -123, -27, 302, -152, 17, 195, 162, 303, 137, -100, -39, -21, -202, -10, 64, 89, 12, -146, -188, -43, -203, 8, 74, 279, 77, -50, 137, -274, -118, 16, 386, -218, 107, 172, 37, -110, 171, -257]
5772b57N26k60N3j41j64M61l83j66L57k14J36J05j85J45k95L94k9j20m6M6K73
5793B36l20P4Q3J39k84k02K04j27K64j70j3K21J54Q6l87J63k56K18K24k57j8L5
5815F7r0p2j54K23nj80K43K8Pj65J09j14N58m17j38P5K70m78L85l3r5K5o2J22
5839A09n4j14l2O3n1J30J90l62J56k84M4J21J97j09k09L22l73J18J87j84J21q9
5861a03J41J64m6m2j57k17J61J8J49k85K91J35k82J94r3n5j7p5J71oj09j14L82
5884B05j50j45J11j6j26j13L42n8j72M96n77K53k34L39R3m90K47K8J66%p1l2j97
5907a01n9J24n1P4M5J42p1K8j13n8K12k00K76m32K57n8K7k20L9L13m30L80j07
5930A7J88l15M1l6L6J82j36R4j80o6K64r7m7P1J45l58K28K05k76j0J19j16j56
$$ y = [-257, 269, 9, 62, -79, -243, 218, -165, -331, 26, -188, -52, 53, -132, 13, -282, 112, 83, -37, -83, -37, 236, -84, -10, 73, 212, -72, -274, -70, -197, 67, -103, -116, 105, 259, 345, -42, 121, -135, 83, 307, 50, 32, 67, -23, -95, -249, -26, -31, -211, 32, 60, 67, -98, 11, -103, 455, 38, -100, -25, 245, -233, 152, 119, 24, 49, -13, 109, 55, -59, -91, -28, -79, 51, 241, -121, 35, -249, -205, -84, 113, 4, -205, 117, -256, -138, 49, -135, -14, -103, 38, 202, 156, 114, -43, -260, -99, -81, 68, -217, 74, 209, -73, 121, 28, -27, -44, -119, 52, 46, -63, -177, 205, 55, -90, 21, 5, -121, -234, 108, 50, -122, 374, -203, 50, -184, 155, 248, -242, 5, 33, 199, 199, 128, 96, -101, -160, -36, -87, -13, 32, 174, 103, 131, 18, -40, 172, -28, 248, -184, 73, 15, 42, -178, -139, 174, -256, 124, 17, 205, -110, -69, -105, -69, 113, -23, 71, -109, -175, 89, -8, -55, 16, 161, -197, 31, 236, -40, -50, 69, -47, -203]
5953b03K0J73j44M5J76r4j7q1K49j89k59J69J53J40k66J84p3j33L51k16l6K75
5975B24k22J40l95M16k33k3K6J1j77K07J36j65K16k53K79j40l52L84j46K59k12
5996b0m4j45m0K52k69Q0K10J63k90o6K24k14M20m34p7M4M37Qk4k02j40J79k23
6019a71M9K8j99R8J35J85k64OL82j24L7k33P1O2l25k1K48J40K0j45K19m01J99
6042dq2K49j11o3j36J80p5j74M79k91J5m8J10M2o0j89K77k3j28O5j61rq3L07J57
6067B44j70j50J9j7p1J76l8r4n8M60k73o0k97L45j68k08J84J14r3K77J32l66J84
6090G2j1R1mJ03n15r9L34r0R8J25j95J26j50J29r8j57M7J00m1P6J31j73J02k46
6114b45lL22j00J94j41J3k9p8MK30k25J6M4N1j1J55m2j56R2k3o9K39l75J63l3
$$ y = [-203, -183, -10, -154, -109, 67, -27, -44, -125, 124, -65, -324, -155, -2, 138, -128, 56, -17, -150, 201, -15, -51, 224, 2, 142, -253, 163, -70, -93, -67, -56, -233, -26, 110, -55, 161, -92, 187, 47, -305, 79, -67, 192, -20, -64, -209, -249, 3, -266, -186, 24, 187, -103, -169, 55, -159, 261, -173, -250, -206, 231, 239, 215, 13, -127, 52, -171, -122, -94, -293, -195, -60, 125, -139, -133, 249, 125, 162, -71, 0, 62, -263, -284, -36, 104, 124, -21, 198, -203, -4, -86, 163, 52, -11, -147, 33, -42, -216, 263, -28, -13, -61, 49, 91, 31, -158, 119, 96, -32, 33, -128, -137, -220, 87, 244, 74, -76, -57, -74, -145, 31, -7, -101, -159, 301, 28, -32, -329, 16, -152, -360, -176, -62, -155, 122, 254, -112, 72, 61, 152, 148, 251, -264, -363, -29, -119, -21, 104, -91, 35, -115, 14, -84, -241, -194, -94, -135, -59, 72, -101, 1, -245, -248, 74, -26, 168, 27, 40, 11, -67, -63, 167, -58, -42, 2, 53, 42, 197, 155, -1, 91, 68, -1, 238, -137, 26, -7]
6139gl7J36Lk26J43L8n4L50k00j86j55K96q6q0J01k94J21j19Q0L18p2k6J52Q8
6163B84q9K4n93K77M7K05l5k46J56L9r6o7L3K72j30K45l56Jnn2J88p0p5oP1o1
6189c9N1q8J64k46J68J0J16Q5j14m82P2K23J17j5k7L20l57P7M6l41M08k13J64
6212I9J97j82L9k46K73j51RQ5k14Q5j15K82k40o1J25L3J19k1k00K32k02N2j78
6235a80K03o4j76L11j51J50k62R0L7k12M8J61n6L06k51j47J89R2j02k17K28j06
6257a09n7J70J23m8Q8K8k26J5J63j43m5j44K49M8j00J14o5M1l58M05j68L9J14
6280A34k75J33q1K87k25M7P4P5j66P3j92R9K21o0j02J3M9j84J86j09j09l6N3m8
6304a43j17M22K8j73N3J94l88J51J05J20l40K52j84k22K49nj21K69k70J08KJ47
$$ y = [-7, -44, 92, 95, -131, 12, 50, -4, 346, 146, -40, -195, 101, 15, -65, 36, -258, -137, -256, -176, 142, 70, 44, 196, 284, 195, 219, -374, -97, -50, 155, 120, -126, 30, 69, -27, -94, -61, 211, 81, 326, -30, -29, -34, -86, 102, 32, -43, -49, 22, -39, 12, -76, 88, -158, 10, 20, 136, 221, 107, -375, -303, -80, 37, 22, -5, 315, -42, 35, 81, -260, 148, -65, 99, 296, 114, 153, -93, 180, 29, 38, 123, -91, -6, -121, 161, -79, -140, -15, 18, 137, 116, -84, 148, -54, -2, -180, 23, -41, -217, 94, -57, 93, -169, -79, -42, -254, -206, -45, -101, 205, -46, -193, -4, 88, -14, -231, -3, -109, -166, 4, 127, 79, 167, 195, -31, -16, 147, 4, -41, -185, 64, 112, 12, 126, 61, 102, -256, 149, -19, 20, 134, -141, -8, -89, 198, -27, 20, 94, 169, 3, 76, -116, -17, 204, 144, 42, 55, 104, -80, 106, -3, -112, -148, -95, -143, -260, 162, 190, 17, 70, 264, -124, 27, 132, 252, -88, 164, -20, -242, 7, 2, -119, 150, -120, -12, -10, 137]
6326A37k19j32M60k65L13m15M27k87ol8o9L7m1L30k14j57J92l8n9J9o1K79q3m00
6350b90N42j87n7k9K3j71J93jJ5l15K68J80m52Q1P3K40O9j21J6l17M14N1l02q
6374h5J62J80k10k38R3K61l46N2O7J39K78m08k9O5j06J76N9j82K54l72K6K17k45
6397a92M15k04j2l4j4J08Q3j92j56L52j58k13K07K6p7K54l4n4j02Rm9m5K14j98
6421f6O2j04J23q9L20l47j47K35k8R6N4J88k74k03J51J5J16l21P8o5M60l09j3
6444f8n0O9J78m11K71J08j88M9R7Qm4m2J43k81L69M1l0k26pN8j17K34k30Q8j77
6469a58J85K04k56J49j78J13l05J6L68k95L57l63J67J52k39pk20M15j90L6J93
6490A44m11L2K25p5J10R1j34r2J58K22l21j1M7L1k6k2J01k8r2J5K39j89J87q9
$$ y = [137, -82, -214, 246, -19, 294, -121, 306, 19, 13, -25, -94, -57, -98, 232, 18, -139, 53, 15, -44, -25, -86, 193, 110, -290, 252, 65, 8, -21, 2, -169, 24, 23, 38, -277, -9, 171, -281, -200, -127, 113, 182, 61, 77, -240, 174, 225, -77, -85, 77, 257, 47, -191, -98, 163, -183, -131, -64, 75, 353, -55, -84, -19, -125, 51, 110, -72, 182, -190, -164, 53, -192, 223, 19, 7, -27, -41, 67, 150, -42, -198, 154, -4, -217, -10, 16, -61, 193, 159, 105, 3, 12, -37, -82, 132, -66, -4, -108, 15, -74, 246, -101, -248, -13, -41, 55, 109, 297, 23, -180, -29, -14, 102, -219, -141, -206, 254, -55, -68, -118, -49, 129, -282, -11, 97, -91, -42, 55, 63, 19, -23, 120, -161, 208, 249, 219, -7, -14, 44, -73, 161, -69, 19, -158, 27, 231, -25, 124, -54, 59, -246, -230, 138, -157, 200, -163, 4, 156, -83, -90, -310, 105, -85, -49, 144, -267, -235, -10, -85, 25, 116, -18, -110, 48, 270, -51, -62, -15, 16, -10, -32, 69, 41, -51, -36, 203, 14, 201, 112]
6514A12Kr5j8j63o7M20j05Ll7K2qp5R3k1op1J32j75J70k15J18n3r5j00N13k8n23
6541b70K59j0R5K08k59j95J89J7K34k03N8l8R3l08l1L58k00n9j16L08j96J63k19
6564a22K76k77N3Q9j35L17M5l83J5j37K68L75l69j30K43K9l21L18k29J28k1J8
6586E0p0K7Q3p0j96K38j87RL17m40K61j16k6K69j04n6k3QJ76k05k0J18K18l19
6610e8j7N1n9J2j61L47j91R6M7o9j30J84k70J33J7P1M6k4j48K67j14J09p4rO4
6635A20j60j2q2K20r9J48k12J21q1j2J63n2J47j86k6j11L32m52N64k52r6r4j07
6658b19L61Mj58j23rK92k97J18N6j65L96l68J58l2J5k95K39nk36J09J14K28K2
6681B05k00m9p1K38j84J29m0J84l48K31mk72L42m4J05l09nk1j09OJ13J47j37K60
$$ y = [112, 114, 19, 1, -162, -229, 191, 86, 89, 52, 74, 66, -9, 84, 63, 57, -14, 118, -57, 113, -102, 16, -37, -132, -232, 281, 253, -270, -11, -21, 74, 282, 23, -172, 17, 34, 268, 65, 123, 85, 178, -130, -161, 197, -3, -62, -178, 130, -66, 97, -122, 154, -123, -70, 19, -116, 201, 246, -137, -122, -259, 9, 384, 15, -115, 128, 157, -164, 154, -75, 53, 32, 50, -20, 7, 90, 20, -176, 62, -125, -116, 201, -239, 22, -94, -120, 149, 45, -11, -34, -26, 150, -55, -75, 43, 261, -58, -75, -24, -83, -71, -232, 115, -76, 20, 67, -2, -132, 52, -218, -85, -68, 3, 49, 25, -123, 144, 30, 139, 65, 56, 120, -40, -52, -134, 86, -13, 135, -77, 44, -37, -49, 114, 62, 209, 23, -3, -114, 218, -234, 330, 78, -18, -112, -219, 142, 146, -12, -135, -144, 148, -149, -31, 25, -140, 256, -112, 46, 14, 29, -266, -27, -32, -268, -159, -45, 183, 205, 5, -44, -115, 123, -61, 68, 28, 212, -136, 95, 91, -181, 161, 117, 222, -87, -92, -113, -222, -216, -103, 44, -93, 167]
6705A67o1J3k53N54l02J3O3l15J59oK10k69J36k07J83J12l81J42Q4O0k11J66K17
6728B74m09L73J1l26J30k27K89j69j26K26P1l42N45m75P6J74J09l12J96qq0l2
6750c2L4l4j57L05j9l4k51L07Q8k08J1j03J81k04jJ30n3Q3j50K04j18j04Q7J10
6774G2j43L34k93l8L11j25PP8k61K00k45K94m8Q8k85J39j39r4K01J04k00J53j82
6797g2K06K4l81n0K42K01j67j37J39P0l73j9L52O5pj23n3j3J2K62k78L25o17K46
6821a46K18o0r9K47l41R6l1O5j11N4k0M5L13k64j47J40r9J32N7j06Q3P1m0m1O4
6846H0p4J86k67J38j91J46l1O4l12N45m33L8K04l02L03k1m8J0L1j46k5J90j64
6869g9j08k0K07J09j69N2nn7J12P4j75q5L22k99k5L01L1o4j96K52j31L7O0k5k67
$$ y = [167, 106, 119, -134, 420, 118, 131, 194, -121, 38, 32, 242, -27, 109, -98, 85, 197, -184, -42, 42, 102, -109, 57, 274, -135, 238, 249, -77, 53, -174, 115, -54, -180, 46, 117, -225, 320, -155, -79, 95, 204, -108, 88, 80, 0, -32, 2, -32, -189, 116, 97, 63, -188, 119, 207, -1, 10, -93, 88, -116, -117, 13, -40, 43, -107, 97, -21, -125, -38, 72, -71, 263, -30, -68, 243, 118, 125, 203, -58, 142, -103, 191, 143, 231, -54, 85, -54, -148, 53, 157, -43, 110, -72, 134, 158, -223, -273, -31, 170, 3, -134, 5, 75, -298, -317, 35, 100, 93, -30, -83, -96, -84, 178, -100, 225, -392, -146, 72, 12, -87, 160, -181, -85, -116, -51, -162, -108, -128, -83, 230, -34, -181, -41, -140, -8, 49, -57, 26, 97, 57, 16, 80, 6, 192, -75, 63, -128, 18, -13, 51, -261, 284, -149, -111, 93, -209, 94, 73, 25, 35, 66, -80, -105, 85, -79, -187, -207, 0, 109, -60, -8, -13, -70, 42, 116, -59, -144, 178, -121, -146, 155, 186, 122, -74, 178, 47, 84, 144, 119, -148]
6894a48K27J01j76rJ5J76j38m9M9m3j27K18k11k99L06K50q9o0K65m00K37lqq1
6918CN9l54J56L19l82K36J04l70l3M70j26j19J99l07K38r4L3k14L16m6l9jqq7
6942d7m3j5L80m55L41j25k11Q9J84l32Q7J55l4k1j41M23n47L29p0O6Q6M4l7p5
6966C1k14K47j53N6n9j20K04M8j48M6J47q4j72J25o7P9j17K99p7j8O8k79J87k12
6990a83K46k47J4%R1P3J29J36q3l21J00Q3n8p4J0P9M2k86L67m0k29K01K0l45L14
7015C9j1j33J14J28r5Jj54L56m14K00l47L43k01K1nL22l36M15l21n7J38l3J30
7038A00%J0l24R1J7J91n9Q3j97M6L26l43j04J48l9L44k84J52l64J87K17R1k25
7061F4Q0j05p4j29J26J66l12K14J94k48k5p6P9L12m91N1J70p3K29j71K9o1p8o1
$$ y = [-148, 79, 180, 4, -5, 10, 186, 48, -1, 48, 5, -122, 96, -115, -414, -108, 142, 53, -7, 258, -142, 95, 92, 84, 3, 62, -292, -136, 183, -199, 37, 141, -229, -262, 208, 82, -37, 162, -145, 93, -1, 32, -182, 134, 88, 49, 48, 40, -47, -90, -105, 275, -180, 161, 36, -175, -86, 98, -234, -147, 8, -26, -47, -188, 235, -312, 17, -53, 13, 99, 143, 106, 31, -183, 64, -89, -33, -92, -212, -8, 40, -108, -62, 85, 1, -171, -46, -113, -34, -151, 148, 71, 53, 121, -158, 29, -183, 63, -184, -170, -170, -79, -6, 123, 259, 176, -145, -45, 38, -20, -94, -84, -5, 37, -249, 118, 78, -151, 50, 70, -275, 39, 28, -105, 9, 137, 42, 43, -111, 245, -169, 31, -316, 27, -174, -153, -158, 164, -172, 243, -78, -135, 3, -30, 100, 100, 110, -214, -123, -106, 85, 26, 109, -88, -42, 284, -59, -163, -15, -54, 290, 6, 158, -206, -19, 198, 289, 64, 144, 39, -35, -164, -38, 128, -184, 30, 224, -24, -49, -125, -46, 266, -225, -174, -4, -77, 152, -19, 10, -51, -129, -190]
7085a90K13j78L20o7P6J97j99j6j23m4j16K90n3P6l45M07n25M58j60l7j26J42
7107@J68N3j13k6n5j11O9%O0L99k87j28k23M81l11j1J14j58R6K3j89J78K91k18
7131A02k41pl2K88Q8l37L8Q4N9J10K6j7k14O3J6q6K61j02K22m37J61R9j79L39
7155C04k49m8l16L25l2J31j15J07j09k12M68j80j43K50l6L8k20O4Q0k11K18j61
7177d7J06j07R3j96P5KO9K07j21J59j90M4N1k97Q5K31p9k32L55k08L7J29j55j29
7201a18J46q6N8L7j46J84K6q2K51k85j79R3J05k02J85j85L11m05L91k0j03M0k3
7224gJ1k0j17L13j86J47J31k79j32K20Lq0j09J36J49m12N05j39k2j22P0n9K07
7247B08k00k27K64m5j50J18P0k45K97j93L18k53J9J80k10J71j61r3J3l2K79k63
$$ y = [-190, 23, -155, 165, 98, 174, 371, 172, 156, 33, -11, -127, 163, 110, 186, -159, 248, -277, 181, 21, -16, -142, 0, 168, 221, 108, 82, 27, -84, -15, -15, 45, 444, 157, 29, -194, 287, -24, -35, 79, -79, 17, 40, -149, 29, 320, 102, -139, -146, -178, 110, 198, -139, -101, -17, 42, 152, 178, 161, -53, 10, 26, -60, 201, 99, 321, -116, 45, 144, -35, 304, 55, 7, -309, 16, -16, 115, 0, 107, -2, -214, 254, 74, -69, 181, 145, 183, -37, 27, 107, -104, 114, -47, 59, -48, 45, -151, -76, -74, -5, 202, 81, 240, 50, 94, 145, -152, -67, 164, 85, -147, 208, 0, 37, 166, 11, -118, 28, -58, 0, 37, -109, 75, 101, 19, 270, -15, -194, -101, 4, -198, -13, -198, 113, -292, 99, 79, -24, 16, -7, 4, -16, -133, 180, -6, 141, 272, -7, -139, 81, 84, 4, -105, 31, 180, -232, 273, 134, 112, -10, 60, 1, 208, 8, -219, 45, 0, -150, -32, 38, -207, 90, -103, 215, -38, -19, 161, -49, 122, -39, -132, -119, -151, 128, -135]
7269a35k1J6J12O6j48Q8J52r5j93j48L69mj40L28j46k42J09l18K17l0J48j04K39
7292A20J2O5l07J70k52L77l49K54ON1j73k12M36k95m7J63m8K0K09m2k04L6O9l44
7316b85K95j12K78l59L64l89K67J53l47m2N15n59J79J22k18J23N1L7j21O8J29
7337A49M6k19O5J48k00K43K00o65J17K07J20j98K21l09j22K35r5R4j96p6J51j22
7359b06L21J98J18m19j2P0j46q0J82R7j07J90m9j65J67j97L26j81j3M7k96K28
7381G3k55J23p3L0OK85k54r8L8K79r6k38M1K24k52j15K19k5K41m8m1j18K05l27
7405a76K70k56L24j98J97l48j29M6K06L5m2jJ94J54k17j1n6K73l58J13l05M39
7427A54l4kj31j72K32J10k8k44j96J73R6J91k10N5l5j82J67o0J56Q3k51K58j42
$$ y = [-135, -156, -140, -28, 38, -110, -22, 130, 35, -158, -306, 63, 59, -81, 247, 101, -141, -32, -350, -133, -163, -15, -119, 120, 132, 197, -110, 60, -192, 185, -164, 90, 96, 147, -26, -238, 198, -97, -144, 19, -29, -9, 200, 158, -46, -10, 59, -285, 10, -102, 176, -183, 181, -208, 59, 212, -135, -177, 338, -221, -42, 80, -138, -15, 36, 73, -48, 20, 149, 195, -24, 41, 189, -11, 232, 432, -233, -116, 91, 211, 13, 234, -75, -197, 38, -57, 37, -159, -235, -84, -206, 115, 313, 431, 12, 0, 70, -76, -156, 26, 123, 16, 206, 157, -8, 159, -38, 288, 107, 94, 141, -155, 73, -182, -59, -132, -102, -96, 189, -65, -163, -125, 154, 58, -180, -139, 85, -167, -282, -63, -88, 153, 105, 64, -54, 151, -176, 94, -162, 162, -36, 161, -187, -316, -270, -64, -29, -71, -72, 122, 276, 59, 48, -8, 265, -93, 20, -285, 154, 120, 118, -13, -185, 47, 157, 129, -115, -311, -138, -42, 149, -61, -6, -41, -223, -56, -116, 40, 123, -128, 130, -12]
7450a2l8j44K15K6l9l7p3O6J15J10l59m7K27J27k48J5k1L22r7m3P7p2j6j83K32
7475A03l41J75jJ91j28N7q4j7L7o5J4K85k86K5q3M25j96m9M6j53K82j52j58L3
7499d0kN70n13L4qJ25l2r5j59j39L89M0j56k8K46j88Rl3o3J97j33j52J73j69L21
7524A94q0k25%L1j18k9L17j26j33q4M09k25k71M93k32J40j43O1j16P3K27l09J31
7547a5m9P0Q9j99KJ68k37K23j97J14o4j55J61j09K47j08J34j5j07m5Q1J28j71
7570e4qQ5j55K34j67K68k53K13J21l33J18k39J07M30l43j70L95k04J04j88O3j23
7592i9N9k9K76k47J36k2j34K11j67J82k12pO4M0o5M36n92L33k03k13K06JK58m7
7616A65J5k2n7j76k3J61j15j21K42N1k06J28K26k53j68N9P9J41j74K16k20J02
$$ y = [-12, -50, -194, 21, 47, 8, -29, -102, -36, 79, 189, -170, -217, 10, 137, -111, -96, -117, 205, 108, 65, 142, 70, 54, -129, 103, -238, -63, -64, 127, -1, 56, -28, -45, -8, -73, -59, 226, -60, -35, -118, 307, 111, 62, 108, -45, 237, 85, -73, -40, -42, 528, 15, 49, 41, 166, 134, 39, -120, -259, 130, 170, 14, -14, 232, 44, 53, 20, -43, 154, 21, -131, 42, -127, 194, 114, -111, -111, -80, -198, -227, 90, -36, -169, -253, 156, -69, -340, 153, -79, 61, -82, -21, -137, -64, 163, -146, -15, -64, 6, 95, -104, -102, 66, -171, 52, -145, -31, -95, -250, -89, -198, 49, -59, 75, 60, -47, -92, -11, 117, -54, -62, 23, -132, 102, -65, 203, -50, 163, 284, -49, 69, -170, -63, 367, 24, -146, 249, 45, 149, -39, 24, -99, -40, -69, 207, -40, 96, 74, -60, 151, -16, 166, -46, -53, 11, 51, -14, 422, -170, 163, -40, -253, -47, -46, 212, 165, 180, 158, 101, -75, -98, 63, -52, -173, 69, 120, -86, 42, 268, 15, -153, -94, -15, 126, -48, 168, -52, 50]
7638E0J19O3p7j69J27l9j8J52j0k26K16j79R5k32J03K23p0o7l32L26j92L52j10
7661A05m7j74K47l10K51K61k85j11j38J74j1J76k38O1M0M2m4j7j95J56j56K29
7683A6j62J95j94J93J13k49L11n34L45j12J55j59K21j69N1K7NL1k21J13j34K37
7705G9j77K03j18r5K13O4l87L02J9k2jj32J87k63O5o1M31l61O9N5j52l0Q5j10
7729a37M22n41Q8J31K7Q4k5j6k01L25J8k66K6qJ91l58J09k1J10J66Nq5M3j87R7
7754cJ5NJ9j93J18j35J22J61L9l79K73j24M1J0k98L74Ok9J60l13J09o8j01M20
7778B29l15O4J4K03l73J49J32j43j36K06l1Ro3J02j55p9R6J67N0k16J29J42k31
7801e0L46m15K35j01l0O5j35K23q4j16R5K42k61m1m1j20L27j52p2J68kJ7M4k60
$$ y = [50, 169, 232, 155, -14, 113, 74, 56, 208, 198, -28, 188, 9, 104, -128, -25, 198, 128, 61, -271, 55, -137, 215, 105, 58, -116, 131, -179, 72, 333, 48, -63, -201, -27, -38, 138, -100, -39, 1, 43, -1, -18, -213, -57, -213, 16, -146, 49, -145, 48, 161, -88, 223, -311, 34, -78, 77, -82, 139, -30, 21, 48, 53, 84, -137, -24, -158, 79, -98, 105, -13, -108, 105, 169, -218, 84, 103, 81, 80, -52, 135, -128, -63, -124, 307, -54, 15, 70, -82, -112, -27, -137, 285, -256, -168, -37, -10, 74, 49, 33, -168, 157, 175, -91, -65, -73, 118, -240, -131, -152, -42, 124, 129, 44, 87, -100, -3, 12, 17, 36, -157, -39, -174, -52, 109, 148, -231, 42, -82, -41, -31, -329, 45, 51, 22, 182, -131, -22, -90, -191, 229, -86, -22, -8, 195, -178, -29, 103, -40, -176, 30, -1, 8, -55, 47, -108, -187, -91, 76, 126, -90, 39, 181, -50, 296, -119, 116, 15, -15, 50, -85, 138, 54, -62, 33, 275, 14, -27, -68, -188, 139, -13, -85, 83, 81, 98, 142, -118]
7825a18J85L0o7l01K03k66K67K08j42L5k73L45k02p8J40J52J88n30L18J10j39
7846F5l19O17k13n24L73k32L01j92J63J42n6j9J46k46k65L9L88Qk78K5N2j23J01
7869d7j41N6J05OJ26j70J05Q4j92K55r5l10K34K21k64k1o0K85j78J56l32RK72
7892A04l34J40J90L1l56K96k71N6J79n0L7j03M07n12Q9L9K39k02O7k39K83kj58
7915g0J0j27J29O8J50m4M8k66k43K08J21K8O6R9j35n4J8J41k44J32L9j46j48Q5
7939a35Q5K29k52K0J55m08M28k69J05P1r9j46M04j57k23J34o7J73n0j34J68j81
7961a49J47L3J34j13j23J66o6o9k3L09k65mj42J70J77l31lN4L67k16j35L0k51
7984c03J48J73K03r7j10P5k74J31J8N6K98n63J68R8O1j65N0M5J69k51j76L15r8
$$ y = [-118, 67, 97, 30, -271, -68, -334, -67, 141, -1, 34, -239, 106, -96, -174, -34, 118, 306, -224, 94, 204, 65, -254, 363, 150, -374, -1, -233, 68, -124, 39, 181, 125, 106, 252, 6, -259, -220, 168, 176, -102, -77, -25, -148, -47, -188, -132, -27, -21, 105, -65, 40, 124, -68, 187, 92, -218, 16, 237, -27, -48, -108, 177, -1, 155, -177, -168, 104, -230, -90, 100, 131, -225, 71, -200, -144, 35, -15, 22, -81, 326, -186, -97, -58, 181, -21, 46, -193, 90, 88, -70, -60, -187, -58, 10, 160, 116, 164, -102, -345, -137, -16, 12, 78, 177, 42, -12, 6, 147, -97, 35, 74, -72, -220, -135, -50, 179, -73, -53, 102, -306, 122, -147, -42, 29, -70, -216, 188, 31, -192, -58, -125, 48, -2, -136, 32, -149, -2, 31, 165, 52, -71, 95, 29, -40, -63, 246, -19, -23, -165, 5, 182, -149, -152, -98, 269, 53, -82, -52, -303, -155, 18, 221, 124, 14, 89, -185, -54, -36, 20, 318, -245, -77, 21, 82, -83, -33, 12, 181, -70, -246, 69, -29]
8007b9J15j49K61k85j7J07j42L96l00j3j41L82k0k63J80j18R4k34L6J33j0PJ70
8030A60j37O9nQ0j42j40O3Q7r4Q4K12l55m3L02m46M84m2m8O0k17J76l41M34l79
8054a78K03J2o9N7j09M9O5K7j15J69l58M11O8n05K62j05J14m6J43l11K26qJ01
8077A03J32l98L40j8k84J36q6K99l39k99P03k15R3k12J48k22J63j31R6j30M7o5
8099a39L64k28l7j14j4O0p0k0K99k54L27Kk32J37j97k1J99l2j39j50K35r4mJ63
8123D1j75n7J64r6J27KO0P9k01L6Q9j54L66j83k12p5J96j41J27j74P2L15m05j27
8147c26K63M8l5K00l72Q8R5jJ88l17J58q8Rj63N3O0J85j4o5R2O4Q7k40j55M89
8172C03j44l19P6K88k48J69j45R2Q8l60K52K24q1n1k31L68p6m4k63
$$ y = [-29, 86, -63, 198, -87, -104, 3, -139, 257, -43, -56, -197, 185, 165, -98, 82, -36, 58, -176, -140, -7, -17, -10, 160, 23, 92, 87, 167, 25, -115, -52, 35, -59, 25, 237, -118, -161, 141, -305, 179, 137, 89, 149, -68, 108, -233, 201, -178, 25, 37, -32, 25, -84, -35, 30, 57, -58, 111, -247, 164, 232, -273, -11, -116, -2, -48, 95, -216, 10, 2, 103, 235, -163, 177, 159, -125, 11, -75, 224, -115, -414, 289, 74, 167, -45, 103, -119, 44, -87, 9, -121, -74, -139, 225, -3, -40, -154, -168, -108, -178, -198, 101, -153, 174, 176, -56, 81, -116, -137, 62, 30, -109, -259, -24, -118, -122, 41, -134, -191, -27, -123, 4, 6, 66, 145, -56, -20, 69, -85, 281, 98, -114, -189, 7, -134, -7, -181, -109, 206, -199, -326, -63, -15, -50, 150, -222, -134, -39, -40, 148, -169, -11, -99, -90, -253, -200, -140, 45, 31, -34, 58, 122, 209, -31, -186, 303, 159, -160, -84, 204, -44, 125, -20, 72, 160, -200, 52, 276, 195, 144, -87, 281, 205, 161, -102]
8191a02
$$ Imaginary data points
##PAGE= N=2
##DATA TABLE= (X++(I..I)), XYDATA
0@%%%%%%%qQqJ6k4L2m0N6o4Q0j04J20j44J76k09K49k97L53m16M81n55O42p39Q47
31D52r68J102j250J412j592J793k011K251k514K801l116L459l833M243m690N178
47B717n712O296o940P647q423R281j0235J1302j2500J3857j5410J7201j9297K1792
61A1576k4819K8582l3408L9857m8964O2902q7123J40941m74570K67743R66220
72H48937n65420p22281L0188N88790O6593k25727j08294N1787l7559J31051J29490
83A87555j43160k76867J11351L11569m534l21608m5743K36511Q6352j58572q2246
94i9392N0361O7840K7993J9567p2251j02924N7120J61746k4237j51181m660J25681
106E5663R330r5199q302N7934k5649k1536O8670P101j08709k2149J18154M2072
$$ y = [0, 0, 0, 0, 0, 0, 0, 0, -8, 0, -8, 8, -16, 16, -24, 32, -32, 48, -56, 64, -80, 96, -113, 136, -161, 192, -224, 257, -298, 344, -395, 452, -516, 586, -664, 748, -844, 949, -1062, 1189, -1325, 1476, -1640, 1819, -2014, 2229, -2461, 2717, -2995, 3301, -3639, 4008, -4415, 4866, -5369, 5933, -6567, 7290, -8120, 9081, -10216, 11576, -13243, 15339, -18069, 21788, -27176, 35726, -51397, 89544, -385026, -117283, 848937, 283517, -438764, -408576, 180214, 246807, 21080, -87214, -35427, -72986, 58065, 187555, 44395, -232472, -121121, 190448, 185914, -135694, -181437, 55074, 141426, -17146, -99392, -49031, 18809, 46802, 66369, -5882, -108806, -51686, 110060, 85823, -65358, -70018, 55663, 64993, -30206, -38508, 19426, -6223, -27759, 40911, 48012, -60697, -82846, 35308, 77380]
118G7380j09273l8204J01338K5221q8837k635P7306k2764p2448N4507R0988p7189
130A5390j21039P2575J31695n5232j26619L4322J09687k0676q9679J0917N9611
141B0952q263k2224K2318k59m0495P194N6155l551n9183K225N6401j152n0691
154b0573n082L5480L189j9762O555P739k1576n197K8986N500k9497o24L2293k273
168A5158l1722M347K9155o209k3508J2588K1485j8362k3712J7353K0773j5067
180B279j4958J2747O543j4151j205J6073n113j8017J3698K4145j6230k9687J3600
193a0276L2235o667k9193M045K3446l665j7133J767P931k555n08O718n002j4667
207a3524N135J9198l399j8376J478J7101J618j3744k564R594J556k737L631k542
$$ y = [77380, -31893, -70097, 31241, 56462, -32375, -35010, 42296, 19532, -52916, 1591, 92579, 15390, -105649, -33074, 98621, 43389, -83230, -48908, 60779, 40103, -49576, -38659, 20952, 12689, -9535, 12783, 12524, -27971, -20777, 35378, 31827, -27356, -25131, 31270, 30118, -20573, -25655, 9825, 13014, -6748, -193, 7546, -14030, -19227, 9759, 15259, -14238, -14862, 17431, 15158, -16564, -12217, 16938, 10729, -12779, -191, 21294, 2932, -20780, -3427, 17346, 2279, -12679, 68, 6611, -7540, -8745, 7328, 2215, -15802, -2104, 22041, 5811, -23876, -10276, 21959, 15292, -13901, -9856, 13590, 9925, -7208, -5441, 2490, -65, -573, 6145, 1143, -13524, -8389, 10809, 7410, -10966, -9488, 7613, 9231, -4513, -7077, 2517, 4073, 1336, 4967, 2425]
221B425q674K312J1249m76j4003q54J4377O27j4387j376J0301K468n668q18M735
236B238k519l863O063L324o171j643N781K129o474l166N817J928m979K74L930
251B669l572m137L481M821l154n573N016N336n106m177M396L422k043j918K441
266A902M11l988J072M102k470l768K436L022k325m305J210M756j750k502J806
281c91P90j243N89J213k31j616J708L239k911m405K696M170j889l990O19L505
297A853q27l466M45J824q1K2M63j158q87J620K252r17l036K082L034j801k792
314a370Q32K481n15k091J59R91j012o27P57k9j251N23J977m72k618J214L016m51
332A514k097L63J653j95j420j89J307k92j96K38p70r61J61Q86j61j634N42J984
$$ y = [2425, -6249, -3937, 7312, 6836, -7167, -8021, 6356, 6983, -7404, -8780, 1521, 3989, -1679, -2497, 2238, -281, -4144, 1919, 5243, -928, -2571, 3210, 5339, -1135, -4301, 1516, 3444, -1535, -1261, 2669, -903, -5040, -1559, 3262, 108, -5465, -449, 4887, -219, -4396, 0, 3422, 1379, -539, 1902, 2313, -1675, -603, 3499, 1029, -2739, -303, 2719, 394, -3911, -2701, 2055, 305, -2197, -391, 399, -844, -255, 958, 727, -889, 819, 4058, 1147, -3258, -562, 3608, 1719, -2271, -1652, 1853, 1026, -2440, -1995, -171, -252, -230, 233, -925, -1812, -192, 2060, 1143, -1893, 189, 3223, 1422, -1370, -538, 1943, 1428, -663, -504, 487, -525, -1152, -395, -424, -1675, -1152, 825, 353, -2265, -1051, 1965, 1514, -583, -220, 1433, 1238, -182, -371, 936, 644, 448, 686, -84, -1045, -884, 2, -159, -1793, -1251, 733]
350G33m22j839M25K071K04j168J62Q55k32k50K84J36j186J16P75l96j342J4R69
369i1L26j095j59O55M41m48K22M92k01K82P09N6j252l07Q47J154j419j067M40
388d15M59rl24n27j06O82J49o7n82n84J415Q11r8n76m16P95M33n47j73l92O4Q12
410H04J21j618q12P43J346k6j588k11J063o8L11m38j94O17O68N45n56j376L82
429b87J648J59j493j701J089J954n41k352n2Q88J231k65j288K88O06N53M52m66
447D23j378N23J558O02j522j443P84K199m55j972o69R30J698j124j371L66O43
464b08Q9J07O7j02p03M59K194k04k220q84J646K160j460k584N17K389m23j529
482f89n57O49N18j34M82n07j464K02K782R03k472k080K205L413k027l183J10L044
$$ y = [733, 311, -1528, -1103, 968, 1172, 4, 166, 1021, 789, 539, 823, 959, -227, -111, 664, 268, -1074, -1060, -91, 235, -860, -1019, -364, 77, -371, -149, 343, 142, 424, 1133, 1189, -63, -370, 477, 1631, 212, -855, -415, 44, 35, -289, -816, -922, -240, -91, -158, -740, -1324, 91, 902, 804, 228, -188, 607, 1040, 493, 320, -72, -8, 804, 925, -693, -1505, -762, 584, 558, -1030, -1241, -178, -246, 65, -373, -567, 50, 718, 1263, 707, -669, -287, 1361, 1520, 27, -1674, -585, 1369, 828, -1524, -1576, -688, 543, 278, -1010, -722, -116, 437, 889, 423, -955, -432, 1126, 1728, 206, -1237, -453, 1746, 1291, -681, -1350, -420, 1278, 154, -1217, -851, -208, -119, -12, 55, -47, -750, -291, 1903, 1699, -521, -1405, 241, 2401, 941, -1643, -1126, 1263, 840, -689, -1246, -597, -79, -213, 269, -238, -1702, -1500, 1282, 2185, -287, -2367, -162, 3251, 1224, -1959, -1849, 1195]
500A195J254k159k386J112J623n9p73m28n63P22R43N19j595j679J511K881n44
517A574k811n17K747J652k324k172J351J950m90j750k48J182m48o66J173L51j546
534i92q73K445J551j691k645J476L275o94k791m81K492N99j821o13P07m3n08R15
552C08J77j362j111K067K207j829k658Q12L099P06k815j302K188J445j016j760
568h44L66Q65j4o5l32r04L12N96R34q50j712N20K176M75j982j027J423K129j014
587A052k105K68J599L04j084o82P38K04n84K17M98q93o37R49Q49q68j337R36J813
606A237m63j699L49J255K24o74n45P40K29o35M7J61m38j19J87M78J9j335O20Q39
626D77k8o49o50Q66O93k12n80r7L75O33l62n53J03P9L6n8J54p80J08L55M16o00
$$ y = [1195, 2449, 290, -2096, -984, 639, 580, -193, -621, -1184, -462, 481, 1000, -595, -2274, -763, 2118, 1574, -1237, -1754, 993, 2645, 321, -1851, -500, 1450, 960, -790, -1038, 144, -304, -970, 203, 554, -992, -1865, 580, 2131, 440, -2205, -729, 2546, 1852, -939, -1420, 1072, 1671, -150, -763, -56, -99, -607, 308, 485, -877, -1988, 79, 2286, 457, -2201, -1389, 1710, 2416, -399, -1701, 487, 1932, 916, -844, -478, 387, 373, 308, -24, -928, -616, -20, 914, 64, -1648, -1128, 1048, 1523, -459, -1486, -63, 2066, 1052, -1053, -785, 814, 1118, 34, -648, 90, 294, -290, -73, 425, -468, -1105, -156, 693, -175, -1512, -576, 1237, 774, -925, -576, 679, 903, 229, -316, 424, 653, 18, 65, 226, -212, -331, -144, 334, 353, -982, -362, 477, 449, -200, -850, 16, 709, 497, -83, -180, 195, 828, 466, -87, 16, 95, 131, 73, 227, -553, -445, -90, 326, -274]
648b74l75M37P51l19o75J53O29K51p36J53M58j66q8M1K3k09j97J97J66m67l1K51
670b7J11j14m35P5P01j40n04L26L32j59r1K4K37q9k19J28l13K50k77j0j48J17
692b25J01Pj86K15J10n3J23o2M7M9L27j19k34j00J13L4n3k57j40N20l0m70n9j31
716d73L47j91K88l07k84N79M39j54m49K12L62mr9k21o6N53m94j14m28N12N7l17
738b52m9p9J10P9J4j65K9L08L86l42J99p5K98j90J29m32p6O4k10K82l31j6Q7K84
762E2l50J3K55j51M7K7K64j6k13QL52j66J86j35k34q0R3K10l17R6J60Jl07k88
786d93K47J74J17k84M31l62M27R0k16P1M0o1o6j20R8o9l2m0r1l4k2J0j13J58j66
811c06Q1L01j21K80j35j1J63o8L0K11l39m73L38K0l1nrM8j76L7J25m15J52N24
$$ y = [-274, -649, -212, 539, 220, -455, -302, 327, 578, -158, -5, 453, 287, 199, 240, 263, 54, -143, 54, 220, -247, -278, -27, 84, -30, -465, -390, 311, 171, -333, -7, 325, 166, 75, 99, 336, 247, 28, 156, -157, 93, -184, -194, -342, -225, -124, -117, -303, -88, 22, -31, 92, 30, 77, 126, 453, 334, 100, 0, 113, 147, 94, -163, -303, 217, 187, -283, -342, -473, -126, -317, -29, -336, -620, -41, 398, 244, -205, 7, 369, 365, 266, 45, -21, 532, 38, -76, -504, 8, 65, -252, -301, -380, -270, -191, -177, -342, -313, -5, 381, 39, 238, 163, 461, 271, 400, -32, -108, -44, -254, 28, -303, -319, -232, 52, -298, -285, -30, -181, -134, -107, 157, 141, -72, -64, 288, 122, 308, 173, -61, -141, -48, 162, -155, -59, 101, 102, -205, -493, -246, -72, 45, -239, 192, -170, 257, 347, 131, 202, 242, 181, 115, -5, 93, 24, -8, -48, -139, -173, -195, -185, -298, -140, -306, -225, 76, -45, 235, 100, 89, 252, 184, 214, 425, 86, -387, -49, -29, -60, -65, -74, -26, -202, -165, -40, -455, -303, 221]
835B21J52l65K12k85K34J25J1o2j81m0K16l80J33k33M6L38m59J97n2K17m25K99
857h1r6J04j6j46K33J0K12K28k13l14J31l8K37J18n83K51j54K65j79J75n27J52
879b31L28m24M21l8j40J72O6o0K57j43lr4K58m23J00R7J05m12j85J32J34K4M9
902a0j58K77k72j58P9L04j28j12K96p2L0l25J68O3J33k64R0K01J93p16kJ74R4
925a15J50k5k4j59K74n3j08k3L8K07J25j31k16m11L72J37k20r9L65M0k33J8j81
948b72L82k58k39M31L93k92o4k33O92m36m5J13j31M20p93K91K93l32l24K39K04
969C9J76o14K29K12j04k81N00J63k91m03N47M49l20m65k29O16J44l26k74K02J73
990A43j04k77L6L39l70O6J26Q3j01j69M41jm36J96L68P4k50m03M04O0m1n06J33
$$ y = [221, 373, 8, 220, -65, 169, 294, 305, 243, 62, 22, 238, -142, -9, -242, -196, 142, -317, -120, -172, 45, -380, -81, -177, -73, -89, -235, -2, 8, 220, 448, 235, -79, 52, 14, 251, 369, -214, 37, -117, 148, -31, 144, -383, -231, 97, -327, 94, 56, -84, 88, 154, 94, 351, 208, 205, 111, 369, -54, 46, 143, 248, -164, -349, -217, -83, -59, -10, -168, 109, -163, -321, -242, 62, -66, -178, 118, 46, 76, -249, -81, -18, 115, -149, -59, 142, 335, -381, -383, -209, -115, 35, 10, -14, -173, 101, 48, -60, -83, -45, 162, 287, 156, -60, -471, -99, 38, -182, -281, 84, 124, -109, -91, -272, 110, -148, -387, 44, 437, 145, 81, -152, 540, 104, 59, 172, 41, 461, -332, -41, 252, -80, -404, -165, 39, 215, -399, -170, 42, -62, -343, 157, 320, 29, -374, 173, 622, 302, -163, -392, 224, 368, 42, -232, -30, 143, 39, -238, -202, 137, -233, -167, -41, 42, -59, -228, 213, 212, -224, -28, 340, 414, 164, -239, 165, 225, 184, -322, -189]
1013a89L40j53k38K7M12n2l95J91K93p5m11M5N60j70l81J75M09k10l62m5N42k50
1035F3m22q2O92J81l42l80N37K24n01jJ12J41l93J89M56p8k39m51N11R6j51n27
1057c65l9L77j33j24K1K62j36l0O9L57j0r5l03O4K66l91M2K67K26l03l53L29j48
1080a50kk40L41J91l50k67L87L24l68PL47j45N2J31k88K38k70NJ90R9l19p3K46
1103H6qk70J76K48k23j28R3R9j7k00M59k09R4Q7k82k3J37k19M8J61j99J85Rm50
1127c46N2K25J20k41J03m2MJ43P3j97o1k2M08k44K98k72J07Q4j34o8n2L01l78
1150a39R6q2J31j56j13K95j49R9M2N5Pk45J99K2Q9J56k32k7j09K42j19l4j82K36
1174H2J3m27K68J26j06L63M1m82N2J83j42L5KP3N6j7o4j53m5J90K8k21m2J87L
$$ y = [-189, 151, -2, -240, -213, 199, 147, -248, -57, 236, 161, -250, -205, 355, 185, -196, -21, 388, 178, -184, -229, 313, 63, -359, -441, 251, 432, 90, -290, 247, 471, -30, -31, 81, 222, -171, 18, 474, 396, 157, -294, 217, 313, 162, -365, -404, -27, -160, -284, -263, -1, -137, -167, -98, 259, 249, 154, -149, -85, 181, -210, -168, 99, 325, 22, -331, -2, -150, -152, -392, -51, 140, -210, -477, -90, 234, -134, -127, 220, 75, 127, 258, -30, 208, -62, -57, 133, 232, -87, -160, 86, 78, -192, -16, 232, 9, -119, -26, 73, 56, -144, 315, 106, 200, 287, 5, -18, 119, -100, -52, 109, -90, 95, 104, -346, -294, -69, 51, -190, -87, -129, -125, 18, 91, -106, -167, -189, 219, -25, 273, 1, 108, 192, 58, -10, -62, 239, -139, -43, -125, 6, -150, -263, 32, -117, -18, 24, 79, 86, -159, 40, 62, 151, 307, 75, 48, -61, 181, 62, 28, -154, 82, 95, -332, -64, 62, -44, 319, 360, -122, -70, 113, -29, 6, 8, 81, 137, 120, 56, -97, -142, 48, 76, -145, -187, 0, 3]
1199Ck11M92l38N2n0K22l44L77k71K05p1r0j61K96j01j4K0j94L03j1k43QJ77k92
1223b36K14O9J16l04l8K30K98m34J58j87K04n9L55m24K35m6j65J91r1k74l4K43
1245B1j58L40m8j73R3m1J09q8k09K04j6o1j3o9K34J8l03J96l45J98J67Q9j10J8
1269E3m4P8m22N01j44l05J86j24K62q2P5K9j57L8o2L79p17N64K05j52k42p2J26
1292b7j0r5J03O6k96M43j8l53L75j05M1p8N7r8K81m31J85m4rP0J38k91k11L68
1316F1j81M13m26L8k0oM9M34l49j60O1K7N4J44J14o4j70K15j72j25j91J10L4M0
1340g0M0L56k80q6K03j72jK07j64o2J18K91n49J82m7Q9j47p5K76k51J25r0J41
1363C4Nj14m4M00l07N4j05J81J46n16P7j8L0K35q5K33k36Q5J15l3j63j28J98j94
$$ y = [3, -208, 284, -54, -2, -52, 170, -174, 203, -68, 137, 66, -24, -185, 111, 10, -4, 16, -178, 125, 114, -129, -121, 56, -236, -22, 47, 163, -141, -179, 51, 349, -85, 73, -114, 90, 31, 386, -38, 197, 151, -14, 177, 86, -188, -222, 21, -137, 203, 155, -18, 75, 34, 143, 55, -154, 50, 34, -27, -40, -109, 125, 143, -160, 36, -309, -111, 56, 145, 35, 53, 9, 87, -335, 166, 22, -283, -97, -221, 41, -41, 34, 63, -94, -56, -118, 261, -456, 108, 313, 161, -81, -153, -27, -37, -132, -29, 37, -259, 184, 166, -187, 188, 83, 124, 46, 103, 5, 286, -145, 40, -4, -13, 57, 195, -96, -307, 61, -120, 293, -133, -95, -115, -121, -72, 362, 13, -147, -86, -59, -5, 139, 253, 189, 19, 234, 62, -63, -254, -144, -110, -70, -30, 326, 46, -40, 163, -9, -10, 197, 33, -29, 89, 380, -169, 13, -34, 55, -92, -167, 109, -142, -17, -107, 34, 39, -75, -119, 281, -26, 28, -77, 104, 250, -266, -189, -207, -177, 58, -27, 206, -30, 55, 170, 137, -26, -154, 44, -150]
1387a50J13l0J49l6J08L7K23k04qj53o8O6Q0m76K94k43Q5N69l65j9k77N3L51K6
1411A25M9Mol02j0L44m21J29q0J55J18o1j37n1K65k07K22j76Q2j77J11k44K15
1434e3j48J53j8Q3j29L73l26R6j84L75k24Q7J9j95J44k9L08l25J90j38j12M00
1456C47j70k19j9N4k0r9L51k26J09j19k21J46j46J54K77j82p9j56M34j22k77K46
1478F3M1mq9K1r8K12k36n7K73l00K38k96J66L02k22R2j17l9j07J11j27K59j0l5
1502D1j11J05j92J96j62K3L71l07J04J6k72L32m80K72L4K27k12K6J90j22J18l00
1524a03O4P1k97J16N6n2q0J67K41r5k80J33Q6j8n8j11J69j63J35K04n6Q1l07J62
1548F5o7O9p7J6K4K33l52%J52k60K35j29k4N2J18k56K77L7K1k73K49j57R5k26
$$ y = [-150, -37, -67, 82, 46, 154, 191, 414, 210, 202, 49, -19, 47, 127, -349, -55, -298, -213, 356, -9, -28, -305, -252, 99, 125, 174, 178, 172, -130, -140, 204, -217, -88, -168, -13, 105, 44, -93, -144, 121, -86, 136, -40, 42, -135, -24, -268, -53, -201, -48, -66, 17, -112, 261, -65, 31, -153, 222, -2, 85, 104, -91, 53, 24, 332, 7, 197, 59, -53, 347, 177, -42, -61, -7, -27, -126, 225, -1, 108, -11, -232, -86, -232, -78, 199, 17, -62, -218, 216, 94, -183, 63, 104, 100, 11, 32, -66, 146, -90, -147, 126, -174, 64, -232, -66, 236, 14, 106, -11, -50, -157, -46, -173, 86, 76, 41, -70, 35, -157, 39, -123, -100, 271, -36, 68, 84, -188, 144, -336, -64, -30, 197, -15, 11, 201, 79, 197, -103, -39, 32, -265, -149, -93, -145, -225, -58, 183, 88, -192, -59, 27, 9, -49, -160, 9, -154, -19, 185, 129, 210, -97, 65, -2, 67, -10, 6, 30, 263, -89, -89, 63, -197, 38, -91, -115, -63, 55, -201, 76, 113, 134, -139, 110, -47, 48, -178]
1572a78J24Q4k21J31J87j48J53n1k0k06K55j24P8R5l98K18LJ42J49O0k90n5J11
1595I9%l7K02l53J04r1P0j73J43K37j74j11K05l32K07M1l3j15J68j90K25r9r4
1618a01J96j51K92k26p5j12K33k11P3J4j85KL10j24k6N2R1QjQ0k85N0J37m8J23
1643A16j02J45j24j27L41j20j36o6J3L83k44k86J42J87r2j29o5J40J87J44n6m45
1665a94K05%j25K3nK89k48P3J61m23K06K12j07j39K3j92J05J54Pl30J82J20K5
1688B2k23J56K99j08k68r3R5J84k7k32lJ43L24n95K01K04M7j89R6j78R1K05j10
1711D1K66o11L83Rj36R4J16j90R0J53k58K41k10oK04n7R4j71L4J1o4J40j94J24
1735A03q9L2l85M68j12j69n8J57l05L44j82K38J27k41K77j79N7P8j18j62R5j90
$$ y = [-178, -54, 30, -191, -60, 127, -21, 132, 81, 61, -145, 110, -14, 64, 159, -239, -21, -18, 124, 273, 333, 43, -12, 99, 99, 62, 264, -89, 15, -76, -6, -179, -36, 201, 27, -84, 121, -211, -4, 37, 4, -111, 57, -133, 92, -7, -101, 95, -56, 236, 10, -65, -177, 56, -155, -82, -68, -253, -251, 59, -65, -91, -39, 52, 60, 59, 139, -146, -96, 41, -7, 116, 14, 159, 35, -92, 249, 129, -7, -73, -60, 323, 79, -207, -65, 122, 30, -99, -164, -24, 163, 307, 251, -194, 11, 11, -114, -91, -96, 193, -55, 18, 179, -244, -38, 174, 67, -72, -49, -241, -136, 18, 25, -305, -123, -3, 22, -201, -45, 254, 146, -122, -215, -120, 64, 37, -195, -198, -55, 269, -326, -125, 79, 126, -63, 33, -145, -54, 151, 41, 307, -304, 79, 88, -48, 46, 162, -28, 62, 215, -43, 198, -12, -18, 186, 129, 223, 52, 86, 97, 33, 173, -21, 103, 14, 46, -339, 129, 17, -152, -210, -53, -358, -14, -196, 42, 169, -72, 205, 26, 83, 161, 43, -119, -24, -214]
1757b14L61p6j26K95k57J27m01L63Rl07k43N61k04J77p2J5j8P6K49m31j46O1K07
1780Fj71L17r5r9j2J14j36J11p0j08j04Q5N49n55J29L00l97J54k9j58N42n06K38
1803A05j01k74L92k64M0K06j19n4K14mk55L6K4o3N1L2m8K61m6jj45N6k26K42j07
1828d8l1o6J72J71o7J77m36N3j32M44N4l46J50j49M48j92k70l1l2J89P8j40O8
1851F4j21R4k47J75K79n63L67p7J02m2p2J70l51J33JjJ61n9l3K82m34L12J8k3
1875A35l14j31N56m93K51L3r5J24k35K90j26M0j02J13j03j64J02Q3K8m1K05l93
1897b37L62j01k75K08m8p7K94j94j74P2k5L66j0Q9lk22j8P9n3l7j03J63k28J93
1921B1R1M3k03p5J85j16J55j22L0K6k53N31n47N3L71k31K23j25K18j30m20K85
$$ y = [-214, 147, 71, -55, 240, -17, 110, -291, 72, 81, -226, -469, 92, -112, 65, -7, 8, -10, 66, 315, -116, -262, -201, 6, -165, 152, 57, -42, -54, 60, -76, 35, -35, -143, -247, -162, 387, -168, -39, 261, -136, 18, -11, -169, 373, -133, 105, 4, -270, 122, -142, -102, 104, -15, -69, 145, 141, -114, -78, -54, -117, -66, -34, -82, 179, 133, 132, -13, 43, -183, 59, -48, -79, -145, 27, 198, 131, 308, -128, -75, -207, 237, 291, -55, 95, -54, 394, 202, -68, -99, -131, 58, 136, -4, 64, -57, 37, -210, -35, 244, -319, 48, -29, 73, 31, -41, 129, -222, -89, -88, -89, 72, 13, -20, 262, -172, 140, 158, 135, -179, -310, 246, -247, 4, 37, -58, 66, -169, 121, -5, 35, -67, 46, -57, -221, -119, -36, -8, -49, 156, -237, 125, 24, -251, -43, -91, -168, 126, -68, -242, -170, -195, 171, 161, 250, 247, 25, 7, 86, 33, -4, -107, 56, -172, 21, 112, 155, -48, -123, 62, -54, 101, -21, 9, 35, -218, 313, -234, -181, 190, -41, 182, 57, 275, 145, -275, 10]
1943A0l74N89l55N0J26o7j40K25j00j42K66Q8j56k60R1N66m58m6J82l26K52L1
1965E2o5L0j51L20j68Nr2K34k65L83j24j94m4J69r6J59J29j76j08j74L69k34o2
1988a03J18J34l55J04J94k22J78O5j44P9j14K21m7J9J47j11l67K57M2j27J26p9
2010A5K02j69J1j6j32J07J39l14O3j6K15j61PK66k14j28RP2M5K83n80K64K25j60
2034C3PJ34n31M28j90m9j6J82k07K20p3J35q0qN3l02L42j15j28L34mk67N2r7K13
2059F6LP9j0j62q6O5j83J01K20M3k22K06J64k83n0L6k95K79L6P9k42l0K52j39
2083g3N9J90q3J57k45M0J58n0j40Kr1p5J33p2K15j01J30j11j15K84j5n0j60j22
2107a35j27N71m22K01Nk38K94o3j45j14K94j82J62k52K91l93M16j68N3o5r5K66
$$ y = [10, -364, 225, -130, -80, 46, -21, -161, 64, -36, -178, 88, 176, 20, -240, -149, 417, -41, -87, 95, -231, 21, 52, -13, 17, -134, 186, 18, 23, -69, 165, -100, 283, 159, -35, -79, 90, -6, 153, 282, 106, -2, -176, 193, -41, -103, 15, 149, -206, -102, 92, -130, 48, 113, -31, 48, -66, 155, 108, 127, 274, 163, -204, 53, 95, -32, 94, 15, 217, 48, 59, 43, -89, 18, 157, -157, -94, -110, 105, -56, -49, 217, 3, -125, -116, -44, 1, 284, -296, -32, 193, 33, 40, 174, -357, 71, -119, -168, -184, -2, -209, 11, -62, 73, -7, -15, 38, -264, 78, -37, -165, 169, 165, -102, -50, -147, 66, 69, 148, 138, -24, -110, -45, -228, -127, 93, 136, -86, 120, 284, 1, -49, -13, -308, -29, 7, 86, -156, -186, 66, -73, -14, 176, 93, 250, 5, 45, 203, 153, 13, 15, -76, -151, -18, -90, 125, 24, 154, 43, -72, 212, 197, 147, -13, -135, -262, 309, -113, 88, 93, -145, 149, 86, -59, -173, 121, -61, 101, -151, 140, -253, 163, -5, 48, -17, -112, 154]
2129A54j89p9O1J53r0N1J6j41j8J12J65k6J23mj56p1M2J1J89q9k77J37l09K23
2153a2j68J35J61j4r5mJ3k21J33P0k05J70J68r8n2l2L88k91r8M9J42k47j44L62
2177A10n8m9m5j28R8K45k83L64r4j77K14k49J38k15J46K22j73K16l5l67K63k12
2199f9J74k82J34J21m4m09L25J38m5J81l52K52k70J01K4J74Rk14p1Q9poK5k00
2223b22N4L34P4j37o1j63L44Lr5k89K20j23K28k98M11m61L80k13K19j36J71k26
2245A4Q5j43M2J41n5Ro5j41k7J38q7L8k8n5J53J23q3N3k60J39j19k1j33J51J00
2270c1J70k3n00N43k94O2n2K75j36j05O1j27Q6N8j9k22K03l07L50q2J05j49J70
2293C6j40J73p0j97J85L1k75M66j1P6Q1l25n3J7J91J16l52k97M32J0r2j65L2j25
$$ y = [154, -35, -114, -53, 100, 10, 61, 77, -64, -82, 30, 195, 169, 292, 288, 132, 61, 103, 114, 303, 214, -63, 74, -235, -12, -180, -45, 116, 102, 7, 3, 16, -205, -72, -2, -207, -37, 131, 33, -19, -51, 337, 46, -52, -3, 139, -108, -252, 110, 52, 3, -42, -170, -72, 173, -110, 254, 160, -17, 197, -52, 86, -129, 17, 239, 66, 282, 247, -120, 143, -69, 105, -177, -43, 78, 34, -375, -50, 88, 43, 224, -128, 124, -146, -45, -21, 153, 162, -52, -123, -34, -41, -47, -22, -222, -168, 166, 240, 103, 42, -121, 223, 226, 131, -158, 62, -61, 167, -131, 280, -181, 199, -14, 205, 69, 240, 14, 99, -44, -2, 139, 84, 93, 28, -113, -140, -2, -89, -51, -79, -134, 19, 142, 59, 112, -148, -9, -128, -149, -282, -131, -31, 139, 116, -384, 159, -135, -73, -125, 150, 14, -91, -30, -157, -71, -13, -32, -254, -51, -358, -8, -90, 15, -134, 36, -104, 69, -1, -198, -13, 18, -257, 209, 198, 274, 355, 30, -23, -6, 185, 301, -51, -348, 84, 94, 2, -163, -131, -256]
2317b56R4K3J19M7J74k31j41J41j03K98j39j89M20m56M28J6J91m78P1J62j63m3
2339a5Jn4N9N0p2q4j28M94k28O0J37j56j45J69J31l38O1j74J09J13J45J98j35
2362A98j75j2K95m1j50j25j97J78o5K52j22r5JQ4kL20l54J05j97M16l48L00k39
2385B7M2J85k39n4j3J29Op3r8K23k7K37m63J80l08L03L4Nr5l4r0J23k2l8J21j29
2411f8j76L64l7p1j6k13J31O0J16k53L45n40P6K62n7L5P2K02jl99L96k93j0k2
2435i7J96L2M3l07L22J04j94o2j30K63k18K46n6n6k26M14m09J10M8j67R1K53j00
2458A00j34M9K12m12N9K85l27R0p8M66k99j25j0o3L21j51K8m9L1j6O6p2n1J68
2482H8q3p6JN0L5K6M87l94j1N4j47L7k07K17k04M4M40l02j44j90R7M10k35k2l17
$$ y = [-256, -162, -139, -20, 27, 201, -30, -171, -30, -133, 165, 26, -163, 257, -199, 229, 245, 436, -42, 29, 191, 28, -15, -14, -68, -9, 41, -31, -115, -243, 251, 23, 83, 220, 64, -81, 88, 219, -119, -58, -232, -123, -10, 135, 333, 198, 23, 11, 306, 265, 115, -10, -207, -29, -94, 158, 36, -59, -58, 26, 24, 344, -10, 95, -102, 314, -34, 266, 27, 69, 254, 15, -39, -52, 77, 83, 10, -88, 135, 108, 345, -118, 62, -246, 57, 91, 96, 1, -33, -123, 0, -22, -60, 61, -68, -244, 120, 83, 12, -4, -217, -86, -26, 90, -163, 182, -358, -282, -20, -77, -42, 30, 232, 231, -168, 228, -65, -75, -97, 99, 131, 174, -133, 189, 293, 99, 37, -93, 170, -48, 198, 142, 86, -140, 274, -135, -25, 23, -144, -53, 200, 100, -34, 15, 227, -185, -126, 159, -168, -78, -156, 310, 11, -114, -124, -187, 134, -17, 11, -38, -7, -23, 43, -29, -80, 88, 5, -71, -70, -20, 15, 41, 528, 134, 123, 177, 30, 67, -140, 77, -127, -83, 357, 55, -89, -279, -182, 228, -7, -29, -346]
2507c46L87j1J48J16ll00K20l98L04K28k69n0l59L62j48J28K5J27k07k52J82m2
2529a58M6O7L83m60M70k80k34M21o3k49L7j9j35K33K42l40l0R0J14l5r6L3o6J10
2553H1o5R1k11N5K8k5P9PJ6j32k90L85j73K92j07j98K22Q7j59PK10K2l92J45n5
2578h0J91rk13J58p9m1P9o9J34l71K15O0j26L9J21O6j03k3r3L84k85R2N9k69M43
2603B80r4n12K83J36k01L09J07l43j36J9J06J49J77l08K19l59L07j02j83MK38
2624I6nn6kj5O0l27N10r6j86M3K32l42J4rpN5O1J49K0J8j93jK0j39Q5k3k26o1
2652c25M69j10j56J05rk61M53j39P0j20j81J43q%O3J36J59k98j38K30J91l12r0
2675a28J82J0J66M8m76K18n1P9Q7l90L78q7o1o0M71k43Rn0k29L0L67l60j80N22
$$ y = [-346, 41, 30, 178, 294, 291, -9, 211, -187, 117, 345, 76, 26, -333, 29, -119, 9, 34, 161, -46, -298, -116, -158, -112, -45, 338, -122, 348, 68, -166, 255, 192, -57, -20, -39, -174, 59, 301, -39, -69, 21, 135, 100, 4, 37, -29, 81, 16, 107, -104, -49, -21, -46, 33, 40, 56, -76, -366, 19, -154, 138, 31, -167, 55, 142, -17, -10, 200, 222, -170, -25, -80, 111, 102, -111, 47, -32, -73, 6, -63, 71, -300, -85, -25, -151, -112, 9, 75, -28, -51, -144, 240, -45, 47, 106, -163, 280, 186, -326, -43, 93, -108, 201, 308, -35, -171, -152, -46, 103, 280, -28, 191, -168, 139, 37, -146, -142, 96, 91, 35, 33, 18, 78, -249, 261, 165, -21, 22, 254, -88, -74, -83, -90, -35, 26, 175, 195, 213, 20, 19, 39, -100, -15, -38, -264, -325, 144, 34, -122, -17, -26, -287, 166, 27, 97, -23, -204, -61, -69, -69, -6, 130, 289, -9, -147, 83, 274, -38, -128, 54, 64, 230, 278, -198, 20, -31, 48, 135, -255, 123, 36, -25, -85, 386, 143, 152, 102, -127, -97, 270, -90, -270, 252]
2699B52j27j41J40L8M3m7j42R9l52R4J2J58k6P4k0k32K01j53M04k83J76k54L66
2722B80m2l00Q1P3m4j75O9PN6l70M40k9N3k13n3p7J35L10j91m4m4l4K81j8j52
2747aj37j0Q6o1p4N35n38L25j74J56k41K28l01L77j46M9j60MK97k59J03J71j33
2770I6P9j2j90j0J09K3r1j25j35P37k64l78K32J43l22K14k31J01j7J25j15MJ17
2793I0j13J58j43K0j12M26n07l5L54k36J90k28K57NJ27k91J88j27j68J98l28L72
2815I7p0k28J69j2J81r5l14L75j40J7J67l93K04r7k7J64j96M33q7k07o9K32j68
2838f4J47k22O8J15J60k76q8J34J23J88m74J41p8J24k21M10J0m06M65j63R8j20
2860G1K78m18j2P9j05K4O6k62K17K11j69j96J30N9k25L03J63l76N0P2N0M0j03
$$ y = [252, 125, -16, 124, 162, 205, 158, 16, 115, -237, -143, -131, 27, 1, 75, 55, -177, 24, -129, 275, -8, 168, -86, 280, 238, -62, 19, 92, 48, -127, -58, -51, 5, -365, 75, 46, 99, -114, -167, -244, -109, 201, 10, -34, -78, -112, 169, 151, -1, -138, -148, -62, -123, -197, 338, -200, 125, -49, 107, -134, 94, -207, 170, 24, 73, -87, -83, 214, -45, 58, 229, 96, 175, 163, -27, -37, 72, 95, 4, -121, -256, 481, 217, -161, 71, 214, -108, 106, -125, -24, -41, 84, -31, -27, 90, -23, 135, -8, 12, -100, 326, -181, -216, 138, -98, 92, -136, 121, 126, 253, -38, 150, 23, -145, 53, -275, 97, 27, -201, -32, -44, 137, 42, -272, 103, -37, -20, 147, -246, -42, -139, -166, -2, -198, 235, 148, -59, -128, 104, -64, 83, -139, -71, 44, 204, -72, -160, -26, 97, 285, -189, -48, -126, -2, -223, 187, 197, -209, 256, 93, 191, 71, 349, -69, -81, -2, -107, -83, -17, -279, -62, 149, -20, -216, -86, -27, -252, 51, 214, -162, -112, -40, 10, 50, -53]
2883e3Or9K75k26K97j95M7p9P5k42J09N9L1j8N7M5l23K80L90n59L0j1J82n6q0
2908e8p8J92Q7l50L02p3j81n0O2mK28Q6j58j50Q5K10l63L81O3K8l65J03j01K34
2932A30j11J23kk64K35k62J57k5Pq3L04m32J86l3J10k64L00k0J44l56J12R0j8
2955B8L00j69j36k11K37j4J2L7m22L22l06L31p3p8R3O9j84L99l21j48K19j74J16
2978g3N4N1L7Lp0L6nm11J60K74J63l41m7j6Q8R7J48k75J39j9j50L63r6r4k7J84
3004A73j43L36l23K1k7L4q6K96l06K21l37M10j46j18p3J73k31o5Q3O1Q4O3j48
3027d8J02j34K67p5L4j69L23m46K16J00l00Q2J3O3q8j01J51j16J72k45K34n7o3
3050h5j40L96j34K7j10O7N7J1k45R2J71l66L89j8k28L02k15j20K44j04j42k7P0
$$ y = [-53, -47, -146, 129, -97, 200, 5, 52, -27, 48, -194, -85, -26, 5, -13, 44, 89, -234, 46, 436, -123, -93, -104, 78, 22, -58, -136, 56, 143, -207, 95, 22, -159, -209, -147, -151, 77, 163, 5, -145, -60, 150, -213, 168, 231, 259, -106, -3, -104, 130, 19, 142, 140, -124, 111, -151, 6, -19, -12, -95, 209, -223, -37, -70, 40, -224, 76, 56, 200, -156, -44, 46, 28, 328, 159, 23, -188, 49, 35, 47, 84, -338, -16, -322, 9, -64, -142, -49, 20, -164, 235, -86, -234, -15, -189, -73, -19, 32, 69, 72, 2, 38, 33, -378, -218, 56, 219, -122, -169, -185, -97, 0, 148, -127, 12, -7, -157, 206, 110, 16, -11, 173, 30, 366, 43, 64, 37, 71, -15, 281, -25, 196, -141, 269, 123, 5, -68, 105, -126, -191, -108, -47, 37, 100, -48, 54, -80, 187, 112, 146, -23, 300, -146, 70, 170, -130, -48, -35, 28, -60, -161, -10, -126, 46, -199, 35, -22, -85, -225, 171, 37, 64, -46, 21, 78, 89, -156, -64, 107, -259, 130, 112, -116, 186, -29, -149, 95, -9, -151, -178, -108]
3073a08j1r2J04J42r7JNj92K68J4J6j20L02k7j24k2q2K87m08J52o5j17O5r4J81
3098b2R4j57j7L12l65P3N6l5Qj4J1K47j43r9K49j49j15j75M48j96J27j72J16q5
3122cl73L11j16J37O4l9J48k13n3R7j28K69j59j07K27J0oJ42l34j14K52n4r5J10
3146b7k37P0J43P4M5L3j06KK51k07N1k03K51n8n7j5m4n5nR4k95J21K08j19K1O8
3172DJ18j35k09P0L74j61j56L17j31J01m6j71J3n6J24K00l5j82k75L56j78J77
3194A19l41L17l30J84J59J1r8R7k13J20j09L6k8K11N8k71N9J11r6J7l7J02n9r7
3218g8nn9K82l02K13k11Q2Oj26J43K0o9K08j9k62J96J37r5R9l09N13m33K84k54
3242c9K15k58K12l17M11l63O6K73l56P1JL57m1j63j33O9K4N5J31l37PK8K40m09
$$ y = [-108, -119, -211, -107, 35, -62, -61, -56, -248, 20, 34, 50, -70, 232, 205, 81, 59, -23, 264, -144, 8, -57, -174, -109, -203, -22, 72, -85, -102, 210, -155, -82, -26, -61, -53, -67, -56, 191, 48, -51, 198, 49, -66, -241, 207, 11, 138, -34, 82, -3, -376, -65, -181, -44, 20, -19, 129, -84, -137, -40, -168, 101, -58, -165, 62, 72, 66, 208, -126, -240, 12, -42, -137, -27, -264, -194, -51, 23, 68, 101, -5, -3, 248, 41, 92, -111, 140, 82, 25, 10, -34, -89, -94, 0, -295, -174, 34, -85, -64, 4, 122, -13, -222, -152, 222, 61, -95, 222, 91, 192, 146, -25, -12, -68, 56, 256, 221, 39, -236, 120, -58, 119, -222, 95, -235, -51, 108, 119, 21, 118, -95, 25, -84, -48, -76, 135, 193, -78, -19, 92, -4, 13, -24, 78, 19, -78, -83, -142, 140, -162, 51, -160, -78, -72, -198, -55, -35, -104, 104, 85, -177, 19, 156, 61, 160, -149, 364, -69, 215, -39, 176, -82, 130, -187, 224, -139, -73, 200, -156, -85, -84, 273, 232, 69, -64, 5, 29, 84, 215, -122, -115, -87, 153, -256]
3266b56J71J20k47J83j6J43J03k16o1J31j39K83k82K58k66K5j82K41k7j86M21
3287B01l47n2k7J09q2O8J6J67J15j5l01J66L23q6l29o0K46k10o2L2O8J43M2M7
3311A72o0QO8j32l7pO4k35J27j93K38J9k1K02l05L92k57j10L57k43J02j67r1K7
3335h2J51j48J85j81J48j97J10j92J91J47q6Rj72j01J20L00m24J31q7K94p2j2
3357C2j21J98o3j8j52K32J00j00M5K2P7m94L20J13j64O7kL5k48L78k26j46R5j40
3381a60K31j12P0J99m16O9J2N5l8N9n8J57r9r1J21k73L36j9q0L32k65Q2r5J53
3405A70j40j82K85J12k11n7j96K60r6J66J4l12PK12K8j35L84l60o2M0M9M4J54
3428A74k18J01l6N7K0j13P0J15J01j72j0k81L75r3k07j79M42j94O1P6k39Q3QJ37
$$ y = [-256, -85, 35, -212, -29, -45, 98, 201, -15, -76, 55, -84, 199, -83, 175, -91, -66, -248, -7, -34, -220, 201, -146, -198, -225, -116, -198, -130, -114, 53, 168, 153, -148, 18, 341, 255, -74, -134, 112, -98, -160, -128, -60, 83, 125, 172, 112, 120, 188, 56, 19, 12, 76, -159, -32, -225, 13, 32, 11, 213, -92, 300, 43, -67, 290, 47, 149, -18, -109, -82, 69, -79, 106, -75, 73, -124, -14, -206, -15, 132, 46, 55, -117, -218, -98, 202, -222, -91, -178, 116, 44, 32, -89, 109, 46, 28, -124, 108, 208, 108, 153, 175, 252, -242, 78, 191, 27, 94, 92, 127, -121, 257, 31, -115, -20, -160, 71, -41, 29, 228, -188, -119, -107, -52, -90, -31, -89, 68, -31, -122, -1, -274, 62, 43, -37, 295, 30, 112, 17, 170, 30, -152, 133, 245, 34, -23, -219, 41, -55, 111, 125, -187, -180, 32, 60, -75, 309, -51, -113, -73, -24, 20, 174, -44, 57, 21, 78, 98, -15, 55, 170, 271, 99, 89, -192, 183, 90, -117, -296, 146, -48, 13, 89, -150, -67, -59, 78]
3452G8j45J33R6o1n4l5Q4j13j09K02j0K06k46l9j61J96Ql1P9j10j63M9J52J69
3476A75m63M84k93J93n5k06J88k76M99j98J36J02k96jl2M8J52k23K89n0l36K94
3498A31k88L63j24j51J71j01n4J22O4j8j77o8K61k10J25Rj4P2p5j85Q6J73k04
3521i2K17j69K01j61K57p2m5j30mo2j10N7K0Q2j20N0K16j3l21R4l9J42j37J90
3545E1L36m30n8K90L7k12J00k08q7J15k2J68Nk76J22J4J05oj27K72o9l00M53l44
3569g1l7K59j13j2L25k67j55K68k19L0J18J1J15j80o7J50J3q7N2j89J74k30K97
3592A85n0j05k35K60J9k54K09K03k27p6j14L51l01j75K81j21M01l52K9N3J6P0
3614F7P5k37k44R5J84J89k79m7L21O2j5j54J8j17J00N4ojj07o8J5k9NP5N8k51
$$ y = [78, -67, 66, 162, 101, 47, 12, 96, -17, -126, 76, 66, 272, 26, -13, -174, 22, 30, -1, 78, -32, -195, -146, 6, 175, -288, 196, -97, 96, 41, -165, 23, -253, 246, 48, 184, 286, -10, -11, -43, 5, 157, -66, 223, 173, -163, 131, -157, 206, 82, -69, 102, 1, -53, 69, 133, 115, -62, -130, 131, -79, 46, 55, 41, 113, 38, -147, -61, 112, -92, 125, -44, 157, -4, 253, 181, 136, 6, 2, -60, -170, -113, -93, -11, -131, -81, 135, 122, -199, -105, -144, -2, -139, 51, 387, -43, -101, 189, 226, 14, 114, -94, -181, -66, -88, 80, 85, -191, -69, -55, 50, 44, -83, 189, 120, -180, 273, -71, -108, 151, 38, 26, 351, 84, -71, 197, -22, 8, 126, 137, 252, 72, 5, 155, 168, 81, 133, -56, 118, -112, 185, 135, 30, -205, 55, 74, -180, 29, 232, 5, -71, -185, 166, -135, -310, -29, -150, 251, -101, -72, -19, -3, 67, 142, -95, -339, -244, -60, 129, -150, -197, 124, 186, 171, 17, 35, -82, 18, 72, 66, 65, -42, -110, -95, -124, -119, -44, 14, -237]
3640b37J96J92k68K11j59K22j71k08J90J46L2r3j9O7J33k05k2L8j9j49J38J78
3662A93k04J64j41j53L26l08j46J48j2K72k97J85P2j09Q3R0k73L5Q1J37o8R2q0
3685H7j11M10n38N1j20L68j01j1r7p4j66K23K16r6J8K85n89K77q1j6r6R8r7J85
3709B5J55o4n2m12L29K04m15P8K19K40n90K45j74J73j42n7L19k00N6j38o7M70
3731B02k10j81N3L39nk70J39m5k59J67J44K45n98K25K74m22K85L80k37l13K97
3752B10j7k57K3K04M8l14J42mOK8j07j9j19m4L8J91J0O8j58K18k24K8K32j29j44
3777i0K06n4o6NN1J28j79Nr5M4j04J62Q6j84J93l4k00K28J4N3K7m90J64J77j52
3802a05k45L90k61L77j89Q1j60j48J61j34K64lk0j75rK86K4N4r4j91K40k39J80
$$ y = [-237, -41, 151, -117, 94, -65, 157, -14, -222, -32, 114, 146, 53, 34, 101, 234, 29, 7, 45, 26, -123, 15, 193, -11, 153, 12, -141, 185, -123, -269, -121, -133, 139, -158, 27, 99, -10, 73, 163, -110, -75, 6, 143, 75, 167, 87, -24, 386, -152, -101, -221, 147, 46, 35, -62, -136, -302, -79, 137, 41, 59, 344, -245, 32, -49, -65, -161, -63, -160, 25, 180, 116, 64, -348, -19, 185, -230, -152, 67, 307, -283, -38, -212, -39, -181, -238, 81, -119, -63, -201, -268, 202, -8, -189, -136, 203, 198, -72, 67, 22, -237, -70, 74, 319, -279, -54, 220, -202, 83, 463, 226, -87, 210, 193, -64, -41, 163, 211, -103, 39, 35, 41, 69, -38, -57, -176, -220, -182, 9, 19, 87, -71, 147, -77, -49, 183, 54, -90, 116, 62, -4, 1, 52, 180, 1, 6, -89, -45, -149, 13, 99, -85, 108, 74, -126, 102, 116, 169, 196, -294, -130, 47, -105, -350, 40, -221, 156, -33, 48, -112, -260, -99, -233, 31, 28, 8, -167, -176, 110, 134, 188, 94, -97, 143, -96, 84]
3825H4j25j62K78J08k48J90K9o8j20m7k3J11j8j11K86r4K27j54Oj12j09J54l6
3848D6j59K36J30k55k7M0oJ74l41m9J38K33k99J54q4L3NJ31k99J54K93l46j25
3871b23J79j22O3J22j54j4K16j00P2J43k73O5j19p7J76O8J87l25jk2L76k17l6
3894a6l00K62rr6j54L72j67K33j52Pj33K8K65o2j13j42K75k78K18N6L2Mm03K48
3918b5j09j60L18L7J7NJj04L2Q6J42l10J34j09p6K05j56M27l39q0k41J22M30l89
3942a42M40l30n9L1J13j66K96j20j5k6j63O1Ok06M95j44j56O3m6K06j74M04m69
3965a01J29j47k07L86j69K60q2j64j18L91k53m7R0L29l48r1K98k93q2O0J35J48
3987A24j16j74j66L23J26j33j82L08r6k29K87O1j42J69q7pj19O3J26l16L24j57
$$ y = [84, -41, -203, 75, 183, -65, 125, 154, 86, -34, -81, -104, 7, -11, -122, 164, 70, 297, 143, 149, 37, -72, 82, 46, -113, 123, 253, -2, -29, 11, 5, 179, -162, -211, -73, 160, -139, 15, -69, -36, -31, 100, -199, -45, 248, -98, -223, -44, -166, -103, 19, -135, -149, 67, -33, 39, 182, -91, -26, -145, -222, -46, 22, 209, -116, -117, -139, 237, 20, -16, -316, -54, -63, -159, -313, 59, -108, 125, -27, -20, -153, -125, 140, 78, -35, -177, 98, -180, 38, 94, 126, 130, -273, -25, -134, -294, 24, 61, 78, 83, 84, -20, 12, 98, 240, -70, 64, -45, -121, 84, -72, 355, 16, -64, -305, -183, 247, -142, 298, -32, -91, -60, 53, -113, 183, 63, 48, 22, -141, -80, -74, -280, 215, 71, -85, -22, -68, 138, -36, 368, -101, 28, -119, -326, 60, -109, 151, 69, -95, -213, 178, -75, -122, -32, 297, -51, -142, 156, -137, -219, -159, -24, 124, 8, -166, -332, -9, 117, -16, -198, 110, 14, -215, 72, 133, -9, 160, 73, 66, -53, 10, 136, -180, 144, -13]
4009a3K5l02K72J5N1KK56j67j90J74j3k93R3J46r1j28L02j39k09K47j29J81j34
4032d4J72k98p7K92l2r9N1K17l12K49l78K3N49l49K83n87N23j84p1m2kj43N48
4055B89j45n5k95j09M05l06M31k85j64M64j77J38n1j94R9L8K7K49j91k06J40j52
4077e0o2J73l1j01J22k76K76%j05K1o2J31l1j54P6J87j72k9RJ38M4lj72J7J9p2
4103a07j4l0J18K2o7k39M17p2O7O6j99K61k81P2P5Q3k02K24n49M98k45o2M71m49
4127a42J78k74L17j52j11J71K95j50n2k19j80K78L17k14J09k60K20k77K59J37
4147B50j60k50Qk2L1n5jK27j14N2M7r5J73J02k74M3K15j88K5Q6j94K02k75L21
4171A54Lm51K03r3K94k23o2K31k00L47k60J44l01K72n6J12k01J9O7Q0l67K26M2
$$ y = [-13, 12, -290, -18, -3, 48, 50, 306, 139, -51, 123, 110, -183, -90, 56, -35, -163, 139, 0, -209, 38, -91, 90, -44, 128, -170, -247, 45, 13, -86, -35, 182, -130, 119, -259, -236, 313, -36, 247, -340, 183, -1, -72, -114, -116, -259, 289, 144, 89, -206, -315, 90, -216, 215, -70, -234, 230, 53, 191, 140, -54, 45, 83, 110, 359, 168, -38, 102, -50, -112, 61, 30, -71, 51, -225, 51, 51, -54, -33, -95, 36, 5, -149, -73, 114, -58, -87, -78, 60, 104, 101, -71, -54, -35, -107, -121, -151, -33, -11, -78, -317, 100, 28, 95, 161, -38, 223, -58, 14, 89, 172, -30, 194, -355, 143, -102, -164, 307, -142, 36, -238, 79, -73, -184, -13, 282, 132, 80, -139, -319, -41, 276, 62, 171, -89, 131, -146, 113, 250, 90, -160, -152, -174, -143, -198, -199, 28, -86, -34, 13, -82, 91, 193, -81, -38, 177, -11, 14, 100, -94, 108, -167, 154, 157, -294, -91, -184, 110, -113, -175, 56, -144, 203, -57, 87, -214, 58, 2, 114, -87, -68, -1, 79, -288, -62, -20]
4194b0l7k10n7M98k35Q9j21K74r9j8L0O7j83L5p4J83q8J28k50J42j24L24j73j18
4218c7R8L9q7K36k07j08J90l49L74j78p0J12J69k29J39m55L79j62J22n2J03K2
4240D9j52L4J12O0k88L36m12K83k60J56kK6m5J11%k60J56J29J21j16j13K39l10
4263a46M7L04l51K73%j81j7J12J9L1j99J42R4m3L8j35n0K47k73n2K64k37J37K16
4287B40o8k61L0J36J6Rk10J05N2O5Q0K8p1K2r6M7k83K87j3j64K14p1j17R3l22
4312b52J72J07K26k51r5L34j61r3J64K5o6j74PK34j19k43L93j30j80J46N9j89
4334h6l0J34q8j75K26k54L62P9r4j07K3o2N6M6j17j30J05K08J0l03J0K28o0qp3
4359a00O9J53j44rK34k99j59M48m56M67l21L19M1k75r0L38j57J51j58j41M47k95
$$ y = [-20, -57, -267, -324, 174, -61, 28, -93, 181, 82, 64, 94, 161, -22, 13, -61, 122, 34, 162, -88, 54, -70, 254, 81, -37, 61, 100, 13, 249, 42, -66, 124, -225, 149, -29, -99, 13, 182, -47, 92, -363, 16, -146, -24, -76, 27, 49, -103, -69, 43, 103, -185, 151, -261, 22, -238, -82, -84, -58, -103, 8, 8, -252, -96, 33, 154, 38, -75, 164, -146, -99, 205, -146, 127, 127, -54, -71, 41, 60, 91, -108, 34, 128, 85, 123, -12, -62, 185, -88, -140, 124, -113, 24, 240, 172, -89, -59, 77, 93, 102, -108, -3, 49, 114, 194, 222, 151, 173, 77, 124, -159, 128, 115, -49, 165, 94, -23, 70, -252, -80, 27, 253, 2, -93, 241, 80, -13, 151, 176, 110, -64, -57, 177, 58, -185, 208, 78, -102, 44, 103, -86, -116, 18, -70, -245, -19, -273, 89, 168, 74, -33, -10, -72, -16, 30, -87, -217, -112, 96, 106, -197, -187, 41, -19, -27, -100, -31, 122, -22, -31, 203, -96, -255, 193, -263, 204, -117, 202, 243, -32, -122, 216, 59, 210, 52, -89, 358, 63]
4381F3k75R1K53l72L88j68J9J0l8n0J60j20P3J60q2j69K17o6R8j18k27J32qk63
4405b92J48LM13j64j5P5K9k81J12k16j23N28l57J31j16k0K07J08nk83j94L04k60
4428b68M48l9j02L3j21J96j36N1k56K49m4LJ19k94K43J78m33j50K76q9L77Pk90
4451d2Q5q8J54M5j30m7o1K30o5k30J77j58K88k30J1q4J19r2O9J06j8K70l55M5
4475aLj24J92J23r1k82JK26j35K5KK36l25J07P7j7J31k61K0K35m24L43J31n00
4499c08J25J16k8J60J31k60L26r8M6l39P2J95J05L3j23Jm4j95J80k85J55J93Q
4522A66k03q0N1lJ76j35q3J02K15k03m0n8K64l58O5J19j01N6n9M9ok8m7O8J92
4547A19p6J04k73O5j55Q3J82J12j18n9l5J30M8k45P7M4K54j81o4J2j33RJ22J04
$$ y = [63, -212, -121, 132, -240, 148, -20, -1, 9, -29, -79, 81, -39, 34, 194, 112, -57, 160, 94, 192, 74, -153, -21, -29, -292, -144, -141, 272, 108, 93, 168, 197, -84, 28, -188, -311, 217, -140, -9, -125, -145, 62, 170, 165, -118, -312, -8, -268, 180, 141, 39, 72, -49, 147, 11, 62, -194, 55, 11, 14, 133, -161, 82, 260, -173, -323, -47, -136, 241, 248, -42, 43, -45, 109, 154, 24, -23, -84, 146, 81, -149, 28, -130, 158, -72, -61, -145, -26, -118, -49, 57, 39, 309, -46, -1, 2, -122, 70, 193, 102, -180, -179, 47, -88, -63, -61, 175, -150, -43, 34, 17, 148, -113, -93, 142, -282, 61, 192, -308, -183, -67, -95, 65, 196, -64, 262, 164, 210, -129, -57, 138, 243, 276, 153, 154, 110, -85, 95, -190, -35, 158, 166, -37, -117, -66, -69, 107, -28, -111, -9, 206, 3, -37, -95, 169, -189, -124, -5, -106, -50, -109, -60, -66, -94, -141, -73, 119, 43, 147, -126, -61, -216, -133, 49, 161, 43, -16, -51, 79, 127, -118, -41, 3, 257, 76, 12, 24, -109, -100, 22, 126]
4571A26o5J50j76J01J37j59j34P5k05J32P1r2O5K5K19m67K15J79o3j05j95l4K3
4594a77K91m02J55O3J14j3n2j30J98l3P8j97j07J36N5J67j86J57j29Q0J59m42
4616b15M78l07O0Pn2r5J88j38K09m27J97Q7qn0j10J72J88j50n5Q6j05R2j54j30
4640b32P4J70K42p1n25N27l59m0J84j20k5K98j63j13J59P9l0j17P5r9k73L94j23
4663h8j25L42k72K36k15K70o6k01J77j82P9K01j95J05k99J63K72k01kq9l81N23
4685E2j20P6j32O5o0K79r1k56J15J89J13r3j90J1KK06j64J03k10J34jj08K88k97
4709h9L00k46j78K33P9N4k08J52j91J53K6Q1k54j10K70R5k16q6J07k1R1r5L70
4732C17m21K81N0k03j0k21L79r5j87%J75Kl3k7n0O9J50l54kJ70L2j03J64L2j73
$$ y = [126, 61, 211, 35, 136, 273, 114, -20, 55, -150, -18, 53, -39, 26, 51, 270, -197, 18, 197, 134, 29, -166, -200, -177, 114, -288, -133, -70, 44, 31, -21, -151, 47, 14, 92, -105, -212, -76, -21, 146, -40, 117, -12, 68, 227, -215, 263, -44, 16, 23, -29, -124, 64, -74, 135, -292, -95, -8, -16, -66, -176, -4, 184, 34, -21, 65, -40, 52, -102, -232, -158, 12, 254, 183, -342, 185, -174, -214, -30, -150, -175, 123, -40, -153, 6, 85, 55, -62, 13, -86, -359, 35, -88, -213, 129, -143, 93, -122, 148, 82, -119, 58, -124, -45, 156, -39, 66, -233, -70, 202, 1, -1, -90, -471, 52, -68, 8, -124, -59, -119, 160, 69, -187, -72, 117, 230, 137, -53, -42, -40, 166, 2, 105, -105, 29, 28, -80, 208, -89, 211, -35, -213, 20, 99, 153, -55, 97, -94, 59, 85, 166, -88, -198, 72, 167, -49, -135, -28, -49, 42, -53, 317, -104, 177, 227, 24, 14, -207, 172, 77, -110, -110, 65, 67, 34, 7, -43, 26, 176, -178, -180, -10, 22, -81, 83, 115, -58]
4757e8KJ21J25o1l12J05Q5J39j29j19Q2m0k06L00o5j04L9J53N3Qj98J97q9k60
4781b32J53J8K99j30k58K22k77M81l10M2j15K55j64L13l47M2J48k00J13jJ3J1
4803G6l25K16j22j40L23M1j15JJ24o9J04l97N25J0m03P7p4ML57Ol48L51l94J06
4827f6o7K63l70m4J94J52k73K49k4O8K70m13J28k7j51Q0P6l9J03k82M44l82K34
4850A23k23J28J13l03K22J6j06R3J10k05K2m7n7L1j14K19n1M4j25J71J3N7r5k
4874C4l1N1N4j22K22j43J48m28j06K62J02k66K93m7kK08l87J94k34J13K42m06
4896b49M28k59K11l3N9j04j1j2r9j21K50J8k08L70k85%J43K72m96m8J79j70K21
4919E6Kn6J09j08j2j1J19m9L9r5P3k24kN6K92j85m8J74j07p9q1r3L63j27q9l4
$$ y = [-58, -56, 65, 190, 129, -183, -78, 7, 146, 17, -102, -20, -60, -266, 34, -31, -135, -96, 57, 110, 118, -80, 117, 28, -232, -79, -61, 238, 108, -150, 72, -205, 276, -34, 8, -107, 148, -16, 297, -50, -8, 140, -60, 53, 52, 65, 76, -249, -33, -155, -295, 28, 69, -46, -45, 79, 10, 114, -283, 242, 252, -151, -74, -148, -144, 213, 219, -129, 222, -172, -66, -133, 130, -240, -284, -90, 62, -211, 38, 14, 82, 352, -61, 67, 40, -111, -31, 45, 6, 109, -173, 271, -111, 123, -100, 28, 141, -162, 60, 76, -30, 63, 173, -32, -10, -57, -114, -83, -197, 22, -29, 15, -110, 61, 74, 131, 36, 34, 3, 54, 108, -14, 208, 65, 213, -215, -321, -59, 43, -223, 70, 23, 21, 229, -158, 36, -198, -85, 157, -249, 179, -80, 131, 98, 157, 53, 42, 30, -69, -190, 60, 78, -130, 240, -45, -45, 98, 370, -126, -174, 5, -165, 56, 58, 2, 111, 3, -9, -20, 99, 50, 89, -6, 67, -157, -159, -103, 189, 4, -44, 130, 23, -56, -137, -230, 133, 6, -83, -117]
4945a17j45J72R0L21k83j72k8m5L40k77L44J10l20j28K17j00K87j89j33m2L36
4966B38k24m6L9j02k68L25q9M8J42J97l6j38p2J4P5j00J0n8p4J14L6o0K28k65
4990f6ll9K70j4n1j62M1P9p9N7m4k02L89Ok19L8j06j16K06j30M11J04k33k16n5
5015a34KQL2l8J59J38l52k32M47p6M9j54j0K58Q3j50k96L40j59j5N8M6MJ5j31
5040a08N6o8L48j97k05j0L70k14P1J7l95J99m5L63n40K84L3j6m2J56r3L44l53
5063d5M3j59K69n4j34j30K62K9j32oP0l38M29Kq3L1j50j14l1L50n7k21J32Q7J24
5088A74j57j46J37J43j91Q3n6OK15N3l99OL0J33N9r9J10m29K26j41R5L15j58j5
5112fk4K19q9Nj35j1Q3k79K31l7l19L02K49l31K72k1K03l92K30N6j54J03l8r0
$$ y = [-117, -262, -90, 0, 321, 38, -134, -162, -207, 133, -144, 200, 310, -10, -138, 79, -21, 266, 77, -56, -98, 238, 14, -32, 7, -95, -363, -38, -127, -79, 63, 260, 224, 86, 14, 28, 103, 3, 13, -45, -119, -5, 31, -29, 199, -66, -69, -108, 162, 148, 97, -65, -24, 55, -24, 33, -11, -213, 176, 182, -37, 1, -105, -221, -15, -145, 266, 370, 137, -79, -134, -132, -124, -92, -130, 29, 167, -185, -417, 30, -46, 3, -151, -161, 97, 180, 30, -266, 74, -85, -100, -42, 4, 8, 23, -108, -52, -120, 228, 31, -174, -184, 186, -28, 43, 60, -335, -136, -181, 182, -358, -74, -41, -57, -99, 57, -36, 308, -45, -2, -161, 108, 54, -80, -210, 52, 81, -51, -57, 13, -325, 104, 106, 23, 54, -96, -210, -241, 109, 52, -169, -37, 50, 174, 17, -129, 8, 151, -40, 43, -13, -7, 208, 261, -138, -132, -102, 31, 90, -9, 101, -328, -102, -243, -148, 167, 9, -6, -30, 189, 100, 105, -30, -41, 42, -237, -6, -43, -362, -60, 189, -142, 130, 109, 312, -80, 150, 206, 52, 155, 117, 27]
5136B7j0L2k0N6j59JK45j60q7P5m09K42N0J36k43J73k23K49M9J28j26K9j77kk
5161a26j32K86k50K85k28M7K55k14K80l69K31l1Q0p9O8J11l37L5k13M42l78M24
5183A87j18k05J57M5N5L1j11k78K35j50M2M5J35p0L9k51Q3L03J43m63K01J21j40
5206C6J03o2j08P3k14J50j35j48K65J35j42J5N1J97j25m1K2N8l10O9M31j38k22
5229d0j26L11j49Ko3J73k22J11Pl5q1J06j75R8M0J01j26j72L95J0k16K11j95K07
5253A72j41m57K80k86L93J15o7j63P7J81p9N2l23M88k74k7r9J79J31l64J74R1
5275E3J47m73K21k48K81J90k28o2K20k3j82K00j11L07o29K65J93p0j89k1K81j89
5297f7K33k59M20j20o4m6m7p0K03q5J83l05j5j11l1J01J30J03k69P3r7L23k65
$$ y = [27, 17, 49, 29, 85, -74, -73, 172, 12, -75, 0, -409, -167, -117, 19, -224, -51, -274, -25, 24, 152, 26, 55, -122, -124, -126, -258, 28, -222, 63, -165, -118, 137, -77, 203, -166, 65, 34, 114, 35, 103, 214, -123, -88, -301, 141, -237, 187, 69, -136, 21, 66, 121, 152, 41, -237, -2, -152, -110, -65, 70, 0, 39, -212, -129, 174, 317, -146, 55, 176, 36, 139, 77, -31, 42, -172, -22, -157, -305, -40, 95, -47, -32, 19, 216, 91, 50, 72, 130, -180, -111, 320, 182, -40, -166, 145, -4, -2, -65, 108, -114, -3, 4, -31, -112, -6, -181, -83, -43, 58, -68, -240, 155, 165, -51, 160, -35, 172, 31, -426, -146, -432, -39, 76, 9, -154, -77, 104, 25, 77, -246, 242, -32, -59, -158, 21, 152, -212, -38, 53, 200, -273, -52, -300, -19, 171, -57, -119, 101, 78, -104, 96, -15, 292, -337, -72, 121, 51, -138, -159, 122, -67, 166, -93, 327, 207, 143, 97, 50, -20, 183, 98, 281, -24, -39, -150, -181, -80, 50, 153, -116, -43, -140, 183, -82]
5320h2n2J68m71K47M8O4J5M8J44N7k61j2K29j99%J02j6n8K4j2M8o0L2L5J12n7
5346I3j51J00J29k06R6l51L30M7n6j32M09l14l8J19j02k3M6J82k72q2K28m66L03
5369a11L0R2n8J27Q2j70k32K33m3l5L09j71j50J27N6k42L8k5N1J09J35k25J91
5392A18r1R0l61L60k37J7r2K60q3L4r1j42L35r9j67J22J82n2j59R6qj42K87m7
5416A30l13k4K8k07J36q0L98q6K14n1l81K30K48k58j3l0L36l10j61P2l31K55K46
5439D8K00p1l4P1k57j8J02j08j27K41o4J32kk31L50m24J97J08N1Q7k21J02k28
5462i6K57l87J78p4J89k23K12Lk7K64j79n5k4j47L57k24R7M4O0l18J90j24m4J69
5486I8j58L14k49R4j70N5N0m1k07L8L52k00j26J56J05m24L42J14q9p1J64N2k03
$$ y = [-82, -134, 34, -437, -190, -142, -78, -63, -15, 129, 186, -75, -87, 142, -57, -57, 45, 29, -29, -5, -17, 31, -29, 3, 38, 150, 93, -58, 42, 171, -35, 61, -290, 40, 87, 31, -101, 308, -6, -44, 75, -27, -50, -4, 178, -94, -176, 52, -414, -111, -81, 11, -47, 80, 162, -8, -240, -7, -50, -85, 224, 53, -97, 30, 86, -156, -118, -143, -92, 17, 152, -73, 118, 27, 117, -244, 116, -121, -104, -196, 64, -19, 15, -76, -218, 117, 18, -149, -27, 155, 103, -56, 40, 32, -110, 177, 130, -183, -207, -179, -386, -250, -330, 68, -18, 196, 145, -236, -6, 242, -16, -29, -59, 277, -33, -194, -122, -453, -198, 48, 248, 177, 143, 214, -43, -61, 41, -67, -194, 47, -17, 115, 113, -118, 232, -192, 5, 113, 164, 251, 30, 132, -96, 161, -226, -48, -122, 67, -156, 56, 59, 32, 296, 117, 62, 38, -109, 248, 24, 121, 165, 225, -93, 97, -27, -71, 98, -60, 254, 5, 99, -71, -16, 34, -7, -214, -176, 176, -24, -150, 6, 111, -313, 29, 143, 54, -17, 147, 199, -4]
5509dK41j2Qj40o2p2j15O7L10j40p2K45j79j1J02j09K52k24K9j50J85k89J93j82
5533a29N6J48j8j75J25L4P8j2J07o0r4L24k63R5l03p6J94l38J55J33j8P8j48L74
5557B67j91q9k01J27J15P3k67K05j09J39K76k25J26j86pN0j79K07j94p6O1l5j06
5580b19M05pk64J38K0n8R7k52K91k62P9J30J06p2J3k04j5J12j30J71j59M1m7J0
5604g6j00NJ45M49k90r9J3l3j84N07m23Q6l17N48j56m34N70j26P1j60J47K8J85
5627C56k55q6K55k72j5l27L10J70r5J42j64N7q3k41K91K87l00Q6o3j17L5n4R5
5650A2O8l97k4J77R4j03nq4J19M6K8k4n4j4rJ31l7L07k45J50l34J09O0K54l12
5675h7L03j0k38j14J01J98k71K07q5j35J16o4l7K16J37l07q0R4L8L43m18M5Q3
$$ y = [-4, 237, 225, 233, 93, 31, -41, -156, -89, 221, 81, 9, 254, 75, 64, 166, 57, 309, 85, 114, -36, 149, -140, 53, -129, -73, 75, 57, -118, 7, 41, 119, 107, 214, 154, 60, 384, 121, 216, -87, -163, 31, -307, -152, -19, -37, 41, -107, 267, 76, -13, -214, -87, 28, 101, -166, 39, -70, 69, 345, 120, 246, 60, 53, 103, -76, 131, -63, -139, -78, -113, -219, 186, 179, -85, 53, 73, 15, 112, -140, 151, -111, -32, 98, 204, 132, 145, -59, -74, 38, -92, 79, -80, -39, -86, -76, -176, -171, -26, 423, 133, 34, 47, 14, -170, 337, -86, 0, -317, 231, 75, -359, 211, 85, 156, -4, 143, 171, 356, 101, 15, 270, -2, -17, -344, -34, 136, 41, 183, 19, 76, -7, -248, 43, 330, 30, 116, 53, -64, -29, -83, 12, 80, -317, -341, -164, -70, -173, -178, -262, -143, -97, -69, -93, -147, -161, -170, -39, -76, 231, -14, 136, -198, -89, -29, 225, -87, 216, 206, -32, -146, -45, 153, -118, 89, 4, -131, -15, -79, -116, 100, 237, -70, -150, -56, -18, 325, -93, -48, 35]
5698C5j09O5K83l27k32K59J0J22L8j22o9N1K0j94L2K84k37M9J88k81p5J82l3k65
5722c26M58l2l67n5L22NJ64k3j29Lk27K12q8K87l02j5N00l69k03K53k0l7k22k7
5746b38j13N14j09J91m56K74k12k37L14p9J05K19L0p5Lk11j21L35l20L30j52J47
5768A39k34%Q7j12J85p4K26l89L73l7j47R9j08J41j05Q7j78K66m33M05j12j97
5790a18J53m8Mp4J58j58J17K04m90L61j74n3J10o4K79k7j71J14k50O3J19k11J18
5813c8J80J23n69J0M03q5qQn5Q2k31n9K48K0k09J39O1o9J07L4j70M53n38L58j31
5838F4k24N13m16J24l29L57k72J02l3J19J53k36K73j79j33K51mJ52j73j38n0K49
5860A70k94K51j1k2m2k42K02l2Q2O1r5K08l50m9K81KM1l76R3J13L8n7J45J13m57
$$ y = [35, -74, -9, 274, -53, -285, -26, -16, 106, 144, 22, -47, 4, 24, -170, -138, 146, -91, -42, 146, -135, -210, -28, -61, -326, 132, 100, -267, -322, 0, 5, 169, 146, 17, 20, -207, 5, -83, 204, -98, -113, 387, 18, -185, 68, 48, 11, -211, -238, -351, 163, 54, 245, -211, 63, -149, -386, -72, -151, -46, 173, 203, 128, 131, -80, -201, 134, -186, 144, -8, 139, -95, -95, -8, -120, 65, -9, 217, -172, 201, 164, 17, 116, 8, 149, 44, 131, -47, 219, -214, 191, 79, -118, 35, -13, -9, -83, 75, -83, 34, 238, -252, 109, -65, -118, -8, -72, 207, 180, 9, 123, -127, -64, 55, -156, -38, 142, 265, -304, -294, 109, 24, 16, 24, -31, 51, -180, -239, 9, 29, -180, -41, 20, -49, 58, 92, -78, 375, -163, 195, 64, -160, 353, -63, 61, -268, 89, -183, -81, -114, 5, 158, -78, 195, 16, -117, 134, 130, 282, 109, -29, -79, 170, -124, 127, 116, 94, 52, -190, 12, -20, 62, 123, 28, 236, -114, -163, 118, 120, 161, -215, -122, -9, 29, -28, 117, 230, -227]
5885b27L5M8R4J15j79K28k70p9l9L96p1l9o1J42J5L7l10k0J37j55N89l20j1k28
5909a73J08O1K70l36k3K68r6j76R3ok22L64p5p3n1P3K89k76l30K59J36K3J68m53
5933a78K03j00j41K71JJ86k21K63k93r4k20N26k49j03L32l31n0L72L6l48Q3l12
5955c67K49R6k3r4J26k54K40k95K57J00j3q9K82k59K73l00K3k03L52k79M07j70
5977E9k33K29k2J27j90K41l0K20m80K28p5l98K52lK8K46j21j26k58L27j03jJ36
6000E3q4M6n1m8o4J68L0l09K78O0kj02N1q0M3r1Q0o1R3M6j0j59k6J00j46J96n9
6027d8p1L07K2j53j93L18j12j93J89k5k38J11J35k3K65l49m2J83k63L29j26M4
6049F7j10J19j75Rj09J53J06j12J79J54j76k89M53j41j43L3j15P8L9K0J03k40
$$ y = [-227, -192, -144, -50, 65, -114, 114, -156, -235, -274, 122, 51, 12, -49, 93, 108, 145, -165, -185, -48, -203, 386, 66, 55, -173, -65, -4, 266, -70, -93, 175, 79, -97, -4, -10, -232, 132, 57, -16, -67, 6, 295, 19, -311, -52, 84, 107, 275, -178, 25, -75, -216, 55, 56, 242, 21, 284, -9, -103, -323, 203, -46, -149, 183, -148, -198, 174, 210, -138, -55, -367, -118, -22, -45, -139, -13, -267, -27, -322, -65, 35, 22, -67, 215, -44, 229, -71, -48, -251, 101, -178, 229, 59, -174, 55, 33, 160, -30, 211, 181, 401, -79, 149, 74, -324, -72, -75, -47, 199, 78, -48, -306, 21, -82, -83, 53, -31, 15, -36, -84, -148, 20, 50, -259, 19, 79, 77, -25, 26, -54, -11, -102, -22, -83, 10, 56, 46, -113, -139, -39, -185, 11, -48, -119, 188, 210, 57, -136, 182, 70, -123, 66, 41, -197, -86, 49, 26, 291, -58, -100, 83, -180, 149, 23, 67, -43, 76, -99, -90, -199, -46, 60, -52, 127, 281, 105, -184, 269, 128, -15, 18, -97, -19, 20, 40, 143, -97]
6071i7K73k22k3j27J61qk0o3q5J48M0l0n2L2M8j41R0l3j31L39n1k31J99m2J10
6096H4r2j20J65O0p7p0P4k01J86j10K04o2R5J6r4K94k23J9k51nJ03k46K75p8j8
6121g2r5L0J71J08m5N6k67L17l14J75j44J94j6j39J94q4jk0K50l19O8k76J07N2
6145g0K60l76L93p8j2q7J76j75j30K8K93l73J32J57o1j17J90k10L4K10l50J88
6167B2k44K48p5K14j66L1n3L9K13k67M5pj84J26L18k35j9j40K81L6N0P1k52j97
6191a45M1J26k9K92n99M64k18K09P1k62n2N2K49k48k03L92j47J73k63L25jo3k59
6214i5M1L62j52K77m05j3J4Q6j13p5L4l82M16n9n7K01j21J67k28OR6R6K03l54
6238e5J77j61Q5m4J14m4j12L31m03n1K70j79L60k06J54p20K84J95k02L17n1K26
$$ y = [-97, 176, -46, -69, -196, -35, -43, -63, -126, -211, -63, -23, -53, -105, -73, -25, -166, -76, -109, -240, 99, 48, -183, 16, -26, 84, -8, -128, 37, 97, 20, -50, 24, -177, 9, -101, 103, 41, 136, 152, 58, 352, 129, 148, -103, -108, -5, -251, 24, -54, -72, -167, -137, 34, 142, 97, 153, -114, 203, -111, 64, -80, 114, 98, -41, 153, 69, 68, 48, 298, -21, 47, -229, -122, -70, 190, -186, 207, 129, 117, 30, 206, 31, -99, -71, 222, -151, -19, 138, 77, -40, 150, -60, -26, 184, -166, 22, -222, 26, -49, 165, -1, 30, -23, 16, 229, -38, 7, 0, -184, -58, 260, 25, 6, -134, 147, 183, 233, 304, 52, -145, -104, 22, -7, 285, -314, 150, -68, 141, 212, -50, -102, -50, 199, -49, -252, 140, -7, 166, -97, 228, 227, 164, -95, -54, 308, 156, 433, 28, 15, 29, 115, 2, -73, -39, -421, -5, -64, -121, 80, -41, 126, -102, -96, 0, 96, 299, -55, 122, -39, 46, 2, 116, 72, -40, 291, -112, -163, 107, -72, 288, 82, 236, -484, -200, -5, -207, 110, 59, 285]
6260B85k85K9Q9m73K56J77k50K98k82J01M6J45R4m29J05j7mJ55k31J03j2K01j49
6283d8R1k99K82k95rM25j38P9m27J75J27J06m7m6J71k53J06J53j95J56J36l11
6305f1L11n7j65J40j0l01K86k53j29L69j53J67j57k2l8K88l77J4L02j28r9J64
6327I1p9k00%L49jo0k11J33n1J54j64O5J01k44j6m1K94j85j5J60Mr5N6L92n43
6352a06K24k85L53q6J00k53l3K24j55n3N0k45M31j02j04j43j8K58j97Q4k8P2k4
6375c6K5M6MP9j83q3K64k43n4J44m9l9L82j11k82J04j81J85J79l03J33J10k0K4
$$ y = [285, 0, 29, 118, -355, -99, 78, -172, 126, -156, -55, -9, 136, 230, -199, -94, -111, -115, 40, -191, -88, -100, 101, -48, 43, -256, 26, -269, -278, 147, 9, 88, -339, -164, -37, 69, 22, -24, 147, -106, 0, 153, -42, 114, 250, -61, 250, 193, 28, 168, 158, -143, 143, -110, -239, 130, -23, 144, -13, -35, -73, 215, -162, -148, 154, 26, -73, 91, 12, -188, -188, 161, 160, 100, -111, 22, -29, 125, -39, 26, 127, -117, -133, -174, 120, -65, -80, 80, 84, -11, 45, 437, -106, 118, -167, 186, 100, 200, -53, -86, 138, -17, -70, -20, -265, 166, 64, -40, -183, -201, 57, -140, -56, -84, -12, -36, -11, 35, 39, 118, -65, -148, 116, -127, -181, -37, -86, -125, 257, 146, -136, -32, -213, -28, 151, -152, -19, 91, 71, 95]
$$ [...]
8191a00
##END NTUPLES=NMR FID
##END=
