##TITLE=1H_Pr NCS-4H
 200.13MHz, CDCl3,
 8 sc
 
 5.8.2025
##JCAMPDX= 6.0         $$ Bruker NMR JCAMP-DX V2.0
##DATA TYPE= NMR FID
##DATA CLASS= NTUPLES
##ORIGIN= UXNMR, Bruker Analytische Messtechnik GmbH
##OWNER= pz
$$ XWIN-NMR		Version 3.5
$$ Tue Aug  5 15:39:30 2025 Russian Standard Time (UT+4h)  she@DPX200
##.OBSERVE FREQUENCY= 200.1313
##.OBSERVE NUCLEUS= ^1H
##.DELAY= (6, 6)
##.ACQUISITION MODE= SIMULTANEOUS
##.ACQUISITION SCHEME= undefined
##.AVERAGES= 8
##.DIGITISER RES= 18
##SPECTROMETER/DATA SYSTEM= spect
##.PULSE SEQUENCE= zg30
##.SOLVENT NAME= CDCl3
##.SHIFT REFERENCE= (INTERNAL, CDCl3, 0, 14.3821)
##AUDIT TRAIL= $$ (NUMBER, WHEN, WHO, WHERE, WHAT)
$$ ##TITLE= Audit trail, XWIN-NMR		Version 3.5
$$ ##JCAMPDX= 5.01
$$ ##ORIGIN= Bruker BioSpin GmbH
$$ ##OWNER= she
$$ F:/spectra/data/she/nmr/H-C/1/audita.txt
$$ ##AUDIT TRAIL=  $$ (NUMBER, WHEN, WHO, WHERE, WHAT)
(   1,<2025-08-05 15:38:23.26 +0400>,<she>,<DPX200>,
      <created by zg, POWCHK disabled, PULCHK disabled
       configuration hash MD5:
       00 E9 B6 7A A2 85 ED C7 34 08 36 98 17 FE 4E 26
       data hash MD5: 16K
       F3 1B 94 4A A9 14 52 A3 40 03 27 A8 DD ED DC 73>)
$$ ##END=
$$ 
$$ hash MD5
$$ A4 2B 46 D7 65 B6 E3 8D E9 A2 90 1C ED 01 1C 9A
##$RELAX= 
##$RELAX= 
##$RELAX= 
##$RELAX= 
##$RELAX= 
##$RELAX= 
$$ Bruker specific parameters
$$ --------------------------
##$DU= <F:/spectra>
##$EXPNO= 1
##$NAME= <H-C>
##$PROCNO= 1
##$TYPE= <nmr>
##$USER= <she>
##$AMP= (0..31)
100 100 100 100 100 100 100 100 100 100 100 100 100 100 100 100 100 100 
100 100 100 100 100 100 100 100 100 100 100 100 100 100 
##$AQSEQ= 0
##$AQ_mod= 1
##$AUNM= <au_zg>
##$AUTOPOS= <>
##$BF1= 200.13
##$BF2= 200.13
##$BF3= 200.13
##$BF4= 200.13
##$BF5= 200.13
##$BF6= 200.13
##$BF7= 200.13
##$BF8= 200.13
##$BYTORDA= 1
##$CFDGTYP= 0
##$CFRGTYP= 5
##$CHEMSTR= <none>
##$CNST= (0..31)
1 1 145 1 1 1 1 1 1 1 1 1 1 1 1 1 1 1 1 1 1 1 1 1 1 1 1 1 1 1 1 1 
##$CPDPRG= <>
##$CPDPRG1= <>
##$CPDPRG2= <>
##$CPDPRG3= <>
##$CPDPRG4= <mlev>
##$CPDPRG5= <mlev>
##$CPDPRG6= <mlev>
##$CPDPRG7= <mlev>
##$CPDPRG8= <mlev>
##$CPDPRGB= <>
##$CPDPRGT= <>
##$D= (0..31)
0 0.7 0 0 0 0 0 0 0 0 0 0.03 0 0 0 0 0 0 0 0 0 0 0 0 0 0 0 0 0 0 0 0 
##$DATE= 1754393902
##$DBL= (0..7)
120 120 120 120 120 120 120 120 
##$DBP= (0..7)
150 150 150 150 150 150 150 150 
##$DBP07= 0
##$DBPNAM0= <>
##$DBPNAM1= <>
##$DBPNAM2= <>
##$DBPNAM3= <>
##$DBPNAM4= <>
##$DBPNAM5= <>
##$DBPNAM6= <>
##$DBPNAM7= <>
##$DBPOAL= (0..7)
0.5 0.5 0.5 0.5 0.5 0.5 0.5 0.5 
##$DBPOFFS= (0..7)
0 0 0 0 0 0 0 0 
##$DE= 6
##$DECBNUC= <off>
##$DECIM= 32
##$DECNUC= <off>
##$DECSTAT= 4
##$DIGMOD= 1
##$DIGTYP= 9
##$DL= (0..7)
0 120 120 120 120 120 120 120 
##$DP= (0..7)
150 150 150 150 150 150 150 150 
##$DP07= 0
##$DPNAME0= <>
##$DPNAME1= <>
##$DPNAME2= <>
##$DPNAME3= <>
##$DPNAME4= <>
##$DPNAME5= <>
##$DPNAME6= <>
##$DPNAME7= <>
##$DPOAL= (0..7)
0.5 0.5 0.5 0.5 0.5 0.5 0.5 0.5 
##$DPOFFS= (0..7)
0 0 0 0 0 0 0 0 
##$DQDMODE= 0
##$DR= 18
##$DS= 0
##$DSLIST= <SSSSSSSSSSSSSSS>
$$ [...]
##$SUBNAM0= <"">
##$SUBNAM1= <"">
##$SUBNAM2= <"">
##$SUBNAM3= <"">
##$SUBNAM4= <"">
##$SUBNAM5= <"">
##$SUBNAM6= <"">
##$SUBNAM7= <"">
##$SUBNAM8= <"">
##$SUBNAM9= <"">
##$SW= 18.0517328524113
##$SWIBOX= (0..15)
0 0 2 0 0 0 0 0 0 0 0 0 0 0 0 0 
##$SW_h= 3612.71676300578
##$TD= 16384
##$TD0= 1
##$TE= 0
##$TE2= 300
##$TE3= 300
##$TEG= 300
##$TL= (0..7)
0 120 120 120 120 120 120 120 
##$TP= (0..7)
150 150 150 150 150 150 150 150 
##$TP07= 0
##$TPNAME0= <>
##$TPNAME1= <>
##$TPNAME2= <>
##$TPNAME3= <>
##$TPNAME4= <>
##$TPNAME5= <>
##$TPNAME6= <>
##$TPNAME7= <>
##$TPOAL= (0..7)
0.5 0.5 0.5 0.5 0.5 0.5 0.5 0.5 
##$TPOFFS= (0..7)
0 0 0 0 0 0 0 0 
##$TUNHIN= 0
##$TUNHOUT= 0
##$TUNXOUT= 0
##$USERA1= <user>
##$USERA2= <user>
##$USERA3= <user>
##$USERA4= <user>
##$USERA5= <user>
##$V9= 5
##$VALIST= <valist>
##$VCLIST= <CCCCCCCCCCCCCCC>
##$VD= 0
##$VDLIST= <DDDDDDDDDDDDDDD>
##$VPLIST= <PPPPPPPPPPPPPPP>
##$VTLIST= <TTTTTTTTTTTTTTT>
##$WBST= 1024
##$WBSW= 4
##$XGAIN= (0..3)
0 0 0 0 
##$XL= 0
##$YL= 0
##$YMAX_a= 614324
##$YMIN_a= -652768
##$ZGOPTNS= <>
##$ZL1= 120
##$ZL2= 120
##$ZL3= 120
##$ZL4= 120
##$ABSF1= 10
##$ABSF2= 0
##$ABSG= 5
##$ABSL= 3
##$ALPHA= 0
##$AQORDER= 0
##$ASSFAC= 0
##$ASSFACI= 0
##$ASSFACX= 0
##$ASSWID= 0
##$AUNMP= <proc_1d>
##$AZFE= 0.1
##$AZFW= 0.1
##$BCFW= 1
##$BC_mod= 2
##$BYTORDP= 1
##$COROFFS= 0
##$CY= -3
##$DATMOD= 1
##$DC= 2
##$DFILT= <>
##$DTYPP= 0
##$F1P= 0
##$F2P= 0
##$FCOR= 0.5
##$FTSIZE= 0
##$FT_mod= 4
##$GAMMA= 1
##$GB= 0.15
##$INTBC= 1
##$INTSCL= 1
##$ISEN= 128
##$LB= 0.25
##$LEV0= 0
##$LPBIN= 0
##$MAXI= 10000
##$MC2= 0
##$MEAN= 0
##$ME_mod= 0
##$MI= 1.114404
##$NCOEF= 0
##$NC_proc= 0
##$NLEV= 6
##$NOISF1= 3.799351
##$NOISF2= 2.8
##$NSP= 1
##$NTH_PI= 0
##$NZP= 0
##$OFFSET= 14.38212
##$PC= 1
##$PHC0= -1201.003
##$PHC1= 13.7923
##$PH_mod= 1
##$PKNL= yes
##$PPARMOD= 0
##$PSCAL= 0
##$PSIGN= 0
##$REVERSE= no
##$SF= 200.129724274929
##$SI= 16384
##$SIGF1= 3
##$SIGF2= 2
##$SINO= 400
##$SIOLD= 16384
##$SREGLST= <1H.CDCl3>
##$SSB= 0
##$STSI= 0
##$STSR= 0
##$SW_p= 3205.1282051282
##$SYMM= 0
##$S_DEV= 0
##$TDeff= 0
##$TDoff= 0
##$TI= <>
##$TILT= no
##$TM1= 0
##$TM2= 0
##$TOPLEV= 0
##$USERP1= <user>
##$USERP2= <user>
##$USERP3= <user>
##$USERP4= <user>
##$USERP5= <user>
##$WDW= 1
##$XDIM= 8192
##$YMAX_p= 0
##$YMIN_p= 0
$$ End of Bruker specific parameters
$$ ---------------------------------
##NTUPLES= NMR FID
##VAR_NAME=  TIME,          FID/REAL,        FID/IMAG
##SYMBOL=    X,             R,               I
##VAR_TYPE=  INDEPENDENT,   DEPENDENT,       DEPENDENT
##VAR_FORM=  AFFN,          ASDF,            ASDF
##VAR_DIM=   8192,          8192,            8192
##UNITS=     SECONDS,       ARBITRARY UNITS, ARBITRARY UNITS
##FACTOR=    0.0002768,     1,               1
##FIRST=     0,             0,               0
##LAST=      2.2672688,     0,               0
##MIN=       0,             -652768,         0
##MAX=       2.2672688,     614324,          0
$$ Real data points
##PAGE= N=1
##DATA TABLE= (X++(R..R)), XYDATA
$$ plain form
0 0 0 0 0 0 0 0 0 0 0 0 0 0 8 -8 8 -8 16 -16 16 -24 24 -32 40 -45 48 -61 69 -80 93 -105 117 -133 154 -173
34 -173 195 -219 245 -274 306 -342 379 -420 468 -516 569 -627 693 -764 842 -926 1022 -1125
52 -1125 1242 -1370 1518 -1684 1876 -2095 2357 -2668 3047 -3524 4137 -4967 6143 -7943 11013
67 11013 -17252 34840 -189738 -652768 -42523 513202 202584 -333981 -268774 74345 137622
78 137622 49026 40481 -125128 -260492 830 334615 121133 -348084 -299958 211587 320261
89 320261 -86063 -277576 -60111 128366 99958 11912 -54335 -116701 -45614 163096 154745
100 154745 -126453 -183686 66175 171649 -1863 -101011 6395 29994 -66019 22499 154465
111 154465 -26467 -224164 -26061 250200 101866 -227144 -143425 173843 136801 -100842
$$ packed form
0@%%%%%%%%%%%%Qj6J6j6K4l2L2m0M8n6P2q5R3j09J30j49J73j98K22k50K87l27
34a73L68m14M64n19N80o48P21p99Q88r84J085j196J320j457J606j768J948k147
52a125K367k612K888l202L560l971M452n025N715o571P661r104J1110j4086J8956
67A1013k8265N2092k24578m63030O10245N55725l10618n36565O5207L43119O3277
78A37622q8596q545j65609j35364K61322L33785k13482m69217M8126N11545J08674
89C20261m06324j91513K17465J88477k8408q8046o6247o2366P1087K08710q351
100A54745k81198n7233K49861J05474j73512r9148J07406K3599r6013Q8518J31966
111A54465j80932j97697J98103K76261j48334l29010Q3719L17268l7042k37643
$$ plain form
121 -100842 -68380 66605 -5808 -80010 76046 152884 -106031 -233729 84842 280831 -20271
132 -20271 -280571 -62612 230612 111588 -150109 -101294 65657 52859 6122 26999 -13892
143 -13892 -83973 -8970 134496 63486 -140847 -95629 115086 102778 -72968 -96735 27428
154 27428 59324 -23262 -26979 20795 -24128 -38322 47576 44253 -62307 -60323 67910 78334
166 78334 -77110 -89589 86946 96715 -80701 -100723 61094 102579 -42999 -95611 29911
177 29911 64209 -29976 -24342 38261 -4373 -58239 18152 99117 -3374 -123505 -7729 137848
189 137848 38663 -111560 -56918 81477 65442 -49545 -48550 20254 5772 -11145 24272 4875
201 4875 -52812 -30144 56029 50555 -59039 -64863 49437 60514 -31380 -44338 20703 34459
$$ packed form
121a00842L2462J34985p2413p4202J56056P6838k58915j27698L18571J95989l01102
132b0271k60300K17959K93224j19024k61697M8815J66951j2798m6737K0877m0891
143a3892p0081P5003J43466p1010k04333M5218K10715j2308j75746k3767J24163
154B7428L1896q2586l717M7774m4923j4194Q5898l323j06560J984J28233J0424
166G8334j55444j2479J76535R769j77416k0022J61817M1485j45578n2612J25522
177B9911L4298r4185N634O2603m2634n3866P6391Q0965j02491j20131J15776J45577
189A37848r9185j50223N4642J38395j6035j14987R95O8804j4482j6917L5417j9397
201D875n7687K2668Q6173n474j09594n824J14300J1077r1894j2958O5041J3756
$$ plain form
213 34459 -18018 -19172 31979 6949 -42823 1675 44593 -2695 -44248 -3276 42601 593
225 593 -42550 12375 41061 -21333 -34595 29016 44001 -21813 -49164 22534 55509 -16954
237 -16954 -44691 8922 25811 -5775 -16497 4987 1004 -27511 635 40197 -8372 -53605
249 -53605 -1812 52544 17345 -47676 -26107 43154 28468 -24300 -14118 10059 4569 1718
261 1718 9271 3629 -24523 -16020 36518 23907 -40346 -32034 28997 37828 -14891 -38743 8260
274 8260 33798 -2633 -13745 4298 550 -3093 8520 13035 -9361 -28409 6442 34196 -9675
287 -9675 -37333 -1661 25613 4961 -24679 -10108 18836 2122 -12500 7899 7836 -8304 -2975
300 -2975 13180 12574 -11930 -13034 19164 12596 -17478 -7933 12457 5854 -11863 -9565 13242 6176
$$ packed form
213C4459n2477j154N1151k5030m9772M4498M2918m7288m1553M0972M5877m2008
225E93m3143N4925K8686o2394j3262O3611J4985o5814k7351P1698L2975p2463
237a6954k7737N3613J6889l1586j0722K1484l983k8515K8146L9562m8569m5233
249e3605N1793N4356l5199o5021K1569O9261j4686n2768J0182K4177n490k851
261A718P553n642k8152Q503N2538j2611o4253Q312O1031Q831n2719k3852M7003
274H260K5538l6431j1112J8043l748l643J1613M515k2396j9048L4851K7754m3871
287i675k7658L5672K7274k0652k9640J4571K8944j6714j4622K0399o3j6140N329
300b975J6155o06k4504j104L2198o568l0074R545K0390o603j7717K298K2807p066
$$ plain form
314 6176 -18206 -2727 15845 716 -9878 -1440 9995 4222 -9607 2921 11102 -8254 -7687
327 -7687 9895 5392 -9781 -12301 5507 12977 -11533 -16212 7537 8442 -4601 -6168 108 6742
341 6742 91 -1249 8770 -902 -7376 9707 11282 -3978 -10484 63 15339 2807 -17203
354 -17203 -4346 9070 1963 -3092 -6034 -2692 1786 489 6081 1393 -12152 -344 14238 5727
368 5727 -7105 -10809 2848 13198 -1661 -8845 -2442 -2872 1411 5094 -2518 -6654 -7883 1930
382 1930 13497 261 -11064 -2472 5452 9936 5737 -6272 -4530 1557 7796 12221 -4122 -16372
396 -16372 -1808 11480 9869 -5911 -18089 -3682 10769 6512 -394 -10560 -11598 6623 16350
409 16350 7320 -11807 -19513 6551 26533 5763 -19116 -17812 5561 22901 4742 -18707 -14610
$$ packed form
314F176k4382J5479J8572j5129j0594Q438J1435n773j3829J2528Q181j9356N67
327g687J7582m503j5173k520J7808P470k4510m679K3749R05j3043j567O276O634
341F742o651j340J0019r672o474J7083J575j5260o506J0547J5276j2532k0010
354a7203J2857J3416p107n055k942L342M478j297N592m688j3545J1808J4582q511
368E727j2832l704J3657J0350j4859p184O403m30M283L683p612m136j229R813
382A930J1567j3236j1325Q592P924M484m199j2009J742O087O239M425j6343j2250
396a6372J4564J3288j611j5780j2178J4407J4451m257o906j0166j038J8221R727
409A6350r030j9127p706K6064J9982k0770k4879J304K3373J7340j8159k3449M097
$$ plain form
422 -14610 297 14099 11881 -9554 -18091 -5521 12779 22378 -40 -24187 -10235 17708 25816
435 25816 2430 -27007 -14809 19292 22664 -450 -22771 -16630 11847 16927 661 -11404 -16533
448 -16533 -4245 15220 15465 -1778 -22961 -16607 21726 31062 -5027 -30628 -13629 24810 27925
461 27925 -10495 -26272 -5279 11363 12910 1685 -10523 -13139 -8104 12551 25389 -3664 -32243
474 -32243 -12419 27550 33157 -9939 -38864 -4697 32623 21001 -12607 -25899 -4781 17859
486 17859 11764 -1496 -12158 -18206 -1072 20190 15642 -11874 -32178 -6487 36284 24615 -23248
499 -23248 -35542 2960 41195 17592 -29649 -24751 11599 22980 5344 -13384 -11015 -2400 218
512 218 12904 13822 -16134 -28015 2799 35633 17709 -32709 -32137 23355 38663 -2715 -30412
$$ packed form
422a4610J4907J3802k218k1435q537J2570J8300R599k2418k4147J3952K7943Q108
435B5816k3386k9437J2198L4101L372k3114k2321O141K8477N080j6266j2065n129
448a6533J2288J9465K45j7243k1183O354L8333R336l6089k5601J6999L8439L115
461B7925l8420j5777K0993J6642J547j1225j2208k616N035K0655J2838k9053k8579
474c2243J9824L9969N607m3096k8925L4167L7320j1622l3608j3292K1118K2640
486A7859o095j3260j0662o048J7134K1262m548k7516k0304K5691M2771j1669m7863
499b3248j2294L8502L8235k3603m7241M898L6350J1381j7636j8728K369Q615K618
512B18J2686R18k9956j1881L0814L2834j7924n0418N72N5492J5308m1378k7697
$$ plain form
525 -30412 -11058 20990 14521 -8586 -5958 -1483 -7938 -278 13430 8182 -16857 -25379 9106
538 9106 32709 2096 -30081 -16357 20080 28125 -5895 -25105 -2755 16195 10915 -2699 -9355
551 -9355 -2713 296 872 10165 3854 -16417 -14491 9342 23156 619 -30013 -11493 28080 20184
565 20184 -16407 -24026 6911 26129 826 -18429 -875 10315 -151 -5727 1859 5542 -8926
578 -8926 -12241 11193 13966 -12391 -18097 5579 20484 875 -21175 -3377 20263 6711 -12553
591 -12553 -6847 9161 10477 -5821 -8729 5326 4926 -3542 -3846 -152 3167 -1015 -6124 2185 4470
606 4470 -3081 -3646 1328 6250 2755 -7803 -2318 10299 4636 -6843 -7065 4855 10766 -4230
620 -4230 -12512 2903 8235 -2247 -8063 -1376 7031 -767 -9352 3522 9696 -3294 -8324 2028
$$ packed form
525c0412J9354L2048o469k3107K628M475o455P660J3708n248k5039q522L4485
538I106K3603l0613l2177J3724L6437Q045l4020j9210K2350J8950n280j3614o656
551i355O642L009N76R293o311k0271J926K3833J3814k2537l0632J8520L9573p896
565B0184l6591p619L0937J9218k5303j9255J7554J1190j0466n576P586L683j4468
578h926l315K3434K773k6357n706K3676J4905j9609k2050J7798K3640j3552j9264
591a2553N706J6008J316j6298k908J4055m00q468l04L694L319m182n109Q309K285
606D470p551n65M974M922l495j0558N485J2617n663j1479k22J1920N911j4996
620d230q282J5415N332j0482n816O687Q407p798q585J2874O174j2990n030J0352
$$ plain form
634 2028 11600 3549 -11464 -3347 10823 4234 -5066 -4342 762 2882 -1546 -1259 2289 -4684 -5499
649 -5499 4494 6176 -1293 -7328 -3501 9083 7555 -4159 -6530 -1296 6801 8282 -3986 -8661
663 -8661 -843 5641 5508 -3800 -9503 -177 4990 1865 -1054 -5528 -2570 3731 4123 2037 -3349 -5936
679 -5936 5369 8712 -1048 -6189 -2493 5830 5719 -5529 -5597 2018 1474 -710 -1884 -2418 426 -495
695 -495 -455 1977 -1710 -1658 3225 1417 18 -645 -257 3453 508 -3034 1100 1210 -1198 -741 -1926
712 -1926 -232 810 -1959 -216 -257 -1963 1963 1353 -1932 263 680 2195 1913 -1992 301 2536
728 2536 -450 -174 -375 -1331 1106 -929 -1921 529 -1768 -981 755 -1753 -148 1147 -183 999
744 999 -521 -29 3736 53 -1876 992 744 1589 201 -3313 -235 1122 -718 190 -2429 -2666 1918
$$ packed form
634B028R572q051j5013Q117J4170o589r300P24N104K120m428K87L548o973q15
649e499R993J682p469o035L827J2584j528j1714k371N234Q097J481j2268m675
663h661P818O484j33r308n703R326N167l125k919m474K958O301L92k086n386k587
679e936J1305L343r760n141L696Q323j11j1248o8P615n44k184j174n34K844r21
695d95M0K432l687N2M883j808j399o63L88L710k945l542M134J10k408M57j185
712a926J694J042k769J743m1j706L926o10l285K195M17J515k82l905K293K235
728B536k986K76k01r56K437k035r92K450k297P87J736k508J605J295j330J182
744I99j520M92L765l683j929K868k48Q45j388l514L078J357j840R08k619k37M584
$$ plain form
761 1918 1017 -437 -1124 -1853 2918 3782 -1311 -838 654 1631 3081 -1001 -2381 875 25 793 -57
778 -57 -3470 -947 1158 -135 157 -2474 -1493 2707 756 -744 294 -339 2441 2038 -1329 684 761
795 761 107 1846 -958 -1653 472 -370 -240 -803 -2554 796 709 -1412 35 227 228 1825 -21 78 1787
814 1787 -685 1381 1727 -1417 170 294 -819 447 -1779 -894 745 -2011 -893 1120 -828 -345
830 -345 -607 -50 2551 198 -1845 1485 1132 800 1052 -993 232 369 -404 1508 -1165 -3282 629
847 629 1396 94 -1246 -2771 786 2400 -769 -374 -10 -472 2342 2179 -240 -745 -1670 2150 3756
864 3756 -2884 -3332 349 1108 716 -2353 -2523 278 -627 -6 1871 -1732 -1977 1362 2420 2498 -1629
881 -1629 -2553 2974 2818 -233 -98 -1909 -593 1730 494 -385 -2696 -2930 2626 2225 -2582 -1592 -270
$$ packed form
761A918r01j454o87p29M771Q64n093M73J492R77J450m082j380L256q50P68q50
778e7l413K523K105j293K92k631R81M200j951j500J038o33K780m03l367K013P7
795G61o54J739k804o95K125q42J30n63j751L350q7k121J447J92JJ597j846R9J709
814A787k472K066L46l144J587J24j113J266k226Q85J639k756J118K013j948M83
830c45k62N57K601k353k043L330l53l32K52k045J225J37p73J912k673k117L911
847F29P67j302j340j525L557J614l169L95L64m62K814j63k419n05r25L820J606
864C756o640m48L681P59l92l069j70K801r05O21J877l603k45L339J058P8m127
881a629r24N527j56l051J35j811J316K323j236q79k311k34N556m01m807R90J322
$$ plain form
898 -270 1092 1793 -345 376 -182 -2001 3540 4432 -2634 -4020 419 4733 1578 -6211 -2669 4118
914 4118 536 -2471 -681 74 -157 -1959 1331 4759 -2249 -5264 3060 6096 935 -4467 -1970 5387
930 5387 2747 -3951 -1388 1053 -98 -281 -1365 241 -64 -3131 362 2508 -373 -1031 -1061 9
946 9 3641 1349 -1774 -1327 607 3808 670 -5141 -149 3788 -557 -3539 -1024 3212 581 -6074
962 -6074 -688 7325 -390 -6892 -577 6657 3620 -6467 -2885 8370 3162 -6766 -1655 5648 2385
977 2385 -6050 -4389 6793 3175 -8271 -3222 5612 3326 -4225 -5031 3841 4889 -3442 -2644 3372
992 3372 2005 -652 -1540 1309 3449 -1463 -3035 1304 1900 810 -2452 -4493 1861 4204 -1631 -4699
1008 -4699 -1669 4526 3780 -4845 -3132 5460 2693 -3401 -1289 4415 2705 -5986 -2883 8321 2790
$$ packed form
898b70J362P01k138P21n58j819N541Q92p066j386M439M314l155p789L542O787
914D118l582l007J790P55k31j802L290L428p008l015Q324L036n161n402K497P357
930E387k640o698K563K441j151j83j084J606l05l067L493K146k881o58l0J070
946IL632k292l123M47J934L201l138n811M992L937m345k982K515M236k631o655
962f074N386Q013p715o502O315P234l037j0087L582J1255n208r928N111P303l263
977B385q435J661J1182l618j1446N049Q834k286p551q06Q872J048q331P98O016
992C372j367k657q88K849K140m912j572M339N96j090l262k041O354K343n835l068
1008d699L030O195p46q625J713Q592k767o094K112N704j710q691L103J1204n531
$$ plain form
1023 2790 -9746 -4664 7607 6262 -7220 -8819 6168 7556 -5191 -5274 4392 4479 -3014 -3673 5461
1038 5461 4868 -6320 -4407 6783 4874 -4398 -6381 1653 6258 -1731 -5392 -12 1204 -97 36
1053 36 -597 -178 -635 -18 2612 568 -830 706 -829 378 3763 256 -4087 -2405 3459 4787
1069 4787 -4503 -7484 3105 5860 -2397 -5429 473 4678 -995 -4096 3892 4673 -4914 -3355 5815
1084 5815 5743 -4522 -7362 4089 8143 -4275 -7483 1689 4206 -1198 -4508 799 3183 -2950 -2518
1099 -2518 4720 1934 -4379 -1773 4118 3928 -2602 -3624 2658 2358 -1528 77 54 -1442 -685 963
1115 963 1551 -2430 -3441 2904 2667 -2904 -1087 1748 1015 -1092 -478 3221 697 -4229 1081 5034
1131 5034 -1081 -4337 -576 4070 910 -5278 -945 4270 -1385 -3656 1393 2761 -1453 -3601 1697
$$ packed form
1023B790j2536N082J2271j345j3482j599J4987J388j2747q3R666Q7p493o59R134
1038E461n93j1188J913J1190j909r272j983Q034M605p989l661N380J216j301J33
1053C6o33M19m57O17K630k044j398J536j535J207L385l507m343J682N864J328
1069D787r290k981J0589K755q257l032N902M205n673l101P988P81r587J559R170
1084E815p2j0265k840J1451M054j2418l208R172K517n404l310N307K384o133M32
1099b518P238k786o313K606N891j90o530j022O282l00l886J605k3j496P57J648
1115I63N88l981j011O345k37n571J817K835p33k107O14L699k524m926N310L953
1131E034o115l256L761M646l160o188M333N215n655k271N049J368m214k148N298
$$ plain form
1146 1697 5098 -2501 -3992 3501 3786 -1681 -2670 1000 3151 -1836 -3177 2757 1438 -4079 -1130
1161 -1130 2438 775 -3173 -2059 3669 1646 -3858 146 3920 117 -2175 170 2946 472 -3311
1176 -3311 1125 3397 -2460 -2258 1743 1469 -1673 -2861 1264 2834 -2376 -2535 3044 1261 -2166 -292
1192 -292 2134 1721 -2274 -719 3759 -340 -3616 781 2512 -902 -3291 -427 3000 -994 -3941
1207 -3941 1170 2466 -1937 -2013 1386 2363 -1046 -2699 2704 3198 -2587 -1199 2786 1330 -1743 -1974
1223 -1974 1570 1632 -3303 -1397 2958 -527 -2730 -490 2286 709 -2751 -561 3603 -26 -2265
1238 -2265 1520 1855 -556 -1399 595 2509 -1627 -2847 2068 1237 -2733 -1400 1069 928 -1584 -2423
1254 -2423 2238 1380 -2440 -182 2490 -164 -1277 -145 2605 754 -2930 333 2967 -1253 -2110
$$ packed form
1146A697L401p599j491P493K85n467r89L670K151m987j341N934j319n517K949
1161a130L568j663l948J114N728k023n504M004L774l803k292K345K776k474l783
1176c311M436K272n857K02M001k74l142j188M125J570n210j59N579j783l427J874
1192b92K426m13l995J555M478m099l276M397J731l414k389K864L427l994k947
1207c941N111J296m403p6L399R77l409j653N403M94n785J388L985j456l073k31
1223a974L544O2m935J906M355l485k203K240K776j577l460K190M164l629k239
1238b265L785L35k411q43J994J914m136j220M915q31l970J333K469j41k512q39
1254b423M661q58l820K258K672k654j113J132K750j851l684L263K634m220q57
$$ plain form
1269 -2110 379 1273 -477 -2436 403 2307 -1811 -1841 1958 1127 -1319 -1084 1723 2352 -1291 -1497 2703
1286 2703 1249 -1915 -351 1314 669 -1890 -1524 1950 37 -2958 105 1613 -524 -1209 -190 1861
1302 1861 399 -1732 780 2015 -878 -648 823 885 -557 -1527 617 1246 -2057 -1331 1559 -141
1318 -141 -1143 -445 426 771 -1390 -223 2393 -320 -1529 1250 1251 -18 -1164 -263 1789 -224 -1909
1335 -1909 903 1113 -784 -1156 -123 885 -697 -1816 868 1243 -1073 -213 1002 928 328 -704 815
1352 815 1285 -1285 -157 1067 -342 -319 -370 214 344 -1303 -881 778 -924 -520 1011 122 98 -123
1370 -123 248 1474 -281 -579 1307 406 -701 -85 -57 385 -363 -1288 781 102 -1484 -240 97 295
1388 295 21 -1014 567 1222 -241 338 646 139 801 -180 -133 545 -476 -345 277 -505 228 -279 -1035
$$ packed form
1269b110K489Q94j750j959K839J904m118l0L799q31k446K35K807O29l643k06M200
1286B703j454l164J564J665o45k559L66L474j913k995L063J508k137o85J019K051
1302A861j462k131K512J235k893K30J471O2j442r70K144O29l303P26K890j700
1318a41j002O98Q71L45k161J167K616k713j209K779Jj269j146R01K052k013j685
1335a909K812K10j897l72J033J008j582j119K684L75k316Q60J215p4o00j032J519
1352H15M70k570J128J224j409K3n1N84J30j647M22J659j702M04J531q89k4k21
1370a23L71J226j755k98J886r01j107O16K8M42p48r25K069o79j586J244L37J98
1388B95k74j035J581O55j463N79L08n07O62r81M7O78j021J31O22p82P33n07p56
$$ plain form
1407 -1035 506 396 -845 -111 -420 511 1201 -858 -599 1289 217 57 -54 -55 942 -231 -964 657
1425 657 -71 -827 -574 -754 835 -7 -1791 30 1223 259 -582 -809 945 1600 -639 -729 1223 611
1443 611 -318 -562 84 1376 -1034 -1872 1121 938 -904 -1589 -184 1668 170 -2266 158 1645 258
1460 258 -246 -354 1527 1037 -1230 -285 1520 -18 -1018 -703 622 951 -1702 -1932 989 1062 -534
1477 -534 -1124 -531 1715 986 -1401 336 1163 634 -115 -278 1199 1185 -1266 -793 1324 507 -864 -1952
1495 -1952 236 2165 -701 -2447 496 1877 27 -1386 -288 2389 1134 -1724 433 2044 372
1510 372 -1026 -647 1802 975 -2537 -1221 1669 208 -1505 -1262 631 1815 -1155 -1659 1257 995
1526 995 -409 -461 359 1264 152 -900 708 1410 -247 -810 -390 648 842 -1452 -1074 598 445 -575
$$ packed form
1407a035J541j10j241P34l09R31O90k059K59J888j072j60j11jR97j173p33J621
1425F57p28p56K53j80J589q42j784J821J193r64q41k27J754O55k239r0J952o12
1443F11r29k44O46J292k410q38K993j83j842o85J405J852j498k436K424J487j387
1460B58n04j08J881m90k267R45J805j538j000L15J325L29k653k30K921P3j596
1477e34n90N93K246p29k387J737Q27n29p49j63J477j4k451M73K117q17j371j088
1495a952K188J929k866j746K943J381j850j413J098K677j255k858K157J611j672
1510C72j398L79K449q27l512J316K890j461j713K43J893J184k970n04K916k62
1526I95j404n2Q20R05j112j052J608P02j657n63M20J038J94k294L78J672j53j020
$$ plain form
1544 -575 -999 -117 1510 199 -1082 773 1129 210 -232 -98 1463 502 -1880 -191 1610 102 -1118
1561 -1118 -1193 660 1135 -1843 -1122 1540 592 -997 -622 898 1337 -682 -1027 1704 1001 -780 -753 399
1579 399 1011 -694 -1589 504 669 -1099 -292 77 306 -81 -677 145 669 -350 -32 537 -96 531 212
1598 212 -389 332 -247 -71 -14 -775 262 241 -1030 -436 414 57 -381 -947 395 1337 -932 -692 1188
1617 1188 611 -217 -532 285 1200 -424 -1066 1071 524 -1073 -715 103 552 -752 -1248 957 476 -1095
1635 -1095 -75 757 267 -137 -591 897 934 -993 -198 925 -129 -507 -10 249 255 -1094 -207 679 -600
1654 -600 -487 484 239 161 -347 132 901 -352 -172 1175 378 -351 199 348 121 -434 -940 746 11
1673 11 -1342 112 361 -655 -505 -129 1066 -96 -1078 888 1003 -461 264 522 354 10 -931 418
$$ packed form
1544e75m24Q82J627j311j281J855L56r19m42J34J561r61k382J689J801j508j220
1561a118p5J853M75k978P21K662r48j589L75J520M39k019l45K731p03j781K7J152
1579C99O12j705q95K093J65j768Q07L69K29l87n96Q22N24j019L18N69o33O27l19
1598B12o01P21n79J76N7p61J037k1j271N94Q50l57m38n66J342R42k269K40J880
1617A188n77q28l15Q17R15j624o42K137n47j597L58Q18M49j304m96K205m81j571
1635a095J020Q32m90m04m54J488L7j927P95J123j054l78M97K59Oj349Q87Q86j279
1654f00J13R71k45p8n08M79P69j253J80J347p97p29N50J49k27n55n06J686p35
1673A1j353J454K49j016J50L76J195j162r82J966J15j464P25K58j68l44r41J349
$$ plain form
1691 418 773 -1211 -626 411 -137 -375 -504 350 654 -887 -524 1100 111 -587 64 497 607 -131 -10
1710 -10 1049 -73 -697 490 220 -265 -317 -419 285 -391 -901 268 332 -843 -118 385 425 -44 -287 935
1730 935 848 -649 94 739 -10 -309 -272 278 116 -736 -203 438 -706 -582 315 149 139 -300 58 870
1750 870 -314 2 856 250 -357 -33 -68 490 -171 -788 673 159 -810 -12 137 -37 59 -580 671 573
1770 573 -681 173 857 113 49 89 496 568 -589 151 656 -331 -176 111 -351 -215 -584 -325 408 -425
1790 -425 -71 552 -33 -125 390 132 367 -48 -148 735 155 -453 415 129 -305 -318 -288 308 -372 -804 430
1811 430 159 -453 141 286 373 266 -593 746 750 -584 -101 416 -11 -88 -489 131 431 -693 -716 143 -40
1832 -40 -590 -146 -83 472 -319 -138 620 -276 -49 651 -249 50 306 -125 203 -214 -839 329 -99 -332
$$ packed form
1691D18L55j984N85J037n48k38j29Q54L04j541L63J624r89o98O51M33J10p38J21
1710a0J059j122o24J187k70m85n2j02P04o76n10J169O4j175P25N03M0m69k43J222
1730I35q7j497P43O45p49k99L7N50j62q52N33O41j144J24Q97j66j0m39L58Q12
1750H70j184L16Q54o06o07L24l5N58o61o17J461n14r69P98J49j74R6o39J251r8
1770E73j254Q54O84p44o4M0M07P2j157P40N05r87J55K87m62J36l69K59P33q33
1790d25L54O23n85r2N15k58K35m15j00Q83n80o08Q68k86m34j3L0N96o80m32J234
1811D30k71o12N94J45Q7j07q59J339Mj334M83N17m27p7m01O20L00j124k3Q59j83
1832d0n50M44O3N55p91J81P58q96K27P00r00K99K56m31L28m17o25J168m28k33
$$ plain form
1852 -332 68 -304 118 -33 -507 477 325 -492 482 482 2 220 -144 668 576 -559 248 519 -594 -267
1872 -267 -250 -129 -63 -798 -386 666 -398 -171 269 134 257 150 25 638 -123 -121 352 39 -105 220 -27
1893 -27 204 -65 -310 398 -552 -278 535 78 -492 -37 79 445 100 -694 787 649 -573 12 491 117
1913 117 382 -454 148 867 -792 -713 465 37 -168 -710 -213 775 -210 -265 433 182 406 91 -401 596
1933 596 368 -711 104 371 15 -263 -577 -97 288 -349 -612 379 247 180 -265 -566 672 431 -498 266
1953 266 205 638 -104 -514 614 492 -697 -458 441 -19 -226 -1122 192 771 -421 -655 71 522 679
1972 679 -638 -158 1129 165 -509 403 261 539 -139 -558 605 502 -1026 -319 237 149 -225 -869 -33
1991 -33 987 -264 -651 347 512 459 -430 -204 970 -134 -801 341 300 -129 -394 -431 372 471 -882 152
$$ packed form
1852c32M00l72M22j51m74R84j52q17R74%m80K18l64Q12r2j135Q07K71j113L27
1872b67J7J21O6p35M12J052j064K27M40j35J23j07j25O13p61KM73l13j44L25k47
1893b7K31k69k45P08r50K74Q13m57n70M55J16L66l45p94J481j38j222N85M79l74
1913A17K65q36O02P19j659P9J178m28k05n42M97R88r85n5O98k51K24l15m92R97
1933E96k28j079Q15K67l56k78l14M80L85o37k63R91j32o7m45l01J238k41r29P64
1953B66o1M33p42m10J128j22j189K39Q99m60k07q96J314N79j192k34P26M51J57
1972F79j317M80J287r64o74R12j42K78o78m19J163j03j528P07N56q8l74o44Q36
1991c3J020j251l87R98J65n3q89K26J174j104o67J142m1m29k65l7Q03R9j353J034
$$ plain form
2011 152 253 187 -177 -657 320 468 -262 -100 410 271 186 99 -182 849 -223 -311 -30 110 -52 -231 -952
2032 -952 69 354 -613 -380 -119 343 400 -376 227 1071 -104 -419 -116 231 290 -444 -328 868 -25 -924
2052 -924 -38 362 254 -623 -693 748 159 -934 285 692 156 -516 -267 551 537 -580 62 697 -275
2071 -275 -493 -348 -67 -33 -700 -363 188 -545 -122 308 -242 -218 194 48 122 -100 194 763 -289 -69 513
2092 513 -159 -476 -263 -13 417 -526 -685 555 142 -790 100 280 332 -415 -491 795 517 -702 10 870
2112 870 352 -230 -601 603 413 -931 -462 398 -495 -460 -149 -12 358 -286 -463 618 -200 -427 421
2131 421 276 380 -64 -150 551 -16 -301 361 -270 -514 16 -53 -82 -482 -148 351 -128 -829 521 249 -214
2152 -214 -221 138 772 96 -870 523 650 -406 -317 -18 302 -181 -606 142 354 -700 -484 459 241 -35
$$ packed form
2011A52J01o6l64m80R77J48p30J62N10j39q5q7k81J031j072q8K81J40j62j79p21
2032i52J021K85r67K33K61M62N7p76O03Q44j175l15L03L47N9p34J16J196q93q99
2052i24Q86M00j08q77p0J441n89j093J219M07n36o72K49Q18j4j117O42O35r72
2071b75k18J45K81L4o67L37N51p33M23M30n50K4M12j46P4k22K94N69j052K20N82
2092E13o72l17K13K50M30r43j59J240m13r32Q90J80N2p47p6J286k78j219P12Q60
2112H70n18n82l71J204j90j344M69Q60q93L5L11J37L70o44j77J081q18k27Q48
2131D21j45J04m44q6P01n67k85O62o31k44N30o9k9m00L34M99m79p01J350k72m63
2152b14pL59O34o76r66J393J27j056Q9K99L20m83m25P48K12j054K16R43k18k76
$$ plain form
2172 -35 -195 368 469 -434 -238 780 -113 -151 173 192 145 -268 -26 561 -399 -498 390 61 -393 -520 -26
2193 -26 258 -347 -112 441 514 -488 -32 629 213 -69 -321 744 180 -686 -26 631 -40 -623 -169 215
2213 215 227 -686 90 1030 -196 -157 352 322 218 -152 -13 649 -153 -627 182 -130 -558 -181 61 152 -278
2234 -278 -545 570 -40 -414 299 466 -336 79 35 513 55 -638 419 577 -280 -515 47 263 32 -777
2254 -777 -109 435 -289 -404 416 10 -407 -65 310 565 -496 26 715 174 -430 -66 7 76 -300 -203 423
2275 423 -161 -654 340 293 -293 -371 -21 374 -315 -323 402 524 -177 3 484 325 18 -372 502 342 -1206
2296 -1206 -257 361 0 -513 -333 286 164 -778 147 528 -32 -61 196 482 -27 -247 -189 643 -164 -236 130
2317 130 -111 -271 -29 -205 230 -270 -286 364 -177 -332 244 -17 31 68 -19 678 239 -381 437 212 -230
$$ packed form
2172c5j60N63J01r03J96J018q93l8L24J9m7m13K42N87r60r9Q88l29m54j27M94
2193b6K84o05K35N53P3j002M56O61m16k82k52J065n64q66O60O57o71n83M54L84
2213B15J2r13P76R40j226L9N09l0j04l70J39O62q02m74Q09l12m28L77K42R1m30
2234b78k67J115o10l74P13J67q02M15m4M78m58o93J057J58q57k35N62K16k31q09
2254g77O68N44p24j15Q20m06m17L42L75K55j061N22O89n41o04L64P3O9l76R7O26
2275D23n84m93R94m7n86p8L50L95o89qP25J22p01J80M81j59l07l90Q74j60j548
2296a206R49O18l61n13J80O19j22r42R25L81n60k9K57K86n09k20N8Q32q07p2L66
2317A30k41j60K42j76M35n00j6O50n41j55N76k61M8L7q7O97m39o20Q18k25m42
$$ plain form
2338 -230 -182 236 486 -182 -637 136 593 -636 -344 98 -41 109 -574 27 647 -173 -358 406 160 150
2358 150 -62 -162 339 -210 -292 92 -68 -243 -72 -58 14 85 -233 -29 67 -299 286 43 -386 325 176 188
2380 188 226 -180 379 32 -420 25 346 -135 -126 -259 166 -195 -578 -279 422 -138 -198 -269 322 365 -69 -71 363
2403 363 -333 -15 106 -3 222 -253 -268 196 140 -740 322 69 50 264 -116 -92 234 98 331 43 50 369
2425 369 218 -208 142 -192 243 -213 -238 70 -51 -603 119 233 -87 -127 -349 304 434 -314 -5 356 284
2446 284 177 -245 -136 322 -307 -562 240 -28 -374 -124 -305 378 -134 -692 -15 166 -290 -206 105 328
2466 328 300 -385 -34 298 -174 77 -124 -34 427 -349 -193 -45 -66 -26 -125 -138 427 156 -297 64 281 79
2488 79 111 -468 131 403 -211 -227 222 87 -239 -296 -55 256 -309 -493 425 134 -314 91 -129 222 187 -450
$$ packed form
2338b30M8M18K50o68m55P73M57j229K92M42j39J50o83O01O20q20j85P64k46j0
2358A50k12j00N01n49q2L84j60j75J71J4P2P1l18K04R6l66N85k43m29P11j49J2
2380A88L8m06N59l47m52M45L21m81Rj33M25l61l83K99P01n60o0p1N91M3m34kM34
2403C63o96L18J21j09K25m75j5M64n6q80J062k53j9K14l80K4L26j36K33k88PL19
2425C69j51m26L50l34M35m56k5L08j21n52P22J14l20m0k22O53J30p48L09L61p2
2446B84j07m22J09M58o29k55Q02k68l46K50j81O83n12n58O77J81m56Q4L11K23
2466C28k8o85L51L32m72K51k01R0M61p76J56J48k1M0r9j3N65k71m53L61K17k02
2488G9L2n79N99K72o14j6M49j35l26n7K41L11n65j84R18k91m48M05k20L51l5o37
$$ plain form
2510 -450 120 13 108 88 -46 61 406 -492 60 383 -177 137 -182 -236 295 -243 -286 307 298 -205 -49 53
2532 53 329 240 -263 322 -5 4 128 -345 264 156 -416 -68 -21 -347 -86 -21 -2 311 -162 62 -21 15 52
2555 52 120 -78 438 287 8 205 -283 65 -56 -360 -78 182 -494 -152 45 80 273 -346 -273 353 133
2576 133 -74 88 496 84 65 -25 516 87 -428 -152 212 -13 -280 -26 87 131 -521 5 547 -350 -163
2597 -163 98 144 71 127 65 242 -49 72 144 -206 93 221 -236 -45 -100 -55 45 -63 -263 86 72 -91 -86
2620 -86 13 247 105 -157 404 167 -174 -110 -22 146 -191 -239 143 533 -383 -119 -18 -188 -45 -201 54 290
2642 290 -109 -129 561 -187 232 143 153 149 -265 -62 395 -121 -316 161 48 -24 23 15 427 -191 -258 313 35
2665 35 -237 573 75 167 -51 -183 140 164 -655 25 287 -23 -123 -173 300 -52 -365 23 -61 -221 -247 23
$$ packed form
2510d50N70j07R5k0j34J07L45q98N52L23n60L14l19n4N31n38m3N93rn03J56J02
2532E3K76q9n03N85l27RJ24m73O09j08n72L48M7l26K61O5J9L13m73K24q3L6L7
2555E2O8j98N16j51k79J97m88L48j21l04K82K60o76L42J97L5J93o19P3O26k20
2576A33k07J62M08m12j9r0N41m29n15K76L64k25k67K54J13M4o52N26N42q97J87
2597a63K61M6p3N6o2J77k91J21P2l50K99J28m57J91n5M5J00j08k00L49j4j63N
2620h6R9K34j42k62N61k37l41O4Q8J68l37m8L82L90r16K64J01j70J43j56K55K36
2642B90l99k0O90p48M19q9J0mm14K03M57n16j95M77j13p2M7qM12o18o7N71k78
2665C5k72Q10m98R2k18j32L23K4q19O80K62l10j00n0M73l52l13L88q4j60k6K70
$$ plain form
2687 23 -58 63 -494 159 834 -308 -298 395 -121 81 30 -225 91 -333 -434 193 -168 -502 136 396 144
2708 144 -143 48 320 248 -271 -58 20 -23 84 176 235 -219 -402 317 229 -369 -63 135 -115 -199 -317 -43
2730 -43 270 -274 70 300 12 -385 162 337 678 -279 -357 358 155 -36 -169 112 -103 -148 -297 259 -166
2751 -166 -406 303 248 -21 -63 -79 264 31 -296 163 -11 -213 188 322 -36 -67 -95 438 332 -368 -89 398
2773 398 -25 -217 130 283 245 -67 176 561 -67 -194 417 255 -43 -265 -67 277 -166 -342 437 -313
2793 -313 -125 -97 68 295 -113 -271 -38 37 -62 305 -4 2 11 -7 67 148 -512 -61 275 -143 -192 -131 180 -15
2817 -15 -364 183 156 -295 -389 432 204 128 -74 421 193 -120 -132 299 42 -170 -137 -67 62 -353 -175 546
2839 546 37 -151 115 87 257 -145 -125 327 16 -287 397 -61 102 15 -116 36 37 -218 106 366 -324 -197
$$ packed form
2687B3q1J21n57O53O75j142J0O93n16K02n1k55L16m24j01O27l61l34O38K60k52
2708A44k87J91K72p2n19K13P8m3J07R2N9m54j83P19q8n98L06J98k50q4j18K74
2730d3L13n44L44K30k88l97N47J75L41r57p8P15k03j91j33K81k15m5j49N56m25
2751a66k40P09n5k69m2j6L43k33l27M59j74k02M01J34l58l1k8N33j06p00K79M87
2773C98m23j92L47J53l8l12K43L85o28j27O11j62k98k22J98L44m43j76P79p50
2793c13J88K8J65K27m08j58K33P5r9L67l09ORj8P4Q1o60M51L36m18m9O1L11j95
2817a5l49N47k7m51r4Q21k28p6k02M95k28l13j2M31k57k12L3P0J29m15J78P21
2839E46n09j88K66k8J70m02K0M52l11l03O84m58J63q7j31J52Jk55L24K60o90J27
$$ plain form
2861 -197 7 -265 -20 -70 105 -8 -335 200 202 217 -99 147 187 73 -291 -180 303 -77 -186 93 108 -178
2883 -178 -56 174 195 -23 -439 112 190 -145 -66 161 41 333 -67 156 110 -248 113 -77 0 55 -133 -212
2905 -212 247 -157 39 214 -173 -106 73 133 -2 35 75 -134 -387 114 221 -247 -157 -71 87 178 -254 -190 360
2928 360 -107 -161 -20 -48 9 -134 -211 552 -65 -62 -59 159 -100 23 -267 121 224 -280 4 31 -13 -48 52 -26
2952 -26 226 -270 118 -249 202 -112 206 105 -18 -106 14 -104 -94 149 408 -317 -93 -73 -338 -263 -280 -123
2974 -123 336 -213 -305 400 -173 -5 120 162 150 -164 27 289 33 -328 -96 -57 -202 235 -432 247 230 -57
2996 -57 8 19 -97 206 -267 -156 287 -81 -151 -17 -15 145 365 -152 138 -5 -207 -174 -247 -84 52 -104 297
3019 297 -20 -16 206 -226 -49 45 -125 -125 289 26 -84 -93 -184 281 15 -205 88 -154 -43 -146 -319 -21 53
$$ packed form
2861a97K04k72K45n0J75j13l27N35KJ5l16K46M0j14l64J11M83l80j09K79J5k86
2883a78J22K30K1k18m16N51P8l35P9K27j20K92m00K23m6l58L61j90P7N5j88p9
2905b12M59m04J96J75l87O7J79O0j35L7M0k09k53N01J07m68R0Q6J58R1m32O4N50
2928C60m67n4J41k8N7j43p7P63o17LLK18k59J23k90L88J03n04K84K7m4l5J00p8
2952b6K52m96L88l67M51l14L18j01j23q8J20j18J0K43K59p25K24K0k65P5j7J57
2974a23M59n49r2P05n73J68J25M2j2l14J91K62k56l61K32L9j45M37o67O79j7k87
2996e7O5J1j16L03m73J11M43l68p0J34KJ60K20n17K90j43k02L3p3J63J36j56M01
3019B97l17MK22m32J77R4j70%M14k63j10rr1M65k66k20K93k42J11j03j73K98P4
$$ plain form
3042 53 -309 58 177 -165 -101 30 -4 10 355 -171 -47 200 181 -213 -127 -41 134 -133 -112 -38 -143 41 -84
3065 -84 -189 292 147 -313 119 -166 60 188 -176 288 186 -39 100 -54 -103 49 -316 -91 15 -29 174
3086 174 -20 -84 116 -239 7 140 -122 -16 286 159 -54 -9 -23 67 -244 -117 -71 -11 -22 -54 -296 -41 88
3109 88 -349 38 -126 41 198 -302 37 241 -99 121 311 226 4 -92 -97 21 -237 100 37 -118 274 84
3131 84 197 -291 203 -60 357 114 -40 -14 -41 -234 330 126 -108 -24 -243 149 18 22 71 175 -194 -95 -25
3154 -25 264 208 -370 423 310 -78 -146 174 199 23 -182 -24 277 65 -181 -55 131 153 -115 -69 253 -198
3176 -198 -77 10 32 411 102 -122 107 190 -110 259 -89 -226 -70 -113 74 66 180 -43 24 -20 -219 -87 -352
3199 -352 -25 -166 -87 -52 155 288 250 -174 34 225 76 -65 243 70 5 -17 -36 -4 120 -323 95 365
$$ packed form
3042E3l62L67J19l42O4J31l4J4L45n26J24K47j9l94Q6Q6J75k67K1P4j05J84j25
3065h4j05M81j45m60M32k85K26J28l64M64j02k25J39j54m9J52l65K25J06m4K03
3086A74j94o4K00l55K46J33k62J06L02j27k13M5j4R0l11J27M6O0j1l2k42K55J29
3109H8m37L87j64J67J57n00L39K04l40K20J90q5k22r6nJ18k58L37o3j55L92j90
3131H4J13m88M94k63M17k43j54K6k7j93N64k04k34Q4k19L92j31MM9J04l69R9P0
3154b5K89n6n78P93j13l88o8L20K5j76k05J58L01k12k46J26J86K2k68M6L22m51
3176a98J21Q7K2L79l09k24K29Q3l00L69l48j37J56m3J87qJ14k23O7m4j99J32k65
3199c52L27j41P9L5K07J33l8m24K08J91j49j41L08j73o5k2j9L2J24m43M18K70
$$ plain form
3221 365 153 -25 -83 422 68 -303 173 -40 12 213 73 246 -187 232 141 129 -187 62 32 -81 373 -151
3243 -151 154 -58 -174 142 -102 -73 142 -30 92 -230 -373 51 68 -237 -89 115 2 -36 198 75 33
3264 33 -320 -132 62 177 -49 82 -8 129 320 -78 459 80 -114 217 120 -200 -52 -58 139 263 -271 -155
3286 -155 -38 -313 49 198 -87 -199 -63 54 108 -201 -308 157 1 -35 25 242 71 -443 -318 104 -183
3307 -183 -113 -284 -175 137 -193 -315 225 99 -30 260 -2 -68 -53 -76 80 -143 -67 76 115 67 -60 -396
3329 -396 208 -155 78 90 83 -76 46 48 173 130 46 188 354 -57 70 10 109 10 60 -402 -71 -342 -170 198
3353 198 -220 -63 203 -133 -8 -5 29 66 4 -455 155 -164 -343 -24 -20 29 -210 -342 -80 -15 -183 131 6
3376 6 -49 -56 71 125 -4 217 11 70 -146 -99 -65 94 -24 -271 -48 37 -202 279 -140 -29 -79 70 150 39
$$ packed form
3221C65k12j78n8N05l54l71M76k13N2K01j40J73m33M19r1j2l16K49l0j13M54n24
3243a51L05k12j16L16k44K9K15j72J22l22j43M24J7l05J48K04j13l8K34j23m2
3264C3l53J88J94J15k26J31r0J37J91l98N37l79j94L31r7l20J48oJ97J24n34J16
3286a55J17k75L62J49k85j12J36J17N4l09j07M65j56l6O0K17j71n14J25M22k87
3307a83P0j71J09L12l30j22N40j26j29K90k62o6J5k3J56k23P6J43L9m8j27l36
3329c96O04l63K33J2pj59J22KJ25m3q4J42J66m11J27o0R9r9N0m62L31k71J72L68
3353A98m18J57K66l36J25LL4L7o2m59O10l19j79L19MM9k39j32K62O5j68L14j25
3376Fn5pJ27N4j29K21k06N9k16M7L4J59j18k47K23Q5k39M81m19J11n0J49Q0j11
$$ plain form
3400 39 -158 -91 184 89 -21 356 -33 10 241 -62 98 156 -48 -175 20 -237 -92 -106 98 99 9 21 121
3423 121 5 -236 -11 -9 172 83 192 302 60 -136 -144 -99 -132 85 -280 72 53 -125 27 -209 -172 49 -99
3446 -99 110 24 -205 30 144 -364 105 -69 -5 -111 -105 198 -203 -125 -207 34 -41 26 18 -9 40 -14 -126 146 -51
3471 -51 -22 -63 -157 116 -52 -132 17 189 -176 80 -56 -180 292 -169 237 -189 -335 -32 282 7 57 -85
3493 -85 -88 8 -56 -82 154 148 175 -134 10 239 -120 219 -229 42 188 38 -80 -257 190 -73 -36 12 9 -22 75
3518 75 157 -14 -198 -1 99 -149 188 -164 -175 65 -18 -76 -222 0 -117 -105 -151 235 178 -45 119 223 -24
3541 -24 -62 30 3 219 -167 109 39 152 426 110 -69 -146 -13 -14 -80 -117 -142 61 15 274 193 -97 -82 49 219
3566 219 180 -179 -154 403 -242 -45 128 318 38 26 -4 -113 175 174 6 136 149 43 -100 335 120 216 100
$$ packed form
3400C9j97O7K75r5j10L77l89M3K31l03J60N8k04j27J95k57J45j4K04Jr0J2J00
3423A21j16k41K25KJ81q9J09J10k42j96qM5l3K17l65L52j9j78J52k36L7K21j48
3446i9K09q6k29K35J14n08M69j74O4j06OL03m01P8q2K41p5O7qk7M9n4j12K72j97
3471e1K9m1r4K73j68q0J49J72l65K56j36j24M72m61M06m26j46L03L14k75N0j42
3493h5lR6o4k6K36oK7l09J44K29l59L39m48K71J46j50j18j77M47k63L7M8ll1R7
3518G5Q2j71j84J97J00k48L37l52j1K40q3n8j46K22j17J2m6L86n7k23J64J04k47
3541b4l8R2k7K16l86K76p0J13K74l16j79p7J33jo6l7k5K03m6K59q1k90J5J31J70
3566B19l9l59K5N57o45J97J73J90k80j2l0j09K88jj68J30J3j06j43M35k15R6j16
$$ plain form
3589 100 -114 254 223 -234 130 -203 12 -26 -72 -75 -7 -176 -121 38 -133 388 30 230 306 312 -135 -25 35 -220
3613 -220 43 -43 185 56 -30 11 -225 -53 -224 -72 221 49 287 -185 193 10 -139 405 -204 90 191
3634 191 239 -117 -50 206 -110 -203 -24 106 -7 -22 85 -170 265 70 -211 148 119 -695 28 162 -63 43
3656 43 -86 143 -75 124 140 6 110 5 -186 53 -49 24 162 56 233 55 40 53 -141 25 135 -154
3678 -154 -206 -209 63 -193 -167 92 -79 37 -44 57 127 -181 75 -27 -143 4 78 15 -68 49 -110 141 47
3701 47 209 115 -92 -114 9 92 -30 -234 -206 50 124 38 88 50 100 -101 -13 53 -103 41 79 -86 -123 -179 -59
3726 -59 26 -41 74 61 -70 -7 18 164 9 -339 84 -151 31 -15 33 373 122 45 -236 77 79 -50 12 107
3750 107 5 -227 -73 -29 -138 -13 -31 -52 -129 -74 59 118 -160 -93 53 -37 124 78 -148 -6 -117 -267 56
$$ packed form
3589A00k14L68l1m57L64l33K15l8m6lO8j69N5J59j71N21l58K00P6Om47J10O0k55
3613b20K63q6K28j29q6M1k36J72j71J52K93j72K38m72L78j83j49N44o09K94J01
3634A91M8l56O7K56l16r3J79J30j13j5J07k55M35j95k81L59k9q14P23J34k25J06
3656D3j29K29k18J99J6j34J04j05j91K39j02P3J38j06J77j78j5J3j94J66J10k89
3678a54n2lK72k56K6K59j71J16q1J01P0l08K56j02j16J47P4o3q3J17j59K51r4
3701D7J62r4k07k2J23Q3j22k04K8K56P4q6N0l8N0k01Q8O6j56J44L8j65l7n6J20
3726e9Q5o7J15j3j31O3K5J46j55l48M23k35J82m6M8L40k51p7k81L13Kj29O2R5
3750A07j02k32J54M4j09J25j8k1p7N5J33N9k78O7J46r0J61m6k26J42j11j50L23
$$ plain form
3773 56 -240 -108 -32 -289 35 -398 -134 -22 -135 -52 29 163 120 -189 45 26 -151 -159 -63 -29 70 72 -267 158
3797 158 195 -164 -30 -72 -173 203 -165 -281 248 -100 85 197 33 -265 -4 -134 127 -118 98 89 99 -202
3819 -202 -185 143 -162 29 -14 -32 44 67 -94 23 -60 172 171 78 140 219 -183 -168 36 118 -130 -176 125 20 50
3844 50 226 45 132 125 -97 -28 24 -32 364 149 176 71 -56 42 155 -386 -152 141 -53 -120 76 47 102 63
3868 63 -83 48 258 128 -330 -105 -87 185 -170 107 -149 -12 154 -246 -289 366 -2 -72 -243 -2 91 -236
3890 -236 -83 -531 170 67 -90 -22 116 -387 4 -133 -25 -43 -158 -72 11 114 10 -5 32 8 109 141 78
3913 78 -119 -102 6 274 -76 65 205 70 320 182 -219 106 8 263 183 -259 -107 -25 137 37 130 -86
3935 -86 22 133 50 -197 104 -123 228 115 83 18 116 -21 293 184 30 178 -57 -37 -127 8 -20 -276 55
$$ packed form
3773E6k96J32P6k57L24m33K64J12j13Q3Q1J34m3l09K34j9j77qR6L4R9Kl39M25
3797A58L7l59J34m2j01L76l68j16N29l48J85J12j64k98K61j30K61k45K16rJ0l01
3819b02J7L28l05J91m3j8P6K3j61J17q3K32jr3O2P9m02J5K04Q2k48m6L01j05L0
3844E0J76j81Q7pk22O9N2n6L96k15K7j05j27R8J13n41K34K93j94o7J96k9N5l9
3868F3j46J31K10j30m58K25J8K72l55K77k56J37J66m00m3O55l68p0j71K41R3l27
3890b36J53m48P01j03j57O8J38n03L91j37J08j8j15Q6Q3J03j04j5L7k4J01L2o3
3913G8j97J7J08K68l50J41J40j35K50j38m01L25r8K55q0m42J52Q2J62j00R3k16
3935h6J08J11q3k47L01k27L51j13l2o5R8j37L14j09j54J48k35K0r0J35k8k56L31
$$ plain form
3958 55 175 -6 -253 126 -133 7 -54 358 147 5 -258 143 -208 -288 -33 -134 98 11 -6 227 200 22
3980 22 152 98 -135 9 -7 9 219 -234 -2 120 13 70 -301 54 207 -239 272 24 55 -157 -63 -88 -178
4003 -178 -65 163 7 -196 -128 141 14 -245 260 155 156 -133 -172 -172 314 47 -22 29 212 110 168 246 -265
4026 -265 25 -166 -62 -122 124 -115 -15 -308 -285 -99 91 -78 120 -158 -330 160 -153 6 39 -165 -144
4047 -144 42 -208 -134 -399 -127 163 -104 123 -140 207 -12 149 -141 -63 -32 -233 -46 -47 153 96 -181 -103
4069 -103 7 208 51 189 87 -1 113 -34 177 -310 155 -115 -127 207 403 -22 -35 -35 24 -1 22 -80 143
4092 143 -39 2 11 -250 35 240 10 58 -47 -177 -131 174 -136 100 -121 60 -13 72 -59 123 63 -171 137
4115 137 -81 -1 -97 25 38 193 142 -134 -134 -160 -60 -40 -233 173 18 92 367 82 -203 49 78 284 -30
$$ packed form
3958E5J20j81k47L79k59J40o1M12k11j42k63M01l51q0K55j01K32q7j7K33k7j78
3980B2J30n4k33J44j6J6K10m53K32J22j07N7l71L55J53m46N11k48L1k12R4k5r0
4003a78J13K28j56k03O8K69j27k59N05j05Jk89l9%M86k67o9N1J83j02N8P8n11
4026b65K90j91J04o0K46k39J00k93K3J86J90j69J98k78j72M90l13J59L3k04K1
4047a44J86k50P4k65K72K90k67K27k63L47k19J61k90P8L1k01J87jK00n7k77P8
4069a03J10K01j57J38j02q8J14j47K11m87M65k70j2L34J96m25j3%N9k5K3j02K23
4092A43j82M1Rk61K85K05k30M8j05j30M6L05l10K36k21J81p3Q5j31J82o0k34L08
4115A37k18Q0r6J22J3J55n1k76%k6J00K0j93M06j55P4K75k85k85K52K9K06l14
$$ plain form
4138 -30 59 44 78 -6 83 177 48 157 -183 182 146 -78 -103 13 186 55 5 153 -19 -119 -61 87 22 -44
4162 -44 160 -108 106 89 -110 82 -111 19 -33 -150 -23 53 127 -9 -196 -127 -151 195 -26 63 96 -46 6
4185 6 69 21 32 27 117 -140 -238 27 -84 264 29 -40 -50 -79 -287 141 70 -106 -4 204 208 36 -59 -27 -42 8
4211 8 3 -38 -182 -104 -84 71 -190 -66 186 41 259 -200 -138 51 244 -47 -135 -177 -91 69 -218 -55 64 -225
4235 -225 -89 -42 188 10 -52 -38 44 -54 -330 215 59 -65 -119 -116 -78 141 -85 -146 76 253 -59 104 3
4258 3 195 -144 112 244 16 112 168 69 187 -237 -332 -61 0 142 21 44 -243 98 89 -191 103 -82 -235
4281 -235 55 -132 37 42 -5 -221 -176 150 -22 -96 191 58 81 142 190 54 149 88 48 -293 -323 15 -107 -147
4305 -147 287 40 51 194 -178 -91 -42 -14 -174 143 36 49 130 198 9 -120 -280 -76 -171 -37 -160 -301 153
$$ packed form
4138c0Q9j5L4q4Q9R4j29J09l40L65l6k24k5J16J73j31n0J48j72j00N8J48o5o6
4162d4K04k68K14j7j99J92j93J30n2j17J27P6P4j36j87O9k4L46k21Q9L3j42N2
4185FO3m8J1nR0k57r8K65j11L48k35o9j0k9k08M28p1j76J02K08Mj72r5L2j5N0
4211Hnm1j44P8K0J55k61J24K52j45K18m59O2J89J93k91q8m2Q6J60k87J63J19k89
4235b25J36M7K30j78o2J4Q2r8k76N45j56j24n4LL8K19k26o1K22J77l12J63j01
4258CJ92l39K56J32k28R6N6r9J18m24r5K71O1J42j21K3k87L41rk80K94j85j53
4281b35K90j87J69Nm7k16M5L26j72p4K87j33K3O1M8j36R5o1m0l41l0L38j22m0
4305a47M34k47J1J43l72Q7M9K8j60L17j07J3Q1O8j89j29j60K04r5J34j23j41M54
$$ plain form
4328 153 223 50 138 144 -28 -16 89 -170 -44 -49 7 5 -43 26 -199 62 -139 -19 -163 -182 -108 -263 -56 10 -104
4353 -104 34 -255 -110 -112 -98 -53 41 -260 -32 -144 7 234 37 194 7 84 33 236 -301 63 -48 56
4375 56 95 170 174 48 207 -17 -72 -44 59 64 -148 26 137 24 -66 -108 -128 160 126 -194 -31 -62 176 -119 -7
4400 -7 -6 -85 118 -4 190 226 95 71 -177 -116 -91 -69 106 -106 -122 24 -64 -62 -155 -37 -169 -89 77 40 82 21
4426 21 33 31 269 -40 -67 -13 -25 177 383 -275 -70 -169 -69 18 -41 106 44 10 -27 -275 -166 8 43 251 76
4451 76 163 -202 -21 -230 -270 -34 56 -135 55 52 -112 -96 -23 237 -156 -78 114 33 -24 -80 80 41 -156 67
4475 67 -144 -103 192 176 33 35 -56 -234 1 49 -311 -210 -98 157 192 102 157 -110 133 42 -46 -9 110 97 176
4500 176 84 -88 -131 -48 -121 -45 163 12 78 -19 133 233 -265 176 -15 169 48 119 -185 131 93 133 114 -235
$$ packed form
4328A53P0j73Q8Oj72J2J05k59J26nN6km8O9k25K61k01J20j44j9P4j55K07O6j14
4353a04J38k89J45kJ4M5R4l01K28j12J51K27j97J57j87P7n1K03n37L64j11J04
4375E6L9P5Mj26J59k24n5K8J03Nk12J74J11j13r0m2k0K88l4l20J63l1K38k95J12
4400gJp9K03j22J94L6j31k4k48O1K5K2J75k12j6J46q8Kr3J18j32Q0J66l7M2o1
4426B1J2kK38l09k7N4j2K02K06o58K05r9J00Q7n9J47o2l4l7k48J09J74L5K08j75
4451G6Q7l65J81k09m0K36R0j91J90lj64J6P3K60l93P8J92q1n7n6J60l9j97K23
4475F7k11M1K95j6j43Kr1j78K35M8l60J01J12K55L5r0N5k67K43r1q8L7J19j3P9
4500A76r2j72m3Q3p3P6K08j51O6r7J52J00m98M41j91J84j21P1l04L16l8M0j9l49
$$ plain form
4524 -235 -22 -313 -67 -42 -49 219 185 125 161 -137 -270 142 -115 69 106 110 15 96 182 -38 -86 -192 371 200
4548 200 108 87 -61 -273 10 -136 -179 -166 -11 660 165 -260 177 117 166 -206 287 -245 -67 8 154 -29
4570 -29 46 -296 -88 -45 -154 137 -21 81 -330 199 78 75 127 105 242 201 -40 85 3 -89 -152 -79 113 -95
4594 -95 -38 -12 237 237 235 -116 -477 -81 107 151 133 173 -148 -20 -28 -176 17 -35 20 -220 92 13 -28 18 71 65 151
4621 151 1 1 -114 65 35 -77 48 29 251 56 -152 -75 -107 -168 283 -144 -164 46 -17 -200 -22 -260 -9
4644 -9 -69 -101 -96 134 -91 116 33 116 27 -186 190 9 -203 -257 -79 -126 78 12 -109 -37 201 10 200 39
4668 39 -133 -74 64 -261 175 72 135 70 157 -116 117 -253 54 28 191 203 67 114 49 -87 96 78 -438
4691 -438 177 -18 -259 -34 120 -61 124 -155 -343 135 -8 -157 -47 -208 -202 -116 0 171 92 -18 62 79
$$ packed form
4524b35K13k91K46K5pK68l4o0L6k98j33M12k57J84L7Mr5Q1Q6k20m8j06N63j71
4548B00r2k1j48k12K83j46m3J3J55O71m95m25M37o0M9l72M93n32J78P5J46j83
4570b9P5l42K08M3j09K91j58J02m11N29j21lN2k2J37m1k41J25q2r2o3P3J92k08
4594i5N7K6K49%kl51l61L96J88M4j8M0l21J28qj48J93n2N5k40L12p9m1M6N3oQ6
4621A51j50%j15J79l0j12J25j9K22j95k08P7l2o1M51m27k0K10o3j83J78k38K51
4644io0l2NK30k25K07q3Q3q9k13L76j81k12n4J78m7K04o6j21P2K38j91J90j61
4668C9j72N9J38l25M36j03O3o5Q7k73K33l70L07k6J63J2j36M7o5j36J83j8n16
4691d38O15j95k41K25J54j81J85k79j88M78j43j49J10j61OQ6J16J71p9j10Q0J7
$$ plain form
4713 79 113 9 -94 137 129 -77 13 -147 437 257 -22 191 163 -2 150 115 -35 208 -190 -77 42 7 -299
4736 -299 44 165 250 197 266 57 97 -207 137 315 -23 -36 -225 -32 175 -85 -264 -173 105 79 130 -69 -65
4759 -65 -57 125 91 12 9 5 -292 84 -18 -165 127 -102 -12 232 -131 133 416 -76 -151 59 53 -28 27 -144 -43
4784 -43 130 162 86 147 227 22 -203 -18 243 292 -136 108 -169 63 130 19 13 -154 -81 96 -25 -126 -200 -31
4808 -31 315 -238 221 57 -161 -215 87 18 -316 17 -107 -174 73 -97 25 185 -204 117 224 119 144 40
4830 40 -12 68 26 33 -91 43 75 21 -32 186 150 21 -19 161 -169 -133 176 -151 42 -85 -94 -240 -68 25 -217
4855 -217 199 -11 -74 -53 118 -121 -135 57 -58 -71 -150 -55 106 107 54 -53 -80 -42 16 -42 -76 -69 -99 -62 25 90 92
4882 92 21 -185 -99 -177 40 -99 91 -89 -45 32 9 108 -29 -189 -169 67 304 58 54 -60 30 60 230 -232
$$ packed form
4713G9L4j04j03K31qk06R0j60N84j80k79K13k8j65J52l5j50K43l98J13J19l5l06
4736b99L43J21Q5n3O9k09M0l04L44J78l38j3j89J93K07k60j79R1K78k6N1j99M
4759f5QJ82l4p9lmk97L76j02j47K92k29R0K44l63K64K83m92p5K10oq1N5j71J01
4784d3J73L2p6O1Q0k05k25J85K61M9m28K44k77K32O7j11oj67P3J77j21j01p4J69
4808c1L46n53M59j64k18n4L02o9l34L33j24o7K47j70J22J60l89L21J07j05K5j04
4830D0n2Q0m2Pj24J34L2n4n3K18l6j29m0J80l30L6L09l27J93j27rj46J72R3k42
4855b17M16k10o3K1J71k39j4J92j15j3p9R5J61Jn3j07k7L8N8n8l4Pl0L7Q7O5K
4882I2p1k06Q6p8K17j39J90j80M4P7k3R9j37j60K0K36K37k46mj14R0L0J70m62
$$ plain form
4906 -232 -192 130 -59 -139 -29 2 -32 -90 -119 -32 58 -60 -97 -54 -139 -4 38 -136 -125 -16 -70 46 -200 -106 49
4931 49 -11 37 -36 -58 126 152 93 -99 -224 190 -152 27 363 69 1 15 -228 -58 -195 -29 164 -38 -20
4954 -20 -118 -228 119 75 73 61 12 -192 175 -22 -32 -54 -128 101 -77 -25 -273 -113 294 125 -161 -280 -218 -173
4978 -173 -155 166 -39 -10 71 186 191 41 29 59 60 273 -31 146 -1 -210 62 -6 241 -132 -215 -122 53 -19
5002 -19 213 101 -92 3 214 175 -159 74 -284 56 248 67 -97 69 94 -96 165 130 -169 64 -164 80
5024 80 66 -30 152 -36 27 -100 -141 67 -105 -359 50 -340 -130 -29 -79 -59 12 -281 9 50 -4 167 313
5047 313 -145 289 122 -175 -115 -3 57 79 26 -44 39 -105 39 74 142 -4 85 168 87 -219 -77 -174 33 349
5071 349 33 -187 114 -282 -77 55 95 -101 -128 109 -216 -31 -71 1 86 44 -6 311 -39 31 -254 211 180
$$ packed form
4906b32M0L22j89q0J10L1l4n8k9Q7R0j18l7M3q5J35M2j74J1J09n4J16k46R4J55
4931D9o0M8p3k2J84K6n9j92j25M14l42J79L36k94o8J4k43J70j37J66J93k02J8
4954b0r8j10L47m4kj2m9k04L67j97j0k2p4K29j78N2k48J60M07j69k86j19O2M5
4978a73J8L21k05K9Q1J15Nj50j2L0JK13l04J77j47k09K72o8K47l73q3R3J75p2
5002a9K32j12j93R5K11l9l34K33l58L40J92j81j64J66K5j90K61l5k99K33k28K44
5024H0j4r6J82j88O3j27m1K08j72k54M09l90K10J01n0K0P1k93K90M1n4J71J46
5047C13m58M34j67k97O0J12O0K2n3p0Q3j44J44L5O8j46Q9Q3q1l06J42r7K07L16
5071C49l16k20L01l96K05J32M0j96k7K37l25J85m0P2Q5m2n0L17l50P0k85M65l1
$$ plain form
5094 180 208 -58 96 25 66 -48 -23 50 -46 -39 -10 -160 87 66 78 -214 154 -205 -7 -79 -201 -74 54 -196
5118 -196 -78 87 -14 43 -26 28 -394 -217 -247 -29 152 -103 -19 -61 88 -32 22 -44 -48 218 -154 9 123
5141 123 -100 -276 -57 -74 31 107 -156 -108 -50 126 -96 -52 123 171 112 103 237 18 -129 -5 212 155 -183
5164 -183 45 -9 -109 -60 -17 35 -79 -134 169 279 -9 -81 102 20 -43 338 199 134 218 -146 73 -47 -26 50
5188 50 48 -72 -105 -116 111 187 252 90 -106 -19 155 82 209 -48 144 -1 46 115 -93 33 -40 23 165 187 -29
5213 -29 -136 -34 29 130 150 -5 271 -91 234 -34 73 -56 98 -50 324 48 59 74 207 78 -163 43
5235 43 -96 -74 -130 -58 197 2 191 11 26 30 253 150 273 284 -8 108 20 -227 22 158 83 -42 166
5258 166 -261 314 87 36 -29 -156 -52 42 -29 166 12 31 341 -184 130 46 36 -113 16 -228 155 -66
$$ packed form
5094A80K8k66J54p1M1j14K5P3r6PK9j50K47k1J2k92L68l59J98p2j22J27J28k50
5118a96J18J65j01N7o9N4m22J77l0K18J81k55Q4m2J49j20N4o6mK66l72J63J14
5141A23k23j76K19j7J05P6k63M8N8J76k22M4J75M8n9rJ34k19j47J24K17n7l38
5164a83K28n4j00M9M3N2j14n5L03J10k88p2J83q2o3L81j39o5Q4l64K19j20K1P6
5188E0kj20l3j1K27P6O5j62j96Q7J74p3J27k57J92j45M7O9k08J26p3O3J42K2k16
5213b9j07J02O3J01K0j55K76l62L25k68J07j29J54j48L74k76J1J5J33j29k41K06
5235D3j39K2n6P2K55j95J89j80J5MK23j03J23J1k92J16q8k47K49J36p5j25K08
5258A66m27N75k27n1o5j27J04R4p1J95j54J9L10n25L14q4j0j49J29k44L83k21
$$ plain form
5280 -66 21 200 63 -17 -30 -116 103 75 -105 135 -19 45 -80 -45 -9 74 43 61 -174 -200 36 -65 123 -115
5304 -115 8 -8 -155 53 6 295 67 139 106 -113 140 -94 -207 -91 111 89 -98 165 54 286 -66 80
5326 80 -23 -136 165 21 -202 46 -306 -213 -107 -87 288 22 265 -35 374 -322 35 -156 -163 125 -93 -186
5348 -186 85 -239 -113 -3 -55 72 -211 229 75 -92 -101 -43 160 16 -22 -105 -14 216 -99 160 251 242 39
5371 39 -22 357 -68 -14 14 152 -78 83 -166 -60 -15 219 -6 -59 10 76 -186 -180 -31 -49 58 183 67 158
5395 158 -140 -198 -51 111 -123 -38 107 -7 -1 53 61 89 132 155 103 235 140 280 -241 157 -2 77 55 -105 -101
5420 -101 135 -64 -3 -140 12 376 114 91 13 -57 124 288 -171 -48 217 277 -225 -26 -100 54 103 -313
5442 -313 -326 0 -194 -35 -129 -217 200 -147 82 346 -135 174 -212 -265 120 -57 39 8 -17 273 147 -11
$$ packed form
5280f6Q7J79j37q0j3q6K19k8j80K40j54O4j25L5L6Q3l1J8k35k6K36j01J88k38
5304a15J23j6j47K08m7K89k28P2l3k19K53k34j13J16K02k2j87K63j11K32l52J46
5326H0j03j13L01j44k23K48l52R3J06K0L75k66K43l00M09o96L57j91pK88k18r3
5348a86K71l24J26J10n2J27k83M40j54j67rN8K03j44l8q3R1K30l15K59R1rk03
5371C9o1L79m25N4K8J38k30J61k49J06M5K34k25n3O9O6k62OJ49j8J07J25j16R1
5395A58k98n8J47J62k34Q5J45j14ON4QK8M3K3n2J32r5J40n21L98j59P9k2j60M
5420a01K36j99O1j37J52L64k62k3p8p0J81J64m59J23K65O0n02J99p4J54M9m16
5442c13j3L26j94J59r4q8M17l47K29K64m81L09l86n3L85j77R6l1k5K90j26j58
$$ plain form
5464 -11 208 166 113 24 -75 107 39 151 89 -28 -85 -276 -52 -21 -207 -186 -24 55 -88 -32 -1 134 -140 153
5488 153 22 -95 -93 -116 59 -73 206 151 152 -114 -58 -116 169 111 -135 74 -65 133 41 -221 77 -30 20 -48
5512 -48 123 -8 102 221 -84 -204 199 -134 -171 90 1 43 -143 44 -196 50 -238 101 58 187 193 72
5534 72 95 2 226 200 235 130 -134 9 220 322 112 251 -54 -82 87 -82 -88 13 110 58 -195 93 -34
5557 -34 62 -48 52 -220 136 -7 -45 -52 51 -96 -96 14 -46 131 -153 -93 -139 106 -35 126 -14 342 123
5580 123 -209 -307 13 -91 -146 -16 -80 45 121 232 171 -303 32 140 65 510 -211 -69 -186 137 -127 -343
5602 -343 -110 233 364 101 -12 54 62 -60 124 -257 -143 -412 -87 -27 7 140 -180 84 -93 185 58 90
5624 90 -151 -251 -85 -69 67 -103 -297 171 -2 -188 57 -12 -50 256 180 -143 260 -56 215 87 -9 100
$$ packed form
5464a1K19m2n3q9r9J82o8J12o2j17n7j91K24L1j86K1J62P9j43N6L1J35k74K93
5488A53j31j17Kk3J75j32K79n5Jk66N6n8K85n8k46K09j39J98r2k62K98j07N0o8
5512d8J71j31J10J19l05j20M03l33l7K61q9M2j86J87k40K46k88L39m3J29Oj21
5534G2K3r3K24k6L5j05k64J43K11J02k10J39l05k8J69j69oJ01R7n2k53K88j27
5557c4R6j10J00k72L56j43l8pJ03j47%J10o0J77k84O0m6K45j41J61j40L56k19
5580A23l32r8L20j04n5J30o4J25P6J11o1m74L35J08p5M45p21J42j17L23k64k16
5602c43K33L43J31k63j13O6Qj22J84l81J14k69L25O0L4J33l20K64j77K78j27L2
5624I0k41j00J66J6J36j70j94M68j73j86K45o9l8L06p6l23M03l16K71j28r6J09
$$ plain form
5646 100 -60 -209 98 40 -81 -136 159 238 66 -62 64 -212 -118 -194 187 -259 -112 -85 -24 62 15 37 -136
5669 -136 139 98 -35 -49 131 -101 -85 -207 71 264 -28 144 305 255 99 -28 227 -34 -8 -260 -1 -94
5691 -94 -225 141 32 -82 102 150 -11 -104 51 5 58 84 -43 -23 149 53 -116 -10 173 -48 -224 -252 -150
5714 -150 123 267 145 102 167 0 188 -12 -46 -150 -29 -39 -30 165 -203 -74 64 17 -34 37 217 -119 -98
5737 -98 47 -239 290 126 -196 60 95 -315 -270 248 268 -125 -314 -44 108 -164 143 107 80 -41 70 -25
5759 -25 90 -8 -52 -159 -53 239 1 -106 91 4 -49 161 -136 -65 -98 -31 -66 104 -160 25 96 -37 -52 4
5783 4 143 101 -49 -99 -4 10 -28 -247 124 -243 185 70 153 125 -21 -78 -17 -71 -80 129 36 -41 -73 -66 2 -203 170
5810 170 108 -14 222 -20 231 -142 54 -284 32 31 -56 -78 -296 -88 103 155 -74 -157 -127 -106 33 -298 -3
$$ packed form
5646A00j60j49L07n8j21n5K95P9j72j28J26k76R4p6L81m46J47K7O1Q6m7K2j73
5669a36K75m1j33j4J80k32J6j22K78J93k92J72J61n0j56j27K55k61K6k52K59r3
5691i4j31L66j09j14J84M8j61r3J55m6N3K6j27K0J72r6j69J06J83k21j76k8J02
5714a50K73J44j22m3O5j67J88k00l4j04J21j0RJ95l68J29J38m7n1P1J80l36K1
5737i8J45k86N29j64l22K56L5m10M5N18K0l93j89K70J52k72L07l6k7j21J11r5
5759b5J15r8m4j07J06K92k38j07J97q7n3K10k97P1l3O7l5J70k64J85P1j33j5N6
5783DJ39m2j50n0R5J4l8k19L71l67M28j15Q3k8j46n7O1n4rK09r3p7l2PO8k05L73
5810A70o2j22K36k42K51l73J96l38L16jq7k2k18K08J91N2k29q3L0K1J39l31K95
$$ plain form
5833 -3 81 17 9 -60 273 -46 -307 33 -46 63 -12 -248 62 -32 -161 -155 11 -103 -90 -231 396 5 -13 193 -145
5858 -145 82 -60 -63 72 86 -11 128 -249 -56 201 43 277 -41 -47 -29 14 38 324 151 -214 35 -9 91
5881 91 52 106 145 36 94 -76 261 -266 -24 -64 -354 42 -22 -28 55 101 -84 -16 -86 -71 127 -8 243 -16 65
5906 65 96 -34 -109 17 19 152 122 -259 -150 -64 -144 -101 24 -161 -60 177 143 107 145 26 -17 63 -254 71 -139
5931 -139 -71 124 258 -212 -171 -142 -57 -96 -55 -87 197 171 318 70 -95 244 -13 312 -80 65 -188 252 27
5954 27 -43 78 -138 63 51 -255 18 177 -210 47 41 156 -20 -42 34 -37 130 133 -7 -66 50 -10 148 -35
5978 -35 -83 118 59 -16 -51 10 35 161 -84 -3 -133 118 112 136 -91 -15 -96 41 -180 122 214 145 -202 193 -160
6003 -160 -90 -227 46 25 132 114 67 -161 -36 -94 -154 -59 -7 -46 -11 -226 -8 -160 29 15 -177 54 -10 -83
$$ packed form
5833cQ4o4qo9L33l19k61L40p9J09p5k36L10r4j29OJ66j14J3j41O27l91j8K06l38
5858a45K27j42lJ35J4r7J39l77J93K57j58K34l18oJ8M3K4K86j73l65K49m4J00
5881I1l9N4L9j09N8j70L37n27K42m0k90L96o4oQ3M6j85O8p0J5J98j35K51k59Q1
5906F5L1j30p5J26KJ33l0l81J09Q6q0M3J25j85J01K37l4l6L8j19m3Q0l17L25k10
5931a39O8J95J34m70M1K9Q5l9M1l2K84k6J47k48j65L39k57L25l92J45k53M40k25
5954B7p0J21k16K01j2l06K73J59l87K57oJ15j76k2P6p1J67Lj40n9J16o0J58j83
5978c5m8K01n9p5l5O1K5J26k45Q1j30K51oK4k27P6q1J37k21L02R2o9l47L95l53
6003a60P0j37K73k1J07j8m7k28J25n8o0R5N2l9L5k15K18j52J89j4j92K31o4p3
$$ plain form
6027 -83 -93 14 108 66 -39 3 235 -39 52 3 154 48 -40 -110 -208 231 158 -96 52 62 -181 20 274 190
6051 190 58 68 108 42 -197 -196 -55 23 1 -167 163 -12 -123 42 74 -226 205 120 -2 287 72 -35 34
6074 34 109 173 55 -94 18 -1 175 -89 139 276 -24 -41 84 202 135 80 144 177 -130 -284 -56 11 -321
6097 -321 -13 100 87 -27 58 -6 66 119 -169 147 -114 -14 89 -193 56 -133 -205 -98 319 -432 -38 17
6119 17 76 -88 216 79 81 -20 -69 -164 66 -124 116 -101 426 94 -120 -123 167 179 -232 -58 -175 -116 -147 310
6143 310 -86 238 -43 -82 -166 -124 206 231 353 -187 -92 232 433 40 -153 156 -218 135 83 -33 232 -44
6165 -44 77 -82 -133 -115 -72 -249 13 78 306 -200 -215 59 -287 3 87 10 206 -5 191 -173 -22 -221 112
6188 112 -27 -72 158 -59 157 51 187 94 -97 -49 -54 -220 76 -198 -442 130 101 55 -33 -166 -249 -376 124
$$ packed form
6027h3j0J07R4m2j05M2K32k74R1m9J51j06q8p0r8M39p3k54J48J0k43K01K54q4
6051A90j32J0M0o6k39JJ41P8k2j68L30j75j11J65L2l00M31q5j22K89k15j07O9
6074C4P5O4j18j49J12j9J76k64K28J37l00j7J25J18o7n5O4L3l07j54K28O7l32
6097c21L08J13j3j14Q5o4P2N3k88L16k61J00J03k82K49j89p2J07M17p51L94N5
6119A7N9j64L04j37Kj01m9r5K30j90K40k17N27l32k14lK90J2m11J74j17N9l1M57
6143C10l96L24k81l9q4M2L30K5J22n40R5L24K01l93j93L09l74L53n2j16K65k76
6165d4J21j59n1J8M3j77K62O5K28n06j5K74l46K90Q4p7J96k11J96l64J51j99L33
6188A12j39m5K30k17K16j06J36r3j91M8nj66K96k74k44N72k9m6q8j33q3j27N00
$$ plain form
6211 124 70 -109 82 160 202 131 110 -162 -261 103 -85 -153 31 -21 -254 143 -80 57 204 -213 140 -96 57
6234 57 -392 35 80 187 308 6 -55 -61 -54 -25 -52 -54 -61 -14 55 -65 200 137 89 -47 -78 111 -150 71 -28 -24 22
6261 22 422 34 -29 -76 78 -89 -46 -269 16 6 -87 46 -83 -61 136 17 -290 222 31 122 323 111 216
6284 216 38 44 175 -95 -149 187 -132 -99 152 5 -110 -11 -300 157 -300 -88 154 -83 79 90 509 -154
6306 -154 116 241 1 5 -2 -99 -207 100 46 3 -58 -114 -57 -310 -108 -172 -94 -114 9 -165 182 8 -11 -103 195
6331 195 355 -212 202 31 96 -31 47 -308 28 39 -124 68 265 -11 -21 109 51 91 162 44 160 -97
6353 -97 -41 -223 87 115 -224 -222 -329 10 -7 -96 63 -48 69 -196 111 -85 -61 131 -87 135 -34 32 -156
6376 -156 224 -91 174 -220 -30 198 139 -201 -25 75 -151 -34 -44 -169 -66 19 -85 -128 114 -113 -188 -89
$$ packed form
6211A24n4j79J91P8M2p1k1k72r9L64j88o8J84n2k33L97k23J37J47m17L53k36J53
6234E7m49M27M5J07J21l02o1oPK9k7kpM7O9j20K65o3m8j36l1J89k61K21r9MM6
6261B2M00l88o3m7J54j67M3k23K85j0r3J33j29K2J97j19l07N12j91R1K01k12J05
6284B16j78OJ31k70n4L36l19L3K51j47j15R9k89M57m57K12K42k37J62J1M19o63
6306a54K70J25k40Mpr7j08L07n4m3o1n6N7k53K02o4P8k0J23j74L47j74j9r2K98
6331A95J60n67M14j71O5j27P8l55L36J1j63J92J97k76j0J30n8M0P1j18J16k57
6353i7N6j82L10K8l39Kj07L39j7q9J59j11J17k65L07j96K4J92k18K22j69O6j88
6376a56L80l15K65l94J90K28n9l40J76J00k26J17j0j25J03Q5j04m3K42k27p5R9
$$ plain form
6398 -89 93 332 -107 -118 -390 -143 282 61 -112 -55 -41 -49 -99 84 143 -103 -76 -100 -33 59 1 -195 -89 -61 -97
6423 -97 -185 193 -118 3 -58 136 68 -203 -107 76 -250 8 4 -398 -51 -171 -95 -117 19 121 -72 -4 179
6446 179 -124 213 -125 -132 -226 46 -214 15 31 8 68 43 -51 -182 -305 -62 16 -192 -22 -277 78 -9 78 8
6470 8 23 -45 146 33 166 89 140 -167 192 -24 -50 -84 44 -115 -8 21 -39 10 52 181 -2 116 -83 111
6494 111 -128 -174 -156 -145 207 -88 60 68 -100 190 214 -144 -42 -294 146 250 -94 50 94 295 -178 130
6516 130 -18 -72 232 -170 -189 141 -132 175 -66 -138 -44 66 242 -45 105 296 126 -183 -31 141 -84
6537 -84 9 61 10 -62 -244 -37 -18 17 209 -126 9 -329 -24 -97 29 100 -185 -55 122 257 199 -141 92
6560 92 123 -97 -49 95 -61 18 158 -95 55 294 289 -200 -44 102 83 -33 -30 -324 13 79 -89 228 -132
$$ packed form
6398h9J82K39m39j1k72K47M25k21j73N7J4qn0J83N9k46K7k4O7R2n8j96J06K8l6
6423i7q8L78l11J21o1J94o8k71R6J83l26K58mm02L47j20P6k2J36J02j93O8J83
6446A79l03L37l38pr4K72k60K29J6k3O0k5r4j31j23K43P8k08J70k55L55q7Q7p0
6470HJ5o8J91j13J33p7N1l07L59k16k6l4J28j59J07K9o0M9M2J29j83J18j99J94
6494A11k39m6J8J1L52k95J48Qj68K90K4l58J02k52M40J04l44J44M4K01m73L08
6516A30j48n4L04m02j9L30k73L07k41p2R4J10J76k87J50J91j70l09J52J72k25
6537h4R3N2n1p2j82K07J9L5J92l35J35l38L05p3J26P1k85J30J77J35n8l40K33
6560I2L1k20M8J44j56P9J40k53J50K39nm89J56J46j9j16Lk94L37O6j68L17l60
$$ plain form
6583 -132 122 28 67 -196 10 152 -10 86 -270 -237 117 34 -99 188 171 6 270 -177 69 98 -62 -81 -26
6606 -26 71 -120 50 -94 93 161 -122 88 -53 51 -155 146 16 -64 -56 -4 -59 -82 24 -74 9 77 -80 -108
6630 -108 60 -100 226 36 -13 -54 46 129 186 52 154 -101 53 102 139 -171 124 41 212 -74 114 170 199
6653 199 113 -271 211 29 -167 -423 -29 -354 -219 -89 -220 -46 273 58 -9 -97 -74 183 -241 -432 -65
6674 -65 -132 154 -165 213 84 -70 55 125 -39 -176 30 41 72 -250 -195 358 67 -234 -122 -134 -114 24 263
6697 263 -261 349 -55 73 -115 -107 -131 164 39 36 -170 162 -135 -175 -233 85 182 71 13 -107 -138 20 -104
6720 -104 85 -121 -102 -287 -114 -83 -330 15 -12 180 69 220 -122 21 -23 260 36 34 409 -125 -327 49
6742 49 -168 187 -215 -40 -18 155 166 -106 416 23 -154 -231 -41 167 14 -5 -50 -124 -70 -187 -18 -182 15
$$ packed form
6583a32K54r4L9k63K06J42j62R6l56L3L54q3j33K87j7j65K64m47K46K9j60j9N5
6606b6R7j91J70j44J87O8k83K10j41J04k06L01j30q0QN2n5k3J06r8Q3O8j57k8
6630a08J68j60L26j90m9m1J00Q3N7j34J02k55J54M9L7l10K95q3J71k86J88N6K9
6653A99q6l84M82j82j96k56L94l25J35J30j31J74L19k15o7q8K3K57m24j91L67
6674f5o7K86l19L78j29j54J25P0j64j37K06J1L1l22N5N53k91l01J12j2K0J38K39
6697B63n24O10m04J28j88Qk4K95j25lk06L32k97m0n8L18R7j11n8j20l1J58j24
6720a04J89k06J9j85J73L1k47L45k7J92j11J51l42J43m4K83k24kL75n34k02L76
6742D9k17L55m02J75K2J73J1k72N22l93j77p7J90K08j53j9m5p4N4j17J69j64J97
$$ plain form
6765 15 68 -62 -264 -179 -186 -246 20 -208 1 -8 -42 84 215 35 -51 -78 -162 -76 381 174 49 32 -7 -157 107
6790 107 -203 -165 -37 155 306 -223 27 24 -226 -64 289 219 132 85 64 -29 -74 -86 -24 -109 20 30 -91 162
6814 162 -66 158 170 -271 11 -151 230 91 -78 104 145 -23 140 159 -166 -5 31 206 -130 85 -39
6835 -39 65 -43 4 82 -139 87 117 70 -182 -130 31 -75 86 -144 216 197 -154 115 144 -195 -104 -202 32
6858 32 147 94 -157 35 45 42 -199 124 130 -166 81 -150 111 -185 5 223 157 -22 -92 102 -135 -53 24 31
6882 31 -166 176 168 184 -37 -82 -169 -283 -14 21 -42 -381 28 -56 -130 -195 -183 -59 -174 -22 -107 114 120 -158 90
6907 90 258 -34 32 -185 -44 0 -139 -205 -57 147 -27 124 11 -108 -4 -136 205 -88 -70 174 -223 101
6929 101 24 -41 114 -103 -325 -175 48 -178 -38 -63 -122 -85 363 7 150 -7 -29 209 170 -72 109 -74
$$ packed form
6765A5N3j30k02Q5po0K66k28K09rl4J26J31j80q6k7q4Q6M57k07j25j7l9j50K64
6790A07l10L8J28J92J51n29K50lk50J62L53p0q7m7k1r3m5j2O2q5J29J0j21K53
6814A62k28K24J2m41K82j62L81j39j69J82M1j68J63J9l25J61L6J75l36K15j24
6835c9J04j08M7P8k21K26L0m7k52N2J61j06J61k30L60j9l51K69K9l39R1r8K34
6858C2J15n3k51J92J0lk41L23Ok96K47k31K61k96J90K18o6j79p0J94k37Q2P7P
6882C1j97L42qJ6k21m5q7j14K69L5o3l39M09q4p4o5J2J24j15J52q5K21Ok78K48
6907I0J68k92O6k17J41M4j39o6J48K04j74J51j13j19J04j32L41k93J8K44l97L24
6929A01p7o5J55k17k22J50K23k26J40k5n9L7M48l56J43j57k2K38l9k42J81j83
$$ plain form
6951 -74 254 105 120 169 258 -133 -245 -177 -150 -192 -31 -188 -182 -118 30 194 -314 -293 111 24 -279 163 111 65 241
6976 241 -71 283 28 126 26 -111 95 279 -41 15 -110 37 -190 -51 -16 159 -150 157 -65 29 -172
6997 -172 82 -120 -214 23 -4 93 -217 -47 -65 25 46 96 256 -105 -31 52 86 -185 -102 -4 -91 85 67 102 86
7022 86 130 -15 22 -14 231 -191 -15 54 -53 -63 -208 -130 -28 -213 -76 99 48 -55 47 -115 -16 -47 29 -321
7046 -321 107 162 117 28 32 -136 14 -178 -16 144 91 23 -304 -99 -14 13 256 71 -44 -306 -121 -136 -29
7069 -29 78 124 -109 89 -157 -89 -205 35 -156 -4 -156 257 300 181 289 90 112 -70 297 -52 -52 68
7091 68 -123 -6 -40 -119 -81 -5 86 113 191 -39 -200 -142 17 -201 -154 -17 37 -138 172 -215 -34 -83 22 -16
7115 -16 394 -57 -118 -95 -129 216 -94 -192 -173 88 97 48 -92 115 -111 91 -37 61 81 -161 -76 162 81 298
$$ packed form
6951g4L28j49J5M9Q9l91j12O8K7m2J61j57OO4J48J64n08K1M04q7l03M42n2m6J76
6976B41l12L54k55R8j00j37K06J84l20N6j25J47k27J39L5J75l09L07k22R4k01
6997a72K54k02r4K37k7R7l10J70j8R0K1N0J60l61P4Q3L4k71Q3R8q7J76j8L5j6
7022H6M4j45L7l6K45m22J76O9j07j0j45P8J02j85J37J75n1j03J02j62R9l1P6l50
7046c21M28N5m5q9Mj68J50j92J62J60n3o8l27K05Q5K7K43j85j15k62J85j5J07
7069b9J07M6k33J98k46O8j16K40j91J52j52M13M3j19J08j99K2j82L67l49%J20
7091F8j91J17l4p9L8P6R1K7P8k30j61N8J59k18M7J37N4j75L10l87J81m9J05l8
7115a6M10m51o1K3l4L45l10r8J9K61Rm9j40K07k26K02j28R8K0k42Q5K38q1K17
$$ plain form
7139 298 24 -96 427 47 213 288 35 -206 -59 18 -107 -31 -73 -34 97 -98 132 -44 -17 -131 52 145
7161 145 65 96 130 49 14 -161 392 -153 -269 -164 -233 205 -4 -115 136 194 -41 334 198 21 -4 146 -85
7184 -85 131 124 -47 -183 62 -14 249 86 145 -233 -22 -153 -57 13 51 -2 39 264 131 -48 4 130 -24 -235
7208 -235 31 116 -300 -95 22 90 -56 -74 -207 133 -138 74 -26 -53 20 -21 -101 -163 -205 56 -9 55 -2 -21
7232 -21 352 -74 -3 -84 -162 24 51 209 274 84 62 10 189 166 -37 49 304 82 -72 275 166 -128 -286
7255 -286 141 -175 -195 -36 -228 58 -66 -13 -120 35 186 -23 -185 165 -23 51 -37 123 75 74 18 41 153
7278 153 -40 -155 -105 -30 259 164 -102 16 -225 -181 -170 -123 48 -397 -47 -114 -202 -31 -108 141 -117 -136 -176 -61
7302 -61 50 142 -57 207 -64 51 -138 54 -211 -101 251 -109 226 86 -86 -146 -113 186 -79 -139 -71 36
$$ packed form
7139B98k74j20N23l80J66P5k53k41J47P7j25P6m2L9J31j95K30j76K7j14J83R3
7161A45q0L1L4q1l5j75N53n45j16J05o9M38k09j11K51N8k35L75j36j77k5J50k31
7184h5K16pj71j36K45p6K63j63N9l78K11j31R6P0L8n3M1K25j33j79N2J26j54k11
7208b35K66Q5m16K05J17O8j46j8j33L40k71K12j00k7P3m1q0o2m2K61o5O4n7j9
7232b1L73m26P1q1p8J86K7J58O5j90k2n2J79k3k03Q6K55k22j54L47j09k94j58
7255b86M27l16k0J59j92K86j24N3j07J55J51k09j62L50j88P4q8J60m8jn6K3J12
7278A53j93j15N0P5K89r5k66J18k41M4J1M7J71m45L50o7q8J71p7K49k58j9m0J15
7302f1J11R2j99K64k71J15j89J92k65J10L52l60L35j40j72o0L3K99k65o0O8J07
$$ plain form
7324 36 -323 162 -149 171 64 57 123 60 -49 -108 151 -65 -188 -112 85 53 216 -125 180 165 -217 -56 121
7347 121 77 63 406 18 -20 -380 -34 -228 31 39 111 165 64 -137 -138 -102 -69 63 35 -130 125 -102 -54 217
7371 217 110 159 -27 -22 56 -194 -176 -145 -118 -67 117 48 -5 0 -166 113 -177 -280 -169 94 81 54 1 181 -135
7396 -135 73 -189 -96 -8 13 210 -160 -137 -165 126 -100 -53 36 -35 143 179 -92 -28 4 157 -104 -106 -275 -240 -109
7421 -109 -62 -76 -6 -51 53 197 -136 -73 -90 148 185 -164 99 88 -77 7 -6 103 105 41 153 109 -6 190 -238
7446 -238 -22 -132 62 7 -19 254 16 -51 -295 38 -100 96 -148 -30 -156 -98 133 -158 60 3 -30 97
7468 97 -106 -107 -246 17 91 98 59 0 -35 -192 169 -404 157 -9 -75 -7 -60 -60 177 66 257 79 -100 -102 -230
7493 -230 9 -69 13 25 -295 -294 220 -168 129 -181 -136 69 -66 -42 -163 -281 313 158 -145 -78 147 24 34
$$ packed form
7324C6l59M85l11L20j07pO6o3j09n9K59k16j23P6J97l2J63l41L05j5l82J61J77
7347A21m4j4L43l88l8l60L46j94K59QP2N4j01k01jL6L3J32k8j65K55k27M8K71
7371B17j07M9j86NP8k50J8L1K7N1J84o9n3Nj66K79k90j03J11K63j3k7n3J80l16
7396a35K08k62R3Q8K1J97l70K3k8K91k26M7Q9p1J78L6k71O4L2J53k61kj69L5J31
7421a09M7j4P0m5J04J44l33O3j7K38L7l49K63j1j65Q4j3J09Ko4J12m4j15J96m28
7446b38K16j10J94n5k6K73k38o7k44L33j38J96k44J18j26N8K31k91K18n7l3J27
7468I7k03jj39K63P4Pl9n9l5j57L61n73N61j66o6O8n3%K37j11J91j78j79kj28
7493b30K39p8Q2J2l20JN14l88K97l10M5K05j35K4j21j18N94j55l03O7K25j23J0
$$ plain form
7516 34 27 -107 71 -84 -220 19 -162 151 -22 93 32 45 -248 222 162 87 42 -198 78 -190 91 29 301
7539 301 -120 -21 -170 150 41 -44 -61 138 64 160 -32 5 -230 38 -106 -315 37 63 -214 -118 26 -21 109
7562 109 -185 -132 -144 152 -53 -65 -60 -223 41 12 -37 89 -183 -27 12 -67 88 -34 -204 -184 172 -161 1
7585 1 -91 -54 -184 -52 -20 105 127 -5 162 -97 -104 -72 -13 301 -1 -229 -300 -132 -30 309 26 -61 63 -179
7609 -179 115 29 101 -7 -48 2 69 -88 -107 -272 153 0 -82 -175 -202 -118 131 -41 267 -13 -142 102 131 168
7633 168 152 127 20 51 170 -119 -38 193 52 211 -27 92 133 129 -352 63 35 42 -16 -8 -225 -112 23 -126
7657 -126 118 -327 62 -11 108 54 8 -62 -179 -13 85 186 -110 105 136 47 -184 -130 9 83 75 105 75 -36
7681 -36 -133 -76 35 -16 77 70 -71 11 -65 -194 34 -113 84 54 247 421 -251 -126 -317 -1 -33 124 80 -38
$$ packed form
7516C4pj34J78j55j36K39j81L13j73J15o1J3k93M70o0p5m5k40K76k68K81o2K72
7539C01m21R9j49L20j09q5j7J99p4R6j92L7k35K68j44k09L52K6k77R6J44m7J30
7562A09k94N3j2K96k05j2Nj63K64k9m9J26k72J56L9p9J55j22j70K0L56l33J62
7585Ar2L7j30J32L2J25K2j32J67k59pL2N9L14l02k28p1J68J02L39k83q7J24k42
7609a79K94q6P2j08m1N0O7j57j9j65M25j53q2r3k7Q4K49j72L08k80j29K44K9L7
7633A68j6k5j07L1J19k89Q1K31j41J59k38J19M1mm81M15k8Pn8Qk17J13J35j49
7657a26K44m45L89p3J19n4m6p0j17J66R8J01k96K15L1q9k31N4J39P4qL0l0j11
7681c6r7N7J11n1R3pj41Q2p6j29K28j47J97l0J93J74o72J25j91L16l2J57m4j18
$$ plain form
7705 -38 105 -121 16 380 -11 -4 -175 -10 18 79 -78 37 -76 133 -84 134 -166 -311 220 10 88 -150
7727 -150 -169 -52 187 180 43 7 -26 -65 102 -89 109 243 -76 -57 -40 -211 -38 87 119 109 -99 8 -25 89
7751 89 311 -226 -91 53 -78 -125 -183 -169 -24 128 -34 28 -154 168 -73 -201 -42 -136 181 -107 -128 -24
7773 -24 4 -92 19 -229 178 5 -145 -76 124 112 -2 -45 71 28 99 2 57 28 -32 126 53 30 -64 237 136
7798 136 71 -106 116 -75 -40 -31 90 -21 182 207 -51 -123 -224 59 -187 -219 -70 -120 -14 76 5 -76 -145 -81
7822 -81 147 -15 -11 -116 31 140 -84 12 -130 -48 -292 -90 158 77 85 4 -54 -112 -26 198 65 83 -98 5
7846 5 246 272 -15 55 139 125 -271 -84 117 254 87 -154 -57 214 -79 -23 225 83 59 91 -183 -271 34 -5
7870 -5 -35 84 74 9 -157 170 -86 83 -107 -55 -94 52 -85 57 159 218 -287 -243 -88 246 -209 184 -198
$$ packed form
7705c8J43k26J37L64l91Pj71J65K8O1j57J15j13K09k17K18l00j45N31k10P8k38
7727a50j9J17K39pj37l6l3l9J67j91J98J34l19J9J7j71J73J25L2j0k08J07l3J14
7751H9K22n37J35J44j31m7n8J4J45J52j62O2j82L22k41j28J59r4L17k88k1J04
7773b4K8r6J11k48M07j73j50O9K00j2j14m3J16m3P1r7N5k9o0J58p3k3r4L01j01
7798A36o5j77K22j91L5RJ21j11K03K5k58p2j01K83k46l2J49n0J06R0p1q1o9O4
7822h1K28j62Mj05J47J09k24R6j42Q2k44K02K48q1Qq1n8n8Q6K24j33J8j81J03
7846EK41K6k87P0Q4j4l96J87K01J37j67k41R7K71k93N6K48j42k4L2k74q8L05l9
7870el0J19j0o5j66L27k56J69j90N2l9J46j37J42J02N9n05M4J55L34m55L93l82
$$ plain form
7893 -198 -97 214 133 84 -265 -131 -17 -180 -105 -114 -41 -180 25 136 73 149 -247 76 -51 -230 -15 42 119
7916 119 160 16 192 25 -129 79 -18 -283 117 -92 19 30 -14 -58 -517 36 175 54 -287 4 -156 347
7938 347 14 69 87 112 141 26 -62 104 -320 146 119 -89 109 46 13 2 -258 73 191 -78 75 161 64 70
7962 70 -216 -303 45 -58 28 119 -32 113 99 -174 -30 17 3 225 -146 -17 -99 61 190 -33 -36 -191 -144 36
7986 36 -63 103 -121 -52 -10 77 259 -4 -20 347 30 -18 510 -64 98 14 -109 -12 -199 -8 -10 -35 -33 -54 -70
8011 -70 -19 65 -32 -129 66 -54 -273 -15 136 221 -3 -200 25 -154 17 7 169 216 80 93 83 -123 23
8034 23 56 130 92 -62 3 -143 217 226 103 164 80 15 -8 2 1 27 49 113 -325 144 101 -1 -40 -43 -271 94 119
8061 119 -222 -163 15 -99 141 -142 -179 85 -186 2 97 -204 -143 65 -29 30 -88 20 63 -44 -58 -79 -113
$$ packed form
7893a98J01L11q1m9l49J34J14j63P5rP3j39K05J11o3P6l96L23j27j79K15N7P7
7916A19M1j44J76j67j54K08r7k65M00k09J11J1m4m4m59N53J39j21l41K91j60N03
7938C47l33N5J8K5K9j15q8J66m24M66k7k08J98o3l3j1k60L31J18k69J53Q6r7O
7962G0k86q7L48j03Q6R1j51J45j4k73J44M7j4K22l71J29q2J60J29k23lj55M7J80
7986C6r9J66k24O9M2Q7J82k63j6L67l17m8N28n74J62q4j23R7j87J91kk5Kk1j6
8011g0N1Q4r7r7J95j20k19K58J51Q5k24j97K25j79J71j0J62M7j36J3j0k06J46
8034B3L3P4l8j54O5j46L60Rj23O1q4o5k3J0jK6K2O4m38M69m3j02l9lk28L65K5
8061A19l41N9J78j14K40k83l7K64k71J88R5l01O1K08r4N9j18J08M3j07j4k1l4
$$ plain form
8084 -113 63 -68 -90 59 167 -100 38 77 118 63 -24 122 -83 -69 -161 151 40 -117 -63 42 56 31 95 -333
8108 -333 74 -62 50 -153 274 96 -223 71 11 2 -69 18 -206 -115 16 274 -120 266 203 107 34 -32 -89 29
8132 29 97 -20 -73 28 114 190 54 8 13 -232 166 -4 -171 105 36 122 145 227 -29 -371 195 -124 -297 -83
8156 -83 -30 -54 -181 100 200 200 46 79 160 -165 -86 -164 -121 133 -160 29 -10 -387 198 -102 -31 -90 129 68 -19
8181 -19 -230 -8 127 -84 -196 -206 119 102 -251 145
$$ packed form
8084a13J76j31k2J49J08k67J38L9M1n5q7J46k05J4r2L12j11j57N4J05J4k5O4m28
8108c33M07j36J12k03M27j78l19K94o0rp1Q7k24R1J31K58l94L86o3r6p3o6n7J18
8132B9O8j17n3J01Q6P6j36m6Nk45L98j70j67K76o9Q6K3Q2k56l42N66l19j73K14
8156h3N3k4j27K81J00%j54L3Q1l25P9p8M3K54k93J89l9l77N85l00P1n9K19o1q7
8181a9k11K22J35k11j12j0L25j7l53L96
8191A45
$$ Imaginary data points
##PAGE= N=2
##DATA TABLE= (X++(I..I)), XYDATA
$$ plain form
0 0 0 0 0 0 0 0 0 -8 0 -8 8 -8 8 -16 24 -24 32 -40 48 -56 72 -80 96 -120 136 -160 184 -216 248 -281 323
31 323 -369 419 -475 537 -603 680 -761 851 -948 1058 -1172 1303 -1443 1597 -1764 1948
47 1948 -2147 2366 -2606 2871 -3162 3488 -3847 4249 -4705 5221 -5813 6501 -7312 8281
61 8281 -9469 10963 -12904 15544 -19357 25376 -36344 62769 -265133 -19417 614324 86781
73 86781 -430713 -288602 201992 197910 4861 -67796 -95966 -163669 86026 311582 66037
84 66037 -351439 -209437 292887 332558 -145981 -304823 8592 213924 93621 -49304
94 -49304 -87101 -64926 10304 156031 109512 -144454 -170927 106467 191653 -21966 -132569
105 -132569 1717 70316 -26274 3145 111703 -32552 -195125 2358 240372 59678
$$ packed form
0@%%%%%%%qQqJ6j6J6k4M0m8N6p2Q8j04J28j52J76k16K56k96L44m00M64n29O04
31C23o92P88q94J012j140J283j441J612j799K006k230K475k746L040l361L712
47A948m095M513m972N477o033O650p335Q096q954R926j1034J2314j3813J5593
61H281j7750K0432k3867K8448l4901M4733o1720R9113l27902K45716O33741n27543
73H6781n17494J42111M90594m082j93049p2657k8170o7703K49695K25556k45545
84F6037m17476J42002N02324L9671m78539j58842L13415K05332j20303j42925
94d9304l7797K2175P5230J45727m6519k53966k6473K77394Q5186k13619j10603
105a32569J34286O8599r6590K9419J08558j44255j62573J97483K38014j80694
$$ plain form
115 59678 -247570 -133248 200994 145358 -138278 -107395 78558 33628 -62885 48002 115925
126 115925 -91934 -190743 105454 266890 -54681 -285959 -22599 259859 91472 -196024
136 -196024 -117701 102671 77066 -29196 -17014 -20273 -59285 5309 111503 35866 -141903
147 -141903 -81442 132589 103217 -93647 -101288 47142 78985 -24001 -46461 17650 -3158
158 -3158 -33114 34565 37587 -59138 -53372 64318 70055 -70641 -82612 86560 98280 -81001
170 -81001 -93755 77398 107571 -47059 -97820 37586 84044 -28321 -44959 31056 5562
181 5562 -49133 10935 74453 -15173 -115866 -3631 132652 22069 -127447 -47996 98007
192 98007 65455 -62548 -59004 35072 28987 -14179 10148 4699 -42359 -18073 53133 37611
$$ packed form
115E9678l07248J14322L34242n5636k83636L0883J85953m4930r6513J10887O7923
126A15925k07859r8809K96197J61436l21571k31278K63360K82458j68387k87496
136a96024P8323K20372k5605j06262J2182l259l9012O4594J06194p5637j77769
147a41903O0461K14031k9372j96864p641J48430L1843j02986k2460O4111k0808
158c158k9956O7679L022r6725N766J17690N737j40696j1971J69172J1720j79281
170h1001j2754J71153L0173j54630n0761J35406M6458j12365j6638P6015k5494
181E562n4695O0068O3518q9626j00693J12235J36283j10583j49516P9451J46003
192I8007l2552j28003L544R4076o085m3166K4327n449m7058K4286P1206j5522
$$ plain form
204 37611 -61128 -62245 53656 63205 -41452 -52429 26343 41235 -14571 -23502 28407 16874
216 16874 -34948 1878 47629 -1398 -43659 -168 42556 1704 -45295 2479 39151 -20905
228 -20905 -40625 23269 35952 -27596 -47835 21593 54350 -18912 -49990 15248 37364 -4949
240 -4949 -19169 4625 9051 -14781 -703 33424 -7214 -49813 2782 51918 7298 -51419
252 -51419 -23793 46297 29720 -32992 -20022 19066 12110 531 5267 2142 -14394 -7800 32356
265 32356 21026 -40720 -29557 34057 32345 -24571 -42327 7660 35324 -7479 -26402 1799
277 1799 5425 -2884 5886 8442 -7785 -18678 9982 34301 -7335 -35711 5233 31950 3405
290 3405 -25781 -10015 20581 5596 -17467 1878 8741 -9262 -4323 11513 8471 -10550 -11239
$$ packed form
204C7611r8739j117J15901R549j04657j0977P8772J4892n5806q931N1909j1533
216A6874n1822L6826M5751m9027m2261M3491M2724m0852m6999M7774L6672o0056
228b0905j9720O3894J2683o3548k0239O9428L2757p3262l1078O5238K2116m2313
240d949j4220K3794M426k3832J4078L4127m0638m2599N2595M9136m4620n8717
252e1419K7626P0090j6577o2712J2970L9088o956j1579M736l125j6536O594M0156
265C2356j1330o1746J1163O3614j712n6916j7756M9987K7664m2803j8923K8201
277A799L626q309Q770K556j6227j0893K8660K4319m1636k8376M0944K6717k8545
290C405k9186J5766L0596j4985k3063J9345O863j8003M939J5836l042j9021o89
$$ plain form
303 -11239 18050 15740 -16356 -7651 16416 7269 -10998 -7893 11116 6675 -18465 -6915 15107
316 15107 -1951 -15433 -2723 7474 2074 -10756 -1159 11668 -4807 -7983 12018 7962 -7830
329 -7830 -6358 8960 14335 -7730 -14980 9838 11623 -7553 -8373 384 5372 -630 -5724 3847
343 3847 230 -7873 7070 10290 -5997 -8645 3911 14712 3500 -16009 -2720 13676 2562
356 2562 -6643 -6011 -2710 2642 -724 -934 -1684 -11765 -2075 13495 2557 -10492 -7187 5985 14889
371 14889 -178 -10022 1723 4758 3612 5809 -2127 -6407 -2871 3421 10285 -2347 -15051 -2283
385 -2283 7605 5649 198 -9247 -5300 5416 7537 7345 -4222 -13712 2867 16167 6571 -8367
399 -8367 -14799 296 14860 3769 -8082 -11078 -8686 7516 13336 -2033 -15371 -14058 9310
$$ packed form
303a1239K9289k310l2096Q705K4067r147j8267L105J9009m441k5140J1550K2022
316A5107j7058j3482J2710J0197n400j2830R597J2827j6475l176K0001m056j5792
329g830J472J5318N375k2065p250K4818J785j9176q20Q757M988o002n094R571
343C847l617q103J4943L220j6287k648J2556J0801j1212j9509J3289J6396j1114
356B562r205O32L301N352l366k10p50j0081R690J5570j0938j3049L305J3172Q904
371A4889j5067r844J1745L035j146K197p936m280L536O292O864j2632j2704J2768
385b283R888j956n451r445L947J0716K121j92j1567r490J6579J3300r596j4938
399h367o432J5095J4564j1091j1851k996K392J6202N820j5369j3338J313K3368
$$ plain form
412 9310 25642 439 -22393 -9918 14736 23615 1835 -20763 -8881 10844 15646 6571 -13626
425 -13626 -17574 1136 14900 13235 -8465 -26500 -5459 22001 18445 -7431 -27197 -8167 26202
438 26202 20706 -9016 -22513 -8387 18819 18804 -6294 -15773 -10673 2145 16540 8765 -11962
451 -11962 -21568 -8776 22837 24699 -14738 -31631 -3155 29892 24118 -16327 -26814 4277 21335
464 21335 11869 -3368 -12988 -8530 1662 12899 16039 -10885 -32254 -5069 30089 22012 -20107
477 -20107 -38165 2473 38204 14344 -22313 -23632 4282 24917 11204 -9325 -12466 -9249 6158
490 6158 20678 6729 -18851 -26144 1593 35020 14966 -32783 -31802 13705 40196 9155 -35823
503 -35823 -21281 23198 26564 -261 -17469 -8725 6629 7596 8731 6445 -16979 -22757 9764
$$ packed form
412I310J6332k5203k2832J2475K4654Q879k1780k2598J1882J9725M802r075k0197
425a3626l948J8710J3764j665k1700j8035K1041K7460l556k5876j9766J9030L4369
438B6202n496k9722j3497J4126K7206j5k5098r479N100J2818J4395p775k0727
451a1962r606J2792L1613J862l9437j6893K8476L3047n774m0445j0487L1091J7058
464B1335r466j5237r620M458J0192J1237L140k6924k1369K7185L5158q077m2119
477b0107j8058M0638L5731k3860l6657j319K7914K0635j3713k0529l141L217J5407
490F158J4520j3949k5580p293K7737L3427k0054m7749R81M5507K6491l1041m4978
503c5823J4542M4479L366k6825j7208Q744J5354R67J135k286k3424n778L2521
$$ plain form
516 9764 31167 5620 -36847 -27187 28468 35947 -13666 -35423 -4755 27119 15368 -13466 -9980
529 -9980 4042 -252 2630 12133 3273 -16566 -17666 12923 29237 -5346 -33956 -10353 24815
542 24815 22589 -13565 -28354 1487 21906 8456 -7934 -9950 661 6868 3966 6066 1808
555 1808 -14329 -8627 13745 18254 -5844 -29029 -7928 29203 15186 -23606 -23618 10552 25326
568 25326 -1936 -22420 -795 15206 1475 -5856 2064 5678 -4635 -8415 10266 13262 -13029
581 -13029 -17101 8618 18198 -3343 -22298 -3478 20864 4687 -16711 -6468 11114 9796 -6247
594 -6247 -9000 7055 8025 -3344 -3413 1823 3111 -313 -4925 886 4290 -4305 -5277 1369 3577 172
610 172 -7810 -2834 9423 3655 -8096 -4781 6631 10191 -3053 -10861 4480 11027 -2592 -7661
$$ packed form
516I764K1403k5547m2467R660N5655P479m9613k1757L0668L1874j1751k8834L486
529i980J4022m294K882R503q860j9839j100L0589J6314l4583k8610K3603L5168
542B4815k226l6154j4789K9841K0419j3450j6390k016J0611O207k902K100m258
555A808j6137N702K2372M509k4098k3185K1101L7131j4017l8792j2L4170J4774
568B5326k7262k0484K1625J6001j3731p331P920L614j0313l780J8681K996k6291
581a3029m072K5719R580k1541j8955J8820K4342j6177k1398J0243J7582j318j6043
594f247k753J6055R70j1369o9N236J288l424m612N811L404q595r72O646K208l405
610A72p982M976J2257n768j1751L315J1412L560j3244p808J5341O547j3619n069
$$ plain form
624 -7661 100 6732 -53 -9092 948 8635 -4943 -9688 2392 9776 989 -11155 -3159 12395
638 12395 5139 -7096 -3339 3137 4853 275 -2102 1787 -1935 -4472 4482 4828 -4644 -7912 -2510
653 -2510 7683 5197 -7654 -7409 1965 7237 5584 -4682 -7829 3005 8273 4375 -3666 -7592
667 -7592 2016 7593 967 -3592 -4742 -2169 3949 2601 -2108 -4369 -4486 4181 7645 -3186 -6965
682 -6965 -213 6771 5525 -4681 -5200 4498 3746 -1185 -1520 -1637 674 490 -1995 499 -1646 -3353
698 -3353 1702 944 -2095 -785 -23 2604 1124 -2768 1731 3288 -486 -179 -134 10 2140 -1245 -1193
715 -1193 475 -1881 372 894 -3385 -1154 986 259 585 -2098 -623 3406 362 -616 1322 -43
731 -43 1539 1142 -1482 1059 -119 -1176 724 -1581 -1364 891 -1033 -1044 -849 -1202 2007 180 -3118
$$ packed form
624g661P761O632o785r039J0040P687j3578m745J2080P384q787j2144P996J5554
638A2395p256j2235L757O476J716m578k377L889l722k537Q954L46r472l268N402
653b510J0193k486j2851K45R374N272j653j0266l147J0834N268l898q041l926
667g592R608N577o626m559j150K573O118j348m709k261j17Q667L464j0831l779
682f965O752O984j246j0206n19R698p52m931l35j17K311j84k485K494k145j707
698c353N055p58l039J310P62K627j480l892M499J557l774L07M5J44K130l385N2
715a193J668k356K253N22m279K231K140p27L26k683J475M029l044r78J938j365
731d3J582l97k624K541j178j057J900k305K17K255j924j1J95l53L209j827l298
$$ plain form
748 -3118 1284 2049 904 906 -1663 1134 3390 177 -211 -779 -1846 2034 1138 -2458 -2034 -2148 1011
765 1011 2061 -3147 -2874 1045 1134 1984 -870 -2502 2168 1986 850 925 -2022 -115 2864 147 -924
782 -924 -1570 -1690 2124 328 -3087 -485 -533 458 1291 -1862 -246 1568 575 1783 410 -1312 2047
799 2047 1291 -153 85 -1027 274 1446 -1953 -1037 142 -1446 144 -603 -1425 849 -407 -116 1760
816 1760 -866 135 1614 280 1116 517 -479 1834 -582 -1295 1529 -600 -1613 -704 -916 1026 -711
833 -711 -3001 673 1298 -583 471 -354 423 1725 274 1307 764 -2546 1120 2680 -907 -1406 -1895
850 -1895 501 2188 -1921 -2440 -36 -1246 1097 1087 -1557 -1210 -166 2018 3708 -1837 -2705 2422
866 2422 2468 818 -992 -2119 1103 788 -1120 688 -1756 -2947 1179 1671 -135 -2038 -2473 2394
$$ packed form
748c118M402P65j145Kk569K797K256l213l88n68j067L880q96l596M24j14L159
765A011J050n208K73L919Q9Q50k854j632M670j82j136P5k947J907K979k717j071
782i24o46j20L814j796l415K602m8R91Q33l153J616J814r93J208j373j722L359
799B047p56j444K38j112J301J172l399R16J179j588J590p47q22K274j256K91J876
816A760k626J001J479j334Q36n99r96K313k416p13K824k129j013R09k12J942j737
833g11k290L674O25j881J054q25P77J302j451J033n43l310L666J560l587m99m89
850a895K396J687m109n19K404j210K343j0k644L47J044K184J690n545q68N127
866B422M6j650j810j127L222l15j908J808k444j191M126M92j806j903m35M867
$$ plain form
882 2394 2983 -1046 -638 87 301 2736 988 -656 -936 -1485 2569 2292 -3281 -2395 390 342 689 -1436
900 -1436 -1323 -294 -1530 2115 3853 -2978 -3673 2793 4988 1385 -4794 -2025 5565 1649 -3374 -802
916 -802 501 -278 -1533 -375 2962 -2381 -5597 2828 5385 -1049 -4797 -1617 5892 3357 -4103 -1354
932 -1354 3209 1263 -168 -363 -109 487 -1968 -466 2139 -1588 -2329 -853 -413 1884 418 -2956
948 -2956 -586 1853 2945 1017 -4075 160 5184 66 -2960 204 3386 990 -4725 -1043 6036
963 6036 -575 -7520 -449 6056 1650 -6737 -3581 7904 3253 -7293 -1454 6632 2752 -4946 -2954
978 -2954 6614 4168 -7364 -3012 6457 2815 -5278 -4706 3008 4728 -4274 -4479 3210 1956 -2046
993 -2046 -1519 1259 3172 -833 -2972 2166 2938 302 -1460 -2130 2278 4582 -2091 -4794 -334 3954
$$ packed form
882B394N89m029M08P25K14K435j748j644k80n49M054k77n573Q86K785m8L47k125
900a436J13J029j236L645J738o831o95O466K195l603o179K769P590l916n023K572
916h02J303p79j255J158L337n343l216Q425K557o434l748L180P509k535p460K749
932a354M563j946j431j95K54N96k455J502K605l727p41J476M40K297j466l374
948b956K370K439J092j928n092M235N024n118l026L164L182k396n715L682P079
963F036o611o945P071O505m406q387L156J1485m651j0546N839Q086l880p698J992
978b954R568k446j1532M352R469l642q093N72P714J720r002k05P689j254m002
993b046N27K778J913m005k139N138P72k636j762o70M408K304o673k703M460M288
$$ plain form
1009 3954 2248 -5287 -4188 4954 2510 -4489 -1401 3689 2370 -4575 -2373 8055 3550 -8782
1023 -8782 -3213 8573 5406 -7521 -8153 6130 8013 -6392 -6770 4020 3915 -3642 -4297 3881 4731
1038 4731 -6138 -4245 7739 4993 -5083 -4867 3316 7196 -1043 -6256 1068 2914 -263 -958 -1344
1053 -1344 -809 -371 -646 1089 -205 -2544 211 317 205 2950 -148 -3349 -346 4063 4081 -3167 -6295
1070 -6295 3449 6823 -3272 -6128 772 4283 -980 -5195 1558 4106 -4567 -3612 5723 4479 -4643
1085 -4643 -6070 4765 8818 -3595 -7396 3447 6034 -1195 -4189 125 3284 -2209 -3587 3704
1099 3704 1617 -5127 -1937 3778 2838 -2971 -3968 2916 3736 -1764 -355 1434 -294 268 1279 1058
1115 1058 -1931 -3054 2147 2843 -3249 -2574 1856 492 -1535 -1253 1755 890 -3691 466 5298 -597
$$ packed form
1009C954j706p535J099R142k444o999L088N090j319o945K202J0428m505j2332
1023h782N569J1786l167j2927o32J4283J883j4405l78J0790j05p557o55Q178Q50
1038D731j0869J893J1984k746j0076K16Q183L880q239n213P324J846l177o95l86
1053a344N35M38k75J735j294k339K755J06j12K745l098l201L003M409J8p248l128
1070f295R744L374j0095k856O900L511n263m215O753K548q673R55R335j244r122
1085d643j427J0835M053j2413l801J0843K587p229k994M314L159n493j378P291
1099C704k087o744L190N715r40n809r97O884Q20n500J409J789j728N62J011k21
1115A058k989j123N201O96o092O75M430j364k027K82L008q65m581M157M832n895
$$ plain form
1131 -597 -4295 826 4655 1427 -4377 -912 4903 -426 -4185 1197 2396 -2115 -3557 910 3893
1146 3893 -2398 -5007 2971 4198 -2688 -2793 1935 3633 -1075 -2795 2642 2626 -3449 -805 2801 275
1162 275 -2979 -1694 2866 1430 -4778 -1133 4021 -458 -2988 66 2526 566 -2632 679 4025
1177 4025 -1225 -2404 2754 2044 -1716 -1912 1260 2679 -2538 -2898 2563 1127 -3101 -1011 1594 806
1193 806 -1930 -1225 3373 669 -3297 1172 3326 -429 -2609 287 3150 -81 -4001 732 2862
1208 2862 -2388 -2584 1229 1407 -1701 -3042 1810 3078 -2848 -2233 3156 1794 -1701 -1120 2116 2337
1224 2337 -2015 -1473 3277 96 -3446 131 1952 67 -2636 -1382 2717 114 -3317 914 2081
1239 2081 -865 -1483 677 2512 -244 -2317 2463 2427 -2122 -1237 1918 1231 -1425 -1961 1406 1463 -2990
$$ packed form
1131e97l698N121L829l228n804L465N815n329l759N382J199m511j442M467K983
1146C893o291k609P978J227o886j05M728J698m708j720N437j6o075K644L606k526
1162B75l254J285M560j436o208L645N154m479k530L054K460j960l198L311L346
1177D025n250j179N158p10l760j96L172J419n217l60N461j436m228K090K605p88
1193H06k736P05M598k704l966M469K154l755k180K896K863l231l920M733K130
1208B862n250j96L813J78l108j341M852J268n926O15N389j362l495N81L236K21
1224B337m352N42M750l181l542L577J821j885k703J254M099k603l431M231J167
1239B081k946o18K160J835k756k073M780l6m549Q85L155o87k656n36L367N7m453
$$ plain form
1256 -2990 -873 2037 -433 -1880 86 2017 972 -2834 -63 3722 12 -2320 1212 1800 -165
1271 -165 -1748 148 2228 -1600 -2742 1633 1310 -2358 -1153 902 1652 -1388 -2242 2293 1710 -1893
1287 -1893 -402 2067 710 -621 -898 2095 976 -2692 -246 1854 -1221 -1774 -257 1067 111 -2233
1303 -2233 83 2325 -1100 -1014 1440 905 -248 -505 1018 1715 -1226 -860 1911 323 -1749 -107
1319 -107 585 190 -1307 -1244 1473 -490 -1927 470 1467 -391 -422 66 1716 687 -1973 1194 1701
1336 1701 -591 -612 322 911 -508 -1660 292 1421 -1539 -1285 752 153 -150 -537 164 1377 -509
1353 -509 -227 1751 129 -369 397 302 712 -571 -527 889 -370 -1076 451 26 -701 -314 -495 705
1371 705 -192 -1074 1117 711 -715 607 452 846 20 -762 633 915 -1137 -237 480 -128 -426 -1032
$$ packed form
1256b990K117K910k470j447J966J931j045l806K771L785l710k332L532N88j965
1271a65j583J896K080l828j142M375l23l668J205K055P50l040q54M535n83l603
1287a893J491K469j357j331k77K993j119l668K446K100l075n53J517J324r56k344
1303b233K316K242l425Q6K454n35j153k57J523O97k941L66K771j588k072J642
1319a07O92l95j497O3K717j963j437K397R97j858l1M88J650j029k660L167N07
1336A701k292k1R34N89j419j152J952J129k960K54K037n99l03l87P01J213j886
1353e09K82J978j622m98P66r5M10j283M4J416j259p06J527m25p27L87j81J200
1371G05q97q82K191m06j426J322j55L94q26p82J395K82k052R00P17o08k98o06
$$ plain form
1389 -1032 -577 769 -762 -703 397 -53 497 178 -239 870 396 -234 634 172 26 399 -702 122
1407 122 793 -1205 -324 -418 -122 486 -878 -961 790 111 -413 10 32 1057 509 -596 1106 576 -706
1426 -706 -447 121 803 -15 -1723 -93 1137 -393 -1002 -575 346 1028 -919 -1070 1445 1014 -363 -206
1444 -206 346 1195 -412 -1424 1388 1491 -1025 -1087 -148 1276 -42 -2417 -459 1825 -239 -1391 -382
1461 -382 797 846 -1079 -628 1821 589 -725 240 995 1200 -1010 -1530 1257 1246 -1085 -979 -199 1085
1479 1085 184 -1857 -687 1369 -9 -549 -218 650 1306 -811 -640 1910 1008 -962 -902 703 1808
1496 1808 -581 -2783 284 1927 -995 -1715 -410 1497 503 -2088 -372 2185 39 -1371 7
1511 7 1726 1439 -1650 -1060 2731 746 -1790 -1013 827 1017 -1111 -1892 1037 933 -1251 -633 284 820
$$ packed form
1389a032M55J346j531N9J100m50N50l19m17J109m74o30Q68m62j46L73j101Q24
1407A22O71j998Q81r4K96O08j364q3J751o79n24M23K2J025n48j105J702n30j282
1426g06K59N68O82q18j708J630J230j530o09M27R21O82j947j51K515m31j377J57
1444b06N52Q49j607j012K812J03k516o2R39J424j318k375J958K284k064j152J009
1461c82J179M9j925M51K449j232j314R65P55K05k210n20K787j1k331J06P80J284
1479A085r01k041J170K056j378n40L31Q68O56k117J71K550r02j970O0J605J105
1496A808k389k202L067J643k922p20J305J907r94k591J716K557k146j410J378
1511GJ719k87l089N90L791j985k536P77J840J90k128p81K929j04k184O18R17N36
$$ plain form
1529 820 -22 -1204 468 1695 -340 -510 142 753 981 -1094 -986 1319 412 -876 -701 -355 927
1546 927 -587 -1833 334 1033 -430 -605 -120 1160 530 -1583 -24 2297 183 -1384 -399 1172
1562 1172 1075 -1701 -1371 1587 392 -1562 -882 680 1060 -856 -1433 1409 1299 -1132 -324 994 882
1579 882 19 -994 892 1284 -765 -546 279 257 27 -724 -614 511 -702 -729 165 -350 19 306 -180
1598 -180 415 463 44 447 -283 261 884 -762 -383 725 90 -595 -582 -115 711 -827 -1329 774 504
1617 504 -773 -644 534 908 -568 -961 1078 1358 -645 -401 851 576 -520 -813 569 908 -1053
1634 -1053 -673 610 -119 -637 -520 313 876 -792 -308 1357 159 -23 160 661 454 -492 -153 837
1652 837 -195 -830 335 -16 -504 -500 -78 267 -457 -850 801 155 -457 413 548 162 -93 -149 806 228
$$ packed form
1529H20q42j182J672J227k035j70O52O11K28k075J08K305r07j288J75L46J282
1546I27j514j246K167O99j463j75M85J280o30k113J559K321k114j567R85J571
1562A172r7k776L30K958j195j954O80J562L80j916n77K842j10k431Q08J318j12
1579H82q63j013J886L92k049K19Q25k2k30p51J10J125j213k7Q94n15L69K87m86
1598a80N95M8m19M03p30N44O23j646L79J108o35o85J3M67Q26j538n02K103k70
1617E04j277J29J178L74j476l93K039K80k003K44J252k75j096k93J382L39j961
1634a053L80J283p29n18J17Q33N63j668M84J665j198j82J83N01k07r46L39R90
1652H37j032o35J165l51m88MM22L45p24l93J651o46o12Q70J35l86k55n6R55n78
$$ plain form
1672 228 -1170 384 634 -777 -509 16 369 81 -1134 110 683 -611 -607 807 739 127 -374 362 1217
1691 1217 -390 -802 941 487 -263 -367 40 380 -571 -696 840 25 -721 187 176 189 -208 -150 909
1710 909 377 -532 641 863 -248 6 106 468 36 -765 80 484 -781 -387 335 -401 -278 -362 -100
1729 -100 629 -667 -76 900 -41 -194 198 480 214 -160 -120 810 -622 -689 344 -289 -135 -464 -134 516
1749 516 -269 -964 552 272 -249 -56 337 606 401 -308 826 660 -787 130 499 -172 -484 -800 321
1768 321 427 -995 -255 576 -577 -552 -31 275 518 -402 -132 909 -177 -138 483 -40 53 -97 -374 374
1788 374 -142 -561 257 19 -519 87 -210 53 158 -138 468 161 -417 933 464 -161 -68 -73 383 -141 -702
1809 -702 390 458 -755 -389 7 -95 -218 -571 -1 699 -571 -206 673 408 -63 -44 534 886 -292
$$ packed form
1672B28j398J554K50j411K68N25L53k88j215J244N73j294MJ414o8o12n01P36Q55
1691A217j607m12J743m54p50j04M07L40r51j25J536q15p46R08j1J3l97N8J059
1710I09n32r09J173K22j111K54J00L62m32q01Q45M04j265L94P22p36J23q4K62
1729a00P29j296N91R76r41j53L92K82k66l74M0R30j432o7J033o33J54l29L30O50
1749E16p85o95J516k80n21J93L93K69k05p09J134j66j447R17L69o71l12l16J121
1768C21J06j422P40Q31j153K5N21L06K43r20K70J041j086L9O21n23R3j50k77P48
1788C74n16m19Q18k38n38O06k97K63J05k96O06l07n78J350m69o25R3nM56n24n61
1809g02J092O8j213L66L96j02j23l53N70P00j270L65Q79k65m71J9N78L52j178
$$ plain form
1828 -292 -519 713 -156 -247 -110 -144 -74 -418 -477 369 158 -592 87 104 -259 209 -220 484 455 -61 491 404
1850 404 -309 351 125 -258 -186 -304 112 -136 -616 -125 504 -273 -307 148 210 275 -413 152 720 -222 -163 523
1872 523 316 238 -383 -389 524 -394 -695 199 -126 -329 -321 -202 351 202 -219 293 -52 -154 481 260 214 244
1894 244 -243 265 -20 -550 462 137 -1008 -142 -112 -46 -307 -667 -16 500 -785 -50 581 4 48 -106
1914 -106 221 866 -423 -637 541 170 -28 -195 -86 425 -166 -888 140 26 -391 -250 -456 194 290
1933 290 -634 210 679 35 100 108 196 571 -110 -666 216 -83 -221 -459 -350 374 199 -763 -121 22 285
1954 285 -178 -403 576 568 -364 57 682 496 117 -520 209 837 -462 -962 -49 273 -144 -460 -296 675
1974 675 27 -403 214 410 188 -219 -293 692 1023 -652 -325 794 183 -221 -632 -225 959 -439 -968
$$ packed form
1828b92k27J232q69r1J37l4P0l44n9Q46k11p50O79J7l63M68m29P04k9n16N52q7
1850D04p13O60k26l83P2j18M16k48m80M91O29p77l4M55O2O5o88N65N68r42N9O86
1872E23k07p8o21oR13r18l01Q94l25k03QJ19N53j49m21N12l45j02O35k21m6L0
1894B44m87N08k85n30J012l25j145Q66L0O6k61l60O51N16j285P35O31n77M4j54
1914a06L27O45j289k14J178l71j98j67J09N11n91p22J028j14m17J41k06O50R6
1933B90r24Q44M69o44O5QQ8L75o81n56Q82k99j38k38J09P24j75r62O42J43K63
1954B85m63k25R79qr32M21O25j86l79o37P29O28j299n00R13L22m17l16J64R71
1974F75o48m30O17J96k22m07p4R85L31j675L27J119o11m04m11M07J184j398n29
$$ plain form
1993 -968 362 148 -145 -457 -56 858 243 -522 371 783 108 -312 -316 522 668 -1033 -163 355 -173 -315
2013 -315 -499 -183 304 -693 -614 599 151 -37 -130 -288 673 33 -471 387 517 103 -176 -408 341 430 -631
2034 -631 -543 242 137 143 -817 -577 972 -230 -564 288 636 252 -72 -129 936 209 -799 4 540 11
2054 11 -471 -406 379 361 -1149 -425 892 -442 -582 -32 338 546 -709 -303 780 186 -93 59 46 88
2074 88 -67 -396 136 -112 -526 305 -351 -396 233 -309 -29 -11 -19 475 -309 -357 362 367 -344 -13 281 433 -145
2097 -145 -607 557 178 -919 -207 628 166 -439 -843 188 336 -829 -266 709 -47 -439 -94 391 796
2116 796 -347 -550 878 244 -409 46 72 219 -314 -237 396 -191 -427 412 290 -421 -101 -144 275 -4
2136 -4 -250 451 456 -373 123 495 -149 160 -148 431 -91 -866 296 425 -425 -551 -19 77 -11 -415 477 650
$$ packed form
1993i68J330k14k93l12M01R14o15p65Q93M12o75m20mQ38J46j701Q70N18n28j42
2013c15j84L16M87r97P9J213m48j88r3j58R61o40n04Q58J30m14k79k32P49Q9j061
2034f31Q8P85j05Or60K40J549j202l34Q52L48l84l24n7J065p27j008Q03N36n29
2054A1m82O5P85j8j510P24J317j334j40N50L70K08j255M06J083n94k79J52j3M2
2074H8j55l29N32k48m14Q31o56m5O29n42K80J8qM94p84m8P19Np11L31K94J52n78
2097a45m62J164l79j097P12Q35m62o05m04J031J48j165N63R75p56l92L45M85M05
2116G96j143k03J428o34o53M55K6J47n33P7O33n87k36Q39j22p11L20m3M19k79
2136dk46P01Nq29M96L72o44L09l08N79n22p75J162J29q50j26N32R6q8m04Q92J73
$$ plain form
2158 650 -814 -179 618 576 -100 -368 289 755 -355 -448 472 137 -475 -341 -100 475 -180 -580 395 278
2178 278 -197 83 484 18 231 -26 653 105 -699 591 269 -371 -96 99 77 -386 -535 24 217 -361
2198 -361 -326 673 56 -115 -292 341 596 -731 -152 744 158 -762 223 124 -55 -547 -183 730 -188 -687
2218 -687 77 158 -205 -302 -130 698 -78 -610 452 296 -339 96 358 372 -42 -274 293 203 -693 -46 377
2239 377 -8 -281 -310 78 -28 -682 30 605 -363 -130 231 327 316 -236 -124 689 -251 -538 515 -96 -269
2260 -269 -212 71 278 -331 -564 657 55 -235 -36 365 183 43 -165 535 300 -559 241 287 -321 -359 -30
2281 -30 74 -38 -639 99 407 -305 -170 512 231 0 -402 566 513 -447 -305 886 115 -284 -133 303
2301 303 324 -555 -274 556 -270 -732 18 43 -106 -369 -311 525 -11 -245 616 197 -109 -226 -118 174 152
$$ packed form
2158F50j464O35P97m2o76k68O57M66j110r3R20l35o12J34K41N75o55m00R75j17
2178B78m75K80M01m66K13k57O79n48q04J290l22o40K75J95k2m63j49N59J93n78
2198c61L5R99o17j71j77O33K55j327N79Q96n86r20R85r9j79m92L64R13r18m99
2218f87P64Q1l63r7J72Q28p76n32J062j56o35M35K62J4m14k32N67r0q96O47M23
2239C77l85k73k9L88j06o54P12N75r68K33L61R6j1n52J12Q13r40k87J053o11j73
2260b69N7K83K07o09k33J221o02k90J99M01j82j40k08P00k35q59Q00M6o08l8L29
2281c0J04j12o01P38L08p12J35O82k81k31m02R68n3r60J42J191p71l99J51M36
2301C03K1q79K81Q30q26m62P50K5j49k63N8Q36n36k34Q61m19l06j17J08K92k2
$$ plain form
2322 152 -336 393 -87 -689 -1 211 -242 -207 17 262 274 -461 237 499 -185 -54 96 429 180 -197 502
2343 502 842 -408 -439 316 216 -298 -578 -34 350 -204 -441 253 2 -24 93 251 382 1 -297 199
2363 199 226 -356 176 178 192 -1 -197 -150 120 -482 109 238 -480 -19 -90 80 301 -69 234 198 -346 66
2385 66 553 157 -280 159 541 200 -565 -233 503 -267 -295 -101 196 305 -173 -102 680 -215 -508 289 288 151
2407 151 -35 -189 258 324 -184 25 -15 -41 -88 -286 25 146 -269 61 216 34 254 224 -98 145 275 49
2429 49 285 18 132 322 -439 -57 31 -195 -203 -311 58 92 -236 -488 203 435 -5 -29 44 568 -38 -501
2451 -501 772 221 -136 123 73 259 144 -701 229 447 -155 -78 -103 78 250 -405 -394 525 162 -82 -13
2472 -13 -46 258 -36 159 322 108 -45 31 -186 221 236 -344 120 224 55 -88 227 -30 51 -91 -81 469
$$ packed form
2322A52m88P29m80o02O88K12m53L5K24K45J2p35O98K62o84J31J50L33k49l77O99
2343E02L40j250l1P55j00n14k80N44L84n54k37O94k51k6J17J58J31l81k98M96
2363A99K7n82N32KJ4j93j96M7K70o02N91J29p18M61p1J70K21l70L03l6n44M12
2385F6M87l96m37M39L82l41p65L32P36p70k8J94K97J09m78P1P82q95k93P97jj37
2407A51j86j54M47O6n08K09m0k6m7j98L11J21m15L30J55j82K20l0l22K43J30k26
2429D9K36k67J14J90p61L82Q8k26qj08L69L4l28k52O91K32m40k4P3N24o06m63
2451e01J273n51l57K59n0J86j15q45R30K18o02P7k5J81J72o55J1R19l63k44O9
2472a3l3L04k94J95J63k14j53P6k17M07J5n80M64J04j69j43L15k57Q1j42J0N50
$$ plain form
2494 469 142 -161 64 191 362 60 -200 99 235 -109 -322 85 59 0 -446 -194 298 -16 -257 -66 -58
2515 -58 217 -117 -3 642 242 51 -367 -111 100 -264 -375 213 18 -108 -295 -385 107 -23 -278 -21 283
2536 283 -351 -212 377 165 315 -336 81 234 -69 -246 264 -155 239 -84 -294 281 -158 -21 105 52
2556 52 108 356 54 -187 190 -74 177 54 -48 628 -298 -249 171 28 -38 -88 -189 4 100 -299 244 348
2578 348 -192 15 -215 413 256 -169 239 395 -3 -61 -67 -79 3 -214 -203 173 -240 -65 -170 42 -7 -118
2600 -118 -241 366 117 -338 262 60 158 100 38 48 110 75 196 -217 -425 -26 28 -453 -145 -158 123 -124 -204
2623 -204 15 159 -573 -123 85 338 56 -119 271 347 -549 -572 348 -42 -22 -371 44 -8 -229 -246 339 -117
2645 -117 -2 -149 270 196 -71 73 244 177 -170 84 123 -112 -287 -95 -98 -52 -193 -21 329 -245 -129 -17
$$ packed form
2494D69l27l03K25J27J71l02k60K99J36l44k13M07k6n9m46K52M92l14k41J91Q
2515e8K75l34J14O45m00j91m18K56K11l64j11N88j95j26j87r0M92j30k55K57L04
2536B83o34J39N89k12J50o51M17J53l03j77N10m19L94l23k10N75m39J37J26n3
2556E2N6K48l02k41L77k64K51j23j02O76r26M9M20j43o6n0j01J93R6l99N43J04
2578C48n40K07k30O28j57m25M08J56l98n8oj2Q2k17J1L76m13J75j05K12m9j11
2600a18j23O07k49m55O00k02R8n8o2J0O2l5J21m13k08L99N4m81L08j3K81k47q0
2623b04K19J44p32M50K08K53k82j75L90P6q96k3R20l90K0l49M15n2k21j7N85m56
2645a17J15j47M19p4k67J44J71o7l47K54L9k35j75J92lM6j41J72L50n74J16J12
$$ plain form
2667 -17 19 -166 155 225 189 -303 122 316 10 42 101 267 212 -94 -95 429 -260 -124 -80 -45 44 -154 -134 233
2691 233 119 -142 273 152 -5 -256 -257 371 262 -150 334 50 -447 92 114 -195 -138 -421 183 109 -75 294
2713 294 174 136 -111 -158 284 173 64 125 498 -361 -137 265 -146 -214 252 120 163 -336 -148 433 34 -479
2735 -479 87 -207 284 -223 -298 325 101 -224 4 80 361 -283 -472 388 -112 -444 104 82 -482 -188 -208
2756 -208 203 -73 -160 468 53 -256 116 88 170 68 23 368 125 -386 47 288 -52 148 214 -54 -101 -90
2778 -90 -276 279 -232 -121 191 179 39 -256 20 462 249 -324 112 126 -73 -181 142 26 -2 -291 -84
2799 -84 88 -301 -13 118 -203 -267 -57 287 279 154 -114 235 -19 -124 -30 -90 32 -305 216 445 -122 -257
2821 -257 159 -44 -210 -266 470 208 -81 -264 213 64 -336 314 63 -34 -1 -255 400 -36 -355 65 88
$$ packed form
2667a7L6j85L21P0l6m92M25J94l06L2N9J66n5l06jN24o89J36M4L5Q9j98K0L67
2691B33j14k61M15j21j57k51jO28j09m12M84k84m97N39K2l09N7k83O04p4j84L69
2713B94j20l8k47m7M42j11j09O1L73q59K24M02m11o8M66j32M3m99J88N81l99n13
2735d79N66k94M91n07p5O23k24l25K28P6K81o44j89Q60n00l32N48k2n64K94k0
2756b08M11k76q7O28m15l09L72k8Q2j02m5L45k43n11M33K41l40K00O6k68m7J1
2778i0j86N55n11J11L12j2j40k95K76M42k13n73M36J4j99j08L23j16k8k89K07
2799h4J72l89K88J31l21o4K10L44qj25k68L49k54j05R4o0J22l37N21K29n67j35
2821b57M16k03j66n6P36k62k89j83M77j49m00O50k51r7L3k54O55m36l19M20K3
$$ plain form
2842 88 72 -94 24 270 12 -335 44 248 -69 23 156 137 -42 -46 -281 -159 -170 -9 282 -121 -279 -122
2864 -122 200 -116 -351 -1 207 39 -363 112 48 -116 -114 95 344 6 -185 -170 77 -182 -133 3 19 -156
2886 -156 -246 187 73 -374 6 156 -143 9 -79 -34 342 -46 62 -10 -22 114 -24 -184 172 -272 -47 -72
2908 -72 -95 167 -62 130 -12 -100 218 102 -53 -123 409 81 -374 69 229 300 -48 -36 239 -168 -517 -9
2930 -9 185 -238 -365 -140 150 -32 -314 320 347 -166 -266 483 181 18 -28 30 275 -38 -90 12 -240 127
2952 127 -70 -55 48 -195 -257 224 48 -56 388 5 -36 96 174 291 -133 -179 235 108 -331 -217 -101 184
2974 184 20 -64 222 -95 -223 276 73 148 -124 -473 500 104 352 70 428 115 111 -117 -185 196 -85 -265
$$ packed form
2842H8j6j66J18K46k58l47L79K04l17R2J33j9j79mk35J22j1J61K91m03j58J57
2864a22L22l16k35L50K08j68m02M75o4j64KK09K49l38j91J5K47k59M9J36J6j75
2886a56r0M33j14m47L80J50k99J52q8M5L76l88J08p2j2J36j38j60L56m44K25k5
2908g2k3K62k29J92j42q8L18j16j55p0N32l28m55M43J60P1l48J2K75m07l49N08
2930iJ94m23j27K25K90j82k82O34K7n13j00P49l02j63m6N8K45l13n2J02k52L67
2952A27j97J5J03k43o2M81j76j04M44l83m1J32P8J17m24m6M14j27m39J14J16K85
2974A84j64q4K86l17j28M99k03P5k72l49R73l96K48k82L58l13mk28o8L81k81j80
$$ [...]
8191i
##END NTUPLES=NMR FID
##END=
