##TITLE=1H_Pr NCS-400
 200.13MHz,CDCl3,
 8 sc
 
 1.7.2025
##JCAMPDX= 6.0         $$ Bruker NMR JCAMP-DX V2.0
##DATA TYPE= NMR FID
##DATA CLASS= NTUPLES
##ORIGIN= UXNMR, Bruker Analytische Messtechnik GmbH
##OWNER= pz
$$ XWIN-NMR		Version 3.5
$$ Tue Jul  1 16:07:25 2025 Russian Standard Time (UT+4h)  she@DPX200
##.OBSERVE FREQUENCY= 200.1313
##.OBSERVE NUCLEUS= ^1H
##.DELAY= (6, 6)
##.ACQUISITION MODE= SIMULTANEOUS
##.ACQUISITION SCHEME= undefined
##.AVERAGES= 8
##.DIGITISER RES= 18
##SPECTROMETER/DATA SYSTEM= spect
##.PULSE SEQUENCE= zg30
##.SOLVENT NAME= CDCl3
##.SHIFT REFERENCE= (INTERNAL, CDCl3, 0, 14.3821)
##AUDIT TRAIL= $$ (NUMBER, WHEN, WHO, WHERE, WHAT)
$$ ##TITLE= Audit trail, XWIN-NMR		Version 3.5
$$ ##JCAMPDX= 5.01
$$ ##ORIGIN= Bruker BioSpin GmbH
$$ ##OWNER= she
$$ F:/spectra/data/she/nmr/H-C/1/audita.txt
$$ ##AUDIT TRAIL=  $$ (NUMBER, WHEN, WHO, WHERE, WHAT)
(   1,<2025-07-01 16:06:00.07 +0400>,<she>,<DPX200>,
      <created by zg, POWCHK disabled, PULCHK disabled
       configuration hash MD5:
       00 E9 B6 7A A2 85 ED C7 34 08 36 98 17 FE 4E 26
       data hash MD5: 16K
       DA 27 9B 77 F5 FA 23 23 E4 AC 7A CC 52 25 58 68>)
$$ ##END=
$$ 
$$ hash MD5
$$ C8 7F 5A 10 26 6A 74 05 5C AE 89 98 6A 13 46 AE
##$RELAX= 
##$RELAX= 
##$RELAX= 
##$RELAX= 
##$RELAX= 
##$RELAX= 
$$ Bruker specific parameters
$$ --------------------------
##$DU= <F:/spectra>
##$EXPNO= 1
##$NAME= <H-C>
##$PROCNO= 1
##$TYPE= <nmr>
##$USER= <she>
##$AMP= (0..31)
100 100 100 100 100 100 100 100 100 100 100 100 100 100 100 100 100 100 
100 100 100 100 100 100 100 100 100 100 100 100 100 100 
##$AQSEQ= 0
##$AQ_mod= 1
##$AUNM= <au_zg>
##$AUTOPOS= <>
##$BF1= 200.13
##$BF2= 200.13
##$BF3= 200.13
##$BF4= 200.13
##$BF5= 200.13
##$BF6= 200.13
##$BF7= 200.13
##$BF8= 200.13
##$BYTORDA= 1
##$CFDGTYP= 0
##$CFRGTYP= 5
##$CHEMSTR= <none>
##$CNST= (0..31)
1 1 145 1 1 1 1 1 1 1 1 1 1 1 1 1 1 1 1 1 1 1 1 1 1 1 1 1 1 1 1 1 
##$CPDPRG= <>
##$CPDPRG1= <>
##$CPDPRG2= <>
##$CPDPRG3= <>
##$CPDPRG4= <mlev>
##$CPDPRG5= <mlev>
##$CPDPRG6= <mlev>
##$CPDPRG7= <mlev>
##$CPDPRG8= <mlev>
##$CPDPRGB= <>
##$CPDPRGT= <>
##$D= (0..31)
0 0.7 0 0 0 0 0 0 0 0 0 0.03 0 0 0 0 0 0 0 0 0 0 0 0 0 0 0 0 0 0 0 0 
##$DATE= 1751371559
##$DBL= (0..7)
120 120 120 120 120 120 120 120 
##$DBP= (0..7)
150 150 150 150 150 150 150 150 
##$DBP07= 0
##$DBPNAM0= <>
##$DBPNAM1= <>
##$DBPNAM2= <>
##$DBPNAM3= <>
##$DBPNAM4= <>
##$DBPNAM5= <>
##$DBPNAM6= <>
##$DBPNAM7= <>
##$DBPOAL= (0..7)
0.5 0.5 0.5 0.5 0.5 0.5 0.5 0.5 
##$DBPOFFS= (0..7)
0 0 0 0 0 0 0 0 
##$DE= 6
##$DECBNUC= <off>
##$DECIM= 32
##$DECNUC= <off>
##$DECSTAT= 4
##$DIGMOD= 1
##$DIGTYP= 9
##$DL= (0..7)
0 120 120 120 120 120 120 120 
##$DP= (0..7)
150 150 150 150 150 150 150 150 
##$DP07= 0
##$DPNAME0= <>
##$DPNAME1= <>
##$DPNAME2= <>
##$DPNAME3= <>
##$DPNAME4= <>
##$DPNAME5= <>
##$DPNAME6= <>
##$DPNAME7= <>
##$DPOAL= (0..7)
0.5 0.5 0.5 0.5 0.5 0.5 0.5 0.5 
##$DPOFFS= (0..7)
0 0 0 0 0 0 0 0 
##$DQDMODE= 0
##$DR= 18
##$DS= 0
##$DSLIST= <SSSSSSSSSSSSSSS>
$$ [...]
##$SUBNAM0= <"">
##$SUBNAM1= <"">
##$SUBNAM2= <"">
##$SUBNAM3= <"">
##$SUBNAM4= <"">
##$SUBNAM5= <"">
##$SUBNAM6= <"">
##$SUBNAM7= <"">
##$SUBNAM8= <"">
##$SUBNAM9= <"">
##$SW= 18.0517328524113
##$SWIBOX= (0..15)
0 0 2 0 0 0 0 0 0 0 0 0 0 0 0 0 
##$SW_h= 3612.71676300578
##$TD= 16384
##$TD0= 1
##$TE= 0
##$TE2= 300
##$TE3= 300
##$TEG= 300
##$TL= (0..7)
0 120 120 120 120 120 120 120 
##$TP= (0..7)
150 150 150 150 150 150 150 150 
##$TP07= 0
##$TPNAME0= <>
##$TPNAME1= <>
##$TPNAME2= <>
##$TPNAME3= <>
##$TPNAME4= <>
##$TPNAME5= <>
##$TPNAME6= <>
##$TPNAME7= <>
##$TPOAL= (0..7)
0.5 0.5 0.5 0.5 0.5 0.5 0.5 0.5 
##$TPOFFS= (0..7)
0 0 0 0 0 0 0 0 
##$TUNHIN= 0
##$TUNHOUT= 0
##$TUNXOUT= 0
##$USERA1= <user>
##$USERA2= <user>
##$USERA3= <user>
##$USERA4= <user>
##$USERA5= <user>
##$V9= 5
##$VALIST= <valist>
##$VCLIST= <CCCCCCCCCCCCCCC>
##$VD= 0
##$VDLIST= <DDDDDDDDDDDDDDD>
##$VPLIST= <PPPPPPPPPPPPPPP>
##$VTLIST= <TTTTTTTTTTTTTTT>
##$WBST= 1024
##$WBSW= 4
##$XGAIN= (0..3)
0 0 0 0 
##$XL= 0
##$YL= 0
##$YMAX_a= 262180
##$YMIN_a= -312030
##$ZGOPTNS= <>
##$ZL1= 120
##$ZL2= 120
##$ZL3= 120
##$ZL4= 120
##$ABSF1= 10
##$ABSF2= 0
##$ABSG= 5
##$ABSL= 3
##$ALPHA= 0
##$AQORDER= 0
##$ASSFAC= 0
##$ASSFACI= 0
##$ASSFACX= 0
##$ASSWID= 0
##$AUNMP= <proc_1d>
##$AZFE= 0.1
##$AZFW= 0.1
##$BCFW= 1
##$BC_mod= 2
##$BYTORDP= 1
##$COROFFS= 0
##$CY= -3
##$DATMOD= 1
##$DC= 2
##$DFILT= <>
##$DTYPP= 0
##$F1P= 0
##$F2P= 0
##$FCOR= 0.5
##$FTSIZE= 0
##$FT_mod= 4
##$GAMMA= 1
##$GB= 0.15
##$INTBC= 1
##$INTSCL= 1
##$ISEN= 128
##$LB= 0.25
##$LEV0= 0
##$LPBIN= 0
##$MAXI= 10000
##$MC2= 0
##$MEAN= 0
##$ME_mod= 0
##$MI= 1.114404
##$NCOEF= 0
##$NC_proc= 0
##$NLEV= 6
##$NOISF1= 3.799351
##$NOISF2= 2.8
##$NSP= 1
##$NTH_PI= 0
##$NZP= 0
##$OFFSET= 14.38212
##$PC= 1
##$PHC0= -1204.185
##$PHC1= 15.7922
##$PH_mod= 1
##$PKNL= yes
##$PPARMOD= 0
##$PSCAL= 0
##$PSIGN= 0
##$REVERSE= no
##$SF= 200.129724274929
##$SI= 16384
##$SIGF1= 3
##$SIGF2= 2
##$SINO= 400
##$SIOLD= 16384
##$SREGLST= <1H.CDCl3>
##$SSB= 0
##$STSI= 0
##$STSR= 0
##$SW_p= 3205.1282051282
##$SYMM= 0
##$S_DEV= 0
##$TDeff= 0
##$TDoff= 0
##$TI= <>
##$TILT= no
##$TM1= 0
##$TM2= 0
##$TOPLEV= 0
##$USERP1= <user>
##$USERP2= <user>
##$USERP3= <user>
##$USERP4= <user>
##$USERP5= <user>
##$WDW= 1
##$XDIM= 8192
##$YMAX_p= 0
##$YMIN_p= 0
$$ End of Bruker specific parameters
$$ ---------------------------------
##NTUPLES= NMR FID
##VAR_NAME=  TIME,          FID/REAL,        FID/IMAG
##SYMBOL=    X,             R,               I
##VAR_TYPE=  INDEPENDENT,   DEPENDENT,       DEPENDENT
##VAR_FORM=  AFFN,          ASDF,            ASDF
##VAR_DIM=   8192,          8192,            8192
##UNITS=     SECONDS,       ARBITRARY UNITS, ARBITRARY UNITS
##FACTOR=    0.0002768,     1,               1
##FIRST=     0,             0,               0
##LAST=      2.2672688,     0,               0
##MIN=       0,             -312030,         0
##MAX=       2.2672688,     262180,          0
$$ Real data points
##PAGE= N=1
##DATA TABLE= (X++(R..R)), XYDATA
$$ [...]
$$ plain form
1916 -212 104 -420 -480 -128 -718 -433 -299 -719 -20 -105 -261 -166 243 328 597 336 564 669 52 316 642
1937 642 -196 -38 43 -547 -162 -396 -606 -403 -727 -181 36 -665 -39 645 -418 -12 706 481 486 248 139
1958 139 492 -184 -58 413 -364 -487 -122 -531 -586 -48 -589 -593 15 -4 269 278 -141 600 293 5 716 302
1980 302 -36 426 78 174 -211 -570 -101 -206 -698 -287 -239 -580 252 6 24 602 81 385 505 71 768
2001 768 492 -66 647 316 -529 -419 -122 -520 -498 -661 -421 -91 -555 151 314 -438 420 442 -128 298 489
2022 489 383 585 487 230 551 -445 -240 361 -1043 -465 -185 -296 -385 132 -179 47 -255 -296 356 338 569
2043 569 722 327 643 746 -390 -109 252 -519 -366 -272 34 -102 -633 -499 295 -373 -435 378 -48 275
2063 275 245 139 593 557 135 503 -25 -140 662 -355 -409 357 -214 -416 -188 -341 -171 -506 -744 144 -109
$$ packed form
1916b12L16n24o0L52n90K85J34m20O99q5j56R5M09Q5K69k61K28J05o17K64L26
1937F42q38J58Q1n90L85k34k10K03l24N46K17p01O26O84j063M06P18k25Nk38j09
1958A39L53o76J26M71p77j23L65m09n5N38n41mO08j9K73Rm19P41l07k88P11m14
1980C02l38M62l48R6l85l59M69j05m92M11M8l41Q32k46J8N78n21L04J20m34O97
2001G68k76n58P13l31q45J10K97l98K2j63K40L30m64P06J63p52Q58K2n70M26J91
2022D89j06K02r8k57L21r96K05O01j404N78K80j11q9N17l11K26l02m1O52j8K31
2043E69J53l95L16J03j136K81L61p71J53R4L06j36n31J34P94o68o2Q13m26L23
2063B75l0j06M54l6m22L68n28j15Q02j017n4P66n71k02K28j53J70l35k38Q88k53
$$ plain form
2084 -109 7 834 250 -41 729 66 -169 177 160 -90 -12 131 311 -417 -1066 -225 -390 -730 192 154 312
2105 312 150 -111 553 274 -520 524 526 -152 284 187 64 310 -59 -173 -255 -448 -174 -43 -864 -31 115
2126 115 -583 240 496 -261 17 178 349 70 142 829 1109 178 -67 346 -663 -706 -211 -162 -277 -345 321
2147 321 257 -695 -374 289 -306 -127 577 673 59 513 728 535 -293 -323 202 -322 -457 55 -142 -336 -364
2168 -364 -395 -461 -415 -237 -226 -267 487 724 357 81 609 517 -278 160 230 -117 -151 -162 406 55 -725 -239 -403
2191 -403 -1123 -392 -4 -290 -206 649 600 99 29 438 542 -277 169 578 -165 -68 191 37 -414 -724 -607
2212 -607 -256 -490 -270 60 -28 101 313 163 261 350 207 97 262 323 341 -162 -192 290 -607 -353 -92 -507
2234 -507 -875 -433 -1 229 -105 -278 516 -196 -212 682 433 27 537 348 202 110 81 59 96 -588 135 28
$$ packed form
2084a09J16Q27n84k91P70o63k35L46j7k50P8J43J80p28o49Q41j65l40R22l8J58
2105C12j62k61O64k79p94J044Ko78M36r7j23K46l69j14q2j93K74J31q21Q33J46
2126A15o98Q23K56p57K78J61J71k79P2O87K80r31k45M13j009m3M95M9j15o8O66
2147C21o4r52L21O63n95J79P04R6o14M54K15j93q28l0N25n24j35N12j97j94k8
2168c64l1o6M6J78J1m1P54K37l67k76N28r2p95M38P0l47l4j1N68l51p80M86j64
2191d03p20P31L88k86Q4Q55m9n01p0M09J04q19M46M09p43R7K59j54m51l10J17
2212f07L51k34K20L30q8J29K12j50R8Q9j43j10J65O1J8n03l0M82q97K54K61m15
2234e07l68M42M32K30l34j73P94p12j6Q94k49m06N10j89j46r2k9k2L7o84P23j07
$$ plain form
2256 28 -408 -124 -52 -195 -11 33 -160 434 -39 221 372 95 338 301 -335 552 158 -367 -48 -206 -155 -330
2278 -330 -302 -149 -214 -436 -120 -32 -245 190 297 393 393 184 -10 260 322 162 481 -340 -117 -129 -363 -273 -371
2301 -371 -514 92 -33 -674 359 -100 -240 463 257 452 449 164 560 519 240 376 265 -234 -6 -286 -344
2322 -344 -169 -450 -376 45 -257 -418 -102 -301 128 392 -58 400 290 -64 468 183 -225 406 104 176 150
2343 150 -439 -72 -228 -563 -168 -45 -175 -66 -178 -34 331 245 262 340 227 159 360 432 142 -199 -197 268
2365 268 -357 -531 -15 -174 -454 -49 -427 -263 -46 -123 93 307 26 195 232 252 363 355 -178 181 -138 -135
2387 -135 164 -375 -253 -68 -249 -63 -229 -161 90 233 28 292 259 273 335 239 246 599 28 -90 380 -113
2409 -113 -531 -182 -370 73 85 -192 272 -214 165 176 32 120 224 -95 555 295 219 190 264 -106 64 42
$$ packed form
2256B8m36K84P2j43J84M4j93N94m73K60J51k77K43l7o36Q87l94n25L19j58N1j75
2278c30K8J53o5k22L16Q8k13M35J07R6%k09j94K70O2j60L19q21K23j2k34R0r8
2301c71j43O06j25o41J033m59j40P03k06J95lk85L96m1k79J36j11m99K28k80n8
2322c44J75k81P4M21l02j61L16j99M29K64m50M58j10l54N32k85m08O31l02P2k6
2343A50n89L67j56l35L95J23j30J09j12J44L65q6J7P8j13o8K01P2k90l41KM65
2365B68o25j74N16j59k80M05l78J64K17p7K16K14k81J69L7K0J11qn33L59l19L
2387a35K99n39J22J85j81J86j66O8K51J43k05K64l3J4O2r6PL53n71j18M70m93
2409a13m18L49j88M43J2k77M64m86L79J1j44Q8J04l19O50k60p6k9P4l70J70k2
$$ plain form
2431 42 -268 -66 -108 -229 -493 -381 -241 -232 -399 19 117 -113 107 473 97 332 356 228 267 187 -62 81 -16
2454 -16 -131 -465 -582 -51 21 -262 -407 41 -90 -57 166 160 373 -169 149 239 -18 -28 435 129 -228 -197 -228
2477 -228 -257 -152 -237 -340 -461 -225 365 -90 -234 118 119 28 -1 188 416 46 242 615 5 -91 184 -57
2499 -57 -459 90 -142 -186 -295 -134 -39 -148 -133 263 -118 -315 211 355 7 594 402 192 -31 -162 109
2520 109 -38 -325 -191 -4 -258 -248 -53 -253 -173 -67 170 -5 -301 449 495 10 251 755 -119 121 -32
2541 -32 -75 -48 -389 22 428 -490 -247 -171 -611 -221 -52 -51 15 265 207 265 143 5 627 -325 -208 595 -172
2564 -172 -173 390 88 -190 -175 -461 204 -261 -413 233 -181 -442 230 213 87 91 342 392 61 -154 474 166
2586 166 6 592 176 -255 -417 -245 -422 -632 -382 320 -200 -444 395 323 -166 194 323 81 115 332 585
$$ packed form
2431D2l10K02m2j21k64J12J40Rj67M18R8k30K20L66l76K35K4j28L9q0k49J43r7
2454a6j15l34j17N31P2k83j45M48j31L3K23oK13n42L18R0k57j0M63l06l57L1l1
2477b28k9J05q5j03j21K36N90m55j44L52Jr1k9J89K28l70J96L73o10r6K75k41
2499e7m02N49k32m4j09J61R5j09J5L96l81j97N26J44l48N87j92k10k23j31K71
2520A09j47k87J34J87k54J0J95k00Q0J06K37j75k96P50M6m85K41N04q74K40j53
2541c2m3K7l41M11M06r18K43P6m40L90J69JO6K50n8N8j22j38O22r52J17Q03p67
2564a72jN63l02k78J5k86O65m65j52O46m14k61O72j7j26MK51N0l31k15O28l08
2586A66j60N86m16m31j62J72j77k10K50P02n20k44Q39p2m89L60J29k42L4K17K53
$$ plain form
2607 585 203 -114 267 35 -405 -235 105 -464 -28 212 -68 -263 -25 215 74 0 217 120 -49 296 648
2628 648 -40 -266 274 194 -264 -302 215 103 -587 -169 -54 -428 -505 206 125 -82 98 451 182 75 115 532
2650 532 -71 -81 261 41 -100 -17 -342 -280 64 -167 -433 -323 -70 57 -315 -144 384 268 169 291 490
2671 490 194 177 40 490 -29 -214 132 -93 -366 -227 -204 -151 -121 -373 98 -69 246 122 -17 -14 195 354
2693 354 68 -4 77 28 198 127 -84 -232 -6 -577 -306 -125 -264 61 -348 -73 19 -76 -115 134 202 481 147
2716 147 28 303 124 -16 295 -137 -248 -49 -182 -30 -380 -189 -60 188 -45 -156 -29 126 164 32
2736 32 176 149 -6 290 326 -212 238 85 238 46 98 -339 -96 6 -113 120 -172 -82 170 -133 -36 238
2758 238 9 238 350 91 159 248 7 148 118 -65 -80 -270 -156 -148 -224 -291 -141 -150 -4 50 297 260 81 316
$$ packed form
2607E85l82l17L81k32m40J70L40n69M36K40k80j95K38K40j41p4K17r7j69L45L52
2628F48o88k26N40q0m58l8N17j12o90M18J15l74p7P11q1k07J80L53k69j07M0M17
2650E32o03j0L42k20j41Q3l25O2L44k31k66J10K53J27l72J71N28j16r9J22J99
2671D90k96j7j37M50n19j85L46k25k73J39K3N3L0k52M71j67L15j24j39LK09J59
2693C54k86p2Q1m9J70p1k11j48K26n71K71J81j39L25m09K75R2r5l9K49O8K79l34
2716A47j19K75j79j40L11m32j11J99j33J52l50J91J29K48k33j11J27J55L8j32
2736C2J44k7j55K96L6n38M50j53J53j92N2m37K43J02j19K33k92R0K52l03R7K74
2758B38k29K29J12k59O8Q9k41J41l0j83j5j90J14Qp6o7J50rJ46N4K47l7j79K35
$$ plain form
2782 316 233 107 258 211 8 220 -66 -394 112 -452 -189 40 -230 -182 -266 -316 146 -72 -21 197 37 64
2804 64 189 195 15 264 252 146 183 -230 111 -21 -93 -468 -224 -247 -131 -58 -316 71 257 -16 154 68 254
2827 254 501 30 51 92 13 114 -180 -8 3 -110 -328 -153 -99 -368 182 -73 -77 195 42 172 557 -7
2849 -7 336 189 134 282 114 39 62 41 -285 -206 -433 -164 -317 -529 120 5 282 -43 347 49 73 24 358
2872 358 315 129 185 337 -103 88 202 -79 89 -131 -127 3 -231 54 -124 -154 37 111 50 203 193 367 188
2895 188 233 136 -42 33 70 3 126 -151 12 -249 -214 -206 -249 -204 274 249 184 116 31 53 190 -45 -14 8 329 179
2921 179 -22 49 -89 27 -113 -32 73 -55 -280 -205 237 77 23 -96 -53 100 -115 335 254 90 168 365
2943 365 116 -336 -107 86 -207 55 -67 -101 80 -256 -94 15 -160 -79 268 -89 96 179 -56 382 77
$$ packed form
2782C16q3j26J51m7k03K12k86l28N06n64K63K29k70M8q4n0M62k18N1K18j60K7
2804F4J25Oj80K49j2j06L7m13L41j32p2l75K44k3J16P3k58L87J86k73J70q6J86
2827B54K47m71K1M1p9J01k94J72J1j13k18J75N4k69N50k55mK72j53J30L85n64
2849gL43j47n5J48j68p5K3k1l26P9k27K69j53k12O49j15K77l25L90k98K4m9L34
2872C58m3j86N6J52m40J91J14k81J68k20MJ30k34K85j78l0J91P4o1J53j0J74j79
2895A88M5r7j78P5L7o7J23k77J63k61L5Qm3M5M78k5o5o8q5K2J37k35L1K2L21j50
2921A79k01P1j38J16j40Q1J05j28k25P5M42j60n4j19M3J53k15M50q1j64P8J97
2943C65k49m52K29J93k93K62j22l4J81l36J62J09j75Q1L47l57J85Q3k35M38l05
$$ plain form
2964 77 129 137 -4 148 346 -400 -56 -215 -342 -59 -316 -114 -184 74 45 217 272 52 179 349 -17 163
2986 163 186 132 56 -26 90 -33 -147 -154 -197 -428 -89 17 -308 77 215 -97 70 -231 204 49 -47 318 159
3009 159 45 148 175 -228 -141 -34 -450 -157 -19 -124 217 -362 144 -19 32 33 244 -24 24 331 438 114
3031 114 -97 242 14 -161 -224 193 -252 -132 17 -95 224 -123 -512 -124 -149 -429 445 255 124 77 -55
3052 -55 98 139 -123 31 226 -56 54 -4 -3 79 97 -220 -54 -136 -190 42 107 48 445 120 463 70 26 109
3076 109 -43 65 185 -102 -38 131 -108 8 -253 -342 -129 -359 232 7 95 -71 417 -105 -70 253 -115
3097 -115 29 14 45 106 162 -112 139 -347 -236 -370 -359 -380 -152 -152 -80 294 -139 136 341 -30 -25 -2 26 239
3121 239 361 25 -22 47 -122 -242 -240 170 -441 -380 -113 -158 -50 132 -151 -419 202 -148 255 134 107 414
$$ packed form
2964G7N2Qj41J52J98p46L44j59j27K83k57K02p0K58k9J72N5k20J27J70l66J80
2986A63K3n4p6q2J16j23j14pm3k31L39J06l25L85J38l12J67l01M35j55r6L65j59
3009A59j14J03K7m03Q7J07m16K93J38j05L41n79N06j63N1JK11k68M8L07J07l24
3031A14k11L39k28j75o3M17m45J20J49j12L19l47l89L88k5k80Q74j90j31m7j32
3052e5J53M1k62J54J95k82J10n8JQ2J8l17J66q2n4K32O5n9L97l25L43l93m4Q3
3076A09j52J08J20k87O4J69k39J16k61q9K13k30N91k25Q8j66M88n22L5L23l68
3097a15J44j5L1O1N6k74K51m86J11j34J1k1K28%P2L74m33K75K05l71NK3K8K13
3121B39J22l36m7O9j69j20KM10o11O1K67m5J08J82k83k68O21l50M03j21k7L07
$$ plain form
3143 414 151 -52 -150 63 -380 -335 29 -99 -92 2 -41 -337 -650 -117 195 -61 -122 10 240 271 153 72 85
3166 85 -193 -39 -258 -153 -123 36 54 19 96 -116 -369 -223 0 47 -16 -21 416 108 6 259 126 48 107 -6
3190 -6 54 64 101 164 -62 -189 -177 -187 -439 -18 -54 31 -187 -51 129 6 -248 258 200 40 205 553 65 132
3214 132 155 -64 -175 -203 162 -211 16 10 174 -195 -312 233 -367 -127 -149 99 109 156 352 476 -232 -66
3236 -66 56 -313 -196 -191 -337 -98 -324 -127 -156 -25 -172 0 6 -40 380 249 23 332 -8 -281 236 -197
3258 -197 -66 37 -364 -150 -153 -386 -36 201 -62 128 55 -104 43 149 278 -279 -375 129 459 -61 107
3279 107 151 150 146 150 -153 4 -137 -13 -140 -390 -86 -211 47 -146 15 47 266 -282 300 236 22 280 7
3302 7 269 -5 40 -348 -157 -209 -166 -130 -9 -300 84 -168 138 295 -127 167 414 53 57 94 -102 203 59
$$ packed form
3143D14k63k03r8K13m43M5L64j28PR4m3k96l13N33L12k56o1J32K30L1j18q1J3
3166H5k78J54k19J05L0J59J8l5P7k12k53J46K23M7o3nM37l08j02K53j33p8N9j13
3190fO0J0L7O3k26j27J2j0k52M21l6Q5k18J36J80j23k54N06n8j60J65L48m88O7
3214A32K3k19j11k8L65l73K27oJ64l69j17N45o00K40k2K48J0M7J96J24p08J66
3236f6J22l69J17Nj46K39k26J97k9J31j47J72Om6M20j31k26L09l40k73N17m33
3258a97J31J03m01K14lk33L50K37k63J90p3j59J47J06J29n57r6N04L30n20J68
3279A07M4jmMl03J57j41J24j27k50L04j25K58j93J61L2K19n48N82o4k14K58k73
3302GK62k74M5l88J91n2M3L6J21k91L84k52L06J57m22K94K47l61ML7j96L05j44
$$ plain form
3325 59 185 72 110 -109 -84 -282 -148 275 -252 -65 -138 -269 178 56 57 210 406 -60 274 63 -116 280
3347 280 -277 -31 -108 -248 28 -45 -394 116 -135 -234 -17 -44 34 202 250 2 372 83 293 151 4 93
3369 93 21 39 131 -237 -144 -250 119 -43 -81 -238 -17 -177 -61 225 21 324 107 180 189 185 235 47 155 65
3393 65 374 -222 -64 222 -329 -8 -65 -275 -91 92 -208 -61 35 -114 309 348 -108 253 -4 -237 72
3414 72 68 250 72 -139 57 -128 81 -227 -194 56 -143 -44 2 155 57 58 157 506 452 295 119 16 -10 -127
3438 -127 -180 17 116 -210 -68 -71 -266 -116 -219 -23 -61 -226 -28 -78 205 15 137 178 373 134 214 107 -128
3461 -128 -36 -150 -183 65 -349 -379 80 -83 -213 223 -88 216 112 109 179 285 19 88 -21 -145 115 -73
3483 -73 -254 -114 58 -116 -379 -383 -191 128 -161 -60 6 -292 336 332 155 -42 203 -63 90 -51 -20 101
$$ packed form
3325E9J26j13L8k19K5j98J34M23n27J87p3j31M47j22JJ53J96m66L34k11j79L96
3347B80n57K46p7j40K76p3l49N10k51r9K17k7P8J68M8k48L70k89K10j42j47Q9
3369I3p2J8R2l68R3j06L69j62l8j57K21j60J16K86k04L03k17P3RmN0j88J08r0
3393F5L09n96J58K86n51L21n7k10J84J83l00J47R6j49M23L9m56L61k57k33L09
3414G2mJ82j78k11J96j85K09l08L3K50j99R9M6J53r8JR9L49n4j57j76j03k6j17
3438a27n3J97R9l26J42lj95J50j03J96l8j65J98n0K83j90J22M1J95k39Q0j07k35
3461a28R2j14l3K48m14l0M59j63j30M36l11L04j04lP0J06k66O9j09j24K60j88
3483g3j81J40J72j74k63mJ92L19k89J01O6k98O28mj77j97K45k66J53j41L1J21
$$ plain form
3505 101 -197 -94 -28 -214 -117 -132 -76 27 -293 -179 205 -217 -69 182 167 306 12 46 23 353 -97 65
3527 65 -42 -14 -289 -219 -145 65 -133 74 86 244 167 -119 26 -145 215 66 77 257 -313 168 36 -126
3549 -126 -26 -374 -120 -161 -195 33 -162 -64 73 -6 -269 179 -112 -3 -138 63 488 26 -114 229 169 -31
3571 -31 135 64 56 55 -43 86 104 -47 -111 -296 7 -215 405 114 -135 -369 125 235 -112 148 572 -86 -161
3594 -161 124 155 -203 -36 134 -307 94 -47 43 -143 -189 164 144 -109 221 254 -77 3 215 118 -96 58
3616 58 97 132 -144 261 35 -313 201 -69 -110 228 -88 -32 -94 -92 14 71 -203 287 368 36 113 44 236 -45
3640 -45 -103 237 152 -317 -340 -85 -225 -255 280 -67 -404 -93 104 -44 -26 289 213 87 230 102 -30 -146
3662 -146 -169 -67 -289 -87 -164 -185 -233 -69 92 -248 40 -176 160 -420 195 210 280 97 -18 86 -215 -121
$$ packed form
3505A01k98J03O6j86R7j5N6J03l20J14L84m22J48K51j5J39k94L4k3L30m50J62
3527F5j07K8k75P0P4K10j98K07J2J58p7k86J45j71L60j49J1J80n70M81j32j62
3549a26J00l48K54m1l4K28j95R8J37p9k63M48k91J09j35K01M25m62j40L43o0k00
3571c1J66p1qjr8J29J8j51o4j85L03k22O20k91k49k34M94J10l47K60M24o58p5
3594a61K85L1l58J67J70m41M01j41R0j86m6L53k0k53L30L3l31Q0K12r7k14J54
3616E8L9L5k76M05k26l48N14k70m1L38l16N6o2KJ06N7k74M90Q1l32P7o9J92k81
3640d5n8L40q5m69k3K55j40l0N35l47l37L11J97j48J8L15p6j26J43j28j32j16
3662a46k3J02k22K02p7k1m8J64J61l40K88k16L36n80O15J5P0j83j15J04l01R4
$$ plain form
3684 -121 134 0 -114 8 -74 -212 -33 -337 -151 -108 51 50 191 -187 411 271 -22 -120 45 213 151 -36
3706 -36 -126 -64 -258 129 -183 -136 -138 -633 -318 -183 -129 358 43 -226 37 120 -177 43 185 179 110 -28 123 47
3730 47 -39 86 -67 -274 -310 -42 -119 -112 106 -100 -40 182 -35 123 -119 277 27 -139 -27 24 88 -188 155
3753 155 179 -332 -96 -152 116 -64 -139 40 221 -8 120 -86 190 197 174 367 111 60 243 82 10 323 24
3776 24 -31 76 21 -151 -91 -163 -64 262 -94 -109 175 92 72 29 25 98 291 121 -383 -21 40 -86 20 -231 -229
3801 -229 -191 -120 -74 -375 206 127 16 -152 169 0 62 482 344 112 484 140 -83 159 209 102 84 -210
3823 -210 -115 -2 -173 -168 -54 -251 -155 -149 -69 105 -24 209 229 187 277 -69 -30 -16 -142 95 0 216 103 -361
3847 -361 -107 80 -52 -77 83 -67 51 -123 -27 244 79 213 25 239 72 76 -159 92 165 -101 -100 -136 -251
$$ packed form
3684a21K55j34j14J22q2j38J79l04J86M3J59jJ41l78N98j40k93r8J65J68o2j87
3706c6r0O2j94L87l12M7km95L15J35N4M87l15k69K63Q3k97K20J42oo9j38J51p6
3730D7q6J25j53k07l6K68p7PK18k06O0K22k17J58k42L96k50j66J12N1O4k76L43
3753A55K4n11K36n6K68j80p5J79J81k29J28k06K76Pk3J93k56n1J83j61p2L13k99
3776B4n5J07n5j72O0p2R9L26l56j5K84q3k0m3mP3J93j70n04L62O1j26J06k51K
3801b29L8P1M6l01N81p9j11j68L21j69O2M20j38k32L72l44k23K42N0j07j8k94
3823b10R5J13j71NJ14j97R6OQ0J74j29K33K0m2R0l46L9J4j26K37r5K16j13m64
3847c61K54J87j32k5J60j50J18j74R6K71j65J34j88K14j67Mk35K51P3k66Jl6j15
$$ plain form
3870 -251 -347 -137 -29 -216 -27 46 186 269 -18 188 -275 170 233 -64 207 362 200 -31 -252 -158 -136 -119
3892 -119 -224 85 -343 -68 214 -1 51 277 191 169 61 196 310 -58 113 113 -82 95 208 -151 -144 25
3914 25 -123 82 8 35 -41 -40 -203 124 91 268 181 -120 51 243 211 168 218 241 -41 -214 31 106 -162 23
3938 23 -101 -107 108 8 1 -186 323 11 165 148 339 234 -132 -74 105 234 -37 -80 -102 112 -2 -119 -330
3961 -330 49 40 -459 68 -141 -18 142 160 127 -97 107 -78 99 172 -61 -42 64 -70 -341 -5 -116 -104
3983 -104 -273 168 -137 -169 -69 -2 181 -148 -28 216 48 562 285 40 -11 243 -85 -157 314 -7 198
4004 198 -13 61 38 34 -145 54 0 -153 104 218 109 -37 156 364 -48 -142 204 0 -243 -190 -75 -63 -200
4027 -200 63 161 -447 -90 24 -140 96 155 61 159 55 -176 60 79 -70 60 122 -246 -17 -10 -242 19 119
$$ packed form
3870b51r6K10J08j87J89P3J40Q3k87K06m63M45O3k97K71J55j62k31k21R4K2J7
3892a19j05L09m28K75K82k15N2K26q6k2j08J35J14l68J71%j95J77J13l59PJ69
3914B5j48K05p4K7p6Jj63L27l3J77q7l01J71J92l2m3N0K3k82j73K45P5k68J85
3938B3j24oK15j00pj87N09l12J54j7J91j05l66N8J79J29k71m3k2K14j14j17k11
3961c30L79rm99N27k09J23J60J8l3k24K04j85J77P3k33J9J06j34k71L36j11J2
3983a04j69M41l05l2J00O7J83l29J20K44j68N14k77k45n1K54l28p2M71l21K05
4004A98k11P4k3mj79J99n4j53K57J14j09j46J93K08m12r4L46k04k43N3J15J2j37
4027b00K63R8o08L57J14j64K36N9r4R8j04k31K36J9j49J30O2l68K29Pk32K61J00
$$ plain form
4050 119 -407 -128 -69 78 29 -112 9 43 -25 2 142 113 -43 78 170 109 -190 -310 119 -440 165 -219 -175
4073 -175 119 -159 -47 144 221 34 67 -69 393 0 55 188 77 -83 19 -72 107 62 -106 -173 72 -137
4095 -137 -52 -14 -37 -211 63 -15 -31 -13 232 -52 332 -150 267 -80 -182 150 90 253 52 -89 -35 -42 -112 -40
4119 -40 -140 156 -197 -272 121 226 -8 496 344 27 56 -74 -72 -148 -30 -51 -23 -133 -75 38 -26 -30 -18 60 91
4144 91 173 29 198 95 312 172 253 84 -87 124 56 -455 -198 -13 39 -85 48 -17 -262 -126 -140 -20
4166 -20 131 105 229 15 -108 47 40 -41 -195 335 -28 -24 11 -119 46 -155 21 45 -39 108 -83 -38 -254 134
4190 134 270 23 146 135 226 -150 -93 83 -116 -187 172 -104 21 -187 10 -161 270 8 -26 196 -133 162
4212 162 206 273 67 239 94 111 50 51 25 -3 -2 -53 174 -108 -156 40 -51 88 -252 156 244 3 114 29 113
$$ packed form
4050A19n26K79N9J47m9j41J21L4o8K7J40k9j56J21R2o1k99j20M29n59O05l84M4
4073a75K94k78J12J91P7j87L3j36M62l93N5J33j11j60J02r1J79m5j68o7K45k09
4095a37Q5L8k3j74K74p8j6J8K45k84L84m82M17l47j02L32o0J63k01j41N4pp0P2
4119d0j00K96l53p5L93J05k34N04j52l17K9j30Kp6J18k1K8j10N8J13o4mJ2P8L1
4144I1Q2j44J69j03K17j40Q1j69j71K11o8n11K57J85N2j24J33o5k45J36j4J20
4166b0J51k6J24k14j23J55pq1j54N30l63ML5j30J65k01J76K4q4J47j91M5k16L88
4190A34J36k47J23j1R1l76N7J76j99p1L59k76J25k08J97j71M31k62l4K22l29K95
4212A62M4O7k06J72j45J7o1Jk6k8Jn1K27k82m8J96r1J39l40M08Q8k41J11q5Q4
$$ plain form
4237 113 169 163 97 64 80 16 140 -135 260 -115 -76 84 -39 -91 11 -180 96 -142 -44 -70 87 306 -17 366
4261 366 177 80 -9 99 43 71 -18 -94 -19 -103 -307 -251 -34 -54 -36 33 -114 59 78 80 -29 101 17 -149 114
4286 114 56 15 168 35 159 -8 -114 24 -59 -160 -98 146 -316 133 -268 -130 181 137 -220 6 -28 -7
4308 -7 129 -58 314 -78 -217 189 39 44 101 185 -106 -122 -158 -45 -100 -257 -14 331 -16 423 59 -160 37
4331 37 137 -118 197 -3 -72 23 -279 -103 41 -341 146 -12 -434 94 -181 -321 -18 199 -65 122 41
4352 41 153 319 -80 184 -84 -11 77 58 133 -149 -188 17 20 -185 -73 87 14 35 453 212 -167 321 -229
4375 -229 337 -143 -134 38 -225 -183 -158 -37 -21 -105 -198 -3 74 -70 253 -130 135 9 136 263 33 90 -121
4398 -121 -99 -137 -141 21 -93 -85 -134 -172 -288 -259 -354 -365 -128 34 -113 -1 -60 159 0 1 153 -69 27 -155 95
$$ packed form
4237A13N6oo6l3J6o4J24k75L95l75L9J60j23n2J02j91K76k38R8k6J57K19l23L83
4261C66j89r7q9J08n6K8q9p6P5q4k04N6K17k0J8O9j47J73J9Kj09J30q4j66K63
4286A14n8m1J53j33J24j67j06J38q3j01O2K44m62M49m01J38L11m4l57K26l4K1
4308gJ36j87L72l92j39M06j50NN7Q4k91j6l6J13n5j57K43L45l47M39l64k19J97
4331C7J00k55L15k00o9R5l02J76J44l82M87j58m22N28k75j40L03K17k64J87q1
4352D1J12J66l99K64k68P3Q8j9P5k82l9K05Lk05J12J60p3K1M18k41l79M88n50
4375b29N66m80RJ72k63M2K5J21J6q4r3J95P7j44L23l83K65j26J27J27k30N7k11
4398a21K2l8mJ62j14Qm9l8j16K9r5j1K37J62j47J12n9K19j59JJ52k22R6j82K50
$$ plain form
4423 95 -185 -39 17 -291 -16 -97 -67 94 42 -204 -7 39 -103 171 -88 50 -76 241 -125 24 21 -8 -76
4446 -76 24 327 -104 51 -242 74 15 -86 176 -211 -6 123 -127 40 -12 190 79 -79 -263 80 122
4467 122 -100 -177 -150 -88 -245 -79 5 -131 -454 -129 83 356 -122 180 250 -17 145 36 78 304 126 -193
4489 -193 30 190 21 -93 -105 -43 -342 -243 -181 -78 -161 -29 447 -137 111 -98 -109 -146 -57 298 79 17 271
4512 271 -166 134 -113 -64 -138 -97 -376 24 98 -322 278 -95 48 72 217 -266 50 -174 99 -165 338 96
4534 96 -51 37 67 -46 15 -61 -77 198 114 -49 9 337 -65 47 166 161 145 91 -16 147 53 -48 184 -109
4558 -109 137 -141 -209 168 163 -166 -222 73 -404 -115 91 36 110 94 200 9 112 226 140 48 -32 209 -5
4581 -5 56 98 -151 106 -51 -200 -124 -154 -275 48 34 -269 324 -78 409 -119 260 144 -54 177 356 6
$$ packed form
4423I5k80J46N6l08K75q1L0J61n2k46J97M6j42K74k59J38j26L17l66J49lk9o8
4446g6J00L03m31J55k93L16n9j01K62l87K05J29k50J67n2K02j11j58j84L43M2
4467A22k22p7K7O2j57J66Q4j36l23L25K12K73m78L02P0k67J62j09M2K26j78l19
4489a93K23J60j69j14j2O2k99R9O2J03q3J32M76n84K48k09j1l7Q9L55k19o2K54
4512B71m37L00k47M9p4M1k79M00P4m20O00l73J43K4J45m83L16k24K73k64N03k42
4534I6j47Q8L0j13O1p6j6K75q4j63N8L28m02J12J19nj6n4j07J63r4j01K32k93
4558a09K46k78o8L77nl29n6K95m77K89K06n5P4j6J06j91J03J14q6r2q0K41k14
4581eO1M2k49K57j57j49P6l0j21L23j4l03N93m02M87n28L79j16j98K31J79l50
$$ plain form
4603 6 39 98 -245 -58 287 8 -71 -56 124 13 -361 36 66 229 19 133 -171 -82 152 46 566 157 -91
4626 -91 -260 -288 -50 -141 -265 -227 151 65 126 -151 120 -218 -430 -29 180 145 173 422 135 118 108 -36 -88 -342
4650 -342 -143 -31 68 -291 -6 12 -322 -188 -186 -13 -74 221 34 73 -64 168 -138 141 202 -55 -49 -69 140
4673 140 -106 63 -127 122 -32 -127 159 -192 -215 -249 237 60 84 74 -81 -129 4 -238 141 -125 248 -190
4695 -190 -17 -73 155 -14 -205 99 63 -19 48 108 -254 54 -93 90 123 183 -22 321 75 356 185 67
4717 67 2 -96 -177 -145 -440 87 -94 -173 223 -24 10 133 45 -85 -98 -125 114 236 118 -137 22 86 -55 -19
4741 -19 118 -100 -49 291 -99 -321 -128 49 258 147 88 -143 249 -20 -75 63 -104 110 216 140 -78 -109
4763 -109 113 176 15 -282 -186 196 -91 -94 -191 -151 -47 125 -31 300 124 107 241 -97 199 146 -114 72 -293
$$ packed form
4603FL3N9l43J87L45k79p9J5J80j11l74L97L0J63k10J14l04Q9K34j06N20m09k48
4626i1j69k8K38r1j24L8L78q6O1k77K71l38k12M01K09l5K8K49k87j7j0j44n2k54
4650c42J99J12R9l59K85J8l34J34KJ73o1K95j87L9j37K32l06K79O1k57Ok0K09
4673A40k46J69j90K49j54r5K86l51k3l4M86j77K4j0j55m8J33k42L79k66L73m38
4695a90J73n6K28j69j91L04l6q2O7O0l62L08j47J83L3O0k05L43k46K81j71j18
4717F7o5r8q1L2k95N27j81p9L96k47L4J23q8j30j3k7K39J22j18k55J59O4j41L6
4741a9J37k18N1L40l90k22J93J77K09j11n9k31L92k69n5J38j67K14J06p6k18l1
4763a09K22O3j61k97R6L82k87lr7M0J04J72j56L31j76j7J34l38K96n3k60J86l65
$$ plain form
4786 -293 -79 -20 -26 144 -25 89 -284 58 -84 275 249 -78 170 -1 -121 -109 -183 148 125 129 3 -83 -131 47
4810 47 -106 -255 -257 32 -198 -175 -299 5 97 -254 120 228 199 197 10 50 44 -10 -96 37 -179 -247 168 -18 -150
4835 -150 42 -96 -115 -104 -106 -213 127 74 -72 47 230 57 11 75 -19 -76 119 118 -168 90 0 180 0 -157
4859 -157 -50 -132 186 70 195 -66 -102 -174 26 -45 8 101 26 21 -261 167 -220 -262 -226 141 144 -48 45 -44 -84
4884 -84 -58 -74 95 139 29 141 -8 192 145 -77 -324 -94 279 -23 -216 -216 19 -42 153 -54 -392 139 -219
4907 -219 165 101 -106 10 -85 187 72 -116 155 202 110 195 36 -52 -17 -81 -125 -122 -215 -5 9 -40 45 100 35 30
4933 30 -91 111 42 41 82 -88 8 -25 -257 -179 -71 -56 13 46 -78 -181 -9 45 -61 240 274 19 132 13
4957 13 46 -47 63 -8 6 -101 -23 -178 -415 -219 -177 192 -186 -31 -113 -13 197 -53 330 130 260 137 121
$$ packed form
4786b93K14N9oJ70j69J14l73L42j42L59k6l27K48j71j20J2p4L31k3Mj26q6m8J78
4810D7j53j49kK89k30K3j24L04R2l51L74J08k9kj87M0on4q6J33k16o8M15j86j32
4835a50J92j38j9J1kj07L40n3j46J19J83j73m6O4r4n7J95jk86K58r0J80j80j57
4859a57J07q2L18j16J25k61l6p2K00p1N3R3p5nk82M28l87m2L6L67Lj92R3q9m0
4884h4K6j6J69M4j10J12j49K00m7k22k47K30L73l02j93%K35o1J95k07l38N31l58
4907b19L84o4k07J16r5K72j15j88K71M7r2Q5j59q8L5o4m4Lr3K10J4m9Q5N5o5n
4933C0j21K02o9jM1j70R6l3k32P8J08J5O9L3j24j03J72N4j06L01L4k55J13j19
4957A3L3r3J10p1J4j07P8j55k37J96M2L69l78J55q2J00K10k50L83k00J30j23j6
$$ plain form
4980 121 297 89 -112 -97 19 -81 -128 38 -68 -180 -76 97 21 217 -167 -9 445 11 18 218 74 47
5002 47 154 132 187 9 -18 12 -36 -128 -71 -238 -51 21 -233 31 250 214 127 260 -196 -75 58 -148 123 152
5026 152 51 154 -251 -11 -133 230 134 -8 -97 -106 -37 -328 13 -103 -26 211 -155 38 148 82 -118 -175 0
5049 0 94 118 -378 -15 -177 -260 39 29 -129 -36 92 44 10 163 330 -252 57 211 45 100 -25 264 11
5072 11 -120 321 -106 -87 -116 -3 19 -69 -17 50 -250 -76 181 405 128 5 149 12 69 27 321 -153 -54
5095 -54 251 43 22 -161 82 -235 58 112 115 140 -3 -11 -76 221 -75 72 4 146 116 310 55 -70 246 52
5119 52 78 -17 17 -108 -117 21 -16 -124 -229 112 -52 127 109 70 -90 168 -10 197 183 136 -27 -57 -118 45
5143 45 -268 7 77 -110 142 -6 87 32 86 30 -61 99 -21 -166 148 -30 134 221 207 -177 18 -25 -218
$$ packed form
4980A21J76k08k01J5J16j00m7J66j06j12J04J73p6J96l84J58M54m34PK00j44k7
5002D7J07k2N5j78k7L0m8r2N7j67J87P2k54K64K19l6q7J33m56J21J33k06K71K9
5026A52j01J03m05K40j22L63r6j42q9rO9k91L41j16P7K37l66J93J10o6k00n7J75
5049@R4K4m96L63j62q3K99j0j58R3J28m8l4J53J67n82L09J54j66N5j25K89k53
5072A1j31M41m27J9k9J13K2q8N2O7l00J74K57K24k77j23J44j37N7m2K94m74R9
5095e4L05k08k1j83K43l17K93N4LK5j43qo5K97k96J47o8J42l0J94k55j25L16j94
5119E2K6r5L4j25rJ38l7j08j05L41j64J79j8l9j60K58j78K07j4m7j63l0o1J63
5143D5l13K75P0j87K52j48R3n5N4n6r1J60j20j45L14j78J64Q7j4l84J95m3j93
$$ plain form
5166 -218 129 270 50 -23 16 -95 193 108 -8 104 42 106 121 100 326 -254 39 32 255 50 -290 92 -164
5189 -164 -21 -101 -76 134 34 15 -176 152 -24 -128 18 104 269 115 -146 -124 140 -71 103 -21 301 -126
5211 -126 -119 -275 -114 2 -203 -23 -94 10 106 7 116 -123 133 152 -186 83 140 -7 174 274 13 -47 101
5234 101 -104 -291 135 -48 -22 -256 71 -111 64 -111 -93 53 289 118 134 121 64 257 -28 20 -194 181
5256 181 -35 -69 -162 -59 131 275 -279 167 -32 48 -196 -39 99 176 -37 329 -12 439 107 -68 -81 121
5278 121 -151 -243 -187 34 -269 -119 -153 -214 -15 -127 -173 -91 103 22 -30 -68 -1 173 15 270 -25 -381 102
5301 102 220 -143 22 -89 -183 36 15 -72 -99 21 281 -59 -144 163 416 99 63 -34 -59 -40 18 174 -263
5324 -263 -198 45 -297 -116 -100 -13 -277 -140 -35 -6 237 -108 167 86 168 55 105 82 384 -172 -217 -3 -32
$$ packed form
5166b18L47J41k20p3L9j11K88q5j16J12o2O4J5k1K26n80K93pK23k05l40L82k56
5189a64J43q0K5K10j00j9j91L28j76j04J46Q6J65j54k61K2K64k11J74j24L22m27
5211a26Pj56J61J16k05J80p1J04R6r9J09k39K56J9l38K69N7j47J81J00k61o0J48
5234A01k05j87M26j83K6k34L27j82J75j75J8J46K36j71J6j3n7J93k85M8k14L75
5256A81k16l4r3J03J90J44n54M46j99Q0k44J57J38P7k13L66l41M51l32j75j3K02
5278A21k72r2N6K21l03J50l4o1J99j12m6Q2J94q1n2l8O7J74j58K55k95l56M83
5301A02J18l63J65j11r4K19k1q7k7J20K60l40q5L07K53l17l6r7k5J9N8J56m37
5324b63O5K43l42J81J6Q7k64J37J05K9K43l45K75q1Q2j13N0k3L02n56m5K14k9
$$ plain form
5347 -32 -156 42 209 -42 108 264 132 262 124 -271 180 67 188 151 107 236 146 -65 109 -92 79
5368 79 -232 -25 5 -1 -201 -363 -70 -179 81 -71 -68 -31 198 -234 216 -38 36 26 20 -81 246 -23 -20 -77 241
5393 241 -163 -81 77 -196 -52 -89 53 -88 122 192 40 48 -61 73 230 32 233 -61 -97 -260 52 126
5415 126 -170 17 -203 -38 119 -102 -25 256 -79 203 285 52 -99 82 324 64 -32 107 122 337 -120
5436 -120 -2 -118 -96 -105 -12 -178 -50 -85 65 -89 -156 171 160 -78 285 277 -227 -232 -113 -215 84 120 -24 -85
5460 -85 -176 195 -157 -27 -92 -193 147 220 72 157 35 9 137 -61 9 -146 179 117 -130 -5 -347 205 -44
5483 -44 89 -78 43 180 -117 76 199 184 -128 -65 4 -280 -16 22 35 184 -85 237 -22 -174 -151 -229 -55
5506 -55 63 17 -198 114 73 -145 -7 41 157 222 -131 47 152 41 -123 1 -110 -50 141 -40 -134 -124 -42
$$ packed form
5347c2j24J98J67k51J50J56j32J30j38l95M51j13J21l7m4J29r0k11J74k01J71
5368G9l11K07L0ok00j62K93j09K60j52LL7K29m32M50k54P4j0oj01L27k69Ln7L18
5393B41m04Q2J58k73J44l7J42j41K10P0j52Qj09J34J57j98K01k94l6j63L12P4
5415A26k96J87k20J65J57k21P7K81l35K82Q2k33j51J81K42k60r6J39J5K15m57
5436a20J18j16K2rR3j66J28l5J50j54o7L27j1k38L63qn04nJ19j02K99L6j44o1
5460h5r1L71l52J30o5j01L40P3j48Q5j22k6J28j98P0j55L25o2k47J25l42N52k49
5483d4J33j67J21J37k97J93J23j5l12O3O9k84K64L8J3J49k69L22k59j52K3p8J74
5506e5J18m6k15L12m1k18J38M8J16O5l53J78J05j11j64J24j11O0J91j81r4J0Q2
$$ plain form
5529 -42 -27 -124 -41 199 107 -33 -20 60 51 81 68 -4 -58 67 128 226 39 24 45 -4 -76 -63 -29 -110 -203 -109 -20 8 20
5558 20 139 84 83 113 197 180 -143 69 -100 271 264 -100 -163 179 -174 -56 -40 71 98 140 95 -248 25 76 143
5583 143 259 -144 -15 131 12 -162 -146 -88 -141 -204 -165 -299 -237 -75 -3 -143 -39 14 -218 14 42 44 -72 -117
5607 -117 207 16 172 205 330 190 -105 194 145 -57 40 16 40 -160 265 40 9 34 -128 -32 39 176 69
5630 69 40 12 178 -30 -57 -135 98 -115 -232 -129 -230 -75 78 104 180 284 -96 121 203 172 390 -54 -217
5653 -217 325 -62 112 -127 -196 113 -277 -295 124 -316 -244 138 -133 -210 -101 132 -51 -80 150 65 -288 211
5675 211 9 190 -43 -148 -120 -199 -74 -68 -143 -115 -126 -71 50 -266 -98 195 199 7 368 23 -69 -57 3 -298
5699 -298 153 190 163 -188 -109 243 -230 -49 82 -200 -323 -95 209 294 42 -83 186 -18 25 144 58 -32
$$ packed form
5529d2J5r7Q3K40r2j40J3Q0rL0j3p2n4J25O1R8j87j5K1m9p2J3L4q1r3R4Q9K8J2
5558B0J19n5jL0Q4j7l23K12j69L71pl64o3L42l53J18J6J11K7M2m5l43K73N1O7
5583A43J16m03J29J46j19j74J6N8n3o3L9j34O2J62P2j40J04N3k32K32K8Kj16m5
5607a17L24j91J56L3J25j40k95K99m9k02R7k4K4k00M25k25l1K5j62R6P1J37j07
5630F9k9k8J66k08k7p8K33k13j17J03j01J55J53K6P6J04l80K17Q2l1K18m44j63
5653b17N42l87J74k39o9L09l90j8M19m40P2L82k71p7J09K33j83k9K30q5l53M99
5675B11k02J81k33j05K8p9J25Op5K8j1N5J21l16J68K93Mj92L61l45r2J2O0l01
5699b98M51L7k7l51P9L52m73J81J31k82j23K28L04Q5k52j25K69k04M3J19q6r0
$$ plain form
5721 -32 214 174 -59 -99 -5 -192 -79 -126 -153 -94 -234 -344 59 -63 40 -179 -24 -216 231 -37 145 107 231
5744 231 174 -142 -89 108 39 -72 -119 65 27 61 55 153 9 2 104 63 -114 -50 60 155 117 -147 75 -333 33
5769 33 -225 -59 -66 63 -108 -302 -91 -218 -102 102 -67 84 -40 176 -55 153 230 221 48 37 -48 -131 119
5792 119 -49 -217 -134 -136 149 162 46 13 12 253 -25 -112 127 424 125 203 -39 144 -16 125 -94 -174 -34
5815 -34 23 -377 -61 -172 -33 -40 -456 -139 186 200 -208 2 -71 34 -70 175 -137 -87 123 136 7 -86 -18
5838 -18 -262 -182 -194 -222 -301 -306 -79 248 -155 128 245 0 270 135 -20 292 37 236 95 -155 -235 -102 -243
5861 -243 49 -38 95 -206 51 117 -132 48 -185 64 -232 51 87 -34 187 133 -283 -189 -70 7 -8 -38 57
5884 57 -165 -258 -222 153 -125 229 -107 121 91 33 -30 -68 193 96 199 34 -183 -109 -17 -108 75 164 15 39
$$ packed form
5721c2K46m0k33m0R4j87J13m7k7N9j40j10M03j22J03k19J55j92M47k68J82l8J24
5744B31n7l16N3J97o9j11m7J84l8L4oR8j44pJ02m1j77O4J10R5l8k64K22m08L66
5769C3k58J66pJ29j71j94K11j27J16K04j69J51j24K16k31K08P7rj73j1q5q3K50
5792A19j68j68Q3kK85J3j16l3jK41k78q7K39K97k99P8k42J83j60J41k19q0J40
5815c4N7m00L16j11J39pm16L17L25J4m08K10p3J05j04K45l12N0K10J3j29r3O8
5838a8k44Q0j2k8p9nK27L27m03K83J17k45K70j35j55L12k55J99j41k50q0J33j41
5861b43K92q7J33l01K57O6k49J80k33K49k96K83L6j21K21n4m16R4J19P7j5l0R5
5884E7k22r3L6L75k78L54l36K28l0n8o3l8K61r7J03j65k17P4R2r1J83Q9j49K4
$$ plain form
5908 39 -124 -90 -209 -59 97 -168 -100 92 63 -150 20 -182 -217 29 -254 183 -326 -65 -14 -250 -164 -146 -171
5931 -171 209 -62 -293 14 141 -64 -51 281 272 247 -24 190 -27 67 -109 -56 37 99 136 -15 34 78 -204 109
5955 109 -148 -51 0 -47 90 -211 -204 -67 230 -10 -3 371 -378 19 -30 -44 249 -52 35 -41 4 -17 194 -243
5979 -243 28 -82 22 -85 165 272 -268 91 -70 -158 -119 -152 -142 164 245 349 14 70 -34 286 -270 -127
6001 -127 92 22 31 -40 281 -170 -258 1 113 239 68 18 134 101 -111 -179 -238 77 -91 -44 -92 -97 44 54 47
6026 47 14 76 13 204 94 387 297 -2 109 -24 -3 148 124 -85 -279 -237 332 -181 39 8 62 -52 -149 -58
6050 -58 -14 214 23 34 68 -106 -53 -42 -316 77 -112 -154 -173 44 95 -47 -90 109 -126 -178 -104 -200 -63 177
6074 177 123 -83 233 -119 42 28 -207 98 -100 71 179 102 -154 73 -25 109 -79 82 -87 -176 -276 -18
$$ packed form
5908C9j63L4j19J50J56k65O8J92k9k13J70k02l5K46k83M37n09K61N1k36Q6J8k5
5931a71L80k71k31L07J27k05J3L32rk5k71K14k17R4j76N3R3O2L7j51M9M4k82L13
5955A09k57R7N1m7J37l01PJ37K97k40PL74p49L97m9j4K93l01Q7p6M5k1K11m37
5979b43K71j10J04j07K50J07n40L59j61q8L9l3J0L06Q1J04l35N6j04L20n56J43
6001a27K19p0Rp1L21m51q8K59J12J26j71n0J16l3k12o8n9L15j68M7m8nJ41J0p
6026D7l3O2o3J91j10K93r0k99J11j33K1J51k4k09j94M2N69n13K20l1N4j14r7R1
6050e8M4K28j91J1L4j74N3J1k74L93j89m2j9K17N1j42m3J99k35n2P4r6J37K40
6074A77n4k06L16l52J61j4k35L05j98J71J08p7k56K27r8J34j88J61j69q9j00K58
$$ plain form
6096 -18 83 55 -69 64 42 350 334 -46 128 8 -99 -188 -118 -64 -112 -239 60 -92 51 -197 -21 173 -22
6119 -22 86 34 101 -16 35 139 -2 101 112 53 40 6 107 0 -31 -21 148 -131 -105 21 -76 -135 -9 253
6143 253 31 123 181 186 -104 -327 73 -263 -45 172 -104 -182 22 93 -89 -39 120 69 -74 110 149 76 -53
6166 -53 -79 296 99 91 139 67 -111 -136 162 -71 -305 -186 -329 -302 -92 1 10 41 -187 63 -88 171 22 -28
6190 -28 90 199 349 -244 -141 30 164 117 -256 106 -36 -224 25 185 -125 -43 47 196 76 1 106 -27
6212 -27 186 158 31 300 203 -161 176 52 -241 7 39 -9 33 151 313 10 17 92 -45 303 77 43 73 79
6236 79 -181 -31 113 63 -309 -111 -25 -280 -24 -174 -157 40 121 -120 -184 -140 88 136 136 -80 127 -166 -113 -416
6260 -416 185 -71 54 -143 64 -169 -33 -260 185 345 -37 109 -89 -104 17 40 -53 -168 -47 -88 62
$$ packed form
6096a8J01k8j24J33k2L08j6l80J74j20j07q9P0N4m8j27K99j52J43k48J76J94j95
6119b2J08n2O7j17N1J04j41J03J1n9j3l4J01j07l1J0J69k79K6J26r7n9J26K62
6143B53k22R2N8Nk90k23M00l36K18K17k76p8K04P1j82N0J59n1j43J84L9p3j29
6166e3k6L75j97qM8p2j78k5K98k33k34J19j43K7K10R3RL1k28K50j51K59j49n0
6190b8J18J09J50n93J03J71J34m7l73L62j42j88K49J60l10Q2R0J49j20p5J05j33
6212b7K13k8j27K69r7l64L37j24k93K48L2m8M2J18J62l03PP5j37L48k26l4L0O
6236G9k60J50J44n0l72J98Q6k55K56j50J7J97Q1k41o4M4K28M8%k16K07k93N3l03
6260d16O01k56J25j97K07k33J36k27M45J60l82J46j98j5J21K3r3j15J21m1J50
$$ plain form
6281 62 8 131 -25 126 -37 -364 -49 -198 68 -32 -252 -69 89 41 373 -179 140 -38 -131 21 6 -156
6303 -156 119 260 63 -196 -9 243 -162 174 257 -165 -151 116 95 -93 208 -78 -45 178 30 50 34 97
6325 97 65 -116 -260 56 272 73 9 227 -50 -86 164 56 -86 -14 23 64 119 129 -188 -130 45 -12 -148 69
6349 69 67 -353 -83 -84 5 41 169 96 -32 103 178 0 -177 -142 50 19 -137 183 -12 206 307 -20 -215 -149
6373 -149 -71 148 262 -172 97 -1 123 -119 -91 -88 6 -31 -137 57 -42 41 5 158 94 -171 44 167 -65 177
6397 177 86 201 -145 128 7 -145 -153 88 -150 -113 52 165 251 1 -32 199 261 -125 -191 -37 -49 -75 100
6420 100 -115 -30 149 -300 -110 -158 -98 -2 -24 198 275 55 250 233 116 -145 13 129 -202 77 -214 -208 3
6443 3 -134 -4 -222 -90 -74 59 162 44 -88 -90 198 -181 107 147 118 148 -8 111 -102 -89 30 12 181
$$ packed form
6281F2n4J23j56J51j63l27L15j49K66j00k20J83J58m8L32n52L19j78r3J52j5j62
6303a56K75J41j97k59J87K52m05L36Q3m22J4K67k1j88L01k86L3K23j48K0j6O3
6325I7l2j81j44L16K16j99o4K18k77l6K50j08j42P2L7M1N5J0l17N8J75n7j36K17
6349F9km20K70jQ9L6J28p3j28J35P5j78j77L5J92l1j56L20j95K18J01l27j95O6
6373a49P8K19J14m34K69r8J24k42K8LR4l7j06J94r9Q3l6J53o4k65K15J23k32K42
6397A77r1J15l46K73j21j52qK41k38L7J65J13Q6k50l3K31O2l86o6J54j2k6J75
6420A00k15Q5J79m49J90m8O0R6k2K22P7k20J95j7j17k61J58J16l31K79k91OK11
6443Cj37J30k18J32J6J33J03j18j32kK88l79K88M0k9L0j56J19k13J3J19j8J69
$$ plain form
6466 181 -108 -190 50 -96 -53 -213 269 -8 180 185 -57 66 -140 38 -76 29 -39 56 228 42 -92 32
6488 32 -85 8 125 284 -299 23 119 -11 50 213 -4 18 -14 213 216 70 -73 -380 61 -33 244 -214 191
6511 191 75 -38 70 15 -253 285 136 186 64 256 152 1 -179 -7 -186 -130 42 -196 90 77 8 94
6533 94 17 6 -102 87 -234 8 117 48 113 56 -129 41 233 153 199 118 84 140 -17 -82 -16 -150 37 24 29
6558 29 66 -194 15 64 17 83 96 -93 -250 237 76 17 -102 -31 77 126 148 -103 176 -113 206 235 18 -211
6582 -211 69 -51 227 -103 40 331 -115 -198 -218 377 165 204 261 -132 -269 -172 9 -76 -180 145 -200 -43
6604 -43 -125 243 183 260 -81 -94 -109 -207 -65 -13 150 -336 178 -113 175 -44 -161 -162 -10 -313 215 -106 0
6627 0 -10 -82 117 -40 -15 -330 -17 225 -260 -74 -124 -52 -55 25 -95 -198 2 -18 -200 -75 214 245 198 18
$$ packed form
6466A81k89q2K40j46M3j60M82k77J88Nk42J23k06J78j14J05o8R5J72j86j34J24
6488C2j17R3J17J59n83L22R6j30O1J63k17K2l2K27Lj46j43l07M41r4K77m58M05
6511A91j16j13J08n5k68N38j49N0j22J92j04j51j80J72j79N6J72k38K86j3o9Q6
6533I4p7j1j08J89l21K42J09o9O5n7j85J70J92q0M6q1l4N6j57o5O6j34J87j3N
6558B9L7k60K09M9m7O6J3j89j57M87j61n9j19P1J08M9K2k51K79k89L19K9k17k29
6582b11K80j20K78l30J43K91m46q3k0N95k12L9N7l93j37R7J81q5j04L25l45J57
6604d3q2L68o0P7l41j3j5r8J42N2J63m86N14k91K88k19j17jJ52l03N28l21J06
6627@j0p2J99j57K5l15L13K42m85J86n0P2lQ0j20j03K00k0j82J25K89L1m7j80
$$ plain form
6651 18 36 -62 -25 -83 -12 -277 214 -15 228 -19 -52 -65 93 -159 -8 -213 64 153 -87 44 -66 -45 52 -172
6675 -172 158 183 67 160 140 -130 93 -11 167 -7 -212 -76 146 107 -293 -54 190 -16 74 77 137 34 -66
6698 -66 -83 76 83 -183 -90 -57 -165 -45 -156 -258 207 -153 -190 -161 67 -16 179 -238 88 26 -172 273 -78
6721 -78 130 -1 -121 12 -65 145 69 180 11 34 -277 76 -76 -410 -24 50 -16 -281 -5 -93 -37 129 291
6744 291 -268 72 -64 184 -19 208 19 -88 -79 -7 101 67 150 -141 23 -24 -92 63 229 -118 -134 66 -20
6767 -20 -13 41 128 156 -212 106 25 148 -86 117 -281 219 -341 -84 -124 31 -223 -232 20 -302 -101 136 7
6790 7 257 341 162 -57 -43 -12 219 -81 -235 55 -199 159 -110 108 154 -115 37 90 -78 107 82 104 54
6813 54 -4 193 -197 62 126 295 19 -74 -63 -152 -77 -144 -30 145 -31 163 74 70 -33 24 159 396 -22 -32
$$ packed form
6651A8J8r8L7n8P1k65M91k29K43k47l3j3J58k52J51k05K77Q9k40J31j10K1R7k24
6675a72L30K5j16R3k0k70K23j04J78j74k05J36K22l9m00K39K44k06R0LO0j03j00
6698f6j7J59Pk66R3L3j08J20j11j02M65l60l7K9K28q3J95m17L26o2j98M45l51
6721g8K08j31j20J33p7K10p6J11j69K3l11L53j52l34L86P4o6k65K76q8N6J66J62
6744B91n59L40j36K48k03K27j89j07RP2J08l4Q3k91J64m7o8J55J66l47j6K00q6
6767b0PN4Q7K8l68L18q1J23k34K03l98N00n60K57m0J55k54rK52l22K01K37j29
6790GK50Q4j79k19J4L1K31l00j54K90k54L58k69K18M6k69J52N3j68J85k5K2n0
6813E4n8J97l90K59O4J69k76r3J1q9P5o7J14J75j76J94q9mj03N7J35K37m18j0
$$ plain form
6837 -32 32 -19 84 126 70 81 35 110 -32 6 -65 -121 -246 -198 39 26 167 138 41 98 -24 65 275 32 79 -84
6863 -84 112 163 -199 69 260 -90 -128 -26 91 -51 -2 62 -202 102 305 -13 49 195 -60 -60 -226 93 -73
6886 -73 -108 -15 110 -237 -124 21 -137 -51 -118 -160 77 -239 131 -10 -53 228 -143 228 102 70 -49 -72 -36
6909 -36 223 -78 151 -205 82 -89 -58 -37 -316 -98 -10 3 272 80 36 -9 43 18 245 -143 -201 117 246
6932 246 16 -123 208 18 -130 -205 -23 -165 -9 -44 183 48 86 -10 -8 84 -100 93 89 294 221 131 -103 44
6956 44 -208 -288 -19 31 162 -253 55 -19 67 -49 171 -99 71 -147 -118 -12 169 -47 28 168 45 97 -206
6979 -206 105 -62 84 54 145 -288 82 -220 167 -133 138 111 -291 -75 31 64 304 286 -5 -220 8 85
7001 85 -8 -191 -71 -350 -104 172 -65 -40 -76 -125 -190 -184 86 215 60 -139 93 211 -50 -12 -146 -108 208
$$ packed form
6837c2O4n1J03M2n6J1m6P5j42L8p1n6j25M8K37j3J41k9r7N7j22Q9K10k43M7j63
6863h4J96N1l62K68J91l50l8J02J17j42M9O4k64L04K03l18O2J46k55%j66L19j66
6886g3l5R3J25l47J13J45j58Q6o7m2K37l16L70j41m3K81l71L71j26l2j19k3L6
6909c6K59l01K29l56K87j71L1K1k79K18Q8J3K69j92m4m5N2k5K27l88n8L18J29
6932B46k30j39L31j90j48p5J82j42J56l5K27j35L8r6KR2j84J93mK05p3r0k34J47
6956D4k52q0K69N0J31m15L08p4Q6j16K20k70J70k18K9J06J81k16P5J40j23N2l03
6979b06L11j67J46l0R1m33L70l02L87l00K71k7m02K16J06L3K40j8k91k15K28P7
7001H5r3j83J20k79K46K76k37K5l6m9o5OK70J29j55j99K32J18k61L8j34L8L16
$$ plain form
7024 208 41 -48 239 -180 60 62 -261 74 -138 51 115 98 -67 193 -92 -195 11 130 29 -66 -120 -129 7
7047 7 -14 -11 -83 -90 5 -102 20 -12 43 -19 125 -69 -115 4 -27 -112 -74 22 -132 -88 -185 -193 134 161 37 106 120 -11
7075 -11 -47 -71 56 13 -293 -327 125 6 227 20 -30 334 13 -195 -140 152 -24 -140 -179 62 36 -184 130
7098 130 -236 -295 -7 -234 107 82 199 116 147 -106 47 -1 -11 -151 36 234 -68 74 -189 150 218 6
7120 6 -45 -90 177 65 140 9 123 195 107 102 -145 75 75 -245 39 -138 -177 -14 -307 -232 266 -148 -385 42
7144 42 -103 -64 68 -24 -14 -175 -121 115 42 -225 76 226 -268 13 -91 -45 -156 -114 -137 64 -27 -95 14 -131
7168 -131 184 13 127 -131 -87 -100 94 -60 -95 -179 21 -28 41 165 -82 154 -165 -40 -279 -62 83 94
7190 94 145 77 267 -22 176 70 15 -113 -313 90 -221 130 26 -75 -25 140 -254 120 -188 -44 -161 191
$$ packed form
7024B08j67q9K87m19K40Kl23L35k12J89O4j7j65K60k85j03K06J19j01r5n4rJ36
7047Gk1Lp2pR5j07J22l2N5o2J44j94m6J19l1q5L8R6j54M4r7qL27K7j24O9J4j31
7075a1l6k4J27m3l06l4M52j19K21k07n0L64l21k08N5K92j76j16l9K41k6k20L14
7098A30l66n9K88k27L41k5J17q3L1k53J53m8j0j40J87J98l02J42k63L39O8k12
7120Fn1m5K67j12P5j31J14P2q8nk47K20%l20K84j77l9J63k93P5M98m14k37M27
7144D2j45L9J32r2J0j61N4K36p3k67L01J50m94K81j04M6j11M2k3K01r1o8J09j45
7168a31L15j71J14k58M4j3J94j54l5q4K00m9O9J24k47K36l19J25k39K17J45J1
7190I4N1o8J90k89J98j06n5j28k00M03l11L51j04j01N0J65l94L74l08J44j17L52
$$ plain form
7212 191 -205 -34 149 1 56 -174 -77 -158 27 8 -80 -23 -114 -54 0 30 107 90 29 -214 196 -100 191 56
7236 56 3 65 -101 -182 -189 -137 138 -255 -15 -85 151 100 -160 57 23 71 -14 -12 -136 234 -187 -302 -71 -164 -118
7261 -118 175 -424 -54 21 85 86 16 -38 -44 -82 123 119 41 217 116 -66 -248 -52 -47 264 27 56 52 -174 -106 234
7287 234 -55 -49 38 3 -31 -102 -47 11 -269 -73 10 -96 -72 92 -16 -218 93 39 95 -187 -62 -100 16 -121
7311 -121 -14 155 190 -351 62 -51 113 -208 260 -38 -261 115 79 164 25 -46 -110 -15 133 -132 -120 -51 -92
7334 -92 -79 -58 -45 45 77 69 42 -150 323 -97 -159 -27 23 -122 40 72 122 48 -281 -138 106 -253 3 138 -145
7359 -145 60 -206 -229 253 -78 -274 0 -60 -40 100 41 100 31 -221 18 317 -144 -52 15 36 -157 273 -72
7382 -72 -141 51 159 -99 19 -45 77 -46 130 1 64 171 -17 1 -349 17 -59 -137 162 276 80 43 138
$$ packed form
7212A91l96J71J83j48N5k30R7q1J85j9q8N7r1O0N4L0P7j7o1k43M10k96K91j35
7236E6n3O2j66q1pN2K75l93K40p0K36n1k60K17l4M8q5Kj24L70m21j15K31r3M6
7261a18K93n99L70P5O4Jp0n4ol8K05mp8J76j01j82j82J96NL11k37K9mk26O8L40
7287B34k89OQ7l5l4p1N5N8k80J96Q3j06K4J64j08k02L11n4N6k82J25l8J16j37
7311a21J07J69L5n41M13j13J64l21M68k98k23L76l6Q5j39p1o4R5J48k65J2O9m1
7334i2J3K1J3R0L2qk7j92M73m20o2J32N0j45J62L2N0p4l29J43K44l59K56J35k83
7359a45K05k66k3M82l31j96K74o0K0J40n9N9o9k52K39K99m61R2O7K1j93M30l45
7382g2o9J92J08k58J18o4J22j23J76j29O3J07j88J8l50L66p6p8K99J14j96l7R5
$$ plain form
7405 138 -27 192 -187 150 71 -44 92 156 -37 -31 90 140 129 -67 32 -15 332 -38 -38 13 -47 146 293 -118
7429 -118 -322 280 -332 -51 20 231 -102 -151 -45 -29 -178 106 -179 29 -15 -2 -117 -182 28 19 68 54 37 -2
7453 -2 113 -11 -121 124 -62 195 136 -114 -199 -44 143 -98 -160 -180 -25 -194 -117 112 43 -24 200 -18 -49
7476 -49 -100 -43 -68 -56 95 -70 95 29 119 127 -39 -17 249 -78 2 -112 90 395 162 139 -26 -63 0 -64 207
7501 207 107 290 243 -265 -86 -130 13 309 -94 34 75 -65 -69 -34 -15 -310 132 129 -107 166 -95 -13 -267
7524 -267 -4 -77 -115 -100 -340 41 170 37 57 -72 -326 -54 243 101 228 -51 -3 98 39 68 232 -361
7546 -361 148 101 -63 96 154 15 9 51 -211 -192 -33 -31 35 -186 146 99 65 -105 77 46 117 192 219 214 184 -201
7572 -201 -61 118 -158 188 234 -55 143 167 -115 -81 121 -80 -362 3 120 -94 -115 -174 17 -1 167 -17
$$ packed form
7405A38j65K19l79L37p9j15J36O4j93OJ21N0j1j96R9m7L47l70%N1o0J93J47m11
7429a18k04O02o12K81P1K11l33m9J06J6j49K84k85K08m4J3j15o5K10rM9j4j7l9
7453bJ15j24j10K45j86K57n9k50q5J55J87k41o2k0J55j69P7K29o9o7K24k18l1
7476d9n1N7k5J2J51j65J65o6R0Qj66K2K66l27Q0j14K02L05k33k3j65l7O3o4K71
7501B07j00J83m7n08J79m4J43K96m03J28M1j40mL5J9k95M42lk36K73k61Q2k54
7524b67K63p3l8J5k40L81J29j33K0j29k54K72K97j42J27k79M8J01n9K9J64n93
7546c61N09m7j64J59N8j39oM2k62J9J59KO6k21L32m7l4j70J82l1P1P5K7nl0l85
7572b01J40J79k76L46M6k89J98K4k82L4K02k01k82L65J17k14k1n9J91j8J68j84
$$ plain form
7594 -17 -76 -96 -5 32 207 129 70 358 -110 -139 102 47 -76 263 -30 -168 -219 -151 -19 -81 -6 -76 -86 -164 9
7619 9 136 -49 -180 -16 256 -339 -43 -23 85 79 87 -26 97 -4 104 162 -51 -226 -391 -23 -74 -41 230
7642 230 123 56 -65 322 116 277 23 116 -10 67 -164 -67 3 34 -109 -136 -157 223 -33 187 -167 58 101
7665 101 -236 14 30 -112 -74 -126 -31 56 -58 -45 -164 54 147 214 -113 50 40 -30 -201 49 18 -60 96 -102
7689 -102 -80 17 78 104 228 232 233 356 -15 160 70 191 4 14 -48 -384 -181 -235 -216 -121 216 -70 -9 157 -39
7714 -39 277 -83 -22 32 75 -130 -91 -231 -133 198 -78 155 -63 -82 -219 31 35 177 95 -106 156 -156 164
7737 164 20 132 36 68 85 -123 -3 -63 145 -77 1 336 245 -138 195 -79 -27 -179 -283 44 -23 -169 -54
7760 -54 16 22 86 166 -171 -110 -147 5 -47 69 104 -11 -49 -41 136 -42 -179 244 49 -28 -125 77 64 2 43 93
$$ packed form
7594a7n9k0R1L7J75p8n9K88m68k9K41n5j23L39k93j38n1O8J32o2P5p0j0p8J73
7619IJ27j85j31J64K72n95K96K0J08oQj13J23j01J08N8k13j75j65L68n1L3K71
7642B30j07o7j21L87k06J61k54R3j26P7k31R7P0L1j43k7k1L80k56K20l54K25M3
7665A01l37K50J6j42L8n2R5Q7j14J3j19K18R3O7l27J63j0p0j71K50l1p8J56j98
7689a02K2R7O1K6J24MJJ23l71J75r0J21j87J0o2l36K03n4J9R5L37k86O1J66j96
7714c9L16l60O1N4M3k05L9j40R8L31k76K33k18j9j37K50MJ42q2k01K62l12L20
7737A64j44J12r6L2J7k08J20o0K08k22P8L35r1l83L33k74N2j52j04L27o7j46J15
7760e4P0OO4Q0l37O1l7J52n2J16L5j15l8QJ77j78j37M23j95p7r7K02j3o2M1N0
$$ plain form
7786 93 196 -30 -37 8 -12 -300 8 139 214 -42 272 -121 25 -193 -22 132 -23 -100 -114 -87 64 94 90 2
7810 2 -1 4 148 -60 83 -140 101 221 71 -173 138 -90 120 -125 -160 -176 269 135 -234 -5 101 112 -130
7833 -130 19 -131 -85 -180 185 -227 163 327 -160 -112 -157 -241 -77 -16 -54 56 -45 21 -178 -116 317 74 88
7856 88 -51 134 -28 35 102 -141 13 -31 24 -59 57 334 42 -234 -80 138 94 -267 60 -66 160 -50
7878 -50 142 271 -250 203 10 -208 -156 11 163 387 160 64 -7 -10 -271 -214 249 142 134 -228 15 -354 66
7901 66 -108 73 20 -46 -89 -37 -170 -53 -5 -143 134 -23 -154 -11 4 -243 -52 -261 -190 8 114 -375 -50
7924 -50 -85 -46 -150 53 323 -206 218 8 75 115 25 -55 133 -38 66 -394 127 -8 -149 19 -244 -53
7946 -53 -72 -136 -159 -72 -189 148 -120 17 13 199 114 110 208 -61 180 -24 91 77 223 60 42 -51 -338 -35 -155
$$ packed form
7786I3J03k26pM5k0k88L08J31P5k56L14l93J46k18J71J54j55p7j4K7J51L0mq8
7810BlNJ44k08J43k23K41J20j50k44L11k28K10k45l5j6M45j34l69K29J06J1k42
7833a30J49j50M6r5L65m12L90J64m87M8m5q4J64O1l8J10j01O6j99O2M33k43J4
7856H8j39J85j62O3O7k43J54m4N5q3J16K77k92k76J54K18m4l61L27j26K26k10
7878e0J92J29n21M53j93k18N2J67J52K24k27r6p1lk61N7M63j07ql62K43l69M20
7901F6j74J81n3o6m3N2j33J17M8j38K77j57j31J43J5k47J91k09P1J98J06m89L25
7924e0l5L9j04K03K70n29M24k10O7M0r0q0J88j71J04m60N21j35j41J68k63J91
7946e3j9o4k3Q7j17L37k68J37mJ86q5mR8k69K41k04J15j4J46j63j8r3k87L03j20
$$ plain form
7971 -155 84 -3 -161 406 22 -163 -68 -124 -274 216 121 -242 82 99 -292 122 148 -53 69 -139 -79 205
7993 205 -71 -233 104 117 -103 -276 200 -119 -95 129 40 143 122 -232 -54 -14 -34 91 -96 29 -30 168
8015 168 40 70 -308 210 247 134 84 48 98 114 192 -107 -40 -312 157 -24 -129 159 -6 37 51 -105 78
8038 78 55 -303 26 148 139 -133 181 8 -48 263 -38 -44 -340 -205 13 11 -12 101 -147 14 62 50 148 169 -168
8063 -168 -41 -82 -112 -77 -53 -74 -68 -285 49 -1 46 -149 55 -129 40 141 -15 -125 -117 -204 -152 34 35 78 72 51
8089 51 198 113 -184 123 -176 219 46 44 -93 -49 -127 -114 -240 11 -128 -76 -12 180 -127 -179 26 -171 -60
8112 -60 -153 -101 -52 -214 102 -199 214 -89 49 1 -102 62 73 43 -172 -93 -196 33 124 36 -147 12 -288
8135 -288 102 48 -39 -350 5 -157 211 -144 -88 174 -4 103 -180 -130 55 -48 129 152 70 180 -175 80
$$ packed form
7971a55K39q7j58N67l84j85R5n6j50M90r5l63L24J7l91M14K6k01J22k08O0K84
7993B05k76j62L37J3k20j73M76l19K4K24q9J03k1l54J78M0k0J25j87J25n9J98
8015A68j28L0l78N18L7j13n0l6N0J6P8k99O7k72M69j81j05K88j65M3J4j56J83
8038G8k3l58L29J22rk72L14j73n6L11l01ok96J35K18kk3J13k48J61M8j2R8K1l37
8063a68J27m1l0L5K4k1Ok17L34n0M7j95K04j84J69J01j56j10Qq7N2J86JM3ok1
8089E1J47q5k97L07k99L95j73kj37M4p8J3j26K51j39N2O4J92l07n2K05j97J11
8112f0r3N2M9j62L16l01M13l03J38m8j03J64J1l0k15P9j03K29R1q8j83J59l00
8135b88L90n4q7l11L55j62L68l55N6K62j78J07k83N0J85j03J77K3q2J10l55K55
$$ plain form
8157 80 226 -38 27 30 -1 -270 26 314 -82 -88 211 -245 -181 -288 -158 -141 167 77 -81 -33 -61 127 267 -77
8181 -77 32 -315 -186 163 -6 -67 24 -35 -58 -92
$$ packed form
8157H0J46k64O5Ll1k69K96K88l96oK99m56O4j07J30J7L08r0j58M8k8J88J40l44
8181g7J09l47J29L49j69o1R1n9k3l4
8191i2
$$ Imaginary data points
##PAGE= N=2
##DATA TABLE= (X++(I..I)), XYDATA
$$ plain form
0 0 0 0 0 0 0 0 0 0 0 0 0 -8 8 -8 8 -16 16 -17 24 -32 33 -40 48 -57 70 -80 95 -109 126 -144 165 -186 213
33 213 -240 272 -305 343 -385 431 -481 536 -594 659 -730 808 -893 986 -1086 1198 -1320
50 -1320 1454 -1601 1765 -1947 2152 -2382 2643 -2943 3291 -3701 4192 -4793 5548 -6529 7863
65 7863 -9786 12823 -18345 31630 -136421 -10525 262180 2122 -140525 -35232 103767
76 103767 39380 -20469 -25656 -49620 -63119 71626 119805 -506 -88664 -18270 86327 83023
88 83023 -55862 -107320 -15766 56617 27925 -36299 -56866 414 29157 22324 20012 -32305
100 -32305 -65428 23870 77463 4165 -52729 397 63429 21255 -34542 9363 12662 -50928
112 -50928 -11473 60460 7508 -69328 -35195 51104 30238 -66299 -37177 56298 20520 -33978
$$ packed form
0@%%%%%%%%%%%qJ6j6J6k4L2l3M1n6O5p3Q8j05J27j50J75k04K35k70L09l51L99
33B13m53N12n77O48p28Q16r12J017j130J253j389J538j701J879k072K284k518
50a320K774l055L366l712M099m534N025n586O234o992P893q985J0341j2077J4392
65G863j7649K2609l1168M9975j68051J25896K72705k60058j42647J05293J38999
76A03767o4387n9849n187k3964j3499J34745M8179j20311q8158P0394J04597l304
88H3023j38885n1458R1554P2383k8692o4224k0567N7280K8743o833k312n2317
100c2305l3123Q9298N3593p3298n6894N3126O3032m2174n5797M3905L299o3590
112e0928L9455P1933n2952p6836L4133Q6299k0866r6537K9122R3475l5778n4498
$$ plain form
124 -33978 20573 58066 -8028 -64397 5981 81807 -2483 -86090 -1662 80072 27458 -48617
136 -48617 -44275 13620 17721 -29116 -23345 1320 -8270 6828 34215 20335 -13070 -23772 15318
149 15318 40652 -13593 -44384 8365 38439 10587 -13519 -2530 12631 -12119 -22928 8157
161 8157 -9708 -44438 938 40585 2337 -26456 6545 38859 4540 -35103 2825 31901
173 31901 -7957 -16660 18230 20299 -4795 -14033 4547 8995 -23896 -22139 16333 2605 -29249
186 -29249 -10109 24458 19663 -21622 -25739 29939 37718 -16663 -24486 13595 26516 3989 -16496
199 -16496 -3924 9351 -3128 1704 7094 -20236 -21681 9240 14134 -11062 -29947 -5776 31576
212 31576 11767 -19393 70 19068 11110 3005 68 177 -6073 -4251 18634 8090 -26659
$$ packed form
124c3978N4551L7493o6094n6369P0378P5826q4290q3607Q4428Q1734n2614p6075
136d8617M342N7895M101m6837N771K4665r590J5098K7387j3880l3405j0702L9090
149A5318K5334n4245l0791N2749L0074k7852k4106J0989J5161k4750j0809L1085
161H157j7865l4730M5376L9647l8248k8793L3001L2314l4319l9643L7928K9076
173C1901l9858q703L4890K069k5094r238J8580M448l2891J757L8472j3728l1854
186b9249J9140L4567m795m1285m117N5678P779n4381p823L8081J2921k2527k0485
199a6496J2572J3275j2479M832N390k7330j445L0921M894k5196j8885K4171L7352
212C1576j9809l1160J9463J8998p958q105k937J09o250J822K2885j0544l4749
$$ plain form
225 -26659 -10154 20653 6802 -20195 -24266 -566 12980 -7069 -10199 7444 5330 5504 13994
238 13994 6642 -1267 -3638 3961 16627 -2284 -19922 3509 15186 -2919 -14318 -9133 5897
251 5897 -719 -19740 -4216 9028 -7238 -4046 11581 7988 2809 1682 8580 11703 -4969 -4010
265 -4010 10508 -1515 -8930 235 745 -937 -8016 -10863 3792 -551 -14898 -3680 5047 1020
279 1020 -166 130 10900 11615 -3614 5023 13674 -3242 -5324 4485 633 -3897 -8458 -2303 5831
294 5831 -8686 -10752 3340 -2308 -6439 -673 -1447 3703 3811 410 10683 7688 -2258 6878 8046
309 8046 -284 -3465 -6193 2292 3973 -12725 -7309 4876 -3808 -5566 -1923 -3527 245 -1805 389
324 389 6792 -1506 462 13338 5824 -224 3058 1656 4064 -627 -9448 -904 1056 -6433 -3300
$$ packed form
225b6659J6505L0807j3851k6997m071K3700J3546k0049l130J7643k114J74Q490
238A3994p352p909k371P599J2666j8911j7638K3431J1677j8105j1399N185J5030
251E897o616j9021J5524J3244j6266L192J5627l593n179j127O898L123j6672R59
265d010J4518j2023p415R165N10j682p079k847J4655m343j4347J1218Q727m027
279A020j186K96J0770P15j5229Q637Q651j6916k082R809l852m530m561O155Q134
294E831j4517k066J4092n648m131N766p74N150J08l401J0273k995r946R136J168
309H046q330l181k728Q485J681j6698N416J2185q684j758L643j604L772k050K194
324C89O403q298J968J2876p514o048L282j402K408m691q821Q544J960p489L133
$$ plain form
339 -3300 -3111 -3225 344 -4154 -797 3183 -5144 855 9242 863 1033 5796 5458 6038 -569 -2488
355 -2488 4118 -2399 -4783 171 -5844 -5457 486 -3237 -1421 -1395 -5493 2060 3967 -2127 540 1484
371 1484 4384 8175 233 1057 6394 -702 254 3687 -4766 -5851 -2201 -1149 58 -5999 -6593 2803
387 2803 -250 -2326 1961 -2707 -1279 6271 3398 2518 1753 350 6879 5692 -1575 -995 -3334 -2096
403 -2096 3274 -3151 -8198 -3480 -1889 1573 903 -6411 -2892 3154 2932 4031 -706 -2440 6259 6772
419 6772 2740 1699 -1867 324 4062 -1290 -2438 -3976 -8868 -352 4067 -5117 -7941 -2806 3851
434 3851 5643 -3064 -3003 4493 2726 4115 6608 -1701 -1949 5512 5507 1630 -3998 -5958 -254 -117 -1794
451 -1794 -3335 -11257 -5244 9055 2781 -7442 -2520 4721 7102 2733 -722 1511 620 3209 10382
$$ packed form
339c300J89j14L569m498L357L980q327N999Q387q379J70M763l38N80o607j919
355b488O606o517k384M954o015L87N943l723J816K6m098P553J907o094K667R44
371A484K900L791p942Q24N337p096R56L433q453j085L650J052J207o057n94R396
387B803l053k076M287m668J428P550k873q80p65j403O529j187p267N80k339J238
403b096N370o425n047M718J591L462o70p314L519O046k22J099m737j734Q699N13
419F772m032j041l566K191L738n352j148j538m892Q516M419r184k824N135O657
434C851J792q707O1P496j767J389K493q309k48P461nl877n628j960N704J37j677
451a794j541p922O013J4299o274j0223M922P241K381m369l455K233q91K589P173
$$ plain form
466 10382 972 -7589 520 2926 -479 -2733 -8738 -8858 -1039 4218 2118 -9109 -7809 10905 9621
481 9621 -5699 -2225 4660 3921 3947 4047 3306 -903 -3741 5712 6143 -7966 -9369 -3812 -1032 2982
497 2982 -2657 -9954 -1987 5929 5956 -1148 -7640 1449 8702 2603 4073 4841 -2890 12 6738 3838
513 3838 -4943 -12696 -4121 8536 1042 -7871 -6468 -4335 4097 6473 -5383 -8012 1316 9138 9555
528 9555 200 -2977 3184 1962 4134 6919 -6784 -12491 1422 9812 3187 -11911 -13050 5218
542 5218 8807 -4800 -8471 -6444 1701 10568 4997 -1069 991 1583 6208 6955 -2584 -6861 -5347
557 -5347 3021 12106 84 -13905 -4751 4308 2451 -5085 -12122 -4157 6123 5432 4520 -12 -4117
572 -4117 3692 7546 2248 -1384 -5653 -1215 9179 5909 -2625 -5993 -5690 3252 4350 -8720 -10133
$$ packed form
466A0382r410q561Q109K406l405k254o005j20P819N257k100j1227J300J8714j284
481I621j5320L474O885p39K6J00p41m209k838R453M31j4109j403N557K780M014
497B982n639p297P967P916K7p104o492R089P253o099J470P68p731K902O726k900
513C838q781p753Q575J2657p494q913J403K133Q432K376j1856k629R328P822M17
528I555r355l177O161j222K172K785j3703n707J3913Q390o625j5098j139J8268
542E218L589j3607l671K027Q145Q867n571o066K060N92M625P47r539m277J514
557e347Q368R085j2022j3989R154R059j857p536p037P965J0280o91r12m532m105
572d117P809L854n298l632m269M438J0394l270q534l368L03Q942J098j3070j413
$$ plain form
587 -10133 -2433 3451 6852 -77 -4728 1688 2560 2847 4620 -2761 -4253 3253 7847 7984 -2434
602 -2434 -10394 392 6001 -2730 -7696 -7657 -651 6491 759 -3412 -1369 -2096 1913 4162 -710 -613
618 -613 470 3809 9625 3584 -4648 -1813 511 817 -307 -6747 -4416 2328 576 -235 -2048 -4819
634 -4819 -1167 781 -331 1546 -815 687 7726 5257 1475 815 -1551 -43 2015 -1193 -2749
649 -2749 -2989 -1035 3855 -1242 -6608 -1974 -1854 -3726 964 1234 -795 860 4792 7442 1700 -4308
665 -4308 1870 4292 -6 521 -779 -2341 1721 1464 -3048 -5105 -5021 -454 90 -4165 -327 1861
681 1861 -727 3724 4862 -1014 -538 2989 3779 1957 -1350 1167 2544 -1681 -268 -293 -6559 -4324
697 -4324 344 -1900 -2650 -1680 107 2461 515 406 2327 -521 1621 5649 1546 -236 2345 1339
$$ packed form
587a0133P700N884L401o929m651O416Q72K87J773p381j492P506M594J37j0418
602b434p960J0786N609q731m966L9P006P142n732m171K043p27M009K249m872R7
618f13J083L339N816o041q232K835K324L06j124o440K331O744j752q11j813k771
634d819L652J948j112J877k361J502P039k469l782o60k366J508K058l208j556
649b749k40J954M890n097n366M634J20j872M690K70k029J655L932K650n742o008
665d308O178K422m298N27j300j562M062k57m512k057Q4M567N44m255L838K188
681A861k588M451J138n876M76L527P90j822l307K517J377m225J413k5o266K235
697d324M668k244p50R70J787K354j946j09J921k848K142M028m103j782K581j006
$$ plain form
713 1339 547 -1160 -3189 -1541 -3188 -3313 293 -2437 -4101 217 416 -500 917 -702 1459 3241
729 3241 2074 3355 1951 -257 3919 2253 -2594 -1117 -1684 -1790 -559 -3775 -2985 -808 -2440 333
745 333 223 -3547 978 3223 344 2230 1735 2090 4021 1236 750 1379 -1856 469 1098 -3579 -2178
762 -2178 -498 -2602 -1365 -2036 -2453 470 -693 84 2259 -1004 1322 4622 968 820 2343 336
778 336 2058 965 -2075 398 -1067 -1757 -178 -3601 -3058 635 -2113 -1291 393 -1402 1615 2235
794 2235 -168 2240 1783 1008 3486 342 -194 2389 -683 -518 350 -3076 -1141 -303 -3175 -1074 -941
811 -941 -2291 830 -393 -634 2220 99 1127 3666 69 956 3415 82 1685 1228 -1770 538
827 538 -699 -2748 -376 -2455 -2739 463 -1997 -1489 965 -1502 926 2554 -293 1927 2219 817
$$ packed form
713A339p92j707k029J648j647j25L606k730j664M318J99r16J417j619K161J782
729C241j167J281j404k208M176j666m847J477n67j06J231l216P90K177j632K773
745C33j10l770M525K245k879J886m95L55J931k785m86O29l235K325O29m677J401
762b178J680k104J237o71m17K923j163P77K175l263K326L300l654j48J523k007
778C36J722j093l040K473j465o90J579l423N43L693k748Q22J684j795L017O20
794B235k403K408m57p75K478l144n36K583l072J65Q68l426J935Q38k872K101J33
811i41j350L121j223k41K854k121J028K539l597Q87K459l333J603m57k998K308
827E38j237k049K372k079k84L202k460N08K454k467K428J628k847K220K92j402
$$ plain form
843 817 2647 1098 -124 2013 -840 -599 1128 -2898 -2243 -233 -2278 -1099 -1663 -3080 455 505 -504
860 -504 2017 16 318 3893 1333 1295 2241 -685 1641 2322 -1910 -1271 -1004 -1865 148 -2388 -3528
877 -3528 -443 -1845 -741 1325 -1338 -443 2910 1610 2449 958 -121 3346 2293 18 1068 -806
893 -806 -1743 482 -1260 -2026 -2237 -3764 -459 766 -2806 -2013 617 605 2335 642 512 3410 1437
910 1437 1788 3188 160 -1273 228 -113 171 -1773 -4539 -774 335 -2190 -1897 -2336 -960 1867
926 1867 177 292 1990 754 2388 4185 617 115 662 388 1836 -334 -2616 -1014 -1411 -1082 -207
943 -207 -3997 -3649 820 876 -289 -630 -296 3573 3089 -23 1771 1559 140 1327 745 75 283 -2305
961 -2305 -265 2289 -2968 -5538 -2042 704 830 -2933 -2318 3837 2175 -1474 1572 1821 117 826
$$ packed form
843H17J830j549j222K137k853K41J727m026O55K010k045J179n64j417L535N0j009
860e04K521k001L02L575k560l8R46k926K326O81m232O39K67q61K013k536j140
877c528L085j402J104K066k663Q95L353j300Q39j491j079L467j053k275J050j874
893h06r37K225j742p66k11j527L305J225l572P93K630j2J730j693j30K898j973
910A437L51J400l028j433J501l41K84j944k766L765J109k525K93m39J376K827
926A867j690J15J698j236J634J797l568n02N47k74J448k170k282J602l97L29Q75
943b07l790L48M469N6j165l41L34L869m84l112J794k12j419J187n82o70K08k588
961b305K040K554n257k570L496K746J26l763O15O155j662l649L046K49j704P09
$$ plain form
977 826 1532 2833 1200 -1990 399 1978 -1531 -2670 -3229 -2374 1746 -861 -3568 -372 662 756 647
994 647 -981 723 1933 -140 3037 2594 -962 1069 1250 450 419 -2406 -3626 -505 176 145 -2202
1011 -2202 -4039 2161 3320 -3393 -2996 1833 1842 720 675 3503 3290 -2334 415 4889 -1349 -4860 -572
1028 -572 1678 1034 -2342 -3646 824 662 -1964 -1336 -2428 -447 2816 31 663 3946 779 -166
1044 -166 2439 2108 -201 -3170 -287 4685 -449 -3972 660 -360 -2870 -937 -1688 -2540 -1105 509
1060 509 3342 -320 -1415 4246 1500 -2169 3034 2439 -2135 -604 3328 3020 -2453 -4326 1837 1103
1076 1103 -5050 -2347 332 -1795 241 815 246 903 -292 765 1807 239 1284 527 -237 4391
1092 4391 2431 -4233 -1481 2118 -948 -3866 -2968 483 71 -3427 685 2583 -3282 -1371 3679
$$ packed form
977H26P06J301j633l190K389J579l509j139n59Q55M120k607k707L196J034R4j09
994F47j628J704J210k073L177m43l556K031J81q00l1k825j220L121O81l1k347
1011b202j837O200J159o713L97M829Rj122m5K828k13n624K749M474o238l511M288
1028e72K250o44l376j304M470j62k626O28j092J981L263k785O32L283l167r45
1044a66K605l31k309k969K883M972n134l523M632j020k510J933p51q52J435J614
1060E09K833l662j095N661k746l669N203n95m574J531L932l08n473j873O163p34
1076A103o153K703K679k127K036N74n69O57j195J057J042j568J045p57p64M628
1092D391j960o664K752L599l066k918Q98L451m12l498M112J898n865J911N050
$$ plain form
1107 3679 1222 -1068 550 3037 3327 41 913 2588 -2089 -1740 1853 -1478 -3477 -605 217 -567
1123 -567 -2326 -1760 1131 -828 -1358 2007 546 97 2815 2082 1152 1658 178 32 801 -588 -523 -1923
1141 -1923 -1880 1284 -1641 -3404 328 -210 -2620 -591 1218 1246 -408 328 4368 2018 -1978 1752
1157 1752 3041 -1263 -983 781 433 -1172 -2250 381 -210 -3877 -1675 1127 -973 -1262 668 718
1173 718 1338 683 899 1898 599 703 1663 228 -54 894 -1171 -248 107 -2375 -1608 -523 -797 -1328
1191 -1328 -1456 -231 1293 -465 27 2853 348 -77 2228 1978 144 -171 947 1711 -1139 -1834 1386
1208 1386 -598 -3252 -662 -244 -1359 -1064 -716 936 315 -1169 1411 1985 -568 972 1306 822 949
1225 949 203 -364 748 -848 -1322 -435 -1245 -511 -1116 -1718 274 -122 -2064 605 1295 -338 577 1183
$$ packed form
1107C679k457k290J618K487K90l286Q72J675m677L49L593l331j999K872Q22p84
1123e67j759N66K891j959n30L365j461m49K718p33r30N06j480j46P69j389O5j400
1141a923M3L164k925j763L732n38k410K029J809K8j654P36M040k350l996L730
1157A752J289m304K80J764l48j605j078K631n91l667K202K802k100k89J930N0
1173G18O20o55K16R99j299J04R60j435k82R48k065R23L55k482P67J085k74n31
1191a328j28J225J524j758M92K826k505m25K305k50j834l15J118P64k850o95L220
1208A386j984k654K590M18j115K95L48J652o21j484K580N74k553J540L34m84J27
1225I49p46n67J112j596m74Q87q10P34o05o02J992l96j942K669O90j633R15O06
$$ plain form
1243 1183 1599 1214 -148 1623 2078 -963 -443 1281 -881 -1151 -604 -388 -741 -1792 -779 807 -1053
1260 -1053 -1247 1123 167 335 946 382 1546 1090 -297 1495 1091 -614 116 -261 -410 -21 -1922 -612
1278 -612 361 -2152 -947 306 -741 -257 29 341 1613 423 263 2582 513 168 1427 355 223
1295 223 -237 -1297 193 -379 -2307 -1063 -505 -1605 -300 -501 -280 654 -264 813 2102 77 926
1312 926 2010 564 1192 613 -430 850 -728 -1095 46 -1565 -1768 -221 -1232 -692 -50 -1296 718
1329 718 704 -427 1288 1120 287 1613 912 579 947 -570 -90 585 -1733 -1153 -641 -1566 -702 -1280 -1592
1348 -1592 -56 -661 -503 1395 319 95 1822 648 1189 1127 -175 1023 804 -809 17 -660 -999
1365 -999 -462 -1227 -1338 -415 -1704 -522 571 -644 407 1076 573 1208 849 583 1395 324 460 1175
$$ packed form
1243A183M16l85j362J771M55l041N20J724k162k70N47K16l53j051J013J586j860
1260a053j94K370r56J68O11n64J164m56j387J792m04j705P30l77j49L89j901J310
1278f12R73k513J205J253j047M84K86L12J272j190j60K319k069l45J259j072j32
1295B23m60j060J490n72j928J244N58j100J305k01K21R34r18J077J289k025Q49
1312I26J084j446O28n79j043J280j578l67J141j611k03J547j011N40O42j246K014
1329G18j4j131J715j68q33J326p01l33L68j517M80O75k318N80N12r25Q64n78l12
1348a592J536o05J58J898j076k24J727j174N41o2j302J198k19j613Q26o77l39
1365i99N37p65j11R23j289J182J093j215J051O69n03O35l59k66Q12j071J36P15
$$ plain form
1383 1175 -306 -458 349 -759 -1101 -842 -1441 -580 -226 -1191 -208 -277 0 1290 672 395 1315 886 971
1402 971 1204 354 167 284 -642 411 -363 -1898 -556 -453 -1047 -658 -913 -714 250 -312 188 1015 15
1421 15 1039 1423 253 1154 921 -110 517 275 -329 -710 -1452 -383 19 -1634 -1242 486 -409 -804
1439 -804 188 -206 179 149 852 1331 187 538 1401 -123 -115 887 -839 -1070 552 -50 -1045 -1500 -508
1458 -508 313 -1538 -1533 564 300 -840 1026 1324 790 714 534 929 533 -527 272 -2 -528 887 -751
1477 -751 -2087 16 -192 -1800 -1518 -213 403 -407 -798 1625 1415 -766 839 1463 -64 136 729
1494 729 891 947 -40 -303 -196 -1474 -579 -586 -2330 -545 871 -616 -667 319 795 448 -932 494 1626
1513 1626 -336 398 2498 1055 -447 -51 -477 -251 -1169 -1733 -303 -953 -390 708 -1104 -652 777
$$ packed form
1383A175j481j52Q07j108l42K59n99Q61L54r65R83o9K77J290o18k77R20m29Q5
1402I71K33q50j87J17r26J053p74j535J342J03n94L89k55J99R64n62N00Q27j000
1421A5J024L84j170R01k33j031O27k42o04l81p42J069M02j653L92J728q95l95
1439h04R92l94L85l0P03M79j144L51Q63j524QJ002j726k31J622o02r95m55R92
1458e08Q21j851NK097k64j140J866K98n34p6j80L95l96j060P99k74n26J415j638
1477g51j336K103k08j608K82J305O16q10l91K423k10k181J605O24j527K00N93
1494G29J62N6r87k63J07j278Q95pj744J785J416j487n1R86M76l47j380J426J132
1513A626j962P34K100j443j502L96m26K26r18n64J430o50N63J098j812M52J429
$$ plain form
1530 777 -450 -867 750 825 605 508 1625 2685 -170 -1359 1100 -295 -2373 -911 -120 -473 -448 -576
1548 -576 575 -1076 -1938 480 -255 -729 1199 1504 1154 1894 1200 381 -243 -605 322 -457 -1661 494
1566 494 734 -985 -429 -482 -1582 -1144 -837 -243 252 -8 1716 2123 -13 1078 1188 -932 -8 778
1584 778 73 -446 118 861 66 -1908 -686 45 -2096 -1794 553 356 68 1187 1692 1185 -458 -168
1602 -168 1329 -53 -212 1211 693 221 289 -474 -841 -1317 -1581 -854 -862 -353 924 45 231 1219 -24
1621 -24 -518 568 497 328 520 855 1378 440 -323 583 -707 -2153 -503 -404 -1282 -440 258 113 -180 -351
1641 -351 641 -27 -976 496 1230 250 1217 1199 1070 558 -580 -666 -336 -1030 -366 251 -486 -34 -45 -1202
1661 -1202 -41 -667 -905 46 831 626 709 957 1319 960 -286 258 619 -1335 -501 269 -199 -541 -363
$$ packed form
1530G77j227m17J617P5k20r7J117J060k855j189K459j395k078J462P91l53K5j28
1548e76J151j651q62K418p35m74J928L05l50P40o94q19o24l62R27p79j204K155
1566D94K40j719N56n3j100M38L07N94M95k60J724M07k136J091J10k120R24P86
1584G78p05n19N64P43p95j974J222P31k141L02K347j97k88J119N05n07j643K90
1602a68J497j382j59J423n18m72O8p63l67m76k64P27qN09J277q79J86R88j243
1621b4m94J086p1j69J92L35N23r38p63R06j290j446J650R9q78Q42O98j45k93j71
1641c51R92o68r49J472P34r80R67j8j29n12j138q6L30o94O64O17p37M52j1j157
1661a202J161o26k38R51P85k05Q3K48L62l59j246N44L61j954Q34P70m68l42J78
$$ plain form
1680 -363 -577 -425 -1193 -928 258 -528 -152 758 546 823 866 283 476 422 -262 608 221 32 441 -339
1700 -339 -581 -44 -1043 -1213 -105 -931 -243 295 265 516 63 519 1243 -74 151 1140 496 -45 582 448
1720 448 -16 -566 -960 -333 -645 -1180 -518 -74 -637 -237 47 109 571 442 434 861 405 266 973 315 543
1741 543 413 -212 193 -573 -917 -125 -772 -730 -124 -438 -149 -83 -588 267 830 -68 783 1017 544 531 119
1762 119 167 559 -740 -208 54 -893 -751 -257 -669 -839 -666 -771 70 -201 53 711 214 338 955 325
1782 325 509 611 -192 371 44 -624 -235 -317 -853 -387 -862 -843 -185 -568 -294 731 -81 121 568 392
1802 392 878 125 295 1152 234 -505 456 -45 -690 -416 -624 -553 -224 -1147 -98 122 -690 88 270 300
1822 300 674 238 696 1197 100 369 997 -387 -366 204 -550 -115 -734 -882 -74 -567 -585 -133 -273 -328
$$ packed form
1680c63k14J52p68K65J186p86L76R10k12K77M3n83J93n4o84Q70l87j89M09p80
1700c39k42N37r99j70J108q26O88N38l0K51m53M56P24j317K25R89o44n41O27j34
1720D48m64n50l94O27l12n35O62M44n63M00K84O2M62j29qM27m56j39P07o58K28
1741E43j30o25M05p66l44P92o47M2O06l14K89O6n05Q55N63q98Q51K34m73j3m12
1762A19M8L92j299N32K62r47J42M94m12j70J73j05Q41k71K54O58m97J24O17o30
1782C25J84J02q03N63l27o68L89q2n36M66m75J9O58l83K74J025q12K02M47j76
1802C92M86p53J70Q57r18p39R61n01o45K74k08P1L29r23J049K20q12P78J82L0
1822C00L74m36M58N01j097K69O28j384K1N70p54M35o19j48Q08m93j8M52j40n5
$$ plain form
1842 -328 252 58 528 660 -275 833 969 -240 326 253 -129 140 -666 -476 295 -551 -497 -155 -458 -528
1862 -528 -103 -291 282 79 143 1066 424 -12 702 290 485 596 -347 104 154 -672 -171 -3 -986 -200 -145
1883 -145 -655 -159 -711 -604 448 -202 124 669 240 326 518 213 577 122 -250 496 104 -645 -250 -340
1903 -340 -719 -408 -411 -278 -31 -557 -32 454 75 357 614 296 792 166 131 476 252 -170 139 -525 -491
1924 -491 106 -715 -788 -370 -619 -245 -431 -423 69 -160 179 436 84 102 798 363 189 476 -100 -91 269 -351
1946 -351 -185 -768 -702 188 -485 -904 132 -288 -311 109 443 484 288 261 904 676 -243 535 380 -35 -50
1967 -50 -144 -582 -111 -434 -391 -444 -373 -140 -187 -552 182 584 160 436 829 489 199 304 210 492 -318 -143
1989 -143 104 -333 -472 36 -805 -374 -240 -682 -340 -52 -42 316 -106 191 876 -25 397 723 119 10
$$ packed form
1842c28N80j94M70J32r35J108J36j209N66p3l82K69q06J90P71q46N4L42l03p0
1862e28M25j88N73k03O4R23o42m36P14m12J95J11r43M51N0q26N01J68r83P86N5
1883a45n10M96n52J07J052o50L26N45m29Q6J92l05L64m55l72P46l92p49L95r0
1903c40l79L11lJ33K47n26N25M86l79K82K57l18M96o26l5L45k24m22L09o64L4
1924d91N97q21p3M18k49L74j86QM92k29L39K57l52J8O96m35j74K87n76RL60o20
1946c51J66n83O6Q90o73m19J036m20k3M20L34M1j96k7O43k28r19P78j55m15j5
1967e0r4m38M71l23M3n3P1K33m7l65P34M02m24K76L93l40k90J05r4K82q10J75
1989a43K47m37j39N08q41M31J34m42L42K88J0L58m22K97O85r01M22L26o04j09
$$ plain form
2009 10 188 -256 204 -534 -493 -68 -507 -831 -88 -523 -285 330 163 162 431 283 447 62 32 678 135 139
2031 139 686 -235 -143 19 -765 -440 -630 -940 -190 -18 -650 209 -69 46 656 -338 -92 838 252 351 394
2052 394 439 455 -390 -699 119 -288 -774 -4 -318 -549 88 -278 -214 173 -288 95 231 -24 826 506 142
2073 142 672 245 -66 175 63 -311 -149 -288 132 -24 -301 292 -167 -915 181 -88 -456 462 673 623
2093 623 528 360 499 344 -347 -15 670 -375 -31 292 -204 -483 -372 -549 -400 -806 -60 358 61 264
2113 264 622 305 411 219 -14 246 388 402 393 62 82 302 -573 -674 -420 -645 -858 -127 -345 54 -27 249
2135 249 650 -304 -80 569 218 -84 735 525 164 -120 335 -2 -999 -1132 -328 -563 -627 609 258 -149
2155 -149 -243 159 255 -16 188 618 593 187 535 543 -187 35 25 -221 -336 -316 -367 -373 -181 321 78 -597 -157
$$ packed form
2009A0J78m44M60p38M1M25m39l24P43m35K38O15j67jK69j48J64l85l0O46n43M
2031A39N47r21R2J62p84L25j90l10P50J72o32Q59k78J15O10r94K46R30n86R9M3
2052C94M5J6q45l09Q18m07m86P70l14k31O37l66O4L87m61L83J36k55Q50l20l64
2073A42N30m27l11K41j12l74J62j39M20j56k77N93m59p48J096k69l68R18K11n0
2093F23r5j68J39j55o91L32O85j045L44L23m96k79J11j77J49m06P46M18k97K03
2113B64L58l17J06j92k33K60J42J4rl31K0K20q75j01K54k25k13P31k18L99q1K76
2135B49M01r54K24O49l51l02Q19k10l61k84M55l37r97j33Q04k35o4J236l51m07
2155a49r4M02R6k71K04M30k5m06L48Qp30K22j0k46j15K0n1oJ92N02k43o75M40
$$ plain form
2178 -157 -6 -285 -28 392 270 388 544 643 571 -550 124 228 -835 -468 601 -250 -568 26 -140 -587
2198 -587 -652 -83 554 -312 -135 753 205 183 885 494 130 -184 96 425 -388 -287 301 -324 -629 -164 -515
2219 -515 -683 -97 -243 100 184 108 464 122 309 791 113 -147 299 320 -17 98 207 -197 -406 -467 -331
2240 -331 -537 -760 142 223 -484 163 343 50 184 97 431 384 30 216 636 -486 -165 56 -289 -98 -580
2261 -580 -419 -180 -423 -523 -44 -176 25 186 -95 129 538 25 180 434 250 228 -116 -293 236 -329
2281 -329 -60 18 -372 -408 -44 -440 -148 219 -167 190 -25 22 430 275 5 517 54 205 307 -237 -38
2302 -38 -348 -242 -85 -98 -705 -212 240 -429 -105 -397 -113 152 150 182 396 356 385 226 -22 447 217 -280
2324 -280 386 -161 -136 -43 -600 2 -268 -290 -72 224 -240 47 431 -221 648 400 390 237 -154 113 500
$$ packed form
2178a57J51k79K57M20j22J18J56R9p2j121O74J04j063L67J069q51l18N94j66m47
2198e87o5N69O37q66J77Q88n48k2P02l91l64l14K80L29q13J01N88o25l05M65l51
2219e15j68N86j46L43Q4p6L56l42J87M82o78k60M46K1l37J15J09m04k09o1J36
2240c31k06k23R02Q1p07O47J80k93J34q7L34m7l54J86M20j122L21K21l45J91m82
2261e80J61K39k43j00M79j32K01J61k81K24M09n13J55K54j84k2l44j77N29n65
2281c29K69P8l90l6L64l96K92L67l86L57k15M7M08j55k70N12m63J51J02n44J99
2302c8l10J06J57j3o07M93M52o69L24k92K84K65kL2K14m0K9j59k48M69k30m97
2324b80O66n47K5R3n57O02k70k2K18K96m64K87L84o52Q69k48j0j53l91K67L87
$$ plain form
2345 500 -168 -82 45 -244 -344 -47 -276 -170 -313 -430 -54 -311 -75 103 178 338 18 62 375 625 12
2366 12 101 389 -214 53 -123 -229 0 -371 -503 -194 -187 104 28 -151 -74 107 230 311 66 486 576 -34 33
2389 33 318 -156 277 78 -548 -337 -30 -603 -321 -65 -236 -65 30 -470 202 115 183 651 323 75 276
2410 276 352 53 75 0 -200 -171 -325 3 -326 -330 68 -194 -176 207 -185 28 428 -188 251 270 175 323 314 83
2434 83 281 -162 -153 35 -339 -56 19 -108 -70 -160 -421 -93 83 -240 153 338 324 557 548 162 99 138 229 119
2458 119 -185 -230 152 -513 -392 -193 -186 -23 -432 -242 116 143 -9 435 407 211 90 267 126 97 -164 -56
2480 -56 -317 -248 158 -320 -235 -27 -70 -311 -197 -85 113 157 161 576 502 61 463 67 -111 206 43 -210 227
2503 227 -108 -68 -144 -504 -291 -157 -459 -265 76 -417 -9 -69 -145 54 163 272 214 -160 122 401 -66 73
$$ packed form
2345E00o68Q6J27k89j00K97k29J06j43j17L76k57K36J78P5J60l20M4L13K50o13
2366A2Q9K88o03K67j76j06K29l71j32L09PK91p6j79P7J81J23Q1k45M20R0o10O7
2389C3K85m74M33j99o26K11L07n73K82K56j71J71R5n00O72q7O8M68l28k48K01
2410B76P6k99K2p5k00K9j54L28l29mL98k62J8L83l92K13M00o16M39J9r5J48rk31
2434H3J98m43RJ88l74K83P5j27L8r0k61L28J76l23L93J85j4K33rl86o3L9R1j10
2458A19l04m5L82o65J21J99PJ63m09J90L58K7j52M44k8j96j21J77j41k9k61J08
2480e6k61O9M06m78Q5K08m3k41J14J12J98M4MM15p4m41M02l96j78L17j63k53M37
2503B27l35M0p6l60K13J34l02J94L41m93M08o0p6J99J09J09n8l74K82K79m67J39
$$ plain form
2525 73 150 -193 -153 -346 -89 -200 -385 -121 382 -408 -33 331 -57 -231 329 470 -38 -54 400 641 51
2546 51 -227 247 -38 -309 11 -133 -88 -94 -31 -59 -378 -495 -26 -422 -144 453 124 -98 475 409 134 1
2568 1 -138 359 -168 -482 337 -83 -456 -221 111 -431 -185 -126 -33 230 -43 648 406 -324 516 493 -432 258
2590 258 259 240 -469 -3 334 202 -828 -263 0 -662 -150 232 -375 165 284 130 70 139 458 -42 -76 369
2612 369 644 -531 13 347 -189 -533 -206 -120 -314 -563 -54 275 -583 -56 466 151 -327 332 291 140
2632 140 30 543 437 -193 -138 71 -380 -494 225 -217 -430 0 -66 83 -149 -142 349 -280 13 278 473
2653 473 -96 249 359 152 -83 125 -69 -489 -312 -130 -138 -634 99 58 -466 -249 73 120 -20 62 335 58
2675 58 32 469 345 -145 295 197 -194 -251 -259 -93 -130 -325 -404 110 -269 81 20 -216 -3 305 -7 113 362
$$ packed form
2525G3P7l43M0j93K57j11j85K64N03p90L75L64l88j74N60J41n08j6M54K41n90
2546E1k78M74k85k71L20j44M5oO3k8l19j17M69l96K78N97l29k22N73o6k75j33
2568Aj39M97n27l14Q19m20l73K35L32n42K46N9R3K63k73O91k42p30Q40k3r25O90
2590B58Jj9p09M66L37j32j030N65K63o62N12L82o07N40J19j54o0O9L19n00l4M45
2612C69K75j175N44L34n36l44L27Q6j94k49N09L29q58N27N22l15m78O59m1j51
2632A40j10N13j06o30N5K09m51j14P19m42k13M30o6J49k32PM91o29K93K65J95
2653D73n69L45J10k07k35K08j94m20J77J82qm96P33m1n24K17L22M7j40Q2K73k77
2675E8k6M37j24m90M40r8l91n7qJ66l7j95p9N14l79L50o1k36K13L08l12J20K49
$$ plain form
2698 362 200 6 -15 3 339 -159 -34 222 -262 97 -88 33 -209 -65 55 -131 -99 -72 38 252 -210
2719 -210 412 246 42 -61 12 -63 23 135 249 -206 -413 -105 2 -345 -174 19 -10 -144 -220 -16 381 -98
2741 -98 -59 250 73 255 18 123 56 -126 -215 203 1 -88 -144 -12 -139 -96 -111 148 297 -256 310 378 86
2764 86 295 490 186 204 180 112 176 -224 -104 548 -214 -29 -161 -426 31 -173 -143 96 -73 -99 334 75
2786 75 115 186 -115 244 208 -133 67 184 -126 -94 -334 -97 273 -358 -100 -140 -274 -148 95 198 14 80
2808 80 -81 374 245 -144 329 2 161 9 8 94 184 302 89 -240 -194 -117 -92 -96 84 92 148 57 84 78 257 306
2834 306 101 425 6 49 29 39 107 -123 -287 -108 -192 -351 270 -293 110 -84 79 234 462 -52 236 375
2856 375 -42 198 -126 -72 134 131 -243 114 -188 -251 -249 -115 20 -292 -154 -193 405 -102 153 202 -115 269 106
$$ packed form
2698C62j62j94k1J8L36m98J25K56m84L59j85J21k42J44J20j86L2K7J10K14m62
2719b10O22j66k04j03P3p5Q6J12J14m55k07L08J07l47J71J93k9j34p6K04L97m79
2741i8L9L09j77J82k37J05o7j82q9M18k02q9n6J32j27M3j5K59J49n53N66O8k92
2764H6K09J95l04J8k4o8O4m00J20O52p62J85j32k65M57k04L0K39j69k6M33k59
2786G5M0P1l01L59l6l41K00J17l10L2k40K37L70o31K58m0j34J26K43J03j84O6
2808H0j61M55j29l89M73l27J59j52jQ6R0J18k13l29M6P7K5mJ80QN6r1K7oJ79M9
2834C06k05L24m19M3k0J0O8k30j64J79q4j59O21n63M03j94J63J55K28n14K88J39
2856C75m17K40l24N4K06ll74L57l02o3KJ34J35l12J38l9N98n07K55M9l17L84j63
$$ plain form
2879 106 109 142 -244 51 150 -65 121 -309 -200 -234 -131 -9 149 -85 -324 -87 -101 -287 102 -12 201 210 40
2902 40 276 -52 116 62 197 -388 -20 -255 -341 -13 -354 78 -29 -373 121 136 73 289 187 50 311 249
2924 249 -14 223 -157 -285 35 -94 -418 -335 -364 -153 -127 -346 -98 -214 -77 -23 93 127 209 160 -52 180
2946 180 -15 77 297 96 118 -38 258 73 -236 -51 -192 -260 -482 -194 -48 -159 89 -135 133 317 67
2967 67 420 128 131 -81 -42 -110 26 110 -68 -222 -81 -163 -75 -205 136 -48 -313 -79 213 -15 131 535 179
2990 179 166 111 101 -115 167 397 148 268 318 -42 -146 36 -95 -354 -119 -41 -33 -55 -164 137 420 218 -36
3013 -36 265 -138 276 -154 99 292 -206 -4 53 -334 -268 -4 -332 3 165 264 -124 -190 -281 244 -209 111
3035 111 631 388 192 414 208 -57 -152 -194 -253 -321 -220 -119 -276 58 201 54 -43 -78 -196 -20 -115 -38 379
$$ packed form
2879A06LL3l86K95R9k15J86m30J09l4J03J22J58k34k39K37j4j86L89j14K13Rj70
2902D0K36l28J68n4J35n85L68k35q6L28l41M32j07l44M94J5o3K16j02j37K61o2
2924B49k63K37l80j28L20j29l24Q3k9K11K6k19K48j16J37N4J16L4Q2m9k12K32
2946A80j95R2K20k01K2j56K96j85l09J85j41o8k22K88J46j11K48k24K68J84k50
2967F7L53k92Lk12L9o8J36Q4j78j54J41q2Q8j30L41j84k65K34K92k28J46M04l56
2990A79j3n5j0k16K82K30k49J20N0l60j04J82j31k59K35P8Qk2j09L01K83k02k54
3013c6L01m03M14m30K53J93m98K02N7l87O6K64l28L35J62R9l88o6r1N25m53L20
3035A11N20k43j96K22k06k65r5m2n9o8J01J01j57L34J43j47r7l5j18J76r5P7M17
$$ plain form
3058 379 30 223 304 -227 -68 97 -392 -310 153 -203 -93 277 -162 -15 217 -114 -224 -12 -271 343 179
3079 179 -80 403 84 -78 195 106 31 -186 -19 70 66 -149 -343 -109 -741 -63 -201 -217 262 47 234 191
3101 191 287 -23 36 -368 44 67 13 -135 13 59 37 -218 -69 -156 -207 27 -82 107 143 190 -252 169 250 171
3125 171 112 -73 -113 46 -176 16 231 -133 -135 -68 -497 -342 -127 142 184 -32 -23 11 199 -28 552 -4 98
3148 98 381 154 63 -65 -203 144 -127 -82 137 -371 -15 258 158 -201 157 86 57 274 246 407 -239 351
3170 351 345 -15 -173 169 106 -322 -196 35 72 -182 81 208 -217 -487 -98 7 -307 -114 51 -38 93 324
3192 324 -38 -189 -168 46 161 -237 241 -22 -118 -5 21 23 -193 -206 103 -38 -216 -10 167 224 433 420 279
3215 279 -60 142 19 84 320 18 34 60 -90 249 -267 -401 -209 -358 -218 -181 179 278 -190 -25 195 -18
$$ packed form
3058C79l49J93Q1n31J59J65m89Q2M63l56J10L70m39J47K32l31j10K12k59O14j64
3079A79k59M83l19j62K73q9p5k17J67Q9mk15j94K34o32O78j38j6M79k15J87m3
3101A91R6l10N9m04M12K3n4j48J48M6k2k55J49q7n1K34j09J89L6M7m42M21Q1p9
3125A71n9j85m0J59k22J92K15l64kO7m29J55K15K69M2k16RL4J88k27N80n56J02
3148I8K83k27r1j28j38L47k71M5K19n08L56K73j00l59L58p1k9K17k8J61o46N90
3170C51ol60j58L42o3m28J26K31L7k54K63J27m25k70L89J05l14J93J65q9J31K31
3192C24l62j51K1K14J15l98M78k63r6J13K6Kk16j3L09j41j78K06J77N7K09j3j41
3215B79l39K02j23O5K36l02J6K6j50L39n16j34J92j49J40L7L60R9m68J65K20k13
$$ plain form
3237 -18 78 260 -94 113 -187 -150 -125 23 -50 -162 -567 -427 130 -159 -338 56 -49 -13 -13 108 -10 76 227
3260 227 -61 194 71 -126 -42 -33 26 -170 99 -197 -45 -131 -86 -81 -267 -200 -136 -89 134 -31 -23 37 101 233 43
3285 43 122 294 2 -43 174 -242 -20 92 -62 -115 -120 -26 53 -41 -2 290 59 395 -31 62 129 66 -201 -191 -130
3310 -130 -160 -187 26 -231 -29 -245 -401 -56 -468 -144 182 -25 196 77 -159 205 -108 229 -24 -241 177
3331 177 358 -338 57 23 67 79 59 76 -79 -199 -99 -65 35 17 353 -48 250 -29 -61 80 -21 -283 -108
3354 -108 -68 -217 -314 -44 -179 76 -350 32 -145 -121 59 194 -142 146 -105 -69 -16 -20 123 69 -107 39 94
3377 94 -257 -212 139 -401 -97 118 -110 104 19 56 -51 32 -12 -104 -103 -52 162 247 136 56 206 109 -247 -151 22
3402 22 -169 -53 4 -250 -40 -334 154 -184 185 338 -26 -69 1 339 316 -30 106 213 54 206 -111 -94
$$ packed form
3237a8R6J82l54K07l00L7K5J48p3j12m05J40N57k89j79L94j05L6%J21j18Q6J51
3260B27k88K55j23j97Q4RN9j96K69k96J52q6M5Nj86O7O4M7K23j65QO0O4J32j90
3285D3P9J72k92m5K17m16K22J12j54n3nR4P9r4L9K92k31L36m26R3O7o3k67J0O1
3310a30l0k7K13k57K02k16j56L45m12L24L26k07K21j19k36L64l13L37k53k17M18
3331A77J81o96L95l4M4J2k0J7j55j20J00L4J00j8L36m01K98k79l2J41j01k62J75
3354a08M0j49r7K70j35K55m26L82j77K4J80J35l36K88k51L6N3mJ43n4j76J46N5
3377I4l51M5L51n40L04K15k28K14q5L7j07Q3m4r2JN1K14Q5j11q0J50r7l56R6J73
3402B2j91J16N7k54K10k94M88l38L69J53l64m3P0L38k3l46J36J07j59J52l17J7
$$ plain form
3424 -94 -16 -58 -17 -34 -283 -135 3 -12 88 97 -38 281 192 132 -58 73 -66 70 234 -94 88 -98 -29 -119
3448 -119 -529 -71 55 -246 -111 2 -75 45 -59 117 84 89 165 105 -68 103 -29 16 -40 -108 -76 -91 -270 -79
3472 -79 418 -39 -122 10 -102 -131 -16 71 75 298 192 329 188 200 70 -21 -467 -110 -70 -105 42 106 -322 -102
3496 -102 -50 -34 -182 -289 197 200 100 492 57 54 164 293 -66 119 -75 28 -141 -107 -66 -234 -263 -140 233
3519 233 -351 -73 160 -124 176 312 101 188 9 314 244 268 125 -102 -266 -22 -214 161 -75 -18 112
3540 112 -313 -251 -103 211 -174 -146 -39 -185 -96 239 142 137 -48 149 -2 -314 -178 -102 -136 -16 42 -149 -102
3563 -102 -362 95 253 -71 -153 179 -52 207 125 306 -11 286 319 -135 -235 -172 76 -49 -278 126 -129
3584 -129 -45 -12 -117 -85 -305 -59 190 -208 -161 540 341 -164 213 355 -68 -39 146 132 49 21 194 33 -394
$$ packed form
3424i4P8m2M1j7k49J48J38j5J00Rj35L19q9o0j90J31j39J36J64l28J82j86O9r0
3448a19m10M58J26l01J35J13p7J20j04J76l3NP6o0j73J71j32M5n6o8L2j5j79J91
3472g9M97m57q3J32j12k9J15Q7MK23j06J37j41J2j30r1m46L57M0l5J47O4m28K20
3496a02N2J6j48j07M86Lj00L92m35lJ10J29l59J85j94J03j69L4M1j68k9J23L73
3519B33n84K78K33k84L00J36k11Q7j79L05p0K4j43k27j64K44j92L75k36N7J30
3540A12m25O2J48L14l85K8J07j46Q9L35r7nj85J97j51l12J36P6l4J20N8j91M7
3563a02k60M57J58l24q2L32k31K59q2J81l17K97L3m54j00O3K48j25k29M04k55
3584a29Q4L3j05L2k20K46K49l98M7P01j99n05L77J42m23K9J85j4q3k8J73j61m27
$$ plain form
3607 -394 -335 305 -454 -218 255 40 79 68 343 -83 -137 50 238 -4 82 302 -246 -368 367 -7 -216 -144
3629 -144 -158 -125 -398 124 377 -187 42 271 -128 131 211 -125 -15 126 304 371 -130 -351 194 -238 -251 -4
3651 -4 -97 30 -199 -57 164 -82 -142 360 40 168 287 327 100 181 318 366 -192 -19 -325 -279 -60 -256 -226
3674 -226 -403 97 314 -152 75 65 77 137 301 199 48 259 271 241 -441 132 -7 -185 31 -172 136 65
3696 65 45 -109 -111 -46 -206 -34 116 -61 123 259 342 236 112 -51 -104 -102 69 -253 97 -27 -243 -230 22
3719 22 -161 -195 -179 -312 103 16 106 318 191 -59 234 12 171 24 -231 -151 -57 302 -177 -36 -285 -226 107
3742 107 -23 14 -231 -37 159 -192 -93 186 -23 189 43 199 -46 105 -146 -235 208 -117 33 -302 12
3763 12 -31 -188 -168 160 -211 90 38 5 238 271 213 132 -54 -28 -29 -108 -12 -35 -209 -416 -8 74 67 0 -252 -44
$$ packed form
3607c94N9O40p59K36M73k15L9j1K75m26n4J87J88k42Q6K20n48j22P35l74k09P2
3629a44j4L3k73N22K53n64K29K29l99K59Q0l36J10J41J78O7n01k21N45m32j3K47
3651dr3J27k29J42K21k46o0N02l20J28J19M0k27Q1J37M8n58J73l06M6K19j96L0
3674b26j77N00K17m66K27j0J2O0J64j02j51K11J2l0o82N73j39j78K16k03L08p1
3696F5k0j54kO5j60J72J50j77J84J36Q3j06j24j63n3KJ71l22L50j24k16J3K52
3719B2j83l4J6j33M15q7R0K12j27k50K93k22J59j47k55Q0R4L59m79J41k49N9L33
3742A07j30L7k45J94J96l51R9K79k09K12j46J56k45J51k51q9M43l25J50l35L14
3763A2m3j57K0L28l71L01n2l3K33L3n8q1j86K6jp9R6k3j74k07M08Q2po7k52K08
$$ plain form
3789 -44 -101 -27 44 86 328 59 149 31 180 -237 -150 5 -38 -23 -190 19 -356 -279 184 -22 -70 -113 -124 -291
3813 -291 24 -41 -156 187 404 171 -23 43 -142 23 -2 -154 -51 131 37 14 -222 24 -78 122 295 10
3835 10 10 97 89 126 84 173 273 298 -153 201 -209 -8 -119 -184 -100 -61 -45 176 -188 -158 1 -54 -83 -35 -260 120
3861 120 135 200 72 -27 -14 168 20 56 -48 290 31 -76 -35 -47 235 -58 -98 -4 -213 -174 -136 -162 245 7
3885 7 -196 169 185 256 173 41 -85 -158 -178 -149 -104 -54 -202 224 -32 32 163 -204 139 104 16 8 74 117 120 -123
3911 -123 28 -197 56 -66 220 10 158 -61 -52 87 -550 -131 -102 -203 -412 271 177 322 37 151 49
3932 49 328 136 -48 143 -209 -35 -30 -162 -17 -7 -90 72 -35 42 -39 -10 329 222 14 315 151 -152 233
3955 233 98 -29 51 73 -80 159 -274 -201 175 71 83 67 -361 -14 189 58 -162 216 -32 34 46 126 -108
$$ packed form
3789d4n7P4P1M2K42k69R0j18J49m17Q7J55m3J5j67K09l75P7M63k06m8m3j1j67
3813b91L15o5j15L43K17k33j94O6j85J65k5j52J03J82r4k3k36K46j02K00J73k85
3835A0%Q7qL7m2Q9J00K5m51L54m10K01j11o5Q4L9J6K21l64L0J59n5k9M8k25L80
3861A20J5O5j28r9J3J82j48L6j04L38k59j07M1j2K82k93m0R4k09L9L8k6M07k38
3885Gk03L65J6P1q3j32j26p3k0K9M5N0j48M26k56O4J31l67L43l5q8qO6M3Lk43
3911a23J51k25K53j22K86k10J48k19RJ39o37M19K9j01k09O83r4J45k85J14j02
3932D9K79j92j84J91l52J74Nj32J45J0q3J62j07P7q1K9L39j07k08L01j64l03L85
3955B33j35j27Q0K2j53K39m33P3L76j04J2j6m28L47K03j31k20L78k48O6J2Q0k34
$$ plain form
3978 -108 153 -317 212 -28 157 188 -34 -196 -108 -129 -39 -92 38 -107 -67 279 -53 83 -106 87 -71 161
4000 161 367 297 159 10 -239 11 -2 -89 -178 -179 -194 208 -10 224 -127 -222 50 91 -29 205 -21 20 349
4023 349 170 107 12 -102 35 238 -226 -159 -223 -13 -4 -151 -381 57 191 -34 105 -45 468 40 -69 303
4045 303 189 240 47 146 -14 182 -126 96 133 -244 -7 -43 56 -221 -77 -166 67 32 64 117 66 232 26
4068 26 148 -18 -63 207 -49 127 -167 -148 92 -32 -134 -233 -78 197 144 -38 287 72 397 294 182 33
4090 33 280 -72 122 -209 -41 -108 -276 121 -17 -75 -48 215 -78 -56 42 21 202 47 56 192 -47 173 138
4113 138 -22 -28 16 -61 -129 105 -53 -189 -92 -476 191 11 38 -75 27 6 302 236 104 13 26 31 90 14 -105
4138 -105 -95 -14 168 -331 -68 -50 129 -108 32 -223 -28 45 -256 191 61 281 272 -101 93 292 48 -26
$$ packed form
3978a08K61m70N29k40J85L1k22j62Q8k1R0n3J30j45M0L46l32J36j89J93j58K32
4000A61K06p0j38j49k49K50j3q7q9jj5M02k18K34l51r5K72M1j20K34k26M1L29
4023C49j79o3r5j14J37K03m64O7o4K10Rj47k30M38J34k25J39j50N13m28j09L72
4045C03j14N1j93R9j60J96l08K22L7l77K37l6R9k77J44q9K33l5L2N3n1J66k06
4068B6J22j66m5K70k56J76k94J9K40j24j02r9J55K75n3j82L25k15L25j03j12j49
4090C3K47l52J94l31J68o7j68L97j38n8K7K63k93K2R8k1J81j55RJ36k39K20l5
4113A38j60oM4p7o8K34j58j36R7l84O67j80K7j13J02k1K96o6j32r1J3NN9p6j19
4138a05J0Q1J82m99K63J8J79k37J40k55J95P3l01M47j30K20rl73J94J99k44p4
$$ plain form
4160 -26 3 50 -36 82 -89 237 -71 52 -158 -261 -114 337 -333 159 98 12 37 63 -8 -166 24 69 -157
4183 -157 -106 -113 78 122 -374 -182 -207 -87 -297 80 -236 64 -12 29 323 373 302 35 -73 -11 184 72 106 56
4207 56 -97 115 307 63 -232 -215 -116 -25 116 56 73 -229 69 116 5 -73 177 -283 -39 241 170 -19 -32
4230 -32 -21 62 -340 -19 -185 -409 -176 120 -93 -74 330 -135 -76 102 108 94 132 15 116 -59 -12 -51 149 -220
4254 -220 -35 -245 29 -339 -56 286 -219 55 170 142 98 84 59 133 -34 -312 26 -61 -30 312 192 59
4276 59 -30 4 -184 -140 -211 -28 -44 -162 46 131 255 -136 -16 121 154 -25 26 281 -56 166 226 -2 -107
4299 -107 116 192 77 -259 -278 38 53 -130 -122 -119 39 235 -8 -69 213 196 -325 217 -104 -56 -286 157 68 -276
4323 -276 -173 -35 -8 -178 -183 108 -41 -46 276 165 9 -16 143 301 177 44 90 313 -228 -146 122 -122 53
$$ packed form
4160b6K9M7q6J18j71L26l08J23k10j03J47M51o70M92o1q6K5K6p1j58J90M5k26
4183a57N1pJ91M4m96J92k5J20k10L77l16L00p6M1K94N0p1k67j08O2J95j12L4n0
4207E6j53K12J92k44k95J7R9R1J41o0J7l02K98M7j11p8K50m60K44K80p1j89j3
4230c2J1Q3m02L21j66k24K33K96k13J9M04m65N9J78Oj4L8j17J01j75M7l9K00l69
4254b20J85k10K74l68K83L42n05K74J15k8m4j4k5P4j67k78L38q7L1L42j20j33
4276E9q9L4j88M4p1J83j6j18K08Q5J24l91J20J37L3j79N1K55l37K22O0k28j05
4299a07K23P6j15l36j9L16J5j83QLJ58J96k43o1K82j7n21N42l21M8k30M43q9l44
4323b76J03J38K7j70nK91j49nL22j11j56k5J59J58j24j33M6K23n41Q2K68k44J75
$$ plain form
4346 53 24 -70 -198 178 120 -74 84 -84 85 50 338 68 219 154 97 113 15 19 -142 -239 11 -111 -102 153 -185
4371 -185 -43 250 88 237 -259 64 290 106 -162 49 -1 114 -55 -160 132 -122 51 65 49 114 -181
4392 -181 -154 88 26 37 -203 25 207 -78 142 -89 65 -148 -92 43 82 -90 -57 -103 52 -31 -23 14 175 -126
4416 -126 -37 184 -114 32 221 80 181 -15 25 104 -206 294 193 -36 77 -86 -260 52 -2 -55 -57 -186
4438 -186 106 -81 -251 14 152 59 36 -4 324 -36 -56 -275 124 87 -115 -43 230 6 214 40 -15 -145
4460 -145 -32 -158 40 22 -169 291 23 -58 347 105 232 -252 90 56 -57 25 220 -115 -202 -24 -109 -185
4482 -185 -119 -229 -175 -375 16 153 92 371 42 190 154 -69 210 -3 185 -46 -225 -17 190 -6 -86 -281
4504 -281 -158 20 -60 -82 128 257 -40 148 -293 14 -192 -150 211 214 250 34 85 -233 -176 -29 -94 151 -72
$$ packed form
4346E3k9r4j28L76n8j94J58j68J69l5K88k70J51o5n7J6r8Mj61r7K50j22RK55l38
4371a85J42K93j62J49m96L23K26j84k68K11n0J15j69j05K92k54J73J4j6O5k95
4392a81K7K42o2J1k40K28J82k85K20k31J54k13N6J35L9j72L3m6J55q3QL7J61l01
4416a26Q9K21k98J46J89j41J01j96M0P9l10N00j01k29J13j63j74L12n4n3kj29
4438a86K92j87j70K65J38r3k3m0L28l60k0k19L99l7k02P2K73k24K08j74n5j30
4460a45J13j26J98j8j91M60k68q1M05k42J27m84L42l4j13Q2J95l35q7J78q5p6
4482a85O6j10N4k00L91J37o1K79l29J48l6k23K79k13J88k31j79K08K07j96q0j95
4504b81J23J78q0k2K10J29k97J88m41L07k06M2L61LL6k16N1l18N7J47o5K45k23
$$ plain form
4527 -72 24 -44 -35 47 -12 46 -27 180 218 231 216 81 -91 174 -130 309 -124 5 -53 -214 -22 -97 57 2 -56
4552 -56 122 -76 -6 -163 105 -43 280 -38 -21 198 -22 -105 -189 -27 17 -87 -159 133 -24 -83 -351 -432 -81
4575 -81 39 113 -74 176 226 32 42 381 347 -171 -80 57 -268 -87 112 -175 -88 -190 -47 -46 -139 96 86 -35
4599 -35 223 56 197 49 154 49 -75 101 92 48 -99 -120 -36 -104 -199 -162 -139 -148 -320 138 82 172 275 264 254
4624 254 35 -98 -78 -20 25 151 218 120 -183 -1 45 -249 91 -38 -26 -122 -73 -99 96 -27 -163 132 151 329
4648 329 95 30 187 -29 160 182 -146 -224 -140 -66 102 -111 186 -4 83 -205 -82 -59 -135 -18 -148 297 73
4671 73 246 62 -97 -94 86 -90 -123 -33 -297 -30 61 -48 -53 -215 207 220 -155 77 179 125 47 -33 404 151
4695 151 -5 -208 49 -69 14 93 -136 -100 -86 -182 -9 -99 -187 -167 -58 45 -39 4 34 48 383 -14 73 115 -237
$$ packed form
4527g2R6o8RQ2n9N8p3K07L8J3j5j35j72K65l04M39m33J29n8j61J92p5J54n5n8
4552e6J78j98P0j57K68j48L23l18J7K19k20q3q4J62M4j04p2K92j57n9k68q1L51
4575h1J20P4j87K50N0j94J0L39l4n18R1J37l25J81J99k87Q7j02J43Jr3K35j0j21
4599c5K58j67J41j48J05j05j24J76rm4j47k1Q4o8r5L7K3rj72M58n6R0J03j1j0
4624B54k19j33K0N8M5J26O7r8l03J82M6k94L40j29J2r6M9k6J95j23j36K95J9J78
4648C29k34o5J57k16J89K2l28p8Q4P4J68k13K97j90Q7k88J23K3p6J17j30M45k24
4671G3J73j84j59LJ80j76l3R0k64K67R1j09nj62M22J3l75K32J02n4p8q0M37k53
4695A51j56k03K57j18Q3P9k29L6J4r6J73r0q8K0J09J03q4M3L0J4L35l97Q7M2l52
$$ plain form
4720 -237 20 184 258 -164 111 -8 -48 -102 -14 26 -74 227 -262 35 -40 283 147 93 19 -47 1 146 -6
4743 -6 170 4 -264 -142 -65 -160 -35 235 -14 -99 16 111 186 -249 52 314 110 73 223 112 172 -127 -132 -87
4767 -87 -252 -75 -130 -222 -129 -195 -14 -219 -130 134 33 -104 101 4 138 155 466 174 -97 129 153 -222 -74
4790 -74 -21 -118 -56 -120 -68 -292 -189 -15 -11 -77 259 140 -119 134 -9 125 303 -275 -153 -137 25 -53 -72 -32
4814 -32 -69 89 136 -81 24 -49 201 -89 -72 -201 36 140 -75 -76 -144 198 107 -49 -12 -185 75 38 122 190
4838 190 -212 -159 111 24 -149 161 -40 -2 -20 27 -119 -169 128 106 64 -29 107 8 -181 -154 32 -13 -308 -351
4862 -351 -268 101 17 10 -12 86 183 22 65 147 -154 64 -26 -8 -92 -46 73 219 193 -107 114 -100 -76 199 18
4887 18 -116 93 201 131 -118 111 215 -55 238 52 -42 9 90 -209 135 -113 -267 69 26 -122 -98 51
$$ packed form
4720b37K57J64P4m22K75j19m0n4Q8M0j00L01m89K97p5L23j36n4p4o6M8J45j52
4743fJ76j66k68J22P7r5J25K70k49q5J15R5P5m35L01K62k04l7J50j11O0k99nM5
4767h7j65J77n5r2R3o6J81k05Q9K64j01j37K05r7J34J7L11k92k71K26K4l75J48
4790g4N3r7O2o4N2k24J03J74Mo6L36j19k59K53j43J34J78n78J22J6J62p8j9M0
4814c2l7J58M7k17J05p3K50k90J7j29K37J04k15jo8L42r1j56L7j73K60l7Q4O8
4838A90m02N3K70q7j73L10k01L8j8M7j46n0K97k2m2r3J36r9j89K7J86m5k95m3
4862c51Q3L69q4pk2R8R7j61M3Q2l01K18r0J8q4M6J19J46k6l00K21k14K4K75j81
4887A8j34K09J08p0k49K29J04k70K93j86r4N1Q1k99L44k48j54L36m3j48K4J49
$$ plain form
4909 51 -98 146 -327 14 133 17 183 294 231 96 105 25 15 -103 135 -187 62 -120 -202 -303 -53 -193
4931 -193 -280 -4 -149 7 38 209 -159 19 68 -18 -52 -328 -26 287 -5 -22 294 95 -80 -100 -120 2 -44
4954 -44 -15 -10 -217 180 172 218 9 138 250 -38 13 -145 -221 -73 56 47 -81 49 -39 126 -28 19 153 -69
4978 -69 102 11 210 -53 113 286 5 -45 113 118 108 259 -200 52 -28 -17 -36 -56 -304 -144 -59 54 65 211
5002 211 -84 -138 188 233 -108 -16 -22 141 130 356 131 112 -38 -29 -69 -272 123 -416 163 10 34 96 152 224 248
5027 248 -21 51 168 57 -212 140 -109 46 58 -158 26 -35 -190 39 -95 -74 -173 162 186 -75 -69 223 118
5050 118 -77 -46 165 39 159 106 23 173 -196 -70 -213 -415 113 -157 -241 135 -89 -135 92 78 116 11
5072 11 204 123 149 -94 -28 56 254 354 -39 -157 95 326 66 -214 -278 238 280 22 -92 361 -163 171
$$ packed form
4909E1j49K44m73L41J19j16J66J11o3j35Rq0j0j18K38l22K49j82q2j01K50j40
4931a93q7K76j45J56L1J71l68J78M9q6l4k76L02L13k92j7L16j99j75k0k0J22m6
4954d4K9Nk07L97qM6k09J29J12k88N1j58p6J48J29rj28J30q8J65j54M7J34k22
4978f9J71r1J99k63J66J73k81n0J58Nj0J51m59K52q0J1j9k0k48J60Q5J13J1J46
5002B11k95n4L26M5l41R2oJ63j1K26k25j9j50Rm0k03L95n39N79j53K4O2N6P2K4
5027B48k69P2J17j11k69L52k49J55J2k16J84o1j55K29j34K1r9L35K4k61OK92j05
5050A18j95L1K11j26J20n3q3J50l69J26j43k02N28k70q4L76k24m6K27j4L8j05
5072A1J93q1K6k43O6Q4J98J00l93j18K52K31k60k80o4N16M2k58j14M53n24L34
$$ plain form
5094 171 279 106 170 163 -74 -169 -107 55 129 -139 71 145 71 -186 325 -176 -112 -304 210 404 -163 -25 151
5117 151 17 3 161 44 88 -82 235 -128 -80 -184 -110 2 -395 -187 -19 -279 -182 64 125 -8 333 162
5139 162 -80 -221 28 98 53 12 187 -195 233 59 136 -274 -206 -125 -148 -140 -205 162 78 30 209 -254 41 -34
5163 -34 108 -5 -129 123 -14 -310 -46 55 -150 25 -251 116 36 28 -174 -234 54 -6 124 19 210 56
5185 56 139 231 199 171 -79 -241 -14 -126 -194 -212 -75 186 -95 -144 8 -151 -8 -184 -34 94 255 101 -45
5208 -45 272 -46 67 -181 133 272 -167 12 28 -100 -213 -157 -45 -94 370 240 7 -25 -55 -49 33 10 87 153
5232 153 -99 51 -63 120 -137 -31 213 -133 -75 42 -87 15 -160 -13 53 -39 87 207 -44 -151 -146 -184
5254 -184 262 80 -181 -148 6 -50 -305 -327 -30 -67 198 -270 -36 -53 143 -89 130 -5 -170 48 142 64
$$ packed form
5094A71J08j73O4pk37r5O2J62P4k68K10P4p4k57N11n01O4j92N14J94n67J38J76
5117A51j34j4J58j17M4j70L17l63M8j04P4J12l97K08J68k60R7K46O1j33L41j71
5139A62k42j41K49P0m5m1J75l82M28j74P7m10O8Q1k3Qo5L67q4m8J79m63K95p5
5163c4J42j13j24K52j37k96K64J01k05J75k76L67q0qk02o0K88o0J30j05J91j54
5185E6Q3R2l2k8k50j62K27j12o8j8J37K61k81m9J52j59J43j76J50J28J61j54j46
5208d5L17l18J13k48L14J39m39J79J6j28j13N6J12m9M64j30k33l2l0OQ2k3P7O6
5232A53k52J50j14J83k57J06K44l46N8J17j29J02j75J47O6r2J26J20k51j07Nl8
5254a84M46j82k61L3J54n6k55k2K97l7K65m68K34j7J96k32K19j35j65K18R4p8
$$ plain form
5276 64 5 -282 10 140 -41 33 -31 197 -57 -19 -163 -182 -88 229 58 64 -225 -66 113 20 34 179 247 229
5300 229 -134 62 13 72 -232 -28 -71 -69 86 -408 -214 273 -129 -220 -133 -81 298 -93 -202 -3 90 -45 70
5323 70 55 59 -158 -267 -107 204 -15 226 98 21 -157 131 114 39 79 29 280 334 47 106 36 302 160 -129
5347 -129 -111 96 -129 194 42 -313 -37 -171 -277 -150 160 -216 -170 98 -101 16 -137 224 259 -69 96
5368 96 -99 -89 -3 -57 -157 -103 -106 -117 -80 -158 -28 20 193 101 159 -5 178 100 14 -20 -18 39 149 203 242 -234 -166
5395 -166 -83 42 -82 37 138 135 149 47 -284 240 106 190 234 235 -267 292 241 105 164 191 -13 130 -111 -140
5419 -140 96 -19 -75 -340 0 60 69 53 -4 80 138 -165 47 198 256 11 98 177 -91 18 -34 241 -73 -292
5443 -292 40 -117 -72 -35 139 206 141 134 288 46 232 35 104 180 78 403 -116 159 114 -127 -121 -127 -152 14 -120
$$ packed form
5276F4n9k87K92J30j81P4o4K28k54L8j44j9R4L17j71Ok89J59J79r3J4J45O8j8
5300B29l63J96m9N9l04K04m3KJ55m94J94M87m02r1Q7N2L79l91j09J99R3j35J15
5323G0j5Mk17j09J60L11k19K41j28p7j78K88j7p5M0n0K51N4k87N9p0K66j42k89
5347a29J8K07k25L23j52l55K76j34j06J27L10l76M6K68j99J17j53L61L5l28J65
5368I6j95J0Q6n4j00N4lj1L7p8J30M8J73r2N8j64J83p8q6l4KN7J10N4L9m76O8
5395a66Q3J25j24J19J01lJ4j02l31N24j34Q4M4Jn02N59n1j36N9K7k04J43k41k9
5419a40K36j15n6k65L40O0Rj6n7Q4N8l03K12J51N8k45Q7P9k68J09n2K75l14k19
5443b92L32j57M5L7J74O7o5pJ54k42J86j97O9P6j02L25n19K75m5k41Ook5J66j34
$$ plain form
5468 -120 36 -109 135 300 49 57 45 149 72 123 154 -42 -13 181 49 -412 -95 -219 -246 -170 80 97 -198
5491 -198 -3 28 -116 175 82 -72 216 -144 184 84 -136 -83 213 33 -229 52 101 61 -94 -104 -178 -170 -99
5514 -99 59 67 63 -144 -68 -45 -133 233 14 43 152 -35 33 -124 10 -240 -182 -65 -78 147 223 -264 230 64
5538 64 -189 417 -82 -298 66 145 197 315 -50 180 118 66 -108 -99 -75 289 -106 -113 32 -130 35 -206 -44
5561 -44 52 2 -17 82 325 238 221 178 -61 133 -214 -94 58 22 -264 -178 -260 -244 -97 -49 174 110 -118 -92 319
5586 319 79 -2 77 -27 124 157 171 24 -204 -124 -34 -169 -16 70 -93 18 -79 -106 163 -19 -384 45 118
5609 118 293 2 416 193 104 320 -148 -204 -23 -152 -284 -127 -124 -88 33 136 -279 -39 -60 -31 -106 -187 137
5632 137 -71 -191 -120 264 -16 -89 71 -119 -213 -312 171 -123 -307 -70 122 213 -396 11 -6 -141 144 104
$$ packed form
5468a20J56j45K44J65k51Qj2J04p7N1L1j96K9J94j32m61L17j24k7P6K50J7k95
5491a98J95L1j44K91r3j54K88l60L28j00k20N3K96j80k62K81M9m0j55j0p4QP1
5514i9J58Qmk07P6K3q8L66k19K9J09j87O8j57J34k50N8J17j3K25P6m87M94j66
5538F4k53O06m99k16L64P9N2J18l65K30o2n2j74RK4L64l95pJ45j62J65k41J62
5561d4R6n0j9R9K43q7j7m3k39J94l47J20J52l6k86Q6q2J6J47M8K23o4k28K6M11
5586C19k40q1P9j04J51L3J4j47k28Q0R0j35J53Q6j63J11r7k7K69j82l65M29P3
5609A18J75k91M14k23q9K16m68n6J81j29j32J57LL6J21J03m15K40k1K9p5q1L24
5632A37k08j20P1L84k80p3J60j90r4r9M83k94j84K37J92R1o09M07j7j35K85m0
$$ plain form
5654 104 352 -118 29 22 79 -106 -345 76 -36 81 -212 92 28 -190 -114 -355 158 186 146 17 78 -105 -73
5677 -73 -36 361 116 -93 103 -197 -194 45 -133 -245 -30 13 94 -204 -435 -184 -96 -161 49 -61 125 -75 189
5700 189 -64 282 -46 -155 6 -45 -39 335 60 7 -23 -398 -203 -214 68 -186 -395 -137 190 -69 271 -63
5722 -63 -36 -187 79 252 -166 48 166 5 57 27 -117 -85 -105 -151 -80 -21 -163 188 73 64 233 256 -216 40
5746 40 194 -1 -147 72 240 219 92 -106 -50 -1 -235 -249 -148 -184 -117 -100 72 212 -69 143 -298 27 -25
5769 -25 9 -123 209 178 118 -115 -216 -137 -113 -167 136 -121 -82 162 -143 14 -118 31 -5 234 100 120 -196
5792 -196 -94 165 165 -286 -201 -171 -63 -171 -276 -125 -270 223 -34 9 217 92 402 -148 336 150 -10 170
5814 170 48 96 -72 94 131 207 191 -32 -207 -91 -96 -105 -138 -96 66 -73 34 53 54 354 186 -137 -32 -139
$$ packed form
5654A04K48m70J47pN7j85k39M21j12J17k93L04o4k18P6k41N13K8m0j29O1j83L2
5677g3L7L97k45k09J96l00LK39j78j12K15M3Q1k98k31K51Q8o5K10j10J86k00K64
5700A89k53L46l28j09J61n1OL74k75n3l0l75J95j1K82k54k09K58L27k59L40l34
5722f3K7j51K66J73m18K14J18j61N2l0j44L2k0m6P1N9j42L51j15rJ69K3m72K56
5746D0J54j95j46K19J68k1j27j98N6M9k34j4J01l6O7J7J72J40k81K12m41L25n2
5769b5L4j32L32l1o0k33j01P9K4n4L03k57L9K44l05J57j32J49l6K39j34K0l16
5792a96J02K59%m51Q5L0J08j08j05J51j45M93k57M3K08j25L10n50M84j86j60J80
5814A70j22M8j68J66L7P6j6k23j75J16nrl3M2J62j39J07J9JL00j68l23J05j07
$$ [...]
8191A53
##END NTUPLES=NMR FID
##END=
