##TITLE=1H_Pr NCS-30
 CDCl3
 8 sc, 
 31.05.2022
##JCAMPDX= 6.0         $$ Bruker NMR JCAMP-DX V2.0
##DATA TYPE= NMR FID
##DATA CLASS= NTUPLES
##ORIGIN= UXNMR, Bruker Analytische Messtechnik GmbH
##OWNER= root
$$ XWIN-NMR		Version 3.5
$$ Tue May 31 14:06:31 2022 Russian Standard Time (UT+4h)  she@DPX200
##.OBSERVE FREQUENCY= 200.1313499996
##.OBSERVE NUCLEUS= ^1H
##.DELAY= (6, 6)
##.ACQUISITION MODE= SIMULTANEOUS
##.ACQUISITION SCHEME= undefined
##.AVERAGES= 8
##.DIGITISER RES= 18
##SPECTROMETER/DATA SYSTEM= spect
##.PULSE SEQUENCE= zg30
##.SOLVENT NAME= CDCl3
##.SHIFT REFERENCE= (INTERNAL, CDCl3, 0, 15.7039)
##AUDIT TRAIL= $$ (NUMBER, WHEN, WHO, WHERE, WHAT)
$$ ##TITLE= Audit trail, XWIN-NMR		Version 3.5
$$ ##JCAMPDX= 5.01
$$ ##ORIGIN= Bruker BioSpin GmbH
$$ ##OWNER= she
$$ F:/spectra/data/she/nmr/H-F/1/audita.txt
$$ ##AUDIT TRAIL=  $$ (NUMBER, WHEN, WHO, WHERE, WHAT)
(   1,<2022-05-31 14:05:22.76 +0400>,<she>,<DPX200>,
      <created by zg, POWCHK disabled, PULCHK disabled
       configuration hash MD5:
       00 E9 B6 7A A2 85 ED C7 34 08 36 98 17 FE 4E 26
       data hash MD5: 16K
       7D 30 90 9B D7 BF DA F3 99 D8 28 62 4D 90 AC AC>)
$$ ##END=
$$ 
$$ hash MD5
$$ FF D0 16 92 C5 11 26 45 ED 9A 8A 2A B6 20 A7 FF
##$RELAX= 
##$RELAX= 
##$RELAX= 
##$RELAX= 
##$RELAX= 
##$RELAX= 
$$ Bruker specific parameters
$$ --------------------------
##$DU= <F:/spectra>
##$EXPNO= 1
##$NAME= <H-F>
##$PROCNO= 1
##$TYPE= <nmr>
##$USER= <she>
##$AMP= (0..31)
100 100 100 100 100 100 100 100 100 100 100 100 100 100 100 100 100 100 
100 100 100 100 100 100 100 100 100 100 100 100 100 100 
##$AQSEQ= 0
##$AQ_mod= 1
##$AUNM= <au_zg>
##$AUTOPOS= <>
##$BF1= 200.13
##$BF2= 200.13
##$BF3= 200.13
##$BF4= 200.13
##$BF5= 200.13
##$BF6= 200.13
##$BF7= 200.13
##$BF8= 200.13
##$BYTORDA= 1
##$CFDGTYP= 0
##$CFRGTYP= 5
##$CHEMSTR= <none>
##$CNST= (0..31)
1 1 145 1 1 1 1 1 1 1 1 1 1 1 1 1 1 1 1 1 1 1 1 1 1 1 1 1 1 1 1 1 
##$CPDPRG= <>
##$CPDPRG1= <>
##$CPDPRG2= <>
##$CPDPRG3= <>
##$CPDPRG4= <mlev>
##$CPDPRG5= <mlev>
##$CPDPRG6= <mlev>
##$CPDPRG7= <mlev>
##$CPDPRG8= <mlev>
##$CPDPRGB= <>
##$CPDPRGT= <>
##$D= (0..31)
0 1.2 0 0 0 0 0 0 0 0.06 0 0.03 0 0 0 0 0.0002 0 0 0 0 0 0 0 0 0 0 0 0 
0 0 0 
##$DATE= 1653991522
##$DBL= (0..7)
120 120 120 120 120 120 120 120 
##$DBP= (0..7)
150 150 150 150 150 150 150 150 
##$DBP07= 0
##$DBPNAM0= <>
##$DBPNAM1= <>
##$DBPNAM2= <>
##$DBPNAM3= <>
##$DBPNAM4= <>
##$DBPNAM5= <>
##$DBPNAM6= <>
##$DBPNAM7= <>
##$DBPOAL= (0..7)
0.5 0.5 0.5 0.5 0.5 0.5 0.5 0.5 
##$DBPOFFS= (0..7)
0 0 0 0 0 0 0 0 
##$DE= 6
##$DECBNUC= <off>
##$DECIM= 32
##$DECNUC= <off>
##$DECSTAT= 4
##$DIGMOD= 1
##$DIGTYP= 9
##$DL= (0..7)
0 120 120 120 120 120 120 120 
##$DP= (0..7)
150 150 150 150 150 150 150 150 
##$DP07= 0
##$DPNAME0= <>
##$DPNAME1= <>
##$DPNAME2= <>
##$DPNAME3= <>
##$DPNAME4= <>
##$DPNAME5= <>
##$DPNAME6= <>
##$DPNAME7= <>
##$DPOAL= (0..7)
0.5 0.5 0.5 0.5 0.5 0.5 0.5 0.5 
##$DPOFFS= (0..7)
0 0 0 0 0 0 0 0 
##$DQDMODE= 0
##$DR= 18
##$DS= 0
##$DSLIST= <SSSSSSSSSSSSSSS>
$$ [...]
##$SUBNAM2= <"">
##$SUBNAM3= <"">
##$SUBNAM4= <"">
##$SUBNAM5= <"">
##$SUBNAM6= <"">
##$SUBNAM7= <"">
##$SUBNAM8= <"">
##$SUBNAM9= <"">
##$SW= 18.0517283424761
##$SWIBOX= (0..15)
0 0 2 0 0 0 0 0 0 0 0 0 0 0 0 0 
##$SW_h= 3612.71676300578
##$TD= 16384
##$TD0= 1
##$TE= 0
##$TE2= 300
##$TE3= 300
##$TEG= 300
##$TL= (0..7)
0 120 120 120 120 120 120 120 
##$TP= (0..7)
150 150 150 150 150 150 150 150 
##$TP07= 0
##$TPNAME0= <>
##$TPNAME1= <>
##$TPNAME2= <>
##$TPNAME3= <>
##$TPNAME4= <>
##$TPNAME5= <>
##$TPNAME6= <>
##$TPNAME7= <>
##$TPOAL= (0..7)
0.5 0.5 0.5 0.5 0.5 0.5 0.5 0.5 
##$TPOFFS= (0..7)
0 0 0 0 0 0 0 0 
##$TUNHIN= 0
##$TUNHOUT= 0
##$TUNXOUT= 0
##$USERA1= <user>
##$USERA2= <user>
##$USERA3= <user>
##$USERA4= <user>
##$USERA5= <user>
##$V9= 5
##$VALIST= <valist>
##$VCLIST= <CCCCCCCCCCCCCCC>
##$VD= 0
##$VDLIST= <DDDDDDDDDDDDDDD>
##$VPLIST= <PPPPPPPPPPPPPPP>
##$VTLIST= <TTTTTTTTTTTTTTT>
##$WBST= 1024
##$WBSW= 4
##$XGAIN= (0..3)
0 0 0 0 
##$XL= 0
##$YL= 0
##$YMAX_a= 61061
##$YMIN_a= -96511
##$ZGOPTNS= <>
##$ZL1= 120
##$ZL2= 120
##$ZL3= 120
##$ZL4= 120
##$ABSF1= 10
##$ABSF2= 0
##$ABSG= 5
##$ABSL= 3
##$ALPHA= 0
##$AQORDER= 0
##$ASSFAC= 0
##$ASSFACI= 0
##$ASSFACX= 0
##$ASSWID= 0
##$AUNMP= <proc_1d>
##$AZFE= 0.1
##$AZFW= 0.1
##$BCFW= 1
##$BC_mod= 2
##$BYTORDP= 1
##$COROFFS= 0
##$CY= 11.3945322036743
##$DATMOD= 1
##$DC= 2
##$DFILT= <>
##$DTYPP= 0
##$F1P= 2.36226072786647
##$F2P= -0.459571619588291
##$FCOR= 0.5
##$FTSIZE= 0
##$FT_mod= 4
##$GAMMA= 1
##$GB= 0.15
##$INTBC= 1
##$INTSCL= 1
##$ISEN= 128
##$LB= 0.24
##$LEV0= 0
##$LPBIN= 0
##$MAXI= 10000
##$MC2= 0
##$MEAN= 0
##$ME_mod= 0
##$MI= 1.114404
##$NCOEF= 0
##$NC_proc= 0
##$NLEV= 6
##$NOISF1= 3.799351
##$NOISF2= 2.8
##$NSP= 1
##$NTH_PI= 0
##$NZP= 0
##$OFFSET= 15.70392
##$PC= 1
##$PHC0= -18031.43
##$PHC1= 8.600739
##$PH_mod= 1
##$PKNL= yes
##$PPARMOD= 0
##$PSCAL= 0
##$PSIGN= 0
##$REVERSE= no
##$SF= 200.130013532006
##$SI= 16384
##$SIGF1= 3
##$SIGF2= 2
##$SINO= 400
##$SIOLD= 16384
##$SREGLST= <1H.CDCl3>
##$SSB= 0
##$STSI= 0
##$STSR= 0
##$SW_p= 3612.71676300578
##$SYMM= 0
##$S_DEV= 0
##$TDeff= 0
##$TDoff= 0
##$TI= <>
##$TILT= no
##$TM1= 0
##$TM2= 0
##$TOPLEV= 0
##$USERP1= <user>
##$USERP2= <user>
##$USERP3= <user>
##$USERP4= <user>
##$USERP5= <user>
##$WDW= 1
##$XDIM= 8192
##$YMAX_p= 0
##$YMIN_p= 0
$$ End of Bruker specific parameters
$$ ---------------------------------
##NTUPLES= NMR FID
##VAR_NAME=  TIME,          FID/REAL,        FID/IMAG
##SYMBOL=    X,             R,               I
##VAR_TYPE=  INDEPENDENT,   DEPENDENT,       DEPENDENT
##VAR_FORM=  AFFN,          ASDF,            ASDF
##VAR_DIM=   8192,          8192,            8192
##UNITS=     SECONDS,       ARBITRARY UNITS, ARBITRARY UNITS
##FACTOR=    0.0002768,     1,               1
##FIRST=     0,             0,               0
##LAST=      2.2672688,     0,               0
##MIN=       0,             -96511,          0
##MAX=       2.2672688,     61061,           0
$$ Real data points
##PAGE= N=1
##DATA TABLE= (X++(R..R)), XYDATA
0 0 0 0 0 0 0 0 0 0 0 0 0 0 0 0 0 8 -8 8 -8 8 -16 16 -16 24 -24 30 -32 40 -43 49 -56 64 -74 86 -96 108 -122
37 -122 137 -154 170 -189 210 -234 258 -287 317 -350 384 -423 469 -516 568 -626 690 -764 845
56 845 -937 1044 -1166 1311 -1483 1695 -1959 2304 -2770 3440 -4495 6404 -10986 50869 -3243
71 -3243 -80038 8544 45241 17421 -15921 -2419 -6786 -4200 15604 17965 -18487 -24786 704
84 704 19971 6462 -16513 -13611 2334 -5376 -3233 4995 -1282 -14612 -5196 12566 3562 -11900
98 -11900 5410 12552 -9585 -410 23626 4120 -20029 2579 29400 1645 -23519 5607 22938
111 22938 -6572 -20769 2661 17806 381 -18806 -5274 8126 -3078 -5572 802 -5419 -11429
124 -11429 2931 13628 -6796 -20552 3974 18622 -1827 -8839 5331 9331 194 -751 7503
137 7503 2864 -1076 7691 3904 -8921 -1054 14057 3665 -17189 -10516 15476 11237 -15680 -15722
151 -15722 3635 6277 -4071 -3658 -1043 -9120 -6565 11783 8369 -12374 -9990 8600 11021 130
165 130 -2485 2829 317 -357 9476 10423 -4527 -10317 3467 13497 2947 -8367 -4548 119 838
180 838 5338 455 -13360 -10794 8328 10598 -9522 -15664 1823 9161 -2926 -5702 467 1728
194 1728 -285 2288 4926 334 -2421 5070 7877 -412 -2761 5167 6757 -2312 -4540 4942 4918 -5545
210 -5545 -3558 2888 -766 -4760 -1360 -233 -3711 -3490 1058 -1909 -6217 -182 3722 -1953 -4626
225 -4626 380 6127 1887 -4298 818 6778 2702 -455 2334 3661 710 124 4343 2037 -4038
240 -4038 363 3969 -1980 -3948 -26 648 -3898 -4564 1252 224 -5737 -3661 -183 432 -837 -2278
256 -2278 -644 487 -182 3226 2355 -2467 -227 5233 5473 -938 -2186 4954 4913 -1239 573 1562 -781
273 -781 54 514 -211 -2883 -3041 499 -1257 -3997 -1642 -1104 -1707 -2482 -2049 1028 -574 -3427 782
290 782 2985 384 -266 830 3025 1549 927 3393 832 -657 3854 3076 -557 -896 649 2144
306 2144 -529 -2289 -259 -1088 -1775 -944 -1959 -1502 -2160 -2603 323 -1584 -3163 70 472 -913 -392
323 -392 1256 1584 -283 754 4328 1288 -58 1927 2134 1686 1326 581 1332 280 160 971 -1247
340 -1247 -1631 -1043 -967 -930 -2802 -2931 0 -1400 -2605 -1325 -823 -1034 -462 11 536 -1034 626 2231
358 2231 779 1199 2448 1128 1220 1344 1789 2098 403 29 774 796 680 -1010 -1522 -457 -1191 -995 -752
377 -752 -2727 -2538 -536 -384 -1725 -1819 -929 44 -294 651 432 -439 982 1799 1539 1553 1318 1011 1991 1443
397 1443 1453 941 528 454 86 437 119 -1727 -1171 -239 -1719 -1912 -679 -1144 -2431 -2158 -766 -354 -621
416 -621 -815 -1451 -377 1512 1410 117 -15 1039 1889 2797 2294 -51 -175 2170 2867 1341 -942 -1188
434 -1188 377 1478 339 -2286 -2320 -471 -550 -1283 -1280 -1667 -1983 -1642 -438 -36 -1194 -1098 -125 453 984
453 984 769 538 1660 1091 519 1652 2748 1520 -395 -58 1967 2484 469 -847 -1267 -116 843
470 843 -374 -1292 -2067 -2975 -806 1356 -431 -3616 -3486 290 2649 -76 -2325 -1963 1096 3513 1157
487 1157 -700 556 1190 2072 2667 1673 82 -592 1290 3013 902 -916 -1183 -384 581 -782 -2218
504 -2218 -574 -424 -2181 -2186 -620 504 -1599 -2962 -523 576 658 -54 -1006 -10 1005 1030 2163 2007
522 2007 -21 -324 1556 3896 2153 -1901 -1007 1835 2322 519 -2086 -1886 27 2 -133 -1414 -2507
539 -2507 -1963 -1376 302 141 -2823 -2517 808 1247 -272 -1472 -95 1749 1280 263 1044 1660 1516
556 1516 -4 112 2668 2079 -201 -135 -188 778 314 -417 -288 -1341 -2045 -189 451 -1087 -3227 -2718
574 -2718 1066 1535 -1414 -2570 -1462 1117 1667 283 -10 188 392 1666 2050 1352 -31 -437 2299
591 2299 2970 306 -1231 -113 1054 1487 -771 -1734 -703 60 -663 -1636 -1219 -119 -1518 -1572 -173
608 -173 -693 -1017 -405 203 201 -436 693 1570 697 30 252 1452 2853 975 -794 636 1611 1078 292
627 292 -308 -312 -55 378 81 -1378 -1691 -725 -769 -498 -481 -1868 -1856 -186 498 -294 -1192 -132 661 460 701
648 701 729 685 992 925 1154 1588 1124 98 866 1789 653 -406 444 546 -716 -627 74 -687 -1336 -1016
668 -1016 -713 -850 -847 -841 -1089 -1058 93 138 -173 -515 77 549 877 1008 518 754 1140 1322 1092 937 381 742
690 742 1022 787 -291 -264 221 -83 -973 -466 -754 -1132 -1154 -1036 -886 -1065 -1224 -387 -452 -757 -59 -43 363
711 363 524 515 836 985 598 1325 1140 637 1003 712 936 636 181 522 114 -260 -171 -619 -761 -573 -848
732 -848 -779 -1108 -1334 -629 -675 -991 -420 -225 -24 -437 -179 875 393 256 1135 609 522 1053 898 733 453
753 453 472 973 260 -37 317 -196 -215 -574 -862 -458 -1159 -1200 -692 -1075 -994 -480 -568 -526 -970 -311 502 -616
775 -616 -19 399 487 619 608 985 969 667 1420 919 433 705 567 -7 421 -333 -423 -16 -790 -651 -317 -1088
797 -1088 -1087 -849 -678 -452 -1090 -205 -384 -715 -238 344 115 445 361 869 453 420 1092 1064 793 845 623 501
819 501 870 125 30 298 -323 -61 -115 -557 -924 -639 -881 -1040 -1163 -580 -546 -834 -358 -343 8 -109 -111 366
841 366 433 516 675 668 562 745 956 769 638 238 1053 777 231 295 -86 -236 -338 -317 -189 -829 -1032 -604
863 -604 -687 -875 -788 -509 -960 -801 -284 201 -113 173 163 613 688 597 416 697 940 653 837 471 277 124
885 124 525 453 -341 -216 -338 -486 -179 -228 -965 -1411 -824 -545 -436 -970 -755 -455 -280 16 161 191 54
906 54 173 747 772 608 391 955 854 597 798 753 215 -6 313 423 70 0 -436 -792 -736 -336 -703 -1144
928 -1144 -998 -596 -502 -390 -556 -650 -395 -101 549 450 -30 -89 818 1429 793 -105 736 1131 594 930 717
949 717 156 57 -13 265 141 -874 -911 -489 -235 -600 -1231 -671 -375 -857 -776 -92 -517 -432 -323 193 246 552
971 552 633 270 368 1138 1125 432 823 611 175 396 754 593 -385 -660 258 252 -453 -823 -701 -355 -164 -1072
993 -1072 -640 -245 -829 -375 -170 -176 -516 -602 706 830 69 381 386 422 912 637 396 600 774 727 166 377
1015 377 809 7 -239 25 -102 -412 -984 -635 -238 -711 -800 -510 -290 -318 -821 -525 535 -306 -876 275
1035 275 681 559 453 678 837 173 783 1028 401 243 414 462 538 -81 26 122 -395 -135 -254 -980 -811
1056 -811 -342 -555 -742 -940 -264 -328 -694 -165 388 -178 -127 236 790 796 -213 443 906 733 247 673 882
1077 882 447 -194 437 913 -114 -478 -111 -112 -777 -367 -389 -865 -1044 -427 -124 -586 -529 -477 -168 -86 188 237
1099 237 -79 -9 503 746 344 340 823 1109 561 174 876 342 -319 328 343 -36 -748 -334 109 -443 -992
1120 -992 -300 -455 -669 -757 -293 -192 -546 -285 -338 -248 -232 103 425 308 82 777 867 362 701 632 495 297
1142 297 432 724 -51 -265 82 83 -384 -698 -167 -174 -560 -745 -498 -663 -620 -365 221 -357 -314 -64 582 -73
1164 -73 -28 269 761 336 461 715 489 435 315 871 283 138 429 293 64 -470 -200 -303 -526 -291 -420
1185 -420 -437 -986 -491 -387 -502 -467 -322 -232 -407 -85 133 120 151 472 710 279 363 823 995 417 207 577
1207 577 510 -73 -199 188 175 -348 -452 -108 -644 -581 -564 -481 -429 -968 -497 -164 -320 -428 -16 -83 -260 170
1229 170 268 357 37 424 844 565 564 673 584 482 257 547 554 22 167 435 -168 -353 -368 -477 -523 -744 -306
1252 -306 -364 -607 -398 -247 -566 -140 -235 47 85 -141 298 316 229 507 578 751 758 503 576 586 197 263 385 -72
1276 -72 -186 151 267 -243 -619 -300 -221 -679 -547 -445 -446 -569 -476 -235 -169 -65 50 132 313 394 507 348 549
1299 549 379 808 450 247 352 449 345 -23 117 153 -242 -210 -412 -466 -415 -619 -301 -455 -357 -434 -397 -409 -448
1322 -448 -91 8 -48 118 353 512 205 299 587 281 437 326 615 559 178 431 296 64 59 70 -336 -500
1344 -500 -458 -223 -488 -564 -299 -376 -572 -529 -373 -279 -300 -49 -87 -24 265 275 182 131 433 430 653 322 189 723
1368 723 137 353 197 -20 256 -150 -151 -34 -407 -420 -259 -518 -669 -540 -624 -358 -371 -280 -106 -119 -274 36
1390 36 216 279 157 310 459 394 647 623 709 376 423 363 186 144 -90 -56 -234 -121 -461 -435 -315 -701 -498
1413 -498 -203 -663 -456 -460 -110 -256 -108 65 161 33 258 474 232 237 570 655 463 208 434 202 197 378 207
1436 207 165 4 -300 -295 -103 -613 -214 -431 -624 -375 -307 -421 -408 -540 -379 -149 -262 252 -166 149 9 247
1458 247 419 600 274 375 668 319 313 347 615 265 40 300 -159 33 130 -514 -552 -224 -348 -643 -410 -520
1480 -520 -393 -304 -538 -132 -189 -8 276 119 327 171 501 412 684 -9 185 428 334 183 355 -34 131
1501 131 69 -89 -147 -265 -319 -233 -530 -504 -434 -515 -380 -103 -89 -173 -244 -69 -44 -97 69 289 195 440 135 338
1525 338 583 471 109 433 431 370 27 -10 -80 -281 -83 -84 -59 -550 -533 -308 -305 -443 -355 -458 -227 -402 -173 -356
1549 -356 -266 -123 -92 256 247 70 269 431 536 275 425 413 286 108 352 156 136 -3 -323 99 -58 -328
1571 -328 -542 -475 -583 -140 -549 -486 -281 -244 -83 -210 -198 27 -161 167 109 378 291 250 345 322 335 369 624 226
1595 226 383 458 -98 140 -159 38 -282 -384 -331 -33 -478 -215 -257 -583 -404 -344 -296 -299 -515 -176 -56 -132 236
1618 236 10 314 335 227 444 284 314 362 486 132 357 51 161 268 -311 -216 -450 -435 -310 -351 -233 -629
1640 -629 -444 -26 -538 -371 -312 -275 -17 -135 186 179 83 -4 339 334 393 389 317 442 307 307 375 135 -11 -148 -63
1665 -63 -478 -298 -252 -251 -380 -245 -350 -420 -348 -275 -446 -300 -242 -22 143 -72 -7 275 249 485 137 254 381
1688 381 354 592 390 61 499 177 105 -97 -160 -132 -162 -322 72 -190 -430 -203 -506 -275 -569 -426 -145 -265
1710 -265 -172 14 134 194 298 298 287 459 445 67 356 214 142 344 429 180 258 115 112 -200 2 -207 -202 -287 -302
1735 -302 -376 -189 -235 -352 -375 -265 -266 -167 -162 -131 72 119 103 325 416 160 363 111 468 441 472 77 459 6 159
1760 159 134 26 -93 -321 -131 -304 -341 -225 -380 -437 -238 -336 -359 -266 -245 -298 206 -162 -161 149 226 190 362 316
1784 316 310 237 129 274 -54 219 25 14 24 135 108 -40 -211 -172 5 -401 -715 -400 -206 -303 -118 -227 -85
1807 -85 -37 -361 36 170 107 -117 253 216 375 100 246 251 466 321 409 227 372 295 99 -25 -171 -307 9
1830 9 -252 -309 -279 -144 -396 -351 -305 -287 -285 -99 -317 -65 212 52 343 300 421 218 353 159 261 284 462 105
1854 105 247 161 55 261 -170 -228 -64 77 -106 -416 -143 -651 -172 -295 -269 -324 -307 -481 -82 -227 -135 -61
1876 -61 -72 171 77 404 209 365 23 219 326 324 156 -2 51 3 32 -42 -36 -133 -131 -360 43 -218 -42 -198 -310
1901 -310 -369 -281 -183 -151 18 76 62 -28 94 104 205 173 425 250 81 254 295 309 290 1 153 73 16 -59 -262
1926 -262 -54 -360 -21 -116 -396 -244 -307 -225 -98 95 -67 56 143 -121 363 247 163 207 143 239 481 298 428
1949 428 213 285 409 84 263 -132 112 83 -135 -133 -534 -237 -380 -295 -260 -241 -315 -205 -254 -128 -213 -23 30 -123
1973 -123 72 407 155 235 169 339 236 268 250 291 144 243 228 -98 -194 -62 -138 -327 -111 2 -290 -254 -418
1996 -418 -244 -350 -198 -125 -209 54 -121 -90 -29 40 108 149 228 -69 477 187 365 84 213 93 83 6 29 -37
2020 -37 -324 -185 -4 -273 -419 -229 -173 -245 -284 -339 -181 -255 -320 -168 -7 -111 -12 118 154 302 67 414 304
2043 304 308 417 284 190 259 306 -1 145 -97 -169 61 -264 -158 -302 -329 -180 -493 -215 -113 -136 -291 -123 -29
2066 -29 -58 -379 -25 244 -176 313 91 48 193 149 235 204 355 134 141 -212 222 361 135 179 -203 58 -355
2089 -355 -390 -57 -393 -320 -91 -39 -203 -307 -295 -222 -240 -126 -27 251 65 362 282 418 167 395 475 6 477
2112 477 40 68 277 55 11 -144 92 -204 -181 -387 -307 48 -158 -414 -244 -32 -65 -170 -291 -27 8 73
2134 73 -140 135 -6 40 98 214 174 259 296 203 364 75 138 -59 -47 166 25 39 -198 41 -155 -184 -61 -4
2158 -4 -221 -165 -247 -169 -149 -120 -32 -39 -174 48 16 25 86 361 196 427 458 142 126 475 183 137 178 81 -57 -115 -21
2185 -21 -275 -215 -48 -146 -283 -185 -300 -47 -169 -136 -208 -239 60 267 -218 155 305 285 165 292 154 533 314
2208 314 321 75 345 -16 -234 59 -106 -85 -178 -312 -272 -332 -93 -393 -357 -353 -133 -172 -133 47 -18 -209 110 44
2232 44 79 71 -5 103 346 -77 131 202 332 77 215 3 141 85 -259 165 95 -167 -375 -260 -228 -37 -356
2255 -356 -299 -354 -103 -183 69 -58 9 88 46 -71 319 194 83 235 306 93 265 -52 372 137 300 82
2277 82 -200 74 109 -227 -306 -163 -143 -225 12 -74 -289 -329 -225 -90 -42 105 -317 -15 107 371 151 -76 72
2300 72 356 117 218 115 312 6 44 192 28 -48 73 -5 -352 -221 -8 -61 -324 -241 -216 -75 -147 -196 99
2323 99 -251 -519 25 9 241 4 100 34 280 297 395 110 431 -3 315 225 -53 274 213 -104 -249 281 -233
2346 -233 -76 -129 -171 -39 -310 -203 -287 -322 -305 -11 -279 13 256 -216 67 109 75 243 136 153 20 7 343
2369 343 3 226 39 145 36 112 10 128 -124 87 -207 -108 -184 -141 -281 -205 -181 -130 -39 -56 33 -112 -110 25
2393 25 95 124 35 59 437 434 304 253 335 146 403 42 159 27 -42 -36 -382 -350 -351 97 -100 -243 -138 4 -372
2418 -372 -110 -237 -318 -104 -91 22 -250 284 -163 50 226 13 197 210 231 259 284 19 125 173 -28 -73 -138
2441 -138 -130 -64 -55 -123 -151 -88 -17 -309 -56 -108 -245 199 -64 -110 -156 -194 -16 286 176 -41 230 37 74 292 338
2466 338 296 210 175 256 -128 102 388 -287 144 -147 49 133 -155 -57 -408 -175 -140 92 -229 -278 -206 -171 -94 -261
2490 -261 83 168 -38 65 227 -60 344 179 248 101 125 188 34 4 -51 -97 63 -48 -128 -392 -162 -414 -116
2513 -116 -125 -169 -443 9 10 -6 3 -40 22 117 -133 -288 193 186 141 106 268 58 154 -14 159 177 170 116 -218 -30 -205
2540 -205 -375 -345 -157 -165 72 -70 -535 -128 -154 -50 213 -324 83 87 -204 179 -67 124 153 247 115 159 170
2563 170 -28 189 71 22 10 -77 -111 -54 130 -213 -59 -53 -129 -119 -281 -319 -370 -263 -94 130 118 -53 86 100
2587 100 -109 50 81 290 381 134 388 -35 394 122 237 292 15 55 63 -205 -106 129 42 -158 -152 -256 -101
2610 -101 -393 -67 -98 106 23 -117 -70 157 -126 62 141 23 214 44 -123 190 354 59 103 58 204 226
2632 226 93 164 -205 22 13 -335 -71 -156 -337 -411 105 12 -365 -295 6 -45 -299 89 -7 117 -141 124 110
2655 110 207 1 433 265 190 261 -39 89 -49 239 -101 -62 -2 -174 -229 -158 -117 -130 -164 -184 -162 -91 -222 -111
2679 -111 -138 -31 -113 69 -76 160 -49 2 30 45 277 52 79 204 232 227 192 -174 34 -21 81 17 -41 -105 37
2704 37 -18 -286 -57 -333 -147 -442 -177 125 67 -240 90 -34 30 167 75 103 113 160 240 199 102 76 92 200
2728 200 -83 62 327 -3 54 17 12 -116 -194 -355 -112 -136 -62 9 7 -79 216 83 -104 -142 151 24 18 287 -99
2753 -99 325 4 128 118 172 170 53 97 73 -80 -223 -196 -221 -83 -431 73 -177 -165 -307 -102 -145 -217 -118 -150 -68
2778 -68 -132 121 -28 94 61 77 270 5 304 241 191 103 398 65 30 27 192 82 -40 -176 -124 22 -177 -4
2802 -4 54 -200 -210 -57 -204 -384 33 111 -280 -78 -86 287 174 -46 132 204 115 131 86 -219 -82 151 145 53 87
2827 87 -183 23 85 37 -108 -18 -156 -24 25 -267 65 -118 -79 -206 -7 127 -62 96 -3 23 233 -8 173
2850 173 -6 8 249 353 232 -100 -78 -20 192 201 148 96 30 -284 -241 -210 -114 -32 -39 68 -145 -122 8 -365 -95
2875 -95 140 -129 -147 -21 -135 58 51 285 44 140 114 187 -16 128 133 136 92 35 31 -118 171 -27 -157 -255 -91
2900 -91 57 -211 -96 -154 -97 -107 -255 -84 -168 -135 -37 81 117 190 382 280 -46 24 384 242 2 87 27 -33
2924 -33 -69 159 49 2 -91 -153 -295 -223 -182 -83 -80 -269 -173 -146 -85 -24 24 -70 139 251 169 -20 59 -8 136 -106
2950 -106 87 98 88 27 -25 28 124 172 -9 154 -166 -200 -58 -271 -43 -260 -183 -31 -256 -177 -32 -95 29 -206
2974 -206 247 175 91 143 151 112 -185 109 -50 63 85 207 78 -11 256 311 -240 -80 -158 8 -68 24 -41 102
2998 102 -43 -268 -177 -49 -106 21 216 133 182 140 -270 69 332 -126 86 -16 193 50 166 245 -250 -120
3020 -120 -34 -53 5 -87 -98 -84 -226 -102 26 -309 -225 -242 46 -64 -18 -38 -151 50 78 241 229 -51 155 87
3044 87 321 250 61 -12 167 163 94 191 -66 369 22 6 16 52 -225 -240 -43 -279 -15 33 13 -69 -3 27 -62 -197
3070 -197 59 65 45 23 -65 -104 -147 43 445 24 32 246 -24 -59 -57 -7 41 -54 -77 21 -245 -21 -157 -206 -223 -275 -259
3097 -259 -458 -148 -93 -148 263 146 103 15 -31 122 20 263 308 33 330 270 213 -6 -71 20 193 -92 135
3120 135 -217 -41 -88 -160 -94 20 -156 -320 -82 4 -186 -225 -73 43 221 -208 115 95 67 342 56 268
3142 268 213 251 -23 -9 -81 -8 -33 127 105 74 -143 -122 2 -169 -80 -41 -118 -58 65 -131 -141 -181 68 -230 32
3167 32 -81 -8 116 -40 276 253 110 274 303 79 78 75 171 138 -29 -28 -44 -172 -229 44 34 -57 -288 -266 209 -145
3193 -145 -87 -190 96 -78 56 -19 45 -79 178 -98 53 63 197 14 171 21 120 135 75 -39 4 228 -257
3216 -257 108 101 -119 -236 13 -156 3 -313 -179 -164 184 115 -138 -5 -197 45 -81 3 -107 -111 43 269
3238 269 4 140 351 120 111 133 40 -32 -36 104 -211 -32 94 -125 -107 -7 43 -226 5 -228 -190 97 -83
3261 -83 54 -60 -28 -115 109 -77 -55 309 -105 169 213 -18 11 142 -7 -69 6 -11 -9 -22 110 29 -89 -74 45
3286 45 -146 -68 -156 112 -98 -53 -140 -167 -420 -83 -147 -59 -128 -270 81 89 -118 140 100 -31 43 -133 112 70 49
3311 49 -49 115 78 -27 -33 -199 -209 -257 41 -228 -114 -328 -55 -143 26 69 48 -29 83 7 -114 -28 205 88
3335 88 209 69 63 53 170 94 56 135 -95 -107 209 -52 -93 -6 -219 62 -155 81 101 19 -76 47 -350 -70
3359 -70 -21 -315 11 -164 35 85 33 -124 40 -29 201 28 -269 33 56 68 -155 266 64 -76 -163 -208 -39
3382 -39 63 -238 -10 -134 -132 -163 -156 0 155 -268 -58 115 -76 211 158 45 -188 160 266 -54 -171 197
3404 197 3 -274 78 19 73 24 78 87 136 -217 -278 -202 -117 21 -24 -9 -140 -301 -98 135 83 -2 -93 -39 -10 117
3430 117 362 163 -9 -62 -192 210 -206 87 2 309 -28 -60 -75 -24 98 -211 -224 -174 203 -17 -154 75
3452 75 19 223 -52 -95 -111 321 112 22 76 -132 -121 -35 -11 27 31 160 205 316 139 281 163 183 126 -5 -95
3477 -95 -195 79 26 77 -73 -250 -210 -114 -17 51 257 -92 -31 107 14 -95 -172 -98 125 -256 -45 128 104 -142
3501 -142 79 -41 180 87 153 -97 34 91 41 -149 -101 -356 -141 -274 -63 352 104 -55 -70 -137 127 -120
3523 -120 5 33 34 -101 -26 123 143 59 -74 16 345 -49 78 118 -190 -143 -133 -138 -17 -29 52 0 -99 -27 -18 148
3549 148 -49 -81 59 16 -116 104 -14 47 -143 46 195 77 -47 162 143 77 -16 161 -148 166 0 -196
3571 -196 92 12 210 -120 31 -131 -189 69 -14 -102 84 -34 -67 -110 -49 -6 -11 20 -141 -25 -25 18 -39 24 23 -156
3597 -156 259 72 -124 197 32 -133 168 69 -33 -243 53 -111 -70 -218 -110 -50 -270 -77 121 10 -129
3618 -129 19 47 -124 111 212 -35 -44 137 172 -18 -128 204 58 42 -66 25 120 -14 -13 -11 138 97 104 1 268
3643 268 -34 188 154 -148 -52 29 278 -159 -107 105 141 -38 155 12 -315 144 70 2 93 98 -125 134 74 169
3667 169 41 109 -5 -110 -117 22 -97 -66 56 -76 10 -38 -15 -25 -37 -83 -118 -88 -116 -19 13 -261 -23 124 -118
3692 -118 42 -179 -123 173 51 206 -110 -58 78 86 -34 -77 -3 -177 -63 28 71 -5 -121 89 -108 -18 -89 -315
3716 -315 -139 3 -17 51 -89 84 -24 -163 5 -27 -34 187 -11 -134 166 27 130 127 14 -103 111 48 193
3739 193 -23 -32 -36 -63 -277 120 33 -25 37 -117 -80 -86 237 -109 33 -28 -79 81 153 68 145 12 -116 -5 -35 -111
3765 -111 -109 -292 49 -37 68 -119 -109 -375 -155 -193 -214 -287 19 178 4 115 74 223 -31 -41 -148 39 -40
3788 -40 200 9 -135 -74 -81 280 2 -202 93 140 -65 288 -129 143 -90 -174 67 -34 -116 -169 -231 9 -329
3811 -329 28 -93 -26 220 45 281 232 -172 -275 52 92 273 64 142 -70 152 -192 -12 35 -191 -19 -176
3833 -176 142 -12 130 -25 -235 -21 -58 -34 -15 19 -301 101 -71 148 -18 -46 -17 191 110 -78 76 130 221
3856 221 182 227 40 195 206 100 -301 -113 -46 -147 -17 -53 64 147 -167 11 13 172 292 -24 58 -176 -316
3879 -316 126 -151 25 12 -66 259 5 -33 -20 52 -213 63 116 -131 105 47 -22 -58 27 20 -18 -158 -87 318 -29
3904 -29 236 -1 -104 274 96 213 166 40 214 63 -62 136 180 -116 77 -73 152 169 98 110 110 60 -141
3927 -141 144 212 -59 -109 -96 -134 -154 -114 -142 35 161 -409 -1 -147 -472 53 209 126 -147 77 128 -15 7
3950 7 94 22 -142 -53 -189 150 4 0 85 -152 73 81 37 -131 82 -107 -59 -41 -28 116 -321 -127 122 -121 316
3975 316 -161 35 167 -95 39 5 199 95 33 -155 -252 -100 -189 -128 -210 -187 64 -160 -164 181 -168 -197 80
3998 80 -78 -49 -108 -437 -135 -16 -120 90 86 -11 -176 -224 -9 -111 -181 196 177 314 36 102 -152 -86 133 -202
4022 -202 67 -115 208 114 206 311 27 -61 45 -208 3 -97 -235 -75 -119 -78 -96 -53 -67 132 -103 -51 -106
4045 -106 56 -30 219 -106 239 72 -206 109 -35 52 16 -104 190 130 213 -80 -41 -211 -47 78 -72 -285
4067 -285 132 -97 100 -26 -33 56 -202 136 -54 248 289 -97 -39 235 253 -11 134 -29 143 66 -138 171
4089 171 -229 21 -71 37 -206 -56 -10 43 -65 -36 69 100 176 -49 71 -65 -136 -79 33 -117 -162 59 19
4112 19 -4 171 63 11 149 -220 173 12 -150 -27 69 11 -348 -16 104 8 -123 -84 -83 -60 -205 65 -185
4135 -185 217 -255 -102 109 -138 108 27 29 95 98 -93 -234 158 94 30 -312 -138 38 -95 29 183 -135 -306
4158 -306 150 -54 -16 -49 16 25 -62 31 66 -4 453 -147 180 157 -193 -151 72 209 -61 316 67 71 -139 16
4182 16 278 191 337 137 167 132 27 -12 6 -157 218 -21 -35 -123 -261 56 110 31 -14 28 -120 -68 -172 -136 76
4207 76 -50 -157 21 -24 16 36 316 -54 -87 192 -5 66 249 -46 -138 -28 -143 42 -65 2 -100 -15 -67
4230 -67 -167 138 99 -71 197 -81 117 54 45 109 -123 -10 -7 -64 -160 175 -275 -82 11 85 -231 -20 -64 -186
4254 -186 -25 -53 165 81 -2 303 100 108 20 -138 181 -25 -37 114 237 -90 182 -209 95 116 60 79 18 176
4278 176 28 138 156 -65 53 -180 -124 168 -190 65 204 -11 247 -94 -107 -195 175 2 101 8 72 -119
4300 -119 60 -13 129 35 -16 -57 -71 2 23 24 -69 101 24 -11 -118 -8 -134 -26 64 78 64 -245 -76 11 -249
4325 -249 -124 179 -219 39 -44 -8 49 219 -91 -32 -16 -2 -42 -145 52 25 -403 -21 -7 -118 -77 -228 -112
4348 -112 -47 -122 -67 88 -81 -56 -139 72 -208 -79 10 -138 -58 208 -107 220 -2 -154 28 272 82 146 294
4371 294 -26 27 42 48 -194 -206 -213 90 113 70 -132 92 308 31 -46 -46 -393 59 65 -55 31 102 -275 161 63 -306
4397 -306 -21 -117 230 30 -224 176 119 46 17 -67 229 184 19 145 20 -219 -92 84 87 -311 -184 -80 -192
4420 -192 -44 -159 224 -59 -16 188 -135 103 134 -11 -94 143 -145 -54 241 75 93 -273 52 244 178 252
4442 252 -9 80 -14 -89 -11 -283 34 -70 168 -90 -60 -18 19 -271 -102 -143 15 68 -207 23 -203 -175 109
4465 109 -64 -163 -11 100 178 82 213 171 -14 -81 -79 46 -24 202 -10 133 -66 -42 -66 -17 -61 271 -19 -35
4489 -35 101 -170 -82 52 61 70 -44 -200 121 -41 28 -14 91 -145 279 -65 11 125 98 99 -138 27 -82 202
4513 202 35 -141 -95 -159 185 149 -17 108 7 106 25 179 209 93 -174 1 250 162 6 -402 28 -21 10
4536 10 77 85 -66 -37 -278 88 -127 68 -53 -27 1 106 0 -118 -36 -10 -125 -20 214 -14 -3 76 26 50
4560 50 -79 8 -283 -314 18 77 -170 -76 9 48 56 13 7 53 17 -127 -101 216 75 62 -83 436 -102 -239 -33
4585 -33 -22 -118 183 99 -179 71 20 -123 85 37 -178 164 -79 108 149 -129 145 31 -142 177 43 -194
4607 -194 93 26 -85 249 -128 -142 -62 -180 -16 -42 122 -77 9 141 -37 -80 380 118 -133 18 116 131 111
4630 111 154 140 218 6 23 6 -61 51 28 -200 146 -234 135 -183 41 129 164 -52 207 -125 -292 54 -30
4653 -30 -138 -170 -200 -160 248 -174 8 85 88 -50 -128 64 50 -1 138 31 102 -165 53 88 -224 -70 -39 -60 82
4678 82 -339 -44 37 143 265 -40 -55 -37 94 95 -166 233 180 -250 27 195 135 -38 105 -146 70 -71 -153
4701 -153 -65 -173 58 -238 -399 48 -5 -45 -2 -23 1 -124 110 1 -245 -111 -173 5 28 -15 -60 27 167 -86
4725 -86 -14 68 -35 -135 171 -118 -164 -96 -115 67 -35 -101 -208 -84 -43 -47 63 -23 60 326 -189 -103 178 -273
4749 -273 -32 90 111 166 -23 -58 247 -28 -38 35 -209 -76 -85 -175 9 -81 145 -297 -222 7 -59 -4 -171 180
4773 180 -62 71 -201 -137 -83 -115 -103 182 17 123 175 -56 -104 52 -5 84 60 83 79 92 67 41 134 -20 -243
4798 -243 40 -94 -255 -83 216 -65 -12 -269 -111 -52 -69 97 8 -211 -137 154 85 2 308 -101 -239 155
4820 155 -23 -9 -2 -100 56 -124 -216 216 22 -116 -73 -109 307 184 -52 125 -111 -30 -204 -28 -97 18 111
4843 111 31 -36 -88 169 -100 75 -138 -52 30 54 -43 32 -19 23 -122 -10 -46 -148 125 114 -7 30 -86 92
4867 92 -117 20 71 -27 27 -7 -214 149 -54 -222 144 21 69 -236 -61 226 19 -98 55 -23 -103 -6 -98
4890 -98 54 42 -3 123 -21 -136 147 116 -24 -184 37 -144 -95 -68 142 161 113 -265 -7 -117 58 -15 88
4913 88 134 87 140 -116 -195 -22 278 151 -93 -60 240 36 105 148 -98 -344 39 113 323 24 69 47 -78 -104
4937 -104 -214 184 -128 -245 -17 -200 -144 123 121 -167 22 -19 133 -60 -2 -12 -53 -61 -185 112 177 84 -1 186
4961 186 30 -104 -80 -262 27 107 -43 -40 -78 -111 14 138 -109 -46 -118 369 -96 -54 125 0 -25 -72 -116 45
4985 45 -133 -212 70 -113 98 -330 93 88 37 -138 -12 -11 -55 65 -79 -8 -188 28 86 -294 -114 -31 69 -62
5009 -62 166 5 86 141 -68 225 175 59 -163 100 -16 140 -111 203 23 -12 65 59 273 232 -27 -7 -162
5032 -162 -132 -265 157 48 -67 119 47 285 -124 120 -309 148 -86 -25 3 179 158 81 -133 92 76 -218
5054 -218 -61 246 59 228 45 -188 32 141 -185 -122 70 136 189 159 -106 -168 -14 -5 125 126 47 -130 141
5077 141 1 139 142 -19 -71 -44 34 -102 -221 -29 -208 -40 -143 -156 -130 -35 9 8 78 14 -122 -59 162 -63 12
5102 12 -154 80 -1 -222 -264 22 -114 -233 -71 118 -9 -174 57 -53 77 15 44 65 -180 70 -114 90
5124 90 -53 -100 -61 64 192 -177 -96 -137 76 48 -9 -12 185 170 46 -14 -43 -242 276 -41 70 -79 160 -68
5148 -68 16 188 -357 -45 -121 80 172 -22 -139 -24 -12 -167 84 -69 -160 5 34 -239 52 -14 -66 -57 135 -91
5172 -91 -16 47 -49 15 -86 133 -99 205 -66 122 10 -89 162 -59 28 129 -194 48 -10 180 97 21 -93
5195 -93 -20 24 15 261 128 117 -239 -2 30 -18 95 63 -174 76 15 14 -76 -23 60 -144 -76 -357 -126 -196 -13 30
5221 30 0 286 75 -37 13 -152 -96 66 320 -55 55 40 23 -5 151 -50 -56 115 241 91 33 1 -321 -132
5245 -132 235 181 -71 -5 48 50 -102 91 -58 107 -20 102 55 -97 176 -91 -155 129 -360 -33 -134 208
5267 208 177 -86 -20 38 -1 100 -84 75 223 189 224 -100 -25 -195 -32 85 -98 81 42 233 69 176 -311
5290 -311 93 41 -58 206 295 210 34 245 -9 36 -227 -271 61 -135 -156 -256 -205 -88 16 111 -101 -308 -2
5313 -2 61 61 -120 33 62 51 -185 124 22 -68 20 -108 59 -290 -428 -21 237 28 34 5 164 124 -164 114
5337 114 -29 125 -171 67 29 81 -176 82 103 34 201 37 69 -2 -72 -108 12 90 -90 -97 -41 -284 -30 -16
5361 -16 -39 -163 9 58 -99 -82 -92 74 -211 161 163 27 -109 88 99 8 231 116 27 74 2 12 -229 68
5385 68 -87 58 29 257 -74 12 27 -227 -124 91 -244 -11 160 180 -268 -54 -123 -156 23 -74 87 -95 211
5408 211 -47 23 9 -102 -45 -121 -7 10 130 5 -152 -110 116 127 -94 227 46 280 -17 67 193 -60 131
5431 131 106 139 -46 47 -48 -35 -125 -40 -10 -25 54 -72 49 -89 200 52 48 80 243 194 160 -177 92 -104 139
5456 139 112 -271 195 14 -32 -28 -419 47 107 -157 -32 -59 185 -107 106 10 -37 0 187 184 -194 -288 38 22
5480 22 60 80 -17 -214 -96 15 -73 365 108 -45 51 -40 -148 -32 -118 179 0 26 252 89 46 44 50 -113 44
5505 44 -233 39 163 -142 -65 124 32 153 -85 -17 -252 -28 -16 341 165 -40 6 -63 -323 225 105 107 91
5528 91 314 130 -19 -32 190 122 -149 102 -128 -144 -17 201 -178 -11 166 224 -34 -55 -66 145 -166 157
5550 157 -191 -119 5 -180 -122 -43 38 -73 -142 -55 156 -124 104 112 -187 -54 79 -66 -172 -25 -99 -243 95
5573 95 103 56 0 94 71 57 206 112 -2 98 180 25 -176 131 -16 -133 36 111 84 -152 -37 76 66 -34
5597 -34 274 24 -30 89 176 44 -90 136 -45 -40 293 41 115 138 10 89 108 -25 171 21 -178 77 -218
5620 -218 -290 -24 170 -163 100 -55 26 -30 14 -184 -7 -55 282 23 38 51 -125 -120 -283 118 -67 228 -251
5643 -251 40 -14 49 -192 13 -51 -233 294 101 187 72 214 -35 65 111 93 32 104 58 69 8 -232 10 18
5667 18 7 -124 85 -67 -60 -135 -13 61 128 79 -28 51 -18 28 -2 -308 -69 -121 -143 76 -15 179 -205 172 56
5692 56 -20 22 -183 256 -216 -22 120 68 11 348 164 88 -163 173 -54 -80 -266 14 57 84 -202 -84 30
5715 30 -106 -76 -102 -153 84 -356 330 174 21 63 -116 30 -31 85 293 -189 -31 51 122 -57 -165 45 -329
5738 -329 133 183 -294 280 250 144 62 -93 -34 328 -33 -52 -118 -84 15 -26 75 15 126 111 1 -177 -120 -84
5762 -84 -355 -192 73 23 -71 -10 -105 381 95 -188 71 -96 -76 -98 254 93 263 155 -30 100 0 -212
5784 -212 -265 -65 255 -81 -33 -261 -258 26 60 64 -191 47 189 -34 -201 -86 -188 47 -154 30 -188 -182 -248
5807 -248 7 69 44 130 144 22 230 -292 108 -91 -48 -15 122 59 -190 70 -86 -281 -154 119 215 -36 -81
5830 -81 153 -87 195 -344 -201 126 -106 66 -15 33 133 244 72 52 -18 -179 28 12 116 -150 57 184
5852 184 101 108 153 322 169 -55 105 -31 -156 -364 231 -39 56 -22 47 -3 -188 65 61 -146 74 87 -83 -158
5876 -158 -58 6 -170 129 38 -24 324 -179 -6 -22 -62 34 -193 116 -260 -81 -128 -7 -20 145 53 177 -183
5899 -183 -281 -50 -8 7 -9 144 4 43 9 133 -26 144 212 191 -117 -170 297 217 42 -98 -113 151 -38 103
5923 103 -7 8 113 250 -28 -159 153 -103 -72 75 -237 33 -165 107 290 114 -69 -55 -21 -115 226 164
5945 164 15 148 303 -162 -346 -25 45 -83 -79 -134 -312 -165 -310 -128 223 65 210 132 92 89 -298 196 -97
5968 -97 222 95 -32 -176 -202 -10 134 218 61 1 -61 -8 132 -137 187 95 -18 -126 -70 105 -114 -334 188
5991 188 33 -308 -60 -4 90 -135 131 -183 -136 -93 -56 -25 -94 -63 -31 -176 -94 -140 107 -27 160 -27 -145 -52
6015 -52 -253 -86 -49 194 -197 -143 -5 116 177 162 213 50 82 -133 -109 204 123 -108 38 -7 174 -54 -80 80
6039 80 91 109 -289 328 211 -137 -66 83 27 -155 -30 123 434 28 -85 -112 -235 -159 55 -91 85 -104
6061 -104 105 178 35 20 -170 -31 -139 -215 -105 97 38 96 -69 -6 78 14 -163 100 -125 49 43 -61 149
6084 149 124 33 56 -47 -292 -28 46 -226 -63 -33 -42 -46 199 243 -118 251 -84 133 250 202 46 -9 254 28
6108 28 233 -341 15 12 68 144 118 133 -139 -80 -2 30 46 -132 -57 -122 -206 -35 -106 -52 -108 106 -26 -227 -205 -120
6134 -120 174 -60 18 -23 72 126 -7 27 -284 -21 -207 -35 -42 68 104 416 -15 103 -132 -318 -306 148 3
6157 3 117 -35 20 -120 -54 196 2 -135 -65 275 157 107 -103 45 -48 -59 -110 -107 -51 -279 -202 -86 225 453
6181 453 -10 -93 20 -190 210 9 -232 -113 -19 151 -39 47 -131 160 -98 -97 148 -142 -82 175 -33 -79
6203 -79 -58 -230 120 96 -26 -49 156 84 -59 -88 305 -72 -20 -268 -52 14 -220 -66 55 -119 188 -156 133
6226 133 96 333 168 -184 -171 191 -130 0 -225 -87 12 31 -14 52 -36 94 385 -134 -73 114 213 207 50 47
6250 47 -60 -80 -18 95 -194 -129 -117 44 194 -8 104 -39 -260 283 107 -97 105 157 93 9 161 134 -39
6273 -39 60 -68 -147 41 -140 -24 149 -95 61 63 59 -286 -204 -63 133 -86 -144 196 -107 -113 124 178 8 -85
6297 -85 -251 84 -86 93 -258 13 -167 87 160 25 199 39 197 73 65 -95 -51 -83 47 52 -144 240 -33
6320 -33 -170 68 -17 40 300 248 -92 -13 -43 -57 102 -251 16 138 -156 8 -33 -171 -112 91 -218 -156 -88 -152
6344 -152 109 -56 -79 -106 56 -117 27 -64 -83 62 -257 -119 -108 117 -86 135 105 13 59 44 148 -16 11
6367 11 53 96 107 -14 -96 96 202 187 49 2 109 -21 71 -143 46 108 -27 35 222 -11 49 -42 18 -113
6391 -113 -57 -142 132 -59 59 -185 -214 58 149 -60 -117 169 -157 36 32 108 68 -128 -68 -120 -14 -148 20 129
6415 129 -335 -31 214 -129 -12 -48 158 -41 -91 -88 -43 -89 -67 147 46 254 230 258 -238 15 16 127 97 -13
6439 -13 16 4 85 26 31 94 75 -255 -78 -150 99 61 224 14 -68 -125 -145 22 97 23 55 -215 -33 -147 63 98
6465 98 -35 201 -21 -17 105 -152 162 -12 17 38 -107 -170 -124 -29 -108 144 -206 318 -160 58 -56 67 -118
6488 -118 29 -182 -165 -30 32 -138 -124 340 130 266 159 -77 8 -136 151 -205 30 -195 -97 -102 -87 123 -271
6511 -271 -84 -231 -39 -90 -10 8 26 -146 -43 208 88 125 -33 -31 87 -35 180 -52 -243 -82 -91 -116 -217
6534 -217 20 37 0 -75 11 305 -24 149 -6 -128 152 14 -32 53 -108 -369 -137 94 -80 2 42 84 -1
6557 -1 -88 175 -94 -152 224 -3 34 -12 9 -136 84 162 -50 -157 -91 -132 -37 -139 78 -145 -86 36 40 13 -162
6582 -162 -197 12 210 -90 -212 -2 -112 -30 -87 79 3 -119 49 140 -105 -48 -50 -51 101 246 -41 -89 160 27
6606 27 18 12 62 55 -77 0 -47 -84 42 -27 -94 -80 158 431 55 6 103 41 217 -50 234 124 58 -62 93 -202
6632 -202 -49 5 23 138 -429 180 -66 47 -62 -255 -115 -160 -312 -5 16 -52 -81 113 226 144 25 120 56
6655 56 32 124 -32 -116 -13 162 -137 158 231 37 -2 -30 -419 -78 -106 54 -114 15 124 194 13 24 -220
6678 -220 -143 -33 -48 2 -16 -87 -13 97 203 -27 -26 154 317 -276 -19 295 -67 245 146 78 55 -294 117 -116
6702 -116 -234 -82 -5 -89 -121 42 -44 53 284 20 24 1 16 -51 -70 15 140 -68 155 48 45 -64 172 219 184
6727 184 134 -11 66 11 69 12 -64 -157 195 -130 -39 72 -45 101 161 88 -273 -94 -49 230 -197 456 85 163
6751 163 -117 42 28 -99 53 -8 -38 59 31 45 66 -72 -164 -105 197 159 169 -88 -99 -3 12 49 47 14 -134 -2
6777 -2 -2 98 -38 -49 100 -67 -112 97 -141 -131 103 -41 266 -174 -33 268 -25 192 -70 118 18 16 62
6800 62 152 253 -248 -59 -173 7 -113 145 -20 41 -165 -91 123 160 -92 -80 249 101 162 39 14 113 -31
6823 -31 -139 23 -76 27 124 -175 -142 34 -5 181 -15 150 -132 51 -116 83 -36 -158 -178 -110 9 -12 2
6846 2 167 150 206 -142 51 49 -48 130 46 173 -164 123 -229 4 -211 -181 120 -192 29 -89 102 -34 -9
6869 -9 100 113 -36 272 -120 -128 -1 -11 212 78 -144 55 72 93 254 -277 53 -119 -9 -39 -64 6 -247 206
6893 206 22 -133 -58 -130 93 93 57 -20 -203 56 10 139 -28 -90 68 -231 111 -53 -64 209 -137 59 0
6916 0 -210 82 93 -100 37 -158 32 -4 -468 -12 44 76 -13 116 -236 95 -157 91 377 -127 -28 -25 4 -12
6940 -12 -29 163 0 225 -114 16 178 -92 -83 197 164 -50 173 -93 105 185 89 -12 -26 -136 130 2 134
6963 134 -39 347 -204 13 -52 2 -49 -117 -134 63 110 -118 117 -341 0 -99 98 154 159 147 83 34 101 -9 -14
6988 -14 -150 -174 -106 -27 -15 -87 -71 45 -64 -61 -150 21 -66 0 -100 111 -94 64 38 -154 315 -95 -23 -147 -41
7013 -41 -30 45 136 82 -215 58 -49 185 -62 -325 14 -79 128 -40 -2 -76 102 -195 103 19 -121 -70 -4 -146
7037 -146 100 17 -97 59 -172 154 141 91 -73 73 56 115 -292 -98 73 301 -21 -21 -47 -111 -108 -25 66 -2 -443
7062 -443 -158 -150 -43 56 -1 -146 -167 -58 -88 132 185 167 81 -216 61 69 -71 42 -52 -72 19 -53 158 26 43
7087 43 157 -77 -108 -179 38 47 77 78 67 -134 -255 -26 145 96 -86 18 -39 -48 36 33 -242 13 -118 -89 -20 261
7113 261 -119 -15 68 -111 -7 -40 -135 83 -69 -8 -24 -143 -35 -41 -83 83 149 -5 63 -75 -216 82 84 -256
7137 -256 92 -59 327 -42 88 184 19 -86 165 -97 56 130 124 -91 -76 -69 -179 -141 50 109 -53 53 168
7160 168 -89 64 -115 4 -72 -48 -217 -47 16 -194 51 117 -159 -46 -3 -123 -40 86 98 -156 -37 65
7182 65 -64 33 207 11 -109 53 196 60 -124 -18 -225 22 63 -100 -77 -128 15 29 -129 7 120 -9
7204 -9 -84 115 119 -134 -1 157 -7 3 -132 -184 4 -87 -171 -53 7 -23 -161 -123 127 -13 104 111 228 16 68
7229 68 -8 19 -159 29 -14 -33 32 91 -97 -153 -15 59 -177 -92 -163 -144 -45 85 45 -136 81 -331 -332 175 88 -28
7255 -28 -186 102 36 -196 65 -29 -85 147 173 -130 171 -69 56 -39 346 -156 -156 171 93 218 66 183 -76
7278 -76 247 -79 -104 157 -55 -88 -30 -42 4 14 -162 179 -15 -126 -82 -90 -33 38 -42 42 87 105 1 -31 -87 -38
7304 -38 -60 82 2 -57 -195 -48 -51 -40 230 -164 -151 112 -183 -239 0 -219 -138 27 -14 93 132 34 10 -78 -65
7329 -65 -131 248 6 -198 -80 -83 153 -31 -13 -3 32 -17 -11 52 48 9 57 -172 20 -133 -80 -128 5 49 10 222
7355 222 -64 -23 137 34 -64 -122 226 162 22 -108 -168 185 4 70 294 -147 -34 -51 8 246 120 -5 -66
7378 -66 -126 122 114 91 -173 41 258 169 -101 -134 -64 -251 83 -80 42 -148 -150 -46 -214 65 -33 55 -53 2
7402 2 -58 39 -36 -108 -164 -10 -96 160 -34 -220 -220 8 88 -31 -166 29 -46 -94 -171 164 56 -171 -88 54 42
7427 42 199 -136 146 -72 -19 -38 129 140 -3 -64 193 188 -90 -138 -112 372 -62 -93 -99 11 1 -119 10 -9 144
7452 144 -102 -248 263 191 -166 131 -414 100 302 51 265 -3 72 -106 112 -2 -158 -20 113 18 -97
7473 -97 -49 252 -13 173 119 -100 95 -172 -121 15 -26 -183 -65 230 62 30 153 246 143 -41 52 -12 -31
7496 -31 155 172 -110 77 75 81 -20 -280 -130 -286 -29 -47 114 158 140 142 -105 -88 339 116 -20 27 128 58 -256
7521 -256 -97 -83 151 89 -128 113 254 -155 -91 211 -112 21 -90 -264 -75 112 -218 22 175 54 -154
7542 -154 59 -137 93 2 204 189 139 27 243 157 38 -80 -165 103 -82 47 167 112 -171 -120 113 90 117
7565 117 35 185 -75 58 140 79 -19 33 34 -109 -59 -104 106 -67 206 32 -65 50 -243 -14 -101 186 -155 51
7589 51 -142 14 -178 115 139 243 -12 -107 75 108 211 104 278 90 -96 84 -96 -30 121 143 139 -204 57
7612 57 9 105 10 -277 117 31 -170 25 117 -96 73 130 -286 -176 49 -22 100 -70 203 172 -120 -61 335
7635 335 67 -71 90 -9 180 315 -73 -340 51 -11 -208 9 -160 -42 -143 161 70 -205 -9 -6 -59 -46
7657 -46 -33 -140 218 -23 -34 69 44 119 -139 5 31 -113 147 -10 87 -183 100 188 82 33 -71 -351 -460
7680 -460 57 62 -207 184 41 1 -198 -136 -3 279 -103 214 -202 118 95 -315 -125 -59 -238 89 -103 73
7702 73 0 -162 -57 -99 -212 -89 -36 150 -14 28 -97 -76 -123 -62 123 -288 -401 -133 29 -73 63 154 -74
7725 -74 4 30 -21 -146 -74 67 90 98 22 215 -76 -157 151 90 -212 27 -344 -307 -86 -136 17 -55 195 -49 66
7750 66 173 -15 95 -123 45 96 124 -30 -67 34 -72 100 122 29 186 3 -90 -1 -60 -115 -121 26 21 197 43
7775 43 25 7 170 -156 -116 -2 -167 40 125 -191 -252 -40 -41 136 -57 46 78 -101 31 20 -32 -112 87 -72
7799 -72 244 -54 -116 -47 9 -20 -167 -1 -75 -44 -205 -269 -81 35 167 70 187 144 -151 122 145 -121 -22 104
7823 104 128 -101 -106 149 122 -137 -44 103 78 -339 -230 -22 -137 -59 -121 -137 169 72 -82 -47 24 -221 95 133
7847 133 -122 -37 -19 132 39 42 185 -76 208 312 -127 201 -189 -59 117 -40 29 -35 -121 171 -9 55 221
7870 221 16 24 -56 79 204 -47 -107 42 -13 -91 -38 66 -3 -9 -144 -108 -114 -83 1 -4 -81 -327 25 -83 70 20
7896 20 -105 10 123 12 -154 254 135 -142 39 12 -219 34 122 175 75 64 -147 64 77 179 -135 -152
7918 -152 -111 209 174 101 66 2 -78 -125 96 -107 10 130 -72 -297 -94 -15 -150 30 29 7 108 -46 -72 86
7942 86 137 128 -217 141 130 25 216 -185 219 204 -296 -73 -8 113 -13 48 -78 -184 121 -108 116 -15 -84
7965 -84 82 184 191 16 77 57 -2 287 146 -26 41 -44 70 170 180 358 2 249 -76 -9 112 -10 8 91
7989 91 98 110 74 158 -136 57 -70 -98 -37 -76 108 -153 -186 107 147 -127 -169 -153 -51 156 211 -40 142 159 -175
8014 -175 -1 153 -27 36 -176 24 80 135 16 -70 -60 -2 19 314 65 131 55 -74 -253 90 13 -107 -42 -148
8038 -148 44 -30 272 -35 -58 107 174 111 -78 -74 18 67 -15 -94 -95 21 -2 -88 59 -155 -46 -235 -163 5 -56
8063 -56 254 51 122 1 167 177 -31 56 242 310 -33 88 35 -80 202 -27 -86 30 -103 -279 -63 -48 -111
8086 -111 93 -15 47 -66 20 -168 -227 -119 66 -172 -99 -116 226 112 168 68 13 51 -303 -148 40 -192 -50
8109 -50 -94 -145 81 -186 -188 -125 137 72 188 -17 261 63 -76 -216 -50 -200 -335 136 -64 -227 -163 -91 -131
8132 -131 -114 121 190 45 31 -156 -120 -133 53 143 127 184 76 9 -21 134 251 15 -132 -123 -20 81 -21 25
8156 25 126 -168 37 -137 83 -349 31 -158 55 -36 24 19 193 2 -34 290 -28 -151 -164 -13 -22 -117 82
8179 82 -172 223 -95 80 178 23 -243 108 134 198 -102 178
8191A78
$$ Imaginary data points
##PAGE= N=2
##DATA TABLE= (X++(I..I)), XYDATA
0 0 0 0 0 0 0 0 0 0 0 0 0 0 0 0 0 0 0 0 3 -8 8 -8 8 -8 8 -16 16 -16 19 -24 24 -31 32 -39 43 -48 53 -60 67 -75
40 -75 83 -92 102 -113 125 -139 151 -168 185 -203 223 -246 273 -299 333 -370 411 -458 513 -580 664
61 664 -765 894 -1070 1315 -1687 2309 -3545 6923 -36505 -96511 8741 61061 9356 -27725
75 -27725 -6241 6473 6248 16908 18684 -14580 -15987 14571 27413 6954 -17057 -11285 8488
88 8488 3738 -4319 3015 -2198 -14383 -5345 8949 1990 -16863 -3328 9332 -10312 -8599 14562
102 14562 561 -23004 -218 25719 1688 -24148 4559 27159 -2903 -17171 9111 23280
114 23280 3222 -15929 -447 15727 2573 -6779 1467 -1579 -7896 2149 9343 -8279 -21793
127 -21793 2126 17066 -6185 -16710 458 6476 -4247 -6192 3039 2175 -3930 3373 4649 -6175
141 -6175 903 14892 5397 -11542 -3319 20390 13909 -13429 -12260 10919 11878 -3798 -6140 -968
155 -968 -4892 -5084 8216 4808 -16066 -12346 8028 8220 -6211 -8816 -504 423 -1577 5161 5822
170 5822 -6746 -8917 6455 14627 2833 -8372 -1419 7191 5891 5423 1771 -8090 -4091 12213
184 12213 10997 -9407 -14555 3908 10301 -4667 -10405 -1730 764 -3449 -1958 278 -3489 -5367
198 -5367 1295 4995 -2900 -4674 3796 6106 -1746 -3472 6141 7636 -2431 -1347 7202 3906 -1981
213 -1981 1631 3449 -405 -1495 1929 -172 -5382 -1036 3094 -3638 -6937 -1222 2569 -1540 -7456
228 -7456 -2895 4079 -181 -4516 -589 2062 468 -462 3137 3072 -2124 1559 6758 1218 -1528 3303
244 3303 4049 -113 -1433 3336 2697 -3933 -2671 2061 294 -2495 -3603 -2408 -829 -2174 -821 -813
260 -813 -5040 -2767 2794 1697 -3410 -3980 3453 4653 -1739 -408 3458 1514 1631 3062 2255 858
276 858 633 3241 2205 -1664 86 1374 -656 -1635 -1929 -227 -840 -4498 -1560 1071 -2493 -3589
292 -3589 -1647 186 -619 -1850 359 -166 -1952 2415 3259 -772 -27 2474 3707 1781 -172 2329
308 2329 2443 921 1760 727 110 246 -851 528 -495 -3331 -913 58 -2462 -2319 -954 -870 -2500
325 -2500 -2185 1179 -521 -2854 396 1163 367 719 558 1439 1732 1587 2463 1500 865 2116 1945 1449
343 1449 -51 -753 1875 523 -2143 -884 -451 -1569 -1724 -1267 -1130 -2693 -1995 -97 -1545 -1830 59
360 59 -787 -792 521 703 1215 639 142 2264 2356 1738 919 958 2361 1758 899 1355 -280 -609 1380 788
380 788 -1608 -2330 -1026 -586 -1503 -1728 -1336 -2532 -1638 -194 -914 -1287 -925 -599 489 962 660 160 915
399 915 1354 1441 1810 1920 772 1099 2101 1000 186 1092 795 -840 -823 6 -23 -1358 -1852 -1958 -1439 -184
419 -184 -709 -2602 -2441 -722 -158 31 -255 -1513 -608 1723 2097 938 -418 443 2384 2876 1938 -38
437 -38 -47 2460 2174 315 -102 7 -694 -427 76 -523 -1822 -2287 -1090 -1038 -1273 -1634 -1883 -560 -808 -1345
457 -1345 -328 1239 -39 -1095 67 2153 2687 789 -24 900 1852 2919 1365 131 390 -39 1295
474 1295 2423 -408 -2584 -2591 763 2290 -1346 -4074 -2880 -211 1244 -1235 -3478 -1648 87 121
490 121 608 -386 -864 -487 1736 3450 914 -656 947 2054 2376 1329 -267 1295 1898 -330 -740
507 -740 533 730 -1054 -2829 -407 413 -1087 -1587 -2432 -1864 -101 -616 -409 -441 -1961 -1535 837 2400
525 2400 964 -2589 -654 3496 2919 779 -612 90 2436 2554 1241 126 -894 171 812 804 381
542 381 -2522 -2428 1065 217 -1922 -2681 -1570 242 -480 -1941 -1014 -399 -362 -1116 -869 1953 1624 -720
560 -720 -229 1327 1861 1569 551 1176 695 434 1837 1826 -344 -1796 -1117 1586 1703 -2365 -3182 -1175
578 -1175 475 431 -1658 -2482 -1065 -1034 -178 72 -886 -1501 -679 1566 2467 -318 -1249 880 2424 2452 520
597 520 -335 1109 1674 1300 201 92 998 -146 -1211 222 -186 -1356 -729 -417 -724 -1599 -1160 -258
615 -258 -1184 -1661 -944 510 1001 -159 -1615 498 1820 1409 426 263 1017 1379 1550 1106 237 45 1240
634 1240 924 407 208 -991 -826 130 584 -1298 -2121 -1109 -155 -992 -927 -998 -1218 -651 -239 -550 208 29
654 29 -364 632 1563 907 211 1086 1532 435 673 1746 1105 187 419 495 387 -102 -219 -778 -695 -160 -398
675 -398 -1440 -1577 -898 -622 -409 -932 -1259 -611 64 -10 -169 56 152 442 1342 895 135 822 1589 1122 589
696 589 1012 1052 31 433 712 -134 -275 -519 -462 -758 -1080 -906 -602 -1294 -944 -820 -439 -489 -1145 -273 35
717 35 -546 -113 629 637 554 415 891 1263 811 1257 793 473 994 778 446 109 -110 348 90 -854 -608 -552
739 -552 -838 -1188 -1305 -368 -891 -1101 -316 -369 -1000 -74 -27 -83 319 379 769 593 245 1268 962 1066 1110 901
761 901 1055 448 119 701 151 -267 -49 -352 -670 -793 -958 -368 -1008 -1312 -602 -663 -840 -458 -796 -110 -261
782 -261 -72 799 89 587 834 474 976 1171 503 1187 782 422 1199 660 173 209 139 168 -502 -632 -48
803 -48 -1104 -828 -207 -1189 -1064 -383 -734 -548 -755 -140 149 -552 4 391 271 631 784 717 1032 487 979
824 979 1127 480 600 641 494 308 -64 -117 43 -765 -456 -261 -1003 -704 -919 -943 -584 -972 -546 -693 -349
845 -349 -21 122 -214 375 105 858 909 391 537 666 799 1134 680 788 639 65 321 185 -268 -282 -290 -670
867 -670 -521 -861 -565 -978 -1026 -793 -755 -526 -644 -533 -62 -402 -75 196 420 302 575 1093 910 524 797
888 797 1139 813 668 932 219 -143 486 417 -111 -620 -499 -703 -488 -672 -777 -1118 -697 -733 -242 -423 -487
909 -487 -683 73 245 -79 146 521 589 198 570 896 716 641 943 511 700 746 410 182 128 -113 -41 -324
931 -324 -701 -526 -630 -726 -533 -540 -983 -1044 -698 199 -428 -735 -285 355 415 311 695 103 322 613 1197 783
953 783 578 656 890 1019 555 -62 -250 486 -202 -377 -102 -604 -971 -641 -489 -778 -788 -783 -776 -1015 -126 38
975 38 -379 8 486 81 123 958 691 77 162 1282 1276 394 105 238 632 669 -114 -74 471 -462 -467 -168 -116
998 -116 -1065 -1340 -213 -115 -1033 -993 -566 -437 -99 -229 -112 -79 303 540 245 271 934 556 493 899 928 582
1020 582 411 367 552 329 -215 85 137 -664 -825 -672 -150 -734 -1498 -483 -284 -709 -646 -794 46 -249 -427
1041 -427 530 -44 -206 370 940 913 342 296 927 703 411 833 27 -14 610 214 -164 -334 -319 21 -740
1062 -740 -908 -269 -948 -1057 -489 -127 -442 -645 -399 131 -13 -279 213 512 371 -50 615 1120 591 410
1082 410 866 460 249 559 496 183 -252 121 171 -364 -439 -384 -482 -455 -468 -466 -642 -998 -457 -125 -430 -604 -135
1105 -135 112 -6 22 556 510 32 514 816 636 403 601 875 526 29 359 533 3 -143 113 -84 -371
1126 -371 -491 -345 -485 -863 -491 -334 -727 -591 -173 -59 -250 -274 444 187 26 480 688 322 165 336
1146 336 848 427 334 750 421 89 235 232 308 -419 -225 175 -210 -538 -535 -263 -581 -758 -528 -113 -683 -384
1168 -384 -220 -437 -256 124 484 597 216 834 615 208 331 636 581 396 267 478 308 -153 26 -34 -477
1189 -477 -520 -333 -392 -454 -937 -152 -453 -722 -516 -119 -421 -432 -78 310 -213 -141 418 585 474 196 462 600
1211 600 589 474 622 393 117 101 243 -44 -215 -276 139 -325 -692 -537 -348 -691 -612 -354 -362 -736 -354 -280
1233 -280 -271 -56 293 162 182 39 305 531 502 451 886 645 343 274 443 356 -50 308 113 -487 -367 131
1255 131 -64 -734 -685 -363 -602 -675 -410 -260 -624 -398 -77 11 109 169 89 276 221 11 762 223 534 471 736
1278 736 623 358 378 263 0 6 203 -16 -368 -535 -204 -531 -391 -591 -515 -673 -413 -255 -292 -260 -192 175
1300 175 107 -50 236 407 386 60 602 619 267 108 466 521 409 126 157 109 -133 -267 135 -151 -506 -514 -421
1323 -421 -438 -764 -359 -357 -456 -164 -220 -237 -133 -133 334 120 225 367 503 287 312 825 557 154 47 389 600
1346 600 347 34 214 -100 -162 -176 -317 -362 -645 -596 -250 -393 -596 -401 -394 -380 -83 -113 -63 -292 133 432 114
1369 114 292 653 192 417 351 583 460 234 296 110 212 180 -127 -103 -72 -230 -208 -287 -650 -534 -481 -485 -275
1392 -275 -355 -436 -276 -219 47 294 -3 290 287 273 306 607 580 285 379 476 414 240 69 103 201 116 -517 -127 -356
1417 -356 -377 -525 -378 -327 -740 -536 -348 -375 -354 -250 -298 43 -58 -26 195 -111 350 464 371 550 768 478
1439 478 302 440 241 290 -26 205 25 -127 -160 -121 -201 -466 -603 -388 -491 -443 -655 -231 -340 -132 -291 -205
1461 -205 132 8 346 95 254 177 390 501 426 491 438 471 216 65 158 372 180 -75 34 -289 -560 -215
1483 -215 -694 -689 -562 -405 -362 -643 -559 -387 -449 -49 -191 165 478 11 441 392 321 306 670 476 215 651 443
1506 443 278 81 358 -41 -148 14 -63 -356 -283 -115 -453 -216 -441 -322 -350 -518 -228 -398 -82 -32 282
1527 282 170 178 128 121 467 248 155 494 727 334 98 221 276 65 285 14 -250 -175 -311 -258 -394 -399 -436 -345
1551 -345 -375 -424 -403 -403 -476 -212 -125 132 93 167 -10 416 183 307 788 335 163 428 283 275 58 194 211 8
1575 8 -88 72 -186 -210 -88 -359 -75 -552 -360 -275 -356 -305 -102 -314 -83 -222 147 312 394 399 445 441 413 490 453
1600 453 340 206 469 518 44 215 219 136 138 -327 -196 -340 -400 -217 -142 -398 -331 -313 -552 -387 -413 -105 -67 -102
1624 -102 153 280 59 187 111 257 203 225 325 435 433 241 289 341 239 187 11 -26 -321 11 -463 -574 -529
1647 -529 -262 -218 -376 -439 -168 -337 -310 177 -61 21 -74 326 219 390 164 480 482 311 296 565 339 228 -38
1670 -38 169 82 -165 -227 -223 -259 -486 -278 -116 -743 -304 -315 -192 -580 -280 -311 -18 150 -150 280 228 370 261
1693 261 343 289 297 482 312 428 201 694 129 7 41 -22 -80 -297 -145 -173 -435 -68 -241 -460 -123 -301 -50
1716 -50 -202 -530 -461 87 -114 -57 210 -189 378 -60 351 270 174 230 447 286 97 -33 168 103 -5 -145
1738 -145 -310 -9 -575 -249 -334 -239 -342 -391 -515 -258 -336 -257 -232 -262 -8 -8 4 41 200 6 180 456 346 256
1762 256 305 398 114 276 120 84 -75 44 -131 -130 -241 -327 -393 -456 -250 -352 -182 -231 -130 -148 -92 -160 -307 -268
1786 -268 155 -169 216 286 328 121 314 576 322 51 225 397 493 93 -160 -89 10 -274 -60 -138 -364 -243
1808 -243 -371 -378 -79 -422 -40 -464 -300 110 -42 -19 176 236 320 279 80 473 288 426 343 318 319 308 170 311
1832 311 63 105 185 -79 -367 -224 -220 -269 -450 -424 28 -223 -486 -205 -171 -284 -347 -334 124 -31 250 246 94 193
1856 193 288 489 166 259 109 374 344 213 204 -304 -37 -157 -252 -118 -307 -210 -2 -463 -335 -348 -302 -483 -402
1879 -402 -65 27 -292 -57 203 252 166 251 422 255 229 265 501 478 159 207 267 303 170 -28 -49 -98 17 -266
1903 -266 -18 -260 -108 -262 -275 -182 -185 -257 -117 -145 -170 71 4 -16 226 211 276 178 115 254 183 35 347 134 204
1928 204 276 33 75 -144 -12 160 42 -153 -275 -463 -390 -316 -404 -194 -389 -204 18 -187 -128 185 -124 -167
1950 -167 73 269 180 425 302 379 158 205 250 -76 94 170 -42 -192 -148 -99 -272 -181 -230 -211 -531 -165 -474
1973 -474 -71 -77 -205 -71 56 -41 -28 -120 -103 41 303 401 340 213 184 308 248 82 113 52 238 -79 -84 45 -111
1998 -111 -160 -204 -101 -271 -362 -217 -493 -55 -45 -397 -16 -270 -179 9 -138 -120 -157 177 159 271 388 263 210
2021 210 222 181 121 16 409 -187 -127 -82 -269 -9 -304 -129 -178 -456 -374 52 -366 -163 -294 -187 116 -110
2043 -110 56 -25 1 164 230 218 496 203 225 237 174 286 233 329 378 133 224 117 -115 -186 -247 53 -435 -166
2067 -166 -414 -277 -300 -251 -306 -256 -16 -280 11 190 -114 87 291 -35 228 255 267 260 365 316 96 168 352
2090 352 40 49 158 7 -131 -135 -207 -173 -135 -273 251 -358 -441 -138 -34 -86 302 48 10 -213 83 348 69
2113 69 443 37 217 321 225 279 339 230 166 216 -191 141 96 -2 14 -305 -296 -54 -233 -344 -399 -427 -55 -179
2137 -179 -271 1 -164 -185 -17 82 -61 153 104 332 164 -185 304 161 166 190 380 6 -168 177 33 -307
2159 -307 144 164 -8 -209 -272 -277 -169 -516 -183 -164 38 -193 -66 134 -60 -249 -32 122 -8 448 197 252
2181 252 235 259 225 224 166 295 80 40 -10 -35 -117 -302 -33 -73 -233 -210 -104 -314 -261 -127 -181 -241 -1 -153 -160 10
2207 10 -55 48 213 104 118 366 548 164 156 195 259 74 -69 -56 44 -59 -97 50 26 -354 -229 -322 -236 -31
2231 -31 -263 -172 -240 -255 -121 -114 37 -74 203 -117 -187 242 326 157 93 408 190 136 95 162 -58 -31 171 -400
2255 -400 18 -48 -40 -143 -171 -505 -195 -231 -285 -410 -180 27 -154 -76 22 -306 -69 115 210 93 174 307 62
2278 62 194 10 120 277 8 28 -50 263 14 40 21 -159 -136 -178 -239 -285 -143 -209 -45 -199 -439 7 -381
2301 -381 -204 -41 222 -74 -85 110 90 215 76 209 -21 204 65 222 126 247 -59 29 -193 -195 190 -78
2323 -78 -410 -369 -122 -67 -112 -246 -57 32 156 -50 53 -407 -225 497 -50 110 282 41 155 500 247 158
2345 158 18 414 264 47 90 132 76 -284 -50 -131 109 -277 -30 -256 -188 -325 -386 -132 -196 -158 -23 -22 201
2368 201 101 58 199 252 186 96 29 147 103 347 175 222 102 -19 -65 -157 47 -289 -215 -126 159 -164 -178 -272
2392 -272 -212 -185 -378 -198 -309 -54 23 83 -156 257 -117 101 313 259 236 454 116 236 15 213 40 9
2414 9 421 149 115 -148 108 -235 35 -154 -157 -184 -223 -316 7 26 105 -7 -198 60 -40 396 186 198 187 -30
2438 -30 194 302 224 264 46 84 64 139 161 -37 40 -175 -30 -178 -341 -286 -101 -36 -59 -384 -277 -134 -184 -8
2462 -8 -121 104 197 -281 -157 297 -205 94 57 290 185 175 26 246 84 237 146 -125 72 -121 -11 -169
2484 -169 1 -64 -312 -133 -55 -229 -247 -106 -72 -63 -70 256 -5 -140 151 -208 250 174 172 515 185 219 2 42
2508 42 -2 108 2 129 -81 -8 64 79 -6 -260 21 -58 -103 40 -204 -82 -122 -107 -22 -144 -19 -116 99 36
2532 36 -55 100 230 113 125 32 200 -4 116 180 41 180 -90 12 -124 -152 -317 -180 -163 100 256 -258
2554 -258 -324 -291 -116 133 -83 51 -234 -35 184 -180 -120 26 360 167 385 129 177 394 260 116 29 192
2576 192 352 -27 -188 -18 -305 -26 6 -236 35 -15 -263 -30 37 -73 -189 -82 -21 91 -78 69 93 117
2598 117 263 65 313 220 -88 258 84 278 36 -19 -95 62 42 151 105 -170 -39 -176 -171 -189 -225 109 -213
2621 -213 -57 116 -18 -38 34 45 241 54 358 189 -147 415 183 -91 395 241 -30 309 83 -104 97
2642 97 100 108 30 -96 11 31 -214 -190 -127 -28 -323 -252 -119 -84 100 -79 7 269 43 190 -227 -255 331 111 148
2667 148 161 -169 44 306 -64 -16 -67 -51 134 157 -76 -2 -30 4 -153 -255 -165 -257 68 -128 -156 -104 -39 -243
2691 -243 23 -14 0 121 141 261 50 -24 132 113 165 147 114 -231 139 30 -71 116 -22 144 -239 -147 -99
2714 -99 -109 -274 -145 -77 -157 -42 -5 -150 41 114 -15 -104 72 239 431 265 403 -56 258 287 80 110 -171
2737 -171 44 -85 -14 83 13 251 -146 -76 -257 -261 -598 -174 -146 -227 67 41 -18 -92 182 147 149 100 200 18 130
2762 130 233 296 171 -182 -110 73 56 -34 18 52 -422 148 40 36 -150 -75 -23 -186 -254 -275 -36 -123 -31 27 134
2787 134 52 33 -67 48 -40 1 91 153 240 208 142 160 175 43 123 -14 -14 -77 -390 7 -130 -30 -80 -271 -83
2812 -83 -406 -138 -130 -251 81 14 -10 66 -60 273 165 179 174 5 307 170 121 57 -44 327 195 106 -5 177
2836 177 56 28 20 -223 79 -164 54 226 -235 9 -15 -74 -112 -113 -53 124 265 34 -90 68 311 107 57
2859 57 66 154 129 -149 -11 -50 80 -46 247 30 0 -54 202 -117 -96 -39 -226 -103 -109 -179 11 99 -85 -102 72
2884 72 58 92 199 -201 -22 -41 174 86 37 331 356 20 297 188 92 134 204 294 -96 -297 133 63 -6 -93 -262
2909 -262 -198 -186 -351 -179 110 -189 30 264 105 -19 103 7 -75 -33 239 -26 33 123 94 80 -183 91 50
2932 50 141 23 -168 -30 10 -231 -212 55 -90 -233 -59 -152 -171 -4 -190 20 -9 -22 35 71 84 225 174 167 -26
2957 -26 118 271 351 206 19 41 -31 -162 129 136 165 -106 -195 -189 -93 -62 -128 -353 -122 -83 -248 25 -39 31 -104
2982 -104 25 41 -53 21 19 286 38 118 176 92 163 32 98 34 290 9 -27 64 -153 -11 -54 22 -8 -76 -74 -33 -29
3009 -29 -163 -168 -8 14 -33 252 -66 100 254 -74 211 16 -59 -82 11 0 232 141 -145 65 -58 98 -141
3032 -141 -80 -18 61 -150 -70 -149 -24 -25 -23 -12 -40 -174 -322 139 11 -111 269 197 238 182 127 250 264 167 137 15
3058 15 -115 70 112 287 53 -310 40 -352 -267 179 127 62 -350 261 -57 -6 38 92 62 25 139 -163 219
3081 219 62 -222 -10 162 -150 116 -86 -81 109 -37 -94 79 110 158 -274 83 -22 49 51 -94 110 244 -133
3104 -133 -311 -240 93 -6 -74 -37 -115 -32 -35 257 -17 -26 -40 109 -101 6 34 165 -15 -115 147 -37 -121 71
3128 71 -7 -216 217 -16 262 18 -42 -146 101 -302 -40 29 74 61 -55 48 -52 -212 -8 176 165 149 -79
3151 -79 97 146 0 105 111 -1 95 9 155 11 -65 -344 -22 46 98 -83 -49 -268 -250 207 -278 -92 -145 185
3175 185 107 -162 27 172 118 12 206 51 16 -41 59 240 150 372 -80 113 94 -238 139 -24 -233 -56
3197 -56 24 138 -277 100 23 171 -163 -6 -117 81 70 -6 84 36 107 107 200 233 -132 56 51 -34 -145 123 198
3222 198 -194 -138 -239 -21 -213 111 -19 -67 39 -57 -182 -196 8 -229 -180 -184 -249 -63 148 118 303 178 69
3245 69 73 111 80 -92 17 -38 212 32 -25 -80 -118 -114 -78 33 70 108 -37 90 58 -7 68 -192 -71 -159 -60 95
3271 95 -162 29 -181 -255 4 112 92 0 155 -13 114 195 157 231 -13 12 -172 107 165 -184 141 -261 -156
3294 -156 -158 -217 117 3 -75 -28 -339 -143 97 -191 252 36 -178 29 60 219 243 198 183 62 56 50 -47 99 -143
3319 -143 17 -137 12 -121 144 137 138 -542 -362 -11 -23 83 -349 -288 -19 106 35 33 272 71 33 -66 127 231
3343 231 -1 147 -219 92 133 -54 33 -150 2 218 1 -36 -82 -116 -71 -287 -136 -126 -118 -202 -110 -21 -29 60 321
3368 321 -125 -21 121 197 -119 -116 -15 118 73 296 166 219 197 -127 44 -158 -176 35 -27 -152 -33 -243 -142
3391 -142 -27 -8 -39 -11 217 113 100 25 -84 -70 -162 -131 -201 169 228 501 -51 263 -56 59 154 -28 88 359
3415 359 -330 34 -88 -1 -157 -106 -69 29 161 -213 -109 -36 -187 -156 135 -201 -128 -65 156 -32 30 61 151 207
3439 207 -13 204 105 204 89 19 65 235 -117 42 -95 -77 124 -22 -187 206 12 51 150 -235 -69 -43 -229
3462 -229 -98 -95 -165 -65 45 28 82 160 196 -230 217 54 248 -170 109 158 165 -60 136 105 -31 -124 -134 -109 -15
3487 -15 -54 -52 -124 0 -1 -18 -228 -197 -159 -77 46 -90 22 -356 -68 -209 116 81 -172 179 112 -12 -117 -20 76
3512 76 232 -279 152 164 46 -68 123 -60 -25 -40 -112 -47 -138 -137 -275 -43 -25 207 -332 -69 65 18 -13 14
3536 14 174 239 164 125 48 127 110 66 109 -57 272 56 149 -164 67 37 72 18 -45 -243 30 -35 -174 -242 69
3561 69 40 -124 62 -62 -81 -159 170 91 217 -198 66 246 90 -57 -21 9 118 54 57 -44 -251 -242 25 -178
3585 -178 22 -223 -7 84 39 44 123 -312 -37 -40 29 -33 -66 -217 94 203 -126 190 27 268 88 297 47
3608 47 142 98 -113 -227 -109 0 -119 -178 58 -153 -89 -98 244 -49 3 -50 -48 -33 -137 -173 -100 147 -13 6 -92
3633 -92 74 179 230 -167 344 -76 67 -14 85 -8 -131 -8 155 317 -97 156 109 -43 -200 -50 -38 -136 2
3656 2 -59 -17 -40 -111 26 -156 120 159 -5 86 5 113 -192 -16 146 141 175 -101 -151 -19 84 -149 24 -157
3680 -157 -243 -199 -35 -113 -200 35 -234 -22 -60 -173 -277 51 28 -28 217 -26 -158 108 -7 202 148 5 121
3703 121 -90 119 -59 19 -110 -51 85 -65 15 -182 -33 -59 -62 -138 -125 -185 124 -257 29 -29 93 -122 -81 -127
3727 -127 -379 111 -61 16 188 111 59 -228 203 246 98 -45 183 290 40 -106 -132 264 95 37 122 152 88
3750 88 29 -203 -57 -168 -209 31 183 74 123 54 -103 78 240 181 -49 146 27 -134 250 -190 -65 -156
3772 -156 -17 -135 195 99 -224 -44 14 50 -34 -151 270 7 -126 -104 -44 -3 83 -399 -128 147 -66 -61 -32 -6
3796 -6 -16 299 248 -6 -99 99 -3 -34 328 55 -1 -109 64 -175 27 -134 -162 130 -33 -174 -5 -90 180
3819 180 87 -81 234 119 -96 -102 -73 231 125 72 105 82 -208 103 42 25 0 -204 211 -56 -83 2 73 -96
3843 -96 103 80 -58 -315 -42 -149 -145 -73 57 -180 39 144 -78 -305 -42 -99 -9 59 237 -5 -83 79 -123
3866 -123 -121 106 -16 -111 -133 -28 -60 -120 -1 139 -14 51 -1 -178 -51 -128 -165 -15 -67 88 -3 187 80 -16
3890 -16 123 -172 92 56 175 68 50 -15 44 142 252 98 98 168 -126 166 105 -127 83 -49 38 -90 -106 -103 132
3915 132 134 -20 -72 169 -97 126 135 143 104 227 206 -65 -71 251 77 11 172 40 212 60 93 -6 -77 -104 140
3940 140 -5 -185 152 -139 -181 43 -284 -96 -40 -195 -139 -57 145 -149 224 141 168 16 118 93 -39 -14 141
3963 141 65 102 39 277 -83 123 -195 6 -113 86 96 47 149 -85 -56 -152 -96 -41 -105 -1 21 -126 42 122
3987 122 -60 -141 -3 72 24 -187 107 225 74 34 -4 35 -347 58 -28 -59 -376 -64 248 -148 -14 39 93
4010 93 230 -484 -108 -199 236 -252 -73 124 70 112 -396 99 98 16 -196 111 150 -10 -90 88 -75 -46 311
4033 311 29 91 -4 -187 -5 -116 -78 304 -77 -298 49 -205 212 26 34 -60 -70 -198 235 -218 113 123 -106
4056 -106 178 -220 -131 318 -28 61 148 -45 -34 103 57 -5 -134 -21 -119 -75 -222 -67 255 -97 -3 57 -13 131
4080 131 -128 -178 -51 57 142 -105 142 1 3 5 120 275 -75 63 -86 249 214 73 204 126 202 -102 201
4103 201 124 -102 152 -66 -58 -206 242 50 128 -353 -108 107 -209 88 -23 144 11 -27 -39 -125 42 -100
4125 -100 237 -10 106 83 -34 57 -157 48 99 319 20 203 -196 -94 72 -83 -40 -17 119 160 -1 22
4147 22 -142 68 65 78 39 -24 -176 -42 -65 19 59 82 149 29 -86 -43 55 -232 60 167 29 50 264 -160 -199
4172 -199 -97 354 73 -80 47 -123 69 -199 -56 -102 23 -131 230 68 287 -39 214 53 1 -110 191
4193 191 182 -141 -167 -155 211 -39 51 -200 -58 42 144 -121 -39 -155 68 -6 -150 -43 -14 45 143 149 -16 112
4217 112 105 102 189 295 177 -177 110 -48 -161 -37 106 39 -44 -89 129 210 -222 9 19 -190 -47 -32 -27 336
4241 336 -35 -73 -37 166 126 315 1 163 50 -9 69 -54 -43 122 37 157 51 -140 -100 37 277 105 -38
4264 -38 -56 -210 134 -18 -105 43 157 -186 -235 117 84 -17 -19 -137 88 86 163 72 4 -86 -61 13 -259 -165 -126 84
4290 84 -47 -74 -79 -156 -232 -52 -61 40 -95 93 -30 -174 -2 32 28 106 -233 15 237 9 124 18 -73 -45 -27
4315 -27 116 86 -39 33 78 298 -47 -37 6 76 -101 83 201 103 -75 -191 -225 -41 -151 -170 -130 78 149 -11
4339 -11 121 134 73 152 79 105 -68 88 296 47 -10 23 -22 91 116 -148 99 -36 -156 136 129 -79 283 -46
4363 -46 114 -152 156 114 -154 -31 110 93 -114 -97 -75 -112 0 -164 247 38 97 186 -106 281 91 81 -73
4386 -73 -35 98 101 46 -202 72 98 376 -92 123 -103 28 36 71 -57 102 -135 -116 23 -121 51 199 245 118
4410 118 -62 94 -42 -21 106 -36 194 -56 -7 -73 -180 -165 -235 193 44 -130 22 45 -11 104 -22 -167
4432 -167 15 18 -38 -154 345 -105 -4 253 35 -36 -58 48 77 66 -22 34 52 -12 -11 0 117 40 96 -31 199
4457 199 43 -53 15 -4 -58 -61 -110 141 9 93 -91 54 149 -27 177 -249 -21 -116 18 45 216 -110 24 -111
4481 -111 116 -245 202 -46 -175 35 -94 38 26 116 61 57 -234 85 123 258 -44 -380 -104 -21 -1 101 -128
4504 -128 -145 137 160 98 60 60 -40 107 12 69 -85 -64 14 77 -64 -3 19 43 135 -69 -37 138 76 -91 70 -320
4530 -320 119 69 37 87 169 -26 56 21 -37 -52 -276 263 -371 -82 129 237 34 -87 58 -27 -120 116 226
4553 226 185 171 -57 -77 77 248 -53 298 72 -75 -95 7 -31 -83 87 -191 -83 287 -46 -91 65 -93
4575 -93 279 208 89 252 38 200 -175 9 -89 51 -23 183 -72 86 15 69 -101 -33 -66 56 -28 273 -73
4598 -73 -41 -27 3 -21 29 29 170 -252 52 -218 -70 -213 -297 233 122 3 112 -147 -6 -52 268 -181 33
4621 33 60 -129 189 153 -212 -174 -143 -344 -52 28 212 -107 -63 13 102 -115 41 -164 -36 -32 -71 29 -77 30
4645 30 45 183 -130 37 35 -138 80 -247 116 108 118 9 -153 128 -42 125 -223 -59 -32 70 -142 -279 -149
4668 -149 -58 208 12 -5 132 5 -20 2 -333 24 23 115 60 -124 -12 -248 18 -193 15 88 -144 121 -107
4691 -107 0 102 42 3 72 -44 108 -122 21 34 225 -192 47 226 -56 -1 -119 -164 -35 -9 132 67 -16
4714 -16 -115 -114 79 -14 181 -158 -77 185 -49 101 -105 118 -86 -27 -227 -94 -45 23 -50 33 141 -251 -252 111
4738 111 271 -201 -243 118 66 71 229 -110 -192 -193 42 132 40 -90 -29 173 -106 -116 -93 -16 12 -76 390 49 -26
4763 -26 179 181 -70 198 -60 352 94 -32 237 -10 73 -76 31 -7 77 -193 20 -181 -16 -318 -222 -132 -52
4786 -52 238 -35 -66 28 64 34 6 -110 -142 -85 -136 -60 202 45 -43 -22 78 71 -98 -79 -42 219 -48 54 -137
4811 -137 156 63 -58 43 -295 -39 -100 -172 -131 134 18 -151 137 68 -57 43 -145 90 -77 -153 -77 47
4833 47 -204 56 87 -29 -174 -85 67 -187 -62 53 -92 -135 -73 -39 -13 -17 118 68 -46 -121 -14 77 53 -38 29
4858 29 121 51 -36 217 -83 -133 71 -59 -270 -86 -70 37 184 -235 4 -37 51 14 -7 -169 -16 -195 11
4881 11 -246 53 110 -100 139 296 44 -32 -123 137 -25 -232 -75 71 148 76 17 -172 124 -285 -219 -110 -83
4904 -83 -121 -133 -56 4 140 252 234 -78 -24 49 32 -75 198 -85 -59 -237 -34 -155 87 11 -132 401 18 -221
4928 -221 123 -50 -116 14 -33 -179 133 -299 -1 -73 -31 -33 89 291 232 155 69 -244 -306 -14 159 -136 44
4951 44 266 144 -81 242 -109 43 -128 30 19 84 30 -26 -36 -52 166 -144 111 259 159 -31 -262 -49
4973 -49 -155 -47 101 228 -218 70 14 53 -131 104 181 44 15 -299 -139 93 -161 35 45 131 32 67 -160
4996 -160 -35 45 -29 296 -3 132 -185 -24 -124 -51 11 157 106 -199 -133 -206 220 -76 -89 83 120 41 254
5019 254 -150 -8 30 200 57 -151 -218 214 -60 -33 175 158 47 117 -285 87 34 -87 61 56 118 -29 57
5042 57 36 -51 200 -63 -134 -14 19 -16 -63 -79 -88 151 79 8 -21 -161 -146 -19 117 50 -121 63 -152 86 -228
5067 -228 -175 -105 -79 -16 12 145 -114 15 -18 51 21 36 131 -4 228 -49 -134 -16 -5 88 31 238 284 55 21
5092 21 -13 -35 -13 -105 188 93 -143 145 38 -167 49 32 -151 25 9 299 -26 13 55 23 -59 -133 -23 89
5116 89 32 111 156 -85 0 101 -293 195 -276 -21 -106 187 -121 69 -46 -144 253 -26 114 -367 55 9 80
5139 80 -200 -145 -243 102 7 29 85 56 -9 271 29 17 147 -61 118 -71 364 93 -98 -172 38 -170 -85 45
5163 45 129 -204 -1 -222 -130 -8 64 -160 -106 219 -23 9 -32 66 -201 35 135 151 33 -84 -122 -34 -17 85
5187 85 218 18 -153 -96 -247 220 -92 -480 340 -198 170 -246 -137 -215 -37 11 113 117 57 -235 -120 -74 -73
5210 -73 -75 -263 -29 -144 -275 -292 -73 231 29 109 -87 200 -181 -12 67 -14 -175 7 -61 9 209 246 99
5233 99 224 130 -61 55 61 -96 -171 41 251 7 -51 211 34 108 44 221 37 161 -53 218 -164 149 107
5256 107 -241 142 -14 -183 -85 100 40 106 -74 12 81 -220 136 3 -184 35 -117 5 -190 8 45 287
5278 287 32 -273 223 -36 -5 -144 -160 39 -71 196 -5 86 -404 -167 -145 -214 -166 98 20 152 86 -190 -82
5301 -82 151 22 -3 -139 -26 -77 -146 77 -30 -62 -24 -172 15 9 -29 -48 35 109 -61 -227 -240 -41 -38 -4 104
5326 104 -154 -316 57 45 69 94 112 -193 -75 204 130 6 58 153 -20 414 -19 -47 32 -111 4 -220 166
5349 166 -214 12 -145 -50 119 44 91 -204 62 -10 203 -60 87 -186 71 102 -41 0 223 -142 35 -24
5371 -24 239 49 49 40 -88 -24 -34 -105 192 164 -41 81 -318 -241 23 40 2 254 -107 -153 123 11 134 -178
5395 -178 -102 153 -19 -100 -34 -128 -60 56 -40 166 -17 41 111 219 -158 -279 71 -121 236 -73 74 -218 -86
5418 -86 -36 98 5 -129 -21 69 -76 -73 105 -210 241 93 45 51 27 -11 79 50 -52 -31 -214 98 64 -75 -93
5443 -93 -25 -160 -155 163 -152 147 -252 -26 49 123 -6 -191 78 21 -41 -31 -154 -147 -46 61 288 -47 -280 88
5467 88 -147 308 36 68 113 122 71 -172 71 279 26 42 17 -38 -51 -113 -139 -33 -158 -156 -99 -42 -71 16 149 -159
5493 -159 -108 138 0 47 -99 22 245 -45 -75 -107 -19 -78 306 -90 -79 211 -200 -63 -191 40 -147 212
5515 212 14 6 166 -136 -34 4 -266 18 109 -236 -230 201 55 -51 73 39 -58 2 -133 25 -88 -124 107
5538 107 -123 74 87 16 154 47 78 0 179 -52 -87 46 72 42 -110 1 112 41 73 53 285 -198 -64
5561 -64 102 149 -50 -63 -116 20 -181 178 -48 -123 -13 -86 -119 -51 232 -183 -136 -73 52 30 -73 21 37 -115
5585 -115 244 -241 -90 190 -28 208 -20 -120 208 175 22 174 -260 37 116 74 -42 -209 -56 134 110
5606 110 -39 165 -115 -224 74 -43 -41 -88 -15 123 3 213 323 -28 0 -179 130 178 -366 68 74 -11 89
5629 89 135 -96 -158 -13 88 138 -174 -8 -14 -220 -18 -170 72 -158 -96 15 10 106 70 -25 -152 117 111 151 -40
5654 -40 -16 -62 -101 144 191 243 -40 6 -235 -13 132 -47 47 -50 63 24 -57 167 100 -58 115 36 59 -103 -62
5679 -62 133 157 -207 93 93 189 1 245 -149 -8 -182 63 33 -191 -94 43 -123 -157 -15 -105 -123 -175 -92 -45
5703 -45 19 -1 -37 82 60 56 -246 -33 -148 -212 -44 -134 145 58 130 177 20 -78 170 64 156 68 -60 145 149 -223
5729 -223 -217 132 161 158 -45 193 10 -172 -138 54 -85 5 108 173 -1 18 113 28 56 -87 193 51 -54 245
5753 245 -101 200 104 97 47 -93 95 1 -62 84 183 69 65 23 -201 -183 115 47 -206 -85 -41 27 -184 -137 -197
5778 -197 -144 80 23 -82 -173 -32 150 0 -111 -88 -321 -128 200 70 62 -61 -116 -104 306 -74 -80 12 179 -92
5802 -92 -2 13 -43 -46 11 -107 324 -57 136 -48 18 45 149 4 -210 -3 -102 -83 78 36 44 -9 -30 -176 74
5827 74 -130 182 -44 188 11 35 -164 45 -97 -26 -96 -69 39 -111 131 -103 197 -16 -84 157 -125 159
5849 159 194 111 -49 23 86 -48 146 -75 -44 -18 154 321 -224 1 114 -16 77 27 -79 -220 102 -199 -33
5872 -33 -120 149 -183 54 -64 29 138 -36 83 -179 -86 100 87 71 75 39 -43 -344 -17 -296 -214 334 33 123
5896 123 -129 -212 -4 158 -167 -1 -200 -138 171 101 -161 -111 -17 -125 -202 115 98 -138 51 -48 13 141 104
5919 104 -120 -9 2 11 -351 155 81 -222 -16 99 62 43 74 8 48 -182 58 -23 137 -34 -135 199 93
5942 93 238 -162 -129 54 62 52 -186 -163 -25 -261 -94 130 -56 -128 -4 166 -190 138 -41 114 -121 -121 3
5965 3 -59 -71 55 -165 -161 3 -2 -78 -119 63 -106 -41 -182 127 20 64 43 -5 123 -295 127 144 -67 -176 -122
5990 -122 -89 -54 -91 110 -7 -72 186 114 -200 -10 103 26 1 106 109 -140 -28 -122 -100 47 -143 116 -148 12
6014 12 -21 -175 -72 160 -60 155 117 65 6 -81 -223 76 -29 120 167 -34 159 42 -41 41 -88 -116 228
6037 228 139 -44 199 81 97 31 52 16 -65 -5 -142 58 192 -51 -99 87 73 59 -188 33 -33 -76 65 -90
6061 -90 4 -2 -15 -213 -55 -166 87 -132 232 -140 12 -96 -64 79 57 -4 -71 -70 230 148 159 122 -242 -84 -55
6086 -55 112 -42 174 237 29 -31 -109 -167 -117 -86 50 11 71 -113 159 -171 57 -71 127 -58 -275 130 -105
6109 -105 72 267 -207 -10 -56 -58 132 14 44 -23 -28 -53 -84 28 -87 172 3 -196 -19 -37 -91 137 -68 51
6133 51 70 -161 49 -105 -186 -154 -200 -131 56 -130 23 151 -160 27 -165 86 177 262 -43 163 61 61 -171
6156 -171 99 -43 46 -115 23 106 69 -71 24 58 -222 -207 118 -58 132 128 82 50 -80 -37 -153 -168 107 -176
6180 -176 -106 -63 151 -13 164 75 194 169 210 248 71 224 -48 -212 20 -305 44 202 -119 -189 -121 -80 -255
6203 -255 -54 59 -180 -135 -80 -215 -3 20 96 146 107 23 -251 -44 -7 113 127 143 221 107 43 5 -180 -136 60
6228 60 -132 -340 4 -212 148 8 -88 18 -50 2 -99 -239 -68 -111 -261 -65 54 21 -149 46 75 216
6250 216 -393 225 56 -44 285 119 279 -19 136 -266 -58 223 -97 153 -92 103 -85 -9 -36 20 -34
6271 -34 207 -59 -68 -94 171 79 -177 -237 -114 127 -3 130 -191 109 71 -59 144 -53 -41 -133 -35 -227 25
6294 25 116 102 -12 -27 38 20 83 -168 -45 71 -146 292 -5 48 -144 103 -44 2 82 -79 -207 -89 34
6317 34 184 308 60 -94 -36 -61 -21 169 43 23 -117 -27 -23 -285 -133 -77 -86 -82 99 153 209 -263 80 -30 156
6342 156 218 -63 21 -123 67 -105 -123 25 -55 -67 -63 -48 82 -258 93 -130 15 -368 -70 -188 -56 -187 23
6365 23 -126 119 -19 -104 91 -342 -24 47 16 -83 148 -28 -185 130 35 -4 -164 161 32 13 74 -115 35
6388 35 156 -75 -351 168 -48 -61 -52 -64 84 -54 -116 20 -272 33 100 104 -42 -8 -211 175 -86 -17 71 -110
6412 -110 200 -85 -166 -46 197 136 27 0 -220 94 -60 -260 -167 45 -111 -201 294 -42 125 98 -66 150
6434 150 165 142 -78 -56 14 50 353 232 -105 160 7 -15 -138 31 110 -79 85 -23 -76 -27 109 37 9 -240
6458 -240 -155 -101 -32 -190 -41 106 -106 93 193 -112 12 12 -13 10 -370 -193 -61 127 263 -42 129 -149
6480 -149 -106 185 -118 40 68 -197 -76 -291 -41 202 -20 237 -124 45 -44 -36 -36 -60 41 53 -34 -163 17
6503 17 -81 192 -121 -40 -39 -121 -14 4 -183 79 127 25 -149 -26 -39 -42 20 -16 -47 3 30 -122 -21 -17 46 22 160
6530 160 134 -94 112 164 189 -126 -2 71 -52 -180 -47 -137 161 60 -113 146 -115 -9 -105 27 22 16 77 31
6554 31 -69 -8 -236 -151 -236 -275 257 -4 21 84 -144 -247 -23 -140 -121 -59 -25 -133 -181 -193 -36 81 -161 52
6578 52 -205 148 13 -265 38 -139 5 -143 -187 127 117 32 -417 -169 36 335 30 -17 -162 -27 164 0
6600 0 247 29 310 -21 156 364 75 -312 37 -118 -55 30 -274 187 -80 57 63 -44 -109 -62 -141 -82 -30 -190
6624 -190 15 261 -64 45 -52 -106 64 91 -105 -58 69 -197 50 202 -39 163 45 -111 267 171 48 -20
6646 -20 75 173 97 -43 -144 -285 141 169 -22 -60 -156 -14 -130 155 161 129 -116 23 61 73 -65 -195 27 175
6670 175 15 -73 132 -8 -27 -191 -65 99 109 -13 74 45 -147 26 -79 35 -119 -64 -201 -40 150 -98
6692 -98 -132 -186 186 -12 32 -162 48 104 104 19 -35 191 -121 176 155 -54 160 -57 -189 -181 -234 119 -109 151
6716 151 -91 -93 85 175 -202 150 -79 -58 -268 -23 82 54 -13 101 178 -72 -211 4 104 200 -200 21 19
6739 19 38 -355 -517 119 91 -38 -105 -107 26 -145 188 -70 -146 -269 149 -81 16 153 -36 144 -286 -36 196
6762 196 -69 -235 -122 -71 4 121 187 -212 -230 241 -44 251 158 -360 101 -139 112 -5 -90 -189 -13 27 -3
6785 -3 48 44 -55 -108 66 -123 -66 -122 58 115 237 26 -161 87 88 -34 -153 109 -74 -103 -196 91 34 15 196
6810 196 -82 -191 -24 -111 -164 -23 175 57 115 53 40 115 131 -34 -191 330 -67 161 278 102 -48 189
6832 189 -158 45 52 198 52 231 68 -140 -18 -29 110 -76 -173 189 -52 -69 102 -224 67 135 -189 -169
6854 -169 -11 -191 26 -40 -29 -308 -212 -50 222 151 108 -20 -208 34 -31 -38 -11 53 -78 8 168 -61 -119 -46
6878 -46 134 -5 79 205 115 10 43 34 85 12 -245 47 122 -209 291 148 -29 106 -120 7 -38 22 25 144
6902 144 2 -107 -102 -87 -133 128 116 -76 -144 -60 -338 182 -293 -53 -131 -43 47 -24 102 85 -13 -5 32 -86 149
6927 149 35 73 72 234 281 -8 -42 36 -171 76 52 84 109 220 128 37 -56 -70 185 -207 -83 115 100 45 357
6952 357 7 46 48 54 -203 -143 277 260 112 52 187 -33 225 76 4 -177 -35 -194 3 -55 7 -54 106 -188
6976 -188 -99 260 -15 -364 233 -178 28 185 -157 -215 -4 -23 -30 55 19 107 -119 -81 -12 -35 94 -88 -108 -144
7000 -144 13 -13 -8 111 -253 -133 -193 -74 21 19 -134 74 195 73 -50 152 280 -46 -265 -32 -138 -26
7022 -26 -94 111 119 -89 -112 78 -10 7 -121 174 -69 219 -48 -56 -189 -24 -90 32 17 -162 -84 -257 95 -236
7046 -236 -54 74 86 51 -225 311 119 53 100 -111 -129 90 -275 18 57 53 -79 -23 -192 130 -74 -23 77
7069 77 19 19 -109 -144 54 8 -186 138 -116 -21 -333 130 -70 18 -8 -3 7 91 -7 -36 105 -121 -113 -72 75 -348
7095 -348 -82 -23 193 143 13 -6 145 -146 -41 -168 -130 15 -228 -21 -199 73 -206 -120 -44 -117 15 191
7117 191 -11 159 224 237 -190 203 -71 -145 -82 115 -106 262 40 -147 144 16 203 46 -160 72 48 -112
7139 -112 -164 -129 130 -28 -95 113 -2 84 198 -111 -56 145 -90 -188 -146 73 -90 115 -239 263 -44 -2 -72
7162 -72 -250 19 -46 190 -252 74 -166 142 -60 -194 83 34 2 49 -108 90 -68 -3 48 158 191 81 23
7185 23 -99 322 -64 203 -143 1 198 -64 -257 -152 102 -138 151 -55 -177 66 36 -87 135 63 22
7206 22 -99 63 55 -83 -37 -57 -151 -47 119 2 -226 134 105 100 -36 176 -8 -201 84 40 19 -202 -68 -9
7230 -9 -184 -125 157 -5 64 -141 -38 190 203 76 127 140 101 -31 160 109 -76 -58 -159 26 33 -132 -67 -58 -113
7255 -113 -9 49 157 -144 33 -127 93 -7 -39 -358 -132 -152 -248 -143 -91 6 110 68 234 -148 10 -45 17
7278 17 168 -14 117 -245 -35 10 -100 101 111 -41 -171 -121 -50 -73 139 -7 -273 -3 100 -225 -81 91
7300 91 30 -7 199 -117 -84 -37 175 -85 26 -81 -3 147 -25 -286 -224 179 51 28 -109 -100 135 45 53 -196
7324 -196 76 10 -46 -120 -210 1 13 223 -140 -25 17 178 118 -84 112 -135 -132 -48 -115 77 -146 -66 -156 -31
7348 -31 -91 270 -127 -171 35 -97 288 -130 -11 -225 94 5 -41 78 -110 -331 -12 131 -85 88 65 -6
7370 -6 -11 33 248 169 -31 -122 -13 -5 -19 123 -43 -24 256 323 76 -46 48 318 -72 113 28 -240 84 8 -157
7395 -157 123 -126 -96 -155 -28 106 -113 -1 -16 62 -292 37 54 -121 123 38 -344 0 36 -113 18 186
7417 186 -331 -120 213 16 98 -60 45 -142 14 -3 63 343 -61 104 97 128 -273 -14 166 133 -10 124
7439 124 -86 52 59 -47 -59 -24 109 -255 280 -95 187 -73 19 64 194 -116 158 -230 -15 -57 7 178 -8
7462 -8 -266 -170 -253 -193 -98 -270 167 -50 -77 89 138 -115 -56 63 49 -134 49 56 -163 151 91 101 81 -20 353
7487 353 -22 -66 -14 -10 -177 -177 9 36 -55 -310 55 70 34 -29 -8 -18 132 28 85 70 -88 -187 176 -41 44 94
7513 94 -67 -48 71 -77 87 -36 163 -26 65 -71 -85 -84 -32 208 141 46 -196 -15 5 -15 -73 -127 26 7 -31
7538 -31 -182 -205 -164 -45 -45 59 99 -204 40 160 -11 -137 73 -76 -38 -93 -113 116 37 17 17 -213 32 -112
7562 -112 -121 47 -77 4 163 7 74 -5 219 101 -2 12 -123 -60 78 -151 -31 -184 -31 13 -247 139 294
7585 294 20 -68 65 51 50 39 104 -25 -219 -205 124 180 40 40 -41 -163 84 118 -15 -225 -55 56 -44 -68
7609 -68 -92 107 37 -4 181 -72 -21 -106 -95 8 132 -310 -90 -149 71 -113 -80 -162 -74 119 152 -125 56 53 -65
7634 -65 -43 247 274 -74 233 -171 440 -129 -107 54 110 219 -59 91 137 19 98 -146 327 -344 -225 -84
7656 -84 38 62 115 -108 59 115 16 285 -352 -6 -11 -289 -65 112 49 -71 -55 193 36 -217 -64 70 -29
7679 -29 -18 179 60 59 -175 141 152 -263 -83 16 203 -83 214 -176 -186 193 17 120 -117 -9 174 52
7701 52 -19 130 -44 -54 -152 102 233 141 163 -141 174 165 -95 -182 -279 89 335 -26 -44 312 -92 170 -201 67
7725 67 -125 -8 -243 -153 -60 -363 191 13 163 -150 -122 28 57 -190 -153 309 105 66 -117 70 -49 136
7747 136 -44 -38 216 89 74 20 289 42 -198 -25 107 50 -30 -122 303 -148 89 -56 146 125 -12 -70 102
7770 102 33 -179 306 77 142 -287 -129 -43 224 -35 -94 -178 -72 -14 -20 -74 242 6 -42 138 180 -73 -167 38
7794 38 86 -80 -32 -141 298 153 126 178 115 88 136 -83 -257 -7 89 -35 64 100 -14 34 -76 47 -221 -201
7818 -201 -148 166 -262 -28 241 -59 -85 19 -111 159 124 21 59 35 57 -16 183 12 77 45 -130 -30 -239
7841 -239 -181 91 -36 -111 -75 46 -194 68 144 -8 -92 23 85 -229 68 144 -188 -25 -50 86 46 110 31 -54
7865 -54 36 -59 -185 41 -22 62 171 128 193 155 -170 -11 -149 105 -114 176 -132 9 -32 108 44 -54 -34 107
7889 107 15 80 39 -40 66 -91 142 195 -94 107 -80 226 302 94 -126 -167 -43 31 84 33 39 -116 -72 -152 17
7914 17 263 50 7 -6 19 -25 43 135 -100 95 -291 176 52 9 -26 -7 97 -68 -95 214 60 -33 -233 68
7938 68 -50 -97 207 40 -102 -201 47 138 74 -126 -25 39 -9 -17 -96 -31 17 8 61 -73 9 -39 -74 43 -132 7
7964 7 111 10 -70 188 -73 -129 189 -17 -150 264 -250 156 13 -272 161 -82 17 70 -73 24 40 271 199
7987 199 85 151 7 4 -10 325 -54 108 130 57 -15 -91 -164 11 -60 88 -248 162 -40 120 -71 -21 54 -146
8011 -146 119 -18 -78 18 -57 -20 -42 -10 91 -38 125 265 -37 261 196 -90 98 -52 358 74 13 4 -251
8034 -251 40 -45 -129 -177 111 -88 -61 312 -172 -73 -314 144 -106 -45 -145 -25 94 5 29 54 13 -188 -52
8057 -52 212 119 -145 100 -5 22 56 118 123 -29 128 -208 -185 163 126 -92 168 79 97 238 -245 103 -288 -33
8081 -33 -32 -241 74 75 47 -19 -215 127 62 52 -8 92 -35 61 296 18 87 -230 70 -90 -191 -136 -340 33
8105 33 -110 -202 236 -192 232 -107 11 -17 -215 54 -103 50 -25 -170 3 -167 -20 116 208 218 -151 -180
8127 -180 -93 134 -175 -190 -123 113 27 -110 -492 14 -64 -144 165 -95 128 200 -145 26 -182 20 228 -181
8149 -181 42 -176 -42 139 -89 -149 12 -50 289 39 -80 -19 -230 -213 52 -21 -138 -22 -176 36 112 -54
8171 -54 9 -44 32 125 -175 -8 -56 106 305 56 119 293 -177 203 70 52 -154 -89 -5 -248
8191b48
##END NTUPLES=NMR FID
##END=
