##TITLE=1H_Pr NCS-3
 200.13MHz, CDCl3,
 8 sc
 
 12.8.2025
##JCAMPDX= 6.0         $$ Bruker NMR JCAMP-DX V2.0
##DATA TYPE= NMR FID
##DATA CLASS= NTUPLES
##ORIGIN= UXNMR, Bruker Analytische Messtechnik GmbH
##OWNER= pz
$$ XWIN-NMR		Version 3.5
$$ Tue Aug 12 15:31:38 2025 Russian Standard Time (UT+4h)  she@DPX200
##.OBSERVE FREQUENCY= 200.1313
##.OBSERVE NUCLEUS= ^1H
##.DELAY= (6, 6)
##.ACQUISITION MODE= SIMULTANEOUS
##.ACQUISITION SCHEME= undefined
##.AVERAGES= 8
##.DIGITISER RES= 18
##SPECTROMETER/DATA SYSTEM= spect
##.PULSE SEQUENCE= zg30
##.SOLVENT NAME= CDCl3
##.SHIFT REFERENCE= (INTERNAL, CDCl3, 0, 14.3821)
##AUDIT TRAIL= $$ (NUMBER, WHEN, WHO, WHERE, WHAT)
$$ ##TITLE= Audit trail, XWIN-NMR		Version 3.5
$$ ##JCAMPDX= 5.01
$$ ##ORIGIN= Bruker BioSpin GmbH
$$ ##OWNER= she
$$ F:/spectra/data/she/nmr/H-C/1/audita.txt
$$ ##AUDIT TRAIL=  $$ (NUMBER, WHEN, WHO, WHERE, WHAT)
(   1,<2025-08-12 15:30:20.29 +0400>,<she>,<DPX200>,
      <created by zg, POWCHK disabled, PULCHK disabled
       configuration hash MD5:
       00 E9 B6 7A A2 85 ED C7 34 08 36 98 17 FE 4E 26
       data hash MD5: 16K
       B1 EE DF 01 00 E1 C1 24 CB 42 EE 40 D7 23 5D 6E>)
$$ ##END=
$$ 
$$ hash MD5
$$ 83 10 A9 BD 5D 73 25 7E CB D7 1A 2F 12 05 13 C5
##$RELAX= 
##$RELAX= 
##$RELAX= 
##$RELAX= 
##$RELAX= 
##$RELAX= 
$$ Bruker specific parameters
$$ --------------------------
##$DU= <F:/spectra>
##$EXPNO= 1
##$NAME= <H-C>
##$PROCNO= 1
##$TYPE= <nmr>
##$USER= <she>
##$AMP= (0..31)
100 100 100 100 100 100 100 100 100 100 100 100 100 100 100 100 100 100 
100 100 100 100 100 100 100 100 100 100 100 100 100 100 
##$AQSEQ= 0
##$AQ_mod= 1
##$AUNM= <au_zg>
##$AUTOPOS= <>
##$BF1= 200.13
##$BF2= 200.13
##$BF3= 200.13
##$BF4= 200.13
##$BF5= 200.13
##$BF6= 200.13
##$BF7= 200.13
##$BF8= 200.13
##$BYTORDA= 1
##$CFDGTYP= 0
##$CFRGTYP= 5
##$CHEMSTR= <none>
##$CNST= (0..31)
1 1 145 1 1 1 1 1 1 1 1 1 1 1 1 1 1 1 1 1 1 1 1 1 1 1 1 1 1 1 1 1 
##$CPDPRG= <>
##$CPDPRG1= <>
##$CPDPRG2= <>
##$CPDPRG3= <>
##$CPDPRG4= <mlev>
##$CPDPRG5= <mlev>
##$CPDPRG6= <mlev>
##$CPDPRG7= <mlev>
##$CPDPRG8= <mlev>
##$CPDPRGB= <>
##$CPDPRGT= <>
##$D= (0..31)
0 0.7 0 0 0 0 0 0 0 0 0 0.03 0 0 0 0 0 0 0 0 0 0 0 0 0 0 0 0 0 0 0 0 
##$DATE= 1754998219
##$DBL= (0..7)
120 120 120 120 120 120 120 120 
##$DBP= (0..7)
150 150 150 150 150 150 150 150 
##$DBP07= 0
##$DBPNAM0= <>
##$DBPNAM1= <>
##$DBPNAM2= <>
##$DBPNAM3= <>
##$DBPNAM4= <>
##$DBPNAM5= <>
##$DBPNAM6= <>
##$DBPNAM7= <>
##$DBPOAL= (0..7)
0.5 0.5 0.5 0.5 0.5 0.5 0.5 0.5 
##$DBPOFFS= (0..7)
0 0 0 0 0 0 0 0 
##$DE= 6
##$DECBNUC= <off>
##$DECIM= 32
##$DECNUC= <off>
##$DECSTAT= 4
##$DIGMOD= 1
##$DIGTYP= 9
##$DL= (0..7)
0 120 120 120 120 120 120 120 
##$DP= (0..7)
150 150 150 150 150 150 150 150 
##$DP07= 0
##$DPNAME0= <>
##$DPNAME1= <>
##$DPNAME2= <>
##$DPNAME3= <>
##$DPNAME4= <>
##$DPNAME5= <>
##$DPNAME6= <>
##$DPNAME7= <>
##$DPOAL= (0..7)
0.5 0.5 0.5 0.5 0.5 0.5 0.5 0.5 
##$DPOFFS= (0..7)
0 0 0 0 0 0 0 0 
##$DQDMODE= 0
##$DR= 18
##$DS= 0
##$DSLIST= <SSSSSSSSSSSSSSS>
$$ [...]
##$SUBNAM0= <"">
##$SUBNAM1= <"">
##$SUBNAM2= <"">
##$SUBNAM3= <"">
##$SUBNAM4= <"">
##$SUBNAM5= <"">
##$SUBNAM6= <"">
##$SUBNAM7= <"">
##$SUBNAM8= <"">
##$SUBNAM9= <"">
##$SW= 18.0517328524113
##$SWIBOX= (0..15)
0 0 2 0 0 0 0 0 0 0 0 0 0 0 0 0 
##$SW_h= 3612.71676300578
##$TD= 16384
##$TD0= 1
##$TE= 0
##$TE2= 300
##$TE3= 300
##$TEG= 300
##$TL= (0..7)
0 120 120 120 120 120 120 120 
##$TP= (0..7)
150 150 150 150 150 150 150 150 
##$TP07= 0
##$TPNAME0= <>
##$TPNAME1= <>
##$TPNAME2= <>
##$TPNAME3= <>
##$TPNAME4= <>
##$TPNAME5= <>
##$TPNAME6= <>
##$TPNAME7= <>
##$TPOAL= (0..7)
0.5 0.5 0.5 0.5 0.5 0.5 0.5 0.5 
##$TPOFFS= (0..7)
0 0 0 0 0 0 0 0 
##$TUNHIN= 0
##$TUNHOUT= 0
##$TUNXOUT= 0
##$USERA1= <user>
##$USERA2= <user>
##$USERA3= <user>
##$USERA4= <user>
##$USERA5= <user>
##$V9= 5
##$VALIST= <valist>
##$VCLIST= <CCCCCCCCCCCCCCC>
##$VD= 0
##$VDLIST= <DDDDDDDDDDDDDDD>
##$VPLIST= <PPPPPPPPPPPPPPP>
##$VTLIST= <TTTTTTTTTTTTTTT>
##$WBST= 1024
##$WBSW= 4
##$XGAIN= (0..3)
0 0 0 0 
##$XL= 0
##$YL= 0
##$YMAX_a= 484513
##$YMIN_a= -493359
##$ZGOPTNS= <>
##$ZL1= 120
##$ZL2= 120
##$ZL3= 120
##$ZL4= 120
##$ABSF1= 10
##$ABSF2= 0
##$ABSG= 5
##$ABSL= 3
##$ALPHA= 0
##$AQORDER= 0
##$ASSFAC= 0
##$ASSFACI= 0
##$ASSFACX= 0
##$ASSWID= 0
##$AUNMP= <proc_1d>
##$AZFE= 0.1
##$AZFW= 0.1
##$BCFW= 1
##$BC_mod= 2
##$BYTORDP= 1
##$COROFFS= 0
##$CY= -3
##$DATMOD= 1
##$DC= 2
##$DFILT= <>
##$DTYPP= 0
##$F1P= 0
##$F2P= 0
##$FCOR= 0.5
##$FTSIZE= 0
##$FT_mod= 4
##$GAMMA= 1
##$GB= 0.15
##$INTBC= 1
##$INTSCL= 1
##$ISEN= 128
##$LB= 0.25
##$LEV0= 0
##$LPBIN= 0
##$MAXI= 10000
##$MC2= 0
##$MEAN= 0
##$ME_mod= 0
##$MI= 1.114404
##$NCOEF= 0
##$NC_proc= 0
##$NLEV= 6
##$NOISF1= 3.799351
##$NOISF2= 2.8
##$NSP= 1
##$NTH_PI= 0
##$NZP= 0
##$OFFSET= 14.38212
##$PC= 1
##$PHC0= -1559.754
##$PHC1= 10.99228
##$PH_mod= 1
##$PKNL= yes
##$PPARMOD= 0
##$PSCAL= 0
##$PSIGN= 0
##$REVERSE= no
##$SF= 200.129724274929
##$SI= 16384
##$SIGF1= 3
##$SIGF2= 2
##$SINO= 400
##$SIOLD= 16384
##$SREGLST= <1H.CDCl3>
##$SSB= 0
##$STSI= 0
##$STSR= 0
##$SW_p= 3205.1282051282
##$SYMM= 0
##$S_DEV= 0
##$TDeff= 0
##$TDoff= 0
##$TI= <>
##$TILT= no
##$TM1= 0
##$TM2= 0
##$TOPLEV= 0
##$USERP1= <user>
##$USERP2= <user>
##$USERP3= <user>
##$USERP4= <user>
##$USERP5= <user>
##$WDW= 1
##$XDIM= 8192
##$YMAX_p= 0
##$YMIN_p= 0
$$ End of Bruker specific parameters
$$ ---------------------------------
##NTUPLES= NMR FID
##VAR_NAME=  TIME,          FID/REAL,        FID/IMAG
##SYMBOL=    X,             R,               I
##VAR_TYPE=  INDEPENDENT,   DEPENDENT,       DEPENDENT
##VAR_FORM=  AFFN,          ASDF,            ASDF
##VAR_DIM=   8192,          8192,            8192
##UNITS=     SECONDS,       ARBITRARY UNITS, ARBITRARY UNITS
##FACTOR=    0.0002768,     1,               1
##FIRST=     0,             0,               0
##LAST=      2.2672688,     0,               0
##MIN=       0,             -493359,         0
##MAX=       2.2672688,     484513,          0
$$ Real data points
##PAGE= N=1
##DATA TABLE= (X++(R..R)), XYDATA
$$ [...]
1808a18j33L40l72l8J51K42Q2l64j13Q01q3q03K44K03J46j16j33M50m92j24J48
$$ -118 -251 89 -283 -321 -170 72 154 -210 -323 478 395 -408 -164 39 185 69 -64 386 -106 -230 -82
1829h2K89p1o64J72Q08o10o33P11L29k50j96K69K6j53l37L13M06o89R8N68l21
$$ -82 207 136 -528 -356 452 -158 -791 -80 249 -1 -197 72 98 -55 -392 -79 327 -362 -264 304 -17
1850a7l7o6n3L39n92K83L80l21j39K91o4J84m30K56J49k89j31L45M00n32j66R1
$$ -17 -54 -120 -173 166 -426 -143 237 -84 -223 68 4 188 -242 14 163 -126 -257 88 488 -44 -210 -119
1872a19L80n72n10J091q9o69K18J43J08l3l50P64j49l64j17L98K43m62j27O24
$$ -119 261 -311 -821 270 181 -488 -270 -127 -19 -52 -402 362 213 -151 -268 130 373 -89 -216 408
1892D08m1l14k92L60K23n27J19k17M30l65o9M21L3l62R0K06N6j29r0mK37j51J68
$$ 408 367 53 -239 121 344 -183 -64 -281 149 -216 -285 136 169 -193 -103 103 159 30 -60 -64 173 22 190
1915A90r7l45K79K78l41k71J65M76q0m99J93K71j87o46O78L24k45n44N17J49m39
$$ 190 93 -252 27 305 -36 -307 -142 334 254 -245 -52 219 32 -614 64 388 143 -401 116 265 -174
1936a74k62O05J91l62j14j77N43l65k55J85M63k51j53J20J24K72q67K04K60M49
$$ -174 -436 169 360 -2 -116 -293 250 -115 -370 -185 278 27 -126 -6 118 390 -477 -273 -13 436
1956D36m22n0K02K87k09l22J40k93L93k87j08L30p6k26J68K21J88m92k81O06R0
$$ 436 14 -36 166 453 244 -78 62 -231 162 -125 -233 97 21 -205 -37 184 372 -120 -401 205 295
1977B95m91qM89j28R1m38K31J23j72l57J11M37k51k14R0L24j40k14J41L66p7r
$$ 295 -196 -204 285 157 248 -190 41 164 -8 -365 -254 183 -68 -282 -192 132 -8 -222 -81 285 208 199
1999A99k45K70l5m22K09PM9K34n61J91O56p22m63O06K22k29m01J91M19K88o51
$$ 199 -46 224 189 -233 -24 -17 32 266 -295 -104 552 -170 -633 -27 195 -34 -435 -244 175 463 -188
2020a88q2N65O1n25P7N09m7n96J89K17Q9m12O2N4M37m07l61O23k29k79j18K41
$$ -188 -270 295 356 -169 -92 417 370 -226 -37 180 269 -143 -81 -27 410 3 -358 265 36 -243 -361 -120
2042a20K79j43k59O27k65j76J88q0p2pn3P7k14K42P7k77j22M86m20P1J0K67N6
$$ -120 159 16 -243 384 119 -57 131 51 -21 -28 -81 -4 -218 24 101 -176 -298 188 -232 -161 -151 116 172
2065A72l15j0O66k66m53J71N4L44o12LK82K24q68K43O53j69k97J37j06P94j150
$$ 172 -143 -153 513 247 -206 -35 19 363 -249 -246 36 260 -608 -365 288 119 -178 -41 -147 647 -503
2086e03Q7O00K24o81J55L84K2l02K4M19l22k46R8K45n03L77m78O42O4o08K36K18
$$ -503 -416 184 408 -273 -118 266 288 -14 10 429 107 -139 -41 204 -299 78 -400 242 306 -302 -66 152
2108A52k27j02L95j20l1q5j53J90k51L98K3l26k31M14k77K17k92M79q7m38j27
$$ 152 -75 -177 218 98 67 -18 -171 19 -232 166 189 -137 -368 46 -231 -14 -306 173 86 -352 -479
2129d79Q03k44j78p7N8M99n24J06L20L5k58q6L5K08l78m11M00M11n27P8P0L19
$$ -479 324 80 -98 -175 -117 382 -142 -36 284 319 61 -25 10 218 -160 -571 -171 240 -287 -209 -139 180
2151A80k02l65K86K14m79L94J15k17K81K8P6q1m08K48O3k39n9K42j64r9J93K78
$$ 180 -22 -387 -101 113 -366 28 143 -74 207 235 311 230 -178 70 133 -106 -165 77 -87 -186 7 285
2173B85k71j4O4J12j83o7J43M1P1j16l74P62k60m92J06L91k77j79J58M23j98o06
$$ 285 14 0 64 176 -7 -74 69 110 181 65 -309 453 193 -299 -193 198 -79 -258 -100 323 125 -481
2195d81N35J52q2m64K83K78k94q3K29N72n47m43K76o8J23k10K22j24j32j26M81
$$ -481 54 206 124 -340 -57 221 -73 -156 73 645 98 -345 -69 -137 -14 -224 -2 -126 -258 -384 97
2216I7k25j97L34P4J74k73J65q5J16j68K44m6l61M0R0K09m09l56P99K14n23j86
$$ 97 -128 -325 9 83 257 -16 149 64 180 12 256 210 -151 -111 -21 188 -221 -577 222 436 -87 -273
2238b73J40K56k47m4K63K19k06j60L87j99Q5l75J91R0k70o9O40p15j45L83R7J43
$$ -273 -133 123 -124 -168 95 314 108 -52 335 136 221 -154 37 127 -143 -212 428 -287 -432 -49 48 191
2260A91k53k61M13j57j7P1M00m33m0L7L40j90m16M95K1k97l05O82j55m68J62L61
$$ 191 -62 -323 90 -67 -84 -13 387 -46 -86 -49 291 101 -315 180 201 -96 -401 281 126 -342 -180 181
2282A81L0n20J03M48l36K8k6K18K9j73l6N24k80m84J18j07K35k19L30J26m1l38
$$ 181 211 -309 -206 242 -94 -66 -92 126 155 -18 -54 470 190 -294 -176 -283 -48 -267 63 189 148 -190
2304a90J25j26M8J38K55k65m9J1L81k40j14R2J80l44j26K27K91J23n73Q3L80k92
$$ -190 -65 -191 -143 -5 250 -15 -64 -53 328 88 -26 66 246 -98 -224 3 294 417 -156 -73 307 15
2326A5k38J24Q3K5n1L27rm03j86K75J82K1Nk20K50p7k27L26j35j63J7P0j46J26
$$ 15 -223 -99 -16 9 -42 285 276 -127 -313 -38 144 165 170 -50 200 123 -104 222 87 -76 -59 11 -135 -9
2350ij49K44k08L5J70k18L93l66j12Q2J66N2J76k61m0PJ71j24j33jP3L25p24J69
$$ -9 -158 86 -122 -87 83 -135 258 -108 -220 -138 28 80 256 -5 -45 -38 133 9 -124 -125 -52 273 -451 -282
2374b82K89k7K65k85Q7Lj26j30N57Jl21pn0L83m80J1Q9J31j49N3l26P4L76l46
$$ -282 7 -20 245 -40 47 50 -76 -206 351 352 31 24 -26 357 -123 -112 -23 108 -41 12 -314 -240 136 -210
2398b10J14L15j13j58L75j64K75n44P3N9m9J31m23M0K43K16m55L82J3k20M2L0
$$ -210 -96 219 106 -52 323 159 434 -110 -37 22 -27 104 -319 -279 -36 180 -275 107 120 -100 -58 -28
2420b8Q0K57l15l3J19L4r0j47K59J09n9l99K98j63j00N4K57l77L55n28M89J13
$$ -28 52 309 -6 -39 80 114 24 -123 136 245 186 -213 85 -78 -178 -124 133 -244 111 -417 72 185
2442A85l54K79l0J01oj24m4Q2j16k44M08r9O1P0l39M43l33j36J76j65R2J64k57
$$ 185 -169 110 80 181 175 51 7 89 -27 -271 137 38 99 169 -170 273 -60 -196 -20 -185 -93 71 -186
2465a86L12k55K22j16k7R2O3k44j05L52m6p6Q0k25K27j64j5N7K02l63P7K66j34
$$ -186 126 -129 93 -23 -50 42 105 -139 -244 108 62 -14 66 -159 68 -96 -111 -54 148 -215 -138 128 -6
2488fJ67k83J38P0J24m17L49n6P4m00M11J04k09K1K4k27LO6k62M39J07l47K31
$$ -6 161 -122 16 86 210 -207 142 86 160 -240 171 275 66 87 111 -116 -113 -47 -309 130 237 -110 121
2511A21j01J58m9j78K49q8J71l92J45l6K30m07jM27j27M9Q0j14j76k22J34M25
$$ 121 20 178 129 -49 200 112 283 -109 36 0 230 -177 -178 249 122 171 251 137 -39 -261 -127 298
2533B98p5j95nJ14j31J05j05k30K57j06J98j52p1K13l68j9M27l18N2J55k45M28
$$ 298 223 28 23 137 6 111 6 -224 33 -73 125 -27 -98 115 -253 -272 155 -163 -111 44 -201 227
2555B27j90k06Q7K49Pk30L1Q9R1j70k46K29L50m54O2Q7K9j84q0L77J92n14lJ0
$$ 227 37 -169 -82 167 174 -56 -25 64 155 -15 -261 -32 318 -136 -74 13 42 -142 -222 155 347 -167 -170 -160
2579a60J62K53l57L85j6k21j58l9K81k63j28M08p3k53QJ92k8j38L28k81K37j58
$$ -160 2 255 -102 283 267 46 -112 -151 130 -133 -261 147 74 -179 -171 21 -7 -145 183 -98 139 -19
2601a9N9k3KJ1p9l5k6J71j45qj8p4M75n74J58L09j95L0ojR0o6l02L76J75n37J73
$$ -19 40 17 19 30 -49 -84 -110 61 -84 -92 -110 -184 291 -283 -125 184 -11 19 13 12 102 36 -266 110 285 -252 -79
2628g9k04N5L93l93K44Q7K4k01KJ66j10k35L63k60J85j25K63j88J58j56PM00o15
$$ -79 -283 -228 165 -228 16 103 127 -74 -72 94 -16 -251 112 -148 37 -88 175 -13 145 -11 -4 396 -219
2651b19M39j95J53q7j47l63O9K15K10o0J36k41qJ40p6m6P3K47j83Rj54L22l00
$$ -219 220 25 178 91 -56 -419 -350 -135 75 15 151 -90 -98 42 -34 -80 -7 240 57 66 -88 234 -66
2674f6j43K13j42M16m21K8K98m05n3J67J90Nk5K53n17K03j61L03lk66J42J27j35
$$ -66 -209 4 -138 278 -143 -115 183 -222 -275 -108 82 87 62 315 -202 1 -160 143 140 -126 16 143 8
2697HL8p8J83j35r0K15n54N26j53j11Q4n7k37K40L70n42K16p4K91r4j19k0P9R9
$$ 8 46 -32 151 16 -74 141 -413 113 -40 -151 -67 -124 -361 -121 249 -293 -77 -151 140 46 -73 -93 -14 85
2721H5k20L82j45K2k63K14n3k15oK66r5l10K65r8K09J5j5J37j80j41M55k27P0
$$ 85 -135 247 102 124 -139 75 22 -193 -199 67 -28 -338 -73 -171 38 53 38 175 -5 -146 309 82 152
2744A52q6N3r1n4k25M29R3m78M01l01M3J33K7N5K31l61r0K43j09L1j42M27O6l85
$$ 152 66 119 28 -26 -251 178 271 -207 194 -107 -64 69 96 151 382 21 -69 174 65 96 -46 381 447 62
2768F2j50q3J97P7k44K56j17L2q8K97p5l50J9J53j01L1K6k2L0l3J25R8jk32J33
$$ 62 -88 -171 26 103 -141 115 -2 30 -58 239 164 -186 -167 -14 -115 -84 -58 -80 -50 -83 42 140 139 -93 40
2793D0j08Q8j63J59J39l22L9K14j62j82K83L7K55k77j55K43k50J9j10R5o8L3R8
$$ 40 -68 20 -143 16 155 -167 -128 86 -76 -258 25 62 317 40 -115 128 -122 -103 -213 -118 -186 -153 -55
2816e5Q5q3l3L0J41k70M06k97J53L2k1j13K34l86J95J74j98j92J36K33k25P1J4
$$ -55 30 -53 -86 -56 85 -185 221 -76 77 109 88 -25 209 -177 18 192 -6 -198 -62 171 -54 17 31
2839C1p8r0k35J82L68Nj45j2n1r2K07o2j6j25J99j4P1j18p1J77l95L57q4O1j33
$$ 31 -47 -137 -372 -190 178 183 38 26 -25 -117 90 28 12 -113 86 72 143 25 -46 131 -264 93 9 70 -63
2864f3P7j57J03K33l56K76P6k72M5j12K70l28K05p1J53j8j57J06K50m58l3L66
$$ -63 14 -143 -40 193 -163 113 189 -83 -38 -150 120 -208 -3 -74 79 61 -96 10 260 -198 -231 135
2886A35q5O9q2J36j69j04L0j45J66M9j27J96J02k52K05P2l00L26k61j6Q9k59K68
$$ 135 50 119 37 173 4 -100 -70 -215 -49 0 -127 69 171 -81 124 196 -104 222 -39 -55 34 -225 43
2909D3l5k83L17L9p1J28R7j19k9nk46K47m7j47J8K07j89j42J55o6J27j49J68j23
$$ 43 8 -275 42 81 10 138 235 116 87 82 -164 83 36 -111 -93 114 -75 -217 -62 -128 -1 -150 18 -105
2933a05j45J18J61m2k36J73K5J33j90K80l92M24l59J72j68k0L05K5k48K93L3l67
$$ -105 -250 -132 29 -13 -249 -76 -51 82 -108 172 -220 204 -155 17 -151 -171 134 159 -89 204 237 -130
2955a30K54n3o4j25L24j01k16PK57n1k7K23k61k67O2K09j88j62N32j69k03J52
$$ -130 124 71 7 -118 206 105 -111 -104 153 102 75 298 37 -230 -168 41 -147 -309 223 54 -149 3
2977Cj08J2O2q5o3L69J9k12N1O5M4m5N4J34j56l25L96k42J4k27Q6K27l6P7j74
$$ 3 -105 -93 -31 -116 -179 190 209 -3 48 113 157 112 166 300 144 -181 215 -27 -13 -240 -154 73 37 114 -60
3002f0J36L2k52n7J95q3J86k09J89j02J17o2j05K38p2p2j7J32k23o4K19O2J25
$$ -60 76 108 -144 -201 -6 -89 97 -112 77 -25 92 30 -75 163 91 19 2 134 -89 -153 66 128 253
3025B53p4j27j96K24P3j99K15j9k24L2Mj20L73m11jM27j49m6l0L6K92k51r1K43
$$ 253 179 52 -144 80 153 -46 169 150 -74 -42 -38 -158 215 -196 -197 230 81 35 5 41 333 82 -9 234
3049B34m97N18k96J1Q6m1k58N5M0K60l03J1J85m0K5l38J65K36R9j81J46r0j28
$$ 234 -263 255 -41 -30 56 15 -243 -188 -148 112 -191 -180 5 -35 -10 -348 -183 53 152 -29 117 27 -101
3072a01q1J94J07q6J46nK8k39k21J93L4Q8O5k51L02l23j10K18Q9k07QO7k47K29
$$ -101 -182 12 119 33 179 174 202 -37 -258 -65 -31 57 122 -129 173 -150 -260 -42 47 -160 -152 -85 -332 -103
3096a03r9R1J80j71J46q3O4k2J89j77k06M55n08K77k83L14j69O5m7R3M5J38j50
$$ -103 -202 -111 69 -102 44 -39 25 3 192 15 -191 264 -244 33 -250 64 -105 -40 -87 6 51 189 39
3119C9r4N6P2k91J68j5l7J29j75J11j51J93j53j2J36L18l06m1k51J69J36j10J05
$$ 39 -55 1 73 -218 -50 -65 -102 27 -148 -37 -188 5 -148 -160 -24 294 -12 -53 -304 -135 1 -109 -4
3142dj52J20O5j60K12j69M1J79r8j17L30m83L68j70q0Q6n3J4j17J5J21M1k32K99
$$ -4 -156 -36 29 -131 81 -88 -47 132 34 -83 247 -236 132 -38 -118 -32 -85 -71 -188 -173 -52 -11 -243 56
3166E6k06J60k5P0j90J63Kl6j39K13O0l00L30m59J68K52j88j36N56o08J22n6K63
$$ 56 -150 10 -15 55 -135 28 30 -6 -145 68 128 -172 158 -301 -133 119 -69 -205 351 -257 -135 -191 72
3189G2k06L44Q5j87k82J52J71j22j68RJ58j74L95k88j17N3q5j10L27l65K27N6
$$ 72 -134 210 295 108 -174 -22 149 27 -141 -132 26 -148 247 -41 -158 -105 -190 -300 27 -338 -111 -55
3211e5J16o3J45j4m0q3rk88J80J73O2J02l90L03k53O17o03K69qk64K22o5L2j54
$$ -55 61 -2 143 129 89 6 -3 -291 -111 62 124 226 -164 139 -114 503 -100 169 161 -103 119 54 86 -68
3235f8p1K42j21J16l48J77J64k47K24j61J92J4j8j60LJ02n4k13L08J00l05L10
$$ -68 -139 103 -18 98 -250 -73 91 -156 68 -93 99 113 95 -65 -62 40 -14 -227 81 181 -124 186
3257A86j98j2p6J59j53P3K21j96N3k10L52l24O7J86J11j54j33k11K13P3m4J95
$$ 186 -12 -24 -100 59 -94 -21 200 4 57 -153 199 -125 -58 128 239 85 -48 -259 -46 27 -17 178
3279A78J30j19l6k19n0K20j69n1nM76%j79k00R2m4j17K63j8l87j3M51k20M8p9
$$ 178 308 189 153 -66 -116 104 -65 -116 -121 355 355 176 -24 68 24 -93 170 152 -235 -248 203 -17 31 -48
3303d8O7j02M5Q4p9l1N7J95L2l79O3J28K01k23l8J32k43N1k3j59K26j14RJ57J97
$$ -48 19 -83 -38 46 -33 -64 -7 188 220 -159 -96 32 233 10 -28 104 -139 -88 -111 -270 -44 -158 -149 8 205
3328B05p7j70j49K42K1j49J00j80J66q7j88L20J54O1j93J52k40LJ75k26l3J09
$$ 205 128 -42 -191 51 72 -77 23 -157 9 -78 -266 54 208 269 76 228 -12 -9 166 -60 -93 16
3350A6j38O7Q4k28K66l5O4J9k53K05K34j63pK7k27J78m3k53LK73j08PJ11J23j11
$$ 16 -122 -55 29 -199 67 32 96 115 -138 67 301 138 131 158 -69 109 66 -187 -184 89 -19 -12 99 222 111
3375A11l05M9k9J90r8m2N1M6n3k4j45J67L45k61L18j26j68o2QM4J52j38J28k94
$$ 111 -194 -145 -174 16 -82 -124 -73 -27 -80 -104 -249 -82 263 2 320 194 26 -36 -28 16 168 30 158 -136
3399a36l4J15j79J93k5K3J45k94J82J18j22j14J03o8m1J52K7k29K36r5J67M0Q6
$$ -136 -170 -55 -234 -41 -66 -43 102 -192 -10 108 -14 -128 -25 -93 -134 18 45 -184 52 -43 124 164 250
3422B50m60%K66N1j14j7r2K01K33k46J84n37N29N9m31J95j13J7p2K03q3J48k37
$$ 250 -210 -210 56 107 -7 -24 -116 85 318 72 256 -281 248 307 -124 71 -42 -25 -97 106 23 171 -66
3445f6J28r2j39nJ41n2J80k3O8l72K22K6n2N7p8J73o1J74k06L8qp3M7J9k01J27
$$ -66 62 -30 -169 -174 -33 -85 95 72 140 -232 -10 16 -36 21 -57 116 55 229 23 61 53 -20 27 46 -155 -28
3471b8j80L77j98K2Q8J4k69L47k57K69k15J58j62J79o8m6Q5Q3j79L5J3q7o8p6
$$ -28 -208 169 -29 -7 81 95 -174 173 -84 185 -30 128 -34 145 77 31 116 199 20 55 68 -19 -87 -163
3495a63q4L16K0J15j96K53k65P4l6j02O6k8p4o5r1J77K86l95J67K5n5j49J28R2
$$ -163 -247 69 89 204 8 261 -4 70 34 -68 -2 -30 -104 -169 -260 -83 203 -192 -25 0 -55 -204 -76 16
3519A6k6j05K34k99L75j22n8J80k89q3K35j86K65L5j67J17j82j41K09l7K68l76
$$ 16 -10 -115 119 -180 195 73 15 195 -94 -177 58 -128 137 172 5 122 -60 -201 8 -29 239 -137
3541a37J05K29k69j9K61m17J42jN0k2N4J47p9J95k26J54J46j23j75l0j06L08O5
$$ -137 -32 197 -72 -91 170 -247 -105 -106 -56 -78 -24 123 44 239 13 167 313 190 15 -15 -121 187 252
3564B52k17k6j26Q8j89j06N64J02j93j71K7J78j45p5k7n3M67l15R2j96J63j57
$$ 252 35 9 -117 -29 -218 -324 240 342 149 -22 5 183 38 -37 -64 -117 350 35 127 -69 94 -63
3586f3o9N4n1j21J34P4J85j49m3N4p6R9J09k6n4j5K71k86q3J25J08k63P8oM9J28
$$ -63 -132 -78 -129 -250 -116 -42 143 -6 -49 5 -71 28 137 111 57 42 313 27 -56 69 177 -86 -8 -14 35 163
3612A63m93L31q1J49J80q3n3p3k72O20k64k70K25Jl24N50l93K5j5J2k09J97K5
$$ 163 -330 1 -80 69 249 166 113 40 -232 388 124 -146 79 80 -244 306 -87 -62 -77 -65 -274 -77 -52
3635e2L7J34j71J79P0l74J69j57L17p4Mq1P9K3K0j41P1n2L3N5k66J76j02j27L25
$$ -52 -15 119 -52 127 197 -177 -8 -165 152 78 82 1 80 103 123 -18 53 1 34 89 -177 -1 -103 -230 95
3660I5k54P6R7QO4rL0l49J08J44M0O5l0k32J05K72k33J58K4k15K31j07k05r6M17
$$ 95 -159 -83 14 22 86 77 107 -242 -134 10 50 115 85 -147 -42 230 -3 155 179 -36 195 88 -117 -213 204
3685B04m0n7p9j54J42M2j5J01j91L6L28k91K17l51J14M5lJ22k28L1j88K13N0k29
$$ 204 164 107 28 -126 16 58 43 144 -47 -11 317 26 243 -108 6 51 48 170 -58 -27 -215 -2 48 -181
3709a81K14l6Q1j92PJ14L20l11n4R5j03K28j17j53J70j8j14J2K67k10k9r3M3K13
$$ -181 33 -3 78 -114 -107 7 327 16 -38 57 -46 182 65 -88 82 64 -50 -38 229 19 -10 -103 -60 153
3733A53mr1P9l3k7j67P5o1Q0J47k3P8r0O7j55Q2k74M15k23j83J24K78l22J09k6
$$ 153 149 58 137 104 77 -90 -15 -76 4 151 128 206 116 183 28 110 -164 251 28 -155 -31 247 -75 34 8
3758HP6PL8j11k0L2n9L7j47J54m2N7r0j04J53K06j02m19L54j19J85j0M8q8j86
$$ 8 84 91 129 18 -2 30 -29 8 -139 15 -27 30 -60 -164 -11 195 93 -326 28 -91 94 84 132 44 -142
3783a42M7J4K7L87k54j24n4K47k36O0K62k93j61M08j25j49J21J64j96j10J78K8
$$ -142 -95 -81 -54 333 79 -45 -99 148 -88 -28 234 -59 -220 188 63 -86 35 199 3 -107 71 99
3805I9q6J84m13K09k9m8N2K9q2m6nq9L04k23M64l30J64j98K21j13j45Mr4K75p
$$ 99 13 197 -216 -7 -36 -84 -32 -3 -85 -131 -136 -225 79 -144 320 -10 154 -44 177 64 -81 -77 -171 104 97
3830I7k42j47K08j1L21k60J30j12J87j8j42k4j39L05k44J97j03j5k2o7j4J33m5
$$ 97 -145 -292 -84 -95 226 -34 96 -16 171 153 11 -13 -152 153 -91 106 3 -12 -34 -101 -115 18 -27
3853b7J04l5J9P6J92m87lP0k5L21k91O1J66q9j00o4J04K7j13r4K68M9r3K7l83
$$ -27 77 42 61 137 329 -158 -161 -91 -116 205 -86 -25 141 52 -48 -112 -8 19 -94 -188 80 129 36 63 -320
3878c20M53M3l57K35PJ1j66J89J00j63k70L94o3j57K98k18k1P1M9L6l16M6M0l0
$$ -320 133 176 -181 54 61 72 -94 95 195 32 -238 156 93 -64 234 16 -5 66 115 151 -165 -119 -79 -109
3902a09O9J35N2l69J23M23m54O2O8k1J71j3p1j07P3l0M9j14J95p3j62m9K48j34
$$ -109 -40 95 147 -222 -99 324 -130 -68 0 -21 150 137 66 -41 32 2 51 -63 132 59 -103 -152 96 -38
3926c8O0L3j92K8k94M42N9j82j39K90J10jr7M3K5j02P7j78O4k0O8K21n40M43j99
$$ -38 22 55 -137 -109 -403 39 98 -84 -223 67 177 176 79 122 147 45 122 -56 8 -12 56 277 -263 180 -19
3951a9Q5q5k7Q6m01M03J02k84K57J01m35K39O0j73J87k47Q4j66L61k68oQ9Q3p6
$$ -19 66 -19 -46 40 -361 42 144 -140 117 218 -217 22 82 -91 96 -151 -67 -233 128 -140 -146 -57 26 -50
3975e0o9K39k63K30J29k49j06J92J02j23K03k92N1K97k53O4m9%k12R9J22K0k00
$$ -50 -119 120 -143 87 216 -33 -139 53 155 32 235 -57 -6 291 38 102 53 53 -159 -60 62 82 -118
3998a18p7J03K17k98P8J64N1M6J29l64K38j90l3L63k37l6j48L43k02m2j38L89
$$ -118 -195 -92 125 -173 -95 69 120 166 295 -69 169 -21 -54 309 72 36 -112 231 29 -13 -151 238
4020B38l06o7j50K63M5P1M3j94j3P8k07J85Q2J28j2l28N9LJ11R1k50K14j7J11
$$ 238 -68 -135 -285 -22 23 94 137 -57 -70 8 -199 -14 68 196 184 -144 -85 -82 29 120 -130 84 67 178
4044A78K0j06k94K55J35j47J78m54K42j79n4L55k00j01L45j72J32m4m2j19j25
$$ 178 198 92 -202 53 188 41 219 -235 7 -172 -226 129 -71 -172 173 1 133 89 47 -72 -197
4065a97K00J7j36L2J12j63K88k1l26J78j4P2j38J44j22L67n93N6J21NpJ10OL5
$$ -197 3 20 -116 -84 28 -135 153 132 -194 -16 -30 42 -96 48 -74 293 -300 -244 -123 -118 -125 -15 -9 26
4089B6j19p1J92J20L3k00j2rKL21m32n1p5O3J82M7j22J7R2M4j80J29q7J64K08
$$ 26 -93 -164 28 148 181 -19 -31 -40 -38 283 -149 -200 -275 -212 -30 17 -105 -88 4 48 -132 -3 -90 74 282
4114B82j55k30k6L28j91K52m33N4n3K73l2j30O3j04J80j53q1q3J93k70Q5K42M6
$$ 282 127 -103 -129 199 8 260 -173 -119 -172 101 69 -61 2 -102 78 -75 -156 -239 -46 -316 -231 11 57
4137E7l30L01Ll68M18r7J64j54K9o1j24j02K75n6n4K51l05n1L60k19J33J0r3q4
$$ 57 -273 28 31 -337 81 -16 148 -6 23 -38 -162 -264 11 -45 -99 152 -153 -204 156 -63 70 80 -13 -97
4161i7J39k36L24j60q9N8J55k22Q2j94L14k96J50J75l72J12K4J17L34l51J78J29
$$ -97 42 -194 130 -30 -119 -61 94 -128 -46 -240 74 -222 -72 103 -269 -157 -133 -16 318 -33 145 274
4183B74l69J41j28M07j95m41O39j34k95K34j72J70k48J38K50k66P1j40J6O3j94
$$ 274 -95 46 -82 325 130 -311 328 194 -101 133 -39 131 -117 21 271 5 76 -64 -48 15 -179
4204a79N1K33k12K62J7m5l69K16K48m12O5N8J27J3l20J29O9k0K24j62N9l1k74
$$ -179 -128 105 -107 155 172 127 -242 -26 222 -190 -125 -67 60 73 -247 -118 -49 -69 155 -7 52 21 -253
4227b53M03m57N1K99K17j35r2l36N6M23j28k3M6q2K70m13K15k24L98k95K02J24
$$ -253 150 -307 -256 43 260 125 33 -303 -247 176 48 25 71 -11 259 -154 61 -163 235 -60 142 266
4249B66k28J05k69J38j59q3Q9K07k38K63j66n3J38j49QQ7k3L55l41O0L0R5k9p2
$$ 266 38 143 -126 12 -147 -230 -141 66 -172 91 -75 -128 10 -139 -131 -44 -67 288 -53 7 37 132 103 31
4273C1j9j15J64J65k78q8j06K32L6J1n3N8j51L43k85J93k47L27j97j5O5j38j15
$$ 31 12 -103 61 226 -52 -140 -246 -14 22 33 -20 38 -113 230 -55 138 -109 218 21 6 71 -67 -182
4296a82RJ5K84j4P8Q6l01Qk62L37j8P9k44J92j26L28k01J78r5j81j65J10J49q1
$$ -182 -173 -158 126 112 190 276 -25 -17 -279 58 40 119 -125 67 -59 269 68 246 151 -30 -195 -85 64 -17
4320a7J91p5p6j21K27k72K11Q5M9r7j27K9k54K45m7J12p6J45Kn2Q3m09Q4J54J17
$$ -17 174 99 23 -98 129 -143 68 153 202 105 -22 7 -247 -2 -49 63 -13 132 134 82 165 -244 -160 -6 111
4345A11j7m4K91m21OK03k30J49N4m4P2l05l2K7J97J57P2m18J60k03L03j68r2p0
$$ 111 94 50 341 -80 -74 129 -101 48 102 58 130 -175 -207 -180 17 174 246 -172 -12 -215 88 -80 -172 -242
4369b42K94nn9J69l8o8j69O0L5K29lk7n1j86P7L1k5k10J70q1K25o4j38Q5m4K93
$$ -242 52 47 -12 157 119 51 -118 -58 -23 206 203 176 125 -61 16 47 22 -188 -18 -99 126 62 -76 9 -35 258
4395B58o0l66L14p5j59L7L2pj50J20j2L4O8k17p0K61l6j5q9J63N2J9q4j92J77
$$ 258 198 -168 146 71 -88 -51 -19 -26 -176 -56 -68 -34 34 -183 -253 8 -28 -43 -132 31 83 102 18 -174 3
4420Cj96K13mo4J87p6j45L64l66J31k00L78k55nM6j82M08l20K24j58J79j85Q4
$$ 3 -193 20 16 -48 139 63 -82 282 -84 47 -153 225 -30 -35 11 -171 237 -83 141 -17 162 -23 61
4443F1j78J82k86L78l91K14N9j43j17J58L13j58k82M18l66j03K77n3R3J13j13
$$ 61 -117 65 -221 157 -234 -20 39 -104 -221 -63 250 92 -190 228 -138 -241 36 -17 76 189 76
4464G6K85j69k99O7J23l2q2j25J31N3r7J5q9K18k04K14j56L3J01m10K86J44L83
$$ 76 361 192 -107 -40 83 51 -31 -156 -25 28 -69 -54 -143 75 -129 85 -71 -38 63 -347 -61 83 466
4487D66m92K05r8j58N5L7n5J98k5j78K00k7j0l4k02K08l2j0k6j2j29p8M00j32
$$ 466 -26 179 81 -77 -22 15 -40 158 133 -45 155 128 118 84 -118 90 58 48 22 10 -119 -197 203 71
4511G1m6j9mk09L41k42M9J10l6L3j88r0K94j13L4k9k90M97j49j26J16j11K7j04
$$ 71 25 6 2 -207 134 -108 -59 51 15 48 -140 -230 64 -49 -15 -44 -334 163 14 -112 4 -107 -80 -184
4535a84M38l79kQ7K59j40j86M7j72O43j94n04L6K21j59J93Pq1M3qnO1N2k42K60
$$ -184 254 -125 -127 -40 219 79 -107 -60 -232 411 217 -287 -251 -30 -189 4 11 -70 -27 -35 -40 21 73 -169 91
4560I1QQ1Oj53j11o3J62K6k29j11L09JO7j24R9O1m22M28P4l0k16K6J82n13L01
$$ 91 99 180 186 33 -78 -141 21 47 -182 -293 16 17 84 -40 59 120 -302 126 200 170 -46 -20 162 -351 -50
4585e0J9j0J65l62L98m5m9j78k46N29j71J7Pl8Q8k54J78P3K3l29j1K61m9m3P9
$$ -50 -31 -41 124 -238 160 115 66 -112 -358 171 0 17 24 -14 74 -180 -2 71 94 -235 -246 15 -34 -77 2
4610BJ19r3l75K34P1o9J21Nm34N60K07n00L25k08j39K21J11J2l30J72P6l23K96
$$ 2 121 28 -347 -113 -42 -111 10 15 -419 141 348 -152 173 -35 -174 47 158 170 -160 12 88 -235 61
4633F1r7J25k77J86j13J81m9l8P5j88L89m43L04p0j83P2J59j94j63L56k92J10
$$ 61 -36 89 -188 -2 -115 66 17 -21 54 -134 255 -188 116 46 -137 -65 94 -100 -263 93 -199 -89
4655h9K38j09J36k47M8J66l46L99j20k45K01j5p5J94l17M44l40N4L0K48k73K5
$$ -89 149 40 176 -71 -23 143 -203 196 76 -169 32 17 -58 136 -181 263 -77 -23 7 255 -18 7
4677GJ8J33k27J42J00q3o2K1M3J34l46J22K04k36j21L07J3j60k92L82j07M9j9
$$ 7 25 158 -69 73 173 90 28 49 92 226 -120 2 206 -30 -151 156 169 9 -283 99 -8 41 22
4700B2Nn8pP9r2r9M9o3o6M39k49KR0l00K3J69j7J17R2k30N0m2O13l25J20l42K49
$$ 22 27 -31 -38 41 -51 -150 -101 -164 -230 209 -40 -38 52 -248 -225 -56 -73 44 136 -94 -44 -86 527 202 322 -20 229
4727B29l46PJ66q8J73j38R9K75l39q3K60l63JL58l19JK59j26J93k05j93o3L57
$$ 229 -117 -110 56 -32 141 3 102 377 38 -45 215 -148 -147 211 -108 -107 152 26 219 14 -179 -242 115
4750A15j79k0n2K33p5Q2n5l9j89O8K22j42L7j70N5K42l44K0Q1J75r2q4J12lM39
$$ 115 -64 -84 -136 97 22 104 49 10 -179 -111 111 -31 6 -164 -109 133 -211 -191 -110 65 -27 -111 1 -2 437
4775D37k15j29J7j57M7N6j3j70j37P9L6J18K83k81n8J2J11k27K4j07J70J00J90
$$ 437 222 93 110 -47 0 56 43 -127 -264 -185 -149 -31 252 -29 -87 -75 36 -191 -167 -274 -104 -4 186
4798A86j24j64n6J15p8L51m33K47j22K88K6m47J44Ol41N24K4k41l4K4Q2OJ8q7
$$ 186 62 -102 -158 -43 -121 230 -203 44 -78 210 236 -211 -67 -61 -402 122 146 -95 -129 -105 -23 -17 1 -86
4822h6L1J34K4j07k6QL06l68J33O8l56J30L04j14p7L6J18m6m1Q3n9k5j94j33L43
$$ -86 -55 79 103 -4 -30 -22 284 -84 49 117 -239 -109 195 81 4 40 158 112 71 154 95 70 -124 -257 86
4847H6l77L84p9J3K34j94j33K83j76l17K82k27L8M75m16J75J08k26K40k06q9N4
$$ 86 -291 93 14 27 261 67 -66 217 41 -276 6 -221 -183 292 -124 51 159 -67 173 -33 -122 -68
4869f8O3J06j55O1J13l1j21K7j56L0r1r4J07K94Kk1r1j33K98K9k78o0L47n0j5
$$ -68 -5 101 -54 7 120 89 -32 -5 -161 -131 -222 -316 -209 85 87 66 -25 -158 140 169 -109 -169 178 128 113
4894A13r0J73l07K32K8n8k11p3P8J25N6j24O6L5n3K7l7l54K83J0J05qM2k90J59
$$ 113 23 196 -111 121 149 91 -120 -193 -115 10 66 -58 8 43 -10 17 -20 -374 -91 -81 24 16 58 -232 -73
4919g3K5p8k1j00L28k29K04M8rj62J56LL0q4K3r4k08K88j40K29l2r4J29j56J37
$$ -73 -48 -126 -147 -247 81 -148 56 104 95 -67 89 92 122 38 61 -33 -241 47 -93 136 104 10 139 -17 120
4944A20l04J50j8j59J63J32J4j68L4k09K36J76j71K61m9k38M92k93l6L2L9j39
$$ 120 -184 -34 -52 -211 -48 84 98 -70 -36 -245 -9 167 -4 257 208 -30 462 169 133 165 204 65
4966F5L4q1k36J99k4j3l5J95R5p2O7l43J50P3J5l3J02j85J40K49k62n7J2P2l05
$$ 65 99 18 -218 -19 -43 -56 -91 104 199 127 194 -149 1 74 89 56 158 -27 113 362 100 43 55 127 -178
4991a78q4L16l01j5J34K08k6j36j71L05Rk31k5o7M46j57mn0j13J80k6Q2o0l8J76
$$ -178 -262 54 -247 -262 -128 80 54 -82 -253 52 61 -170 -195 -262 184 27 23 -27 -140 40 14 96 36 -2 174
5016A74L3k78p0L14l86J97j56L71l25K95j82l0J93K0k00J17j15j19K01K39k30
$$ 174 207 -71 -141 173 -213 -16 -172 199 -126 169 -13 -43 150 170 -30 87 -28 -147 54 293 63
5037F3j57L00m4l66L9K8K48j30j55L05J3k27N4J74k84K11p6j10L2J09M2j4j7K71
$$ 63 -94 206 162 -204 -165 -137 111 -19 -174 131 144 -83 -29 145 -139 72 -4 -114 -82 27 69 55 38 309
5061C09m58K59j94J96l22J65N6P3j45P4K92k96o5L29n6k58p6K11j74l8P0l60L66
$$ 309 -149 110 -84 112 -210 -45 11 84 -61 13 305 9 -56 273 217 -41 -117 94 -80 -118 -48 -408 -42
5084d2J2J38k39m3L8L16j04J00k00L29l01lK51k24j03K68k50K44l28K48q8J21
$$ -42 -30 108 -131 -174 -136 180 76 176 -24 305 4 1 252 28 -75 193 -57 187 -141 107 19 140
5106A40k59L2K16m8l5Q9k28N0K32j88J18k5M2j4j68J10k23Q7J8R4J58k91J79j99
$$ 140 -119 -87 129 81 46 135 -93 -43 189 1 119 94 136 122 -46 64 -159 -72 -54 40 198 -93 86 -113
5130a13K32k60K46q0Jn6k8R1r2l2J12J55l51L48k2K44l69R5Ok44K95k79J70O6
$$ -113 119 -141 105 25 26 -30 -58 33 -59 -91 21 176 -175 173 151 395 26 121 127 -117 178 -101 69 135
5154A35m3J35p5j45K7j86l1J53k20L49n9O1k29R6L4L05j60k95R2o5J04J5j0o3
$$ 135 92 227 152 7 34 -152 -183 -30 -250 99 40 101 -128 -32 2 307 147 -148 -56 -121 -17 -2 -12 -75
5178g5L05l25k8J20N7m5Q4J13l21l2J12Q8l17J57J19m0K80l21J69q4j11PM31l86
$$ -75 230 -95 -123 -3 54 9 93 206 -115 -147 -35 53 -264 -107 12 -28 252 -69 100 16 -95 -88 343 -43
5202d3P6k61P8K52k07K67m81K84j04J53P1m6q4R3j83M4J48l20L39K1j76n1J84
$$ -43 33 -228 -150 102 -105 162 -319 -35 -139 14 85 39 -45 48 -135 -91 57 -263 76 97 -79 -130 54
5225E4m2j27l0L36k64j96J03K7K36R4j10O8r3j12j06O8K03j28J65k89J90j35J13
$$ 54 12 -115 -145 191 -73 -269 -166 -139 97 191 81 149 56 -56 -162 -94 109 -19 146 -143 47 -88 25
5248B5k64M07k83K3J88l05J95Q7Q8n2l7Qj78L55n38N07q2q2k4k6J27m71L77L1
$$ 25 -239 168 -115 -92 96 -209 -14 73 161 109 72 80 -98 257 -281 226 144 62 38 12 139 -332 45 76
5272G6k43L23j68p0K31Q2j9j89O2p5k12L9N3p3R8J32l52K77R0o2M0mK64l09J24
$$ 76 -167 156 -12 -82 149 231 212 23 85 10 -202 -163 -110 -183 -85 47 -305 -28 62 0 40 36 300 -9 115
5297A15m6m2k09L56l85rJ21K72n6o2k82L73k19r1l3J63j23N4J02j7j31J93p7K5
$$ 115 69 27 -182 174 -211 -220 -99 173 117 55 -227 146 -73 -164 -197 -34 -157 -103 -1 -18 -149 44 -33 -8
5321hJ5K6O7k13p7J40L76l65m9K52l20J79R3j18J2q3r7R8K83k82M4j96J58J40
$$ -8 7 33 100 -113 -190 -50 326 -39 -88 164 -156 23 116 -2 10 -73 -170 -72 211 -71 -27 -223 -65 75
5345G5r2m9o5RN9Rj62N9l9J30O0l80N39J42m05P9m9J25j76L0J03O3j85K76j12
$$ 75 -17 -66 -131 -122 -63 -54 -216 -157 -196 -66 -6 -386 153 295 -110 -31 -80 45 -131 -101 2 65 -120 156 44
5370D4J97m06Nl29M88K6J60j89J61j71J39k13R5j32j02K47K5R6m1j66J0J24nj00
$$ 44 241 -165 -160 -489 -1 25 185 -4 157 -14 125 -88 7 -125 -227 20 45 141 100 -66 -56 68 63 -37
5394c7o1J58j70J91k55j18L11P2k55J64j99L19j0M2n03L09n6M38k54Q6J6k60J43
$$ -37 -98 60 -110 81 -174 -292 19 91 -164 0 -199 120 110 152 -351 -42 -98 340 86 172 188 -72 71
5417G1j06O0l67O0j3K83l7k18L35o8q5J75K61m93K6J13J97r0j32o8p9J67k8L01
$$ 71 -35 25 -342 -282 -295 -12 -49 -267 68 0 -85 90 351 -142 -116 -3 194 104 -28 -96 -175 -8 -36 265
5441B65m36o2O1n5O0J58m6nN7k97L28J07o8Q5k58K4J53pJ88l08R6K13l26J1J66
$$ 265 -171 -233 -172 -227 -167 -9 -55 -60 -3 -300 28 135 67 152 -106 -82 71 64 252 -56 40 253 -73 -62 104
5466A04j39K13l34J86l33L08o2J81l06j47J36J48P1j74L16j91k27L76j01K7j13
$$ 104 -35 178 -156 30 -303 5 -57 124 -182 -329 -193 -45 26 -148 168 -23 -250 126 25 52 -61
5487f1O3K50l67p7K1J92KN1j58k52J07L16l5N2j66J70k36jrK43K4l32K56Lk45
$$ -61 2 252 -115 -192 -171 21 23 74 -84 -336 -229 87 52 104 -62 108 -128 -129 -138 105 129 -203 53 56 -189
5512a89K62k00J71P2k53K60k9p5l2j71P8Q5J56j64J85m85L23m8M4p3J3o5Q0P1
$$ -189 73 -127 44 116 -137 123 94 19 -13 -184 -106 -21 135 -29 156 -329 -6 -54 -10 -83 -70 -135 -55 16
5536A6J77j08Lk77K17k25J14l0M9k6nK03k02j59J99J8j38J94O9Q9j42J02j97J16
$$ 16 193 85 88 -189 28 -197 -83 -113 -64 -90 -95 108 -94 -253 -54 -36 -174 20 89 178 36 138 -59 57
5560E7l40M20m12M41k00L0K8j95J44J43l1N8j16K0K5r2k01K04J20j47J03O1k20
$$ 57 -283 137 -275 166 -34 -4 24 -171 -27 116 85 143 27 47 72 -20 -221 -17 103 -44 59 120 -100
5583a00J14L7k26P0J68q8k05M30l18Q3R7l21K73l5p3K77L0l13J65k59J60K61m08
$$ -100 14 51 -175 -105 63 -25 -230 200 -118 -35 62 -259 14 -21 -94 183 213 -100 65 -194 -34 227 -181
5606a81R4%J11q6R1j0j71J06j34n8L94M2K5k88L0O5k77K66o2O3l6J71k18P0p8
$$ -181 -87 -87 24 -62 29 19 -152 -46 -180 -238 156 198 223 -65 -35 30 -247 19 -43 20 -16 155 -63 7 -71
5631g1R8nj37J00k00L83j12k38M50k96N6l9j72n6K25J99j51k08Q7J87o6j9J7K88
$$ -71 27 22 -115 -15 -215 168 56 -182 268 -28 28 -11 -183 -239 -14 185 34 -174 -87 100 34 15 32 320
5655C20m54K86l1kj53J1J48j14J5o8K26l42K80oK6l11L55o0l78L1L16j18j20J73
$$ 320 -134 152 121 119 -34 -23 125 11 26 -42 184 -158 122 116 142 -169 186 126 -252 -221 95 -23 -143 30
5679C0K9k04J88j2j46J39Nl7o8J83k71J53N1O6k09K25M7r8n5j3n7j83O0J63J35
$$ 30 59 -145 43 31 -115 24 29 -8 -76 107 -164 -11 40 106 -103 122 169 71 16 3 -54 -237 -177 -14 121
5704A21l05K93k37K78k08K3K79l14K56l43M33m54R9MJ88m9r2K88k90Q0O9j89M6
$$ 121 -184 109 -128 150 -58 -35 244 -70 186 -157 276 -178 -79 -75 113 64 -28 260 -30 50 119 -70 -24
5727b4PJ36j9k42K17Km3R2n6j15j59M30k34j8K18p7k09L26k17J70j63Q1k5k4k00
$$ -24 -17 119 100 -142 75 77 34 126 70 -45 -204 226 -8 -26 192 115 -94 232 15 185 22 103 78 54 -146
5752a46K19K9m4k1o8K7j8k42K68j87J28JK19k29OP5k36J52J47j13J18pk61J63
$$ -146 73 102 58 37 -31 -4 -22 -264 4 -183 -55 -54 165 -64 -58 17 -219 -67 80 -33 85 78 -183 -20
5776b0j16J03K33m23L11r2r4K42k02K1kJ36m08J36P1M01l25J9J3j29K27l61L64
$$ -20 -136 -33 200 -223 88 -4 -98 144 -58 -37 -39 97 -311 -175 -104 297 -28 -9 4 -125 102 -259 105
5799A05M1j6k21q3K22j15J24Nj88J91r7k32L34j1j15j07L2K4N3j8r8j09K90K99
$$ 105 146 130 -91 -174 48 -67 57 62 -126 65 -32 -264 70 59 -56 -163 -131 -107 -54 -72 -170 -279 11 310
5823C10n43O7j76J47J54J13k8k8j27J4Q9L41o22K22LN8o6P8j08K02r9rm00M26
$$ 310 -233 -166 -342 -195 -41 72 44 16 -111 -97 -8 333 -289 -67 -64 -6 -72 6 -102 100 1 -8 -408 18
5847A8M6k16m31O64m1K17j03J37l10o9P3R6K03l89J00K04r1L9j54Q3j43Mk7M3
$$ 18 64 -152 -583 81 40 257 154 291 -19 -88 -15 81 284 -105 -5 199 108 147 -7 76 -67 -63 -90 -47
5871d7N7r8K48l52K12q9J23n5J64p6k81L96j51j58l6N1q9J0K72p1n4O4Q7j79L07
$$ -47 10 -88 160 -192 20 -69 54 -1 163 87 -194 202 51 -107 -143 -92 -181 -171 101 30 -24 40 127 -52 255
5896B55l39K50J0k02r6J11L32k67J06o3k23L9R4m4k16M61j39k23R2j19J96l11
$$ 255 -84 166 176 -26 -122 -11 321 54 160 97 -126 -87 7 -37 -253 208 69 -154 -62 -181 15 -296
5918b96K77o2n4J37k26K24m6K48j55J11K5j24q1m7J63k60l0L37n81O71l07L17
$$ -296 -19 -81 -135 2 -224 0 -46 202 47 158 183 59 -22 -69 94 -166 -196 141 -440 231 -76 241
5940B41j36k97K07M1L32m72l7K19q9K92k29k79L10l15K41q2k00K20M2o1O6m8K88
$$ 241 105 -192 15 56 388 -84 -121 98 9 301 72 -207 103 -212 29 -53 -253 -33 9 -52 14 -34 254
5963B54o8j14k58K27O9k86N3J35nj95K71k56P8KK41k28J22j13K16q5q2N0O2k27
$$ 254 186 72 -186 41 110 -176 -123 12 7 -188 83 -173 -95 -93 148 -80 42 -71 145 60 -22 28 90 -137
5987a37L29O3k79o2K08n6l3k13R3K08q8M8k51J58L0q2j42J94Pp4J22j95J26J61
$$ -137 192 255 -24 -86 122 66 33 -180 -87 121 33 81 -170 -12 18 -64 -206 -12 -5 -79 43 -152 -26 135
6011A35k24kL0J50K47m13J34l8n3J26j71J05Q7LP2j59j76K85J55q3k07j70J06
$$ 135 -89 -91 -61 89 336 -77 57 19 -34 92 -79 26 113 116 188 29 -147 138 293 210 3 -167 -61
6034f1J54J39n4k31j08M39k62J53k06R7J73l52K04k39J06O9j0J22k82K40l2J2
$$ -61 93 232 178 -53 -161 278 16 169 -37 60 233 -119 85 -154 -48 21 11 133 -149 91 59 71
6056G1qj46J57O1j90J91j81j69J35J95N5rl10j14M63k01p0j17J39K69o9pQ6m51
$$ 71 63 -83 74 135 -55 136 -45 -214 -79 116 171 162 -148 -262 201 0 -70 -187 -48 221 152 145 231 -220
6080b20R7J93j70jK55k40M2N8j47O2L04l74K38j62j16J86J85r6j26p4K1K86ln0
$$ -220 -123 70 -100 -101 154 -86 -44 14 -133 -71 233 -141 97 -65 -181 5 190 94 -32 -106 -85 201 198 148
6104A48k67K22j27J2J01L3o6%k79Q8K40l01M09J37l10n1j4J17j36L3Q0j83J97
$$ 148 -119 103 -24 -12 89 122 56 56 -223 -135 105 -196 213 350 40 -11 -25 92 -44 -11 69 -114 83
6127H3j89KL62j89l14K91J09n6M6j80j2n2K83j20L4k72J71J41m58N06l59L50o5
$$ 83 -106 -104 258 69 -245 46 155 99 145 -35 -47 -99 184 64 98 -174 -3 138 -320 186 -173 177 112
6150A12l71K6J55L28k14J44m14K69p6J96l93J21N4J36k86K06j78j8R5k5p9K10
$$ 112 -259 -233 -78 250 36 180 -234 35 -41 155 -238 -117 -63 73 -213 -7 -185 -203 -108 -133 -212 -2
6172bj05j40M54k63P7l5j45O5J06k42K60rj34K97l17l9k2q8L51K61j14M7n8j04
$$ -2 -107 -247 207 -56 21 -14 -159 -94 12 -230 30 21 -113 184 -133 -172 -194 -282 69 330 216 263 205 101
6196A01j18J63k5j59j38J41J51n5j63L07j07j90j82L35K19j57l62L95j91on7J14
$$ 101 -17 146 121 -38 -176 -35 116 61 -102 205 98 -92 -274 61 280 123 -239 156 -35 -41 -98 16
6218A6p4O1P4k7k09J01Q9j25J37P6k39K31j08K11n1q5N2k44J06j35K50o4Jk18
$$ 16 -58 3 77 50 -159 -58 31 -94 43 119 -120 111 3 214 163 78 130 -114 -8 -143 107 43 44 -174
6242a74K68J60k17l17N90j92k72J40L54l06j4k83P4j1J72j58J53J4j66J74J03
$$ -174 94 254 37 -280 310 118 -154 -14 340 34 20 -263 -189 -200 -28 -186 -33 -19 -185 -11 92
6263I2N5j12J90j69j46J49r3P6K84m69K56j85j78J96K01j51J69k44J80r0p0K14
$$ 92 147 35 225 56 -90 59 -34 42 326 -143 113 -72 -250 -54 147 -4 165 -79 101 11 -59 155
6285A55k84L6J03k8K36k60L6KL2m5l9j31NJ82Q3p3L28l16l38M81m81M07l01K20
$$ 155 -129 -93 10 -18 218 -42 -6 -4 28 -17 -56 -187 -182 0 83 10 338 22 -316 165 -316 91 -210 10
6309A0N0K04m32J7L32K17n52r5L19J13j65K0j17O6Q9j03K60l30K52k15J62k59
$$ 10 60 264 -168 -151 181 398 -154 -249 70 183 18 38 -79 -13 76 -27 233 -97 155 -60 102 -157
6331a57J85k10J30m3j9R7j43K07K1j14Kj31J45K93m53J80K59k71J4J03k1k57K
$$ -157 28 -182 -52 -95 -114 -17 -160 47 68 -46 -44 -175 -30 263 -190 -10 249 -22 -8 95 74 -183 -181
6354a81K80m0k44M08m25L62j97j22L1J13J72k71N2N2J37J74l83J07k4j87K14j86
$$ -181 99 59 -185 223 -202 160 -37 -159 -128 -15 157 -114 -62 -10 127 301 -82 25 1 -186 28 -158
6376a58J44L29m11J40j30L1J48k87J31K74k87R6m5K6o9J62j83O3nq5K82o9J38
$$ -158 -14 315 -96 44 -86 -55 93 -194 -63 211 -76 20 -25 1 -68 94 -89 -26 -31 -116 166 97 235
6399B35j85L4J04k24l28M78Pp6n1j83K98r8J60Q3k34k40Q6J78K00q8j91j31m6
$$ 235 50 84 188 -36 -364 114 121 45 -6 -189 109 11 171 254 20 -220 -134 44 244 156 -35 -166 -212
6422b12J89NJ17%k40pJ50k03K80j9o6M9p3O7k05L60N2K5l21R1n2K33o5l50K63
$$ -212 -23 -18 99 99 -141 -148 2 -201 79 60 -6 43 -30 37 -168 192 244 269 -52 39 -13 220 155 -195 68
6447F8j01L6l4J79k60K31j16j62K2QQ6O3k42K88k0j68K62j26q8n4K93m2q5j67
$$ 68 -33 3 -31 148 -112 119 3 -159 -137 -129 -43 20 -222 66 46 -122 140 14 -74 -128 165 123 38 -129
6471a29K30m7j28R8J64K3l91K59M8j50R0L12l40O6k7ol8M6m2Q4j16K4l05K70j52
$$ -129 101 54 -74 24 188 211 -180 79 127 -23 67 379 39 105 78 72 34 80 38 122 6 30 -275 -5 -157
6496a57M3K24Q4j31r9j78J99Qk2L78m99J62k18K94o6j48j6K4O7l18J51J45j01
$$ -157 -114 110 194 63 -36 -214 -15 -7 -29 349 -150 12 -206 88 22 -126 -142 -118 -51 -369 -218 -73 -174
6519a74L14j18j98O0J1J85P6k29R5L6O0J63j20j24Oj54K11j54J10j10J39j00K06
$$ -174 140 22 -176 -116 -105 80 156 -73 22 58 118 281 161 37 43 -111 100 -54 56 -54 85 -15 191
6542A91J10k75K62l08J65j90j57K19j21j2J13k58M14k75K60o5L19n12pJ13k03
$$ 191 301 26 288 -20 145 -45 -202 17 -104 -116 -3 -261 153 -122 138 73 392 -120 -127 -14 -217
6563b17K79Ql8P5O7m8k35R8M4J47n8j04j41L49j82J28k17oM7M8o3J07k43o0J41
$$ -217 62 70 32 107 174 126 -109 -11 33 180 122 18 -123 226 44 172 -45 -51 -4 44 -19 88 -155 -215 -74
6588g4j27L89Mp8j66P2j88L53k24O6o9M5J58L0P4k81K31k73J79l69K81J77k25
$$ -74 -201 188 192 114 -52 20 -168 185 -39 27 -42 3 161 191 265 -16 215 -58 121 -248 33 210 -15
6611a5K10j74m6R3K7k65K37L1J52k39l9M01k86l67M28k71K56p5O1k50K56j01l3
$$ -15 195 21 -25 68 95 -170 67 98 250 11 -28 373 87 -280 148 -123 133 58 119 -131 125 24 -9
6634ik35J66RK90o9k78K41l90M18o5r8L6O8k95j15O09m88K66J78k44Q2j09N4m9
$$ -9 -244 -78 -69 221 152 -126 115 -275 143 78 -20 16 84 -211 -326 283 -205 61 239 -5 77 -32 22 -27
6658b7J75j2q6j07r5K53n5n0r8J6K09j50l71L02JK11k40K33J37k60L51m72L06
$$ -27 148 136 50 -57 -152 101 46 -4 -102 -86 123 -27 -398 -96 -95 116 -124 109 246 -14 337 -135 171
6681A71o9j04P4q6p4M9l2J99K3j34j03K48m5L3j49k48M79l91L35k30L13n2j08
$$ 171 102 -2 72 -14 -88 -39 -71 128 151 17 -86 162 117 150 1 -247 232 -159 176 -54 259 207 99
6704I9j90L24m94L45J8j14J08n6o6K02j59M5J9Ok01J2L2J84k5q1j81J59Q7k96
$$ 99 -91 233 -261 84 102 -12 96 40 -26 176 17 62 81 87 -114 -102 -70 114 89 8 -173 -14 73 -223
6728b23O0L82n1m85K47P8j13J09lJ63m26K48J09j31J9Q6R2k07K00n34L54J49j71
$$ -223 -163 219 168 -317 -70 8 -105 4 1 164 -262 -14 95 -36 -17 69 161 -46 154 -380 -26 123 -48
6751d8Q3O1l43M19M2o5j41O5l7km8l14L72J10l20K06k48M24j64oq0P1k54J24L0
$$ -48 35 96 -247 172 214 149 8 73 36 34 -14 -328 44 154 -166 40 -208 216 52 46 -34 37 -217 -93 -63
6776f3j35J36J70j07K2K32l50J95K3r1M3r4m1J54j77Q0j6j17K27j25j06J38N5
$$ -63 -198 -62 108 1 23 255 -95 100 123 32 75 -19 -60 94 -83 -3 -19 -136 91 -34 -140 -2 53
6799E3MlJ54J06l22k9k4j49K74j35M8L3J38k50Q4j8oJ48k64K72j20J94k68J31
$$ 53 57 54 208 314 -8 -37 -61 -210 64 -71 -23 10 148 -102 -18 -36 -42 106 -158 114 -6 188 -80 51
6823E1j73J55l45J13L84k76J99m1O0l27J91K6j66n4K72N2J13k58Oj18K75j83K58
$$ 51 -122 33 -312 -199 185 -91 108 67 127 -200 -9 17 -149 -203 69 121 234 -24 -18 -136 139 -44 214
6846B14l57O7J39k41N00k20K80m72K36M8k33ml9J06k95J99j27J81r1J53j27O2
$$ 214 -143 -76 63 -178 322 102 382 -90 146 194 -39 -43 -82 24 -271 -72 -199 -18 -109 44 -83 -21
6868b1J49N4k11m8J11j2J75l18q5L09q2n0J19j12%O4R3j66k01p9J23J82o1K51
$$ -21 128 182 -29 -77 34 22 197 -121 -206 103 21 -29 90 -22 -22 42 135 -31 -232 -311 -188 -6 -67 184
6892A84l79J55o5K8J76j74J17q5J1j83M22l58M24o7l41R7j85K21R9k49J42o7n9
$$ 184 -195 -40 -105 -77 99 -75 42 -43 -32 -215 207 -151 273 206 -135 -38 -223 -2 97 -152 -10 -77 -136
6915a36K03q4o3j70J85l7j1M0J74l27K91n6j17p2K54j77K00o9j52j91M33k74L08
$$ -136 67 -17 -80 -250 -65 -102 -113 -73 101 -226 65 9 -108 -180 74 -103 97 28 -124 -315 118 -156 152
6938A52j2j3r1l42J90K21q4Mj38k40K87K78j11n6J03k68P0P4k37L54l05N6jK01
$$ 152 140 127 36 -306 -116 105 21 25 -113 -353 -66 212 101 45 148 -120 -50 24 -213 141 -164 -108 -109 92
6962I2J45l63J95j57K56m24J85j73j19L99l2p5lj14L26o1k91L43j4j3R2K1k89
$$ 92 237 -126 69 -88 168 -256 -71 -244 -363 36 4 -71 -74 -188 138 77 -214 129 115 102 194 215 -74
6985g4M76n84K21j93j9k8K90Q2j07k2J58l65J88K12k25k32M87l56J6J00k8q1o1
$$ -74 402 -182 39 -154 -173 -201 89 171 64 42 200 -165 23 235 10 -222 265 -91 -75 25 -3 -84 -145
7008a45J65J08l95M58n25J57K29N1j37j47K86j78N9K1Lk27K17Rj26K17j24J53
$$ -145 20 128 -267 191 -334 -177 52 103 -34 -181 105 -73 -14 7 10 -217 0 9 -117 100 -24 129
7030A29j40K59m88J89M23m45QM77n61O8J10Op8O7o4j79K36J06j11N2jj67Q6l3
$$ 129 -11 248 -240 -51 372 -73 -65 412 -149 -81 29 35 -43 24 -40 -219 17 123 12 64 63 -104 -18 -51
7054e1j71J25L03l36J33P0n6J00k45J54L5k7k21J90r8K27j48M9q3L08j92j11J34
$$ -51 -222 -97 206 -130 3 73 17 117 -128 26 61 34 -187 3 -95 132 -16 33 -50 258 66 -45 89
7077H9k03K21k08q8j0K47j25j95K34j47J94j75L21l1m99L78o5J96J04k10L8k75
$$ 89 -114 107 -101 -189 -199 48 -77 -272 -38 -185 9 -166 155 124 -375 3 -62 134 238 28 66 -209
7099b09m6K87r5J23p1lR6j06J95L4k32Lm8M0K41j81k34K73j05L0p2o6K91j84N2
$$ -209 -255 32 -63 60 -11 -14 82 -24 171 205 -27 -24 -72 -32 209 28 -206 67 -38 -8 -80 -146 145 -39 13
7124A3k08J82r3j1L9l6K31j70j0L4J17Jk40Q3j27L00l5O9j10J9q5n5OJ20J40k81
$$ 13 -195 -13 -106 -117 -78 -114 117 -53 -63 -29 88 89 -151 -68 -195 105 70 139 29 48 -37 -92 -86 34 174 -107
7150a07K14K51k79j15%RJ16o1j0o5J91j47J86l20L1ql0M4J40j03L9o5j60K38m
$$ -107 107 358 79 -36 -36 -27 89 28 18 -47 144 -3 183 -137 -106 -114 -144 -100 40 -63 -24 -89 -249 -11 -15
7175a5j26k0J38l0P0j86J46n4J65j04K66m01J74p5M5o5J2J7M2j99L85r6j84q9
$$ -15 -141 -161 -23 -53 17 -169 -23 -77 88 -16 250 -151 23 -52 -7 -72 -60 -43 -1 -200 185 89 -95 -184
7199a84K21mJ21j52J92l59J60J18j93J17j79R7k31J32L9L54k38J1mo5j84K47J5
$$ -184 37 33 154 2 194 -165 -5 113 -80 37 -142 -45 -276 -144 -105 249 11 22 18 -47 -231 16 31
7222C1l70M78k2N6j55O5N2j69L4n6J68r2p8j30M02k49j20K9MO0j33K19J3k58K27
$$ 31 -339 139 117 173 18 83 135 -34 0 -56 112 20 -58 -188 214 -35 -155 -126 -122 -62 -195 24 37 -221 6
7247FJ02j33O8l61L52j14Q2Q4j53j65M47j65n2l5n2P6K55k04k14K11r8r9Q4M9
$$ 6 108 -25 43 -318 34 -80 2 86 -67 -232 215 50 -2 -37 -89 -13 242 38 -176 35 -63 -162 -78 -29
7271b9M8j08m4n3N08l61rR7R3j89j52K51j53m6J16K07l03J65M1j63j29N51j63
$$ -29 19 -89 -133 -186 322 -39 -48 49 142 -47 -199 52 -101 -147 -31 176 -127 38 79 -84 -213 338 175
7294A75J89n55K91P1rm29M17q2o6n9K52l19p8O6J69k83j34K15K87k01j15Q8J92
$$ 175 364 -191 100 171 162 -267 150 68 2 -57 195 -124 -202 -136 33 -250 -384 -169 118 -83 -198 -110 82
7317H2n1J5l8L7Oj18j17N31k67n3l7n4r9K85j47k7L1l8J15K5k26Q2Pk6m1J29k14
$$ 82 31 46 8 45 51 -67 -184 347 80 27 -10 -64 -163 122 -25 -52 -21 -59 56 81 -145 -63 -56 -82 -123 6 -208
7344b08J21J09J30j50J44j69J68J13m59M44k61J87k20J3J09Ml24K56J43j71l2
$$ -208 -87 22 152 2 146 -23 145 258 -201 243 -18 169 -51 -38 71 75 -249 7 150 -21 -53
7365e3j03o1K96k35K9k6K82o5p1J57j52J20k49N3M17k78J7k54J56n4J99M7j56
$$ -53 -156 -217 79 -156 -127 -153 129 64 -7 150 -2 118 -131 -78 339 61 78 -176 -20 -74 125 172 16
7388A6K96l78j29K64k02K5K36J06l18N9N16o44J61J44j50n3k78M05j79K71k06
$$ 16 312 -66 -195 69 -133 -108 128 234 -84 -25 491 -153 8 152 2 -51 -329 76 -103 168 -38
7409c8n7j19L53p4J10k36lK5M3J48r0j4J3M3J12j89J5M5p3k32J77l7J58O9n25
$$ -38 -95 -214 139 65 175 -61 -64 -39 4 152 62 48 61 104 216 27 42 87 14 -218 -41 -78 80 149 -376
7434c76M72l5M3l2j24r4K51M7j87M1j32k30L51L8J80j42k19l2J21j09J36M8j86
$$ -376 96 61 104 72 -52 -146 105 152 -35 6 -126 -356 -5 33 213 71 -148 -180 -59 -168 -32 16 -170
7457a70J12J67l62L52j27k57K70J84k66J85k62K14Qj58j70J88j56J47K49N1o4
$$ -170 -58 109 -253 99 -28 -285 -15 169 -97 88 -174 40 48 -110 -280 -92 -248 -101 148 199 135
7478A35N1j24Q7k6k27j36M32N3j58k06J63n7J23jK39j66n58K88P2j77J41J40J
$$ 135 186 62 149 123 -104 -240 192 245 87 -119 44 -13 110 109 348 182 -376 -88 -16 -193 -52 88 89
7501H9L4j34N8j99J41n4J00k19L32j69k17L92k17R0k77M69l13J38K3j91J29M44
$$ 89 123 -11 47 -152 -11 -65 35 -184 148 -21 -238 154 -63 27 -250 219 -94 44 67 -124 5 449
7523D49m97j4l7K85p1q6j54K04q8j33n8L46k24m51N62o7K01j2n9Lk27K31l22K73
$$ 449 -48 -62 -99 186 115 29 -125 79 -9 -142 -200 146 -78 -529 33 -34 167 155 96 99 -128 103 -219 54
7547E4K51l06J06n5pj42J33j2k85L11M6k21K34M8n9j20Lj07LL32j51k68K08J0
$$ 54 305 -1 105 50 43 -99 34 22 -263 48 94 -127 107 155 96 -24 -21 -128 -125 207 56 -212 -4 6
7571FP5m08L55K0J55l01K46m8L9j88OR7K7k52K54K3l58L52k07r6J48Q3k20M3L94
$$ 6 81 -327 28 48 203 -98 148 100 139 -49 -43 54 81 -171 83 106 -252 100 -107 -203 -55 28 -192 -149 245
7596B45j04k76K10K4k69K06K7l37M62k37j80K16j48L13K3k55J53j93J03j21K21
$$ 245 141 -135 75 99 -170 36 63 -274 188 -49 -229 -13 -161 152 175 -80 73 -120 -17 -138 83
7617H3j88J28p7O3M4k79L27K9j44j29K31J41j23k79j74K19K33M2k4l28J09j48
$$ 83 -105 23 -54 9 53 -226 101 130 -14 -143 88 229 106 -173 -347 -128 105 147 123 -205 -96 -244
7639b44J49N9J85r3j64j9J51lj02L11m26J96l8J79j12P0p5j0j06J59j19K1j10
$$ -244 -95 -36 149 56 -108 -127 24 21 -81 230 -196 0 -38 141 29 99 24 14 -92 67 -52 -31 -141
7662a41o5K9K22j4j49J7K79k44l0M43n19j00L41j58J56N0j45K79k49K62j39l26
$$ -141 -206 -177 45 31 -118 -101 178 -66 -96 347 -172 -272 69 -89 67 117 -28 251 2 264 125 -201
7684b01K68j60L08k27R8%j12O1p4J26M4j25n1J96n9J55m53K8J04p5K03j05K0Q9
$$ -201 67 -93 215 -12 86 86 -26 35 -39 87 131 6 -45 151 92 247 -206 -178 -74 -149 54 -51 -31 58
7708E8l19K76q0qk88P9J78K60j17j62j8J88N4l7o5k89K45j71K62L5N0j86O9j2
$$ 58 -261 15 -65 -73 -361 -282 -104 156 39 -123 -141 47 101 64 -1 -290 -45 -216 46 81 131 -55 14 2
7732Bk67L84j20J6r9o1L6L4M3j9J04j01K82m77K44Q2l03K44p3n4l9l6J1l39M65
$$ 2 -265 119 -1 15 -84 -145 -109 -75 -32 -51 53 -48 234 -243 1 83 -220 24 -49 -103 -142 -178 -167 -506 -41
7757d1j54K71j48P1J19k22n4K74p0o5o4K14K3k01J51J1l08O16m12j07L8L2n7O5
$$ -41 -195 76 -72 -1 118 -104 -158 116 46 -19 -83 131 154 -47 104 115 -193 423 11 -96 -58 -26 -83 -18
7781a8J81k69J7R0q4L80n76O98j79n15K45j10M8J59N5M3k94K79k83K88q8P2l5
$$ -18 163 -106 -89 1 -83 297 -279 419 240 -275 -30 -140 -92 67 122 165 -129 150 -133 155 67 139 104
7804A04m6Q9j75J8k28J97k3j10J47j3J57j14k53J80K03j96K4J1jl4L3j74N3m5
$$ 104 58 147 -28 -10 -238 -41 -64 -174 -27 -40 117 3 -250 -70 133 -63 -39 -28 -29 -63 -30 -204 -151 -196
7828a96J94j64L96k98O5P1m44M98l17nJ93Q7j17j46j22M65k62L48k18k22K48J13
$$ -196 -2 -166 230 -68 -3 68 -376 122 -195 -200 -7 80 -37 -183 -305 160 -102 246 28 -194 54 167
7850A67o3j04Q0q4J01J48k46j09J23l5R0j22K00J99n40J92o1k4J56P0l21K36j42
$$ 167 104 0 80 -4 97 245 -1 -110 13 -22 68 -54 146 345 -195 -3 -64 -88 68 138 -183 53 -89
7873h9N2J06K5j33J02j70J45K0j24j59J99K49k46L6O6O1k21R9J83k65L94k95l9
$$ -89 -37 69 94 -39 63 -107 38 58 -66 -225 -26 223 -23 13 79 140 -81 18 201 -64 330 35 -4
7896dKj3K47k18J79Kk61m5J41q2l1R0p3K49j97K94k86J97j13j4L6n0j10K80m8
$$ -4 -2 -15 232 14 193 195 -66 -111 30 -52 -83 7 -66 183 -14 280 -6 191 78 64 100 50 -60 220 172
7921A72j99j70Q4j2J0L3M9L89k79q6K12l22j40j1J78Q7j69L70j85j51J30j15j3
$$ 172 -27 -197 -113 -125 -115 -82 -33 356 77 -9 203 -119 -259 -270 -92 -5 -174 196 11 -140 -10 -125 -138
7944a38L43k39j8j17K23L7r7k25K70j0O0k13R8J12P2k19K21K6l44K64r0K82k57
$$ -138 205 -34 -52 -169 54 91 -6 -231 39 29 89 -124 -26 86 158 -61 160 186 -158 106 16 298 41
7967D1ko6J76q9n6k0K69j94J0l05J51P8l6O4l76O56m24K55k4nj61j59K12j39M07
$$ 41 39 -27 149 60 4 -16 253 59 69 -236 -85 -7 -43 21 -355 301 -123 132 108 103 -58 -217 -5 -144 263
7992B63l72L96m71n1L0J62J47Mk21O7m5J62pQ9j92j19J04M76m55k2q4n6K24N1
$$ 263 -109 287 -184 -235 -205 -43 104 108 -113 -46 -91 71 64 153 -39 -158 -54 422 -33 -55 -139 -195 29 80
8016H0K0K8J77k52K08k01J09j75j06n1p9J80j15K25j98R5K02p0k32Q4L03l33J05
$$ 80 100 128 305 53 261 60 169 -6 -112 -163 -242 -62 -177 48 -150 -55 147 77 -155 -71 232 -101 4
8039DRj18r7R9J85l3j17k76K76K13J56l63K2j91L57p0J11o4JR9l50lJ1M02m35
$$ 4 13 -105 -202 -103 82 49 -68 -344 -68 145 301 -62 -40 -231 126 56 167 103 104 203 -147 -150 -139 263 -172
8064a72M8QK28K08n32R5J95j53O3oJ10j86K5J80j50l9k25N82l08p9M1J86j75J77
$$ -172 -124 -116 112 320 -212 -117 78 -75 -12 -18 92 -94 -69 111 -39 -78 -303 279 -29 -108 -67 119 -56 121
8088A21m86M79j60PM5j18P6J48k7p4j70K37k58L33j0l3k72L1K21l63K90j01K7
$$ 121 -365 114 -46 -39 6 -112 -36 112 85 11 -159 78 -180 153 143 110 -162 -131 90 -273 17 -84 -57
8111e7j10J71k7l1J95j70o7j78J10K51l5p2m1J01j36o1j31M09l03P7J19R7j34
$$ -57 -167 4 -23 -54 141 -29 -96 -274 -164 87 52 -20 -61 40 -96 -157 -288 121 -182 -105 14 111 -23
8134b3Op3R6Qj4r7K30j99J36j68N80l13l12K37m0p8q4L5J57l26K53k28j6K25j59
$$ -23 -17 -90 6 14 0 -97 133 -66 70 -98 482 169 -143 94 54 -24 -108 -73 84 -242 11 -217 -233 -8 -167
8159a67J80j30L29k39J03r6N4r2K60l18n0M71n56M62j55Nn2rj10LJ38j33Q2K11
$$ -167 13 -117 212 -27 76 -20 34 -58 202 -116 -166 305 -251 211 56 61 9 0 -110 -107 31 -102 -20 191
8183A91k21k33N07l10L28n04J45K37
$$ 191 -30 -263 244 -66 262 -242 -97 140
8191A40
$$ Imaginary data points
##PAGE= N=2
##DATA TABLE= (X++(I..I)), XYDATA
0@%%%%%%%%%%Qj6J6j9K7l2M0n6O4p2R3j17J36j60J91k22K56k97L44l93M50n16
$$ 0 0 0 0 0 0 0 0 0 0 0 8 -8 8 -11 16 -16 24 -32 32 -40 53 -64 72 -88 103 -119 137 -160 184 -209 241 -275
32b75N87o67P54q49R57j074J201j342J496j664J848k047K266k507K769l053L363
$$ -275 312 -355 399 -450 507 -567 634 -708 788 -876 972 -1075 1191 -1316 1453 -1600 1763
49A763l707M083m497M957n467O036o675P399q225R177j0293J1619j3224J5219
$$ 1763 -1944 2139 -2358 2599 -2868 3168 -3507 3892 -4333 4844 -5449 6170 -7054 8165
63H165j7774K1180k5976L3280m5884P3573k44293K03106M79136m06177m00686
$$ 8165 -9609 11571 -14405 18875 -27009 46564 -197729 5377 484513 78336 -322350
74c22350J14420L74812m461j51804o3365j8619l6488J86043J52508j96938l08265
$$ -322350 -207930 166882 162421 10617 -52748 -71367 -107855 78188 230696 33758 -274507
85b74507J35187L77067m396l82059r7347K74004J55630j38362j35469P732N9898
$$ -274507 -139320 237747 233351 -148708 -246055 27949 183579 45217 -90252 -82520 -22622
96b2622N6012O2476o1817j59165K1442K12508L4463j92578p8555J43995P7937
$$ -22622 33390 95866 34049 -125116 -103674 108834 143297 -49281 -127836 16159 94096
107I4096r4107k9484O9550n3292q0773J14964J21357j39301j80498J19370K21817
$$ 94096 -11 -29495 40055 -13237 -94010 20954 142311 3010 -177488 -58118 163699
118A63699q2827k16115N1235J69620l9849j05825O8121O9930j26952o8871J93725
$$ 163699 80872 -135243 -84008 85612 45763 -60062 8059 77989 -48963 -117834 75891
129G5891J01730k28550j51717K08917J95426j53006k12881Q5083J78845l7873
$$ 75891 177621 -50929 -202646 6271 201697 48691 -164190 -79107 99738 61865
139F1865j05850J8847K5189l4858L0320Q2931m4930j37007L2957J71767k033j64582
$$ 61865 -43985 -25138 51 -34807 -4487 78444 33514 -103493 -70536 101231 99198 -65384
151f5384l1178J27749N0442q2476m3420M3589N360j9342L9564Q022p4170j5014
$$ -65384 -96562 31187 81629 -847 -44267 -678 4682 -14660 24904 32926 -41244 -56258
163e6258Q9308L2092r3397m1836R5847L6919r3180k0408R1769J0054r4174j0598
$$ -56258 33050 65142 -28255 -70091 25756 62675 -30505 -50913 40856 50910 -43264 -53862
175e3862J02169J4527j06589j5910R3428J0154o9396k07M9952k1790m7502N4372
$$ -53862 48307 62834 -43755 -59665 33763 43917 -25479 -25686 24266 2476 -45026 9346
187I346O2246q2676q4160R1067J08958o9551j27662L3661J27386p97r8102j8558
$$ 9346 71592 -11084 -95244 -4177 104781 35230 -92432 -58771 68615 67818 -30284 -48842
199d8842M4835J7859M941M736l4801m8239L6964R5143j7813j21061j3113J15727
$$ -48842 -4007 13852 18793 23529 -11272 -59511 -22547 72596 54783 -66278 -79391 36336
211C6336M8723q4169o8526M5745O2153j2329k7000j0379j8311J1459N2664Q000
$$ 36336 85059 890 -67636 -21891 40262 27933 933 -9446 -27757 -16298 36366 44366
223D4366p0533m3155P0144P0558n6921p6998L2617O6299p441m4217j414K3493
$$ 44366 -26167 -69322 822 71380 14459 -62539 -29922 36377 28936 -15281 -16695 6798
235F798p560j878K7884j1891m3704J1017N1339K96n5614j4004N2254J5360m4656
$$ 6798 -762 -2640 25244 13353 -30351 -19334 32005 32301 -23313 -37317 14937 30297 -14359
248a4359r113L1366R69k3524O014K6865j1572l2648J9673L6441j9858l1361J4573
$$ -14359 -23472 7894 8863 -14661 -8647 18218 6646 -26002 -6329 30112 10254 -21107 -6534
261f534K5974r097k2179J0857J5167k1048q389K7640K185l1725o469L2754J4793
$$ -6534 19440 10343 -11836 -979 14188 -6860 -15249 12391 14576 -17149 -23618 9136 23929
274B3929l4352j8626L3606J7237k3867j0545J4219P590q757n79J2167j0767j7062
$$ 23929 -10423 -29049 4557 21794 -2073 -12618 1601 9191 434 -145 12022 1255 -15807
287a5807J9960J8883k3880k3179J7290K8163j2091l2698Q710K7864n725j6229
$$ -15807 4153 23036 -844 -24023 -6733 21430 9339 -23359 -14649 13215 7490 -8739
299h739K522P301M9j519P892n93j8167M425K5682m710k6723k417K3957R922k3645
$$ -8739 -6217 1084 1133 -386 7506 6913 -11254 -6829 18853 14143 -12580 -14997 8960 18882 -4763
314d763j4084J9034Q762j1199l000L203m64j099N632O780j1475j0551J7680J2529
$$ -4763 -18847 187 8949 -2250 -5250 -2047 -2511 -3610 2022 8802 -2673 -13224 4456 16985
328A6985j5853j2760R366J4948n022j7148M422J1458n607m736L511m11k913K71
$$ 16985 1132 -11628 -2262 12686 7664 -9484 -5062 6396 789 -3947 -436 -847 -3760 -3489
342c489O783P77j1805J757J4923k955j1758J079R641L481r926l826Q766J13o114
$$ -3489 3294 4071 -7734 -5977 8946 5991 -5767 -4688 4953 8434 -1492 -5318 3448 3561 -2553
357b553K663J083l826q60K828M979n688p474Q954O443o562l684K430M422N78m786
$$ -2553 110 1193 -2633 -3493 -665 4314 -1374 -8848 106 6549 -13 -3697 -1267 3155 3733 -1053
373a053K781J128o259K560O761l532p181j862P650O259q837o421M981M408K265
$$ -1053 1728 2856 -3403 -843 5918 2386 -4795 -6657 993 7252 -1585 -8006 -3025 1383 3648
388C648j537o014j0M347N319J667r722n693Q987P578k064r690o933P929R778j792
$$ 3648 2111 -3903 -3913 434 5753 7420 -2302 -7995 992 8570 6506 -3184 -10117 -2188 7590 5798
404E798q344q944L869J5789K449j3896r800P054J6687K129j6317o423Q159R089
$$ 5798 -2546 -11490 -7621 8168 10617 -3279 -13079 -6025 10662 12791 -3526 -9949 -1790 7299
418G299K587p952r421P74P542R637k842j8588m484J6851J2799q325j9807j670
$$ 7299 9886 1934 -7487 -6713 829 10466 7624 -10964 -15448 1403 14202 5877 -13930 -15600
432a5600K1503R072j2906j1332J830J1638O181n799o094l979R42J1105M819j0971
$$ -15600 5903 14975 2069 -9263 -7433 4205 10386 4587 -1507 -5486 -4544 6561 11380 409
446D09j2723J341J7616R003j8026j6131R247J9266L841j7588j1627J2427J2976
$$ 409 -12314 -10973 6643 15646 -2380 -18511 -9264 10002 13843 -3745 -15372 -2945 10031
459A0031k120p734m610J758M352L104L963o857j4583L699J9138N370j9112j8503
$$ 10031 7911 177 -4433 -2675 1677 4781 8744 1887 -12696 -8997 10141 15511 -3601 -22104
473b2104J4148K6189o675k4159l131J7958J0602r433r209N331J068k767P692N805
$$ -22104 -7956 18233 11558 -12601 -15732 2226 12828 3395 -5814 -483 585 -2182 5510 11315
487A1315j1481j4419P171K4310l28l0137q763K5464J7204j5667k3187N946K2248
$$ 11315 -166 -14585 -7414 16896 16568 -13569 -22332 3132 20336 4669 -18518 -12572 9676
500I676M28j3020k499M260K374n46L888L305j0904r608J3600J5503q728k1551
$$ 9676 10104 -2916 -5415 -1155 1219 673 4561 7866 -3038 -12646 954 16457 7729 -13822
514a3822l132K4697J2360k2048j8347J2922J9917k258j8447k124J4616J227q254
$$ -13822 -16954 7743 20103 -1945 -20292 -7370 12547 10289 -8158 -10282 4334 5561 -2693
527b693L279O306o817j0683Q510J9546q380k6946K909K8087N836k5680j5332K0623
$$ -2693 586 6892 75 -10608 -2098 17448 9068 -17878 -14969 13118 18954 -6726 -22058 -1435
541a435J8396j4201j4481Q086Q618n121l642R399L403j7021n283K2375J0609k0805
$$ -1435 16961 2760 -11721 -3635 4983 -138 -3780 5619 9022 -7999 -13282 9093 19702 -1103
555a103j9719J4049K6564o210k7669k878K0843R784j1209j2894L722J0036k69
$$ -1103 -20822 -6773 19791 13581 -14088 -16966 3877 13661 2452 -10442 -6720 3316 3047
568C047j228Q9m441k594M755R554M2j6412p078J7853J4033j2641k1178K712K4633
$$ 3047 1819 1908 -2533 -5127 -372 9182 9224 -7188 -14266 3587 17620 4979 -16199 -13487 11146
583A1146N309k3097j0797J5592J3640o828j3458L305J0166l344l472O077k14r300
$$ 11146 16455 -6642 -17439 -1847 11793 4965 -8493 -5188 4978 1634 -1838 4239 4025 -5275
597e275r81J2888O224j6869j1094J5714J3283j1199j5111M271J5805p26j3478
$$ -5275 -6256 6632 12856 -4013 -15107 607 13890 2691 -12420 -8149 7656 6930 -6548
610f548O33Q965j26n011O87N133p53o839J910Q027j812p071j223N129M204n195
$$ -6548 -5915 3050 2924 -2087 -1400 3733 2980 -3859 -1949 6078 4266 -2805 -4028 1101 5305 110
626A10n631L601L764j044k404j473L169J519l207O41L067j063k135o00M497K472
$$ 110 -5521 -1920 1844 800 -1604 -3077 92 1611 -1596 -955 2112 1049 -1086 -1686 2811 5283
642E283o875l354O802L763m730o675K611P609j951p759J647N235N9l604l33L421
$$ 5283 -1592 -4946 1856 5619 889 -5786 -3175 4434 2483 -5276 -3629 1606 1665 -1939 -2272 1149
658A149L03l067K342K941l678k131L034L035k188n237J739N575k426m432M44K878
$$ 1149 1452 -1615 727 3668 -10 -2141 893 3928 1740 -3497 -1758 3817 1391 -3041 -2597 281
674B81J626k873k757L322J790j037q42p85J397K016r18r85r71O26K520p68l183
$$ 281 1907 -966 -3723 -401 1389 352 -490 -1275 122 2138 1220 235 -736 -110 2410 1642 -1541
691a541L34J298Q65J76l102m50K240P65K94k274j980L688K861k406j961o01L450
$$ -1541 -1207 91 956 1132 -1970 -2420 -180 585 879 -1395 -3375 313 3174 768 -1193 -1794 1656
708A656K348l545k818K146J642M87k057k637J844J342L74p71k936P61L540J92
$$ 1656 4004 459 -2359 -213 1429 1916 -141 -2778 -934 408 782 11 -2925 -2164 1376 1568
724A568j802j793Q72M027l13l475m44J724J621K23k971q04J648O82J01j642j777
$$ 1568 -234 -2027 -1155 2872 2559 -916 -1360 364 1985 2208 -763 -1567 81 763 864 -778 -2555
741b555J999J872q82j104j295J291K593q56j468M85k05J704k74j701L18L51J67
$$ -2555 -556 1316 434 -670 -1965 -674 1919 1063 -405 80 -125 1579 1305 -396 -78 273 440
758D40L76j713j57Q93m33L62j15r23J138P3n74J014j01j28N11l98L86L29p73K52
$$ 440 816 -897 -1054 -161 -594 -232 -347 -1270 -132 -59 -633 381 280 152 663 265 651 980 207 459
778D59l0n82P85n90j048N10L09j11K39j446Q91J423r62jP9j45J662m47j134Q50
$$ 459 429 -153 632 42 -1006 -496 -187 -298 -59 -1505 -614 809 -153 -154 -75 -220 1442 995 -139 711
798G11k96Q4O96j576K65L81o07M84p03r95J621K55j059L70j81P70M90j254Q08
$$ 711 415 499 1195 -381 -116 265 -342 142 -561 -1556 65 320 -739 -369 -550 220 710 -544 264
817B64P87p64O76l48q94Q15Km78r7j057N96J265j495p30K57N06J430r84j199J382
$$ 264 1051 287 963 615 -279 536 538 60 -37 -1094 -498 767 -728 -1458 -1201 -695 735 -249 -1448 -66
837f6K83K96N40j304j35J145N65j5j534q29J991%j533k40l41Q36P58j319M71P5
$$ -66 217 513 1053 -251 -386 759 1324 1309 -225 -1054 937 937 -596 -836 -1177 -341 417 -902 -431 -356
857c56m27J645K70j228l13P31J138J69k085P6J350r81r9M40m22l00k73P20O18
$$ -356 -783 862 1132 -96 -409 322 1460 1629 -456 -380 970 -11 -110 330 -92 -392 -665 55 673
876F73k259O5K131l21p08J58J39P70p44K47J832j716j757K318J061j317j988j48
$$ 673 -1586 -1521 610 289 -419 -261 -122 648 -96 151 1983 267 -1490 828 1889 572 -1416 -1564
894a564K839j04k906M55J553n21m29N39J190r86j945K588K535k723k254J362K590
$$ -1564 1275 1171 -1735 -1280 273 -248 -677 -138 1052 66 -1879 709 3244 521 -1733 -371 2219
911B219k05k861n79K257J50j278j04l78o0M53J93O38r94r80J855j4L08l5j167
$$ 2219 2014 -847 -1426 831 981 -297 -401 -779 -839 -386 -193 445 -549 -1529 326 312 620 585 -582
930e82r4J642J148j365k555L82M009p94m483P37K853k2k123n13K946m03l531J973
$$ -582 -676 966 2114 749 -1806 -1424 2585 1791 -2692 -1955 898 876 -1247 -1760 1186 783 -2748 -775
948g75M366k296m609J756N545n3o881n36O434R48n417j528L633J927l797j487
$$ -775 3591 1295 -3314 -1558 3987 3934 -2947 -3483 2951 3899 -1518 -3046 587 2514 -1283 -2770
964b770M149j48l885M32M529L02m496j828N229K444l962k189J857K444j4l010
$$ -2770 1379 1231 -2654 -2222 2307 2609 -1887 -3715 1514 3958 -4 -2193 -336 2108 2094 -916
980i16q25J993M45o00o12l67R37o21j018J732J529k386j842J651M210p85n818
$$ -916 -1741 252 697 97 -515 -882 55 -566 -1584 148 1677 -709 -2551 -900 3310 2525 -3293
997c293M48O301L18n715j866N065L041n954k071N545J018n691l86N551J294o438
$$ -3293 -2845 3456 3774 -1941 -3807 1258 4299 -1655 -3726 1819 2837 -2854 -3240 2311 3605 -2833
1013b833k513Q134K686p563l028O166M344m469n088M185L724l764k163K672J514
$$ -2833 -5346 2788 5474 -2089 -5117 1049 5393 924 -4164 21 3745 -19 -2182 490 2004
1028B004l047j777L605J958l786k848M060K222j407k876q3L086J147j791j007
$$ 2004 -1043 -2820 785 2743 -1043 -3891 169 2391 984 -1892 -1975 1111 2258 467 -540
1043e40m67J747J547k314j404J359J135j241r92J386R32k751r46L905J303m413
$$ -540 -1007 740 2287 -27 -1431 -72 1063 -178 -1170 216 1148 -1603 -2549 1356 2659 -1754
1059a754k008M341M130m385m529M303M426l880l820L098L238k913l711L490L622
$$ -1754 -3762 579 4709 324 -4205 98 4524 644 -3176 -78 3160 247 -3464 26 3648
1074C648m668l047M495K995l611l994L288M789l134l853K957K497j617j968J445
$$ 3648 -1020 -4067 428 3423 -188 -4182 -894 3895 761 -3092 -135 2362 745 -1223 222
1089B22J587j918j457K859L60k464p93J944P74j479q04R21L12q08J157L26k075
$$ 222 1809 -109 -1566 1293 1653 -811 -1604 340 1114 -365 -1169 -248 64 -744 413 739 -1336
1106a336N98K017P2j871p23K299Q68k646m85K461p54k018N40K456o18l414J347
$$ -1336 -738 1279 1351 -520 -1243 1056 1924 -722 -1207 1254 500 -1518 -978 1478 860 -2554 -1207
1123a207L514j344l503J692K914r19k943Q07L375j241l287K342J827j562k258
$$ -1207 2307 963 -2540 -848 2066 1147 -1796 -989 2386 1145 -2142 200 2027 465 -1793
1138a793J356K511k060k774K616J988k259j722K025J588j554j478K135J429k805
$$ -1793 -437 2074 14 -2760 -144 1844 -415 -2137 -112 1476 -78 -1556 579 2008 -797
1153g97k94K371L12k064m26J722O89k734J16K461p59k061Q86J620r83j285M72
$$ -797 -1091 1280 1592 -472 -898 824 1513 -1221 -1105 1356 597 -1464 -578 1042 59 -1226 -754
1170g54K396j360j960J845J450j292j214J325J062j371j193K019M04k363l46K166
$$ -754 1642 282 -1678 167 1617 325 -889 436 1498 127 -1066 953 1357 -1006 -1352 814
1186H14j06j698m17K355j71k425M68K683r24j972J095K036p74k225J042J981j400
$$ 814 708 -990 -1407 948 777 -1648 -1180 1503 579 -1393 -298 1738 964 -1261 -219 1762 362
1203C62j625J294J157j126j851J573J801j921j683K302Q03j568q27J594J069j616
$$ 362 -1263 31 1188 62 -1789 -216 1585 -336 -2019 283 1086 -482 -1309 285 1354 -262
1219b62r27K217J10k189L48J796J22k028k96K033j32j938L07J882p47j058L80
$$ -262 -1189 1028 1138 -1051 -703 1093 1215 -813 -1109 924 792 -1146 -839 1043 296 -762 -382
1236c82Q16j44j417J353J456j922r63J661P98j082j096J124R12j376r83J697J24
$$ -382 434 290 -1127 226 1682 -240 -1203 458 1256 174 -922 202 1114 -262 -1245 452 576
1253E76j738L57J134Rj374m05K352j28k066Q89J342n21j026K80J477o89j392J029
$$ 576 -1162 -805 329 338 -1036 -1441 911 783 -1283 -394 948 427 -599 -319 1158 469 -923 106
1271A06J382j600j073R50R25p50j192R48J217j436m35J417P4o27n06R11P29j263
$$ 106 1488 -112 -1185 -235 690 -60 -1252 -304 913 -523 -958 459 533 -94 -600 311 1040 -223
1289b23l50J592m43q60m8P31J92j098j64J143k50r96O50M87k14o81O54L90j06
$$ -223 -573 1019 576 -284 -332 399 591 -507 -671 472 222 -774 -124 363 149 -532 122 512 406
1308D06r63Q42N39o72n28J028j72k83o93Q19K1p32l07J243m25r41N04M75Q1r96
$$ 406 -557 285 824 152 -376 652 480 197 -496 323 344 -388 -695 548 123 -818 -314 161 242 -754
1328g54N73J034o88o56L47P81k94m63J30O52p11m56O82K04n61m86M90M05k07o41
$$ -754 -181 853 165 -491 -144 637 343 -120 10 662 -49 -505 177 381 -180 -666 -176 229 22 -619
1348f19N33L23n26O1L38n3K33k55L30J26p84J22M06k17k02J33j45L51m57N2K32
$$ -619 -86 237 -289 -228 110 57 290 35 365 491 -293 -171 235 18 -184 -51 -196 155 -302 -250 -18
1369a8k60N0N84j63m60K41J61M41l95l24L55J58j62O7l59M63k70l77K34Nl56J86
$$ -18 -278 -228 356 193 -267 -26 135 576 181 -143 212 370 208 275 -84 379 109 -268 -34 -29 -385 -199
1391a99j36J47O52q05n7R03k45m9j23M7M16j95n20L92q5q4n7n22M76Lo57N50J74
$$ -199 -335 -188 464 -341 -398 505 260 211 88 135 551 356 -164 228 143 59 2 -520 -44 -41 -698 -148 26
1414B6O9l95j14O24K42o82j63Q68K17o29m77K58O45j48r13L86L67l67n9k76P19
$$ 26 95 -300 -414 210 452 -230 -393 475 692 63 -414 -156 489 341 -572 -186 181 -186 -245 -521 198
1435A98J05q06J01Q14j87l95k58O98O54p83p69P43N66k33q18K7J252n50j158K73
$$ 198 303 -503 -402 412 225 -170 -428 270 924 141 -628 115 681 448 -370 -343 909 359 -799 -526
1455e26J011l76p90k42J210K07j174R3J117P1p68l20P72Q12j081o34J155Rn76
$$ -526 485 109 -681 -923 287 494 -680 -587 530 601 -167 -487 285 1097 16 -618 537 546 -30
1474c0l51L31N97n07j097R35P23p18n23PJ119Q2r91K31O37q8k90m10P08O05q39
$$ -30 -381 -50 547 40 -1057 -122 601 -117 -640 -633 486 568 -423 -192 445 357 67 -343 365 970 131
1495A31r87P91N85m99q34J70J170n25j111P14J119k47j149J77R96M13j381j37
$$ 131 -856 -65 520 21 -813 -643 527 2 -1109 -395 724 477 -672 -495 501 914 -467 -604
1513f04J333L70j262n10J058N28j422l97J147M35j214j69N38P35n43j000J166
$$ -604 729 1099 -163 -673 385 913 -509 -906 241 676 -538 -707 -169 566 23 -977 189
1530A89P88j196j67L41O84n9j089L42Q04l17p72K37L20r5o2n99O73O8j29j89K3
$$ 189 977 -219 -386 -45 639 580 -509 -167 637 320 -452 -215 105 10 -52 -651 22 90 -39 -228 -205
1551b05N39N0j024O88L76Jn72k47R62k3r04k32J233j53j034k5O77K38p34n22J193
$$ -205 334 384 -640 48 424 425 -147 -394 568 545 -359 -591 642 489 -545 -570 107 345 -389 -911 282
1572B82K71r93l90P31J035q44n97P17Q13j002n00P58J81m49o09N25N35p83l89
$$ 282 553 -440 -830 -99 936 92 -505 212 1025 23 -477 281 462 13 -596 -71 464 -319 -708
1591g08O45N8l79l6J56M53l99j45O11L7m30J89K06J40m07k35L22j17m44O67l59
$$ -708 -63 -5 -384 -420 -264 189 -210 -355 256 293 -137 52 258 398 -9 -244 78 -39 -483 184 -175
1612a75k93M68k44M65l72NM10k05n07M30L25k66l27L51L76k17q17L13O35m01n38
$$ -175 -468 0 -244 221 -151 -146 264 59 -448 -18 307 41 -286 65 441 224 -593 -280 355 -46 -584
1633e84O10M45n36n14M02N52m02n26N75L18k67l68K30P72p06l70O34J41m82r2
$$ -584 26 471 -65 -579 -177 375 -27 -553 22 340 73 -295 -65 707 1 -369 265 406 -76 -168
1653a68K81N5l22l76P16J93o78lL75o4n7k5J67P5o59Q03J60m30r1K19K69m68m21
$$ -168 113 168 -154 -530 186 379 -299 -302 73 9 -48 -73 94 169 -490 313 473 43 -48 171 440 -28 -449
1676d49M88J49m89q7O79j58k74j09K9M23o19K12N86k61j69o0M80j49l71l3P65
$$ -449 39 188 -301 -388 291 133 -141 -250 -221 202 -417 -205 381 120 -49 -109 371 222 -149 -182 583
1697E83l77q21N86L36o47k92O43K01j92o08P64K42o38J09M43j68R7o32Q23J67
$$ 583 206 -615 -29 307 -340 -632 11 212 20 -588 176 418 -220 -111 332 164 261 -371 452 619
1717F19p25j21N49j97k47kK44l3l95k02N96j7n77O92j19j24j91K65L90j23o41
$$ 619 -106 -227 322 125 -122 -124 120 87 -308 -510 86 69 -508 184 65 -59 -250 15 405 282 -359
1738c59N30Rj62k00P9L72n24k25M37J54q4m98L85K55n07K9J71N15o11L08K25k33
$$ -359 171 180 18 -182 -103 269 -255 -480 -43 111 27 -471 -86 169 -338 -309 -138 377 -234 74 299 66
1760F6l32L59K19j02n40K04M74l51k77L68R8l06j6J89L16n79p1N42p1k93J20J98
$$ 66 -266 93 312 210 -330 -126 348 -3 -280 88 186 -120 -136 53 369 -210 -281 261 190 -103 17 215
1782B15K26m35q9L94K00j013K75N36p2o00R5N91n80p8N1O72l12k6lK02J2m35k
$$ 215 441 6 -83 311 511 -502 -227 309 237 -363 -268 323 -257 -335 -284 388 76 50 47 249 261 -174 -176
1805a76O14m71j94K62L07o04L43J4L2m72P6N60n86M4K30J64j75j00M7L98k22m32
$$ -176 438 -33 -227 35 342 -262 81 95 127 -345 -269 291 -295 -251 -21 143 -32 -132 -85 313 91 -341
1827c41L80N13l08p3o9L69l16n37L17L36n62L20K3K03l15k96K30N11l83o2J86
$$ -341 39 552 244 171 102 471 155 -382 -65 271 -291 29 52 255 -60 -356 -126 385 2 -60 126
1848A26n3l31M29m6K60l61m00N44N4l36n4J12K16m47P0N22l97j65L30J63j99j26
$$ 126 73 -258 171 125 385 24 -376 168 222 -114 -168 -56 160 -287 -217 305 -92 -257 73 236 37 -89
1870h9O06m57m9l56O07j78q5k20P27l82n35k0N89n9n63J16M73J11m85P3K99K13
$$ -89 517 60 11 -345 262 84 -1 -221 506 124 -411 -431 158 99 -464 -348 125 236 -249 -176 123 336
1892C36k09k63J48J71n13L57J8J9k1l07J03K10m35L75j35o0N8J00J04l79M5M91
$$ 336 127 -136 12 183 -330 27 45 64 43 -264 -161 49 -386 -11 -146 -206 -148 -48 56 -323 -278 213
1914B13J23m36K79J69m22j13J63K22M3p81O43J14k96n84O57k6o5l89K47M30j44
$$ 213 336 -100 179 348 -74 -187 -24 198 241 -540 103 217 -79 -663 -6 -32 -97 -486 -239 191 47
1935D7m01N70N73o75l67K26N31k01o62Q1P70n33k30J56k0O53p25Q1L17j95q5o7
$$ 47 -354 216 789 114 -253 -27 504 303 -359 -278 492 -41 -271 -115 -135 518 -207 -126 191 -4 -89 -156
1957a56L62J78m59n0L32o0Qm05j12L91L55p38K46k5M16m55p6J57N15n23j13L35
$$ -156 206 384 -75 -125 207 147 155 -250 -362 29 384 -354 -108 -133 283 -172 -248 -91 424 -99 -212 123
1979A23K02l86m74Q22K71l49l85K80j55L3J18l82M99l19j78K07J42j54R6k32L46
$$ 123 325 -61 -535 287 558 209 -176 104 -51 -18 100 -282 217 -102 -280 -73 69 -85 11 -221 125
2000A25O6j64k76L74K01l93k91L58N36n36l96M70J66l20pK09N0M6q46N16L79k96
$$ 125 191 27 -249 125 326 -67 -358 0 536 0 -396 74 240 -80 -87 122 172 218 -628 -112 267 -29
2022b9j19J98R3R3l85K9R95o34n40K71R1L83m64k57L65L2j96n3K99q4j71j17L03
$$ -29 -148 50 143 236 -149 -120 875 241 -299 -28 63 446 -18 -275 90 122 -74 -127 172 88 -83 -200 103
2045A03J79m59J28Q8M9J9j42P1P5p4K8q1N4J71j37l41L18J40j32l81j80O33Qm34
$$ 103 282 -177 -49 39 88 107 -35 36 111 37 65 -16 38 209 72 -269 49 189 57 -324 -504 129 137 -297
2069b97R1O73m94K28l99P33q7o56k82O76m3m44K42K50q8m43l5M56n1m25L64M04
$$ -297 -206 467 -27 201 -198 535 448 -208 -490 186 143 -301 -59 191 103 -340 -375 81 30 -395 -31 373
2091C73k5o20J21N58k41l33jN78k31l51o7L52k6k05l02K01j6J28L59j62J5q8k10
$$ 373 348 -272 -151 407 166 -167 -168 410 179 -172 -239 113 87 -118 -420 -219 -235 -107 252 90 105 17 -193
2114a93L02l81N91J26m72J73J04m9l00k12K60K19n54J17K57N8k05j81L03M25p13
$$ -193 109 -272 319 445 -27 146 250 201 -99 -311 -51 168 -386 -269 -12 46 -159 -340 -37 388 -325
2135c25q3L49L32l34L6K93R0l06j01J06M78n86k06K97P3k21j91L79J70m91N3K90
$$ -325 -408 -59 273 -61 -25 268 358 52 -49 57 535 -51 -257 40 113 -108 -299 80 250 -241 -188 102
2157A02j17n2J55J89R1n25J17J06n9j23J26K04l28O6L27Pn83j5M29k55p1k12N84
$$ 102 -15 -67 88 277 368 -157 -40 66 7 -116 10 214 -114 -48 279 286 -297 -312 117 -138 -209 -421 163
2180A63K52l45o3L73R7p21K54L38j42n10N9M35N4o95L33M66k37o39M07L30j04
$$ 163 415 70 7 380 477 -244 10 348 206 -304 -245 190 244 -451 -118 348 111 -528 -121 209 105
2201A05k83J03M50l16j38j7O39p30o2J49K97K2j3k4j99k91L23M95m48k16j79M01
$$ 105 -178 -75 375 59 -79 -96 543 -187 -249 -100 197 219 206 182 -17 -308 15 510 62 -154 -333 68
2223F8k80l4K91K86l16j95K11L33j17k97m7M73l22m31L00L23l58m65N03L25m57
$$ 68 -212 -246 45 331 15 -180 31 364 247 -50 -97 376 54 -377 -77 246 -112 -577 -74 251 -206
2244b06j09J54J14p3j57M51j64J10k23J85K62o27K76j0j26R7j32O29n34l17J96
$$ -206 -315 -161 -47 -120 -277 174 10 120 -103 82 344 -283 -7 -17 -143 -46 -178 451 -83 -400 -204
2265b04N99p29K57q4R5J29K9J69J41k65k81K41j98K49k50Q3K15k50k66K94kl10
$$ -204 395 -334 -77 -161 -66 63 92 261 402 137 -144 97 -101 148 -102 -19 196 -54 -320 -26 -28 -338
2287c38K48Q2J92n05P4L81k48L14j14K03j67j5k10J90k63k58M49K60l04J38k11
$$ -338 -90 -8 184 -321 -247 134 -114 200 86 289 122 107 -103 87 -176 -434 15 275 -29 109 -102
2308a02k92M73j85n4K86k11M8O1M4J65k78L36k99o3L3K88j46k56M8R6K60o60J44
$$ -102 -394 79 -106 -160 126 -85 -37 24 68 233 -45 291 -8 -71 -38 250 104 -152 -104 -8 252 -408 -264
2331b64L52l85QK60P2k12l1L68L41k00m69L58j82o8Qj93L41k8l01K15j46N4j47
$$ -264 88 -297 -289 -29 43 -169 -200 168 509 309 -160 198 16 -52 -44 -237 104 76 -225 -10 -156 -102 -249
2354b49N56o42L30K64m14J32R9j65J67L7j35M03m18n9J69n4M16n13R8K80l48j96
$$ -249 307 -335 -5 259 -155 -23 76 -89 78 115 -20 383 -35 -94 75 21 437 -76 22 302 -46 -242
2376b42J33Q3L9q8k58N61j44j65j2L83k01j05O4J37mp6k99K49K04m55K48j17k8
$$ -242 -109 -26 13 -75 -333 228 84 -81 -93 290 89 -16 48 185 181 105 -194 55 259 -196 52 -65 -93
2399i3L9m3j30K72k8M2k82Q2L32l25L99n3k09K49k98j15K57n9r8j46K14M5j78
$$ -93 -54 -97 -227 45 17 59 -223 -141 191 -134 265 212 3 252 -46 -161 96 37 -61 -207 7 52 -126
2422a26l74R02k72j28r5J45J87n02o8M39L22m03l13O47k45j55o5k93P83m80N1
$$ -126 -500 402 130 2 -93 52 239 -263 -331 108 430 27 -286 361 116 -39 -104 -397 386 -94 -43
2443d3OKp8jK6J68O8l15q9M80l71K89j14K5J74l42P6m3K9O6l07K56L24m14J83
$$ -43 -37 -35 -113 -114 -88 80 148 -167 -256 224 -147 142 28 53 227 -115 -39 -82 -53 13 -294 -38 286 -128 55
2468E5J96k27j24r0P0M38M33r60J89K92k24M7n8n5Q4j07j0L53j42k71k63L00K93
$$ 55 251 24 -100 -190 -120 318 751 -209 -20 272 48 95 37 -18 66 -41 -51 302 160 -111 -374 -74 219
2491B19k98l0R6J31O4l7j19pl2Q5%J8l16L90k91J41Q7k24k25J94L38j10p2J27
$$ 219 -79 -109 -13 118 182 145 26 19 -13 72 72 90 -226 164 -127 14 101 -123 -348 -154 184 74 2 129
2515A29j7O5k74J64K59k94j76J47KJ00j94O4N8J0k36J82QQj44j38L32j13J70k76
$$ 129 112 177 -97 67 326 32 -144 3 5 105 -89 -25 33 43 -193 -11 -3 5 -139 -277 55 -58 112 -164
2539a64L01k16K22l01L91j41K64o42Q9r9L03k02M55J01l10J30k89q8K91N0o8P
$$ -164 137 -79 143 -158 233 92 356 -286 -197 -296 7 -195 260 361 51 181 -108 -196 95 145 77 84
2561H4k54L30j31M4n8m3k53K14N4J59k64k2J52J25m01j02K76O9n5k12M88p9j30
$$ 84 -170 160 29 73 15 -28 -281 -67 -13 146 -118 -140 12 137 -264 -366 -90 -21 -76 -288 200 121 -9
2584io2K46j89q7j12J73J11N5k66M49k48j23k8K09N1M3n39J32L70K4q1j65pJ07
$$ -9 -71 175 -14 -101 -213 -40 71 126 -140 309 61 -62 -90 119 170 213 -326 -194 176 200 119 -46 -53 54
2608E4J44k85Q4J27r8j8qm09L10J45M4n5k47J61R9r9J96k64R8k7j71M09l61J38
$$ 54 198 -87 -3 124 26 8 0 -409 -99 46 90 35 -212 -51 48 -51 145 -119 -21 -48 -219 190 -171 -33
2632c3Q5Lm44M00R8k79L05k63N83o68L1J90J41l5l10K74o9j18J21M6K6J2q1j72
$$ -33 52 55 -389 11 109 -170 135 -128 455 -213 -182 8 149 114 -196 78 9 -109 12 58 84 96 15 -157
2656a57J90J72k38J35n0k83L40J16l98j74K56J88j75M4M7M0k04J17L41o6l46K14
$$ -157 33 205 -33 102 52 -231 109 225 -173 -347 -91 97 -78 -34 13 53 -151 -34 307 241 -105 109
2678A09p8K36l17o9K08J23l25j06L14k0j53k31N72j67k40%J75J29l30J61K59j62
$$ 109 31 267 -50 -119 89 212 -113 -219 95 75 -78 -309 263 96 -144 -144 31 160 -170 -9 250 88
2700H8l00J39J28o5j07K95j13J2k84p6N29k85j86K8J32J96j47j5j56K02n4RJ87
$$ 88 -212 -73 55 -10 -117 178 65 77 -207 -283 246 -39 -225 -197 -65 131 -16 -31 -187 15 -39 -30 157
2723A57j12k03L39lk48J86m2K16l42m6j6K44n22O40m5k48N8o9j10K20j58K6J65
$$ 157 45 -158 181 178 -70 116 74 290 -52 -98 -114 130 -392 248 203 -45 13 -56 -166 54 -104 -78 87
2746H7k4k90K14J10j47k52L35Q7k17l58M38j75J63n6n3J54k08K79o7L20k33k34
$$ 87 63 -227 -13 97 -50 -302 33 120 -97 -455 -17 -192 -29 -85 -138 16 -192 87 20 340 107 -127
2768a27k6J86k4m0O3O6k99L0L21L2m27l3J43k0K40K69l42J6j58K14po6k09K57
$$ -127 -153 33 9 -31 32 98 -201 -171 150 182 -245 -278 -135 -155 85 354 12 28 -130 84 77 11 -198 59
2792E9k33j13K06n9K80l26J7K62p0j48K15K2jp0p1N2L76l70j11K49o0J33l84K90
$$ 59 -174 -287 -81 -140 140 -186 -169 93 23 -125 90 112 111 41 -30 22 398 28 -83 166 106 239 -145 145
2816A45l18q6K99J22k17Jk8J01j5P7J90Q2p30K25M8L78l03N8L5N6l26J16J48j62
$$ 145 -173 -259 40 162 -55 -54 -82 19 4 81 271 353 -377 -152 -104 274 -29 29 64 120 -206 -90 58 -104
2840a04j38J55K64l68J89k09N22k43j70M6J45R9l54nO14n65R1q1K55l64J88J10
$$ -104 -242 -87 177 -191 -2 -211 311 68 -102 -56 89 188 -166 -171 443 -122 -31 -112 143 -221 -33 77
2862G7j20j96K70J44l36r3K20Q7K2k02L2J39l2l34L41p9k3j62P4L71l12M1K07
$$ 77 -43 -239 31 175 -161 -254 -34 53 75 -127 -95 44 12 -322 19 -60 -83 -245 -171 200 -112 -71 136
2885A36p4K8l5J56O5k25l18L98p9k5J47k46J87J4k29K66j51M8K29j54j08p7K13
$$ 136 62 90 55 211 276 51 -267 131 52 27 174 -72 115 129 -100 166 15 63 292 138 30 -47 166
2908A66l84L08r3j27R2q4K79M5q3j20N9J56j84j51k5oR3L7j85J74r1J94Kp1j36
$$ 166 -218 90 -3 -130 -38 -122 157 202 119 -1 58 214 30 -121 -146 -152 -59 -22 -207 -33 -124 70 72 1 -135
2933a35Q9j81L78K03l42r1k19L50j3o1l3n7M6j74M43l6k76L3Q4K42j57L7l52Q5
$$ -135 -46 -227 151 354 12 -79 -298 52 39 -22 -55 -112 -66 -240 203 167 -109 -76 8 250 93 130 -222 -137
2957a37K20m58K55J87Qk13K37k01J3K82j98j5k3L05k80L27l67j4k03K58J2K43
$$ -137 83 -375 -120 67 75 -138 99 -102 -89 193 -5 -20 -43 262 -18 309 -58 -72 -275 -17 -5 238
2979B38m05N2L26k43N9J86j39J21j16j79N32m85J09Q0l26M38k80J8J6K8j55L24
$$ 238 -167 -115 211 -32 27 213 74 195 79 -100 432 -53 56 136 -190 248 -32 -14 2 30 -125 199
3001A99k47J81L6k52L2O1J24k84o9pK76j70K01K1k2R9k06j68M8J39Pj02N3K9K4
$$ 199 -48 133 169 -83 -51 10 134 -150 -219 -226 50 -120 81 102 80 179 -27 -195 -147 -8 -1 -103 -50 -21 3
3026Cj21O8P8k23L72n8k26O3K24j07j03Rl1P7j76L80k73j5J52j1Lj82K27k11k6
$$ 3 -118 -50 28 -195 177 119 -107 -44 180 73 -30 -21 -52 25 -151 229 -44 -59 93 82 85 -97 130 -81 -107
3051a07L9J04j94N3J61N6l6k90K82L3nk21K5J60j52o9J55j45M70k75J51j41n2
$$ -107 -68 36 -158 -105 56 112 76 -214 68 101 96 -125 -100 60 -92 -161 -6 -151 319 44 195 54 2
3074BL1J08J21j01k49J02J07J4L6m99L52P1Q4j60Q6k87Q8p6R1J59j39n3K84k60
$$ 2 33 141 262 161 -88 14 121 135 171 -328 24 95 179 19 105 -182 -94 -170 -79 80 -59 -112 172 -88
3098h8J58p0j9k22K99j03j42K81k9O6j87J42k23J97l3k70K77m20J16K41J62l9
$$ -88 70 0 -19 -241 58 -45 -187 94 65 131 -56 86 -137 60 27 -243 34 -386 -270 -29 133 94
3120I4j23M7N7l3K03m09J04L20j21k04K26r6j48j39J24N9J85nl01K57k06K73l02
$$ 94 -29 18 75 42 245 -164 -60 260 139 -65 161 65 -83 -222 -98 -39 146 141 -160 97 -109 164 -138
3143a38J54j28J04j52L84l55K5J27J60k03J27m65J65L00o2n1m8J79Q1k10k02K44
$$ -138 16 -112 -8 -160 224 -131 -106 21 181 -22 105 -360 -195 105 43 -8 -56 123 204 -6 -208 36
3165C6R9J9j62J05l79J39J00K9J44l93L31j82J09L4j13j63K74J16r3k52L43j7
$$ 36 135 154 -8 97 -282 -143 -43 -14 130 -263 68 -114 -5 29 -84 -247 27 143 50 -202 141 124
3187A24k98L14k2j04j66J46p4P5J60o7K59k94j32j47L52k63l1J82l15M37l87J55
$$ 124 -174 140 118 14 -152 -6 -80 -5 155 88 347 53 -79 -226 126 -137 -168 14 -301 136 -251 -96
3209i6L42j93J40r2k80J38K11j80M0j6K66j39k84k1J01j46J09L64n5l20M4q1M16
$$ -96 246 53 193 101 -179 -41 170 -10 30 14 280 141 -143 -164 -63 -209 -100 264 209 -111 -67 -148 268
3232B68j82Q9m01j2L39K10o06N16q9j34k16K27r9l80O01l73J72Q3K8k86P4J11
$$ 268 86 175 -226 -238 101 311 -295 221 132 -2 -218 9 -90 -470 131 -242 -70 13 41 -245 -171 -60
3254f0j8r4K56L5j81J66O1k82J8J40k28L0J56k6o8j13J31Q7p7J08j41L27l34K94
$$ -60 -78 -172 84 119 -62 104 165 -117 -99 41 -187 -157 -1 -27 -95 -208 -77 10 -67 41 -100 227 -107 187
3278A87k11O2R4j47n2K52j36r8K39l36J83k01p1L83K00m76J99lj45J57Q7j52P1
$$ 187 -24 38 132 -15 -67 185 49 -49 190 -146 37 -164 -235 148 348 -128 71 68 -77 80 167 15 86
3301H6P4Q0n4j63j84QJ16j72K24jJ5R2k68RJ61l0J78k75Q8R7J9l18J75JJ07R7
$$ 86 160 240 186 23 -161 -153 -37 -209 15 14 29 121 -147 -138 23 -7 171 -104 -16 81 100 -218 -43 -42 65 162
3327A62l88L66L2k23MJ21l76L43p2K5N9J14j74M6o3R1j28P3J68J7k26K75k69o8
$$ 162 -226 140 172 -51 -47 74 -302 41 -31 -6 53 167 -7 39 -24 67 -61 12 180 197 -29 246 -23 -91
3351i1O5K6j20R6K04p1l3m02M38m74K95k89L34r7K29J1J8j30J34Jj36Q3J60j15
$$ -91 -26 0 -120 -24 180 109 76 -326 112 -362 -67 -356 -22 -119 110 121 139 9 143 144 8 91 251 136
3375A36j11K53k47j74J85o5m6J00j5R5q8p1M40l37j84J7j42M80j00j95P9k3k3
$$ 136 25 278 31 -143 42 -23 -69 31 16 111 23 -48 392 55 -129 -112 -254 226 126 -69 10 -13 -36
3398c6l8K22j60L08j83k26ro1L63k68M4L23k32p7n5k45J97l2K35p6k4j35J00m5
$$ -36 -74 148 -12 296 113 -113 -122 -183 180 -88 -44 279 47 -30 -85 -330 -133 -165 70 -6 -30 -165 -65 -110
3422a10K43J9k46J95N8l8k26j13N03O5j87l92L59j45J0L5k2J90j99q3J33L53m24
$$ -110 133 152 -94 101 159 121 -105 -218 285 350 163 -229 130 -15 -5 30 8 198 -1 -84 49 402 -22
3445b2j05K97O2l66J62k41J88n7L28k97J72o8M4j25o5J07p3J17j08K43q9j55K73
$$ -22 -127 170 232 -134 28 -213 -25 -82 246 -51 121 53 97 -28 -93 14 -59 58 -50 193 104 -51 222
3468B22k45j38P1L26n9m9K6q7k70k7n5L05j22K97k40l3J5q8M1k07J76J73q1j00
$$ 222 -23 -161 -90 236 177 128 154 67 -203 -230 -285 20 -102 195 -45 -78 -63 -151 -110 -317 -141 32 -49 -149
3492a49J00QJ70n18M94J64p6k22J42J16Jl27K04J52n09L37nO3p6k67K9J51O3j82
$$ -149 -49 -41 129 -389 105 269 193 -29 113 229 230 -97 107 259 -250 87 82 145 69 -198 -169 -18 45 -137
3516a37J94P1m9J97l58K98j66L02k50l23K21l2K40j80Q5q4o8R5n1j7K28j28j02
$$ -137 57 128 79 276 -82 216 50 352 102 -221 0 -32 208 28 113 29 -39 56 5 -12 216 88 -14
3539a4N8j14J77j26p9m8L31l31J55r4R3Q0Q0l69K59j36j06K63l81L28N4Q5j25
$$ -14 44 -70 107 -19 -98 -146 185 -146 9 -85 8 88 168 -201 58 -78 -184 79 -302 26 80 165 40
3562D0p7O1J49k44J47j28K0r3J1J28j55lK19Q2l57K01rJ4K9k67K05K51m94K45
$$ 40 -37 24 173 -71 76 -52 -32 -125 -114 14 -141 -144 75 157 -200 1 -8 6 35 -232 -27 224 -270 -25
3586b5J92n4lm51M55j24J65J07l41J7M6j8Q9j04J4K26m0o5N9l10OM10j79m6o8
$$ -25 167 113 110 -341 114 -10 155 262 -79 -62 -16 -34 55 -49 -35 191 151 86 145 -165 -159 251 72 26 -42
3611d2j12J93n4j43j8M20R8l80n6o4K5J22K57k63j64Q1L25m30K10j09n2K51l33
$$ -42 -154 39 -15 -158 -176 244 342 -38 -94 -158 -133 -11 246 -17 -181 -100 225 -205 5 -104 -156 95 -238
3634b38M35k80J90j55P3K29j97j6j33L3on7J28K09l02k8Q0J82j31%J14l29K58
$$ -238 197 -83 107 -48 25 254 57 41 -92 -59 -65 -122 6 215 -87 -115 -35 147 16 16 130 -199 59
3657E9j71R4J40m29N66m62K99m05J4L09l09J33J26M5j97K32Q0K36n75M88m51j58
$$ 59 -112 -18 122 -307 259 -203 96 -309 -295 14 -295 -162 -36 9 -188 44 124 360 -215 273 -178 -336
3679c36M98oq8j64j91L91K38k97j66J23k0J2r5J48L15m33kN8o9J94p2j93K02l4
$$ -336 162 156 68 -96 -287 104 342 45 -121 2 -18 -6 -101 47 362 -71 -73 -15 -84 110 38 -155 47 13
3703A3k2%p8J58Nk28m0M9M7q3K76j61r4O5J17Q9k79L95k22K71l63NJ79l10J44
$$ 13 -9 -9 -87 71 76 -152 -192 -143 -96 -179 97 -64 -158 -93 24 113 -166 229 7 278 -85 -80 99 -211 -67
3728f7k12J27Q0l26J0J40nL06P7j27q8J49k3P7k66m6K49j42r2K5M40j55o2k65
$$ -67 -279 -152 -72 -398 -388 -248 -253 53 130 3 -85 64 41 118 -148 -194 55 -87 -179 -154 286 131 69 -196
3752a96L08J58l70n4J79J5j39K19L6j2j83o3J16o0n2J70J00j66j14J15R4PN8j56
$$ -196 112 270 -100 -154 25 40 -99 120 156 144 -39 -102 14 -46 -98 72 172 6 -108 7 101 108 166 10
3776A0l2j76K95k34O4N9K2m3K7n8O2J62J21m79j08L91N0m18J81m3j50L60J06l44
$$ 10 -22 -198 97 -137 -73 -14 8 -35 -8 -66 -4 158 279 -200 -308 83 133 -285 -104 -147 -297 63 169 -175
3800a75J49K9K3k88L16k00n6J71l7J48j43K15j25R5j57J3j15J33j3n3O8k7j29
$$ -175 -26 3 26 -262 54 -146 -202 -31 -68 80 -63 152 27 122 -35 -22 -137 -4 -17 -70 -2 -29 -158
3823a58j06N5K65M7j07m1J38k34R7j3l1J04L7J50k85J06k32K85k0k20M4J47p7
$$ -158 -264 -209 56 103 -4 -45 93 -141 -44 -57 -88 16 53 203 -82 24 -208 77 57 -163 -119 28 -49
3846d9N9K10k89K56j35p4j93L48j7j6j34J30N7l45K11j56L17J54k65l6l59K44
$$ -49 10 220 -69 187 52 -22 -215 133 116 100 -34 96 153 -192 19 -137 180 334 69 33 -326 -82
3868h2P3O9j62K18j90o2oL68j15j41m5k5o0M48j97j01O8j02J8K8j34K08Mn10L88
$$ -82 -9 60 -102 116 -74 -136 -142 226 111 -30 -75 -100 -160 288 91 -10 58 -44 -26 2 -132 76 80 -430 -42
3893d2Q3k15L83l61K25k8j11J84k0j4k76M83j11k96o3J75K2o2lJ92k57L0P0n3
$$ -42 41 -174 209 -152 73 45 -66 118 98 84 -192 291 180 -116 -179 -4 18 -44 -47 145 -112 -82 -12 -65
3917f5l9K28L7j52n2L8k7r5K78l5m7k05j15J10P4l3K9n6J76L8K2lj96L69j06k55
$$ -65 -104 124 161 9 -43 -5 -32 -127 151 116 69 -136 -251 -141 -67 -100 -71 -127 49 87 109 106 -90 279 173 -82
3943h2L3J27l08K18P8K08l19L0L31j96j56P6k54K23j76K54l07J50M3J19P7k40
$$ -82 -49 78 -230 -12 66 274 -45 -15 316 120 -36 40 -214 9 -167 87 -220 -70 -27 92 169 -71
3965g1K00j01J9lk64L32J56l94K24J5k38l4J21K7j0q6q5J16M7j49M10k29J2m82
$$ -71 129 28 47 44 -220 112 268 -126 98 113 -125 -159 -38 -11 -21 -107 -192 -76 -29 -178 232 3 15 -467
3989d67M91J53k42k68R1L01Q2J03m42L18Pj03J11L6O2k57Q%J9J73j83K47k87J45
$$ -467 24 177 -65 -333 -242 59 141 244 -198 120 127 24 135 171 233 -24 -16 -16 3 176 -7 240 -47 98
4013I8k05K0O6j87J87K1J39j07k86k8K31j1j6K04n7O9r2p1q7K94l44j57L60l9
$$ 98 -107 -87 -21 -208 -21 0 139 32 -254 -282 -51 -62 -78 126 69 138 46 -25 -112 182 -162 -319 41 2
4037Bj62P7j7J55j24j05K51k86K09j0r1N0J00M2L6j22j09q0L55l25j12L37k81
$$ 2 -160 -83 -100 55 -69 -174 77 -209 0 -10 -101 -51 49 91 127 5 -104 -184 171 -154 -266 71 -210
4060b10K98J34Ol08K43o9R5j01M1k29J19l03K15L31l03n8q8P2N3J92j13m5K6k33
$$ -210 88 222 228 -80 163 94 189 88 129 -100 19 -284 -69 262 -41 -99 -187 -115 -62 130 17 -28 -2 -235
4084b35K19j47J28m4m6L53k67J35pj39J07j81M21n8k41j44J14K1M0j48J09o7J21
$$ -235 -16 -163 -35 -79 -125 228 -39 96 89 -50 57 -124 297 239 -2 -146 -32 -11 29 -119 -10 -77 44
4107D4k51j99K84K44j27P5m20K68l4RJ01n3J0p8K68j64K74r0L1k00j50K8r1L60
$$ 44 -207 -406 -122 122 -5 70 -350 -82 -116 -107 -6 -59 -49 -127 141 -23 251 161 192 -8 -158 -130 -221 139
4131A39q6m5K40k95o3j53L49mk01J79j37J29q0Q1K4j97K18j82L25o13M10J17k17
$$ 139 53 8 248 -47 -110 -263 86 82 -119 60 -77 52 -28 53 77 -120 98 -84 241 -372 38 155 -62
4154f2K00l29K11L7j49K81k03K12l47K84n6m3K14j98K45n65K91J73l35K79O4m12
$$ -62 138 -191 20 57 -92 189 -14 198 -149 135 79 36 250 52 297 -268 23 196 -139 140 204 -208
4176b08oJ46J79q0J76kp1j38J55j81lK05K56l62J2j40p2M00l13J12l8n4o7J67
$$ -208 -214 -68 111 31 207 205 134 -4 151 -30 -33 172 428 66 78 -62 -134 266 -47 65 27 -27 -94 73
4200G3l3m1J81k8j40k19K5K23p8k37L27j45K78k53M4J39m2l0J02J20k60L82n88
$$ 73 40 -1 180 152 12 -207 -182 41 -37 -274 53 -92 186 -67 -23 116 74 44 146 266 6 388 -200
4223b00j52J79L14R6l09K65m6J34l83O3Q7N1P4k81O4P6j00k46K29M2OJ06o5J4
$$ -200 -352 -173 141 237 -72 193 147 281 -102 -39 48 99 173 -108 -44 32 -68 -314 -85 -43 -37 69 4 18
4247A8J74k17J90l68L65k42J39Q4K2l56K6J88j61J79j64n4J24J06k7J22n1j27
$$ 18 192 -25 165 -203 162 -80 59 143 165 -191 -165 23 -138 41 -123 -177 -53 53 26 148 97 -30
4269c0R8j33O6K00k99J44J23j80k01J33M4K41m03L47j39j16N3L1J99j34%M7j82
$$ -30 68 -65 1 201 -98 46 169 -11 -212 -79 -35 206 -197 150 11 -105 -52 -21 178 44 44 91 -91
4292i1L5L44l04K32J66l31l2N8J26q5p0k14K00J29k75J04j68L38k98J3L95k20
$$ -91 -56 288 -16 216 382 51 19 77 203 118 48 -166 34 163 -112 -8 -176 162 -136 -123 272 52
4314E2k01L29l53J74J43k65L8j1J67m8p7l9J36k5k83J33l6K81J54j77l2O8p2J03
$$ 52 -149 180 -173 1 144 -121 -83 -94 73 25 -52 -91 45 20 -263 -130 -166 115 269 92 60 128 56 159
4338A59j25j68J6J69Jj42J52j87R3P7K88n65O7K60J67n14Q1K23kM7P3l70J94p
$$ 159 34 -134 -118 51 52 -90 62 -125 -32 45 333 -232 -165 95 262 -252 -171 52 50 97 170 -200 -6 -13
4362a3k25J85J04k6j00K84j75r4R2Qn0J24j00j61J19K31m26P9K13k9l1m89J32
$$ -13 -238 -53 51 25 -75 209 34 -60 32 40 -10 114 14 -147 -28 203 -223 -144 69 40 9 -480 -348
4385c48N89j07q6J87j92J82j22q3j14L4J3j83K74k83K00j33M9N1k77M68l11K02
$$ -348 241 134 48 235 43 225 103 20 -94 -60 -47 -230 44 -239 -39 -172 -123 -72 -349 119 -192 10
4407A0K44j94n3K6p1j48J29J78P9k25j92J49P6m5J17j70L63q2p1l86J48J46m1
$$ 10 254 60 7 33 -38 -186 -57 121 200 -25 -217 -68 8 -37 80 -90 273 191 120 -266 -118 28 -13
4430a3P7k54K83P4k34K4L00m38n8R2K69K36m24K99j16j60Q9j13J2J39P5k39L31
$$ -13 64 -190 93 167 -67 -43 257 -181 -239 -147 122 358 -66 233 117 -43 46 -67 -55 84 159 -80 251
4453B51j55j54L6J32j04N8k05R0j39K35k35J28N2J23k31K78r2q3j09r9K54K3N3
$$ 251 96 -58 -22 110 6 64 -141 -51 -190 45 -190 -62 -10 113 -118 160 68 -15 -124 -223 31 54 107
4476A07J49k57J45R0j9n1j86P8J41O2l17J77l79N33k23j80L20o6j95K3J86J78
$$ 107 256 -1 144 234 215 164 -22 56 197 259 -58 119 -260 273 50 -130 190 124 -71 -48 138 316
4498C16k61j10J56k69R3J0mK82k85Q1O8P5J5j19j56m7L4J18L0j95o5M03k76J40
$$ 316 55 -55 101 -168 -75 -65 -69 213 -72 9 77 152 167 48 -108 -155 -121 -3 27 -168 -233 170 -106 34
4522C4j35P1J24p0O0M2k58J87q0P9Q0j30L34o18M34j35K34P5m80K21j13L09jj05
$$ 34 -101 -30 94 24 84 126 -132 55 -25 54 134 4 338 -280 154 19 253 328 -152 69 -44 265 264 159
4546A59k17P2j83K15K30j33j21J76k79J62r0j04n4K10j84k0J77r3K8k08L95j75
$$ 159 -58 14 -169 46 276 143 22 198 -81 81 -9 -113 -167 43 -141 -161 16 -77 -49 -257 138 -37
4568c7J66p8O0j02J16p8p1L3l6J57l3l36K44l06J30J98j8j55J7o0K79j98L46n7
$$ -37 129 51 111 9 125 47 -24 9 -27 130 97 -239 5 -301 -171 27 9 -146 -129 -189 90 -108 238 181
4592A81q1j67O0j43j66K54l0k24K28P1L1M4q0m0J52N1j00J70m11L53k31l2J05
$$ 181 100 -67 -7 -150 -316 -62 -92 -316 -88 -17 14 58 -22 -62 90 141 41 211 -200 153 -78 -110 -5
4615ek86L64j35L49m62J29k4P9j27J08j01J21M2k03K03J79Rm32j61M32J11o3N8
$$ -5 -291 73 -62 287 -175 -46 -70 9 -118 -10 -111 10 52 -151 52 231 240 -192 -353 79 190 127 185
4638A85l68J22j16J84j10L51Rl37Q7j24J14J13k64o2M24m4L2r7Q9j92j67J45P2
$$ 185 -183 -61 -177 7 -103 248 257 -80 7 -117 -3 110 -154 -216 208 164 196 99 188 -4 -171 -26 46
4661D6M0K4p1n3m5P7K6m3K48o6q3K68m83J47lj79L8Q4J31l12L86k33Q9p8M0l3
$$ 46 86 110 39 -14 -59 18 44 1 249 183 100 368 -115 32 29 -150 -112 -28 103 -209 177 -56 33 -45 -5 -38
4687c8j50K17j33J29P3K26l95QNL2J29k37r0L22j91K77l00K8L12j92q8k9j29J10
$$ -38 -188 29 -104 25 98 324 -71 -63 -58 -26 103 -134 -224 98 -93 184 -116 -88 224 32 -56 -85 -214 -104
4711a04k45L45P5k25K99k02K2j02O1J0J56p4j7j3J15j2q5J94j46K2L5j80R1O4
$$ -104 -349 -4 71 -154 145 -57 -35 -137 -76 -66 90 16 -1 -14 101 89 4 198 52 74 109 -71 20 84
4735H4M7j94J35r6l0J57j62K78l08P8J61n1P5J9l23k98N09j49M1l6L09j12k66
$$ 84 131 -63 72 -24 -54 103 -59 219 -89 -11 150 99 174 193 -130 -428 81 -68 -27 -63 246 134 -132
4758a32P6j53K40mm9K76m4k28p4K55j36j77J46n1J38k25J48l55L55j37L3R3j72
$$ -132 -56 -209 31 27 -22 254 210 -18 -92 163 27 -150 -4 -55 83 -142 6 -349 6 -131 -98 -5 -177
4781a77L24k74J41M6l44M0O46m18k86L41J13p1J37l39L03l72J93p6k25K84j28
$$ -177 147 -127 14 60 -284 -244 402 -16 -302 39 152 81 218 -121 182 -190 3 -73 -298 -14 -142
4802a42R0M12l75j88L30o7J5p7m5J00P8J65j59p5K07j46j55k22n8L61n5k08L17
$$ -142 -52 360 -15 -203 127 60 75 -2 -47 53 131 296 137 62 269 123 -32 -254 -312 49 -6 -214 103
4825A03j71Q0L7k14L45k91K41k86K77j11J19j18J6J57q3O1k68r3K45m8j08j50
$$ 103 -68 12 49 -165 180 -111 130 -156 121 10 129 11 27 184 101 162 -106 -199 46 -2 -110 -260
4847b60K97j76n0J77k7O3pk45N05n6m45L80j83J42l14J45Qo5J3J12o2N3j47J96
$$ -260 37 -139 -189 -12 -39 24 17 -228 277 221 -224 156 -27 115 -199 -54 -46 -111 -98 14 -48 5 -142 54
4871E4j15p8M88k36j83M8J80k72K66l1n6N2j11J17nm90L51r0J17r0j1PJ01K36
$$ 54 -61 -139 349 113 -70 -22 158 -114 152 121 65 117 6 123 118 -372 -21 -111 6 -84 -95 -88 13 249
4895B49l05R9l26L04j59J72l0M2J69J1k41l36K67J23J01j26n2J77n35O00j02m52
$$ 249 -56 43 -283 21 -138 34 4 46 215 226 -15 -351 -84 39 140 14 -38 139 -396 204 102 -350
4917c50M07R1J5m73K65K8j83j71O48k56k05J52j02K22l28Q2J53K58k18m0J2M0
$$ -350 57 148 163 -310 -45 -17 -200 -371 277 21 -184 -32 -134 88 -240 -158 -5 253 35 -5 7 47
4939D7J11r3j49Q5j80J98M1r5J1q5J86J37l40n5K60J8p1k31J03M2n3R3q3K34N7
$$ 47 158 65 -84 1 -179 19 60 -35 -24 -109 77 214 -126 -181 79 97 26 -205 -102 -60 -113 -20 -103 131 188
4964A88j97K64l82j13L10j90K72n09L33l62K95K00N5j52m2l11M06J03j42k56M85
$$ 188 -9 255 -127 -240 70 -120 152 -357 -24 -386 -91 109 164 12 -30 -341 65 168 26 -230 255
4985B55k06j81K45l18K19M3J8O6j81k3K04K6j77r9nJ80R8r7j87K79j98J85M9l33
$$ 255 49 -132 113 -205 14 57 75 141 -40 -63 141 167 -10 -109 -114 66 164 67 -120 159 -39 146 195 -138
5009a38J33J60k21q8L04j73K33k81J21r3j5M2o3Q0P0J99o2k67J79j35P1k11P6
$$ -138 -5 155 -66 -154 150 -23 210 -71 50 -43 -58 -16 -79 1 71 270 208 -59 120 -15 56 -155 -79
5032g9P8j91K97l51K44J41k63J76j41l6J74k54N1R2K44j59J59l14k4L59k44k70
$$ -79 -1 -192 105 -246 -2 139 -124 52 -89 -125 49 -205 -154 -62 182 23 182 -132 -156 203 -41 -311
5054c11K13J73Q4q6j94K11j37Q8m20L46L8j07Q3r4r7JM22j92n7P7r4J09m2m1k94
$$ -311 -98 75 159 73 -121 90 -47 41 -379 -33 5 -102 -19 -113 -210 -209 213 21 -36 41 -53 56 14 -27 -321
5079c21M03J03j30kp9K07j17j06J57j87J60j71j16M6K73J24m88L80l40L62n9n6
$$ -321 82 185 55 53 -26 181 64 -42 115 -72 88 -83 -199 -153 120 244 -244 136 -204 158 99 43
5101D3O7o6M6J18l00L42k67r1RK61l38J46l09K38p0J31R9k22R9K75j6m45M33r2
$$ 43 110 44 90 208 -92 250 -17 -108 -99 162 -176 -30 -339 -101 -171 -40 59 -163 -64 211 195 -250 183 91
5125I1O3j02j21k2J83j70j41K09o0j45K86k54O8O3nL30k90j30J27l3K86k82J6
$$ 91 154 52 -69 -91 92 -78 -219 -10 -70 -215 71 -183 -115 -52 -57 273 -17 -147 -20 -53 233 -49 -33
5148c3Q9j22j45K92k44l2J77J8J80j71O1r7K44k19j25q3K58j51k9J0j5R1K76k38
$$ -33 56 -66 -211 81 -163 -195 -18 0 180 9 70 -27 217 -2 -127 -210 48 -103 -132 -122 -137 -46 230 -8
5172hr5K21pj60kl2Q6J23l73Q1K01M0R9l53o5K34j12K22j5j94J43j87K06r2J51
$$ -8 -103 118 111 -49 -51 -83 3 126 -247 -166 35 75 174 -179 -244 -10 -122 100 85 -109 34 -153 53 -39 112
5197A12j31j71K26j09Q0p9M7J90j62L1l9J42k12L4L22k53J8j47Q7K2J63j28O7
$$ 112 -19 -190 36 -73 7 -72 -25 165 3 34 -5 137 -75 -41 281 28 46 -101 -14 8 171 43 110
5220A10l60M25r5J94m81N1K31j18J31j53J12k25O6k6J79j26j00M2m7J23m3J55
$$ 110 -250 175 80 274 -207 -156 75 -43 88 -65 47 -178 -112 -138 41 -85 -185 -143 -190 -67 -110 45
5242D5j52o8J58j17M18k73o5k61M73n9J15k99J56M1k85P3R1N9r7j18n7M90j38
$$ 45 -107 -175 -17 -134 284 11 -54 -315 158 99 214 -85 71 112 -173 -100 -9 50 -47 -165 -222 268 130
5265A30L4k70J98k00L07K9j60n4J9J03k93M50l54j04K45r2j4nL2j0j49L60j49
$$ 130 164 -106 92 -108 199 228 68 14 33 136 -157 293 -61 -165 80 -12 -26 -31 1 -9 -158 202 53
5288E3l1j66Q1j62J35R1K08k04j47J32j67J31K30k01pj65L13j35R8j5r6K5J63
$$ 53 22 -144 -63 -225 -90 1 209 5 -142 -10 -177 -46 184 -17 -24 -189 124 -11 87 72 -24 1 164
5311A64j74k36J49n5rJ35M9j85K1J09O8Kk24J57j8k64L40j20K77k97M6q1K06j69
$$ 164 -10 -246 -97 -152 -161 -26 23 -162 -141 -32 36 38 -186 -29 -47 -311 29 -91 186 -111 -65 -146 60 -109
5335a09J22nJ7J46l54K35j39K27m02L17L19k83J99k26K87m69J74O8j57m4L80J7
$$ -109 13 8 25 171 -183 52 -87 140 -262 55 374 91 290 64 351 -118 56 124 -33 -77 303 320
5357C20l21j85L07J39k25R6m57kN60j09j0p0K6k33Q2K34j87K29l82J48p7K0jM2
$$ 320 -1 -186 121 260 35 131 -326 -328 232 123 113 43 69 -164 -82 152 -35 194 -188 -40 -117 -97 -98 -56
5381e6J97l29J43L3M3j28l4J10j52K91k9J68l15L09j82j79K45O8k28l5o7J54j51
$$ -56 141 -188 -45 -12 31 -97 -131 -21 -173 118 89 257 -58 251 69 -110 135 203 -25 -60 -127 27 -124
5404a24K10m45J51K55j10p5J42k7j29K55M6k47J10l6l0M07l90K57l61K63j90j37
$$ -124 86 -359 -208 47 -63 -138 4 -23 -152 103 149 -98 12 -24 -54 353 -37 220 -141 122 -68 -205
5426b05O6J00O9j0j9j00J46r1J92L4k79L15o3j87j69L74l17J41P8l07L05l53J49
$$ -205 -139 -39 30 20 1 -99 47 -44 148 182 -97 218 155 -32 -201 173 -144 -3 75 -232 73 -280 -131
5449a31K03j67L20j83P7r8j98K41P6q4j1j39J15r7q8J9OM1K85j91J16j97K51k69
$$ -131 72 -95 225 42 119 21 -177 64 140 56 45 -94 21 -76 -164 -145 -139 -98 187 -4 112 -85 166 -103
5473a03j67J92K54j89J19Jm1N1j06M1LM3q6J18J49k51J4k5J06j09k53J31J49J63
$$ -103 -270 -78 176 -13 106 107 66 117 11 52 55 98 12 130 279 28 42 17 123 14 -239 -108 41 204
5497B04k07J40p7l61J40K18O6p4r8k01K96L0k06K30j87J2J73j10op7K8mRK69m69
$$ 204 -3 137 60 -301 -161 57 123 49 -49 -250 46 76 -130 100 -87 -75 98 -12 -18 -95 -67 -71 -62 207 -262
5522b62K95N8j77n1o0J96J47P3l29j44J35M2P1O9j86L57n88M75m3k15n2M27l84
$$ -262 33 91 -86 -137 -197 -1 146 219 -110 -254 -119 -77 -6 63 -123 234 -354 121 78 -137 -189 238 -146
5545a46P7J51j93J71j51M4k7J18n5p9L44q6j85J28N1l12K18J58l60K60j00K63
$$ -146 -69 82 -111 60 -91 -47 -74 44 -11 -90 254 168 -17 111 162 -150 68 226 -134 126 26 289
5567B89j59l29J40M1N4l2k1o8J03j1j14K47m33L40j19N6O9j56M8l58O43Q2j24
$$ 289 130 -199 -59 -18 36 4 -17 -85 18 7 -107 140 -293 47 -72 -16 53 -103 -55 -413 230 312 188
5590A88j91j31O1NJ38j05J34j06L3R0j44L7N1j63N3J4kj0J51j15P6K8j65R0l81
$$ 188 -3 -134 -73 -68 70 -35 99 -7 26 116 -28 9 60 -103 -50 -36 -38 -48 103 -12 64 92 -73 17 -364
5615c64M83k51K26j03q3n2K39O0j16qj72K77n6q9l75L39O9j90J43J45m01R0K23
$$ -364 119 -132 94 -9 -92 -144 95 155 39 31 -141 136 80 -9 -384 -45 24 -166 -23 122 -279 -189 34
5638C4k58K04K8j05N4P5j98J70j4l0M9N4k01QK20o9l45J95J46N6J80l20J45j76
$$ 34 -224 -20 8 -97 -43 32 -166 4 -10 -40 9 63 -138 -130 90 21 -324 -129 17 73 253 -67 78 -98
5662i8J15j5r1Q7M4l3J8k82M40K6j52p2K40l12J83qj42K18j45K41j76K65m98J16
$$ -98 17 2 -89 -2 42 9 27 -255 185 211 59 -13 227 -85 98 90 -52 166 21 262 86 351 -147 -31
5686c1j0k9K04k72J43J2j92J27j7J3q2Q4n5L18j85K39l13L24k29j04J30j71J07
$$ -31 -41 -70 134 -138 5 17 -175 -48 -65 -52 -134 -50 -105 213 28 267 -46 278 49 -55 75 -96 11
5709A1q8L07l98L60j24j68J34k88L12j0k17J5O7K00k59L63k13J0J39k43K09k94
$$ 11 -77 230 -168 192 68 -100 34 -254 58 48 -169 -154 -87 113 -146 217 4 14 153 -90 119 -175
5731a75K99j3p0j5J13k50J52J04l89J26j3j62L32r4j04o0M31J0k93K01j78pL45
$$ -175 124 111 41 26 139 -111 41 145 -244 -118 -131 -293 39 -55 -159 -219 212 222 -71 130 -48 -55 290
5754B90j75j11L6Lr8o1K60l96L72J09k24L3L2J01p7m6m4l3p9J59j6Q8j58J25j90
$$ 290 115 4 40 43 -55 -116 144 -252 120 229 5 38 70 171 94 48 4 -29 -108 51 35 123 -35 90 -100
5779a00J20M3q4j35L44l80J06k1l5J02N6j41K7J20L6m06L65k85N59o95L68J05
$$ -100 20 63 -21 -156 188 -192 -86 -107 -142 -40 16 -125 -98 22 58 -348 17 -268 291 -404 -36 69
5801F9j57J54r0J20kM0N6m34J86j35mL02k59J55Q2N3j18%J2j85K4K77k09M7m8
$$ 69 -88 66 -24 96 94 134 190 -244 -58 -193 -197 105 -154 1 83 136 18 18 30 -155 -131 146 -63 -16 -64
5826f4K25l70N6K50J09m8r6m1K24k31k05p2J56K04o4j11K07J02J5j14L2j35K5
$$ -64 161 -209 -153 97 206 158 62 21 245 14 -191 -263 -107 97 33 -78 129 231 246 132 164 29 54
5849E4j15O9l2K6K50k45k69J59J26j23j02K69J08N9m56N6J27q6J89n6j18M30j36
$$ 54 -61 8 -24 2 252 7 -262 -103 23 -100 -202 67 175 234 -222 -166 -39 -125 64 8 -110 320 184
5872A84k77M7j6J69R0l32N8m3J32n2j67J76j84M97k40J81k61J7K06j64J34j91
$$ 184 -93 -46 -62 107 197 -135 -77 -120 12 -40 -207 -31 -215 282 42 223 -38 -21 185 21 155 -36
5894c6M1j28M76l79p9J9O8Q2l3j89M07m22L34l31J6L23j57Q8j07jM0j98M72l61
$$ -36 5 -123 353 -26 -105 -86 -18 64 31 -158 249 -173 161 -170 -154 169 12 100 -7 -8 32 -166 306 -55
$$ [...]
8191a90
##END NTUPLES=NMR FID
##END=
