##TITLE=1H_Pr NCS-2M
 200.13MHz, CDCl3,
 8 sc
 
 22.10.2025
##JCAMPDX= 6.0         $$ Bruker NMR JCAMP-DX V2.0
##DATA TYPE= NMR FID
##DATA CLASS= NTUPLES
##ORIGIN= UXNMR, Bruker Analytische Messtechnik GmbH
##OWNER= pz
$$ XWIN-NMR		Version 3.5
$$ Wed Oct 22 15:26:32 2025 Russian Standard Time (UT+4h)  she@DPX200
##.OBSERVE FREQUENCY= 200.1313
##.OBSERVE NUCLEUS= ^1H
##.DELAY= (6, 6)
##.ACQUISITION MODE= SIMULTANEOUS
##.ACQUISITION SCHEME= undefined
##.AVERAGES= 8
##.DIGITISER RES= 18
##SPECTROMETER/DATA SYSTEM= spect
##.PULSE SEQUENCE= zg30
##.SOLVENT NAME= CDCl3
##.SHIFT REFERENCE= (INTERNAL, CDCl3, 0, 14.3821)
##AUDIT TRAIL= $$ (NUMBER, WHEN, WHO, WHERE, WHAT)
$$ ##TITLE= Audit trail, XWIN-NMR		Version 3.5
$$ ##JCAMPDX= 5.01
$$ ##ORIGIN= Bruker BioSpin GmbH
$$ ##OWNER= she
$$ F:/spectra/data/she/nmr/H-C/1/audita.txt
$$ ##AUDIT TRAIL=  $$ (NUMBER, WHEN, WHO, WHERE, WHAT)
(   1,<2025-10-22 15:25:02.64 +0400>,<she>,<DPX200>,
      <created by zg, POWCHK disabled, PULCHK disabled
       configuration hash MD5:
       00 E9 B6 7A A2 85 ED C7 34 08 36 98 17 FE 4E 26
       data hash MD5: 16K
       6A 51 EC 7A B4 B1 A0 0A A0 0C 5C AC AD 93 9A 85>)
$$ ##END=
$$ 
$$ hash MD5
$$ E9 F0 7B 00 22 99 37 34 42 FE 35 E3 14 EB 9E 90
##$RELAX= 
##$RELAX= 
##$RELAX= 
##$RELAX= 
##$RELAX= 
##$RELAX= 
$$ Bruker specific parameters
$$ --------------------------
##$DU= <F:/spectra>
##$EXPNO= 1
##$NAME= <H-C>
##$PROCNO= 1
##$TYPE= <nmr>
##$USER= <she>
##$AMP= (0..31)
100 100 100 100 100 100 100 100 100 100 100 100 100 100 100 100 100 100 
100 100 100 100 100 100 100 100 100 100 100 100 100 100 
##$AQSEQ= 0
##$AQ_mod= 1
##$AUNM= <au_zg>
##$AUTOPOS= <>
##$BF1= 200.13
##$BF2= 200.13
##$BF3= 200.13
##$BF4= 200.13
##$BF5= 200.13
##$BF6= 200.13
##$BF7= 200.13
##$BF8= 200.13
##$BYTORDA= 1
##$CFDGTYP= 0
##$CFRGTYP= 5
##$CHEMSTR= <none>
##$CNST= (0..31)
1 1 145 1 1 1 1 1 1 1 1 1 1 1 1 1 1 1 1 1 1 1 1 1 1 1 1 1 1 1 1 1 
##$CPDPRG= <>
##$CPDPRG1= <>
##$CPDPRG2= <>
##$CPDPRG3= <>
##$CPDPRG4= <mlev>
##$CPDPRG5= <mlev>
##$CPDPRG6= <mlev>
##$CPDPRG7= <mlev>
##$CPDPRG8= <mlev>
##$CPDPRGB= <>
##$CPDPRGT= <>
##$D= (0..31)
0 0.7 0 0 0 0 0 0 0 0 0 0.03 0 0 0 0 0 0 0 0 0 0 0 0 0 0 0 0 0 0 0 0 
##$DATE= 1761132301
##$DBL= (0..7)
120 120 120 120 120 120 120 120 
##$DBP= (0..7)
150 150 150 150 150 150 150 150 
##$DBP07= 0
##$DBPNAM0= <>
##$DBPNAM1= <>
##$DBPNAM2= <>
##$DBPNAM3= <>
##$DBPNAM4= <>
##$DBPNAM5= <>
##$DBPNAM6= <>
##$DBPNAM7= <>
##$DBPOAL= (0..7)
0.5 0.5 0.5 0.5 0.5 0.5 0.5 0.5 
##$DBPOFFS= (0..7)
0 0 0 0 0 0 0 0 
##$DE= 6
##$DECBNUC= <off>
##$DECIM= 32
##$DECNUC= <off>
##$DECSTAT= 4
##$DIGMOD= 1
##$DIGTYP= 9
##$DL= (0..7)
0 120 120 120 120 120 120 120 
##$DP= (0..7)
150 150 150 150 150 150 150 150 
##$DP07= 0
##$DPNAME0= <>
##$DPNAME1= <>
##$DPNAME2= <>
##$DPNAME3= <>
##$DPNAME4= <>
##$DPNAME5= <>
##$DPNAME6= <>
##$DPNAME7= <>
##$DPOAL= (0..7)
0.5 0.5 0.5 0.5 0.5 0.5 0.5 0.5 
##$DPOFFS= (0..7)
0 0 0 0 0 0 0 0 
##$DQDMODE= 0
##$DR= 18
##$DS= 0
##$DSLIST= <SSSSSSSSSSSSSSS>
$$ [...]
##$SUBNAM0= <"">
##$SUBNAM1= <"">
##$SUBNAM2= <"">
##$SUBNAM3= <"">
##$SUBNAM4= <"">
##$SUBNAM5= <"">
##$SUBNAM6= <"">
##$SUBNAM7= <"">
##$SUBNAM8= <"">
##$SUBNAM9= <"">
##$SW= 18.0517328524113
##$SWIBOX= (0..15)
0 0 2 0 0 0 0 0 0 0 0 0 0 0 0 0 
##$SW_h= 3612.71676300578
##$TD= 16384
##$TD0= 1
##$TE= 0
##$TE2= 300
##$TE3= 300
##$TEG= 300
##$TL= (0..7)
0 120 120 120 120 120 120 120 
##$TP= (0..7)
150 150 150 150 150 150 150 150 
##$TP07= 0
##$TPNAME0= <>
##$TPNAME1= <>
##$TPNAME2= <>
##$TPNAME3= <>
##$TPNAME4= <>
##$TPNAME5= <>
##$TPNAME6= <>
##$TPNAME7= <>
##$TPOAL= (0..7)
0.5 0.5 0.5 0.5 0.5 0.5 0.5 0.5 
##$TPOFFS= (0..7)
0 0 0 0 0 0 0 0 
##$TUNHIN= 0
##$TUNHOUT= 0
##$TUNXOUT= 0
##$USERA1= <user>
##$USERA2= <user>
##$USERA3= <user>
##$USERA4= <user>
##$USERA5= <user>
##$V9= 5
##$VALIST= <valist>
##$VCLIST= <CCCCCCCCCCCCCCC>
##$VD= 0
##$VDLIST= <DDDDDDDDDDDDDDD>
##$VPLIST= <PPPPPPPPPPPPPPP>
##$VTLIST= <TTTTTTTTTTTTTTT>
##$WBST= 1024
##$WBSW= 4
##$XGAIN= (0..3)
0 0 0 0 
##$XL= 0
##$YL= 0
##$YMAX_a= 383257
##$YMIN_a= -420457
##$ZGOPTNS= <>
##$ZL1= 120
##$ZL2= 120
##$ZL3= 120
##$ZL4= 120
##$ABSF1= 10
##$ABSF2= 0
##$ABSG= 5
##$ABSL= 3
##$ALPHA= 0
##$AQORDER= 0
##$ASSFAC= 0
##$ASSFACI= 0
##$ASSFACX= 0
##$ASSWID= 0
##$AUNMP= <proc_1d>
##$AZFE= 0.1
##$AZFW= 0.1
##$BCFW= 1
##$BC_mod= 2
##$BYTORDP= 1
##$COROFFS= 0
##$CY= -3
##$DATMOD= 1
##$DC= 2
##$DFILT= <>
##$DTYPP= 0
##$F1P= 0
##$F2P= 0
##$FCOR= 0.5
##$FTSIZE= 0
##$FT_mod= 4
##$GAMMA= 1
##$GB= 0.15
##$INTBC= 1
##$INTSCL= 1
##$ISEN= 128
##$LB= 0.25
##$LEV0= 0
##$LPBIN= 0
##$MAXI= 10000
##$MC2= 0
##$MEAN= 0
##$ME_mod= 0
##$MI= 1.114404
##$NCOEF= 0
##$NC_proc= 0
##$NLEV= 6
##$NOISF1= 3.799351
##$NOISF2= 2.8
##$NSP= 1
##$NTH_PI= 0
##$NZP= 0
##$OFFSET= 14.38212
##$PC= 1
##$PHC0= -2600.054
##$PHC1= -37.20768
##$PH_mod= 1
##$PKNL= yes
##$PPARMOD= 0
##$PSCAL= 0
##$PSIGN= 0
##$REVERSE= no
##$SF= 200.129724274929
##$SI= 16384
##$SIGF1= 3
##$SIGF2= 2
##$SINO= 400
##$SIOLD= 16384
##$SREGLST= <1H.CDCl3>
##$SSB= 0
##$STSI= 0
##$STSR= 0
##$SW_p= 3205.1282051282
##$SYMM= 0
##$S_DEV= 0
##$TDeff= 0
##$TDoff= 0
##$TI= <>
##$TILT= no
##$TM1= 0
##$TM2= 0
##$TOPLEV= 0
##$USERP1= <user>
##$USERP2= <user>
##$USERP3= <user>
##$USERP4= <user>
##$USERP5= <user>
##$WDW= 1
##$XDIM= 8192
##$YMAX_p= 0
##$YMIN_p= 0
$$ End of Bruker specific parameters
$$ ---------------------------------
##NTUPLES= NMR FID
##VAR_NAME=  TIME,          FID/REAL,        FID/IMAG
##SYMBOL=    X,             R,               I
##VAR_TYPE=  INDEPENDENT,   DEPENDENT,       DEPENDENT
##VAR_FORM=  AFFN,          ASDF,            ASDF
##VAR_DIM=   8192,          8192,            8192
##UNITS=     SECONDS,       ARBITRARY UNITS, ARBITRARY UNITS
##FACTOR=    0.0002768,     1,               1
##FIRST=     0,             0,               0
##LAST=      2.2672688,     0,               0
##MIN=       0,             -420457,         0
##MAX=       2.2672688,     383257,          0
$$ Real data points
##PAGE= N=1
##DATA TABLE= (X++(R..R)), XYDATA
0@%%%%%%%%%%%%%%Lj1J6j6J6j6K4l2L2m0M8n2O0p0Q1r2J05j20J37j56J74j92K16
$$ 0 0 0 0 0 0 0 0 0 0 0 0 0 0 0 3 -8 8 -8 8 -8 16 -16 16 -24 24 -28 32 -38 43 -49 56 -64 73 -83 91 -101 115
37A15k43K71l02L35l72M13m58N06n58O14o76P47q22R06j000J102j217J346j493
$$ 115 -128 143 -159 176 -196 217 -241 265 -293 321 -355 392 -430 476 -524 578 -639 707 -786
56g86J661j855K083k353K682l093L619m321N308o789R247j4044K6677j21729l16764
$$ -786 875 -980 1103 -1250 1432 -1661 1958 -2363 2945 -3844 5403 -8641 18036 -103693 -420457
71d20457K97895L95881o5957l05615n6045J37640P0205j7751r749m4976m9636
$$ -420457 -122562 273319 207362 -98253 -154298 -16658 53547 35796 26047 -18929 -68565
82f8565N9313J13398m8494j63518n825J79034O9927j36884j08596O6665R4327
$$ -68565 -9252 104146 55652 -107866 -113691 65343 135270 -1614 -110210 -43545 50782
93E0782n529m7675j9029l033K1457M2015o266o9977j5849P7427L7329o5649m4672
$$ 50782 45253 -2422 -21451 -24484 -3027 38988 32722 -37255 -53104 24323 61652 -3997 -48669
106d8669M1017K9805k5335j919K4220k2951l4132L8344M9253l9373o0872L1213
$$ -48669 -7652 22153 -3182 -5101 19119 -3832 -37964 380 49633 10260 -50612 -19399
118a9399O5954j9122o0624J0697M5406j3090l0467K6455K1565m4993k3909N9254
$$ -19399 46555 27433 -33191 -22494 22912 9822 -20645 5810 27375 -17618 -41527 17727
130A7727L4204o2946m4937N6963N2680m3350n2381K6248M1368j2466k2700Q364
$$ 17727 51931 -11015 -55952 1011 53691 10341 -42040 -15792 25576 13110 -9590 -1226
142a226J855j3729J2584K4726j6615l4858J2695L9743m619l7819l896K9534Q103
$$ -1226 629 -13100 -516 24210 7595 -27263 -14568 25175 20556 -17263 -21159 8375 16478
155A6478j8447o630P142q52K6J1270j658j9065M95K3857J440k3920k589K2025
$$ 16478 -1969 -8599 -1457 -2309 -2283 8987 7329 -11736 -11241 12616 14056 -9864 -12453 9572
169I572J092j9612J898J7492n759j8161P614J9108p217j8483N647J6733m910j2040
$$ 9572 10664 -8948 -7050 10442 4683 -13478 -5864 13244 6027 -12456 -6809 9924 5014 -7026
183g026O203P288r584l173J4570K455k0694n070K3661R800k3346j4639J9008J6373
$$ -7026 -823 6465 -3119 -6292 8278 10733 -9961 -15031 8630 18430 -4916 -19555 -547 15826
197A5826j1507j3828L737P978J180L03r47r187k270J4392Q124j5051j4032J1412
$$ 15826 4319 -9509 -5772 2206 3386 3689 2742 -6445 -8715 5677 13801 -1250 -15282 -3870
211c870J7776n446j7538k68J2662M279n804m406j265J29O265N454p627j1031N721
$$ -3870 13906 8460 -9078 -9346 3316 7595 1791 -2615 -3880 -3751 2514 7968 341 -10690 -4969
226d969J4922k555j4697j406J2520M294q348l997M066J802j052J014k85m754j88
$$ -4969 9953 7398 -7299 -8705 3815 8109 -239 -4236 -170 1632 580 1594 1309 -3445 -3633
241c633O708J999p388l599O339M818n280m123L946L523l458j867L575K46l876
$$ -3633 3075 5074 -2314 -5913 426 5244 -36 -4159 -213 3310 -148 -2015 1560 1806 -2070
256b070P09M203j099m496J286L969j102l402J138K691j708j983K214J421k431
$$ -2070 -1361 2842 1743 -2753 -1467 2502 1400 -2002 -864 1827 119 -1864 350 1771 -660
271f60j492K737J699k894j674K825J771k653j575K011J312j637l28J384O0j832
$$ -660 -2152 585 2284 -610 -2284 541 2312 -341 -1916 95 1407 -230 -558 826 886 -946
287i46N41K072j592k098J828K394j535k674J308K461r16j694K38J135k12l45M52
$$ -946 -405 1667 75 -2023 -195 2199 664 -2010 -702 1759 843 -851 -613 522 310 -35 417
304D17k49o35K41J461q77j845N58K007j32k157k55K001O21j403m11P10N72o51
$$ 417 168 -467 -226 1235 358 -1487 -929 1078 946 -1211 -1466 535 1156 -247 -658 52 624 -27
322b7J98J48o52l14J359K16j372n63J035Q47p36j018O83Q32n81n28L22K04k64
$$ -27 171 319 -333 -647 712 928 -444 -1007 28 875 139 -879 -196 636 55 -473 -151 53 -211
341b11J45J92l60k6n6J052m81p98M67L48l0p88M01K62L49m92j87L77l56P0J34
$$ -211 -66 126 -234 -260 -316 736 255 -543 -76 272 242 -546 -145 117 466 -26 -213 164 -192 -122 12
362A2l17r0K53P55m86m29J9M69J77k71k00o9N93l59l32M47l50l35P29r4l8j72
$$ 12 -305 -395 -142 613 127 -302 -283 186 363 92 -108 -177 416 57 -275 172 -178 -513 216 122 84 -88
384h8P0J39J31k38j92J40K69K27k77m03j46N25km6m32k86M63M04j16m74Q3j92
$$ -88 -18 121 252 14 -178 -38 231 458 181 -222 -368 157 155 109 -323 -609 -146 258 142 -332 -249 -441
406d41Q04O1l65k83j23O51No98M0K05N92Lm74n85M65K95J49r9m46m72Q56L31k5
$$ -441 363 424 59 -224 -347 304 309 -389 -349 -144 448 451 -23 -608 -143 152 301 202 -244 -716 140 471 446
429D46q68j12M53N67J7j002M1N65N53l97m67k3J93K82L42o64l97L9P07N72q82
$$ 446 -422 -534 -81 486 503 -499 -458 107 660 263 -204 -227 -34 248 590 -74 -471 -432 275 847 -35
450c5n74L39N90M13o01r76K64J246L3o26m31L05K53J85j63k36j87J34L11on50
$$ -35 -609 -270 320 733 132 -844 -580 666 699 73 -358 -53 200 385 222 -14 -201 -67 244 238 -312
471c12m01N38Q78L9r86o18O92O00J46r46m89Q92L22k86k11n5k48N60L10K48j109
$$ -312 -713 -175 703 742 -244 -862 -170 430 576 -370 -859 33 355 69 -142 -197 -445 115 425 673 -436
492d36n55Q18J391o61j409k93J377R51j281p29P4R31O65o07n35K8J8N45L74p21
$$ -436 -991 -173 1218 557 -852 -1145 232 1183 -98 -827 -753 178 843 236 -299 -271 -253 292 666 -55
512e5q74J86J540N18j215j472N37J809J13j213j069O67J394j27j050j15q7O91
$$ -55 -929 -743 797 1315 100 -1372 -835 974 1087 -126 -1195 -528 866 739 -311 -426 -513 178
530A78J52J03q48m77M88J113M5j197p96J575R14p41j479k02J663L58n44j052O02
$$ 178 330 433 -415 -892 -404 709 754 -443 -1239 336 1250 509 -970 -1172 491 849 305 -747 -145
549a45K52J2L23j96o21m14R35J345j227j531M49J740N52j848j101R68J503l42
$$ -145 107 119 442 246 -375 -789 146 1491 264 -1267 -818 922 1474 -374 -1475 -507 996 654
567F54r58m51K47N53M85m58n36l29Q09N22o7q61j081J530J097l57j517l76J260
$$ 654 -304 -755 -508 45 530 72 -464 -793 16 538 471 -390 -1471 59 1156 799 -718 -1094 166
586A66R08o06j432K36J109L99n04o41J91N7M30K55q35l64L06J228K35j258j127
$$ 166 1074 468 -964 -728 381 780 276 -365 -174 -117 313 568 -267 -631 -325 903 1138 -120 -1247
605a247P91J267l96r54m7O27P10o10o53N27n5M1K42k53k56m46N34Q07r9q01J03
$$ -1247 -456 811 415 -539 -586 41 751 141 -512 15 -40 1 243 -10 -266 -712 -178 629 530 -271 -168
626a68M89K66n01l27j3O71j18Rn79K01k0J90J29j11n23l7N50L09j42o28K0N47
$$ -168 321 587 86 -241 -254 417 299 308 -271 -70 -90 100 229 118 -405 -442 108 417 275 -353 -333 214
648B14J99l87m22q6O69J07k12l16M39k44J04l1N5o93N04N47k09m81J55J37O04
$$ 214 413 26 -396 -482 187 294 82 -234 205 -39 65 34 89 -604 -100 447 238 -243 -88 49 653
669F53n88n04K79M44O1n41J90j84L41k0k9k69J75k7J83M3j47k77qL54mj72r9p
$$ 653 65 -439 -160 284 345 -196 -6 -190 151 131 102 -167 8 -19 164 207 60 -217 -225 129 125 -47 -146 -153
693a53J54r2PP8l12L7M02j00J87j95k17N36k98j07pO2J63M0j62o1J44K6j0k20
$$ -153 1 -91 -84 -6 -318 -281 121 21 208 13 -204 332 34 -73 -80 -18 145 185 23 -38 106 132 122 -98
717i8K50n0J3j58l3J81l44L64J01k30j58K11j88J62k33J75Q2K55j36j09J39m02
$$ -98 152 102 115 -43 -76 105 -239 125 226 -4 -162 49 -139 23 -210 -35 47 302 166 57 196 -206
739b06m7M56m15L84o9r4N2k22J90j39K54Mk34P1J15Kk21K09J45k95J38P7j24o4
$$ -206 -253 203 -212 172 103 9 61 -161 29 -110 144 148 -86 -15 100 102 -119 90 235 -60 78 155 31 -33
763c3J38j53M15l31lK4J31k45l0M6K01k63J61Rj74L4R4J25k87K25k62K02q2j04
$$ -33 105 -48 367 36 33 57 188 -57 -87 -41 160 -103 58 67 -107 -73 21 146 -141 84 -178 24 -58 -162
787a62K15k98L28r8NK64j82J7j27J65r4L28j89o3j85J87m4M40p38K40k20L14n1
$$ -162 53 -245 83 -15 -10 254 72 89 -38 127 33 361 172 109 -76 111 67 507 -231 9 -211 103 52
810E2l31L57K27k59K4l20L99k21j17L94m09L89k54J87k88l2L46j53J23o6K07m58
$$ 52 -279 78 305 46 70 -250 149 -72 -189 205 -204 185 -69 118 -170 -202 144 -9 114 48 255 -203
832b03O1l6K59M5k83j43J06K35N8j34L1J24k56L04j49r9L0j69L10r6j6K09J04
$$ -203 -142 -178 81 126 -157 -300 -194 41 99 -35 -4 120 -136 168 19 -80 -50 -219 91 -5 -21 188 292
855B92n05K51L5rj35j94J55K39kQq8j62kp5M56j60k62K3K62R1k49j5k44J31K79
$$ 292 -213 38 73 64 -71 -265 -110 129 127 135 47 -115 -117 -192 264 104 -158 -135 127 218 -31 -46 -290 -159 120
880A20j44m3N6j94K6J77m59N40Np1k07J75J18k89M20J9m27K27j34M0J0k41J27
$$ 120 -24 -67 -11 -205 -179 -2 -461 79 84 13 -194 -19 99 -190 230 249 -178 49 -85 -45 -35 -276 -149
903a49J30J4j9J91o0Kj40q5j03O3J06L7J24o6l25L1L19K75l16o3j87J31K07J5
$$ -149 -19 -5 -24 167 107 109 -31 -116 -219 -156 -50 -13 111 45 -280 -249 70 345 29 -34 -221 -90 117 132
927A32j00l5k8L66j73k21J69j99O0J04l35L39j05j13K2J64j46J61K22l63k22K90
$$ 132 32 -3 -31 335 162 -59 110 -89 -29 75 -260 79 -26 -139 -117 47 -99 62 284 -79 -301 -11
949a1L6J0K32l59k53M66k2k02J49j57J8q8L50l5k22p6n5M56j39l99P8L86k4n7
$$ -11 25 35 267 -92 -345 121 99 -103 46 -111 -93 -181 169 134 -88 -164 -219 237 98 -301 -223 163 139 82
973H2j17L53l85k0PK18l26k81O11j08n6l64K62K20J45m24J48k05M67j54j91K5
$$ 82 -35 318 -67 -87 -80 138 -188 -469 142 34 -22 -386 -124 96 241 -183 -35 -240 227 73 -118 -93
995i3J73K58l65J0M2j79R0K82j77p9m1j62O43m39o2k30L03K06j32l74K85P2K31
$$ -93 80 338 -27 -17 25 -154 -64 218 41 -38 -79 -241 402 -37 -99 -329 -26 180 48 -326 -41 31 262
1018B62k36q5K46k38j36M29k95O0j60K91j5j43j16p5N70n22r1J30J62k6l9P6r2
$$ 262 26 -59 187 -51 -187 242 -53 7 -153 138 123 -20 -136 -211 359 -163 -254 -124 38 12 -27 49 -43
1041d3j74K3J87J89l06j85M42P5j46j44MJ47n5j23q1P9j7L12J17k52k65K45j8
$$ -43 -217 -194 -7 182 -124 -309 133 208 62 -82 -78 69 14 -109 -190 -111 -128 184 301 49 -216 29 11
1064A1n0K2k08L15k10K70j52p1l8J76J48l24j47J28L5P3j51p6Q4K31k81K75j44
$$ 11 -39 -17 -225 90 -120 150 -2 -73 -111 65 213 -111 -258 -130 -95 -22 -173 -249 -165 66 -215 60 -84
1087h4J75k58J98J86k27L47n00K38j9j47K58K8k38JK67k70K0L51l44P5p4j45L64
$$ -84 91 -167 31 217 -10 337 -163 75 56 -91 167 195 -43 -42 225 -45 -25 326 -18 57 -17 -162 202
1110B02k46J37k0q2J81j96m2M97j12m42k5P6j59Q1M71l05r0K11p7q0m3j16K8J19
$$ 202 -44 93 73 -9 172 -24 -66 431 319 -123 -148 -72 -231 -150 321 16 -74 137 60 -20 -63 -179 -151 -32
1134c2J54M8j45j73P4J43j42J18l6O6n0k26J26J54M1k05%k5J58l31O6J5M57m22
$$ -32 122 170 25 -148 -74 69 -73 45 9 75 25 -201 -75 79 120 -85 -85 -110 48 -283 -217 -202 255 -167
1158a67J70rK74l65l12N38q6l87N02j32J10k28J24j76J79J25L0j74k42j11K13
$$ -167 3 -6 268 -97 -409 129 43 -344 158 26 136 -92 32 -144 35 160 190 16 -226 -337 -124
1179a24L20l06K60j86l81L53j71J20K59N5k47O7j41j73Q6J83L1J42k73N2J25J08
$$ -124 196 -110 150 -36 -417 -64 -235 -115 144 199 -48 19 -122 -295 -209 -26 5 147 -126 -74 51 159
1201A59k03j00J88k42L91J0l48O6K73K00l83j80oK50K13l12L1k3J5L3k2J58k50
$$ 159 -44 -144 44 -198 193 203 -145 -79 194 394 11 -169 -175 75 288 -24 7 -16 -1 32 10 168 -82
1224h2l7m2J94n0o9M12k24m37J06J59j64J41K03j6N4k23J8J07m4M5k02P0j18K34
$$ -82 -119 -161 33 -17 -86 326 102 -335 -229 -70 -234 -93 110 94 148 -75 -57 50 6 51 -151 -81 -199 35
1248C5J20j99K45n36K47J27lj7R7M7J23k21M7k6k06J1N9j35L9K90Q1l08L50k75
$$ 35 155 -44 201 -335 -88 39 36 19 116 163 286 65 112 86 -120 -109 -50 -185 -146 144 225 -83 267 -8
1272hj3j3j87N5L50k12p1K54q2K17k80r2K3k21M6K86j52J89j11k10M21l18N3r5
$$ -8 -21 -34 -221 -166 184 -28 -99 155 73 290 10 -82 -59 -280 -234 52 -100 89 -22 -232 189 -129 -76 -171
1296a71M58l83K27L6L6k48n8O3k73L09l2j15J72jj07Q6j5M2k61M84m21K00o3J16
$$ -171 287 -96 131 167 203 -45 -103 -40 -313 -4 -36 -151 21 20 -87 -1 -16 26 -235 249 -172 28 -35 81
1320H1J29O9j55p2n7j05J40km5j25K86m76J65K34j32J16o9K0j64L2K24o4K42j49
$$ 81 210 279 124 52 -5 -110 30 28 -17 -142 144 -332 -167 67 -65 51 -18 2 -162 -130 94 30 272 123
1344A23N7j52J64N9M6k20K29l34J8J27K1k90pJ91l80N8K09L90m72L23m41K93q9
$$ 123 180 28 192 251 297 77 306 -28 -10 117 138 -152 -159 32 -348 -290 -81 309 -163 160 -281 12 -77
1367g7P4j56L63j89j79J64M4j80N5J00KJ58K1L3l47K62k66P1L3O4L8j89K40Pq8
$$ -77 -3 -159 204 15 -164 0 44 -136 -81 19 21 179 200 233 -114 148 -118 -47 -14 50 88 -101 139 146 58
1392E8k5O8N4k79K1J00J51n9l37K21j60Q6j69J92j00k14M17J24q3l8K56m72L25
$$ 58 33 101 155 -124 -103 -3 148 89 -248 -27 -187 -101 -270 -78 -178 -392 25 149 66 28 284 -188 137
1415A37l53K11n3J03J00j4J75n41j7K10J15o0p2J72J79k89J14q5N1no9m70N44
$$ 137 -216 -5 -58 45 145 131 306 -235 -252 -42 73 13 -59 113 292 3 117 32 83 78 9 -461 83
1438H3r9k8K8k14L20J08l24L30q3j23j47Q3J15j09k47M46l4k18K63l60L5Q6J04
$$ 83 -16 -44 -16 -230 90 198 -126 204 121 -2 -149 -66 49 -60 -307 139 105 -113 150 -210 -175 -89 15
1461A5J06lJ7j11k6j3k4Q6j88j19J43j13K59j80r9K59m5l4j48nK8Q2L80k00j86
$$ 15 121 118 135 24 -2 -15 -39 47 -141 -260 -117 -230 29 -151 -250 9 -36 -70 -218 -223 -195 -113 267 67 -119
1486a19K99l37K17R7j04%j45K8J47K63m18k41Q5K20r3nRJ45j31O1j70L38q5r9
$$ -119 180 -157 60 157 53 53 -92 -64 83 346 -72 -313 -228 -8 -101 -106 -97 48 -83 -22 -192 146 61 -38
1510c8J99m52K56J06J4j39M6J88j55k27J17K02j1j04QJ00l04M06l74J14K58k71
$$ -38 161 -291 -35 71 85 -54 -8 180 25 -202 -85 117 106 2 10 110 -194 212 -162 -48 210 -61
1532f1R4n2N2k29K01j2J93k72K50l9K00l96K4J3K33l48P6O0K36k97J15j7k22K74
$$ -61 33 -19 33 -196 5 -7 186 -86 164 125 325 -71 -47 -34 199 -149 -73 -13 223 -74 41 24 -198 76
1556G6K58j37k73J27j83L35j82M9k9k50K55K05k87oo1nO7q4L37j28J09l00N3L06
$$ 76 334 197 -76 51 -132 203 21 70 41 -209 46 251 -36 -42 -103 -108 -41 -125 212 84 193 -107 -54 252
1580B52m14K56j60PM0nK16j94j0k22M71j89k09j58M51m7m13J24M66m10J22J41
$$ 252 -162 94 -66 -59 -19 -24 192 -2 -12 -234 237 48 -161 -319 132 85 -328 -204 262 -148 -26 115
1602A15M2J80j64j82k05J9J69k03J62k74K52K9k8K30j43J17j55J15r7j2Q3k32
$$ 115 157 337 173 -9 -214 -195 -26 -229 -67 -341 -89 -60 -88 142 -1 116 -39 76 -21 -33 50 -182
1624a82L3J18K6P4O7p2j59k1N6pL8j94K77Oj35Q1J21l28K44O0J62k77J85j72l53
$$ -182 -149 -31 -5 69 136 64 -95 -116 -60 -67 -29 -223 54 60 -75 6 127 -201 43 103 265 -12 173 1 -352
1649c52J70J28j32q7L84j10K88m13N9j13j86J81O4L4p2K28l47J61L18j70j23N6
$$ -352 -182 -54 -186 -273 111 1 289 -124 -65 -178 -364 -183 -119 -85 -157 71 -276 -115 203 33 -90 -34
1671c4k6QJ91j93k39O57k60k73L53l79K1P2K03O4k17K59O5j84j89P6k38J12K60
$$ -34 -60 -52 139 -54 -293 364 104 -169 184 -195 -174 -102 101 165 -52 207 272 88 -101 -25 -263 -151 109
1694A09J00l81R3j27K26j51J21K4j13J13j2j83O9J23r1M3N0k63J44O1J30q6J02
$$ 109 209 -172 -79 -206 20 -131 -10 14 -99 14 2 -181 -112 11 -80 -37 13 -250 -106 -45 85 -1 101
1717A01J08k62j50L73k32J58k63P5K54N4j55K5J22pJ3m45K2J49P0kk90M00k10
$$ 101 209 -53 -203 170 -62 96 -167 -92 162 216 61 86 208 201 214 -231 -209 -60 10 8 -282 118 -92
1740i2J95j64j5J47j69l3J60j04J07k38L92K08k08l82K32k7r8j06J56K01n08O35
$$ -92 103 -61 -76 71 -98 -131 29 -75 32 -206 186 394 186 -196 36 9 -89 -195 -39 162 -346 289
1762B89l62m8J91j56J10O0k68M27k99J76l13K51l2k1j51R3K5l06L25m9M4K48k92
$$ 289 -73 -121 70 -86 24 84 -184 243 -56 120 -193 58 26 5 -146 -53 -28 -334 -9 -58 -14 234 -58
1785e8k4J59j42K5J05o8p9J26K35l99Q6K20r8j09p8%L79k34l72K81k4n0L13k80
$$ -58 -82 77 -65 -40 65 -3 -82 44 279 -120 -34 186 88 -21 -99 -99 280 46 -326 -45 -69 -119 194 -86
1809h6J56k17OM3K84l13P5J98n7l01J46o9L41j16j7j42m0O5K12m50J4J23J61p9
$$ -86 70 -147 -141 -98 186 -127 -52 146 89 -212 -66 -135 206 90 73 -69 -109 -44 168 -282 -268 -145 16 -63
1833f3l9J48R7j68O0k87K55j48j0L03J4J63n48O9K00o6j85J65K04k10O4m6J21
$$ -63 -102 46 143 -25 35 -252 3 -145 -155 148 162 325 -223 -154 46 -20 -205 -40 164 -46 18 -28 93
1856I3J61l26j30L32j39J81l01M3K47n00N17M7l40j79M45p4J06k03j9J56j47m3
$$ 93 254 -72 -202 130 -9 172 -129 -86 161 -339 178 225 -115 -294 151 77 183 -20 -39 117 -30 -73
1878g3j53O2R1j5N4j8p7J76m2j16K02l96L20l31J67K21l29K03jk9Q3j50j52L98
$$ -73 -226 -164 -73 -88 -34 -52 -129 47 5 -111 91 -305 15 -316 -149 72 -257 -54 -55 -84 -1 -151 -303 95
1902I5j18j36K73K12m85R6rk15K90J51m6l25J52P8l2k74L08n5o2L11j44M5k0k36
$$ 95 -23 -159 114 326 -159 -63 -72 -287 3 154 108 -217 -65 13 -19 -293 15 -40 -102 209 65 110 90 -146
1926a46m0K75k20k2J84J0o5jq3nJ12j42J16k07J55k71K58N0k72K24j09M57l73
$$ -146 -186 89 -131 -153 31 41 -24 -25 -108 -113 -1 -143 -27 -234 -79 -350 -92 -42 -314 -90 -199 258 -115
1949a15O6J80j71K08k88R1ok36lK37J94j65J1k0l1L3J18k07k5j4K58k18O4j51
$$ -115 -49 131 -40 168 -120 -29 -35 -271 -274 -37 157 -8 3 -17 -48 -15 103 -104 -129 -143 115 -103 -39 -190
1973a90J79K91n19M98m01j9J7Q4k29J46J20Jo9K19m39K55q7J23n7q2K78l22L29
$$ -190 -11 280 -239 259 -142 -161 -144 -60 -289 -143 -23 -22 -91 128 -311 -56 -143 -20 -77 -159 119 -203 126
1996A26j09P0j10m2NR1nj20J88n8j85K71l3k57K45Q4j48P3j61j2k53K04L04k53
$$ 126 17 87 -23 -65 -60 31 26 -94 94 36 -149 122 89 -168 77 161 13 86 -75 -87 -340 -136 168 -85
2020h5J57j23K18j42k52M40k84k1j22J03m2J04N5j71J89j20PP3q7K72q0j04K33
$$ -85 72 -51 167 25 -227 213 -71 -92 -214 -111 -153 -49 6 -165 24 -96 -89 -16 -103 169 89 -15 218
2043B18k38j62K68m1l20K86Q7p3K6j74o8J76J27k43J81j34J17k9l81J52J39n6
$$ 218 -20 -182 86 45 -275 11 98 25 51 -123 -191 -15 112 -131 50 -84 33 4 -377 -225 -86 -142
2065a42J13K55k09k70K61K58k74K33l08Q4J6k6l1J05j88K23K89m26M0n3n5P5R5
$$ -142 -29 226 17 -253 8 266 -8 225 -83 1 17 -9 -40 65 -123 100 389 -37 3 -50 -105 -30 65
2088F5k01J29k57J86j8L68m65K37J2j74J42j1q7O7J04k72J32J71l10O0R8K27j96
$$ 65 -136 -7 -264 -78 -96 272 -193 44 56 -118 24 13 -74 -7 97 -175 -43 128 -182 -122 -24 203 7
2111GJ01q7K89k03K9p4R9M5j78J93l65L66m21j57L51J03k82L87j59l07L30o2N2
$$ 7 108 21 310 107 136 62 161 206 28 221 -144 222 -199 -356 -5 98 -184 203 44 -263 67 5 57
2134E7Q4j53j27J52o4K11k43J60j03P3N1k06J03j89k2K94o2j10K45j61L2M7j12
$$ 57 141 -12 -139 13 -51 160 -83 77 -26 47 98 -108 -5 -194 -216 78 16 -94 151 -10 22 69 -43
2157d3k13K34K56j96J64l04J22o0J99k33J24JJ16j84K9L22m91PJ49k27L51J87
$$ -43 -256 -22 234 38 202 -102 20 -40 159 -74 50 51 167 -17 12 334 -157 -150 -1 -228 123 310
2179C10m92K75j47L52k75k8j27J28l3R1Nq2P7l28M04j84k6J53j98J74p6J29m5
$$ 310 -182 93 -54 298 23 -5 -132 -4 -37 54 59 -23 54 -274 130 -54 -80 73 -125 49 -27 102 57
2202E7j61J43J17j79j08J83j96J95RK8k04O5J2ok71J47L62k33J3L97m31Q6J9L82
$$ 57 -104 39 156 -23 -131 52 -144 51 60 88 -116 -51 -39 -45 -316 -169 193 -40 -27 370 -61 25 44 426
2226D26m18j30L67r8j60nJ57l07K00l5J70r2j39K27J42l04p7r5R5k6J99j19K42
$$ 426 8 -122 245 147 -13 -18 139 -168 32 -3 167 75 -64 163 305 1 -76 -171 -76 -102 97 -22 220
2249B20j97p8K89j22r2l7M2R0l74L95k56K6J23j08N4N0L3J19k07k17J42J09j1
$$ 220 23 -55 234 112 20 -17 25 115 -259 136 -120 -94 29 -79 -25 25 58 177 -30 -247 -105 4 -7
2272gK68m07PJ47J80k36n9L02K7m58M48k55J91j35Q4k14J38K41j21k34J26J09
$$ -7 261 -146 -139 8 188 -48 -107 195 222 -236 212 -43 148 13 97 -117 21 262 141 -93 33 142
2294A42l10kO3j37o8L51M7N8mL0j94q7P4K07l37K08J53l46J8M52q5n80K22K9o4
$$ 142 -168 -170 -107 -244 -312 39 86 144 140 170 -24 -111 -37 170 -167 41 194 -152 -134 318 233 -347 -125 -96 -160
2319a60K01l07K05J20j05M5L9j29R9J4q3J15J12k39R9q7J98k22j16K26J32l6j32
$$ -160 41 -266 -61 59 -46 -1 38 -91 8 22 -61 54 166 -73 26 -61 137 -85 -201 25 157 121 -11
2342a1j06K79m5j69J09J2k20K60j52l10K48J75K7j00j1N2j94K70n8j43Ll2M0j41
$$ -11 -117 162 117 -52 57 69 -151 109 -43 -353 -105 70 97 -3 -14 38 -156 114 56 -87 -84 -116 -76 -217
2366b17L03j82LJ46j16J21p8j75K10K64l54nj60J79OJ66k71j89L62K2M2j24J07
$$ -217 86 -96 -93 53 -63 58 -20 -195 15 279 -75 -80 -240 -61 -55 111 -160 -349 13 35 77 -47 60
2389F0J73j05j62l01K57N2m8J40k23K7O03k56l36K52l32K85O5j47R4j6k02O5N3
$$ 60 233 128 -34 -335 -78 -26 -74 66 -157 -130 473 217 -119 133 -199 86 151 4 98 82 -120 -55 -2
2412bJ30k9n9M8R7k55J11j88L34k87j91L35k86N7k7K57K19j91j35L05m04M37k37
$$ -2 128 99 40 88 185 -70 41 -147 187 -100 -291 44 -242 -185 -212 45 264 73 -62 243 -161 276 39
2435C9kR7n0J07m40L67j64o0o0K36j80J05o6R3j37L07J1k86jK55m08N9J17L9Q3
$$ 39 37 134 84 191 -249 118 -46 -106 -166 70 -110 -5 -71 22 -115 192 203 -83 -84 171 -237 -178 -61 -22 61
2460F1Lr1O8n9j2J40p4k86K26o9L14O4m13L07n9j25l0k39L71k78l6K32N7K8k1
$$ 61 64 -27 41 -18 -30 110 36 -250 -24 -93 221 285 -128 179 120 -5 -35 -274 97 -181 -217 15 72 100 79
2485G9k51J40j70L02j19K08j19r0j94J37J70p0q8j52Q8m3J41k18L62l09O1O3k09
$$ 79 -172 -32 -202 100 -19 189 70 -20 -214 -77 93 23 -65 -217 -129 -172 -31 -249 113 -196 -135 -72 -281
2508b81M51L9k77j71J64q4J82k52J00n4O0j11K25m9K55l17j6J12j8L03n35L77
$$ -281 170 209 -68 -239 -75 -159 23 -229 -129 -183 -123 -234 -9 -58 197 -120 -136 -24 -42 261 -274 103
2530A03k99K97j09k75K09mM9J02R4r2n9K9k31K10r9j42K28J57j7q0Q1k48J14L5
$$ 103 -196 101 -8 -283 -74 -78 -29 73 167 75 16 45 -186 24 -75 -217 11 168 151 71 152 -96 18 53
2554E3j30J57l32K00J98j09j45k16O0Q8Q9l4R4J58K35o27L52l2j7r0L24j31k11
$$ 53 -77 80 -252 -52 146 37 -108 -324 -264 -176 -87 -121 -27 131 366 -261 91 59 42 -48 276 145 -66
2577f6J90l52M42k44J83k85j7j21N1J60R5l5J23k49j22L03j07j2QQ9J66j95j19
$$ -66 124 -228 214 -30 153 -132 -149 -270 -219 -59 36 1 124 -125 -247 56 -51 -63 -55 34 200 5 -114
2600a14k4J40qk51L72l09k50M15J50R1k26O3k99J99j5N0k01J48L04k47L7r7J32
$$ -114 -138 2 -6 -257 115 -194 -444 -29 121 212 -14 49 -250 -51 -66 -16 -217 -69 235 -12 25 -72 60
2623F0k4r1k50K78J44j53o6J31j04L22j68k24J00J58j54K31j08o2k05M11j09j92
$$ 60 36 -55 -305 -27 117 -36 -102 29 -75 247 79 -145 -45 113 -41 190 82 20 -185 226 117 -75
2645g5J69j36L45k92r4Q1O7j87K91j25%k59J59n7L03k59N1k06QM65m70K23K30
$$ -75 94 -42 303 11 -83 -2 65 -122 169 44 44 -215 -56 -113 190 -69 -18 -224 -216 249 -221 2 232
2668B32k65j72L35p0R0k03PK30J4j21j26K85j19j85J83j97p2J85r6J36j14pjN
$$ 232 -33 -205 130 60 150 -53 -46 184 198 77 -49 236 117 -68 115 -82 -154 31 -65 71 -43 -50 -51 -46
2692d6N7o4N3m9rJ49j29J70l68K73K4k65J60j43J84j0K1j8%M7R2K01m25M24l09
$$ -46 11 -53 0 -49 -58 91 -38 132 -236 37 61 -204 -44 -187 -3 -13 8 -10 -10 37 129 330 -95 329 20
2717B0O3l5j95J68k0L5j64nJ70q2R4j92K64J49P6k92RJ81K2j72k91M26k64J4K44
$$ 20 83 48 -147 21 1 36 -128 -133 37 -45 49 -143 121 270 346 54 63 244 266 94 -197 229 -35 -21 223
2742B23k3j36N0j04j90J16R7j94N9m4JQ6K4O2l14M15k34o0L80j52O1Nj99Q8j57
$$ 223 200 64 114 10 -180 -64 33 -161 -102 -146 -145 -59 -35 27 -287 128 -106 -166 214 62 123 128 -71 17 -140
2767a40Q3k11J93j43M2J86J33l37k3K51j39J28K5j5o7j8J63n94L84K3K36n00M50
$$ -140 -57 -268 -75 -218 -176 10 143 -194 -217 34 -105 23 48 33 -34 -52 111 -483 -99 -76 160 -340 110
2790A10j10k73L65j46J14J04k94K87j63m2Q3J61j28L3J3j80K80l83J09L31l04
$$ 110 0 -273 92 -54 60 164 -130 157 -6 -48 35 196 68 101 114 -66 214 -169 -60 271 -33
2811c3J26j05o1K87j91K5o7Nm7j0Q2K8j58r0N77j75l0k00J35p1J3K0K6J14p0j63
$$ -33 93 -12 -73 214 23 48 -19 -14 -61 -71 11 39 -119 -209 368 193 163 -37 98 27 40 60 86 200 130 -33
2837c3j72J55r5L19l97N0K52l04Q1j16J09R0j35L93l89L65m07O7J8R5k40L20N5
$$ -33 -205 -50 -145 174 -223 -173 79 -225 -144 -260 -151 -61 -196 197 -192 173 -234 -167 -149 -54 -294 26 81
2860H1k07K74k78J61j98K74k2j17j22R3J34j62M2M3MJ1k09J94p4J56l21N9K16
$$ 81 -126 148 -130 31 -167 107 85 -32 -154 -61 73 -89 -47 -4 0 11 -198 -4 -78 78 -243 -184 32
2883C2K93k62k5j34J26k9M0r5pK3p5J73R6k20J43k6R4q2k1K03m57oJ09M40l96
$$ 32 325 63 38 -96 30 1 41 -54 -61 -38 -113 60 156 -64 79 53 147 65 44 247 -210 -216 -107 333 -63
2908f3K07k14J34m8p9K47j39j11M54j9p2k61J28k53K76r9k6n9K81l4l33K30q5
$$ -63 144 -70 64 16 -63 184 45 -66 388 369 297 36 164 -89 187 88 62 3 284 250 -83 147 62
2931F2j50O9j37K30Or4J5Q9m1j9l9k40J77N4J6J20m20K63L52l09q5Q4k83J36P0
$$ 62 -88 -19 -156 74 80 -14 1 90 49 30 -9 -249 -72 -18 -2 118 -302 -39 313 4 -81 3 -280 -144 -74
2956g4J92k89K65k54K99j6l9m4j11M1k8j9J39k86M9J07K75k69J19r6k5m4Q5l5
$$ -74 118 -171 94 -160 139 123 84 40 -71 -30 -58 -77 62 -224 -175 -68 207 -62 57 -39 -64 -108 -23 -58
2980e8o0m8J94L7k27K19K53k58nj48J39j25P4o7m1J05k5j03P4K98l09N4j35J86
$$ -58 -118 -166 28 65 -162 57 310 52 47 -101 38 -87 -13 -80 -121 -16 -41 -144 -70 228 -81 -27 -162 24
3004B4k19L91j60J40j60k39L49k37Q6R2n0R2nj10j09J58k56M42j25Pn2K8Q4j88
$$ 24 -195 196 36 176 16 -223 126 -111 -25 67 17 109 104 -6 -115 43 -213 229 104 111 59 87 171 -17
3028a7K4L71k51l6J87l91R7J25j49M1l26M55j49L3l6k11J74r9O1J67j0M0m4M6
$$ -17 7 378 127 91 278 -113 -16 109 -40 1 -325 130 -19 14 -22 -233 -59 -158 -97 70 60 100 56 102
3052A02j82J23P8k71J15q2J40M1P4M8m37L58j63L8j24P7J72m10K67K18p8k23M0
$$ 102 -80 43 121 -150 -35 -117 23 64 138 186 -251 107 -56 -18 -142 -65 107 -303 -36 182 104 -119 -79
3075g9j5j59J30J83L71m85p5N15p52M45J21l6j42j73M0k5j45J80J88j59J57R8
$$ -79 -94 -253 -123 60 431 -54 -129 386 -366 79 200 164 22 -151 -111 -136 -281 -101 87 -72 85 183
3097A83k05K20j57l2J51J60j45p3J10l08K12j5k16P1K89n41J72L36l64k61M45
$$ 183 -22 198 41 9 160 320 175 102 212 -96 116 101 -115 -44 245 -296 -124 212 -152 -413 32
3118C2J36m30L12j86l8K78L5j75Q8j15k8M8J57K49j18n95L37j30M09l72j65J37
$$ 32 168 -262 50 -136 -174 104 139 -36 52 -63 -91 -43 114 363 245 -350 -13 -143 266 -106 -271 -134
3140a34P1J81J3M5k21M8j43J92j54K33j47n0M02k84k77L94k00j50J14J5r9O4L22
$$ -134 -63 118 131 176 -45 3 -140 52 -102 131 -16 -66 336 52 -225 169 -31 -181 -67 -52 -151 -87 235
3163B35n8r7P4k01p1L26j77M9k97O2L33j15j32N9j1M4l3r9j63L66j33Lj23L16
$$ 235 177 80 154 -47 -118 208 31 80 -217 -155 178 63 -69 -10 -21 23 -10 -109 -272 94 -39 -36 -159 157
3187A57q9j32O9J06j29J70k03r0J47Oq2rk3J71J35m83L53k11J60P4N0j99j59L26
$$ 157 68 -64 5 111 -18 152 -51 -141 6 12 -70 -79 -102 69 204 -279 74 -137 23 97 147 -52 -211 115
3211A15P2M7n15J96l9j35l1L24k02j08L02j42P8O0k30L48k75N6j2K72l16K67p1
$$ 115 187 234 -281 -85 -124 -259 -290 34 -168 -276 26 -116 -38 22 -208 140 -135 -79 -91 181 -135 132 61
3234F1k21K75j45q6o0nJ23N7R3m1j27m58N41R9q0l9n3j79J08J86kk82L97l34o6
$$ 61 -160 115 -30 -116 -176 -181 -58 -1 92 51 -76 -534 7 106 26 -13 -66 -245 -137 49 47 -235 162 -172 -238
3259b38M32p0j28K82k60k1M8p5l93P79l35r8P1J62J31l37Jk5M7Ll7L19k64O3j43
$$ -238 194 124 -4 278 18 -3 45 -30 -423 356 21 -77 -6 156 287 -50 -49 -74 -27 -24 -61 258 -6 57 -86
3284h6P4J6r3j66Q1J66k8R3k64L23j20K56l15j0K53l04K38j87Q7k09K41j03k25
$$ -86 -12 4 -89 -255 -174 -8 -36 57 -207 116 -4 252 -63 -73 180 -124 114 -73 14 -195 46 -57 -282
3307b82K43J63r3K77n04K68J76m27J47r8Q2J87J9k98l4J39J24p2N7k46L90p7k96
$$ -282 -39 124 31 308 -196 72 248 -179 -32 -130 -48 139 158 -140 -174 -35 89 17 74 -172 218 141 -155
3330a55L67k88O3q4j07K85L0j57m8J31J56l99J16J92j88j07K11N1O4k30J30p3
$$ -155 212 -76 -13 -97 -204 81 111 -46 -94 37 193 -206 -90 102 -86 -193 18 69 133 -97 33 -40
3352d0J6K51k58K20l25J95Rq9M6L58k99k26K64k54R0L39o20J62o6M07j55Q1m33
$$ -40 -24 227 -31 189 -136 59 68 -21 25 383 84 -142 122 -132 -42 297 -323 -161 -227 180 25 106 -327
3375c27L47J31j59J75k75M8P5k1r2J84J97k42j32j26L14M3j12J0j10K77p1k05
$$ -327 20 151 -8 167 -108 -60 15 -6 -98 86 283 41 -91 -217 97 140 28 38 -72 205 134 -71
3397g1%N9L3J00l26M67q7k80J19N3O6j3J46k5n51K21k11L15k17m1J56Nj81J77
$$ -71 -71 -12 21 121 -205 262 175 -105 14 67 133 120 266 241 -310 -89 -300 15 -202 -243 -87 -82 -263 -86
3421h6Q8j72N39k90j50J82L2j14k12J57J97k44J66l92L18N1j4j18L7K4m6J1j3
$$ -86 2 -170 369 79 -71 111 143 29 -183 -26 171 -73 93 -299 19 70 56 -62 -25 -1 -47 -36 -49
3444d9J77qL2m4L2j34J18k45L9J08J70k20Q3l63R2L12M4p2Q1l0m97O05k48m5Q8
$$ -49 128 120 152 108 140 6 124 -121 -82 26 196 -24 59 -304 -212 100 144 72 153 123 -374 231 -17 -62 26
3469B6L24n61K10M1o7J38j33K52j86J00l36l5M41n6q6j39n9J23l01K15r6J74J19
$$ 26 350 -211 -1 40 -27 111 -22 230 44 144 -192 -227 214 158 72 -67 -126 -3 -304 -89 -185 -11 108
3492A08r8J08n2j32J97l23K85K9k03l2M76n39K28k45K70j63k28M61k53J37k58
$$ 108 10 118 66 -66 131 -192 93 122 -81 -113 363 -176 52 -193 77 -86 -314 147 -106 31 -227
3513b27R2j77M95J17j65j23R6j90LM8L41l31l5pl14K59j71J37L77k62J55j54r8
$$ -227 -135 -312 183 300 135 12 108 -82 -79 -31 310 -21 -56 -63 -377 -118 -289 -152 225 -37 118 -36 -134
3536a34L03k19K78k16J08q4k7K1r4n1%n7K44L33m50n6J31k09M8L53l91J24k2M4
$$ -134 169 -50 228 12 120 36 9 30 -64 -115 -115 -172 72 405 -45 -101 30 -179 -131 222 -169 -45 -67 -23
3560b3J67k97J40j21J79K5k3k5k10l9K12L32l47R6j24K0Q1j06M28l27p0KQ1o3
$$ -23 144 -153 -13 -134 45 70 47 22 -188 -227 -15 317 -30 66 -58 -38 43 -63 365 38 -32 -30 51 -12
3584a2K33j23M5l71J81R6J82q3k03K78j86k75J47J79j86j4j8N5J63L0l91N52l57
$$ -12 221 98 143 -228 -47 49 231 148 -55 223 37 -238 -91 88 -98 -112 -130 -75 88 118 -273 279 -78
3607g8Qm13N59q3On7j0J99j99J69k3l88M46j83l6J91L0l9j87R1N9l05M00j64m2
$$ -78 -70 -483 76 -7 -1 -58 -68 131 -68 101 78 -310 136 -47 -83 108 138 99 -88 3 62 -243 157 -7 -49
3632d9o4M7R2j17K21J71l09nn2l3J66J62k13p0K00q2M3j5o8J60k27O5l08J47P7
$$ -49 -113 -66 26 -91 130 301 -8 -13 -65 -98 68 230 17 -53 147 65 108 93 25 185 -42 23 -285 -138 -61
3657f1J81j62KJ99l38JK39j86Qj3L31k39J00k56J62K27l59j19K69K89l86K25k37
$$ -61 120 -42 -40 159 -179 -178 61 -125 -117 -130 201 -38 62 -194 -32 195 -164 -283 -14 275 -111 114 -123
3680a23L23l34K17pj72n9M5L10j09k59K49k63K02k0j34J49j93J13N0J02m2J10
$$ -123 200 -134 83 76 -96 -155 -110 200 91 -168 81 -182 20 0 -134 15 -178 -65 -15 87 45 155
3702A55p8M5j33q0J92k44M2P1O6Rl86J85J65L3j44NK03j61J1k27K47j15LK44o1
$$ 155 77 122 -11 -91 101 -143 -101 -30 36 45 -341 -156 9 42 -102 -97 106 -55 -44 -271 -24 -139 -136 108 47
3727D7k52M44l04K21q4j78J77p7q3L38k97j14n3j12K59j26K30n2J0j2j6R8m3p5
$$ 47 -205 239 -65 156 72 -106 71 -6 -89 249 -48 -162 -215 -327 -68 -194 36 -16 -6 -18 -34 64 21 -54
3751e4J29j54L95n50R2J38p5R4J3k07J44J14j11J3j62K14j49oj2m9n6M07j60J01
$$ -54 75 -79 316 -234 -142 -4 -79 15 28 -179 -35 79 -32 -19 -181 33 -116 -122 -134 -183 -239 168 8 109
3775A09m04L63j96N2J84j74K75l01J32J86k38P3k27J43k3N4L7k2K23m44J21j7
$$ 109 -295 68 -128 -76 108 -66 209 -92 40 226 -12 61 -166 -23 -46 8 45 23 246 -198 -77 -94
3797i4j80L78N7j85M0o8J45k2j78L43qm99K75J42k08q1J77q9R1J43j94J54rl29
$$ -94 -274 104 161 -24 16 -52 93 71 -107 236 228 -271 4 146 -62 -143 34 -55 36 179 -15 139 130 -199
3821a99J74R3J48j33K27k73j49O1j5J38j20q4k83L18j07J59K17j49j15K69k04
$$ -199 -25 68 216 83 310 37 -112 -51 -66 72 -48 -132 -415 -97 -204 -45 172 23 -92 177 -27
3842b7m0J24M8r7Op7j79M29l22Q6K08O7k40j8k9K26j68J25l00K31J0j68o9O3O
$$ -27 -67 57 105 8 14 -63 -242 187 -135 -49 159 226 -14 -32 -61 165 -3 122 -178 53 63 -105 -174 -111 -105
3867a05J40J86k25j04p4J37j22K87K1o3l29J69K73m19K75K24L2l29r1O5M2P5m7
$$ -105 35 221 -4 -108 -182 -45 -167 120 141 78 -251 -82 191 -228 47 271 303 -26 -117 -52 -10 65 18
3890A8M8k84L36k65K32j7m7jM9J5J4R0j23j64o6j20M00L7l10K74j75J32k56K38
$$ 18 66 -218 118 -147 85 68 21 20 69 84 98 188 65 -99 -165 -285 115 152 -158 116 -59 73 -183 55
3914E5J96k16o9K91n53N13l1k91O6L76l88K62n02L62J04k72J1M5m5l2N8K11N4
$$ 55 251 35 -34 257 -296 217 186 -105 -39 337 -51 211 -291 71 175 -97 -86 -41 -86 -118 -60 151 205
3937B05j50L3l26K95M5J12m10M37m33M23n9l22K62J3j58p4P3O1K03m91O8K16L17
$$ 205 55 88 -238 57 102 214 -196 241 -192 231 172 -150 112 125 -33 -107 -34 27 230 -261 -193 23 340
3960C40n28K26m3J55p0Q0j66j20K05r5l6J0J72j43j36K90m2p4q6k4J5q0L03l70
$$ 340 -188 38 -5 150 80 160 -6 -126 79 -16 -52 -42 130 -13 -149 141 99 25 -61 -85 -70 -150 153 -217
3984b17J25P9r9K45n5j89K24L0M4j38j52k3J58K5j03J69J25m61K02j98l1L51k1
$$ -217 -92 -13 -112 133 78 -111 113 143 187 49 -103 -126 32 57 -46 123 248 -213 -11 -209 -240 111 90
4007I0o5o1O6j74R8M74n27K20k00o7J54K05j99k37K94mJ47O3k68l9M7Qj15K8J22
$$ 90 25 -36 30 -144 -46 428 -99 121 -79 -146 8 213 14 -223 71 67 214 277 9 -30 17 25 -90 -62 60
4032F0j79o3L81m44Q9J92j27k42K73k17K07k0K51k47J39k21L25l21K33J32j96
$$ 60 -119 -182 199 -245 -156 36 -91 -333 -60 -277 -70 -90 161 -86 53 -168 157 -164 69 201 5
4053Eq6J44N5m43L66k62Q4J58r8K14l30M05l81Q2O5Kj39O6M35l60j18NJ20k1j19
$$ 5 -81 63 118 -325 41 -221 -137 21 -77 137 -193 212 -169 -87 -22 -20 -159 -93 342 -18 -136 -131 -11 -32 -151
4078a51J86o4K8o3j54L87j88q8J96oj51J41j12kj06L59m00K91j52J93rj20j19
$$ -151 35 -29 -1 -64 -218 169 -19 -107 89 83 -68 73 -39 -41 -147 212 -188 103 -49 144 135 15 -104
4101a04j84J49J49j35R2m4Q8%J34m0k59j24L58r7k32L15m43L87J39j76kk49J05
$$ -104 -288 -139 10 -125 -33 -77 11 11 145 105 -154 -278 80 -17 -249 66 -377 10 149 -27 -29 -278 -173
4124a73J63J9L9N2k56Pm7K80l27J43L12l80K51k53J44o9L7L28j26j83K12k18K00
$$ -173 -10 9 48 100 -156 -149 -196 84 -243 -100 212 -168 83 -170 -26 -95 -58 270 144 -39 173 -45 155
4147A55oj14K7P1j27k0l5K12J2k7k55q8J75Q8j04j83Kl4J58L22l8j0j29k10K39
$$ 155 149 35 62 133 6 -14 -49 163 175 148 -107 -195 -20 68 -36 -219 -217 -251 -93 229 191 181 52 -158 81
4172H1j61J69j13l2j8K7J51n4l03M06j11j37L5J91k2l6j65j11K30K7L4p6r4J3
$$ 81 -80 89 -24 -56 -74 -47 104 50 -253 153 42 -95 -60 131 109 73 -92 -203 27 54 88 12 -82 -69
4196f9J37K72j96j82k57L93k74M53k62j79K87q6K09j05k70K02j56J24j74N8p8
$$ -69 68 340 144 -38 -295 98 -176 277 15 -164 123 37 246 141 -129 73 -83 41 -133 -75 -153
4217a53J29j19K94p8l02K9k08M04R1j50l1L06%j75j72L78l09K87j94j36L0j26
$$ -153 -24 -143 151 73 -229 -200 -408 -4 87 -63 -94 212 212 37 -135 243 -66 221 27 -109 -79 -205
4239b05J97r0k26L72L5j25m7O8J97ql57R5m6M44k39k62K19NL8K02j66k38N6K3
$$ -205 -8 -98 -324 48 83 -42 -89 -21 176 168 -189 -94 -140 304 65 -197 22 27 65 267 101 -137 -81 -58
4263e8k20K90k53L52J30j60N4j27j79K03QK5j62j5K54P0j95J37l41K82K9r9J21
$$ -58 -278 12 -241 111 241 81 135 8 -171 32 40 65 -97 -112 142 212 17 154 -187 95 124 25 146
4286A46m11L73j88j04O6P8L17q1j98K1k75K21P9p9J02k91P1j05N06l76P5j6n7
$$ 146 -265 108 -80 -184 -118 -40 277 196 -2 19 -256 -35 44 -35 67 -224 -153 -258 248 -128 -53 -69 -126
4309a26l1L4K07k59R4L06j83o7q5J24P1r9P3J3J16j80R3K12n44K65l52N87l37
$$ -126 -157 -123 84 -175 -81 225 42 -25 -110 14 85 -14 59 72 188 8 101 313 -231 34 -318 269 -68
4332f8o6N2P4l2K58m82J34l0J34R7o0k12M63k40k89L80Rqk96J13K30k98J92J18
$$ -68 -134 -82 -8 -40 218 -264 -130 -160 -26 71 11 -201 262 22 -267 113 122 114 -182 -69 161 -137 55 173
4356A73j23j02P5r7Q6o0L25m03O9j05L17k41OJ11k04J41M6J71j5j13j54P3K70
$$ 173 50 -52 23 -74 12 -48 277 -126 -57 -162 155 -86 -80 31 -173 -32 14 185 170 57 -97 -24 246
4379B46k29j41K67l43l9p6L99N3k59O4J85j28J87j59j64J70J17Q3l10M5J50J62
$$ 246 17 -124 143 -200 -239 -315 84 137 -122 -58 127 -1 186 27 -137 33 150 233 -77 -32 118 280
4401B80l62L2J21j6K0m67M38r9k3Pj27J27j9K4M4J63j14O4j33R1r4K1q2J90l0
$$ 280 -82 -50 71 55 75 -392 46 -53 -76 -69 -196 -69 -88 -64 -20 143 29 93 -40 51 -43 -22 -104 86 56
4426E6J01M5k02%J63j23K15l80k3oK72j01K28p9k90K34k6p3p8N5j88M10j65m5
$$ 56 157 202 0 0 163 40 255 -125 -148 -154 118 17 245 166 -124 110 84 11 -67 -12 -200 210 45 0
4450@o3P8K60l42R2%j6J41k96J66O4J3j52j15M27l19M2j01J96j33j02Q4J50P6
$$ 0 -63 15 275 -67 25 25 9 150 -146 20 84 97 -55 -170 257 -62 -20 -121 75 -58 -160 -76 74 150
4474A50k54L22k27J4P6P0j10j92K65j63j43J86lp8K60k42R8J83j84r7M6K15k14
$$ 150 -104 218 -9 5 81 151 41 -151 114 -49 -192 -6 -9 -87 173 -69 29 212 28 -69 -23 192 -22
4497b2K2K52n18M20k90J53J49ok55J14L5k07K04r5o0K76L2k17J24j58K13J4l79
$$ -22 0 252 -266 154 -136 17 166 160 -95 19 54 -153 51 -44 -104 172 204 -13 111 -47 166 180 -199
4520a99L60J10k35j50J67o8Q5j49o1K62o0k11J66P9p3K18p3j21k8o1j3m3J94k59
$$ -199 161 271 36 -114 53 -15 70 -79 -140 122 62 -149 17 96 23 241 168 47 19 -42 -55 -98 96 -163
4544a63N0O6P6R0l67N5MK24k11L85j7k48Q7K32j68k48K20l84J72K95nj19k42J16
$$ -163 -113 -47 29 119 -248 -193 -189 35 -176 209 192 -56 31 263 95 -153 67 -317 -145 150 145 26 -216 -100
4568a00Q3lj66K27j08P9P1l02L07o3j0j54L06l46J49K58m46M42k77J78m72K84
$$ -100 -17 -20 -186 41 -67 12 83 -219 88 25 15 -139 167 -179 -30 228 -218 224 -53 125 -347 -63
4590f3j94K31R9m5K40m37L7J99K06k86l7p5j72M10j45O2n9k54L79k33J2P8J12
$$ -63 -257 -26 73 28 268 -169 -132 67 273 -13 -50 -125 -297 113 -32 30 -29 -283 96 -137 -125 -47 65
4613F5j28J37j78J54r9K76j59j21k73L85j11M6J3o4p0O0L4K00m15J11L05l3k86
$$ 65 -63 74 -104 50 -49 227 68 -53 -326 59 -52 -6 7 -57 -127 -67 -33 167 -248 -137 168 135 -151
4636a51M1L82k43J81j33j30q2K83k93M57m45J91N9j98K17j37r2J97k5R2m7j03
$$ -151 -110 272 29 210 77 -53 -135 148 -145 312 -133 58 117 -81 136 -1 -93 104 79 171 124 21
4658B1j36K33K42j04k27l1l1j24K32J55m83J22j04L6k9J65m7J88p9k23M24l95
$$ 21 -115 118 360 256 29 -2 -33 -157 75 230 -253 -131 -235 -199 -228 -63 -110 78 -1 -224 200 -195
4680a95L77l98K51k23j8L13O7k86J67j27l8ll7O3J79N9l43L37q2k8J6O6l5J44
$$ -195 182 -216 35 -188 -206 107 174 -112 55 -72 -110 -113 -150 -87 92 151 -192 145 63 35 51 117 82 226
4704B26k03Jk15K8m7K62l5j09K0O2K13j57j41N0J3k0J38Q6l29K7R7j8l8K40l56
$$ 226 23 24 -191 -163 -210 52 17 -92 -72 -10 203 46 -95 -45 -32 -52 86 172 -157 -130 -33 -51 -89 151 -205
4729b05K69p7p1J35o9O3j69L3p7N02m70NL06j00k19M3NJ94l59L97j94j07J88l15
$$ -205 64 -13 -84 51 -18 45 -124 -91 -168 334 -136 -131 175 75 -144 -101 -96 98 -261 136 -58 -165 23 -292
4753b92J23K26l1j00P4J33K8l40K43l8J9p0K62l63jL37l08k33L73K77m12J25J45
$$ -292 -169 57 26 -74 0 133 161 -179 64 26 45 -25 237 -126 -127 210 -98 -331 42 319 -93 32 177
4776A77j09R3o5o2L6P7j05J07R9k12o3rJ93L8j97j96L43m54N71m44Q8K13j02j80
$$ 177 68 161 96 34 70 147 42 149 248 36 -27 -36 157 195 -2 -198 145 -309 262 -182 -94 119 17 -163
4800a63j35M37k95K34J4M3k32QQ3k06rL57l26M14k47R4lj69m5K50k08k9q3J85
$$ -163 -298 139 -156 78 92 135 -97 -89 -6 -212 -221 136 -190 224 -23 71 68 -101 -146 104 -104 -133 -216 -31
4824c1P9Qj27J72o8J39n65P09k20l31J47P7j58J99r3k13L18k4N4k11J47n6m6j
$$ -31 48 56 -71 101 33 172 -393 316 96 -235 -88 -11 -169 30 -63 -276 42 18 72 -139 8 -48 -94 -95
4848i5P0J6J60l18K22j54K22j66J57n4j76J32j73O1m5J47k20J85k06M22j37k9
$$ -95 -25 -9 151 -167 55 -99 123 -43 114 60 -116 16 -157 -96 -141 6 -214 -29 -235 187 50 21
4870B1j20P9k04K36L0j6J64j26J37k16j75J97k33L92J32n05M43n36K40J33j03
$$ 21 -99 -20 -224 12 42 26 190 64 201 -15 -190 7 -226 166 298 -207 236 -300 -60 73 -30
4891c0R3l5k50J08K36j96j3k28L15j67J5M92m20m3L17m07J88K26j89J41j31m5
$$ -30 63 28 -222 -114 122 -74 -87 -315 0 -167 -152 340 -80 -123 194 -213 -25 201 12 153 22 -23
4913b3k3M05k39P8k12j82K08n5j88J1J49K00k28L60j74j20r6L01j99r6J99l0l0
$$ -23 -46 359 120 198 -14 -196 12 -43 -231 -220 -71 129 -99 261 87 -33 -129 172 -27 -123 76 46 16
4936A6P4o6p4J22P0k19K24l02K5R9k1Q5J9q2J4m3K92l27k08J82j65M35j75j47
$$ 16 90 24 -50 72 142 -77 147 -155 -130 -31 -52 33 52 -30 -16 -59 233 -94 -302 -120 -285 150 -25 -172
4960a72N02Q3m70q0K59K43m69n3J64M6j42J99N3l13K58M2j33j49K94j74o22L47
$$ -172 330 413 -57 -137 122 365 -104 -157 7 53 -89 110 163 -150 108 150 17 -132 162 -12 -634 -287
4982b87M74q2l24J71lO9J69n02M73m88K96l50K45K36o6k24J34jJ33Pn7j08k06
$$ -287 187 105 -219 -48 -51 18 187 -315 158 -330 -34 -384 -139 97 31 -193 -59 -60 73 80 23 -85 -291
5005b91K68p9P6j73K25o4j0MJ05k23L99l56K37k40J33k09Q8K98n43L93J47M3l78
$$ -291 -23 -102 -26 -199 26 -38 -48 -44 61 -162 237 -119 118 -122 11 -198 -110 188 -355 38 185 228 -150
5028a50N07l24n9l0J2j30M9P1K89k18j2nJ02Ql63L14N3j57J08k5k36J47K79l63
$$ -150 357 33 -26 -56 -44 -174 -125 -54 235 17 5 0 102 110 -253 61 114 -43 65 40 -196 -49 230 -133
5052a33j1p7K37j31J99K6k66k0j1L03k39K34k58L56l08L36m55J23P9K44l83K45
$$ -133 -144 -221 16 -115 84 110 -156 -176 -187 116 -123 111 -147 209 -99 237 -218 -95 -16 228 -155 90
5074I0k21M6J26J50j1k31K52l31K67l79M26k08j91J42o6J98j86J16QL7p2j01K38
$$ 90 -131 -85 41 191 180 -51 201 -130 137 -242 184 -24 -215 -73 -139 59 -127 -11 -3 34 -38 -139 99
5097I9M1lm30L68k01K87l36K07K4k12N76l95P4j53M6r3J14r0r1j4K90l8l44M13
$$ 99 140 137 -293 75 -126 161 -175 32 56 -156 420 25 99 -54 -8 -101 13 -77 -168 -182 108 70 -274 139
5121A39j94L3Q2j86K28k51P3K2J36K02j84j15j26J22k65L08r8j09J54J09N2j58
$$ 139 -55 -22 60 -126 102 -149 -76 -54 82 284 100 -15 -141 -19 -284 24 -74 -183 -29 80 132 -26
5143b6j61L56l18K12j2k93L49j59R2j1nKK04n9k5k8q7O1k50j78K09R6o1K59k17
$$ -26 -187 169 -149 63 51 -242 107 -52 40 29 24 26 230 171 146 118 31 92 -158 -336 -127 -31 -92 167 -50
5168e0o5M9P1J71k74K04K22m87r1M59J5j68K46m26L76k90P2j06j3J17K24l75M1
$$ -50 -115 -66 5 176 -98 106 328 -159 -250 209 224 56 302 -124 252 -38 34 -72 -85 32 256 -119 -78
5191g8J78l54L85m31L43j4j55K59j41K31j62j36K63k30j0J22k47J96K48j87o0
$$ -78 100 -254 131 -300 43 29 -126 133 -8 223 61 -75 188 -42 -52 70 -177 19 267 80 20
5212B0q1P2m0J98o5o4k13J62k20K42Jk62J55j04L05n3Jq3j30L47j00j26J13q2
$$ 20 -61 11 -29 169 104 40 -173 -11 -231 11 12 -250 -95 -199 106 53 54 -29 -159 188 88 -38 75 -7
5236gO3K71l67N8p6K06LL8l67M3N3j34J53n9N9j1J24k6L4j8J78k05j70K07k03
$$ -7 56 327 -40 18 -58 148 151 189 -178 -135 -82 -216 -63 -122 -63 -74 50 24 58 40 218 13 -157 50 -153
5261a53k8r8K27k32K39L9O4j82N1N5j13Q8k22K13N5J60q3q4J09q5P7J0Qj70k07
$$ -153 -181 -279 -52 -284 -45 -6 58 -124 -73 -18 -131 -43 -265 -52 3 163 80 -4 105 20 97 107 115 -55 -262
5286b62K33M6j15j3J37L2O1P9k87k2J45n3K16k70K60k7r6L44m64R7k5J70j73J72
$$ -262 -29 17 -98 -111 26 58 119 198 -89 -111 34 -19 197 -73 187 160 64 408 -56 41 16 186 13 185
5310A85P7j84k28j67N95k39l0M1l9j57r9J31K56J55k36j80p7J05J72M1j57K46
$$ 185 262 78 -150 -317 278 39 9 50 11 -146 -245 -114 142 297 61 -119 -196 -91 81 122 -35 211
5332B11k42J00j76J04j71K18n4J8K60k3j43p0j63R7L27l50J55l08K71l43M66k50
$$ 211 -31 69 -107 -3 -174 44 -10 8 268 245 102 32 -131 -34 293 -57 98 -210 61 -282 184 -66
5354f6J88K4j26J04k11O3j8J50L32m19J04M2k50K9o8J66o0K15k27J99m53M23m49
$$ -66 122 146 20 124 -87 -24 -42 108 440 21 125 167 -83 -54 -122 44 -16 199 -28 171 -282 141 -308
5377c08N93j68p2J69Pj63k64L23j10Q4j68K28m36J87J31q7q0k16M11k7J9j44Q6
$$ -308 285 117 45 214 221 58 -206 117 7 91 -77 151 -285 -98 33 -54 -134 -350 61 34 53 -91 -5
5400er3r0K81r9j0J59%l17k2M6J32R4L2k11k07M9K72m6M0j14n3j23J71L9m2K32
$$ -5 -98 -188 93 -6 -16 143 143 -174 -196 -150 -18 76 108 -103 -310 -261 11 -35 5 -109 -162 -285 -114 -75 -117 115
5426A15j30j2q6Q4J77k22J80j17J03P3j13j74J88k50l9M00j14j60Q4N3q6q3J74
$$ 115 -15 -27 -113 -29 148 -74 106 -11 92 165 52 -122 66 -184 -223 177 63 -97 -13 40 -46 -129 45
5449D5l5J7j07K15M4l24L68k19j51k43J65K69j67K16p3K25m39J43r3J12Q2P6k01
$$ 45 10 27 -80 135 179 -145 223 4 -147 -390 -225 44 -123 93 20 245 -194 -51 -144 -32 50 126 -75
5472g5j67K84q9o8P0k19J64j04O2K69k29L2K64j46p8l27L20n3K40j98L10k37q1
$$ -75 -242 42 -47 -115 -45 -264 -100 -204 -142 127 -102 -70 194 48 -30 -357 -37 -90 150 -48 262 25 -56
5495e6L4M2j54K17j50Nk0j95K54J6m6lK58o7P4k67l7K42m00K35j7R4O4k93M1j52
$$ -56 -22 20 -134 83 -67 -62 -82 -277 -23 -7 -53 -56 202 135 209 -58 -95 147 -253 -18 -35 59 123 -170 -129 -281
5521b81M34l89M17k11nJ81j15J28j30R1k67J13K36m50K12R0l08N96l85K27k27
$$ -281 153 -236 181 -30 -35 146 31 159 29 120 -147 -34 202 -248 -36 54 -254 342 -43 184 -43
5542d3J01n9nj26p7R5M11m52k20O15l51J12j11J17j75M21k05k14K99j30j95J44
$$ -43 58 -1 -6 -132 -209 -114 297 -155 -375 240 -111 1 -110 7 -168 253 48 -166 133 3 -192 -48
5564d8R5l08J75k6j06K04J21k7J19k82L28l21J98k54K11K29l80p8k35M54o6l6
$$ -48 47 -261 -86 -112 -218 -14 107 80 199 -83 245 -76 122 -132 79 308 -72 -150 -385 69 3 -33
5586c3K48m42K76n5J26J9Pk01K81m14R3p7K07L1m8j33k37N41Jk68K97j40Qj25
$$ -33 215 -227 49 -6 120 139 146 -55 226 -188 -95 -172 35 66 18 -115 -352 189 190 -78 219 79 87 -38
5610c8j47J68J03k25N4k4LK95L5r8l72L16j10K46k30J8J11J03l39j46K37l23M23
$$ -38 -185 -17 86 -139 -85 -109 -106 189 224 126 -246 70 -40 206 -24 -6 105 208 -131 -277 -40 -363 60
5633F0j32J49J03n18L72j91K86j14j15K61k5k69j54L15J68l76J9K4O6J87k96n0
$$ 60 -72 77 180 -338 34 -157 129 15 -100 161 136 -133 -287 28 196 -180 -161 -137 -71 116 -180 -230
5655b30N26p48K47R4K8J65l8l2m8L00j79L47k55m5K2M7k14O0J41k5o0k53J14O0
$$ -230 296 -452 -205 -111 -83 82 44 12 -36 264 85 432 177 132 154 201 -13 47 188 163 103 -150 -36 24
5679B4j56n8J64j19p4L78m21J35J20J14N4j8j07k4k90K46j71m9J05K11l19J53
$$ 24 -132 -190 -26 -145 -219 159 -262 -127 -7 107 161 143 36 12 -278 -32 -203 -252 -147 64 -255 -102
5701a02J98k58L41j39J1m2O4k72K98K55l01O5l4l28J60R8l8q2J65r6j23J5P4J12
$$ -102 96 -162 179 40 51 9 73 -199 99 354 53 118 84 -244 -84 14 -24 -106 59 -37 -160 -145 -71 41
5725D1J65j27j91k7L29k00K03j39l13N4K53k93L81k97Q9RO4Lj62J86k5k72M02
$$ 41 206 79 -112 -139 190 -10 193 54 -259 -205 48 -245 136 -161 -72 -63 1 4 -158 28 3 -269 133
5748A33o4n05M77m14O11l86O0K25j30m8O5j10j4J79m5L08k62J12k80K23m3m42
$$ 133 69 -436 41 -373 238 -148 -88 137 7 -41 24 -86 -100 79 34 342 80 192 -88 135 92 -350
5770c50M75L8k51J85k29j9J71K67l44j60K2J49Q6p4o4k1J30L4j9J1j69j9J9K73
$$ -350 125 163 -88 97 -132 -151 20 287 -57 -217 -195 -46 40 -34 -98 -119 11 45 26 37 -132 -151 -132 141
5794A41k32J12j6L34j70k95J2J40j00L9k2j62J97l69K79k10K80K94m09J97n0J45
$$ 141 -91 21 5 339 169 -126 -114 26 -74 -35 -57 -219 -22 -391 -112 -322 -42 252 -157 40 -10 135
5816A35k54J35l0K13l25K5J20j67J70j39PJ18l5k4J42k27K68j12p1J11Rj44J26
$$ 135 -119 16 -14 199 -126 -101 19 -148 22 -117 -110 8 -27 -51 91 -136 132 20 -51 60 69 -75 51
5839E1l59L00P0j42L51l72L4j18J61J80k77K0Q0j83K30N1j68J23l03N5K86M3J22
$$ 51 -308 -8 62 -80 271 -101 -67 -185 -24 156 -121 -101 -21 -204 26 77 -91 32 -271 -216 70 113 235
5862B35k67j73K97M0l2Rj92R3j50J31O3J8O2n4r8j08L39m44j3M17k9k33Q5j53
$$ 235 -32 -205 92 132 100 109 -83 10 -140 -9 54 72 134 80 -18 -126 213 -231 -244 173 144 -89 -4 -157
5886a57N5J98k16L4J19k16J56oj83k84M23j30K74j60J08J4k36K94j85n9J23R5
$$ -157 -102 96 -120 -86 33 -183 -27 -33 -216 -500 -77 -207 67 -93 15 29 -207 87 -98 -157 -34 61
5908F1K3k78J40J79l7K37l42N6J65N0m58J11r4K10k55J63k1m2N0K94k27L23m19
$$ 61 84 -194 -54 125 88 325 -17 39 204 254 -204 -93 -187 23 -232 -69 -90 -132 -82 212 -15 308 -111
5931a11J69j43J47J15l88%K01l11K33J45o4J5p8j51M0L66l32K80kl75K4J09K54
$$ -111 58 -85 62 177 -211 -211 -10 -321 -88 57 -7 8 -70 -221 -181 185 -147 133 131 -244 -220 -111 143
5954A43k84K64m1l8K35l80J98k4r1J50J22k18nJ10m41M69k04j46M25K0k66j52
$$ 143 -141 123 82 44 279 -101 97 73 -18 132 254 36 31 141 -300 169 -35 -181 244 264 -2 -154
5976a54k6L39k91L8j5K54l4q2L12l66J6R6j02j36L00l61M29j10r1j60Q5k3K13
$$ -154 -180 159 -132 -94 -109 145 111 29 341 -25 -9 87 -15 -151 149 -212 217 107 16 -144 -59 -82 131
5999A31k34J08j05J94J50k55j78L76L8k38Ll8L12m63M11l93k7K16J0j2j37P0K96
$$ 131 -103 5 -100 94 244 -11 -189 187 225 -13 -10 -48 264 -199 212 -181 -208 8 18 6 -131 -61 235
6022B35l88L3M47l63j04L09k11j08M87r0k36K9M6MJ1K36l38J72l05j9l4q7K95
$$ 235 -153 -120 327 -36 -140 169 -42 -150 337 247 11 40 86 90 101 337 -1 171 -134 -153 -187 -274 21
6045B1p9J43j14L0n5K75n18K11m9j61L99k85J14J3O8n0J30j46J56j65J08j48O4
$$ 21 -58 85 -29 1 -54 221 -297 -86 -135 -296 103 -182 -68 -55 13 -37 93 -53 103 -62 46 -102 -38
6068c8j38k8L80k63Q4J2O8J15n8j72q7K89l32K01P6J15rm72K54j04k19J14K91
$$ -38 -176 -204 176 -87 -3 9 77 192 134 -38 -125 164 -168 33 109 224 215 -257 -3 -107 -326 -212 79
6091G9o9k05J98k36M8J43k7K44l05N32l13l7J03oJ06m5j44j83K07J1k16j15K07
$$ 79 10 -195 3 -233 -185 -42 -69 175 -130 402 89 52 155 149 255 210 66 -117 90 101 -115 -230 -23
6114b3r7J39kj60n0K80Q4k46lM35j54k13m3P4j3J15k79J01n8M44n04R7j4K19j90
$$ -23 -120 19 17 -143 -193 87 171 -75 -78 357 203 -10 -53 21 8 123 -156 -55 -113 331 -173 -76 -90 129 -61
6139f1J07R9j35J82k05NJ58j23k4m0k62K85j41R5M4j4J42Q5k82Q7N6j62J86j96
$$ -61 46 145 10 192 -13 -8 150 27 3 -37 -299 -14 -155 -60 -16 -30 112 197 -85 2 58 -104 82 -114
6163a14nR6j15K59P4k06P4J13r2l84L57N4k14j9L7q6M49k42l8N4l21J23J32J4
$$ -114 -119 -23 -138 121 195 -11 63 176 84 -300 57 111 -103 -122 -85 -171 278 36 -2 52 -269 -146 -14 0
6187@j11m2P6L03k66j02K02k22M25l44K12%j39k71j75N89k21Q0Lj60J33L48o52
$$ 0 -111 -153 -77 226 -40 -142 60 -162 263 -81 131 131 -8 -279 -454 135 -86 -6 -3 -163 -30 318 -334
6210c34M49j42k2K68j88l9J59o7j33Q4J17J7l20K10JO4K8j25r9j22M30j39o6j41
$$ -334 115 -27 -49 219 31 -8 151 84 -49 35 152 169 -151 59 60 124 152 27 -72 -194 236 97 31 -110
6234a10MK67j80L7j39M6n0j13M30k00j21J60k2J57l53M4M25k94L6j1j20J14J30
$$ -110 -106 161 -19 18 -121 -75 -125 -238 192 -8 -129 31 9 166 -187 -143 282 -12 24 13 -107 7 137
6257A37k15k74j35L99k39M2K60P2j89J66J3J12j26j1l1p0Q6k7K68j28rj48K58
$$ 137 -78 -352 -487 -88 -327 -285 -25 47 -142 24 37 149 23 12 -19 -89 -3 -30 238 110 101 -47 211
6280B11l73K07j83O2J88L2J44l81M6J67K19j84l95N13K4k79j11K15j9r2j27K89
$$ 211 -162 45 -138 -76 112 144 288 -93 -47 120 339 155 -240 273 297 18 -93 122 103 11 -116 173
6302A73j81J78j04m3k2j03K50o5J31k51j1PJ67j99o4J39Q0J8q2j84M6L23j64P8
$$ 173 -8 170 66 23 1 -102 148 83 214 -37 -48 -41 126 -73 -137 2 82 100 18 -166 -120 203 39 117
6326A17n3m47L62J96j77J6R4l95J61J71P6j36p5K20m14K61L6J23k3k36K6r1K37
$$ 117 64 -383 -21 175 -2 14 108 -287 -126 45 121 -15 -90 130 -284 -23 13 136 113 -123 -97 -188 49
6349D9n8j08J33L8l30M92k97K87j64LL4jQ5j68K48j65k68Q5K98n5q6R8Q2l79J51
$$ 49 -9 -117 16 54 -276 216 -81 206 42 45 79 78 163 -5 243 78 -190 -105 193 138 52 150 232 -147 4
6374DK04k69j22O0J70k61J65m3Pl1K9m7L27m31O5J75q5j81K63j29O1J87m9j87
$$ 4 208 -61 -183 -123 47 -214 -49 -92 -85 -116 -87 -134 193 -238 -173 2 -83 -264 -1 -130 -69 118 69 -118
6398a18J14j3Q1j75O9j7q5J92j35J20o3K6L16q1j69O8p9j13n1L35j60j9l04J76
$$ -118 -4 -17 64 -111 -42 -59 -144 48 -87 33 -30 -4 312 231 62 130 51 -62 -113 222 62 43 -261 -85
6422h5M2J12k33k7K06j05j8J53j5J02k65J93p4L97j83j77m1j51K37l6j01o1K47
$$ -85 -43 69 -164 -191 15 -90 -108 45 30 132 -133 60 -14 383 200 23 -18 -169 68 32 -69 -130 117
6445A17j04K9J9NP8j73J15r1m9M18j83q0L0j07j46J48r4J16k69j5M6J88J44l69
$$ 117 13 42 61 66 144 -29 86 -5 -54 364 181 101 131 24 -122 26 -68 48 -221 -236 -190 -2 142 -227
6469b27L37N7m42K88k39J03j59J63O7J96j43P5q7O7k39R2J70j31j17K49R3m29
$$ -227 110 167 -275 13 -226 -123 -282 -119 -52 144 1 76 -11 56 -183 -91 79 -52 -169 80 173 -256
6491b56L30j48N7J83k42J92j9j19j59K36J57k12J08k57k8J81Q1K2n17M67k49K59
$$ -256 74 -74 -17 166 -76 116 97 -22 -181 55 212 0 108 -149 -177 4 85 107 -410 57 -192 67
6513F7J01j98JJ68k5k17L36j88L6j22l83M50j43J3j09J74J2k8L6o5j0J40m4j50
$$ 67 168 -30 -29 139 114 -103 233 45 81 -41 -424 26 -117 -104 -213 -39 -27 -55 -19 -84 -94 46 2 -148
6537a48L46k69k02m7K59J01J36j26q0j59K44K0k79K03j67l2L34k35J17j54j82
$$ -148 198 -71 -273 -320 -61 40 176 50 -30 -189 55 75 -204 -1 -168 -200 134 -101 16 -138 -320
6558c20L95k66K68N9n0n9n3j27K70j65J2K97k65r9P2J81k44J37k9L3kk20J59K63
$$ -320 75 -191 77 136 86 27 -26 -153 117 -48 -36 261 -4 -103 -31 150 -94 43 14 47 45 -175 -16 247
6582B47m99L21m7K02kn25L05l11K65K0J46J4j90j5M3J11j9k01k2J01M3r0J21K13
$$ 247 -252 69 22 224 222 -303 2 -309 -44 -24 122 136 -54 -69 -26 85 66 -135 -157 -56 -13 -103 18 231
6606B31j64o2k2Ol1J44j8k01P5L56o04L06%K11R4k11M3k19k95N47N8l49L65l58
$$ 231 67 5 -17 -11 -42 102 84 -117 -42 314 -290 16 16 227 321 110 153 -66 -361 186 244 -105 260 -98
6630i8J06p6j9l4K06j24l5M2J33j59k1O3j82K0J34J35j22k7K48j56k75J40K38
$$ -98 8 -68 -87 -121 85 -39 -74 -32 101 -58 -79 -16 -198 -178 -44 91 -31 -58 190 34 -241 -101 137
6653A37l65n9K43L29j38k18r3K07j74j50K17L3j08J5J96Jj95J04R6m5m6L71j61
$$ 137 -228 -287 -44 285 147 -71 -164 43 -131 -281 -64 -31 -139 -124 72 73 -122 -18 78 33 -13 358 197
6676A97j39j02J35j08l7r2Q1Q6k29Q2n1M6K74m79M30K7j13j95K06J40j92K4J66
$$ 197 58 -44 91 -17 -54 -146 -65 21 -208 -126 -177 -131 143 -336 94 121 8 -187 19 159 -33 -9 157
6699A57j03j05J71j0M2k22J99o7Op0K4K4K84n45J47N8j52J83o5k47J75j15K88
$$ 157 54 -51 120 110 152 -70 129 62 68 -2 22 46 330 -215 -68 -10 -162 21 -44 -291 -116 -231 57
6722E7K5k52J80k41K22J10J8k07J56j25L3J09l07K34j05k91K55J99q1k8L53k46
$$ 57 82 -170 10 -231 -9 101 119 -88 68 -57 -24 85 -222 12 -93 -384 -129 70 -11 -39 314 68
6744F8o5r5o2L41J2j53l6l14M84j38M4l25M32l98M31j5j73rQL0j43K5j49l8K30
$$ 68 3 -92 -154 187 199 46 10 -304 180 42 86 -239 193 -205 226 211 38 29 37 67 -76 -51 -200 -238 -8
6769hL0j95J80k29J45q6K04q1M70m37m2k31M07j49Q3J68l42Q2j6L08j75r8p3J17
$$ -8 22 -173 7 -222 -77 -163 41 -40 430 -7 -49 -280 127 -22 61 229 -113 -31 -47 261 86 -12 -85 32
6793C2j7m3J59k55R0j58J07L16j99J36m95N32j91J55k72L7j27L88k58k1p2k4L09
$$ 32 15 -28 131 -124 -34 -192 -85 231 32 168 -327 205 14 169 -103 -66 -193 195 -63 -84 -156 -180 129
6816A29J6p1r4R6o3J41k10p3K15J53j98J09J0J17n33J78l4j19J83j34%J21J11
$$ 129 145 74 -20 76 13 154 -56 -129 86 239 41 150 160 277 -256 -78 -112 -231 -48 -182 -182 -61 50
6839E0j5j90j37N71k96j33j9K70r0r1R0P7j83J23k78P1K24j41J79m93L09L14l72
$$ 50 35 -155 -292 279 -17 -150 -169 101 11 -80 10 87 -96 27 -251 -180 44 -97 82 -411 -102 212 -160
6862a60M34l45J53q3k00J33J20J29r9k8n1ll6J99L2j47j18q1J86l72K82r3K46
$$ -160 274 -71 82 -1 -201 -68 52 181 82 54 3 0 -36 163 195 48 -70 -151 35 -337 -55 -148 98
6885I8k84l5L30r3K30j58j55J12p3k06K31j17K20k75Ok6L28k98L93m56j55K56
$$ 98 -186 -221 109 16 246 88 -67 45 -28 -234 -3 -120 100 -175 -169 -195 133 -165 228 -228 -383 -127
6907a27j47L59j04k40M51j88J81J81n64J77q3k5J52Pr3J06j88O2j64K97Q5j95
$$ -127 -274 85 -19 -259 192 4 185 366 -198 -21 -104 -129 23 30 -63 43 -145 -83 -247 50 135 -60
6929f0OK64n06K29N2j05j34K02q6R8n3K38j66mO8Pj26K27q5K05n16J34K08k0J51
$$ -60 -54 210 -296 -67 -15 -120 -254 -52 -138 -40 -93 145 -21 -25 43 50 -76 151 66 271 -245 -111 97 77 228
6954B28o7l9k46O2JJ64j0n2Q2j56j95K59J51l62K92M9J35n52M06j72K7J63l18
$$ 228 161 122 -124 -62 -61 103 93 41 123 -33 -228 31 182 -180 112 161 296 -256 150 -22 5 168 -150
6977a50K9K04r2m0r6K70J53n53L59k0Q0n7j37J3Q9J17J25m35J92l41J12J10P7
$$ -150 -121 83 -9 -49 -145 125 278 -275 84 64 144 87 -50 -37 52 169 294 -141 51 -290 -178 -68 9
7000Im3l55N49l41K65q9Q4Q1l47K79Q2p3o5j46j49K73j1l6k08K26NJ35j1K7k09
$$ 9 -34 -389 160 -181 84 -5 79 160 -187 92 174 101 36 -110 -259 14 3 -33 -241 -15 -10 125 114 141 -68
7025f8J31j49Q4j76J14R7k7qR4j43J17Q5j53K12j78J9k15J62j25K97j32J14l4
$$ -68 63 -86 -2 -178 -64 33 6 -2 92 -51 66 151 -2 210 32 51 -164 -2 -127 170 38 152 118
7048A18Q4l37Q9J65M8p6P3j47m7j46L87rk24K0j26l8o6K51M5l3p3k4K25k76K46
$$ 118 202 -135 -46 119 167 91 164 17 -30 -176 211 202 -22 -2 -128 -166 -232 19 64 31 -42 -66 159 -117 129
7073A29j01k17K33k94K97k06J24O3n2l71L05N8J89j27n1K31j63l18L83O3l16q2
$$ 129 28 -189 44 -250 47 -159 -35 28 -24 -395 -90 -32 157 30 -21 210 47 -271 112 175 -141 -223
7095b23L77j39k6j24n8K51k35J23J67j07j12N5k9L43n29K31j15J27N5j10J14J71
$$ -223 154 15 -11 -135 -193 58 -177 -54 113 6 -106 -51 -80 263 -266 -35 -150 -23 32 -78 36 207
7117B07m3q0m4j03K22k14p8L8R4P6l53L06J9k65K67M9j50L2O1k11J80N6p2N6J2
$$ 207 164 84 40 -63 159 -55 -133 -95 -1 75 -278 28 47 -218 49 98 -52 -20 41 -170 10 66 -6 50 62
7142F2r2K7m4J53j47J6P6k20J97k72K86m0j35r5k3J81L9p2M03l95J61j05J75l27
$$ 62 -30 -3 -47 106 -41 -25 51 -169 28 -244 42 2 -133 -228 -251 -70 -31 -103 300 -95 66 -39 136 -191
7166a91K95J10j45N3o7J03m44L43Ok25L22k31j24K85k53M7O7o5j20J9J01j88K04
$$ -191 104 214 69 122 55 158 -286 57 63 -162 160 -71 -195 90 -163 -116 -49 -114 -234 -215 -114 -302 -98
7189i8j32K82j02J1p8LL15l87K16j51nJ02j48K66J73J1r4J13j87l43K45J86k30
$$ -98 -230 52 -50 -39 -117 -114 201 -186 30 -121 -126 -24 -172 94 267 278 184 297 110 -233 12 198 -32
7212c2R5R9K1K39l06k80J19r5J40J8q8nj35J45J42J83j46r4K85l6j12j43J67k2
$$ -32 63 162 183 422 116 -164 -45 -140 0 18 -70 -75 -210 -65 77 260 114 20 305 269 157 14 181 159
7236A59j51n0L10m34O9J72j99L09m5n9j34J17Q4R9r2j62r9J79N1J40j7k20j18
$$ 159 8 -42 268 -166 -97 75 -124 185 140 81 -53 64 148 247 155 -7 -106 73 124 264 247 27 -91
7259i1L45l23P8j57M66j94j05p8K55k53j13k5N2K46j43R9J2j38P5K08j95j18J1
$$ -91 254 -69 9 -148 318 124 19 -59 196 -57 -170 -195 -143 103 -40 59 71 -67 8 216 21 -97 -86
7282h6R7J76j74j47M37j58j14J10l81J04K69k60j1p2K70o2j54J83L0L59n25N5
$$ -86 11 187 13 -134 303 145 31 141 -240 -136 133 -127 -138 -210 60 -2 -156 27 57 416 -109 -54
7304e4o7L36m50J13J60P8j99q5L33o3k05n4K25j26j63Q0J15J19ol15J96j66J21
$$ -54 -121 215 -235 -122 38 116 -83 -168 165 102 -103 -157 68 -58 -221 -141 -26 93 87 -228 -32 -198 -77
7327g7q3k1J81K23k98L24l95K26j0l9R8o2o0p6L65l27L4k0J72p9j62K44R0J27
$$ -77 -160 -181 0 223 -75 249 -146 80 70 31 129 67 7 -69 296 -31 3 -17 155 76 -86 158 248 375
7351C75n19L65j23o4JJ92n17M45r6j99l2M99m41K4O5J31K9j47Q4k48J68j61J32
$$ 375 -144 221 98 34 35 227 -290 155 59 -140 -172 327 -114 -90 -25 106 135 -12 72 -176 -8 -169 -37
7374c7L1K23l20J20m6J80Qm92K75n4J09J52k57L78j16j24n7o0J64m4Pk62K76p8
$$ -37 -6 217 -103 17 -29 151 159 -333 -58 -112 -3 149 -108 270 154 30 -27 -87 77 33 40 -222 54 -24
7398b4Q9K3j63j3N0r7Q3K11j29q3o0K36p9N2k79J8J9L13l07k23O53l05M5J63O7
$$ -24 65 88 -75 -88 -38 -135 -52 159 30 -53 -113 123 44 96 -183 -165 -146 167 -140 -363 290 -15 30 193 260
7423B60j56k17K78j51J54j17j19j9J23K2jj98J51N9m4j43P1k78J38l7K58j5n9
$$ 260 104 -113 165 14 168 51 -68 -87 36 58 57 -141 10 69 25 -118 -47 -325 -187 -224 34 19 -40
7446d0L2n4L8j5J07N0p3L31l90nj28Q7n7j93K95N8j32k04L13L7j10J42K12j05
$$ -40 -8 -62 -24 -39 68 118 45 376 -14 -19 -147 -60 -117 -310 -15 43 -89 -293 20 57 -53 89 301 196
7470A96j43m9L39m53k56J74K93p6j13j7J68l5j72L68m02L16J19j28k88K41l8j73
$$ 196 53 4 343 -110 -366 -192 101 25 -88 -105 63 28 -144 224 -178 138 257 129 -159 82 44 -129
7492a29k6J25m2J04L1qk14K40k36K05n7P7m76L30J90J9J54r4O2l10N5k18L10M3
$$ -129 -155 -30 -72 32 63 55 -159 81 -155 50 -7 70 -406 -76 114 133 287 193 255 -55 0 -218 92 135
7516A35l93N86n05J36K77k0m0j62J01j71J25l80J23J83j15L26k69mLj33J21O8
$$ 135 -258 328 -177 -41 236 216 176 14 115 -56 69 -311 -188 -5 -120 206 -63 -67 -64 -197 -76 -8
7538hj35p8M66j41J02m22J86J85K3k74P4J35Q0M0l87N2J46k2j24k9K33j00j38
$$ -8 -143 -221 245 104 206 -216 -30 155 178 -96 -22 113 193 233 -154 -102 44 22 -102 -131 102 2 -136
7561a36L5J07P0J1j75l1r5J04J47n8oJ51j43j53L18m76L48K0P3m14L86k35M6K40
$$ -136 -101 6 76 87 -88 -119 -214 -110 37 -21 -27 124 -19 -172 146 -330 18 38 111 -303 83 -152 -106 134
7585A34k20J75J11k89K47k29L2L8J02j48r3o5J61K6l81L77j74J96M9j88J56N9
$$ 134 -86 89 200 -89 158 -71 -39 -1 101 -47 -140 -205 -44 -18 -399 -22 -196 0 49 -139 17 76
7607G6o5m2j83O1K5o6K77j05J82l44L03N4k19J17j63L62l28L1J76l00J40j96L88
$$ 76 11 -31 -214 -153 -128 -194 83 -22 160 -184 119 173 -46 71 -92 270 -58 -27 149 -151 -11 -207 181
7630A81j7j60L14m12J58n9j55K97Q5l08Q9J58N4m98K07O7Pp1J8N4j71L66j87j14
$$ 181 164 4 318 -94 64 5 -150 147 232 -76 13 171 225 -273 -66 1 8 -63 -45 9 -162 204 17 -97
7654i7L1k09K31q2J47M0K23l28N3j63K84O1j78K29km27L31k99R3K97m1k28j65
$$ -97 -66 -275 -44 -126 21 61 284 -44 9 -154 130 191 13 242 240 -187 144 -155 -62 235 194 -34 -199
7677a99K38L46m68K45j38N4J29k13P2N7m0k01J39j71M7n6%K12R1ql29K67%j9P5
$$ -199 39 385 -83 162 24 78 207 -6 66 123 83 -118 21 -150 -103 -159 -159 53 144 136 -193 74 74 55 130
7702A30R3j49j99j78L51L9lm14L79J34P4l87J89j53L96k04j03l41L62J10m3P9
$$ 130 223 74 -125 -303 48 87 84 -330 49 183 257 -130 59 -94 302 98 -5 -346 16 126 83 162
7724A62l51NK85k59J41N7k84O6M46k59j1q2m2j79K52p4L23j49j54L74k46Lj94
$$ 162 -189 -184 101 -158 -17 40 -244 -178 268 9 -2 -84 -126 -305 -53 -127 196 47 -107 267 21 24 -170
7747a70L18k80OJ81O4k16M15n69M30k77m2J66M5j3j57R2j23K10j27J75m4k65J37
$$ -170 148 -132 -126 55 119 -97 318 -251 179 -98 -140 26 71 58 -99 -7 -130 80 -47 128 84 -181 -44
7770d4Ll7K18k74J81k30J15J4k3K36k97m0K15k0r2p0l0L57j41j88J05J11r0J03
$$ -44 -41 -78 140 -134 47 -183 -68 -54 -77 159 -138 -178 37 17 -75 -145 -175 182 41 -147 -42 69 -21 82
7794H2J09k22r1J88k09J8M3R7j48K62k9P7Lj91J27n3k46K35pj20L2P0j8j41K01
$$ 82 191 -31 -122 66 -143 -125 -82 15 -133 129 100 177 180 -11 116 63 -183 52 45 -75 -43 27 9 -132 69
7819F9k97M02k46j06J91o4q3L18k28j21M8J91j72J68m9J57j82P5j56p3M03n08
$$ 69 -228 174 -72 -178 13 -51 -134 184 -44 -165 -117 74 -98 70 21 178 -4 71 -85 -158 245 -263
7841b63L99j27J67o0j91K20Q7l25K97j74j83K46P3k4o1j11k05L18J7j58k08L06
$$ -263 136 9 176 116 -75 145 232 -93 204 30 -153 93 166 142 81 -30 -235 83 100 -58 -266 40
7863D0l62K45J74j43J59j25k10K79J05k59LJ78K1k90L60j29k2o3J83k61K55J09
$$ 40 -322 -77 97 -46 113 -12 -222 57 162 -97 -94 84 105 -185 175 46 24 -39 144 -117 138 247
7885B47l96L12J06m05J75J53k04J08n6m3k12M30k76J47k11J60r4J54j83o2K60
$$ 247 -149 163 269 -136 39 192 -12 96 40 -3 -215 215 -61 86 -125 35 -59 95 -88 -150 110
7906A10k59Q4L10j29k4p6j63J51j97M25n59L83Mp7j8M9R3j61jrJ56l79L58j36
$$ 110 -149 -65 245 116 92 16 -147 4 -193 232 -327 56 60 -17 -35 14 107 -54 -55 -64 92 -287 71 -65
7930f5J78p6QP4O6k65M6l26N50K48l11l5j60L9o0k12J46m5L49j98K3K03J72k04
$$ -65 113 37 45 119 185 -80 -34 -360 190 438 127 92 -68 -29 -89 -301 -155 -200 149 -49 -26 177 349 145
7954A45j70p1k21K59ok5j27J47J23J81k34j08J88l34L90m42J84O9J25j2Jj86p9
$$ 145 -25 -96 -317 -58 -64 -89 -216 -69 54 235 1 -107 81 -253 137 -305 -121 -52 73 61 62 -124 -203
7977b03J70j55K9J96r9J68r3j45J51r6J20k36K77l93K61j00P8j65J88Q4m7K07
$$ -203 -33 -188 -159 37 -62 106 13 -132 19 -77 43 -193 84 -309 -48 -148 -70 -235 -47 37 -10 197
7999A97k09J84l6l58L51k2N6J15j79k07p7J78J17j58r9J30L03n68J28K11P6k41
$$ 197 -12 172 136 -222 129 107 163 278 99 -108 -185 -7 110 -48 -147 -17 286 -282 -154 57 133 -108
8021a08j1K56k80P1oj14J86o3J10p7m1l1j81R6M54k08M7j38k25K84o6J61j60Q0
$$ -108 -119 137 -143 -72 -78 -192 -6 -69 41 -36 -77 -108 -289 -193 261 53 100 -38 -263 21 -45 116 -44 36
8045C6m4k59N52l22Q9p1j82J87KJ78l83K00J15M9k65P7J61j15k4J8r7j5Q8j47
$$ 36 -8 -267 285 -37 52 -19 -201 -14 -12 166 -217 -17 98 147 -118 -41 120 5 -19 -1 -98 -113 -25 -172
8069a72J72j38K04k88J37l18K86K14j34K06k90K97k04j09L58k30o0M36m29r4J47
$$ -172 0 -138 66 -222 -85 -403 -117 97 -37 169 -121 176 -28 -137 221 -9 -69 367 -62 -156 -9
8090iK1%n7Q1k8j80K2K70j50p6l1K8k84K19J07j07O2jL4J19l25Q2N9p6K44J8m7
$$ -9 12 12 -45 36 8 -172 -150 120 -30 -106 -137 -109 -393 -174 -67 -174 -112 -113 -79 40 -285 -203 -144 -220 24 42 -5
8117eL0l7p0K05k88J06J78j03r1P7K7j06J55J33k98m1L81l35J52P4n8j31L7R3
$$ -5 25 -12 -82 123 -165 -59 119 16 -75 2 29 -77 78 211 -87 -128 253 -82 70 144 86 -45 -8 85
8141H5k5m4k7o9j19L32J8k64Q6q5J97m7l91N23l28J24K8l4J25k11J95k44K76k20
$$ 85 60 16 -11 -80 -199 133 151 -113 -27 -112 85 38 -353 170 -158 -34 -6 -40 85 -126 69 -175 101 -119
8165a19L53k94j6K36j48l21L76k62J37J1J09Rj46r2K62o8K08j77j51m7K02j1j57
$$ -119 234 -60 -76 160 12 -309 67 -195 -58 -47 62 71 -75 -167 95 27 235 58 -93 -140 62 51 -106
8188a06K71k35j08
$$ -106 165 -70 -178
8191a78
$$ Imaginary data points
##PAGE= N=2
##DATA TABLE= (X++(I..I)), XYDATA
0@%%%%%%%%%%Qj6J6j6K4l2M0m8N6p2Q8j04J20j40J64j92K24k58K98l44L94m51
$$ 0 0 0 0 0 0 0 0 0 0 0 8 -8 8 -8 16 -16 24 -24 32 -40 48 -56 64 -76 88 -104 120 -138 160 -184 210 -241
32b41N14n83O60p42Q32r36J048j169J305j452J611j785J977k187K414k663K936
$$ -241 273 -310 350 -392 440 -496 552 -617 688 -764 847 -938 1039 -1148 1266 -1397 1539
49A539l235L564l926M326m771N269n828O460p184Q020q998J0163j1576J3334j5591
$$ 1539 -1696 1868 -2058 2268 -2503 2766 -3062 3398 -3786 4234 -4764 5399 -6177 7157 -8434
64h434J8609k2878K9418m0825O6352k29140J06621M63534k17812l35265l2463
$$ -8434 10175 -12703 16715 -24110 42242 -186898 -80277 383257 165445 -169820 -202283
75b02283K41369N9265n7010n4376r940k9904O3660P4768n1811j47787K9736J72289
$$ -202283 39086 98351 41341 -13035 -22975 -52879 10781 85549 33738 -114049 -84313 87976
87H7976M3763j68617r2298J00335J11158l5322p0487j2923K4446K0828K5162j7062
$$ 87976 131739 -36878 -129176 -28841 82317 46995 -23492 -36415 -11969 8859 34021 16959
99A6959n6216m686P6409K6911p2241m4920N4051L9025l0558j7096K2987j2037
$$ 16959 -39257 -43943 32466 59377 -12864 -57784 -3733 35292 4734 -12362 10625 -1412
111a412k7267L1531M1258m0156n5489L5935O4196k5403o3412J3832N3541j0140
$$ -1412 -28679 2852 44110 3954 -51535 -15600 48596 23193 -40219 -26387 27154 17014
123A7014l6956J8772K4296l5100k1058N2659K8072o2491m0050O1021M8781n1092
$$ 17014 -19942 -1170 23126 -11974 -33032 19627 47699 -14792 -54842 6179 54960 3868
135C868n3234L4781M7728j8367l2541R764J1840j0220O782J9784j5646l0498J5619
$$ 3868 -49366 -14585 33143 14776 -17765 -8001 3839 -6381 401 20185 4539 -25959 -10340
148a0340L7959r193l9752RL4133O295k4231q052J2643L253l157O036j077j5743
$$ -10340 27619 18426 -21326 -21317 12816 19111 -5120 -13172 -529 2724 -433 5603 4526 -11217
162a1217J140K2726M87k4378k171K3486J950k1027L10J8251l117j8144O170J8815
$$ -11217 -10077 12649 13136 -11242 -13413 10073 12023 -9004 -8694 9557 6440 -11704 -5534 13281
176A3281p160j9185O367J8180n386j4564M935R640p521m827J2128K235j7687l426
$$ 13281 6121 -13064 -6697 11483 6097 -8467 -3532 6108 -1413 -6240 5888 8123 -9564 -12990
190a2990K2730P248k3453j2424K1490J5897j5318j5810P102J1543j086l686k312
$$ -12990 9740 16988 -6465 -18889 2601 18498 3180 -12630 -5528 6015 4929 1243 -1069
203a069m854l47J2475N161j5479j1285J4030J6816q955j8027K511J5580K746r289
$$ -1069 -5923 -6270 6205 11366 -4113 -15398 -1368 15448 6493 -11534 -9023 6557 9303 14
217A4m962J907K159M195K628p111q936P417J2895l967j5108N7J4236L281j0582
$$ 14 -4948 -3041 -882 3313 5941 -1170 -10106 -2689 10206 6239 -8869 -8812 5424 8705 -1877
232a877m513O179K940j774n70r0k783M3N726J433p234l259P282M232o014m577
$$ -1877 -6390 -211 2729 955 385 295 -2488 -2445 3281 4714 -2520 -5779 1503 5735 -279 -4856
248d856M561M050l827k590L121J185l506K24M034q34m441J506M270j346l740J216
$$ -4856 -295 3755 -72 -2662 459 1644 -1862 -1638 2396 1562 -2879 -1373 2897 1551 -2189 -973
264i73L275j608k378J891J626k320j921K733J898k817j798K598K213k601j795
$$ -973 2302 694 -1684 207 1833 -487 -2408 325 2223 -594 -2392 206 2419 -182 -1977
279a977K378J240j987m41J304N83k267P53J979j274k456K048K233j826k264J143
$$ -1977 401 1641 -346 -787 517 1100 -1167 -414 1565 291 -2165 -117 2116 290 -1974 -831
295h31K371r42k010N32J879m86r03J41O95r37m5J368k23j781K22K062R9k207l91
$$ -831 1540 598 -1412 -880 999 513 -390 -249 446 -491 -536 832 609 -1172 -950 1112 1211 -996 -1387
314a387K047N16j553p89J416O1n21L90Op51j09J184M23j176o99J484L45p98r37
$$ -1387 660 1176 -377 -1166 250 311 -210 180 186 -565 -674 510 933 -243 -942 542 887 89 -848
333h48Q35Q37p37p59N21K73o9k95L10k8j22k1P74m87r72P56R02o72p77J26Q48
$$ -848 -13 824 87 -672 -151 122 53 -242 68 40 -82 -103 671 184 -788 -32 870 198 -579 -453 395
354C95j9n06k4L01j34K65j00j22m22L07J94R3l35l44M30N01m25l77L31P8J13m43
$$ 395 376 -130 -154 147 13 278 178 56 -366 -59 135 228 -107 -451 -21 480 55 -322 9 87 200 -243
376b43J68K13m9k8J47K6n72J06N34J25l92l00J20L03j6Q0m57J21L63j48J32n17
$$ -243 -75 138 89 61 208 234 -338 -232 302 427 35 -265 -145 158 142 222 -235 -114 249 101 233 -284
398b84j00K88N44m49k64j98N78J37k48k94j70J34Q08m9p73j49M13O08k49o11J23
$$ -284 -384 -96 448 -1 -265 -463 115 252 4 -290 -460 -326 482 433 -340 -489 -76 532 283 -328 -205
419b05L32K36m38K2l07J81L40N22o52m83p5P00L70m46o49O6J026L95j083n41L46
$$ -205 127 363 -75 -53 -360 -179 161 683 31 -452 -527 173 543 97 -552 -486 540 935 -148 -689 -343
440c43N47j1p0k78k75R4P01m7o04j62M47N39J00j008m11M95R22m6q70n83O44N77
$$ -343 204 193 123 -155 -430 -336 365 318 -286 -448 -1 538 638 -370 -781 -286 636 590 -280 -863 -219 358
462C58j7n89k26MM13N11k64l79l84M49O44N0j151l54Q69O91j01j204m9P56O57
$$ 358 341 -248 -474 -470 -57 454 190 -189 -573 -124 520 570 -581 -935 -66 625 524 -680 -729 27 684
483F84m77l26k57K07K35O07r6r77k95Q35J019r29j361rJ726O58j243j228R73O72
$$ 684 207 -119 -376 -169 66 673 577 -400 -695 140 1159 230 -1131 -1140 586 1244 1 -1227 -254 418
503D18J46q52j52K02M45N45j86p13m04L01R71L57j450j045Q71J514r6j510n34
$$ 418 564 -288 -440 -238 207 752 566 -147 -551 -250 721 1078 -372 -1417 -546 968 872 -638 -1172
522a172J220J089o66j024l15Q75M01n5j27p02k20M86J159n33j329m96K065J119
$$ -1172 48 1137 471 -553 -868 7 408 353 226 -476 -696 -210 949 416 -913 -1409 656 1775
540A775j269j808L43J802J60j305o85R58N31k15k78K23r71K54J037N16j136j257
$$ 1775 506 -1302 -959 843 1003 -302 -987 -29 502 287 9 232 -739 -485 552 1068 -68 -1325
558a325N19J739K60j970o31J364J411j153j156K07Q02N52k28k48p61K6N58J055
$$ -1325 -806 933 1193 -777 -1408 -44 1367 214 -942 -735 67 619 391 143 -618 -592 -34 1021
576A021n92j485N5R15J439j102j191kJ356P77j272j100M41J406j19n08o98N10
$$ 1021 429 -1056 -1001 -86 1353 251 -940 -942 414 1191 -81 -1181 -740 666 547 39 -659 -149
594a49N53om7n16n49M00J098j66r88m91P62J171l97j701K56J142K34n55p61N42
$$ -149 404 398 351 -165 -714 -314 784 618 -370 -861 -99 1072 675 -1026 -770 372 606 51 -710 -168
614a68J75J2m8P1k58k26N91L49l87o28K59M34L04q51q8L07M34j50k58l23N30Q7
$$ -168 7 19 -29 42 -216 -442 149 498 111 -517 -258 176 480 -371 -459 -152 282 132 -126 -449 81 168
636A68j08L75k83l25K06J47L67m76o29L40J83K95l81n43L95O50j05k69k22nO26
$$ 168 60 435 152 -173 33 180 547 71 -558 -218 -35 260 -121 -664 -269 381 276 7 -215 -220 406
657D06l10j67l18K08K2N00j23l87l17O21K48j54l19j2L71k3J05o47q6N86k68J29
$$ 406 96 -71 -389 -181 -159 341 218 -169 -486 135 383 229 -90 -102 269 246 351 -296 -382 204 -64 65
679F5l68N9J37L59j66k19J21K2M80l91j0j67m3K51j20k6j73n3L22j48N1j07J15
$$ 65 -303 -244 -107 252 86 -133 -12 10 490 99 89 -78 -121 130 10 -16 -189 -242 80 -68 -17 -124 -9
702ij01Jr6J81j20R9K99q7j34k04N7J26K68n28J0K25j00J93k98R7P4JJ12l56J97
$$ -9 -110 -109 -205 -24 -144 -45 254 167 33 -171 -114 12 280 -248 -238 -13 -113 80 -218 -121 -47 -46 66 -290 -93
727i3K7J91L21m09l42M94o4j02j15p3j39O86k51N4j41o8J9j04ol5K66j40J61k39
$$ -93 -66 125 446 37 -305 189 125 23 -92 -165 -304 382 131 185 44 -24 -5 -109 -115 -150 116 -24 137 -102
751a02l2K26J25j28j71PL01m4k13m4K82k15o2j25K47m4k82L24j63l4K88k32J53
$$ -102 -134 92 217 89 -82 -75 226 182 -31 -75 207 -8 -70 -195 52 8 -274 50 -113 -147 141 -91 62
774F2J3k47K59j36O6M2o5L1J70o8l9k32q2K95R1p2j17j59M40m69L70n9M0m7l00
$$ 62 75 -172 87 -49 17 59 -6 25 195 127 88 -144 -226 69 160 88 -29 -188 252 -217 153 94 134 87 -213
799b13L16k73K13K6k27M4P2J01j73L05l58P3m1PP7qr7m6O4M1K19M0K7j16N00o50
$$ -213 103 -170 43 69 -158 -114 -42 59 -114 191 -167 -94 -135 -128 -51 -59 -156 -202 -138 -97 122 162 189 73 573 -77
825g7K00m06P9K46K7kR6j30l54O21m44K18O4m6j96N7K34j11M0j73K16R7j31j81
$$ -77 123 -283 -204 42 69 67 163 33 -321 300 -144 74 138 92 -104 -47 187 76 116 -57 159 256 125 -56
849e6j42J75j01K76k69R5j14N11k04k07j44q9J58k79M03J1q1L1o5q6J40Lr3L5
$$ -56 -198 -23 -124 152 -117 -22 -136 375 171 -36 -180 -269 -111 -390 13 24 -57 -26 -91 -177 -37 -34 -127 -92
873i2J82k03L5N4MJ30j65o2K2L33j67qn3k7M4J54k10m6J82J9p4Q5j53r0q0J92
$$ -92 90 -113 -78 -24 -20 110 -55 -117 -95 238 71 63 10 -17 27 181 -29 -75 107 126 52 137 -16 -106 -186 6
899FJ74m37j5J95L91m1l19jj37J12%O7R1k13j63J60N7N3Q6P7k56OJ04r7K62j59
$$ 6 180 -257 -272 -77 314 273 -46 -47 -184 -72 -72 -5 86 -127 -290 -130 -73 -20 66 143 -113 -107 -3 -100 162 3
925CQ1l01R5J83k08J77J4k60L86Q4q9m15K30J2J27n3j67K3l9N7K65m55J83j83
$$ 3 84 -217 -122 61 -147 30 44 -216 170 254 165 -250 -20 -8 119 66 -101 -78 -117 -60 205 -250 -67 -250
949b50L28K85p59L15J29P2j35j23nJ00j31M06K3l70k57L80K21k73j78J09L49l19
$$ -250 78 363 -396 -81 48 120 -15 -138 -143 -43 -174 232 255 -115 -372 8 229 -44 -222 -113 236 -83
971h3J49j64K56k40q8m5N5K64k09J58J80j19j84j16Q9M97n70J37K9j01J20m3k59
$$ -83 66 -98 158 -82 -170 -215 -160 104 -105 53 233 114 -70 -186 -97 400 -170 -33 -4 -105 15 -28 -287
994b87M22j05j60L09l44J12k2j04P69n41j37K00P2oj42j87K45P6j91m39L72J29
$$ -287 135 30 -130 179 -165 -53 -75 -179 590 49 -88 112 184 178 36 -151 94 170 -21 -460 -88 41
1016D1J40l26j74M59L4p8l98N24K4m19K64k79J78l14L81j3P9n85K95K15n3Q9m8
$$ 41 181 -145 -319 140 174 96 -302 222 246 -173 91 -188 -10 -324 57 44 123 -462 -167 48 -5 84 36
1039C6k12m8J64L58k76k39M88q7j2j13k32J64r7K16j04j14j0J57K5M6j14J05l21
$$ 36 -176 -224 -60 298 22 -217 271 184 172 59 -173 -9 -106 110 6 -108 -118 39 64 110 -4 101 -220
1062b20J68k12J82j17J83l6J2LJ00j62K44K58l88J48Q5k05k94J12M32j27k05J39
$$ -220 -52 -264 -82 -199 -16 -52 -40 -37 63 -99 145 403 15 163 248 43 -251 -139 293 166 -39 100
1084A00k19J47j17n6J2%j79K58J45J73j49o22O18j73p5J72J25j26j40k1m0L79
$$ 100 -119 28 -89 -145 -133 -133 -312 -54 91 264 115 -507 111 -62 -137 35 160 34 -106 -127 -167 212
1106B12m25L38mk75j14M41k37K49k54J98j26P3j94j5J43k11K13m0m0J23j78K37
$$ 212 -213 125 121 -154 -268 173 -64 185 -69 129 3 76 -118 -133 10 -201 12 -28 -68 55 -123 114
1128A14l4j61K35K4j17l75N36l77N0K07j88j8J6J80QK6J08k48M1m3M1K67j41j6
$$ 114 80 -81 154 178 61 -314 222 -155 -105 102 -86 -104 -88 92 100 126 234 -14 27 -16 25 292 151 135
1152A35j85l16M44k83j81L91q6J48j08j56K89L2k40J36J8O1k53O5N3KK21j33j0
$$ 135 -50 -366 78 -205 -386 5 -81 67 -41 -197 92 124 -116 20 38 99 -154 -89 -36 -34 187 54 44
1175D4k91K60K67j92l03R3k08L18k6j5O3J47k26K25j43k99Q9j44N92j82N9j64
$$ 44 -247 13 280 88 -215 -122 -330 -12 -38 -53 10 157 -69 156 13 -286 -197 -341 251 69 128 -36
1197c6K73k10k54J51N7K47m16R7J25j47QJ30J78j14j76K63m79L16n6K74m22J78
$$ -36 237 27 -227 -76 -19 228 -188 -91 34 -113 -105 25 203 89 -87 176 -303 13 -43 231 -191 -13
1219a3j44M6J59k45K4n0J94k55K84R9j06J74r0l06K98j26J26j55J31j44L6q5Q4
$$ -13 -157 -111 48 -197 -173 -223 -29 -284 0 99 -7 167 77 -229 69 -57 69 -86 45 -99 -63 -148 -64
1242f4M8J61R6j94k46J54L8J98m71M54r4m07M54j17K20r2q9J96j56j38J71j26
$$ -64 -16 145 241 47 -199 -45 -7 191 -280 174 80 -327 127 10 230 138 49 245 89 -49 122 -4
1264dk71K44J31L0o6k69L53j57p7O9p3l0K05R1j16l7q8q0J24J89k97pK41j08q3
$$ -4 -275 -31 100 130 64 -205 148 -9 -86 -17 -90 -120 85 176 60 23 -65 -145 -21 168 -129 -136 105 -3 -86
1289h6J81k29J18%j51Q8M26o40K55N7q2R4k11J24m8l85N59r3j29K9P2Q2j84J35
$$ -86 95 -134 -16 -16 -167 -79 347 -293 -38 19 -63 31 -180 -56 -104 -489 70 -23 -152 -123 -51 31 -153 -18
1313a8k18L34j90J22k86M20k27K45k36m3K22j77J04o6o0M8J68l94n6J89J06k03
$$ -18 -236 98 -92 30 -256 164 -63 182 -54 -97 125 -52 52 -14 -74 -26 142 -252 -308 -119 -13 -216
1335b16K42k52L71j33j90K09k1K8j28L27k95L7o4N8pL0N3o8lM6J69j87p8K79j20
$$ -216 26 -226 145 12 -178 31 10 38 -90 237 -58 -21 -85 -27 -34 -4 49 -19 -22 24 193 6 -72 207 87
1360H7j19k4j47K90r9j38J53m5J40l44K38m6J02j26P1J58R9j36m58K94R9K6k32
$$ 87 -32 -56 -203 87 -12 -150 3 -42 98 -246 -8 -54 48 -78 -7 151 250 114 -344 -50 49 75 -157
1383a57P4J1k4L9J38n6K42k42l4k78K77k1o8J19j08K88k22rK05n7j22j9J8j6p2
$$ -157 -83 -72 -96 -57 81 25 267 25 -9 -287 -10 -31 -99 20 -88 200 -22 -31 174 117 -5 -24 -6 -22 -94
1408i4J39k1J32r4MO6j50J33J45l65R8k7r9L65j16j30m7P0J35k88L32k03J74j09
$$ -94 45 24 156 62 66 132 -18 115 260 -105 -7 -34 -133 232 116 -14 -61 9 144 -144 188 -15 159 50
1432E0pl08K25K7j58K64J24l84OK6L52k86r5K91j92j20m8M10k73L19l90L51j91
$$ 50 43 -265 -40 -13 -171 93 217 -167 -161 -135 217 -69 -164 127 -65 -185 -233 177 -96 223 -167 184 -7
1455gp1j40L17K89m59k9K47J0j02r7J30j2k89K65j36K56k0j86j05j1K77r7LJ61
$$ -7 -78 -218 99 388 -71 -100 147 157 55 -42 88 76 -213 52 -84 172 152 -34 -139 -150 127 30 33 194
1479A94k84k47L18k1j1p7M6J12J02j85K30l2j93J06L2j11K52l19K5j77N2J32L73
$$ 194 -90 -337 -19 -40 -51 -128 -82 30 132 -53 177 145 -48 58 90 -21 231 -88 -63 -240 -188 -56 317
1502C17m94L60j65l20K48Q2K6j5K4k93K97r1l7J76k61l1K85P4m7q1r2q3L53m59
$$ 317 -177 183 18 -302 -54 28 54 39 63 -230 67 -24 -61 115 -146 -177 108 182 135 54 -38 -121 232 -227
1526b27M75k13j00kP0J15q0n7j17L53j14l53L47j44m5J46k35M64m48Q1L6J89j36
$$ -227 248 35 -65 -67 3 118 38 -19 -136 217 103 -250 97 -47 -92 54 -181 283 -165 -84 -48 141 5
1549EP1q3j88L02K1lm1j04Q0j32K44o77N83P9k44L64j22J77k60J72k70l8O1J09
$$ 5 76 -7 -195 107 128 125 84 -20 60 -72 172 -505 78 157 -87 277 155 332 72 244 -26 -64 -3 106
1573A06k3l1L18l35J04k21P1k88N17q7l80J91P1o5Q0J11j55L4k91L18j35j24K03
$$ 106 83 52 370 35 139 -82 -11 -299 218 131 -249 -58 13 -52 28 139 -16 18 -273 45 -90 -214 -11
1596a1k60L65k8j12Lm3K56l9k19J25k08K63j7o8K47m16L23m18L3O5P2J38q3j11
$$ -11 -271 94 66 -46 -43 -86 170 131 -88 37 -171 92 75 7 254 -162 161 -257 -224 -159 -87 51 -32 -143
1620a43j23L78Q4k12j20N0K91k70J15o0j29O8M8l2J73j06p2J86j00n7j10K94N6
$$ -143 -266 112 196 -16 -136 -86 205 -65 50 -10 -139 -71 -23 -55 118 12 -60 126 26 -31 -141 153 209
1643B09K9l91K38M9j45j30P1j0Q1L07l91m9J67m0P1j89O1l5K56k53MK04q5k08
$$ 209 238 -153 85 134 -11 -141 -70 -80 1 308 -83 -132 35 -5 66 -123 -62 -97 159 -94 -90 114 29 -179
1667a79K80j9k53K8Q4J35K50l61M1J09l35Q9P9N1q7j4M1L1Ln4J96J06n53O64l23
$$ -179 101 82 -171 -143 -59 76 326 -35 6 115 -220 -131 -52 -1 -88 -102 -61 -30 -27 -81 115 221 -332 332 9
1692Ip0m4N7n7k2K52l44N34j59j90K01j25O2m1p0mK16m02J27J44J38Pq5q1k78
$$ 9 -61 -105 -48 -105 -127 125 -219 315 156 -34 167 42 104 63 -7 -11 205 -197 -70 74 212 219 134 53 -225
1717b25K64j79Q2J71j09J44j87j63K10M9R5j60P7M6l5j99K00o9L4j17m4N00k84
$$ -225 39 -140 -58 113 4 148 -39 -202 8 57 152 -8 69 115 80 -119 81 12 46 -71 -115 385 101
1740A01k17r6J74J5L2K32k63K8k07J70J69k31m2Q1j28L35k23k43N42k44rq5O0
$$ 101 -116 -212 -38 -23 9 241 -22 6 -201 -31 138 -93 -135 -54 -182 153 -70 -313 229 -15 -24 -109 -49
1763d9J23Q3Q6l34l2L29j93k47L41k65K18j02L8K61l08Q4j14L37n51M52J03n50
$$ -49 74 157 243 -91 -123 206 13 -234 107 -158 60 -42 -4 257 -51 33 -81 256 -295 157 260 -290
1785b90K75R7K06l35j26K32m8p1l36J75K90q3j8R2K46l18J19jj81JK11k7J07l76
$$ -290 -15 82 288 -47 -173 59 11 -60 -396 -221 69 -14 -32 60 306 -12 107 106 -75 -74 137 110 217 -159
1809a59J7j29L57l5k2M2j31k2j5mK53m20K09J4Q5K46o7k36J16J36o3m12j63N84
$$ -159 -142 -271 86 51 29 71 -60 -82 -97 -101 152 -268 -59 -45 40 286 219 -17 99 235 172 -240 -403 181
1833A81m01q2J07K41k80M21m31J15K30k93M08m76M6L16m50J65M12N3l71p3M06
$$ 181 -220 -302 -195 46 -234 187 -244 -129 101 -192 216 -260 -214 102 -348 -183 229 282 -89 -162 244
1854B44k46K0M0k2k0j4k37N95n05L59k60J38J9k62n0L09J32k82k13M9L99j37j79
$$ 244 -2 18 58 36 16 2 -235 360 -145 214 -46 92 111 -151 -201 108 240 -42 -255 -206 193 56 -123
1877a23K45j14n9j83rL07k66N04l08K22j12N8j35L6L0J34m39K46J35j31K5j18
$$ -123 122 8 -51 -234 -243 64 -202 302 -6 216 104 162 27 63 93 227 -212 34 169 38 63 -55
1899e5rJ9K5r3J77r8j22R3L09k52m9L32m55K63K3L2P1j99j47n2L22j70Q1Q9j66
$$ -55 -64 -45 -20 -113 64 -34 -156 -63 246 -6 -55 277 -178 85 108 140 211 12 -135 -187 135 -35 46 135 -31
1924c1jq7M7L3p9J14k21J73J71J6j57j43J14n8M53k94l97L18L27k38K67o6m06
$$ -31 -32 -119 -72 -39 -118 -4 -225 -52 119 135 -22 -165 -51 -109 344 50 -347 -29 298 60 327 261 -145
1947a45K32p6J02k67M25j16l42P3K66k60J27J44l30K38P3P9l11K89l4n9j96o6
$$ -145 87 11 113 -154 271 155 -187 -114 152 -108 19 163 -167 71 144 223 -88 201 167 108 -88 -154
1969a54Q4J21J41p1m6j20J06j4P4j12q2K9P4j43N9j88K48m4Q0k2L6Q1j88J31r7
$$ -154 -70 51 192 121 75 -45 61 47 121 9 -73 -44 30 -113 -54 -242 6 -38 42 20 56 137 -51 80 -17
1994a7j36K95j81K4Q5K9j80m7PK60j78o0R7QJ44R1j37j80j14M3J89p7k0j34J39
$$ -17 -153 142 -39 -15 70 99 -81 -128 -121 139 -39 -99 -2 6 150 241 104 -76 -190 -147 42 -35 -55 -189 -50
2019e0j56N29o20L57j02K3J05J29j05K5k72J74J19k54Q5O9r2m1K46j33j60j67
$$ -50 -206 323 -297 60 -42 -19 86 215 110 135 -137 37 156 -98 -13 56 -36 -77 169 36 -124 -291
2041b91M62l94K24p6j44J77%O5j20R7O4q5Q7j81J88J60k38k09m8J89K0j00L12
$$ -291 171 -223 1 -75 -219 -42 -42 23 -97 0 64 -21 66 -115 73 233 -5 -214 -262 -73 -53 -153 159
2064A59m38J82O7l9J12j19J50j57q7K4J04R4J40k0j50Q3l02J59j07L35Pl24J94
$$ 159 -279 -97 -30 -69 43 -76 74 -83 -170 -146 -42 52 192 172 22 105 -197 -38 -145 190 197 -127 67
2087F7R3k63r0L42J08l22P4r0KJ2j53K59L11k33m26K61K36m71K26j21J92M3o5
$$ 67 160 -103 -193 149 257 -65 9 -81 -79 -67 -220 39 350 117 -309 -48 188 -283 -57 -178 14 57 -8
2110hL80m27j32M8l8J83l24L13o7jJ80k68K41K80l63k10L61l31K84k01K7J03k05
$$ -8 372 -55 -187 -139 -177 6 -318 -5 -72 -73 107 -161 80 360 -3 -213 148 -183 101 -100 -73 30 -175
2133a75J56j08K76j35j42J65j16J23p1K55n1j48l25J48J67j33K80k34N8K0J46
$$ -175 -19 -127 149 14 -128 37 -79 44 -27 228 177 29 -296 -148 19 -114 166 -68 -10 10 156
2154A56K04l93K75qk85J51oJ51r8k06l8O0L2j59K66oQm69L77L4P8L98m54ok25
$$ 156 360 -33 242 234 -51 100 94 245 147 -59 -97 -37 -5 -164 102 96 104 -365 12 46 124 522 68 62 -163
2179a63J56q3L8J65l17M0J32R0m9j17j07M03l56J77P9k8j83J98J29k66k10M37
$$ -163 -7 -90 -52 113 -204 -164 -32 58 9 -108 -215 188 -168 9 88 60 -123 75 204 -62 -272 165
2201A65j95J1K4r8J19J11m2j42J61R1k68j42n1N5P0J02j75P7l1L09j59K86k51
$$ 165 -30 -19 5 -93 26 137 95 -47 114 205 -63 -205 -256 -201 -131 -29 -204 -127 -158 151 -8 278 27
2224B7l9j04J05q2J95K03k70k09L2K88k77K32Kq4J39j90J6j23K70r6J92l04N6
$$ 27 -12 -116 -11 -93 102 305 35 -174 -142 146 -131 101 103 19 158 -32 -16 -139 131 35 227 -77 -21
2247b1Mj25K89K4L6j18l27P6L83m18L72k3J22J2k89J9J56k27K1m84O08k54J44
$$ -21 -17 -142 147 171 207 89 -238 -162 221 -197 175 152 274 286 -3 16 172 -55 -34 -518 90 -164 -20
2270b0j35P3P6K90k16k04M23m83K65j2N8n7J2N4j55Q5l74K82M1q4K19k79K69Q1
$$ -20 -155 -82 -6 284 68 -136 287 -196 69 57 115 58 70 124 -31 54 -320 -38 3 -81 138 -141 128 209
2294B09k46r9j3K8OK89k27m0J00Rj44J87l6n2j13K14n6j28j98L73k90L4M62j95
$$ 209 -37 -136 -149 -121 -115 174 -53 -93 7 16 -128 59 23 -29 -142 72 16 -112 -310 63 -227 -193 269 74
2318G4j36K53j13R8j77J79j37j82K79k92J16O7J48l04M42l84p5J88L18m53M8j80
$$ 74 -62 191 78 176 -1 178 41 -141 138 -154 -38 29 177 -127 315 -69 -144 44 362 -91 -43 -223
2340b23K61P0l78K3J95J47k12j0J44j05o8L74l36K06j80K10j39j2L06j26k01M4
$$ -223 38 108 -270 -247 -52 95 -117 -127 17 -88 -156 218 -118 88 -92 118 -21 -33 273 147 -54 -10
2362a0K40o3J98m70k7J38m6j06K90j00J05k2k33K12n6kJ86m89L57J65k95K2P9
$$ -10 230 167 365 -105 -132 6 -40 -146 144 44 149 127 -106 106 50 48 234 -255 102 267 -28 -6 73
2385G3P9l6k4k5l7j35J83p1J15j59l2K04J6k85Q6J69k37J25l5J32j59J97k17%
$$ 73 152 116 92 67 30 -105 78 7 122 -37 -69 135 151 -134 -48 121 -116 9 -26 106 -53 144 -73 -73
2409g3r2K38k2K5pr0K27l42L79l71J71o0p2K8o0K46M0K09n72K49nK57l36j5j02
$$ -73 -165 73 51 76 69 -21 206 -136 243 -128 43 -17 -89 -61 -121 125 165 374 -198 51 46 303 -33 -48 -150
2434a50Q6K02j10j19K69j36k6l0j23m0K54L3o1j2j4J07j14O6m58N15k92K71l46
$$ -150 -64 138 28 -91 178 42 16 -14 -137 -177 77 110 49 37 23 130 16 82 -376 139 -153 118 -228
2457b28N26l89J94m5k45k6K38k8q5J63l6j53J45J37k91M01k63M8Nj67m7L16l7
$$ -228 298 -91 103 58 -187 -213 25 -3 -88 75 39 -114 31 168 -123 278 15 63 68 -99 -146 170 133
2480A33j84J58k68L47k26m9K85P8m17r0K72j62L30l32Q8k7J19M9q6J19j56k33
$$ 133 -51 107 -161 186 -40 -89 196 274 -143 -233 39 -123 207 -125 -37 -64 55 104 18 137 -19 -252
2502b52J10L13j39j0L8l1j80j39K30qJ79j76j30l4L36j08q3K91J52l83l6j16K61
$$ -252 -142 171 32 22 60 29 -151 -290 -60 -68 111 -65 -195 -229 107 -1 -84 207 359 -24 -60 -176 85
2525H5n5j75J21J73k72J16j43R5J2Rr9j1jJ57k57J21J12j53J09J20n0j80J07R5
$$ 85 30 -145 -24 149 -123 -7 -150 -55 -43 -34 -133 -144 -145 12 -245 -124 -12 -165 -56 64 14 -166 -59 36
2549C6o5j0J16J1M2k66L63j24j50k1j74K56M3j25P6m1l2J7kj67O8K15Jj8J36k01
$$ 36 -29 -39 77 88 130 -136 227 103 -47 -68 -242 14 57 -68 8 -33 -65 -48 -50 -217 -149 66 67 49 185 -16
2575a6J25K34m0k66j15K07q1J7j2k58L85j60j28K99n5m83L85K09j89kj98L02l00
$$ -16 109 343 303 37 -78 129 48 65 53 -205 180 20 -108 191 136 -347 38 247 58 56 -142 160 -140
2598a40J69J93j5n1Kl67M59k90MJ38k94L13p3o8J4Q7L5K62l85O4k18N4j32K54
$$ -140 29 222 207 156 158 -209 250 -40 -36 102 -192 121 48 -20 -6 81 116 378 -7 57 -161 -107 -239 15
2622A5j49R0k1K98m95L69K1q6O0j26r9J48o7o5p6L23j52R0L1j97K16q1J07m46
$$ 15 -134 -44 -65 233 -262 107 128 42 102 -24 -123 25 -42 -107 -183 140 -12 78 109 -88 128 47 154 -292
2646b92M81q3k13O7K12l00Q3r9J51K3J26j52p5J5J81np8J1k31K93k30J6k4K37
$$ -292 189 106 -107 -40 172 -128 -45 -144 7 30 156 4 -71 -56 125 120 42 53 -178 115 -115 -99 -123 114
2670A14K1n8q9R5p7J55k85J65J61k97n0O5l9OJ66k0J1P3m6J02J73k64l61K13J63
$$ 114 135 77 -12 83 6 161 -124 41 202 -95 -145 -80 -119 -113 53 33 44 117 71 173 346 82 -279 -66 97
2695I7k08j17L17j98K85l28K22j64n8QJ20K82q7k53J8O3K18k88O3J0j28O3L02
$$ 97 -111 -228 89 -109 176 -152 70 -94 -152 -144 -24 258 171 -82 -64 -1 217 -71 -8 2 -126 -63 239
2718B39j4j89j03m5j0K37J27m37J13l26M95k14l2J03M5R0J4j62J57p0J64j83m6
$$ 239 225 36 -67 -112 -122 115 242 -195 -82 -408 87 -127 -159 -56 -11 79 93 -69 88 18 182 -1 -47
2741d7J6K61l82j1K00q4J02Q9j26j15O3K83l22L7Q8k07K19J36j81J9j2j07J05
$$ -47 -31 230 -152 -163 37 -47 55 144 18 -97 -34 249 -73 -36 52 -155 64 200 19 38 26 -81 24
2764B4r7k57K56K01J9l88J53l0K77j47K86l49j11K87j22J56J7j72j10J60pj56
$$ 24 -73 -330 -74 127 146 -242 -89 -119 158 11 297 -52 -163 124 2 158 175 3 -107 53 46 -110
2786a10K29O0l50K50l5K81l42J40k96K31L8l13J39J40P5j87M38j21j3l09K48k92
$$ -110 119 179 -171 79 44 325 -17 123 -173 58 96 -217 -78 62 137 -50 388 267 254 -55 193 -99
2808i9j43L33k71L3K99l73K96j17K10n1j7Lm7J50k63l0J73j94J40K31m78M4J7
$$ -99 -242 91 -180 -147 152 -221 75 -42 168 117 100 103 56 206 -57 -87 86 -108 32 263 -215 -171 -154
2831a54K16J06j79J48k71nK52j62r5L7j98L25m2k45N57j41m9L9l71K34m4K54l19
$$ -154 62 168 -11 137 -134 -139 113 -49 -144 -107 -305 20 -22 -267 290 149 100 139 -232 2 -42 212 -107
2854a07N6j05R4K39l54L3oK59j03j24KJ29k09O2K25k35r5L49r0j1j26J15J82k5
$$ -107 -51 -156 -62 177 -177 -144 -150 109 6 -118 -116 13 -196 -134 91 -144 -239 110 20 9 -117 -2 180 155
2878A55q1qk34L29j95J5j09l2J42j19L00j7n2k21J97m7J79j62q3K05j05l06L18
$$ 155 74 66 -168 161 -34 -19 -128 -160 -18 -137 163 146 94 -127 70 23 202 40 -43 162 57 -249 69
2901F9R1K0p9n15M17R7m05J60K95j81N6Nl70L28J05j37k65L17j84K02r6J18q5
$$ 69 160 180 101 -414 3 100 -305 -145 150 -31 25 30 -340 -12 93 -44 -309 8 -176 26 -70 48 -37
2924c7M4k2J04j57M7k13K89n4K8Q1n0j4k17M73l96L25j61l80J99K69Lm31J95r4
$$ -37 7 -15 89 -68 -21 -234 55 1 29 110 60 46 -171 302 -94 231 70 -310 -111 158 161 -270 -75 -169
2948a69K17J36l49L71k44m6q5K69J9m32M62J14k17j94K52j97J07J33l12J39q6
$$ -169 48 184 -165 206 -38 -84 -169 100 119 -313 149 263 46 -148 104 -93 14 147 -165 -26 -112
2969a12p3K57j72p4J07O7O2j93M47k59O4J26j59j74K37k51J7o9J72p5J80j41K23
$$ -112 -185 72 -100 -174 -67 0 62 -131 316 57 121 247 88 -86 151 -100 -83 -152 20 -55 125 -16 207
2992B07Pk19J73j90Q5l19r%l3L74j34K03k00j10K93p1j50qj53N9L68k82L1L58
$$ 207 214 -5 168 -22 63 -256 -265 -265 -298 76 -58 145 -55 -165 128 57 -93 -101 -254 -195 173 -109 -78 280
3016B80k22l1j78K25q5L7K72k37j20J34p2L55l04K66m27J4J69N5J34k04J53m74
$$ 280 58 27 -151 74 -11 26 298 61 -59 75 3 358 54 320 -107 -93 76 131 265 61 214 -260
3038b60K26R9p2k1K23k02J16j85J07Q2J50n69L00N1j25j52K17m6j76K85q5j01
$$ -260 -34 65 -7 -28 195 -7 109 -76 31 113 263 -306 -6 45 -80 -232 -15 -61 -237 48 -37 -138
3060a38p9J76j63j6P7K57q8j33K8K9J7j5L7M9%J33l29J75J16j57j35L47j44l39
$$ -138 -217 -41 -204 -220 -143 114 26 -107 -79 -50 -33 -48 -11 38 38 171 -158 17 133 -24 -159 188 44 -295
3084b95M54k85J91Q0J9k0k46k15K05J60P6j34J21J12J22n16R8J95pj64K93k7l89
$$ -295 159 -126 65 145 164 144 -102 -317 -112 48 124 -10 111 223 345 -171 -73 122 115 -49 244 217 -172
3107a72j3J00J5J24K44j07k04J96m0k07r5J24n2K51l41J67r0J91r7j34J41p2P8
$$ -172 -185 -85 -70 54 298 191 -13 183 143 -64 -159 -35 -87 164 -177 -10 -100 91 -6 -140 1 -71 7
3130GJ18j04j48R9L12k53j72J17R8k03L15j76l35K81q1O6j58J87RJ27Kj98m4J25
$$ 7 125 21 -127 -28 284 31 -141 -24 74 -129 186 10 -325 -44 -125 -59 -217 -30 -21 106 108 -90 -134 -9
3154ij31K17J09j88J67j54l0J01p3k8m8j7J49p1P2J03j7k15k9Q1K03o4j57j1K89
$$ -9 -140 77 186 -2 165 11 -19 82 9 -19 -67 -84 65 -6 66 169 152 -63 -92 -11 192 128 -29 -40 249
3179B49l52J13r4mL9j40J60J47n1l22J92K07l8m08K41J90k7j20m1m8M6J94M6j97
$$ 249 -103 10 -84 -88 -49 -189 -29 118 67 -255 -63 144 106 -302 -61 129 102 -18 -59 -107 -61 133 179 -18
3203a8r5J78O9j59j8l19K96K50k24j61M49l38l48L07j3J78j3j3J7J8K0JJ66l39
$$ -18 -113 65 134 -25 -43 -362 -66 184 -40 -201 248 -90 -438 -131 -144 34 21 8 25 43 63 64 230 -109
3227a09J71K25k38J73m82N87k45J53R3m67J36Q5PJ59j42l44R4L74k61J39lPJ06
$$ -109 62 287 49 222 -260 327 82 235 328 -139 -3 82 89 248 106 -238 -144 230 -31 108 105 112 218
3250B18J63o13L95Jrl17J40K7M8J81j34j38KK0K22r6j0J82oJ9l85K84l99l4L70
$$ 218 381 -232 163 164 155 -162 -22 5 53 234 100 -38 -36 -16 206 110 100 282 276 295 -90 194 -205 -239 131
3275A31k41qK20ok7J03j93j55J79q4L0N8L0P2j75K3p1J64k20j9M8L20j14k81L04
$$ 131 -110 -118 102 96 69 172 -21 -176 3 -81 -51 7 37 109 -66 -43 -114 50 -170 -189 -141 179 65 -216 88
3300H8k80J91l39M16l05L07n1J9rJ13o3J32k9k50J23k36K41j11R8n0n4k84M18
$$ 88 -192 -1 -340 76 -229 78 27 46 37 150 87 219 190 -60 63 -173 68 -43 55 5 -49 -333 85
3323H5l43L34p7K5j9l0j27k61N48k21J53J82o5m6l99L37k09R6Q8M8o8j13K02m71
$$ 85 -258 76 -1 24 5 -25 -152 -413 135 -86 67 249 184 138 -261 76 -133 -37 51 99 31 -82 120 -351
3347c51K71m0O1j68R3J03J5R9k06P0n8L57l3p1J08j17k15K51l68Q1J9k8N33k19
$$ -351 -80 -120 -59 -227 -134 -31 -16 83 -123 -53 -111 246 213 142 250 133 -82 169 -199 -118 -99 -127 406 187
3371A87j09j18J06p4p7K59l91K54J3L5o8j86J96L3L7L3r9n6j83J97k17M13q7r1
$$ 187 78 -40 66 -8 -85 174 -217 37 50 85 17 -169 27 60 97 130 31 -25 -208 -11 -228 185 98 7
3395Gp3j12K26k05k0L9J88J58k20m1k54K05J80m37M97l9J29k21J83m9j33M6k75
$$ 7 -66 -178 48 -157 -177 -138 50 208 -12 -53 -307 -102 78 -359 138 99 228 7 190 141 8 54 -221
3418b21P4N8n5m1J35J67p0J89j21J6PJ24k82l69O96j32k42K11p8K23l06J8L00
$$ -221 -147 -89 -144 -185 -50 117 47 236 115 131 138 262 -20 -389 307 175 -67 144 66 289 -17 1 301
3441C01k2m51J34M9j82M82n21K28j77J02p5p3K14q8j54j3M17k41m9K7J13L48l07
$$ 301 279 -172 -38 11 -171 311 -210 18 -159 -57 -132 -205 9 -79 -233 -246 171 -70 -119 -92 21 369 62
3464F2r1O5j31K6J26O2k3J06j98O9j94m5%J04J01J37p2J9R1l87J39qJ4j10K56
$$ 62 -29 36 -95 -69 57 119 96 202 4 73 -121 -166 -166 -62 39 176 104 123 214 -173 -34 -42 -28 -138 118
3489A18j63k7Q2k40m5J83M5O0l8J40k02R3M7N3o9q1L84k33j2k8N2P9j97K4J6o2
$$ 118 -45 -72 10 -230 -275 -92 -47 13 -25 115 -87 6 53 106 37 -44 340 107 95 67 119 198 1 25 41 -21
3515b1p5K26j11q8j98L64q9P4l55J25j3K66J7l84M2k4L45q7j82r0K03L58k75k17
$$ -21 -96 130 19 -69 -267 97 8 82 -273 -148 -161 105 122 -262 -220 -244 101 14 -168 -258 -55 303 28 -189
3539a89K19m3J11J3j15%k50j3K24K2J49j90K3N0r6J31J34jj90r0M48m66L54n8
$$ -189 30 -13 98 111 -4 -4 -254 -267 -43 -21 128 -62 -39 11 -85 46 180 179 -11 -101 347 -119 235 177
3563A77k01L72k60j24j63M62k67j73L07O3l09J82j1J8p1J4J61k61J55l02L34j14
$$ 177 -24 348 88 -36 -199 263 -4 -177 130 193 -116 66 55 73 2 16 177 -84 71 -231 103 -11
3585a1q0L37j62k48J64m4K64j28j13L9j55J98p8p2pn1J21K44l72L91m25L54j56
$$ -11 -91 246 84 -164 0 -44 220 92 -21 18 -137 61 -17 -89 -96 -147 -26 218 -154 237 -188 166 10
3608A0O8l96M03k6k89O0O7K80j76K5L8k96k5J7P8J72oP4m1q9K8j12K85j15r0o7
$$ 10 78 -318 85 59 -230 -170 -103 177 1 26 64 -232 -257 -240 -162 10 4 78 37 -52 -24 -136 149 34 -56 -123
3634a23QR3L4j26J82Q5Rk25J56j18j18J44j15K26k38K87j15k28J98p8j6K75r8
$$ -123 -115 -22 12 -114 68 153 162 -63 93 -25 -143 1 -114 112 -126 161 46 -182 16 -62 -78 197 99
3657I9l70K73l2j1Qj83J05J49q4J23N0Lj41K11k88LJ52n1j24n2K60o9j2j10M5
$$ 99 -271 2 -30 -41 -33 -216 -111 38 -46 77 127 130 -11 200 -88 -85 67 16 -108 -160 100 31 19 -91 -46
3682d6J62k78j44K34Q1q7L6N6J20j27m4K65l85K19j87K32K56l30n5r2K8P9K04
$$ -46 116 -162 -306 -72 9 -78 -42 14 134 7 -37 228 -157 62 -125 107 363 33 -22 -114 -86 -7 197
3705A97m88K21j47L52j15j54K94O9j94K71j29J6k05N7j64k14N67l60L26k19L3
$$ 197 -291 -70 -217 135 20 -134 160 229 35 306 177 193 -12 45 -119 -333 234 -126 200 -19 14
3726A4nL3MJ24k11J31o8J25k11J42j68kj33L02l0k99J47l7P2J0J41k71M95j79
$$ 14 9 42 46 170 -41 90 22 147 -64 78 -90 -92 -225 77 47 -252 -105 -142 -70 -60 81 -190 305 126
3750A26Kj06j97J58Jl05L64j43j5J8N1j58N11n76M14k41R4o7k1M6J96l6j7J84
$$ 126 128 22 -175 -17 -16 -321 43 -100 -115 -97 -46 -204 307 -269 145 -96 -2 -69 -90 -44 152 116 99 283
3774B83k49jm2j10K66k49q7P1J17m6K34l02L46Ok60j25J88k3l9K9q5q6L33%j70
$$ 283 34 33 -9 -119 147 -102 -189 -118 -1 -47 187 -115 231 237 -23 -148 40 17 -22 7 -78 -164 169 169 -1
3799aJ60k89j19O06k75j6j32n1J71Q9k59J1K45l51O2K93k90L28o9k39J32R7k44
$$ -1 159 -130 -249 357 82 66 -66 -117 54 143 -116 -105 140 -211 -149 144 -146 182 113 -126 6 103 -141
3822a41J5J63j44K5J41J59j08o1J4L16m98R4JK27k71L32o15M01l14O5N4J69J86
$$ -141 -126 37 -107 -82 59 218 110 49 63 379 -119 -25 -24 203 -68 264 -351 50 -264 -199 -145 24 210
3845B10o39O13l43k4N25m48R4J74j65J37q9L9L1j33N8J63n43K56K53L2Rrk12J48
$$ 210 -429 184 -159 -183 342 -106 -12 162 -3 134 45 84 115 -18 40 203 -340 -84 169 201 210 201 -11 137
3869A37L5k50oJ58m3l5k06L38L8p0k23j74J51L61j87K22q7j62J99j39j32J63k04
$$ 137 172 -78 -84 74 31 -4 -210 128 166 96 -127 -301 -150 211 24 246 159 -3 196 57 -75 88 -116
3892a16J85l66L11J88k77o3J22K42M9k17j84j33L62J53k25n8o8L4K20l41J61j55
$$ -116 69 -297 14 202 -75 -138 -16 226 275 58 -126 -259 103 256 31 -27 -95 -61 159 -182 -21 -176
3914a76L62q8J05k51L2j2j01J42o5L97k99J05j55J23K06l03l6p4N8Q4J45m10K49
$$ -176 186 98 203 -48 -16 -28 -129 13 -52 345 46 151 -4 119 325 22 -14 -88 -30 54 199 -211 38
3937C8j44J60J78j65L14l55J44J3j20j20L1J8P3j81K53k14l7lL85n7k60J83q8
$$ 38 -106 54 232 67 381 26 170 183 63 -57 -26 -8 65 -116 137 -77 -114 -117 268 211 -49 134 46
3960D6L60m71L05l92K14j22J93L36o24L88k46l11K73k07Q2J78r5J20J14n5k06
$$ 46 406 -65 240 -152 62 -60 133 469 -155 233 -13 -324 -51 -258 -176 2 -93 27 141 86 -120
3981a20M4N3k5m8R2J07l46L22l45L02k13K36j04J15L60m47K29k45J0K11l52M1
$$ -120 -76 -23 -48 -96 -4 103 -243 79 -266 36 -177 59 -45 70 430 -17 212 -33 -23 188 -164 -123
4003a23j02K01M9l3k1j00J81R3j7Q0P6l72J18j37j4L92k89k60N1K04k32M61n5
$$ -123 -225 -24 25 -8 -29 -129 52 145 128 208 284 -88 30 -107 -121 271 -18 -278 -227 -23 -255 206 151
4026A51m20K52j00K94k75K30k62K48j57K3p5K33l49J9N4J78J96j41j62O9J22j39
$$ 151 -269 -17 -117 177 -98 132 -130 118 -39 -16 -91 142 -207 -188 -134 44 240 99 -63 6 128 -11
4048a1j91O5J40J07j92J89l6K02n1k31J76Q9n38L72k7j07R3O5j91M9L7m9j00K69
$$ -11 -202 -137 3 110 -82 107 71 273 222 -9 167 256 -282 90 63 -44 49 114 -77 -28 9 -40 -140 129
4072A29k87o0J19J12j98J75L5m03K96kN5J0J46r9l59K14J63m60M91J19l35n3r6
$$ 129 -158 -218 -99 13 -185 -10 25 -378 -82 -84 -29 -19 127 28 -331 -117 46 -414 77 196 -139 -192 -288
4095b88R5J30J86j51Q0O3j38n8J70m1p2k16M34m5j26J36j51J09k8K7k99m9P9K14
$$ -288 -193 -63 123 -28 52 115 -23 -81 89 48 -24 -240 194 149 23 159 8 117 89 116 -183 -232 -153 61
4119F1j42N7l4L46m04J40k21K92L8lj58J11J32j4j16J4j35J11l21M07k50k7L06
$$ 61 -81 -24 -58 288 -116 24 -197 95 133 130 -28 83 215 201 85 99 -36 75 -246 161 -89 -116 190
4142A90k8k87K26k12j4L81l65K01k54j3R9l3O4J57k54n7L78nl88J76m3K97j96
$$ 190 162 -125 101 -111 -125 256 -109 92 -162 -175 -76 -109 -45 112 -142 -199 179 174 -214 -38 -81 216 20
4165B0k59K47n9L42n04J76Q3K6n0L0lk43j23K52j0J57J46k23J19N1j23k5q3M6
$$ 20 -239 8 -51 291 -213 -37 46 72 22 52 49 -194 -317 -65 -75 82 228 5 124 175 52 27 -56 -10
4189a0K35m64K78K74k10n04L48J03Pk9K9l07L99k19l2J52J07j5O9p8l39P5k0L25
$$ -10 225 -239 39 313 103 -401 -53 50 57 28 57 -250 149 -70 -102 50 157 142 211 133 -206 -131 -151 174
4213A74n00J72J94J10K49m02R7m0K77m65j2L91j43l51M26k03P8j94k44N09j53
$$ 174 -326 -154 40 150 399 -3 94 54 331 -134 -146 245 102 -249 177 -26 52 -142 -386 123 -30
4234c0N7j50J13L7J42n25M20l01M1K88j32K4l80Q3K63J18j45o2J5j15L96l09O5
$$ -30 27 -123 -10 27 169 -356 64 -237 -196 92 -40 -16 -396 -313 -50 68 -77 -139 -124 -239 157 -152 -87
4257h7J39j06K95R6l32J14k59M46k40k02J90P7j06j94l8L74m91L44o9K2K30j41
$$ -87 52 -54 241 337 5 119 -140 306 66 -136 54 131 25 -169 -207 167 -324 20 -49 -27 203 62
4279F2j6N4k6j27J0M98m39J60k83p0L03Q7j12k16J86j76l7m3M55m06n9Q8J35j7
$$ 62 46 100 74 -53 -43 455 16 176 -107 -177 126 213 101 -115 71 -105 -142 -185 270 -136 -195 -107 28 11
4303A1kl4M3L15n73J31L17j98j58J97PL1k22R7L63j94o9N5j51j42J10K16l69J42
$$ 11 9 -25 18 333 -240 -109 208 10 -148 49 56 87 -135 -38 325 131 62 117 -34 -176 -66 150 -219 -77
4327g7j8k35J70K59k29pK3N38n81J68n6j2j80J3J1R5J22R9l91K99k45K61j41K64
$$ -77 -95 -330 -160 99 -130 -137 -114 424 -157 11 -45 -57 -237 -224 -213 -118 4 103 -288 11 -234 27 -114 150
4351A50k16J41J9l64M76K7l65J11j0j6r1J02J61j24j1k3p5L7o4L7n7N10m10L73
$$ 150 -66 75 94 -270 206 233 -132 -21 -31 -47 -138 -36 125 1 -10 -33 -108 -71 -135 -98 -155 355 -55 318
$$ [...]
8191A82
##END NTUPLES=NMR FID
##END=
