##TITLE=1H_Pr NCS-2H
 200.13MHz, CDCl3,
 8 sc
 
 5.8.2025
##JCAMPDX= 6.0         $$ Bruker NMR JCAMP-DX V2.0
##DATA TYPE= NMR FID
##DATA CLASS= NTUPLES
##ORIGIN= UXNMR, Bruker Analytische Messtechnik GmbH
##OWNER= pz
$$ XWIN-NMR		Version 3.5
$$ Tue Aug  5 14:17:44 2025 Russian Standard Time (UT+4h)  she@DPX200
##.OBSERVE FREQUENCY= 200.1313
##.OBSERVE NUCLEUS= ^1H
##.DELAY= (6, 6)
##.ACQUISITION MODE= SIMULTANEOUS
##.ACQUISITION SCHEME= undefined
##.AVERAGES= 8
##.DIGITISER RES= 18
##SPECTROMETER/DATA SYSTEM= spect
##.PULSE SEQUENCE= zg30
##.SOLVENT NAME= CDCl3
##.SHIFT REFERENCE= (INTERNAL, CDCl3, 0, 14.3821)
##AUDIT TRAIL= $$ (NUMBER, WHEN, WHO, WHERE, WHAT)
$$ ##TITLE= Audit trail, XWIN-NMR		Version 3.5
$$ ##JCAMPDX= 5.01
$$ ##ORIGIN= Bruker BioSpin GmbH
$$ ##OWNER= she
$$ F:/spectra/data/she/nmr/H-C/1/audita.txt
$$ ##AUDIT TRAIL=  $$ (NUMBER, WHEN, WHO, WHERE, WHAT)
(   1,<2025-08-05 14:16:27.29 +0400>,<she>,<DPX200>,
      <created by zg, POWCHK disabled, PULCHK disabled
       configuration hash MD5:
       00 E9 B6 7A A2 85 ED C7 34 08 36 98 17 FE 4E 26
       data hash MD5: 16K
       B9 3B 75 B6 CC 0A 37 7E 6E A3 4E 3B 97 13 9B 76>)
$$ ##END=
$$ 
$$ hash MD5
$$ 3C AF 87 74 04 2D C6 22 22 26 B2 28 C8 C7 CE 95
##$RELAX= 
##$RELAX= 
##$RELAX= 
##$RELAX= 
##$RELAX= 
##$RELAX= 
$$ Bruker specific parameters
$$ --------------------------
##$DU= <F:/spectra>
##$EXPNO= 1
##$NAME= <H-C>
##$PROCNO= 1
##$TYPE= <nmr>
##$USER= <she>
##$AMP= (0..31)
100 100 100 100 100 100 100 100 100 100 100 100 100 100 100 100 100 100 
100 100 100 100 100 100 100 100 100 100 100 100 100 100 
##$AQSEQ= 0
##$AQ_mod= 1
##$AUNM= <au_zg>
##$AUTOPOS= <>
##$BF1= 200.13
##$BF2= 200.13
##$BF3= 200.13
##$BF4= 200.13
##$BF5= 200.13
##$BF6= 200.13
##$BF7= 200.13
##$BF8= 200.13
##$BYTORDA= 1
##$CFDGTYP= 0
##$CFRGTYP= 5
##$CHEMSTR= <none>
##$CNST= (0..31)
1 1 145 1 1 1 1 1 1 1 1 1 1 1 1 1 1 1 1 1 1 1 1 1 1 1 1 1 1 1 1 1 
##$CPDPRG= <>
##$CPDPRG1= <>
##$CPDPRG2= <>
##$CPDPRG3= <>
##$CPDPRG4= <mlev>
##$CPDPRG5= <mlev>
##$CPDPRG6= <mlev>
##$CPDPRG7= <mlev>
##$CPDPRG8= <mlev>
##$CPDPRGB= <>
##$CPDPRGT= <>
##$D= (0..31)
0 0.7 0 0 0 0 0 0 0 0 0 0.03 0 0 0 0 0 0 0 0 0 0 0 0 0 0 0 0 0 0 0 0 
##$DATE= 1754388986
##$DBL= (0..7)
120 120 120 120 120 120 120 120 
##$DBP= (0..7)
150 150 150 150 150 150 150 150 
##$DBP07= 0
##$DBPNAM0= <>
##$DBPNAM1= <>
##$DBPNAM2= <>
##$DBPNAM3= <>
##$DBPNAM4= <>
##$DBPNAM5= <>
##$DBPNAM6= <>
##$DBPNAM7= <>
##$DBPOAL= (0..7)
0.5 0.5 0.5 0.5 0.5 0.5 0.5 0.5 
##$DBPOFFS= (0..7)
0 0 0 0 0 0 0 0 
##$DE= 6
##$DECBNUC= <off>
##$DECIM= 32
##$DECNUC= <off>
##$DECSTAT= 4
##$DIGMOD= 1
##$DIGTYP= 9
##$DL= (0..7)
0 120 120 120 120 120 120 120 
##$DP= (0..7)
150 150 150 150 150 150 150 150 
##$DP07= 0
##$DPNAME0= <>
##$DPNAME1= <>
##$DPNAME2= <>
##$DPNAME3= <>
##$DPNAME4= <>
##$DPNAME5= <>
##$DPNAME6= <>
##$DPNAME7= <>
##$DPOAL= (0..7)
0.5 0.5 0.5 0.5 0.5 0.5 0.5 0.5 
##$DPOFFS= (0..7)
0 0 0 0 0 0 0 0 
##$DQDMODE= 0
##$DR= 18
##$DS= 0
##$DSLIST= <SSSSSSSSSSSSSSS>
$$ [...]
##$SUBNAM0= <"">
##$SUBNAM1= <"">
##$SUBNAM2= <"">
##$SUBNAM3= <"">
##$SUBNAM4= <"">
##$SUBNAM5= <"">
##$SUBNAM6= <"">
##$SUBNAM7= <"">
##$SUBNAM8= <"">
##$SUBNAM9= <"">
##$SW= 18.0517328524113
##$SWIBOX= (0..15)
0 0 2 0 0 0 0 0 0 0 0 0 0 0 0 0 
##$SW_h= 3612.71676300578
##$TD= 16384
##$TD0= 1
##$TE= 0
##$TE2= 300
##$TE3= 300
##$TEG= 300
##$TL= (0..7)
0 120 120 120 120 120 120 120 
##$TP= (0..7)
150 150 150 150 150 150 150 150 
##$TP07= 0
##$TPNAME0= <>
##$TPNAME1= <>
##$TPNAME2= <>
##$TPNAME3= <>
##$TPNAME4= <>
##$TPNAME5= <>
##$TPNAME6= <>
##$TPNAME7= <>
##$TPOAL= (0..7)
0.5 0.5 0.5 0.5 0.5 0.5 0.5 0.5 
##$TPOFFS= (0..7)
0 0 0 0 0 0 0 0 
##$TUNHIN= 0
##$TUNHOUT= 0
##$TUNXOUT= 0
##$USERA1= <user>
##$USERA2= <user>
##$USERA3= <user>
##$USERA4= <user>
##$USERA5= <user>
##$V9= 5
##$VALIST= <valist>
##$VCLIST= <CCCCCCCCCCCCCCC>
##$VD= 0
##$VDLIST= <DDDDDDDDDDDDDDD>
##$VPLIST= <PPPPPPPPPPPPPPP>
##$VTLIST= <TTTTTTTTTTTTTTT>
##$WBST= 1024
##$WBSW= 4
##$XGAIN= (0..3)
0 0 0 0 
##$XL= 0
##$YL= 0
##$YMAX_a= 599423
##$YMIN_a= -627217
##$ZGOPTNS= <>
##$ZL1= 120
##$ZL2= 120
##$ZL3= 120
##$ZL4= 120
##$ABSF1= 10
##$ABSF2= 0
##$ABSG= 5
##$ABSL= 3
##$ALPHA= 0
##$AQORDER= 0
##$ASSFAC= 0
##$ASSFACI= 0
##$ASSFACX= 0
##$ASSWID= 0
##$AUNMP= <proc_1d>
##$AZFE= 0.1
##$AZFW= 0.1
##$BCFW= 1
##$BC_mod= 2
##$BYTORDP= 1
##$COROFFS= 0
##$CY= -3
##$DATMOD= 1
##$DC= 2
##$DFILT= <>
##$DTYPP= 0
##$F1P= 0
##$F2P= 0
##$FCOR= 0.5
##$FTSIZE= 0
##$FT_mod= 4
##$GAMMA= 1
##$GB= 0.15
##$INTBC= 1
##$INTSCL= 1
##$ISEN= 128
##$LB= 0.25
##$LEV0= 0
##$LPBIN= 0
##$MAXI= 10000
##$MC2= 0
##$MEAN= 0
##$ME_mod= 0
##$MI= 1.114404
##$NCOEF= 0
##$NC_proc= 0
##$NLEV= 6
##$NOISF1= 3.799351
##$NOISF2= 2.8
##$NSP= 1
##$NTH_PI= 0
##$NZP= 0
##$OFFSET= 14.38212
##$PC= 1
##$PHC0= -1200.38
##$PHC1= 13.9923
##$PH_mod= 1
##$PKNL= yes
##$PPARMOD= 0
##$PSCAL= 0
##$PSIGN= 0
##$REVERSE= no
##$SF= 200.129724274929
##$SI= 16384
##$SIGF1= 3
##$SIGF2= 2
##$SINO= 400
##$SIOLD= 16384
##$SREGLST= <1H.CDCl3>
##$SSB= 0
##$STSI= 0
##$STSR= 0
##$SW_p= 3205.1282051282
##$SYMM= 0
##$S_DEV= 0
##$TDeff= 0
##$TDoff= 0
##$TI= <>
##$TILT= no
##$TM1= 0
##$TM2= 0
##$TOPLEV= 0
##$USERP1= <user>
##$USERP2= <user>
##$USERP3= <user>
##$USERP4= <user>
##$USERP5= <user>
##$WDW= 1
##$XDIM= 8192
##$YMAX_p= 0
##$YMIN_p= 0
$$ End of Bruker specific parameters
$$ ---------------------------------
##NTUPLES= NMR FID
##VAR_NAME=  TIME,          FID/REAL,        FID/IMAG
##SYMBOL=    X,             R,               I
##VAR_TYPE=  INDEPENDENT,   DEPENDENT,       DEPENDENT
##VAR_FORM=  AFFN,          ASDF,            ASDF
##VAR_DIM=   8192,          8192,            8192
##UNITS=     SECONDS,       ARBITRARY UNITS, ARBITRARY UNITS
##FACTOR=    0.0002768,     1,               1
##FIRST=     0,             0,               0
##LAST=      2.2672688,     0,               0
##MIN=       0,             -627217,         0
##MAX=       2.2672688,     599423,          0
$$ Real data points
##PAGE= N=1
##DATA TABLE= (X++(R..R)), XYDATA
0 0 0 0 0 0 0 0 0 0 0 0 0 0 8 -8 8 -8 14 -16 16 -24 24 -32 37 -41 48 -56 67 -77 88 -101 115 -131 149 -167
34 -167 189 -212 239 -264 296 -331 365 -406 450 -499 550 -606 669 -738 812 -895 986 -1087
52 -1087 1200 -1326 1466 -1628 1812 -2025 2276 -2576 2943 -3400 3993 -4791 5923 -7654 10607
67 10607 -16601 33500 -182933 -627217 -43411 491241 196153 -304173 -225658 107850 157138
78 157138 46126 27418 -122433 -228975 27776 326738 106499 -331293 -253800 231093
88 231093 296813 -121405 -281618 -28983 158400 101470 -13658 -64305 -91563 -11595 158586
99 158586 117542 -143247 -159080 105181 180567 -22759 -127305 4661 58858 -40349 5834
110 5834 106363 -34672 -171800 18558 219460 41822 -226753 -88702 203841 107446
120 107446 -135102 -63832 96335 14563 -84341 47846 122675 -100124 -197213 96006 236320
131 236320 -66264 -268160 -23042 225895 63483 -178742 -86499 87488 47902 -15142
141 -15142 12418 -15162 -74338 58 130338 49264 -145829 -84850 126372 102494 -79181
152 -79181 -98024 29412 64337 -14781 -20479 21228 -25304 -34499 56529 57910 -48623 -58648
164 -58648 54875 78344 -43386 -58264 70398 56852 -76329 -49714 83618 62573 -85093
175 -85093 -83543 69598 74172 -60915 -60855 31033 20857 -29440 5737 46284 -30307 -84185 41960
188 41960 119928 -27958 -133670 -7446 125163 43076 -104716 -67175 55676 45712 -16949
199 -16949 -21632 -26059 -26976 22095 62795 2009 -92439 -34470 104576 69662 -72297 -72603 43497
212 43497 81429 -619 -49802 -5232 16476 4638 24721 10561 -46749 -36489 41306 59306
224 59306 -29763 -76141 14980 71623 -1513 -46587 -973 31386 3995 -15788 16238 16594
236 16594 -32960 -15714 40329 14064 -41999 -28193 25124 22171 -32189 -25672 22035 2400
248 2400 -27752 3652 25672 -5814 -31409 4741 44108 1490 -38845 3714 32960 2903
260 2903 -17599 -2307 11289 -5894 -11460 17649 5981 -32336 -8234 33299 14478 -28883
272 -28883 -22650 30042 33536 -18943 -20194 18117 17875 -339 -2425 2603 -1859 -8330 11270 16204
286 16204 -23983 -27545 17752 23769 -15738 -34200 332 30903 166 -26246 -902 13350
298 13350 2829 307 1296 -948 -6848 1546 19384 -2369 -28314 -1819 22126 2664 -22444
311 -22444 -15823 14388 12244 -15253 -7561 8717 826 20 6944 5514 -2030 -4269 13473 16195
325 16195 -11195 -10467 13617 10656 -6446 -11847 1051 10376 -6522 -10765 5354 793 -6994 626
339 626 4733 1721 -5098 -736 12821 2191 -10051 4040 8894 -1824 -5678 -2033 5273 -2389
353 -2389 -12079 730 3860 -8952 -6601 824 1775 -1485 -6519 2329 6819 -3152 686 7190 220
368 220 -102 2974 5029 2869 -7615 -1122 10222 -1340 -9193 -2632 2332 4084 -3456 -7070 2640
383 2640 2484 612 4402 -1335 -1650 5721 5989 4347 -2593 -4945 6666 6706 -3989 -4630 -4531 -66 3832
400 3832 -4042 -7016 -5366 -2699 6678 2342 -10486 -4201 6105 7656 1624 -7254 -39 8918 979
415 979 -453 1298 -3073 -1642 -367 1586 1467 -9316 -7278 6833 4083 -4873 -5871 135 9332
430 9332 2759 -5932 3850 7253 793 43 1260 6473 3282 -7507 -1175 7073 747 -5813 -7022
445 -7022 -443 6167 -3703 -8139 1612 2339 -1223 -1798 886 7313 -464 -7866 5355 11243 -695
460 -695 -9401 -4651 10413 7666 -13372 -10627 6927 5333 -6302 -10012 1182 8239 -6091 -7754
474 -7754 9649 7235 -7075 -6412 8762 16106 -3822 -15990 6499 18025 -431 -14111 -5598
487 -5598 11841 6269 -12896 -6225 7430 -5 -6869 -1063 7372 2747 -12035 -2809 18666 8816
501 8816 -13256 -11656 10167 21593 -1714 -22480 -3724 15984 7571 -10378 -14276 1041 6852
514 6852 -4165 -2255 3143 -6599 -9119 5153 17570 4347 -23262 -11424 26852 22262 -15976
527 -15976 -26283 5026 29183 3829 -24922 -8439 11606 4339 -5414 -2696 1789 -6419 -9118
540 -9118 12391 17308 -11898 -20802 6803 27362 8766 -23897 -13076 20905 16822 -8965 -14759
553 -14759 -82 10339 242 -8351 927 166 -8912 -2604 7999 6701 -7586 -15202 5948 20934
567 20934 2041 -16348 -8135 13793 16880 -7286 -15773 2978 9176 -558 -5484 -1893 858 -7325
581 -7325 -4993 12598 6391 -17255 -13220 13635 22432 -4595 -25302 213 26414 9127 -14381
594 -14381 -10538 7301 11133 -1951 -4504 943 -6780 -5448 8638 8083 -7811 -17239 -1062 20786
608 20786 8135 -16904 -11775 9228 16785 3093 -12810 -5080 8526 6352 1293 -4117 -5479
621 -5479 -723 304 2123 2535 -7705 -9846 970 8709 5286 -8685 -12212 6276 14145 1785
635 1785 -7934 -5074 5851 8472 -381 -1739 -1183 -5180 912 8012 1913 -9731 -12755 4388 16042
650 16042 -1769 -16645 -5398 11038 12503 -3099 -11445 327 8773 6812 2264 -5851 -6191 3612
664 3612 7840 3698 -7895 -12500 2437 10869 926 -9439 -10131 2260 11620 2146 -8542 -5662
678 -5662 3066 11001 4693 -7545 -4498 4088 6910 3511 -5929 -5690 2270 2732 1186 -3027 -7300
693 -7300 -1176 4181 1514 -1328 -5268 -715 6909 2647 -1773 -14 1043 3552 2256 -934 1016
708 1016 -253 -2028 2094 124 -2475 -2023 -2435 811 1073 -3212 -1297 761 -155 2249 517 -1208
724 -1208 1664 1271 2030 2035 -2009 183 2203 -440 -281 -1928 -2282 1096 -889 -2558 -1012 -2116 147
741 147 1633 -1823 -113 1284 926 3066 249 -835 2982 2051 745 -183 -2350 893 1845 -2148
757 -2148 -2168 -2241 -1152 2462 -1484 -3893 -393 1168 2486 1123 -3250 826 3851 1821 1134 -1507
773 -1507 -695 3446 1554 -1292 -1938 -2743 1012 1644 -3260 -2713 -1370 159 2165 -1611 -2397 1571 1571
790 1571 2069 1288 -1684 1386 3097 359 716 -1027 -1712 1839 -456 -1914 -1395 -1976 471 218 -3198
807 -3198 -472 721 180 1592 -288 -377 2540 1087 1096 1861 -1008 892 1581 -949 -2 -1199 -1241 957
825 957 -1658 -2132 56 -1906 -757 623 -1305 447 218 344 2702 320 -999 2035 1206 800 763
842 763 -1238 122 19 -1651 527 -1169 -3363 -359 578 -172 -1014 -2448 1017 3339 -239 -41 207
859 207 450 2829 1630 -33 -17 -1479 1584 3255 -2703 -3318 -534 848 1263 -2661 -2801 664 100
876 100 565 2172 -1638 -1814 1780 3127 2808 -2010 -2888 4047 3996 -1785 -2294 -1462 730 756 -1947 -711
894 -711 -1485 -3352 1040 2876 -1088 -2878 -1604 3538 4562 -1836 -2126 1628 2282 3112 161 -3191
910 -3191 -704 943 1639 325 -4147 -2824 1788 504 -349 -1163 -2579 -44 2241 2969 1214 -4383
926 -4383 -1377 7281 4644 -3847 -4866 1522 6849 -406 -6433 -497 1912 -1676 -934 394 -76 -4065
942 -4065 -3132 6218 4982 -6452 -5250 5162 7828 -377 -7352 -161 6957 1227 -3428 -576 -122
957 -122 -677 -1118 570 1241 -3799 -4589 2961 3575 -1014 -3794 -2250 4391 5237 -1296 -2972 -204 3882
974 3882 4515 -2468 -4073 2067 2035 -1300 -2103 -451 1100 -3585 -3322 4882 2432 -6967 -3947 5844
990 5844 7505 -3528 -8656 4053 10326 -1880 -6473 1573 5680 -140 -5795 1296 5172 -4845
1004 -4845 -6618 4039 5344 -4176 -8279 1300 9177 -561 -8429 336 6874 2669 -2874 -2159 3448
1019 3448 2011 -2378 642 1564 -1619 -1522 -531 1014 875 -3541 -2756 1310 2289 1094 -3459 -3344 4708
1036 4708 4999 -2420 -3951 1836 5768 652 -5205 1239 5050 -2992 -4780 2203 3895 -3178 -7474
1051 -7474 1838 7691 -3682 -9045 2019 7972 236 -7071 -27 8356 663 -5951 1753 5512
1065 5512 -1062 -4043 630 5374 -1545 -7017 1137 4681 -1866 -4591 -626 2911 1292 -2950 -414
1080 -414 2910 120 326 1635 -131 486 1179 545 82 -1326 520 941 -2688 -1277 2009 -1367 -2939
1097 -2939 -614 2430 703 -4413 -743 5487 485 -4345 532 4618 1503 -3751 -797 5608 152
1112 152 -5553 540 4027 -1232 -4751 -999 4225 -566 -5855 848 4516 -1237 -3117 1498 3444
1127 3444 109 -3035 2069 4343 -1974 -2343 2353 1684 -1801 -2749 773 1677 -3284 -2262 2473 -592
1143 -592 -2700 -92 1888 590 -1953 185 4172 -164 -2455 2156 2673 -1030 -1245 774 1988 -1992
1159 -1992 -3150 2275 1083 -3573 -1443 1686 607 -2221 -1655 3244 2138 -2911 229 3733 505
1174 505 -1922 672 2986 213 -3552 337 3221 -2081 -3514 970 1616 -1286 -3312 183 3366
1189 3366 -2035 -2572 2967 2020 -1433 -777 2082 2883 -1615 -1969 3442 1466 -3125 -821 1691 -126
1205 -126 -2613 -1573 1919 -163 -3662 201 2549 -893 -1739 803 2357 521 -2153 1585 2889
1220 2889 -1409 -758 2037 893 -1503 -1794 1014 1519 -3004 -2057 2113 37 -2196 -534 1774 982
1236 982 -2009 -35 3509 179 -2077 1786 2563 -323 -1731 298 2603 -906 -3070 866 1543 -2393
1252 -2393 -1574 855 1233 -1553 -2445 1852 2164 -1975 -603 2461 1155 -843 -709 1990 1489 -2347
1268 -2347 -501 2122 -1017 -2296 -123 958 -290 -2441 -514 2151 -1030 -1783 1737 1409 -183
1283 -183 -300 1076 2056 -502 -1160 1922 1065 -1722 -382 410 300 -1523 -1530 1154 -217 -2539 245
1300 245 1457 -672 -881 226 1732 697 -1404 919 2432 -1021 -620 1158 943 -265 -1465 321
1316 321 1469 -2251 -1749 1043 -63 -1081 -1212 252 1358 -1195 -947 2158 870 -908 848 1176
1332 1176 872 -300 -883 1319 -23 -1558 6 226 -993 -749 -603 313 -192 -1210 561 899 -530
1349 -530 688 959 301 442 65 1021 678 -1085 136 1087 -828 -854 -387 -274 214 -1281 -1060 968
1367 968 -768 -833 677 239 361 59 -106 1590 809 -615 797 637 63 386 -443 -417 -137 -1287 -285
1386 -285 -488 -919 241 -483 -664 334 72 89 1083 280 889 766 -436 710 1203 -319 -331 -600 44
1405 44 616 -1822 -1305 110 -151 -654 -818 -523 729 -11 -566 1142 991 80 237 222 1488 556 -1610
1424 -1610 273 1090 -527 -1113 -1443 -180 783 -2047 -941 929 390 -326 -783 391 1767 -261 -1195
1441 -1195 1996 1539 -527 -860 377 1633 -54 -2086 26 1171 -663 -1448 -862 626 469 -1731
1457 -1731 -544 1614 126 -470 63 1131 1615 -485 -915 1690 1192 -428 -1191 -252 1193 18 -2465
1474 -2465 -579 784 -310 -1359 -1049 864 1650 -1732 -849 2218 1037 -890 -956 1242 2415 -1075
1490 -1075 -2376 1390 1776 -1001 -2055 -481 1718 -467 -3007 -9 1873 -774 -1486 67 1890
1505 1890 902 -1805 296 2845 461 -1141 -221 1380 1226 -1100 -1431 994 549 -1038 -801 -627 516
1522 516 -345 -1718 280 1327 -313 -415 -9 1280 1666 -962 -720 1712 791 -626 -967 139 1466
1539 1466 -1101 -2245 514 943 -1347 -1653 -32 1498 -76 -2188 947 2372 -330 -1161 759 2017
1555 2017 772 -1680 197 2166 -448 -1402 -23 485 -37 -1676 -754 1181 -35 -1551 449 1033
1571 1033 339 -534 -337 1300 712 -382 452 716 136 169 -345 -75 164 -526 -311 -581 -787 630 -354
1590 -354 -1084 699 399 -183 -184 -92 1325 846 -847 363 1561 -149 -783 23 752 272 -1744 -342
1608 -342 1075 -908 -1395 -233 611 141 -972 -184 1779 -12 -1101 806 1211 17 -309 76 1223
1625 1223 -90 -1539 502 796 -941 -675 -275 201 -372 -1332 438 650 -1107 -63 701 211 174 -21
1643 -21 490 772 -522 319 1050 -702 -539 -1 -108 -523 -1055 -379 544 -1114 -632 806 -77 -492 13
1662 13 746 813 -538 -154 1398 83 -865 262 565 -16 -682 -728 953 -153 -1690 147 527 -861
1680 -861 -833 54 715 295 -984 523 1377 -281 -48 872 406 267 -466 -4 560 -1228 -544 389 -479
1699 -479 -828 -466 58 168 -460 -487 1162 244 -301 908 780 81 -53 66 1060 68 -766 759 113
1718 113 -896 -378 -230 -26 -484 -1002 545 148 -925 106 570 118 -121 72 785 934 -754 272
1736 272 1070 -316 -616 25 -167 -110 -1024 -451 684 -761 -978 443 371 -141 -290 273 1019 169 -289
1755 -289 885 421 -296 350 533 -25 -394 -942 451 -96 -1351 -37 156 -366 -549 -556 539 173 -620
1774 -620 475 980 46 33 641 68 355 -371 191 435 -709 -576 221 -733 -683 -348 -160 348 -575 -374
1794 -374 1032 -297 -268 1032 747 205 83 229 1023 -172 -913 509 420 -595 -601 -336 311 -465 -1271
1813 -1271 533 711 -1084 -276 588 520 72 -368 762 963 -399 258 846 222 -257 -126 204 160 -757
1832 -757 -905 279 -494 -495 97 38 -127 101 151 542 108 -28 948 224 -452 403 576 181 -336 -989 410
1853 410 -194 -1241 -429 189 -324 -446 -277 721 41 -506 186 979 -23 179 6 667 795 -662 329
1872 329 911 -408 -293 256 -563 -111 -586 -149 343 -187 -480 355 -52 -279 357 396 430 92 230 776
1892 776 -321 -587 490 64 -711 -353 -332 403 -653 -799 564 423 -938 -87 662 500 -31 -323 917
1911 917 1037 -606 -190 699 161 -141 -886 -213 526 -836 -944 266 10 -126 -233 -426 343 284 -218
1930 -218 378 571 248 358 -367 298 829 -315 -200 312 107 185 -555 -784 439 -314 -973 -265 16 229
1950 229 -185 -519 660 457 -456 232 759 496 3 -595 292 642 -652 -865 -1 -114 -350 -842 -312
1969 -312 785 -304 -977 45 642 181 54 -208 1020 698 -476 67 538 473 -312 -821 372 598
1987 598 -1080 -870 271 97 -271 -913 -215 1050 -21 -647 743 910 29 -284 -145 1018 345 -879
2005 -879 282 615 -369 -256 -597 137 500 -1029 -267 326 -268 -98 -190 -63 718 3 -152 636 336 218
2025 218 -82 -124 704 678 -1041 -316 38 -16 -294 -839 -72 597 -708 -570 300 524 197 -474 342 1249
2045 1249 19 -699 576 804 -227 -715 -249 947 -119 -1193 346 511 -344 -520 -194 414 117
2062 117 -1024 94 1179 84 -96 402 270 463 -486 319 610 -246 -152 397 130 -279 -270 -484 248 -18
2082 -18 -371 202 119 -149 582 124 -64 251 498 606 -76 195 934 1 -550 236 359 -424 -702 -378 657
2103 657 -330 -1270 75 590 -122 -274 -187 959 541 -673 59 1267 42 -407 391 320 23 -622 -592
2122 -592 500 -407 -688 284 -40 -184 -469 133 470 17 -38 545 283 -144 516 292 129 58 -366 282
2142 282 -1 -765 120 -115 -635 -276 -40 296 -240 -735 858 682 -524 -184 810 392 163 -100 700
2161 700 386 -807 -331 670 8 -957 -585 -26 301 -1006 -167 810 -142 -461 390 295 155 20 93 909
2181 909 -55 -358 532 225 -199 202 -61 170 -495 -501 -58 -72 -810 2 341 -240 -54 -258 657 315 -512
2202 -512 433 865 -123 -64 399 272 -215 -512 77 752 -777 -622 209 245 -404 -365 114 635 -102 -558 860
2223 860 255 -230 32 490 530 -292 -494 701 -84 -852 15 74 -409 -448 -222 239 -116 -364 350 482 -256
2244 -256 127 556 346 124 -207 312 620 -378 45 279 -353 -461 -197 232 231 -906 -416 553 -210 -297 111
2265 111 295 96 -138 129 660 -141 -569 455 292 -629 -256 -260 223 -418 -734 443 269 -562 -39 80
2285 80 -26 105 23 781 228 -258 569 908 -313 -68 193 42 27 -511 -76 483 -693 -516 238 -44
2305 -44 -195 -468 226 589 -287 -407 527 288 105 260 63 360 39 -327 348 -15 -578 29 -55 -324 -281
2326 -281 -459 353 372 -305 260 120 -432 35 319 204 162 -287 347 420 -465 59 357 -71 -96 45 6 148
2348 148 -574 -405 402 -360 -431 13 244 425 -203 -171 809 48 -429 253 -111 -142 106 -268 148 -138 -615
2369 -615 -153 66 -424 125 -91 -139 -20 -179 222 274 -388 422 26 -224 383 239 -15 193 -620 52 349
2390 349 -847 -509 104 -195 -217 18 232 512 -312 71 295 402 -180 273 263 251 -173 -415 546 127 -393
2411 -393 -182 -245 29 1 -520 -87 31 -530 137 210 -6 306 -220 152 246 216 281 187 186 599 36 -528 -91
2434 -91 -1 -403 -154 -123 -52 -34 -389 -21 399 -196 -401 -145 184 500 -423 -108 722 95 -116 -497 -221 547
2456 547 -192 -641 259 100 -486 -143 36 142 223 -448 -147 549 20 162 505 350 449 37 -144 242 162
2477 162 -189 157 -277 -20 -282 -490 94 -164 -182 27 -71 193 435 -215 336 416 309 -63 114 251 496
2498 496 -341 -241 390 -74 -298 -160 -367 -70 -159 -368 169 59 -19 166 -168 289 124 -187 281 264 -24
2519 -24 14 34 50 415 -303 54 161 -351 -64 -395 65 200 -133 -332 52 91 -327 -35 34 553 369 -189
2541 -189 -82 543 -165 -148 71 -71 -85 -543 -118 187 -60 41 -192 226 29 -257 -168 445 208 -78 165
2562 165 189 127 22 -383 262 -28 -56 44 -258 -347 386 -164 -394 -113 -349 157 -133 44 396 9 -307
2583 -307 362 396 -117 23 -121 354 476 -507 -111 4 -67 -422 -424 -58 27 -384 -33 491 -64 -446 231 293
2605 293 396 162 -89 369 115 -362 340 270 -26 150 -23 -20 -69 -637 98 220 -157 125 -28 175 478
2626 478 -24 218 339 -77 365 254 -64 -83 -45 182 -175 -229 -142 128 -448 -334 347 48 -39 -402 177 446
2648 446 -233 -128 704 410 8 -323 122 452 -94 -437 354 -69 -269 -39 39 -187 -132 -241 214 218 -411
2669 -411 280 424 136 -30 -229 324 200 -62 133 292 -56 24 -47 -290 -186 -378 -75 271 -240 -284 485
2690 485 -41 -69 100 361 57 -276 -185 585 83 -190 71 160 -219 -318 -217 116 -60 -458 13 136 -453
2711 -453 -67 145 284 173 -330 257 264 -44 215 381 63 80 -20 0 -42 -557 -512 147 -436 23 274 -179
2733 -179 -251 -125 233 644 -33 -155 305 142 35 -29 144 180 -106 -169 349 -290 -373 -255 8 -85 -147 -398
2755 -398 393 124 -399 251 308 -9 132 250 -17 217 -120 51 419 -339 -83 184 -75 -97 -179 -186 50 -398
2777 -398 -160 150 11 -202 377 343 18 -14 -57 283 77 -238 83 290 -202 -169 86 120 -325 -579 -66 69
2799 69 -294 152 -86 548 -30 -176 249 189 178 201 242 86 50 17 214 17 -236 42 15 -135 -124 -236 78
2822 78 54 -496 -131 500 -348 -52 106 -47 58 256 98 323 -376 -74 174 -223 -344 223 -154 -8 -277
2843 -277 -402 390 215 -390 81 496 100 -304 175 444 130 -528 -84 363 0 -307 -122 290 63 -491
2863 -491 -262 -80 -119 -222 208 41 -71 -11 -56 306 -207 41 429 389 -58 299 -84 -122 152 134 239 -234
2885 -234 -142 178 -67 -204 -285 -53 162 -83 -528 434 613 -442 24 258 176 -102 -203 240 79 -336 -237
2906 -237 244 -201 -256 -149 -128 345 -310 -213 250 -60 98 68 471 -131 96 -54 233 308 76 146 -150 -252
2928 -252 124 -258 -298 -204 -186 99 -17 -99 349 195 -175 45 -71 4 -118 40 400 336 -83 -59 -52 -71 -89 -560
2952 -560 102 23 -466 -160 69 -103 -12 -170 -15 309 -145 -118 160 124 -312 -17 72 120 -39 -310 -199 51
2974 51 16 -90 -175 -113 130 -280 -146 46 -45 120 222 -76 318 -37 93 205 63 303 109 -177 -132 -78
2996 -78 -231 -273 32 130 40 105 -33 125 59 -49 162 121 189 -212 261 307 149 -371 82 -1 -110 -302 -207 95
3020 95 -17 -295 -113 79 -71 265 90 -207 51 89 93 432 110 233 -357 56 137 107 11 -186 93 -51
3042 -51 107 -557 68 -62 -17 -124 -9 56 30 -97 -147 348 -85 -77 139 115 153 9 -275 317 -483 -100 -151
3065 -151 -132 -6 117 -116 -91 224 -240 187 80 43 -89 -123 10 176 -188 -94 54 33 47 -87 -204 157
3087 157 228 -200 -24 -10 38 21 -55 157 53 219 83 119 -77 -10 -72 178 349 86 -100 -31 -201 -290 34
3110 34 -277 240 -19 66 12 -106 23 218 19 199 225 -135 34 79 -52 -28 -195 -352 -97 86 -70 -161
3132 -161 -128 40 -193 -232 234 155 89 -95 -32 -49 -109 -52 238 65 -93 100 -3 -146 220 -70 204 178 -222
3155 -222 -189 -38 13 213 -76 -54 272 -200 70 234 172 173 27 -350 144 307 -26 208 -270 20 201 -438
3177 -438 -179 48 -215 -389 -216 -118 275 -82 -114 204 93 -36 31 -17 46 81 -280 309 218 -13 -80 -17 -111
3200 -111 251 -257 -10 180 81 -97 350 -84 40 443 133 258 148 -179 274 -116 -50 -145 -298 221 31
3221 31 -418 37 -151 150 242 127 -63 28 -103 188 19 -75 234 123 -82 183 71 64 -306 0 6 245 49
3244 49 -77 -12 -317 -165 14 -31 -29 -39 25 403 -216 142 15 101 183 -79 -26 328 -158 106 216 -331 -20
3267 -20 91 -153 204 -134 -19 368 -170 -173 77 195 -61 371 86 143 101 -90 18 -102 -46 80 -56 -193
3289 -193 -56 -181 -211 339 -87 66 -36 -154 161 16 -126 90 -28 -48 105 -10 -23 -177 -215 -6 -69 -316
3311 -316 -82 -128 -454 -50 -160 -29 -60 -17 130 43 -144 -8 160 -136 66 51 -11 127 -134 292 -77 -366
3333 -366 -43 -133 -420 -142 168 -95 308 -187 359 199 17 -122 170 126 -121 -133 -167 265 123 91 411 -74
3355 -74 -37 -127 -256 15 33 -176 44 30 -34 422 189 129 182 5 -30 8 148 -43 97 -111 -82 -17 11 -115
3379 -115 -59 -75 148 -172 207 392 77 -197 0 127 131 -5 -225 392 86 -20 77 -254 332 -126 -140 133
3401 133 -50 -227 -56 59 52 -27 -185 161 -159 -251 138 128 78 352 91 150 -86 -248 -75 171 -176 -23
3423 -23 263 -96 99 -25 -17 105 319 -30 282 46 231 331 39 297 148 -384 -75 -20 -418 -91 -31 -276
3445 -276 59 9 406 -56 -389 -96 286 -1 156 113 254 -49 88 134 416 89 91 30 -204 186 -212 -3
3467 -3 -181 -179 -179 -11 31 -33 -25 45 -30 -89 12 108 76 208 99 229 315 -46 79 215 -180 -83 83 -161 220 87
3493 87 -56 -133 49 -254 29 -222 -82 -45 -41 -101 210 -8 318 -20 -321 9 149 107 34 -43 -159 -163 -82 184
3517 184 393 -150 65 11 61 177 280 163 -144 216 82 252 -99 -88 153 -240 -55 70 -217 -79 -2
3538 -2 -100 109 22 137 119 202 114 273 123 249 162 -333 212 -1 120 101 -78 150 202 -173 -328 111 84 0
3562 0 -37 107 76 -39 28 5 98 112 36 -253 -71 225 109 99 -25 -117 108 -123 -210 -50 -27 -63 83 -130 -12
3587 -12 61 -135 -51 -71 -356 -2 211 -102 -188 51 133 -44 -54 13 -58 -72 -90 -129 -15 25 -25 -79 221 -185 429
3612 429 107 -156 268 114 31 -23 -23 31 85 -518 80 -84 -104 -34 -478 -141 -188 51 -168 54 97 26 -148 405
3636 405 195 356 -50 58 72 -297 -175 -101 -120 -80 -32 -155 -232 161 -62 -57 -117 300 -211 389 261 -85 258
3659 258 -110 86 219 2 -27 26 -155 -56 -89 -53 -128 72 -72 93 0 -196 5 5 -60 227 -289 -99 -30 -7
3683 -7 157 -170 56 400 12 -43 76 -177 130 -277 -60 59 -105 -224 155 -44 -291 55 106 -148 75
3704 75 64 149 -199 84 -249 189 -247 32 -166 -24 -30 -22 -233 77 -192 219 -88 82 99 189 298 -163 -143
3727 -143 -106 310 -36 -56 -296 -125 42 152 -28 -205 -122 -50 -21 54 24 161 -84 -9 128 33 132 -89 96
3750 96 59 -271 -226 90 -35 107 -57 -255 37 126 -107 -383 -232 -16 151 -3 263 13 13 -19 -43 48 -243
3773 -243 -69 -275 -150 -94 129 -138 -3 -267 -137 -162 -20 -201 159 -122 -13 -62 4 78 -2 89 -81 174
3795 174 -165 12 -99 -289 -228 25 -68 -73 8 38 -194 141 -217 80 36 48 96 358 -296 72 119 96 -29 236
3819 236 -2 -45 180 95 -8 -222 -76 -1 -194 -248 51 -198 -102 167 43 241 -116 -15 148 19 117 269
3841 269 118 93 -24 58 -70 -180 -67 -170 136 -286 132 150 106 -72 -74 306 -4 -77 102 29 -312 -383 28
3864 28 91 186 100 -159 133 34 -106 29 149 -216 -130 118 46 -149 -147 204 -335 177 -42 -35 -77 -97 -8 -10 208
3889 208 205 -128 -132 -75 70 -78 331 -159 -1 10 -94 78 -22 -48 370 -65 156 -68 -184 129 78 289 -189
3912 -189 172 -31 107 114 -169 64 -54 110 -21 -71 -7 -31 207 106 -38 -48 192 -13 307 -248 -28 -13
3934 -13 122 -164 -96 -96 -40 129 114 -18 100 64 155 149 223 175 235 119 -23 -91 132 333 -100 -85 -21 -175 -45
3959 -45 24 -173 100 37 0 -199 98 155 121 48 -55 180 264 -99 248 -64 105 188 -115 -64 -53 -89 279 -79
3983 -79 -260 72 -37 -5 146 -311 268 112 163 20 -45 -42 89 -263 -220 -24 55 102 27 -47 8 131 48 4 -34
4008 -34 -201 -42 -251 70 234 12 -22 -25 104 -169 -111 -93 98 -24 318 147 143 -148 11 9 -173 100 -140
4031 -140 -42 247 -163 -139 160 328 352 116 -95 -138 -20 73 -25 -14 -207 75 26 -211 24 -168 195 -84 150
4054 150 -172 -39 34 -138 154 300 -78 -41 -211 57 -172 72 -5 186 -134 69 -60 17 216 -17 175
4075 175 126 115 -99 35 172 153 349 90 -50 103 -115 -11 75 -10 15 81 -217 -219 -57 16 -96 33 -154
4098 -154 17 1 -214 -111 -76 73 -182 205 98 -213 95 207 -83 15 -169 79 -231 288 -144 -41 -166
4119 -166 33 159 29 -102 200 -253 -141 16 79 29 -7 -17 -246 130 -103 -124 -48 17 27 177 -45 -124 77
4142 77 214 54 -42 -86 208 -172 55 -175 64 37 -218 -225 -333 316 184 11 -136 -35 34 -33 -69 -266 -140
4165 -140 170 69 -218 -54 -125 169 170 126 20 121 240 -202 -387 45 30 -140 -151 24 -178 46 -87 160
4187 160 196 -250 34 -139 96 86 44 16 42 -30 148 86 -159 186 53 92 329 154 61 228 96 -95 -69
4210 -69 -96 -73 58 -108 -81 268 -29 171 -22 76 240 103 -132 156 -29 -187 -133 33 78 134 -55 -423 109
4233 109 25 -269 -111 -69 168 215 53 -48 152 93 -319 18 -86 -208 -68 35 -66 -105 -442 -224 -188 -61
4255 -61 145 -181 -7 51 -133 50 -15 160 -130 38 210 -267 33 124 48 -63 -177 10 -77 176 -138 -75
4277 -75 -16 272 -84 77 99 -44 -28 -123 -27 -109 3 -233 181 -107 -173 -155 -210 9 -45 157 21 -7 -42 -77 -93
4302 -93 -42 -70 -97 39 168 -109 169 189 137 -34 -121 89 38 -211 1 234 -240 100 142 79 -31 250 16
4325 16 -168 204 137 13 31 -65 -235 63 -181 -73 -74 69 -214 -83 4 -69 -133 166 -94 -111 -35 -132 74 100
4349 100 -266 -79 255 -95 136 -195 -103 47 -9 24 41 -180 -80 -13 120 -101 115 89 4 109 -166 15
4371 15 -52 28 -112 214 41 -66 -100 12 34 197 126 85 185 14 -220 -156 146 220 256 285 251 -186 -120 158
4395 158 46 66 -86 116 -223 248 72 33 174 0 337 -24 -30 96 0 142 -122 -129 -18 122 -39 19 -311
4418 -311 153 -29 116 55 74 160 170 -72 -96 77 -49 291 -140 131 -100 -71 170 -64 -86 -55 33 134 -14
4441 -14 -41 36 -39 0 -42 -288 -152 -197 -177 -57 245 79 173 -12 16 -57 116 -239 -357 88 -357 122 -166 -318
4465 -318 -334 91 -34 -28 -168 197 41 135 49 22 -49 -33 51 -82 -125 12 169 121 23 -223 -28 22 -122 30
4489 30 73 80 23 203 100 28 282 -244 125 -21 54 25 80 -52 -83 57 174 155 -387 27 -158 -96 87 -93
4513 -93 -99 -55 -49 -98 185 -266 60 -100 -76 -73 83 208 16 21 -33 79 231 -99 62 116 90 11 113 -127 12
4538 12 -150 -151 112 -46 -110 402 85 59 -124 76 98 -66 310 -225 -23 288 -127 -26 -2 -121 -188 177 -45
4561 -45 -112 167 -209 1 -193 -71 -43 -62 52 201 176 -19 -168 62 258 56 -19 -48 10 -9 375 103 -15
4584 -15 215 -186 158 -178 -172 59 -148 -15 241 172 98 56 -108 127 75 -54 -190 67 -150 63 -102 -221
4606 -221 -208 -123 62 162 -8 -227 -98 -244 -429 -98 -40 244 96 -124 -16 133 -40 126 -50 -151 -137
4627 -137 125 -14 -16 142 -135 3 131 -200 9 385 108 71 -149 228 -141 -18 -282 172 99 56 -83 66
4649 66 76 203 -26 -24 -250 -178 94 166 -13 207 213 -275 -43 -27 27 103 49 -178 -45 -71 -88 -8 31 135 -27
4674 -27 2 30 123 -197 -237 24 317 -82 20 92 28 118 -86 -21 -86 -85 80 -338 -193 -297 -131 -26 -92 -130 7
4699 7 -235 138 109 -39 81 -95 57 -116 209 -80 -98 -113 -127 -295 165 -139 -151 115 -154 -30 48 -424 23
4722 23 -119 -81 -282 -125 130 -23 -110 -164 145 -276 -9 177 0 0 -199 209 -20 268 -13 -159 -192 -84
4744 -84 74 -165 90 98 239 -270 -65 -98 -251 -220 136 -184 -67 -80 -445 -36 75 95 -40 204 104 -213
4766 -213 -34 -20 86 -98 -278 28 -79 29 -15 21 129 -97 -61 72 -94 0 34 184 104 264 -271 -120
4788 -120 138 -216 -14 10 -61 -87 110 42 -23 174 -57 -359 330 -16 -69 -232 -106 205 -126 71 297 -93
4810 -93 214 113 -7 -83 -70 -323 14 82 -103 66 95 27 -66 14 -11 -158 70 -89 -113 -64 -229 -15 -38 72
4834 72 -109 22 -228 -56 51 192 14 -183 -201 -60 132 139 69 -129 94 -178 116 198 7 -196 278 84
4856 84 -161 -203 -213 46 240 84 -45 -168 69 104 257 -70 181 18 214 108 -6 59 -129 -122 171 68
4878 68 -13 25 -44 38 175 -11 -262 34 -337 126 80 -225 117 -34 59 23 103 -70 79 -34 -34 121 286 8
4902 8 -92 -108 276 94 -30 318 127 -13 -17 130 -61 -162 -118 -4 5 210 82 203 -128 -60 -222 -211 -232 195
4926 195 6 -298 40 -134 -74 52 111 -53 -157 -72 173 140 -158 -38 -99 -65 -29 167 -39 -132 117 -323 265
4949 265 -117 -151 -8 240 -197 -25 117 -83 281 -192 -14 210 -16 63 25 123 -46 70 -28 -115 -8 79
4971 79 -51 -28 118 58 34 -20 152 -39 232 -105 194 13 -27 -427 -12 -151 -33 114 25 44 103 142 208 85
4995 85 134 72 -173 -152 132 -63 83 -270 56 79 -17 86 -156 -226 50 19 -2 -280 -189 -54 -22 -8 170 -117
5019 -117 43 251 209 -33 -159 -171 -12 74 19 -277 -143 124 -160 210 33 1 -185 -74 67 18 -196 7
5041 7 246 23 231 190 -72 176 -146 -16 -180 66 -91 -92 95 171 -60 -326 -73 6 16 29 -92 298 162
5064 162 115 130 88 -22 -324 -29 -212 -232 -156 25 214 -78 -96 -347 -359 -124 -159 177 -100 51 158 52 40
5087 40 75 127 131 95 38 -58 291 -126 -223 193 1 -139 -73 -130 207 -243 163 -72 97 110 29 203 74 421
5111 421 -181 -101 140 -84 -106 125 121 -13 -66 -10 -106 52 -27 16 27 121 -149 -9 -170 -117 144 -46 106 94
5135 94 81 -184 103 -33 -227 -292 20 -152 -50 -307 -396 -236 -39 -92 48 -69 -1 -204 -84 -29 -222 156
5157 156 15 -34 -7 -40 101 -112 83 30 162 -30 53 8 106 -195 49 -163 156 291 -39 -116 -70 280 103
5180 103 -39 12 283 -137 -140 201 -137 30 266 107 -217 -153 -212 104 90 146 -144 193 133 -149 -242 44 159
5203 159 -31 -51 191 -141 -51 21 156 -87 -233 -16 -115 137 39 -295 0 89 113 -169 -23 -270 -88 47
5225 47 -45 -46 193 -31 115 -93 20 250 83 186 -313 68 48 -169 230 176 119 136 143 -95 100 246 -217
5248 -217 16 65 128 36 -62 20 -193 5 -137 -100 -63 41 213 144 -63 61 -298 25 53 -494 113 -102 -12
5271 -12 -273 -286 218 159 -19 -134 177 -81 216 20 127 -284 14 -186 390 18 -30 32 114 20 72 251 -2
5294 -2 117 -39 -72 -212 2 46 -250 -30 -52 108 -9 -187 -24 -172 145 -209 116 40 26 -22 -130 -9 -90
5317 -90 117 4 -15 -140 6 -110 -55 -59 190 253 -138 172 38 42 -3 40 3 237 -112 135 111 -94 -181 72
5341 72 -191 -100 19 119 -88 -220 -96 260 234 -112 113 -167 -492 25 66 -68 231 109 48 -222 -163 5
5363 5 158 44 -57 117 180 -100 -179 -10 -182 -9 46 -161 113 -31 201 -228 -137 -322 51 130 26 -15 -84
5386 -84 193 75 49 -115 99 48 -149 103 -159 -257 -33 80 101 -85 49 -203 -136 -115 64 -162 177 71
5408 71 129 -227 148 233 -217 81 -136 54 -190 -12 281 -64 17 -3 41 -39 134 2 -39 -49 -24 -19 261 110
5432 110 145 -156 -116 -122 60 -110 -25 -181 -259 -42 -57 93 -166 -17 -208 -176 52 95 31 -121 -150 115 -242 -94
5456 -94 -4 141 -168 -86 16 -13 -373 272 -32 -60 78 -64 -10 4 -241 -25 -131 -11 -79 -19 467 110 -35
5479 -35 -19 -28 34 2 -99 182 254 107 78 29 39 119 -209 137 -164 100 169 59 -224 251 298 33 95 -69 75
5504 75 -160 120 141 -12 91 -37 -108 55 -120 71 -101 -72 -124 -48 222 -78 79 -390 71 -29 -250 -90
5526 -90 185 -71 37 -29 -133 20 -221 -133 22 217 -159 462 -155 -125 152 -66 158 -170 -239 -18 -7 288
5548 288 -55 -43 -262 -237 278 189 141 -271 36 21 51 243 113 -159 -56 22 -75 -251 240 -120 1 -133 43
5571 43 153 -27 -261 120 -86 41 -33 -70 -71 -187 -103 81 94 25 32 139 65 191 97 12 109 -38 21 20 -271 14
5597 14 79 -161 57 149 29 136 -111 -57 31 -175 272 -185 -115 -124 109 141 -144 22 -43 146 -50 102 92 -100
5621 -100 36 268 -45 -185 55 30 -42 -117 97 -4 235 56 -273 20 91 307 -66 -184 5 -83 -277 -188
5643 -188 113 -9 122 -38 -75 -130 -15 67 -28 -83 119 -192 -52 95 19 -167 26 -45 90 133 300 87 47
5666 47 51 -20 -45 171 146 -326 148 -66 9 -95 14 -50 -22 302 -37 -154 -6 141 132 -87 -66 -128 11 39 -141
5691 -141 176 121 -132 -125 99 -153 -101 -226 -46 -129 -164 191 69 34 174 22 74 -47 -28 -84 -14 -221 -86 445
5715 445 -227 -6 -323 100 -27 -78 -100 -107 211 169 -29 21 -147 58 -232 -67 -180 -35 320 -141 -24 -116
5737 -116 101 -101 111 -351 399 159 82 -26 -30 -31 76 208 212 145 36 -114 -23 19 -281 -30 -219 -31 124
5760 124 -41 27 -35 -77 128 38 320 64 -25 84 -60 48 208 93 -438 10 -133 152 72 -141 172 127
5782 127 201 175 188 -76 69 -16 6 60 166 -195 -241 70 -184 502 -75 123 -30 85 170 60 -144 -165 52
5805 52 67 101 -78 -351 52 22 35 22 -153 47 16 -105 -3 -120 -40 72 139 131 13 -226 -9 145 -24 177
5829 177 -80 -87 96 -1 -60 -126 130 -101 180 89 181 -192 -68 48 -15 102 238 -243 -77 -71 -264 -210 -160 -340
5853 -340 -17 2 118 -214 -36 -126 170 -10 -239 -185 -105 130 -35 114 99 19 -30 64 295 228 1 -171 145
5876 145 351 -22 -2 -21 148 6 236 130 -15 471 -57 -37 50 151 120 43 132 -310 256 -133 -141 133 -59
5899 -59 85 -171 -135 -105 75 -176 -36 -93 338 67 0 -64 -239 -103 -149 172 -379 -85 -207 -144 58 61 90 231
5923 231 44 -58 54 -39 -116 83 -102 271 91 98 -17 -16 -39 223 -58 -25 159 -10 234 262 -55 182 -86
5946 -86 49 -77 -9 22 11 45 -12 228 -50 -4 161 23 91 -119 76 -209 120 -119 16 -147 -259 163 61
5969 61 182 -24 74 -28 -78 -97 253 -15 -32 -11 166 -41 174 383 -54 447 -183 -207 -263 -254 -88 -215 -31
5992 -31 171 40 -33 109 53 -9 14 -88 -24 -209 156 -182 -73 -4 -35 -262 84 260 -68 -8 -103 83 287
6015 287 -129 -253 144 -398 -136 165 -181 102 171 22 40 -49 41 51 -141 -48 -181 -167 -46 8 13 224 20
6038 20 118 25 64 -124 179 -299 11 132 -64 -12 -213 129 47 -197 -215 -106 -43 -58 294 178 23 -75 109
6061 109 25 -97 63 -137 40 83 132 -102 81 126 -84 351 246 -28 -40 -262 33 -28 150 -147 51 115
6083 115 -215 136 -4 7 124 -125 12 -199 162 100 75 12 92 69 243 -166 -24 10 -117 -168 67 -23 -27 -167
6107 -167 152 -45 -118 -306 161 227 23 17 167 -38 -351 -153 -7 -445 201 -36 -140 -261 -126 -214 -152 -16
6129 -16 236 -50 22 22 403 2 25 336 -109 90 -170 -13 91 -26 132 -69 14 -52 -24 155 -46 58 130
6152 130 37 62 188 169 10 -164 369 -191 143 267 -9 3 3 -62 -17 -204 -160 -227 -29 -15 201 16 18 -245
6176 -245 -160 94 35 -217 -190 29 -8 -22 -36 -158 73 -13 77 64 -134 -150 90 -115 76 227 -42 82 65 -30
6200 -30 -70 85 200 429 -96 -146 161 38 -238 1 219 -109 43 -370 167 229 18 201 57 276 130
6221 130 40 -81 -161 -59 -189 150 -28 -137 -51 -12 46 -7 9 -233 54 -146 165 -55 99 178 -114 19 107
6244 107 -155 -102 88 -241 -30 8 -61 -58 27 -57 -190 -121 -29 -13 -122 414 42 -245 63 -282 191 -243 -55
6267 -55 -221 169 -108 -24 -30 -206 -90 -109 -44 -116 10 -11 -35 -60 -28 -390 151 27 55 -51 -29 84 109 -107 139
6292 139 110 -251 -39 197 -213 -292 -221 150 -114 29 -220 150 146 -13 207 232 276 137 286 224 260 -13 -16 -215
6316 -215 -157 118 -87 5 -102 162 -106 4 -20 268 159 -126 88 37 -113 -114 -71 13 177 99 113 -54 -195
6339 -195 78 7 -103 -58 249 21 11 -29 137 210 -72 -152 14 105 -222 -150 -100 93 140 96 -88 -75 5 -96
6363 -96 -281 -135 -44 -67 -225 -13 -77 -127 -114 -169 39 168 248 -216 60 -164 -42 326 -194 35 -178 -105 -26
6386 -26 152 133 -17 53 43 -82 -44 5 -85 -132 -105 375 -5 94 -99 73 96 -12 -9 130 205 -82 119 40 -58
6411 -58 90 95 -143 37 -202 187 250 -178 -70 -101 -237 -4 102 185 267 142 -56 222 -216 -179 -20 -271 -147
6434 -147 -129 -49 -51 1 -221 308 185 -24 175 -43 168 -16 -363 -43 143 214 -387 -24 -174 185 -142 -290
6456 -290 -171 125 -20 54 105 -117 171 190 42 37 -177 291 -68 -297 53 -277 -373 120 77 -66 76 -251
6478 -251 -177 -87 -70 109 267 127 189 62 53 51 -106 -70 -72 69 221 65 129 65 -240 65 43 -109 59 -3 55
6503 55 -15 -25 -165 138 105 162 -169 31 50 258 -1 93 24 -59 -74 -89 98 61 263 -43 -76 188 262 104 -74
6528 -74 -93 -126 205 49 345 163 66 -131 -59 4 -201 -74 -285 -148 111 -17 156 -338 175 39 -19 111
6550 111 -338 -177 155 30 310 -4 64 -60 7 248 -90 69 197 66 96 -86 -110 145 -89 288 280 -9
6572 -9 -118 40 -191 -172 -151 9 -80 -241 -90 74 -59 314 -13 52 -14 -20 24 150 -37 -5 -92 -141 146 140 -4
6597 -4 79 69 21 215 -7 116 35 -211 -102 -82 -45 -232 -160 87 -13 253 -90 -111 124 126 -40 -104 -157 175 198
6622 198 290 -82 -215 19 83 195 -43 -54 -151 -20 -83 -35 -55 19 37 346 -24 232 140 120 146 132 -151 -66 -64
6647 -64 -160 -80 -192 173 -11 138 7 -227 -229 -183 -185 37 227 19 233 -6 271 -137 66 121 -153 17 -26
6670 -26 193 -245 47 13 -52 218 -199 90 -286 -83 116 323 -326 -218 343 142 -162 50 -76 -225 258
6691 258 -67 -48 -161 14 251 248 -29 237 -242 -143 -24 106 62 -81 10 -266 124 -148 125 129 -140 82 -40
6714 -40 -8 38 -8 110 -41 162 -33 63 175 17 -16 91 20 63 -62 286 -19 61 -75 56 -22 -68 -140 -80
6738 -80 241 58 -91 -102 -105 -37 51 -169 -257 -156 112 -23 -73 365 19 40 103 -134 134 90 48 -165 246 92
6762 92 -151 -92 -32 -149 -167 110 -84 189 34 -92 14 234 306 -41 -106 26 -97 -31 -21 -159 -23 123 -56
6785 -56 29 -54 173 -95 -248 -9 -47 10 -46 23 39 -1 235 122 -157 -63 1 -42 87 -133 172 88 -150 190
6809 190 266 31 137 -38 -7 -291 112 -218 17 38 -13 164 17 46 -300 -97 114 258 78 94 -181 -81
6831 -81 39 -28 -71 356 39 -244 120 -277 -96 -30 -56 73 166 -180 -11 50 -65 -94 6 78 -2 -148 20
6854 20 -76 -36 -58 -206 -1 144 -240 128 227 32 132 17 96 -166 137 -204 -55 44 -133 9 18 299 207
6877 207 -192 118 -219 -121 -16 -31 116 44 276 269 -384 238 -83 180 -76 -192 -102 13 118 101 43 -111 44
6900 44 -68 101 -32 213 250 5 -102 -100 26 -39 -135 9 78 -56 -32 -84 225 177 263 -429 363 50 -3 -54
6924 -54 -176 247 165 54 -142 99 -230 44 98 -40 -60 179 314 -43 -56 103 -197 -139 137 -239 263 -147
6946 -147 -8 155 42 -203 123 99 177 -14 125 81 -118 141 -173 110 2 283 -6 148 158 -119 15
6967 15 -88 -241 58 5 -103 -188 -3 -55 -28 25 47 1 0 -26 154 150 30 -84 112 -199 17 -42 85 -209 -10
6992 -10 -1 -60 -117 41 -96 -99 -122 8 -99 -122 93 -102 93 -69 44 -78 -21 34 -47 182 161 17 -18 -152 75
7017 75 163 40 -18 -281 -151 170 -97 95 40 28 217 -142 -311 -99 184 -134 30 -78 -156 -89 -2 -183 49
7040 49 145 84 118 23 123 -111 143 -16 330 -74 -5 170 156 -24 106 89 170 -311 -89 233 -49 34 13 33
7064 33 -208 -28 103 -69 -10 192 119 311 -171 89 95 -13 220 -119 -37 20 -273 -101 69 130 272 -55 -310
7087 -310 9 -38 40 -141 -5 268 47 127 -47 53 96 -30 42 119 -134 -376 70 155 -44 -180 2 125
7109 125 406 276 89 115 104 78 241 103 28 138 -117 34 97 30 31 107 67 -9 77 -94 -41 -2 70 -178 143
7134 143 281 -107 -253 39 103 8 -175 176 -163 38 -191 -85 -105 -336 34 350 69 55 107 31 102 28 -197
7157 -197 45 200 140 315 185 287 30 -21 -144 -95 178 44 -18 154 193 -84 106 43 -270 -177 -20 -34 57
7180 57 -76 47 -119 -170 85 66 -85 4 34 84 98 -139 242 -8 -201 38 14 -37 -11 96 157 70 -222 -5
7204 -5 102 -27 50 -20 -209 180 -55 -298 63 155 -190 91 -168 18 -18 198 20 -61 -97 -25 -43 -14 176 194
7228 194 94 -22 117 28 97 124 116 328 129 -140 -34 -109 -19 15 57 -202 -73 98 -191 -96 132 -122 19
7251 19 -153 -34 -188 22 13 163 89 -84 -35 -245 2 100 126 -52 50 -15 75 -32 19 -266 -9 3 -131 148
7275 148 67 -77 -223 -80 186 160 48 -44 39 -105 -149 -170 -138 325 -82 42 -131 -163 -10 -238 97 48 -124
7298 -124 20 58 -12 2 -31 -114 -129 -3 -276 237 108 249 202 -139 -93 -24 21 -181 140 -53 169 25 36 23
7322 23 -195 56 243 237 -122 -193 64 -34 20 -52 -84 -17 76 85 -175 304 0 142 -15 251 52 -158 -252 -88
7346 -88 -166 47 129 -272 33 149 171 264 29 36 -61 -82 -101 133 105 76 20 101 135 -16 147 -433 196 184 -110
7371 -110 130 99 30 -158 139 -196 146 -194 103 125 66 143 -82 -238 290 6 109 -68 151 -198 133 -89
7393 -89 36 49 -204 36 -142 28 -131 -123 177 -127 -41 -44 -127 -98 186 -129 30 -170 25 -24 -148 110 191 167
7417 167 145 403 -154 43 -33 -63 101 -43 81 81 129 103 339 -54 -133 -89 249 -100 -54 -125 374 -121 -111 -189
7441 -189 -47 33 -53 -49 213 22 -112 -8 217 0 138 -55 -25 -95 -155 -173 -73 265 240 -116 -80 -153 78 26
7465 26 -139 32 49 -5 83 2 177 95 10 -29 -232 162 250 161 -94 8 33 39 201 -148 -108 -244 -60 -79 -155
7490 -155 -39 23 -99 -62 57 -213 -9 191 4 -54 -104 3 135 -110 -87 -109 -165 63 -56 74 -161 24
7512 24 -54 58 134 -178 -91 60 121 -249 -279 -15 82 234 -37 -138 94 286 226 53 -95 129 -91 85 22
7535 22 88 -29 355 55 21 296 181 69 130 -98 113 -278 -64 -4 -104 10 196 226 -164 42 265 -364
7557 -364 93 -205 -194 128 62 -2 27 2 144 -51 102 -37 -74 -200 15 37 134 237 -146 72 -166 89 -268
7580 -268 174 -129 -72 -164 -86 12 143 54 -61 -107 -289 254 246 66 113 215 -167 44 41 -72 -32 178 10 -6
7604 -6 144 -63 197 271 -17 -287 16 -79 81 129 -72 117 -194 -134 100 -11 -87 -105 8 -89 146 -164 115
7627 115 21 72 150 -55 -73 -19 71 220 -128 -78 -122 -83 -64 143 -136 113 216 162 16 -73 -83 83 -88 89
7651 89 -58 147 20 19 81 336 189 99 -5 278 7 147 120 53 40 -215 100 -14 -158 6 -46 127 124 53
7675 53 -77 -164 -154 -217 50 -282 -83 -98 -70 43 -170 -20 -9 21 -88 326 36 38 35 -300 50 -380 -70 60
7699 60 -128 182 18 -58 1 -62 -270 -290 131 -32 -144 -44 -81 -52 -3 -198 64 246 -6 -37 82 -10 -130
7722 -130 152 142 -271 -95 77 271 -139 67 -176 164 -157 -93 -152 125 -28 -96 -3 44 119 -45 -145 -18
7744 -18 84 -199 -66 -200 29 158 -110 -177 -41 -170 50 -118 44 288 222 -397 105 18 40 -128 164 6
7766 6 115 82 -301 -180 -40 68 -43 25 -148 -17 154 -87 -126 -40 -184 -137 -62 51 -72 145 87 161 15
7789 15 -17 220 67 -57 205 -115 -1 65 -24 120 91 -13 -170 -51 383 93 -115 153 145 -50 122 -39
7811 -39 -220 -25 -183 -32 78 -148 64 206 -114 -22 193 263 59 -66 -206 -94 -86 -169 -199 7 -5 4 -41 -129
7835 -129 216 -133 311 -198 -152 298 -15 -174 9 97 59 116 108 37 133 -80 15 -34 -175 334 198 -259 249
7858 249 68 -151 -102 -107 -105 -26 85 -47 108 25 18 181 -118 104 137 -34 -129 162 29 -142 141 -51 -223 -39
7882 -39 -106 235 159 -208 -131 190 73 26 -126 -125 -121 -70 102 81 221 181 94 102 152 -344 -13 -6 111 77 15 121 107
7909 107 47 -147 3 -70 -10 -2 41 -54 -147 94 76 -12 57 49 -19 -113 -17 -39 -113 -191 -74 -228 -166 -130 14 109 -199
7936 -199 14 -155 -286 109 -252 48 -118 103 -200 90 -33 139 61 -14 351 -274 -37 73 -62 -96 -133
7957 -133 186 -225 92 54 261 -101 -17 54 -26 -149 -81 -42 -36 -7 13 -66 -216 83 199 78 91 -65 -214 -35
7981 -35 209 160 -169 70 -261 34 -131 2 -194 -61 -449 219 267 4 70 109 -39 132 192 -207 205 -28
8003 -28 80 137 -228 -30 16 -146 -46 2 43 108 242 4 43 27 172 99 78 -37 -195 -195 -28 -235 -117 32
8027 32 60 -77 108 -208 -50 -83 -4 206 -163 258 12 -28 -128 -274 -230 84 17 26 -168 -44 94 86 24 -35
8051 -35 24 -172 -40 27 -100 137 -68 283 -15 -154 62 -127 -70 95 -493 136 -109 61 57 137 -13 -18 -81
8074 -81 -77 -82 234 319 234 -135 154 -15 -296 -8 -62 174 95 -39 72 -40 -106 183 -116 5 -82 75 -37 226
8098 226 160 21 221 -285 125 -121 46 142 -53 116 -14 -11 -89 47 -90 66 -328 -25 -12 -111 7 -40 -58
8121 -58 -121 95 -87 -41 174 163 -196 -55 -28 39 105 -57 227 149 -138 -252 -25 40 -146 40 137 112 -52 2
8145 2 -187 -17 52 24 42 74 -109 60 -78 17 -288 -147 72 91 196 9 228 160 -28 182 -90 77 -28
8168 -28 -95 -98 25 19 103 -292 -33 30 -137 103 -51 -237 202 -273 -73 349 105 -37 67 27 94 163 -218
8191b18
$$ Imaginary data points
##PAGE= N=2
##DATA TABLE= (X++(I..I)), XYDATA
0 0 0 0 0 0 0 0 0 0 0 -6 8 -8 8 -16 16 -24 32 -40 48 -56 66 -80 96 -112 131 -152 177 -208 237 -273 313
31 313 -356 404 -459 518 -582 655 -735 820 -915 1020 -1133 1256 -1392 1540 -1701 1878 -2069
48 -2069 2283 -2514 2769 -3052 3364 -3712 4099 -4537 5036 -5607 6269 -7052 7987 -9132
62 -9132 10572 -12444 14987 -18660 24457 -35012 60416 -255333 -11590 599423 97835 -388546
74 -388546 -249724 215957 190219 -11464 -81577 -89118 -132552 102948 298956 47603 -334770
85 -334770 -178537 290813 292089 -181829 -296967 39393 230941 72465 -84241 -98510 -45038
96 -45038 29133 134300 70737 -153573 -136432 137402 184490 -53172 -152144 13457 98851
107 98851 -10841 -22737 73024 -28604 -145224 26154 190195 187 -238529 -78371
117 -78371 211153 96952 -177396 -95210 109138 38676 -83491 17653 100905 -74269 -156039
128 -156039 107488 222482 -85365 -258110 21020 249014 44431 -210579 -86158 129821
138 129821 67449 -50537 -22036 -7506 -43011 16285 110383 29563 -134825 -60841 150180
149 150180 105197 -96360 -95918 57730 88393 -15711 -42687 14665 -6064 -31210 39588 41595
161 41595 -60036 -62830 47715 67165 -48591 -70043 57129 59122 -71518 -48816 83780
172 83780 57017 -83499 -73480 77182 79453 -70103 -74797 39450 34771 -34346 -13692 28131
184 28131 -24861 -68749 35701 102711 -37831 -127295 15688 136329 32024 -111335 -53086
195 -53086 87496 64961 -31926 -32441 -5730 -1732 27529 43974 -14819 -82262 -20825 100004
207 100004 52014 -92621 -72454 60557 81919 -16242 -63819 -94 39593 11656 9364 4651
219 4651 -37010 -22377 45297 45275 -39815 -74722 15979 69832 -14117 -65813 -5717 33961 943
232 943 -24144 4176 16104 -23285 -13045 41505 17210 -38872 -17671 35552 27332 -27537 -26144
245 -26144 25459 11834 -27907 -1359 22616 -8875 -29859 3978 38050 -531 -40818 4459
257 4459 40836 4221 -19421 2183 18913 4408 -7265 14355 10432 -25812 -7538 32229
269 32229 7642 -35061 -22956 25406 25576 -28373 -30497 17170 18377 -8704 -8790 1726 3032 -1771
283 -1771 8574 14624 -16728 -21594 22266 24609 -19565 -31630 3886 29130 -3716 -33992 -4281
296 -4281 16888 -345 -6723 -1570 -612 -1064 4181 17133 2437 -20590 4909 30328 5150 -20070
310 -20070 -8060 18739 14852 -16207 -12555 10204 1549 -6313 1343 157 -5249 -4594 8036 12491
324 12491 -10439 -11220 16160 13356 -7135 -8535 4743 12481 -3428 -11885 4477 3096 -10207
337 -10207 -3327 1519 -3881 -8220 -5021 6510 183 -12837 1442 10901 -1611 -4230 2515 8084
351 8084 3116 -6416 3188 9773 -4955 -5442 4148 1751 -2965 -6528 -870 5360 -4691 -4380 5101
366 5101 -75 -2109 4047 4740 3153 -2529 699 12858 3165 -8169 1341 6059 3032 -3401 -8407
381 -8407 617 2065 -4640 -1857 -4116 -6505 2253 2853 -1681 -3634 -4075 6528 8414 -3816 -3281
396 -3281 1898 3464 5785 -1414 -6554 -1215 408 3642 370 -12010 -6038 6126 3465 -3148 -8003
411 -8003 -1314 9681 2305 -2382 3269 1374 1786 5177 3851 3130 -3856 -4139 8860 5000 -7992
426 -7992 -6543 -65 5473 -585 -10189 -1301 5831 -2052 -2956 1246 4253 3234 -5202 -240 10287
441 10287 2596 -5151 -2774 2192 6183 -2766 -9602 709 2067 -4650 -4365 -1963 2115 -2260 -8632
456 -8632 2775 10274 -2450 -8508 206 12416 9309 -9873 -7664 12163 9106 -5890 -7577 2294
470 2294 8240 -5036 -10094 5971 5501 -10073 -7511 7239 11262 -5468 -15389 7399 19902 -1631
484 -1631 -13435 -49 14745 8149 -11244 -6637 10111 1773 -8626 -2157 4066 -686 -12252
497 -12252 -5360 14229 3821 -17693 -10271 12312 17671 -4242 -21465 989 22070 7348 -11641
510 -11641 -10409 5597 11390 -2747 -6056 1880 -4873 -8003 4573 11237 -2643 -21925 -8415
523 -8415 26386 17782 -21214 -22897 12637 31109 2962 -25511 -4911 19966 7626 -7141 -4008
536 -4008 2055 -2899 -6489 7953 11496 -15328 -21787 8712 23555 315 -26141 -11394 24464
549 24464 17140 -13589 -14464 5353 14196 2526 -8963 253 3835 -5811 -1692 6526 1820 -10214
563 -10214 -13362 5134 17067 -3997 -19758 -4942 15545 14130 -9151 -15385 7201 14907 524
576 524 -5109 118 3470 -1707 -2526 9287 4634 -17241 -11178 14527 16039 -10531 -25884 1483
590 1483 26983 4926 -19896 -8872 12301 13616 -2286 -6805 2417 53 -2020 9089 6308
603 6308 -10002 -14003 2000 17446 2632 -21956 -12062 12028 13538 -3682 -15928 -4141 12055
616 12055 7392 -1942 -3360 -2405 3460 5148 2627 1612 -5190 -7176 4141 8265 605 -10864 -11169
631 -11169 6053 12347 -3383 -11653 -3541 7236 8471 -1318 -3976 1527 172 3287 8949 1169
645 1169 -8402 -6580 7156 13943 -4504 -18740 -3429 12465 7575 -8707 -14241 819 10347
658 10347 3463 -2623 -5937 -3448 7256 8981 1171 -6676 -7458 6284 12812 -1246 -11572 -6631
672 -6631 4515 10059 -1940 -12560 -5647 4317 7469 607 -9991 -4469 7123 7272 1510 -4681
686 -4681 -3203 6067 6072 676 -1996 -4435 906 5335 295 -4045 -4921 -1541 4809 502 -5595 -1868
702 -1868 1312 2383 1810 -1505 839 2185 134 2909 2297 -1921 -84 393 992 1361 -3545 -2452
718 -2452 888 -1465 -639 -1052 -3439 -135 805 -5 1192 -1467 143 4084 1155 437 920 -180 2701
735 2701 1590 -1898 -81 -502 -623 840 -2769 -2526 428 -645 61 -1021 -2258 2486 2331 -660
751 -660 704 21 1856 3971 -212 -1054 491 400 2311 -795 -4487 -543 711 -388 -1202 -4289 -1270
768 -1270 3155 -166 -1378 -1057 -766 4190 2754 -1387 68 621 2351 3178 -2315 -2287 912 514 645
785 645 -2193 -4049 515 929 -1110 -613 -2271 -37 3096 -47 296 820 356 3067 2205 -1134 751
802 751 523 788 1319 -2734 -1533 961 -1258 -770 -1372 -2176 770 41 -712 864 -678 757 2753
819 2753 38 465 1192 450 2124 302 -1449 986 -259 -1281 335 -1917 -1535 -145 -1751 342
835 342 -587 -2439 1306 1516 -16 997 113 933 1942 399 1456 934 -1954 634 2031 -922 -1930
852 -1930 -2836 -275 2083 -2033 -2662 -159 -131 1384 1197 -1332 97 842 2319 3784 -1317 -2498 2272
869 2272 2405 801 -1869 -2845 1158 626 -1694 -109 -2286 -3279 1125 2199 -71 -2622 -2986 4297
885 4297 4911 -1886 -1667 1330 2396 2412 -1136 -757 537 -1836 593 2474 -2906 -4060 -1413 1829
901 1829 2619 -3347 -3990 1896 2923 1401 243 -2185 896 3487 1912 463 -2820 -1220 3415 1497
917 1497 -1535 -1488 -2447 -506 1410 -248 -1451 -4489 -1806 6196 3106 -5166 -4027 3253 6925 179
933 179 -5888 841 5065 -116 -664 986 -473 -2885 -2156 4158 3126 -7821 -5993 5615 6042 -3220
949 -3220 -7570 9 8016 1462 -4529 639 2602 947 617 1016 1698 -2565 -3304 3187 3590 -3196
965 -3196 -4636 -1477 3179 3112 -3815 -4592 394 3854 3051 -2440 -3774 3431 4311 -648 -1073 649 1709
982 1709 -1241 -2325 3766 2026 -7202 -4260 5306 4500 -5526 -8845 3270 9553 -2934 -8230 2596
997 2596 6937 497 -4968 1271 6519 -2085 -5398 4972 5768 -4730 -7194 1777 8213 -1830 -10401
1012 -10401 -100 6895 376 -4811 -2767 3310 3070 -2062 175 2997 -459 -514 1349 1894 1120 -2701
1028 -2701 -2208 2045 1695 -1120 -3899 -3444 3413 3638 -4469 -4778 1877 4762 -144 -4998 958 6577
1044 6577 -1331 -4167 3359 4528 -2157 -5544 2144 7675 -3541 -9560 2127 7068 -1744 -8250
1058 -8250 -976 7151 660 -7314 957 6392 -867 -3779 1886 5770 -85 -5431 1751 6172 -1911
1073 -1911 -4799 332 3098 356 -4064 -2172 2153 -967 -1582 824 -788 -203 1209 954 730 -407
1089 -407 775 2338 -939 -845 2792 -320 -2717 127 1975 -229 -4169 -1984 4441 171 -5715 -105
1105 -105 4076 191 -3707 -773 5580 1522 -4940 1176 5634 -555 -3849 26 4358 104 -5744
1120 -5744 -69 4480 -2178 -4555 759 2409 -991 -3658 927 4325 -1719 -2613 3127 2862 -1081
1135 -1081 -1158 1854 2647 -1646 -2000 2701 289 -3308 -533 1351 -589 -2560 -993 2457 -518 -3486
1151 -3486 1409 2613 -1204 -1195 1637 2501 -569 -2049 2733 2506 -3088 -1448 2555 506 -2839 -2172
1167 -2172 1794 1358 -3717 -1686 3196 -158 -2775 277 2767 763 -2594 785 4662 -481 -3024
1182 -3024 2186 2528 -1015 -2750 340 2596 -2008 -3791 1997 1242 -2902 -1628 1584 1871 -1635 -2130
1198 -2130 3217 2503 -2641 -315 3009 1037 -1471 -525 2052 725 -3569 -552 2660 -1575 -2867
1213 -2867 -112 1392 -245 -2606 351 2747 -1202 -1613 2811 1542 -977 -496 1965 2488 -1916 -1926
1229 -1926 2661 598 -2875 -590 854 -176 -2352 -1289 2448 27 -3358 1252 2480 -741 -1567
1244 -1567 768 2859 331 -2098 1477 2615 -1711 -1129 1453 629 -1365 -2266 659 1357 -3150 -1773
1260 -1773 2204 219 -1798 -505 1680 1638 -1487 -218 3050 657 -1829 1095 1915 -174 -1762 -904
1276 -904 2058 -1054 -2771 647 925 -1511 -1159 527 1059 -398 -1689 1985 1909 -1338 209 1893
1292 1893 862 -349 -413 1270 859 -2225 -172 1464 -1374 -1594 -239 683 -244 -2365 36 2214
1308 2214 -760 -883 1649 1049 36 -381 856 2316 -796 -1326 1614 269 -1454 -1017 -178 536 -1248
1325 -1248 -1821 1086 348 -1936 -36 812 276 181 -301 1479 1140 -1092 865 1204 -461 -300 -35 128
1343 128 -32 -1311 -156 522 -1323 -983 538 -502 -145 -229 282 869 -246 250 1945 138 -516 796
1361 796 722 266 -860 -962 692 -392 -1576 -7 -33 -784 -403 -700 469 341 -956 759 914 -59
1379 -59 551 454 332 999 -184 -6 355 -693 193 -66 -1239 -347 -366 -1005 85 -315 -140 59 -622 466
1399 466 1292 -177 83 310 686 1275 -490 -650 959 51 -651 -396 -845 320 -116 -1355 280 373
1417 373 -1048 -258 146 474 532 -1055 349 2062 470 -599 -142 799 1469 -756 -1286 971 268 -1292
1435 -1292 -618 -229 803 -950 -1890 1169 1028 -1080 -496 610 1767 870 -1707 587 1995 -34
1451 -34 -868 -72 638 438 -1217 -1245 1022 -362 -1606 -189 319 780 -725 -1413 1173 1817 -382 -494
1469 -494 465 1662 978 -1697 -213 1730 106 -1204 -967 190 729 -1917 -2147 1426 620 -1850 -972
1486 -972 732 1836 -759 -1881 1818 2554 -812 -1169 918 2291 138 -2308 385 2289 -1202 -2361
1502 -2361 -7 1166 -282 -2497 -720 2296 289 -1923 31 1680 1376 -735 -1061 1466 1497 -1154
1518 -1154 -281 598 457 -161 -1481 -429 1203 -1026 -1601 -265 668 539 -1463 -897 1934 979 -871
1535 -871 -389 740 1898 -54 -1462 970 1492 -924 -845 471 983 -477 -2291 -1 1668 -1191
1551 -1191 -2019 695 1299 356 -1506 -126 2401 249 -1371 955 1381 546 -1036 -618 1348 230
1567 230 -1880 -251 420 -473 -814 -1073 548 335 -961 8 934 99 377 206 80 1123 499 -12
1585 -12 523 -126 291 143 -1177 64 348 -875 -943 -340 443 73 -1279 361 1534 -208 -475 597
1603 597 1583 741 -779 -210 1555 102 -1526 236 604 -244 -1155 -773 1175 -355 -1816 244 1018
1620 1018 -340 -838 -156 1406 462 -889 709 1506 -344 -292 777 30 -102 -1091 -96 640 -1208 -817
1638 -817 379 -494 -630 -75 -122 565 -468 -12 1030 181 27 838 584 -95 -196 37 525 -604 -1104
1657 -1104 786 -280 -1255 -299 193 -28 -815 -583 1261 330 -1089 312 1308 235 -400 3 1083
1674 1083 418 -1165 245 1357 -668 -858 -360 -47 -315 -1268 -392 1078 -452 -896 787 356 49
1691 49 10 606 1116 -165 -647 1320 483 -788 -76 99 17 -681 -750 481 -269 -970 353 290 -469 -209
1711 -209 142 785 301 -642 769 840 -786 -170 607 142 -152 -679 49 386 -1257 -311 578 -722 -827
1730 -827 -291 84 556 -553 -248 1278 -20 -505 611 438 480 -301 -119 808 -144 -1191 226 -35
1748 -35 -860 -409 -133 494 -287 -940 403 782 -730 118 854 253 486 4 750 801 -999 140 977
1767 977 -402 -566 -409 -122 116 -1188 -503 542 -313 -521 375 448 281 -33 58 855 -132 -97 916 -98
1787 -98 -244 135 -182 92 -1017 -692 417 -309 -1050 223 96 -416 -436 -156 576 247 -709 643 906
1806 906 -42 -92 113 585 25 -802 216 725 -1106 -758 259 173 -412 -683 -271 700 -317 -489 964
1825 964 507 -146 349 260 338 -69 -231 473 -69 -726 495 -99 -201 -295 -410 30 -118 -1071 498 206
1845 206 -593 458 462 482 61 68 675 370 -921 56 735 -517 -200 -337 -66 151 -933 -196 712 -406
1865 -406 -788 497 528 339 -144 51 982 238 -391 463 149 49 -149 -431 156 -252 -963 243 -300 -706
1885 -706 132 -283 -364 -299 126 622 341 -369 629 846 94 -123 536 332 97 -852 349 551 -885 -798
1905 -798 353 -303 -341 -548 -183 852 -611 -341 859 523 270 -8 572 842 -58 -486 424 498 -329
1924 -329 -164 -431 -15 269 -999 -196 268 -548 -164 54 23 722 -339 30 599 445 200 156 -170 819
1944 819 83 -688 -266 528 -77 -261 -823 144 373 -719 -414 439 336 -184 -324 331 1337 -86 -367
1963 -367 811 713 -82 -153 -67 663 -72 -1270 -150 119 -512 -463 -674 299 514 -1056 -209 764 290 49
1983 49 -250 297 781 -371 -537 636 444 -291 -373 -246 609 -373 -1191 -187 666 -219 -473 -41 917 546
2003 546 -998 370 1066 284 131 -81 376 754 -690 -210 471 -346 -455 -411 -397 205 -640 -445 126 265
2023 265 -232 -46 -58 544 643 -370 67 941 377 7 -219 -244 523 -693 -1079 631 122 -534 -812 -292
2043 -292 582 -341 -1140 819 934 -85 -380 131 1049 445 -1049 329 1058 -661 -497 289 459 -258
2061 -258 -976 -561 593 -514 -707 305 234 88 -385 -151 934 28 -204 476 81 -110 350 -288 -68
2080 -68 101 -285 -3 -443 -498 163 -367 -582 189 96 120 -315 -29 773 454 -398 582 629 -78 -230 29 430
2102 430 143 -935 -161 731 -348 -839 -391 244 184 -787 -53 1037 -15 -657 456 566 123 -167 -296
2121 -296 999 88 -579 344 312 -391 -279 -393 142 -69 -943 415 194 -686 226 79 -171 134 10 828
2141 828 379 -390 229 496 -615 -299 406 38 -343 -575 -32 624 -942 -425 900 -98 -259 -170 568
2160 568 760 -437 -174 1090 151 -555 424 410 211 -503 -980 291 -244 -832 95 271 -291 -431 -158
2179 -158 614 144 -631 719 695 -123 25 286 318 -9 -444 165 216 -758 -147 512 -540 -572 -182 54 164
2200 164 -523 -21 548 -468 -192 676 565 130 -346 453 774 -251 -341 777 286 -488 -750 -16 293
2219 293 -527 -913 371 137 -588 47 326 372 33 -325 714 664 -572 52 372 -201 59 109 70 145 -762
2240 -762 -69 339 -735 -435 254 -143 74 -236 95 428 -327 -123 840 44 -164 258 314 139 -624 -309
2260 -309 418 149 -717 23 158 -352 -240 -211 426 -46 -497 446 400 -100 -55 432 515 27 -287 425 394 -640
2282 -640 -69 318 -324 -210 -421 -128 -1 -225 -98 910 -208 -175 797 351 535 -225 11 651 246 -448
2302 -448 358 320 -206 -216 -150 300 -454 -496 564 410 -485 -269 165 465 64 -3 390 491 -493 193 258 -34
2324 -34 153 10 -51 69 -434 -356 435 -767 -98 49 -67 -55 -186 211 571 -322 -50 727 168 117 391
2345 391 191 346 -420 -341 669 -150 -680 -7 8 -33 -106 -419 57 258 -435 413 696 -58 140 290 301
2366 301 410 -315 -13 71 -290 -11 -311 -316 -202 -400 -388 -41 -226 -75 133 -340 -128 278 124 27 -61 342
2388 342 574 -21 -144 254 149 -152 -295 192 322 -300 -527 393 28 -565 -87 181 259 370 -400 477
2408 477 645 -102 -51 49 83 448 -293 124 110 -315 -394 128 -267 -56 29 -150 370 -88 -243 153 -99 446
2430 446 334 -275 433 378 24 94 -116 251 -85 -336 -621 322 -222 -437 -554 -115 270 -501 -358 402 278
2451 278 -227 -57 130 454 181 -171 115 576 -352 -237 -22 25 -82 -304 66 371 -403 -432 43 281 541
2472 541 -200 -251 517 372 -213 160 89 299 308 -436 11 400 -364 40 -195 -249 138 -550 -220 171 -337 -100
2494 -100 375 26 241 -68 -159 866 17 -268 136 313 250 17 -200 139 -78 -244 -224 -120 -272 -157 -246
2515 -246 -57 381 -326 -73 381 -96 601 123 -201 281 161 -69 -62 -138 538 -2 -462 100 -15 -587 -56
2536 -56 -33 -38 -6 -155 -159 801 12 -115 80 347 104 -125 -239 512 -25 -413 -51 12 -236 -364 -204 19 54
2559 54 -398 -144 413 161 225 -324 -158 558 -405 342 127 97 115 217 -59 -55 -16 -317 -224 -378 100 -117 -441
2582 -441 -219 272 -296 -32 -26 272 409 -308 -237 582 -102 -470 -4 -113 51 -347 -341 165 -217 -601 75 363
2604 363 -170 -132 -331 548 325 -308 212 319 -43 24 121 194 382 -562 -9 33 -499 -464 -98 -442 147 -201
2626 -201 265 51 -554 111 399 -35 -191 282 313 -18 -130 -136 270 -343 -337 102 -113 -455 -153 -60 -193 -378
2648 -378 -203 409 302 -549 -187 245 420 -25 -600 534 236 -211 39 274 -91 -145 -437 89 -27 -555
2668 -555 -344 216 -283 -231 263 260 166 -60 -121 341 -11 -22 505 329 -18 93 0 43 -266 -489 366 -283 -531
2691 -531 169 -27 48 65 106 244 150 -257 321 204 -3 -65 362 238 -59 -436 317 330 -415 -172 -24 -273
2713 -273 36 -345 144 491 -101 -12 124 30 -180 154 204 270 -90 -201 189 -239 -375 -138 -239 -70 -166 -27
2735 -27 109 -242 -380 393 214 -326 38 109 256 63 -421 254 247 -410 -100 397 -237 -252 -316 158 -60 -620
2757 -620 -185 305 -192 -312 4 -125 -229 185 80 222 -94 -54 244 -42 -54 -5 272 109 -205 -133 181
2778 181 -137 -558 -159 180 -148 -38 35 84 -84 -162 255 197 -241 13 -59 582 285 -377 214 184 -194 -282
2800 -282 -223 -45 -91 -344 -291 58 -177 -357 352 247 -12 -91 79 330 67 -146 434 -51 -112 238 -129 -9
2822 -9 -307 -311 6 -183 -262 255 -129 7 -46 239 113 11 -232 653 210 -110 -43 -29 -78 -211 -310 -48 79
2845 79 -287 -61 149 -157 -423 10 234 31 -213 280 416 -110 134 476 314 181 -104 -144 220 -123 -252
2866 -252 210 -357 -18 -111 -128 -5 -64 -221 294 105 -229 324 179 -85 -25 -310 375 110 -265 43 360
2887 360 -318 -349 81 -173 -300 -379 57 270 -423 -217 279 165 84 -83 65 -13 -523 -96 489 -98 -301
2908 -301 -231 -53 99 -362 -382 236 -149 -168 -249 165 -128 -35 -49 294 -34 -143 320 170 65 164 193 29 12
2931 12 -87 -58 -43 -569 77 229 -432 -16 -178 -22 -7 -290 89 235 -386 94 265 262 -142 152 289 77
2953 77 -153 -407 248 -90 -27 -70 -227 110 -204 -266 127 121 -50 147 138 224 207 -388 80 166 44 227 -131 17
2977 17 292 -83 -203 -128 52 68 -85 -333 285 221 -67 54 119 103 15 108 202 362 -66 -169 132 -87 -63
3000 -63 -414 -191 229 -77 -321 229 -92 -150 -134 -68 247 309 -229 336 -16 -34 37 250 346 139 -113 0 99
3023 99 4 -292 -408 -290 -129 -190 -107 86 -258 210 133 -29 628 52 108 -4 211 -25 -147 -326 207 283
3045 283 -400 -105 -202 -144 -66 80 -219 364 234 59 120 316 281 -117 154 228 308 -285 130 178 254 -97 -7
3068 -7 -6 207 -154 -106 181 -266 -82 -179 -101 164 126 -22 270 83 44 253 -70 99 49 -307 24 -77 -165 48
3092 48 -493 -296 181 -36 -137 -252 -205 0 177 154 540 28 29 -33 90 -110 -34 -217 21 171 -193 152
3114 152 -221 -18 -62 -204 -229 192 -171 -241 239 -96 372 140 -89 218 116 -52 82 77 3 93 -63 118
3136 118 -247 -214 -227 134 145 -201 -357 226 269 -181 -239 212 85 93 125 170 24 -193 -36 195 -20 -78 -76 -327
3160 -327 39 -154 10 195 92 -11 244 -228 -214 276 -45 -110 42 -2 20 250 63 164 -88 161 -118
3181 -118 -201 184 -13 -414 66 220 -214 51 7 82 -64 136 182 367 200 -72 305 16 178 -216 98
3202 98 226 -417 -362 -67 -31 -201 1 -266 326 -55 -444 114 99 -159 131 -116 186 -213 7 -68 280 -81
3224 -81 13 100 -303 11 -10 -168 -48 -326 86 300 -150 6 371 57 -63 -4 72 60 -221 4 22 -342 -191
3247 -191 86 -137 -68 -110 1 242 -229 -370 123 127 94 -65 6 -39 -181 -242 44 111 -102 -143 25 -50 3 -77
3271 -77 -43 21 -139 82 61 -184 23 -14 45 96 37 32 399 17 -157 166 -80 107 -282 -17 54 -187 -27 119
3295 119 20 -172 11 111 69 -62 -214 85 -17 23 122 -20 37 -13 -177 133 89 -136 73 -5 -281 20 -115
3318 -115 -133 42 50 103 -2 -218 151 191 -161 125 259 141 431 279 268 122 -281 -52 187 25 135 -210
3340 -210 -106 30 -324 -302 186 62 -200 93 -105 251 29 147 153 171 -43 88 202 -40 -18 -363 -46 102
3362 102 -304 -12 47 -221 -49 -118 -95 314 -165 157 23 -71 315 113 53 54 44 -133 -104 -222 -248 66 -30 -101
3386 -101 -297 44 449 -22 -163 -8 93 87 192 80 441 -70 114 75 -93 -190 107 177 181 200 -18 128 52
3409 52 -133 -309 -19 -195 99 -214 -91 82 220 288 373 54 -43 -32 10 -82 15 -19 107 -249 -47 -20 -105 -31
3433 -31 -50 364 -21 4 252 92 235 151 174 -103 -86 207 -208 -96 -207 -151 265 7 -288 -6 102 81 -180
3456 -180 -235 47 64 -449 89 86 -90 36 12 -289 201 74 18 -3 -313 -244 -159 -34 -48 26 -185 -76 -10 -67
3480 -67 138 37 -303 131 136 -89 -258 -215 -190 11 -125 -128 -14 -250 175 -72 174 103 -207 -55 13 -227 -18
3503 -18 -74 81 219 105 55 163 45 -191 -110 133 -19 -286 -82 131 -55 -316 -73 -155 7 273 33 -30
3525 -30 123 141 70 373 -20 33 14 -370 105 -49 -184 -48 -55 -91 95 -137 208 147 6 20 -125 115 213 5
3549 5 -44 162 27 -55 33 78 106 30 29 -108 -127 -101 -380 -263 170 428 -269 85 -14 110 93 130 68 -63 -212
3574 -212 152 143 244 -132 221 -201 181 -166 -172 139 -29 -291 82 -37 17 233 -135 46 -240 42 -116 188
3596 188 295 276 -148 -207 229 142 168 -31 -276 236 -87 -128 38 90 -367 112 -96 -33 277 -3 120 196 234
3619 234 272 -340 -4 -17 -17 -143 -14 -247 61 -435 88 128 -228 -362 -50 79 74 -53 -127 365 -16 115 87
3642 87 114 163 -158 -66 116 163 -107 -117 200 -210 -85 -7 -83 133 86 -294 -110 -110 119 79 -204 300 45 116
3666 116 -3 24 235 -115 18 -113 64 8 -205 243 -24 -8 -241 228 44 58 -58 184 -52 72 80 234
3688 234 98 -38 -150 2 114 106 -90 -12 -33 54 32 -176 275 120 140 102 -88 140 -131 -199 122 177 227 259
3712 259 -53 315 -202 -409 145 140 -183 -40 168 -202 67 -62 -92 30 155 -74 62 11 -51 2 -69 366
3734 366 12 201 -41 -22 328 -60 -196 -139 -168 -372 50 -44 145 160 -211 91 186 49 162 60 104 -121
3756 -121 97 72 83 29 -219 86 97 -84 99 133 181 -54 -95 181 -248 -91 6 94 -39 31 -194 -89 170
3779 170 -286 14 -114 -21 -197 68 -126 -112 -205 -140 180 -167 187 101 68 100 -56 33 -103 64 78 67 -167
3802 -167 -27 130 -93 120 -157 -115 15 77 141 55 167 -270 22 -174 85 157 -91 9 -100 -105 14 90 -73
3825 -73 125 -218 35 109 -203 -12 122 2 -116 -20 -26 271 -70 31 194 155 -95 96 44 210 -159 194
3847 194 -52 18 -35 90 -40 156 -83 -86 52 89 -84 -66 37 -75 28 -234 73 227 -149 52 121 410
3869 410 119 -82 -121 176 126 14 105 122 -74 -12 -59 -209 134 -337 63 -79 -131 -138 326 52 151 -90 303
3892 303 128 -198 17 -26 -116 189 128 39 153 151 -140 -27 389 248 216 -15 91 41 166 -100 -90 16 85
3915 85 -8 -124 124 -149 -98 -89 -152 -375 -111 -75 119 21 -312 196 -161 154 -159 -14 225 -119 100 15 23 0
3939 0 78 -61 -144 10 -107 58 -140 -42 -155 143 284 -132 100 39 -221 -209 120 129 96 331 79 -296 62
3962 62 81 148 -47 -116 -23 269 -221 203 259 63 109 109 129 223 -75 124 57 -13 111 -28 5 87 -267 -16 23
3987 23 1 -27 -24 122 112 162 -230 231 75 -224 61 -199 -149 45 393 -172 -160 -55 157 133 -308 95 -94
4010 -94 61 -454 -176 17 1 -262 -49 350 100 -40 169 -93 140 -82 -106 131 -224 130 -37 -313 -179
4031 -179 -169 429 -88 -267 9 22 -44 96 14 262 126 48 -1 134 76 -247 149 25 -255 -86 -159 37 82
4054 82 -217 -123 -48 -21 -124 10 -92 -21 199 129 33 -82 136 -214 -16 72 17 -304 -345 108 -15 10 19 -127
4078 -127 19 150 55 -274 161 -234 4 -273 -121 138 -19 -102 -159 -65 192 -202 69 -106 -137 -141 -74 -66 49
4101 49 -223 -131 -66 -38 336 201 93 48 -181 0 127 -87 -22 -161 125 -32 121 115 -90 -37 -44 -51 -88 237 39
4126 39 -236 -58 -32 -163 -246 -10 -51 -160 -49 -119 -164 -103 -110 27 -89 287 41 -317 159 1 302 74 -120
4149 -120 427 12 -278 -119 16 51 93 95 -41 0 -86 45 -42 -161 127 -220 138 -167 5 -180 -22 91
4171 91 -107 101 -109 65 164 -208 -202 72 65 154 -96 82 69 -72 130 -105 -73 256 7 63 119 43 -209 124
4195 124 -261 0 17 -92 -145 91 108 -217 65 136 7 -398 -30 22 -52 -10 -129 151 185 32 55 50 -39 99
4219 99 -66 91 110 -8 64 23 197 -20 -47 73 74 -127 -296 132 133 -13 -82 -75 -52 167 -81 -331 30 -73
4243 -73 -59 -74 148 190 196 70 113 99 -41 27 66 124 162 11 -233 29 153 11 1 160 45 97 281 175 -207
4268 -207 126 20 -220 -38 -379 122 208 172 84 -66 215 -41 192 -126 25 -147 -31 -219 68 -109 181
4289 181 43 -249 -35 114 -71 131 28 -322 -14 -211 -91 12 60 -244 174 -209 183 15 -390 57
4309 57 110 -28 -64 359 106 1 72 -164 -123 -67 -72 -309 -17 -85 68 34 -71 103 31 -30 143 10 110 203
4333 203 -16 178 -7 0 -10 170 -124 -80 -33 110 189 122 -4 -18 -39 86 -86 213 -174 9 -27 69 11 -72
4357 -72 -208 -128 44 -4 44 -64 -243 167 -126 -2 -69 -249 2 -48 52 -20 138 -10 -83 52 96 122 -33
4380 -33 -54 249 -68 102 -88 -37 4 155 217 -73 -77 13 101 -154 -137 322 106 56 129 -53 -66 107 -15 -92 249
4405 249 -149 -114 -103 19 73 -95 120 -111 -125 15 32 52 -44 16 144 215 -142 -30 -67 17 184 116 -160 158
4429 158 -279 73 165 72 -37 -231 -89 -74 78 -295 -69 -79 435 32 146 -12 -42 58 -57 -186 -59 231
4451 231 -102 -74 20 0 11 66 -2 -51 4 115 -65 16 -163 -96 -2 303 2 16 293 59 -291 202 103 -293
4475 -293 -83 -55 174 29 46 125 -25 -36 142 -96 -84 66 -48 -106 -43 28 -251 -98 -30 27 35 78 322 -256
4499 -256 73 -160 -71 -80 -140 -17 -155 204 60 -54 -69 88 -99 -123 -27 -202 -115 182 115 -159 -166 119 6 51
4523 51 -6 -153 -112 73 44 66 371 -30 -20 -98 33 90 -133 51 53 48 17 -94 295 -156 -251 -35 1 121 91
4548 91 -133 -66 -146 73 78 -85 -160 217 -122 9 23 159 -163 9 159 25 -130 28 -85 -170 -97 -76 40
4571 40 -135 -256 -144 206 82 132 18 170 -155 38 -146 116 -131 -111 -109 -28 -124 -172 -162 -78 -245 -72 56
4594 56 -112 25 36 -164 -8 -115 38 44 -23 121 -52 -2 110 93 -105 -208 89 -218 -92 -75 -188 -1 133
4617 133 112 173 -171 78 -80 -315 -19 -36 -174 -86 -193 25 32 11 103 -89 -93 -116 -239 -63 -18 87 -101 43
4641 43 -11 11 -293 40 64 10 -96 11 21 142 87 71 2 105 18 96 -14 72 19 31 -135 -119 49 271 234
4666 234 -79 381 -156 -133 40 -22 21 -54 -224 45 -31 -197 -261 -92 -103 -101 -93 57 204 -165 3 -14 -171 -83
4690 -83 -178 -191 -62 -40 114 -51 32 -60 108 35 242 149 -9 295 -333 -203 241 59 57 307 -148 44 28 -41
4714 -41 -50 -107 264 206 -28 -188 153 -220 -275 -129 -170 -70 243 206 -30 -81 -81 -8 -162 106 -281 162 -239 98
4738 98 238 36 -30 -260 -142 -10 117 -38 44 -75 -90 11 -309 -222 -63 63 129 131 -145 129 14 -130 -179
4761 -179 72 -257 -98 134 182 -102 97 138 -156 62 69 76 3 -117 -243 136 116 -62 59 88 128 74 -31 230
4785 230 -137 -276 210 15 331 -124 262 104 -6 -40 46 67 -14 191 -145 58 128 -3 190 132 21 182
4807 182 -211 78 113 91 -13 112 -227 -23 -21 -87 -39 -242 270 85 -19 37 377 310 274 26 156 -96 -58
4830 -58 -11 -65 -61 -32 88 -122 297 -1 -44 -156 -93 -76 -9 -8 17 47 -123 79 279 -3 -98 -291 103 45 20 -182
4856 -182 31 -59 -69 9 -39 129 20 162 32 -85 23 -91 11 205 2 -96 261 -108 -273 190 9 7
4878 7 148 -83 -81 -165 100 -28 8 -45 112 102 13 98 -179 -174 133 177 -43 -65 -125 63 -54 43 -164 82 -295
4903 -295 131 -15 -159 28 196 34 23 183 285 -165 -149 -24 -80 12 -44 -27 -80 195 -88 -326 -12 -348
4925 -348 278 -234 -99 -320 35 -46 54 -115 62 147 -231 161 -164 221 192 -34 76 246 -86 -43 -5 -39
4947 -39 -2 174 13 186 20 -51 212 -43 22 402 7 -191 79 154 -85 50 13 -4 336 -402 93 -29
4969 -29 100 89 -13 88 7 13 27 35 -202 53 11 57 80 -38 86 -51 -192 43 43 -271 -12 -213 106 -141
4993 -141 27 232 109 143 164 87 -190 -110 -195 -145 -5 69 -58 -108 -81 -110 -375 4 -53 -141 108 -60 -106 60
5017 60 -91 44 -88 -54 -64 6 97 127 -219 80 84 334 182 117 65 78 -128 -10 76 -2 134 -53 17 -138 -423
5042 -423 -73 -20 20 8 -66 -216 246 -106 -19 -214 280 183 -156 61 103 -280 -112 158 117 -72 12 28 -205
5065 -205 -105 103 71 -31 -196 -186 1 -62 -182 -122 133 -88 27 -25 -84 -88 -98 -29 194 154 11 -83 -50 -67 -289
5090 -289 -37 -56 -221 58 41 21 28 -133 -178 92 199 235 94 -247 -155 110 191 192 174 -136 228 -182 -79 -225
5114 -225 51 -160 52 193 -278 -67 -288 108 -177 39 -132 -22 -96 20 149 227 -119 -2 139 -195 15
5135 15 40 160 -157 97 -91 -41 32 27 -230 -212 162 200 -290 -280 -53 100 116 19 -41 229 -122 100 42 -10 49
5160 49 -250 -84 302 266 50 170 43 -145 16 130 -106 -81 -41 -105 -163 355 37 279 44 41 141 73 -19
5183 -19 -18 309 -91 44 -26 -16 -64 108 -64 -156 -86 -112 109 80 -224 67 -68 -105 285 195 -128 11 -212 -35
5207 -35 73 -97 21 -21 -235 97 41 103 118 -47 380 -10 -60 47 122 225 193 -78 -29 86 -144 68 -234
5230 -234 8 -190 -164 -112 73 -171 262 88 21 47 50 71 129 98 -128 -272 -48 251 57 -335 24 121 313
5253 313 51 85 282 191 78 -231 338 67 -3 119 206 -152 -101 -151 85 -66 180 -12 -57 157 39 163
5275 163 56 -113 155 68 -210 -43 -90 120 41 31 -27 1 284 -98 -128 43 -183 -178 154 -96 75 -53 163
5298 163 -26 190 250 74 0 -168 18 -39 11 -15 283 -283 185 -18 -150 -247 -174 -197 26 72 33 -57 -205 -12
5322 -12 -128 182 59 -7 101 165 -147 124 -47 -118 37 12 -70 -334 130 -113 -144 -177 -44 458 -193 2 -35
5345 -35 -11 11 44 125 290 156 2 60 103 -247 -55 194 86 -85 -34 91 58 296 73 -62 -48 -23 61 -79
5369 -79 -52 -43 -21 34 -196 -29 -52 120 120 304 51 181 -13 109 -84 -115 -338 -30 80 243 186 344 -155 -216
5393 -216 13 -312 304 -172 -117 82 -247 204 0 26 3 27 -42 -220 63 -25 -161 -28 -82 357 95 87 374
5416 374 -181 81 138 5 14 141 -76 48 9 -15 208 59 -388 59 63 -39 20 -125 -65 -380 -268 48 192
5439 192 -210 -188 -31 -38 60 120 125 151 -50 -184 297 61 88 -210 -149 -65 -98 -242 -72 20 69 -99 203 25 292
5464 292 -68 -152 22 -124 289 -179 183 -211 117 -60 160 -180 0 140 -172 31 -55 -194 166 42 218
5485 218 -1 46 -68 34 104 -131 -160 -290 27 -24 -169 -70 105 -68 102 -64 -117 -194 -248 452 36 24 -76
5508 -76 -3 195 39 29 -58 195 -36 21 -79 -35 67 71 21 -198 -145 -28 8 10 -16 17 -190 257 9 -206 22
5533 22 93 -121 280 5 205 60 84 -35 -110 58 -136 216 -166 -204 63 -67 120 93 1 -132 -64 -131 -81
5556 -81 184 199 -37 -20 61 -164 156 -208 36 -206 -46 -12 83 -71 -77 -145 -243 -5 151 15 57 257 -70 268
5580 268 -2 179 70 -79 -209 4 -79 267 120 134 -137 75 111 -141 -62 186 44 117 205 279 -63 38
5602 38 128 -93 95 48 -43 94 210 15 -171 8 121 11 -248 -342 143 -122 -129 136 -6 -22 169 -70 -113
5625 -113 317 170 163 -82 102 -132 -129 8 31 -71 -138 76 -221 78 84 153 -38 118 407 -15 -95 -72 -82 -108
5649 -108 152 -91 25 50 142 -176 79 -8 153 -80 48 57 221 -52 67 56 -239 -156 89 232 -176 138
5671 138 -72 262 51 155 -181 -236 129 -112 83 -233 30 187 -181 -91 229 90 89 -142 185 -297 19
5692 19 -26 -73 -99 -181 -277 -4 -349 63 16 -142 -34 -426 87 289 218 159 -1 -164 110 78 -294 -177 125
5715 125 151 142 63 -67 121 -349 166 93 -272 -30 -134 73 -246 120 17 34 -226 -115 135 -8 -183 68
5737 68 -119 220 94 -77 -154 99 288 -100 2 49 -291 49 182 -49 120 219 -71 -24 -8 -81 81 -28
5759 -28 -84 20 122 -55 -25 -122 153 204 49 -111 165 -101 119 278 -139 -122 124 -110 -15 -102 61 -126 65
5782 65 -128 -31 143 350 73 -173 127 -10 53 57 -129 77 8 89 107 243 45 15 69 -281 22 171 -48
5805 -48 -204 -110 -52 101 -158 113 -146 -52 177 -21 208 -30 62 1 -25 42 -1 -34 -26 -128 -304 -53 51 -243
5829 -243 266 87 115 118 234 19 -177 198 -48 79 81 -3 21 12 -61 102 21 41 16 291 69 94 -78 -49 -48 156
5855 156 -83 -93 207 -86 -58 106 89 -228 58 -78 67 16 -108 -55 -99 -174 -122 -212 49 117 84 -233 41 -35
5879 -35 -5 -90 236 8 108 147 85 292 219 -125 -118 153 142 -239 85 5 -272 -214 -62 124 53 147 -60 -12 61
5904 61 -3 373 86 44 13 -118 -295 65 193 -30 0 -47 159 46 54 9 -156 -135 263 53 43 81 52 3 -65
5929 -65 295 -83 -254 4 -123 14 239 173 1 -64 -226 -97 -3 -177 39 40 -135 155 64 -95 -89 140 -91
5952 -91 130 -64 45 11 269 -93 88 57 -86 -116 -29 143 182 -144 171 8 47 170 38 -49 -152 -104 -143
5975 -143 167 -113 -83 16 -31 -92 -132 10 -377 -30 -309 80 -385 149 -286 72 -59 -132 -61 78 -200 -182 144
5998 144 86 -4 -6 182 -234 240 265 -165 -25 126 57 141 -68 -25 -204 42 167 -112 -23 60 -38 -24 20 6 -36
6023 -36 182 206 -125 3 145 22 84 149 -98 -185 -98 -119 127 -93 -109 -137 -174 -198 -83 55 184 302 268 149
6047 149 -144 375 57 -86 -64 141 -273 -96 14 8 38 -193 30 183 -30 -153 -94 23 -97 153 71 88
6069 88 -86 -83 -1 -138 31 -55 100 -113 194 132 120 10 -139 -38 -115 114 53 -312 -111 121 -79 -37 -43 82
6093 82 318 -254 57 22 -3 13 86 -37 -201 97 10 -2 84 163 198 -467 96 -55 -248 110 -7 76 -153 110
6117 110 45 228 20 -171 -162 -104 -159 -20 -30 -61 264 -181 3 -18 -163 50 2 177 285 -156 -31 96 -91
6140 -91 33 146 -178 -7 -13 -195 -70 -76 -30 -43 -98 -200 -72 -441 34 -37 -28 214 -98 -12 0 328 -83 169
6164 169 265 72 -219 95 -53 95 119 -267 -60 -20 -137 -90 161 -48 -208 228 180 91 17 -138 -47 105 61
6187 61 12 28 18 -250 110 97 -38 -22 -101 212 -118 55 85 -85 -78 91 -145 -30 39 -34 -64 271 240 42 -144
6212 -144 -89 -74 -123 -18 -148 67 90 -163 -233 -167 -162 67 97 -74 -15 -275 -39 351 28 -236 -89 271 14
6235 14 -103 23 -378 -2 72 -202 311 -103 217 366 -95 60 65 36 70 -40 4 1 -113 3 13 148 -354
6258 -354 -82 -307 -144 -117 60 13 78 149 122 137 159 -89 114 93 -29 32 -110 -3 -148 222 94 27 -7 -31
6282 -31 -27 175 41 174 129 -12 202 69 40 42 12 230 35 -160 286 44 -128 78 -193 -148 35 47 -92
6305 -92 -30 15 51 155 13 8 -47 -493 -9 148 -63 82 -114 -253 162 67 148 -128 161 -170 199 162 394
6328 394 171 260 -39 16 -289 91 -4 -32 -114 46 -54 -159 -292 -63 14 -189 202 -37 90 -70 76 106
6350 106 78 62 162 16 -58 -23 -126 -138 16 51 57 76 -63 33 212 -151 230 -4 120 -53 -224 65 -239
6373 -239 -29 -133 46 27 -285 -29 79 -61 56 196 -162 88 230 23 46 69 -150 51 -75 -126 -198 -7
6395 -7 -146 36 139 132 -47 69 -58 60 164 -30 208 17 -41 -127 364 -332 20 45 -353 38 125 70 74 -14
6419 -14 38 -133 -137 27 1 31 -69 8 99 140 93 -11 -231 177 15 -12 -33 -113 -175 124 -67 205 -156 323 -92
6444 -92 -14 -107 -94 15 -106 -149 -269 -52 -84 109 133 -179 -40 55 -224 417 -153 -57 -75 134 15 -86 35
6467 35 -24 183 185 -119 -59 -16 -61 265 58 -138 117 -109 37 278 -193 259 -93 24 294 176 -52 129
6489 129 213 -144 -40 219 20 84 -59 -148 248 75 99 36 -220 -95 -170 -121 -167 -51 -137 -10 138 -8 -167
6512 -167 -135 -110 -6 194 -14 190 231 308 129 61 55 -186 -206 108 -172 -272 113 -174 -17 122 -216 -58 -305
6535 -305 -88 -107 -36 105 -109 -93 81 45 -75 -83 -151 116 -55 69 -7 -168 47 42 -6 -48 -140 43 -186 118
6559 118 117 -271 198 -82 -27 -123 286 12 113 97 48 21 -160 26 46 113 -105 7 48 72 174 -107 96 10
6583 10 120 -91 -55 -92 -152 127 -63 131 27 50 -86 -44 -286 -326 -33 -68 -187 -119 -203 295 -227 99 -35
6606 -35 -161 153 495 27 2 164 -237 -360 -32 -236 -19 -115 -19 61 -310 -123 -38 -335 -164 60 99 -15
6628 -15 -161 -103 -64 85 32 -45 -33 30 -30 201 114 -93 -105 63 219 -43 62 -39 -20 198 24 -7 152 -81
6652 -81 -183 6 -69 61 343 275 321 104 -74 179 79 265 -126 -47 -260 -129 144 55 -112 307 -114 -269
6674 -269 -27 -28 -10 212 200 -19 197 -115 -40 -44 -12 103 130 89 -147 18 -125 176 -111 -27 -341 -124 -66 204
6698 204 192 -109 -128 57 -154 -75 92 6 98 91 110 -34 29 47 -32 221 64 -226 98 279 -52 382 -212 -35
6722 -35 93 -115 -137 -136 -63 116 114 221 -113 45 -60 -121 -161 -176 -123 53 217 26 -244 126 -142 87 141 140 102
6747 102 -246 -54 36 -33 -183 -61 194 -167 -72 142 65 339 105 79 -46 252 174 36 -111 149 287 139
6769 139 115 -121 -203 -113 -203 -69 66 -21 -42 -253 141 172 68 66 -10 -113 -143 228 -69 -29 -214 105 136 18
6793 18 190 105 -129 159 -32 21 -184 -117 307 -6 -55 -96 -109 -153 361 120 -116 30 -134 220 44 -92 165
6816 165 -57 -107 -124 59 -60 155 56 -245 86 95 85 -125 25 33 -8 -35 97 -127 184 -145 64 71 -41 -129
6840 -129 215 -130 -155 90 97 171 78 -94 7 -73 41 -238 -18 123 151 -111 -258 99 -110 66 11 241 -85
6863 -85 25 -204 -125 93 -143 67 235 -290 -7 94 -101 69 114 156 -58 166 123 -156 224 -259 -79 -121
6885 -121 -243 262 -250 -69 254 -137 4 -87 -10 33 1 -103 38 -244 -37 -58 121 41 -32 -251 -156 64 79
6908 79 -222 18 27 -128 -120 -156 -222 33 74 40 -115 63 166 -169 -157 -139 -208 132 -218 -109 48 135 -77 -3 67
6933 67 -32 15 81 -12 28 124 177 -205 -74 33 78 -44 -164 98 -192 55 -299 32 81 50 -65 17 207 121
6957 121 95 -22 -127 -193 -219 -207 -75 145 157 1 99 -34 17 -73 109 296 -92 -22 -178 211 -183 47 -38
6980 -38 235 152 -73 98 131 -89 108 -198 102 2 -29 2 83 -102 173 -202 -57 -222 -94 -323 13 -75
7002 -75 161 -101 9 136 -47 -57 -97 261 48 -48 107 101 59 113 -136 -180 -26 -77 11 122 45 51 12 -21 51 -81
7028 -81 56 6 -72 -107 -234 191 64 -114 141 170 -58 87 6 35 -58 36 -116 67 -170 115 -238 -78 47
7051 47 85 152 236 175 -95 257 33 -27 -330 235 79 -4 -61 -17 -132 -116 -77 -51 152 146 132 -198 -5 109 -191
7076 -191 201 -41 79 172 321 97 24 59 -188 26 -203 67 -267 59 -89 -160 -33 -22 -87 -5 -75 208 -124
7099 -124 -67 97 -103 -268 211 -7 -275 131 27 339 117 95 -166 -79 351 -24 21 -61 124 185 5 -77
7121 -77 -147 134 -108 -10 -280 25 183 114 -172 -159 -30 -31 -41 28 198 194 21 400 201 20 32 169 63 223
7145 223 -123 -56 239 -194 -35 9 19 -284 96 -27 -130 0 -26 -24 357 99 226 0 -82 -11 -158 234 -209
7168 -209 76 147 -43 -79 -148 -58 61 192 -156 -137 -89 282 -10 105 74 -73 -91 -278 -34 112 50 79 -79
7191 -79 2 -15 -134 42 91 -153 -45 -30 -295 194 26 -127 121 -99 -23 83 -13 231 174 -435 111 58 -233
7214 -233 -100 141 66 191 -124 -187 45 -6 -158 -14 114 74 -113 -33 48 122 112 168 -16 24 9 4 47 -13 -229
7239 -229 -8 34 135 16 -90 14 -126 -18 146 -51 -123 76 -77 -37 222 74 194 200 -226 58 169 -290
7261 -290 -141 -101 284 250 -61 -72 -196 3 -95 50 128 -72 230 29 163 -75 117 124 -127 -81 118 -89 -4
7284 -4 -183 -169 -28 144 -169 50 136 -10 -249 109 -38 31 1 85 96 45 200 -26 26 247 40 123 -111 -143
7308 -143 -304 -24 150 -83 179 -34 210 32 15 -168 500 -80 17 85 -98 14 -122 72 -26 34 -83 -82
7330 -82 -51 -167 -266 -76 23 -86 -73 75 95 1 -204 292 147 -257 -85 40 188 -251 26 107 -242 -65 7
7353 7 114 -165 -165 62 -62 195 -87 78 -241 -89 -26 182 -6 -189 -14 -138 83 126 106 -141 127 -126
7375 -126 -61 64 -131 102 118 189 -165 -147 187 85 -68 -253 -49 1 -113 -112 29 -122 -21 182 -191 -84
7397 -84 -54 173 157 13 -39 -41 58 17 -165 247 -9 11 -56 -8 -82 -103 -108 114 -57 125 43 -13 -100 176 68 -207
7423 -207 -252 -14 -195 139 165 -263 -217 216 26 -47 37 250 109 -75 83 -62 133 -257 -347 47 -22 12 141
7446 141 -119 3 -37 -44 -26 144 39 -2 -281 53 16 -161 54 -20 -56 -93 63 -150 155 -5 -134 66 -116
7469 -116 105 64 68 -124 73 -92 25 -322 -44 -258 -180 -18 14 -213 279 -184 -226 -25 -21 79 17 -133 -174
7492 -174 319 82 152 -97 237 66 110 -120 138 -124 35 11 -227 -229 -130 39 302 111 27 -268 -7 78 35
7515 35 132 18 255 143 -158 -1 79 -57 27 -11 222 -22 -203 -60 364 -250 -33 -209 195 16 68 188
7537 188 -137 193 248 123 16 7 -102 62 134 -169 -105 143 130 -14 -228 99 372 8 -79 -166 -47 76 157
7560 157 3 60 45 -128 45 50 119 -65 52 76 -48 61 -109 -15 81 92 160 36 106 -28 -203 108 151 146 -178
7585 -178 -347 -25 -71 -160 301 94 22 136 76 -43 -257 125 -181 -12 -122 -12 -27 5 -142 -112 93 11 145
7608 145 139 78 -24 -124 -51 261 -114 151 -60 -67 -248 68 41 144 -81 -213 66 -45 -174 -315 -23 20 24
7631 24 -55 -148 28 -42 118 156 -105 -17 140 35 221 100 90 -20 -388 161 -56 17 96 188 285 -66 -37 -236
7655 -236 -58 -81 112 99 145 47 71 53 110 54 92 -68 -137 39 -48 -94 -229 -159 -65 42 -29 25 32 -146 -45 -101
7681 -101 163 39 -197 182 -76 31 69 -30 -77 -122 -174 -266 16 27 -12 -149 123 47 -48 140 -121 -72 -132 -131 34
7706 34 30 18 69 138 192 107 -128 41 93 -169 -34 -139 106 -197 -121 193 114 -139 -123 150 140 -159 177 -301
7730 -301 -232 111 -106 -12 35 9 3 104 -36 -100 -37 -5 222 -126 -43 42 76 136 -16 64 22 119 264 -100 -122 99
7756 99 -20 59 191 -206 -232 189 -137 46 22 -34 -53 102 193 116 168 22 -41 236 58 -119 -307 192 179 33
7780 33 118 114 64 -114 242 199 155 30 215 94 -26 71 71 45 -163 -87 21 69 90 -163 14 169 -243 137 65
7805 65 -93 -132 86 -25 206 7 -7 23 -66 32 43 -131 190 -55 56 53 -73 -394 120 -3 107 278 128
7828 128 -17 -326 12 81 296 75 -63 -200 123 29 -271 47 51 -162 38 287 -16 124 -124 -64 207 -286
7850 -286 35 -53 298 -16 186 175 230 96 -114 38 -287 94 112 83 -98 -398 56 -86 -29 -36 165 295 -34
7873 -34 -93 108 -45 260 -113 -151 -45 -88 -71 -134 119 62 215 -11 50 -146 67 -316 51 -36 9 123 -27
7896 -27 105 236 -57 66 25 65 -23 123 96 -111 -37 -223 -63 -154 -89 -102 -156 -190 100 -168 107 123 -245 -197
7920 -197 140 88 -229 64 213 98 18 -27 -69 -138 -65 0 84 6 43 -20 -109 137 68 -145 86 -19 0 -87 -221
7945 -221 76 92 -187 113 112 -99 340 -72 180 -65 9 -277 -47 -71 -95 -111 124 -26 18 159 7 27 -9
7968 -9 134 -29 392 -66 -76 105 -27 79 69 -32 -4 -118 129 -18 111 60 373 206 83 78 -10 276 -8
7991 -8 67 -157 -94 191 -141 -66 84 29 -101 -40 36 61 -22 286 163 -153 -73 148 162 3 141 -113 37 -75
8015 -75 126 22 1 287 -94 81 179 24 59 136 -191 -61 -140 119 -258 14 -76 112 196 -110 -126 27 215
8038 215 157 155 -36 47 -211 132 47 -45 -30 71 -73 80 73 -66 -63 92 1 -95 5 -59 42 302 -215 -48 207
8063 207 262 -15 164 -153 -22 -28 -227 -12 188 -71 -86 98 -45 -29 -287 163 208 -4 260 -320 -199 15
8085 15 107 -106 78 172 -272 115 18 -314 16 92 255 37 -19 -58 -215 165 295 -166 77 -73 117 -12
8107 -12 248 43 -101 -186 192 -288 -101 -52 156 -20 -47 52 9 16 -221 -118 -122 172 265 -33 123 -85 100 -30
8131 -30 348 227 -25 -425 162 367 -60 254 -24 -268 61 104 -9 64 177 170 152 167 74 37 7 18 112 -109
8155 -109 119 -291 -220 -8 -61 37 -167 -20 404 249 -82 -187 -35 -61 -116 -44 -76 12 -109 16 85 250 183
8178 183 -228 46 -59 -161 85 -274 -152 -109 146 69 -66 46 184
8191A84
##END NTUPLES=NMR FID
##END=
