##TITLE=1H_Pr NCS-2Bn
 CDCl3, 8 sc, 
 6.08.2021
##JCAMPDX= 6.0         $$ Bruker NMR JCAMP-DX V2.0
##DATA TYPE= NMR FID
##DATA CLASS= NTUPLES
##ORIGIN= UXNMR, Bruker Analytische Messtechnik GmbH
##OWNER= root
$$ XWIN-NMR		Version 3.5
$$ Fri Aug  6 13:10:06 2021 Russian Standard Time (UT+4h)  she@DPX200
##.OBSERVE FREQUENCY= 200.131506
##.OBSERVE NUCLEUS= ^1H
##.DELAY= (6, 6)
##.ACQUISITION MODE= SIMULTANEOUS
##.ACQUISITION SCHEME= undefined
##.AVERAGES= 8
##.DIGITISER RES= 18
##SPECTROMETER/DATA SYSTEM= spect
##.PULSE SEQUENCE= zg30
##.SOLVENT NAME= CDCl3
##.SHIFT REFERENCE= (INTERNAL, CDCl3, 0, 15.7039)
##AUDIT TRAIL= $$ (NUMBER, WHEN, WHO, WHERE, WHAT)
$$ ##TITLE= Audit trail, XWIN-NMR		Version 3.5
$$ ##JCAMPDX= 5.01
$$ ##ORIGIN= Bruker BioSpin GmbH
$$ ##OWNER= she
$$ F:/spectra/data/she/nmr/H-F/1/audita.txt
$$ ##AUDIT TRAIL=  $$ (NUMBER, WHEN, WHO, WHERE, WHAT)
(   1,<2021-08-06 13:08:46.56 +0400>,<she>,<DPX200>,
      <created by zg, POWCHK disabled, PULCHK disabled
       configuration hash MD5:
       00 E9 B6 7A A2 85 ED C7 34 08 36 98 17 FE 4E 26
       data hash MD5: 16K
       71 B2 F2 4B 71 31 4E 7E 9B D2 FE E4 8D 5D 6D E5>)
$$ ##END=
$$ 
$$ hash MD5
$$ 25 AE 5E 28 E2 36 B3 98 2F 6C AD B5 40 DB 91 D0
##$RELAX= 
##$RELAX= 
##$RELAX= 
##$RELAX= 
##$RELAX= 
##$RELAX= 
$$ Bruker specific parameters
$$ --------------------------
##$DU= <F:/spectra>
##$EXPNO= 1
##$NAME= <H-F>
##$PROCNO= 1
##$TYPE= <nmr>
##$USER= <she>
##$AMP= (0..31)
100 100 100 100 100 100 100 100 100 100 100 100 100 100 100 100 100 100 
100 100 100 100 100 100 100 100 100 100 100 100 100 100 
##$AQSEQ= 0
##$AQ_mod= 1
##$AUNM= <au_zg>
##$AUTOPOS= <>
##$BF1= 200.13
##$BF2= 200.13
##$BF3= 200.13
##$BF4= 200.13
##$BF5= 200.13
##$BF6= 200.13
##$BF7= 200.13
##$BF8= 200.13
##$BYTORDA= 1
##$CFDGTYP= 0
##$CFRGTYP= 5
##$CHEMSTR= <none>
##$CNST= (0..31)
1 1 145 1 1 1 1 1 1 1 1 1 1 1 1 1 1 1 1 1 1 1 1 1 1 1 1 1 1 1 1 1 
##$CPDPRG= <>
##$CPDPRG1= <>
##$CPDPRG2= <>
##$CPDPRG3= <>
##$CPDPRG4= <mlev>
##$CPDPRG5= <mlev>
##$CPDPRG6= <mlev>
##$CPDPRG7= <mlev>
##$CPDPRG8= <mlev>
##$CPDPRGB= <>
##$CPDPRGT= <>
##$D= (0..31)
0 1.2 0 0 0 0 0 0 0 0.06 0 0.03 0 0 0 0 0.0002 0 0 0 0 0 0 0 0 0 0 0 0 
0 0 0 
##$DATE= 1628240925
##$DBL= (0..7)
120 120 120 120 120 120 120 120 
##$DBP= (0..7)
150 150 150 150 150 150 150 150 
##$DBP07= 0
##$DBPNAM0= <>
##$DBPNAM1= <>
##$DBPNAM2= <>
##$DBPNAM3= <>
##$DBPNAM4= <>
##$DBPNAM5= <>
##$DBPNAM6= <>
##$DBPNAM7= <>
##$DBPOAL= (0..7)
0.5 0.5 0.5 0.5 0.5 0.5 0.5 0.5 
##$DBPOFFS= (0..7)
0 0 0 0 0 0 0 0 
##$DE= 6
##$DECBNUC= <off>
##$DECIM= 32
##$DECNUC= <off>
##$DECSTAT= 4
##$DIGMOD= 1
##$DIGTYP= 9
##$DL= (0..7)
0 120 120 120 120 120 120 120 
##$DP= (0..7)
150 150 150 150 150 150 150 150 
##$DP07= 0
##$DPNAME0= <>
##$DPNAME1= <>
##$DPNAME2= <>
##$DPNAME3= <>
##$DPNAME4= <>
##$DPNAME5= <>
##$DPNAME6= <>
##$DPNAME7= <>
##$DPOAL= (0..7)
0.5 0.5 0.5 0.5 0.5 0.5 0.5 0.5 
##$DPOFFS= (0..7)
0 0 0 0 0 0 0 0 
##$DQDMODE= 0
##$DR= 18
##$DS= 0
##$DSLIST= <SSSSSSSSSSSSSSS>
$$ [...]
##$SUBNAM2= <"">
##$SUBNAM3= <"">
##$SUBNAM4= <"">
##$SUBNAM5= <"">
##$SUBNAM6= <"">
##$SUBNAM7= <"">
##$SUBNAM8= <"">
##$SUBNAM9= <"">
##$SW= 20.0188882624521
##$SWIBOX= (0..15)
0 0 2 0 0 0 0 0 0 0 0 0 0 0 0 0 
##$SW_h= 4006.41025641026
##$TD= 16384
##$TD0= 1
##$TE= 0
##$TE2= 300
##$TE3= 300
##$TEG= 300
##$TL= (0..7)
0 120 120 120 120 120 120 120 
##$TP= (0..7)
150 150 150 150 150 150 150 150 
##$TP07= 0
##$TPNAME0= <>
##$TPNAME1= <>
##$TPNAME2= <>
##$TPNAME3= <>
##$TPNAME4= <>
##$TPNAME5= <>
##$TPNAME6= <>
##$TPNAME7= <>
##$TPOAL= (0..7)
0.5 0.5 0.5 0.5 0.5 0.5 0.5 0.5 
##$TPOFFS= (0..7)
0 0 0 0 0 0 0 0 
##$TUNHIN= 0
##$TUNHOUT= 0
##$TUNXOUT= 0
##$USERA1= <user>
##$USERA2= <user>
##$USERA3= <user>
##$USERA4= <user>
##$USERA5= <user>
##$V9= 5
##$VALIST= <valist>
##$VCLIST= <CCCCCCCCCCCCCCC>
##$VD= 0
##$VDLIST= <DDDDDDDDDDDDDDD>
##$VPLIST= <PPPPPPPPPPPPPPP>
##$VTLIST= <TTTTTTTTTTTTTTT>
##$WBST= 1024
##$WBSW= 4
##$XGAIN= (0..3)
0 0 0 0 
##$XL= 0
##$YL= 0
##$YMAX_a= 748228
##$YMIN_a= -1117297
##$ZGOPTNS= <>
##$ZL1= 120
##$ZL2= 120
##$ZL3= 120
##$ZL4= 120
##$ABSF1= 10
##$ABSF2= 0
##$ABSG= 5
##$ABSL= 3
##$ALPHA= 0
##$AQORDER= 0
##$ASSFAC= 0
##$ASSFACI= 0
##$ASSFACX= 0
##$ASSWID= 0
##$AUNMP= <proc_1d>
##$AZFE= 0.1
##$AZFW= 0.1
##$BCFW= 1
##$BC_mod= 2
##$BYTORDP= 1
##$COROFFS= 0
##$CY= 11.3945322036743
##$DATMOD= 1
##$DC= 2
##$DFILT= <>
##$DTYPP= 0
##$F1P= 2.36226072786647
##$F2P= -0.459571619588291
##$FCOR= 0.5
##$FTSIZE= 0
##$FT_mod= 4
##$GAMMA= 1
##$GB= 0.15
##$INTBC= 1
##$INTSCL= 1
##$ISEN= 128
##$LB= 0.24
##$LEV0= 0
##$LPBIN= 0
##$MAXI= 10000
##$MC2= 0
##$MEAN= 0
##$ME_mod= 0
##$MI= 1.114404
##$NCOEF= 0
##$NC_proc= 0
##$NLEV= 6
##$NOISF1= 3.799351
##$NOISF2= 2.8
##$NSP= 1
##$NTH_PI= 0
##$NZP= 0
##$OFFSET= 15.70392
##$PC= 1
##$PHC0= -13359.37
##$PHC1= 17.60099
##$PH_mod= 1
##$PKNL= yes
##$PPARMOD= 0
##$PSCAL= 0
##$PSIGN= 0
##$REVERSE= no
##$SF= 200.130013532006
##$SI= 16384
##$SIGF1= 3
##$SIGF2= 2
##$SINO= 400
##$SIOLD= 16384
##$SREGLST= <1H.CDCl3>
##$SSB= 0
##$STSI= 0
##$STSR= 0
##$SW_p= 3612.71676300578
##$SYMM= 0
##$S_DEV= 0
##$TDeff= 0
##$TDoff= 0
##$TI= <>
##$TILT= no
##$TM1= 0
##$TM2= 0
##$TOPLEV= 0
##$USERP1= <user>
##$USERP2= <user>
##$USERP3= <user>
##$USERP4= <user>
##$USERP5= <user>
##$WDW= 1
##$XDIM= 8192
##$YMAX_p= 0
##$YMIN_p= 0
$$ End of Bruker specific parameters
$$ ---------------------------------
##NTUPLES= NMR FID
##VAR_NAME=  TIME,          FID/REAL,        FID/IMAG
##SYMBOL=    X,             R,               I
##VAR_TYPE=  INDEPENDENT,   DEPENDENT,       DEPENDENT
##VAR_FORM=  AFFN,          ASDF,            ASDF
##VAR_DIM=   8192,          8192,            8192
##UNITS=     SECONDS,       ARBITRARY UNITS, ARBITRARY UNITS
##FACTOR=    0.0002496,     1,               1
##FIRST=     0,             0,               0
##LAST=      2.0444736,     0,               0
##MIN=       0,             -1117297,        0
##MAX=       2.0444736,     748228,          0
$$ Real data points
##PAGE= N=1
##DATA TABLE= (X++(R..R)), XYDATA
$$ [...]
$$ plain form
1975 1353 1590 -60 -1589 -1109 422 1991 701 -1401 -1734 -22 1155 1329 -555 -1772 -1110 972
1991 972 1426 307 -1683 -1493 20 1248 894 -923 -1940 -1175 642 1135 1 -1793 -1405 -340 1118
2008 1118 362 -1362 -1967 -983 733 653 -477 -1686 -1707 -40 1081 353 -1368 -2026 -892 773 1024
2025 1024 -680 -2366 -1623 150 883 452 -1556 -1674 -550 930 824 -1092 -1832 -1376 336 1092 93
2042 93 -1280 -1370 41 1091 559 -86 -1568 -445 921 1705 205 -1106 -907 316 1932 809 -561
2059 -561 -1055 174 1467 1612 355 -599 -310 1019 2057 1242 -363 -575 476 1999 1829 660 -668
2076 -668 -3 1187 2218 1429 -109 -269 1050 2015 1681 593 -375 84 1747 2170 1384 -209 -283 893
2094 893 2100 1585 148 -546 289 1452 2008 549 -297 -341 1157 1865 1326 -237 -693 114 1373 1690
$$ packed form
1975A353K37j650j529M80J531J569j290k102l33J712J177J74j884j217O62K082
1991I72M54j119j990J90J513J228l54j817j017P65J817M93j134j794L88J065J458
2008A118p56j724o05R84J716q0j130j209k1J667J121p28j721o58J134J665K51
2025A024j704j686P43J773P33m31k008j18J124J480j06j916p40M56J712P56r99
2042I3j373r0J411J050n32o45j482J123J366P84j500j311J99J223J616j123j370
2059e61m94J229J293J45j257r54K89J329J038q15j605k12J051J523j70j169j328
2076f68O65J190J031p89j538j60J319R65l34j088r68M59J663M23p86j593p4J176
2094H93J207n15j437o94Q35J163N56j459q46m4J498P08n39j563m56Q07J259L17
$$ plain form
2112 1690 173 -971 -595 591 1544 1147 -388 -890 59 1011 1280 -223 -1188 -1187 317 1031 89 -1153
2130 -1153 -1586 -212 659 515 -742 -1603 -1150 66 660 -394 -1449 -1870 -404 651 -1 -964 -1794
2147 -1794 -1291 235 498 -572 -1759 -1681 -464 313 -474 -1412 -2137 -1260 28 33 -1232 -1792 -2040 -445
2165 -445 265 -502 -1758 -2118 -960 -38 -64 -1239 -1916 -1536 -428 -73 -395 -1820 -2008 -958 121 44
2183 44 -1150 -1807 -1514 -109 458 -709 -1389 -1525 -569 475 195 -1136 -1778 -1071 242 729 -308 -1252
2201 -1252 -1273 -405 828 384 -597 -1155 -243 687 979 157 -815 -795 445 1009 493 -212 -687 105 1064 1045
2221 1045 85 -642 74 848 1655 1009 -170 -635 704 1256 1077 376 -430 256 1120 1931 951 -335 -147
2240 -147 570 1374 988 313 -341 136 1095 1369 803 -406 -139 746 1598 968 70 -520 271 924 1460 534
$$ packed form
2112A690j517j144L76J186R53l97j535n02R49R52K69j503r65JJ504P14r42j242
2130a153m33J374Q71j44j257q61M53J216N94j054j055m21J466J055o52r63q30
2147a794N03J526K63j070j187P8J217P77p87r38p25Q77J288Nj265n60k48J595
2165d45P10p67j256l60J158R22k6j175o77L80J108L55l22j425j88J050J079p7
2183D4j194o57K93J405N67j167o80j36R56J044k80j331o42P07J313M87j037r44
2201a252k1Q68J233m44r81n58R12R30K92q22r72K0J240N64n16p05m75P92R59j9
2221A045r60p27P16P74Q07o46j179m65J339N52j79p01q06O86Q64Q11r80j286J88
2240a47P17Q04l86o75o54M77R59K74n66j209K67Q85Q52o30q98n90P91O53N36r26
$$ plain form
2260 534 -902 -239 537 1144 808 -280 -776 253 772 938 130 -671 -472 73 957 211 -556 -900 -330
2279 -330 610 779 -460 -794 -518 600 725 94 -965 -637 -48 561 517 -626 -736 -848 672 534 -103
2298 -103 -867 -877 -176 861 355 -554 -772 -565 641 630 60 -521 -824 395 623 322 -339 -803 -211 853
2318 853 652 -91 -567 -151 513 987 171 -284 -477 120 1051 718 61 -546 -570 580 1129 678 -399 -255
2338 -255 360 894 934 -211 -466 -231 523 1169 155 -532 -597 268 973 496 -229 -834 -149 567 1002 125
2358 125 -438 -379 178 675 334 -638 -421 -448 340 632 -190 -905 -594 446 439 351 -706 -1140 -149 409 383
2379 383 -166 -951 -709 84 305 89 -1233 -667 -344 222 105 -516 -965 -645 99 71 -480 -646 -846 -35
2399 -35 476 185 -803 -769 -521 -30 560 -355 -962 -806 -219 469 -184 -582 -692 -192 494 231 -221 -1004 -575
$$ packed form
2260E34j436O63P76O07l36j088m96J029N19J66q08q01J99N45Q84p46p67l44N70
2279c30R40J69j239l34K76J118J25o31j059L28N89O09m4j143j10j12J520j38o37
2298a03p64j0P01J037n06r09k18K07J206j1n70n81l03J219K28l01o61m64N92J064
2318H53k01p43m76M16O64M74q16m55j93N97R31l33o57o07k4J150N49m51j077J44
2338b55O15N34M0j145k55K35P54O46j014o87o5Q65P05m77p25o05O85P16M35q77
2358A25n63N9N57M97l41r72K17k7P88K92q22p15L11J040pq8j057m34R91N58k6
2379C83n49p85K42P93K21k16j322N66L23N66j17o21m49L20P44k8n51j66k00Q11
2399c5N11k91r88L4K48M91N90r15o07J56N87O88o53l98j10N00O86k63m52p83M29
$$ plain form
2420 -575 -100 616 432 -549 -661 -223 567 622 -128 -534 -389 87 604 74 -630 -457 -8 711 592 47
2440 47 -642 -225 502 768 296 -361 -184 -76 447 515 -77 -695 -262 428 748 394 -430 -409 14 719 530
2461 530 -187 -517 57 511 791 174 -654 -644 246 796 508 -391 -639 -113 408 208 19 -365 -122 393
2481 393 643 105 -410 -381 -126 262 197 -192 -312 -314 474 137 9 -494 -582 339 539 343 -214 -716 -146 351
2503 351 391 317 -401 -203 234 806 414 -338 -308 -181 391 774 176 -242 119 522 465 321 72 -319 -6
2524 -6 798 387 -57 -308 -130 213 741 417 208 -301 321 450 303 -141 -301 -254 374 582 64 -438 -542
2545 -542 -67 587 546 -21 -397 -277 358 419 189 -403 -468 202 321 398 -139 -462 -245 270 360 -353 -104 -340
2567 -340 -2 419 234 -243 -473 63 299 352 -53 -342 -235 51 425 52 -532 -408 -198 314 -36 -267
$$ packed form
2420e75M75P16j84r81j12M38P90N5p50m06J45M76N17n30p04J73M49P19j19n45
2440D7o89M17P27K66m72o57J77J08N23O8n92o18M33O90L20l54q24K1M23P05j89
2461E30p17l30N74M54K80o17q28J0Q90N50k88q99k48N26N21k00j89l84K43N15
2481C93K50n38n15K9K55L88o5l89j20kP88l37j28n03q8R21K00j96n57n02N70M97
2503C51M0p4p18J98M37N72l92p52L0J27N72L83n98m18L61M03n7j44k49l91L13
2524fQ04m11m44k51J78L43N28l24k09n09O22J29j47m44j60M7O28K08n18n02j04
2545e42M75O54m1n67l76J20O35O1k30n92o5O70J19P7n37l23K17N15R0p13K49k36
2567c40L38M21j85m77k30N36K36N3m05k89J07K86L74l73n84J24K10N12l50k31
$$ plain form
2587 -267 -399 -228 331 421 115 -218 -359 202 132 264 -223 -788 -156 261 412 66 -340 -411 44 369 114
2608 114 -543 -513 -218 367 317 -231 -387 -639 -356 324 -200 -586 -410 -115 67 411 -370 -383 -584 -246 -18
2629 -18 -32 -672 -668 -337 201 -33 -261 -619 -615 -43 -123 -256 -529 -567 -603 77 -15 -83 -493 -431 5 84 -286 -191 -348
2654 -348 -300 157 39 -318 -563 -461 112 95 -14 -137 -327 267 260 261 -140 -183 201 436 446 25 -153 -149 560
2677 560 674 271 98 -225 486 547 743 321 162 206 795 974 368 -132 -83 444 760 639 199 35 176
2698 176 672 573 337 288 98 115 611 704 110 -135 478 586 394 12 -44 99 318 628 231 11 191 168
2720 168 398 465 -19 -295 -300 101 197 479 102 -75 104 52 138 -1 -628 -92 10 -23 -185 -583 -241 223
2742 223 -116 249 -233 -326 -290 -194 194 72 -402 -385 -221 173 68 -496 -622 -416 -133 88 -46 -440 -321
$$ packed form
2587b67j32J71N59R0l06l33j41N61p0J32m87n65O32M17J51l46m06p1M55L25k55
2608A14o57L0K95N85n0n48j56k52K83O80n24l86J76K95J82L44p81j3k01L38K28
2629a8j4o40ML31N38k34k28l58MN72q0j33k73l8l6O80r2o8m10O2M36P9l70R5j57
2654c48M8M57j18l57k45J02N73j7j09j23j90N94pJm01m3L84K35J0m21j78MP09
2677E60J14m03j73l23P11O1J96m22j59M4N89J79o06n00M9N27L16j21m40j64J41
2698A76M96r9k36m9j90J7M96R3n94k45O13J08j92l82n6J43K19L10l97k20J80k3
2720A68K30O7m84k76nM01R6K82l77j77J79n2Q6j39o27N36J02l3j62l98L42M64
2742B23l39L65m82r3L6R6L88j22m74J7J64L94j05n64j26K06K83K21j34l94J19
$$ plain form
2763 -321 -312 -170 -126 -208 -474 -288 202 111 -198 -228 -407 -101 -75 93 -342 -423 -291 89 236 -141 -303 -193 -53
2786 -53 179 25 -201 -464 -195 -3 62 -317 -468 -492 13 21 -141 -356 -483 -270 -51 82 -214 -330 -302 -228
2808 -228 69 -192 -363 -373 -196 351 -194 -468 -394 -242 -93 172 -313 -308 -301 -161 159 67 -369 -353 -319 -84 51
2831 51 -274 -22 -260 193 76 78 -66 -251 -237 90 294 14 -7 108 82 215 201 108 29 -128 506 174 -20
2854 -20 -353 247 334 570 557 61 48 276 390 473 85 -48 187 291 369 352 104 265 191 370 182 78 -70
2877 -70 33 422 285 519 -26 -9 199 282 256 81 -142 189 304 71 -212 -46 -147 89 -8 48 -71 46
2899 46 -106 218 92 -110 -195 -83 172 170 -155 -219 -210 -81 63 528 -282 -353 -21 -48 -256 -288 -429 -155 -105 -108
2923 -108 -70 -87 -394 -199 83 -81 -87 -287 -366 -222 -110 60 -351 -326 -280 114 -206 -164 -199 -294 -40 22 261 -285
$$ packed form
2763c21RJ42M4q2k66J86M90r1l09l0j79L06K6J68m35q1J32L80J47l77j62J10J40
2786e3K32j54k26k63K69J92O5l79j51k4N05Qj62k15j27K13K19J33k96j16K8P4
2808b28K97k61j71j0J77N47n45k74P4J52J49K65m85NPJ40L20r2m36J6L4K35J35
2831E1l25K52k38M53j17Kj44j85J4L27K04k80k1J15k6J33j4r3p9j57O34l32j94
2854b0l33O00Q7K36j3m96j3K28J14Q3l88j33K35J04P8j7k48J61p4J79j88j04j48
2877g0J03L89j37K34n45J7K08Q3k6j75k23L31J15k33k83J66j01K36r7N6j19J17
2899D6j52L24j26k02q5J12K55kl25o4RJ29J44M65q10p1L32k7k08l2j41K74N0l
2923a08L8j7l07J95K82j64ok00p9J44J12J70m11K5M6L94l20M2l5r5K54O2K39n46
$$ plain form
2947 -285 -439 -348 89 -120 -165 -166 -179 -26 71 381 114 -309 135 295 -56 217 -26 61 -78 26 28 -103 -31
2970 -31 124 4 -69 19 100 28 202 489 -232 -38 -296 61 162 86 -200 -119 92 226 116 49 -187 -183 54
2993 54 128 -26 14 -335 193 13 87 -52 -142 -138 -14 265 -427 -1 -262 123 59 -118 227 -99 50 194 152
3016 152 282 231 -135 100 280 372 60 -310 3 -64 109 -209 235 255 -80 459 274 72 -51 255 193 -115
3038 -115 -242 -11 -112 -81 215 -34 -98 13 -16 250 45 -79 182 -172 66 323 143 54 28 68 207 274
3060 274 118 48 66 -10 88 -13 -6 109 120 -146 90 179 -5 214 169 72 -87 18 36 -100 138 185 -126 -240
3084 -240 -278 19 378 -52 -84 93 -7 168 180 114 -69 -231 72 181 -144 -386 -44 110 66 34 -225 -280
3106 -280 22 -22 -79 -224 -254 -85 97 153 -188 -285 -188 -46 -24 153 -38 -147 -323 107 -117 121 -248 -19
$$ packed form
2947b85j54R1M37k09m5jj3J53R7L10k67m23M44J60l51K73k43Q7j39J04Kj31P2
2970c1J55j20p3Q8Q1p2J74K87p21J94k58L57J01p6k86Q1K11J34j10o7k36MK37
2993E4P4j54M0l49N28j80P4j39r0MJ24K79o92M26k61L85o4j77L45l26J49J44m2
3016A52J30n1l66K35J80R2l12l70L13o7J73l18M44K0l35N39j85k02j23L06o2l08
3038a15j27K31j01L1K96k49o4J11k9K66k05j24K61l54K38K57j80q9k6M0J39O7
3060B74j56p0J8p6R8j01PJ15J1k66K36Q9j84K19m5r7j59J05J8j36K38M7l11j14
3084b40l8K97L59m30l2J77j00J75J2o6j83j62L03J09l25k42L42J54m4l2k59n5
3106b80L02m4n7j45l0J69J82N6l41r7R7J42K2J77j91j09j76M30k24K38l69K29
$$ plain form
3128 -19 -95 -53 25 12 11 -195 146 118 3 226 23 -21 19 -51 -1 -285 19 289 127 146 -111 128 105 -22 166
3153 166 25 156 -75 -121 191 13 -153 -138 76 363 204 28 24 94 73 183 -79 -244 -242 444 155 171 -212
3176 -212 37 155 44 -57 43 57 101 -27 183 -58 -125 -339 228 167 64 141 68 30 123 -210 -144 -147 30 -165
3200 -165 -420 -141 -212 -303 -176 -285 84 -143 -278 -217 -104 107 45 45 -126 162 -6 133 7 -218 -239 -194 -26
3223 -26 -278 -312 110 -289 128 -23 82 97 -99 -62 89 -165 -69 -229 55 354 54 15 -185 74 376 114
3245 114 154 -109 -79 -20 -32 213 -77 419 206 182 41 -3 -171 61 -22 26 24 220 -76 -281 79 -82 -195
3268 -195 65 -96 291 93 319 41 124 -175 118 23 73 50 67 71 14 185 181 -38 36 163 -129 117 7 -109
3292 -109 -6 187 -210 -92 -26 -165 157 288 -33 -269 42 191 29 -101 236 83 22 73 80 23 -102 29
$$ packed form
3128a9p6M2P8j3jk06L41k8j15K23k03m4M0p0N0k84L04K70j62J9k57K39k3j27J88
3153A66j41J31k31m6L12j78j66J5K14K87j59j76mP0k1J10k62j65KO86k89J6l83
3176b12K49J18j11j01J00J4M4j28K10k41o7k14N67o1j03P7p3l8R3l33O6lJ77j95
3200a65k55K79p1r1J27j09L69k27j35O1J13K11o2%j71K88j68J39j26k25k1M5J68
3223b6k52l4M22l99M17j51J05J5j96L7J51k54R6j60K84K99l00l9k00K59L02k62
3245A14M0k63L0N9j2K45k90M96k13k4j41m4j68K32q3M8kJ96k96k05L60j61j13
3268a95K60j61L87j98K26k78Q3k99K93r5N0k3J7Mn7J71mk19P4J27k92K46j10j16
3292a09J03J93l97J18O6j39L22J31l21k36L11J49j62j30L37j53o1N1Pn7j25J31
$$ plain form
3314 29 94 46 -102 -257 67 -185 -56 -38 -18 262 7 -236 -81 -134 -285 -62 195 52 -28 155 -94 233
3336 233 155 -11 8 -108 -79 19 212 50 -22 -108 -86 -187 -140 74 179 -40 -4 180 136 -20 -64 52 -43 -111
3360 -111 -285 -281 -232 121 -131 133 -97 6 -173 -19 55 72 -3 -122 86 295 -67 -15 140 -24 50 -43 157
3383 157 -165 125 56 -101 -53 -79 -203 223 42 -68 173 -268 178 22 -222 -36 -166 -193 109 102 230 100
3405 100 77 172 50 176 0 153 -101 -105 33 -58 -210 -1 -117 -90 119 11 -25 -46 157 382 87 4 228
3428 228 -33 -90 299 -30 281 -122 -97 -159 154 173 -15 154 174 23 -3 172 16 417 70 51 119 18 -314
3451 -314 71 98 -177 -84 68 -190 140 39 -152 63 -100 -114 -132 12 -160 -171 13 -38 -180 128 -62 -93
3473 -93 -105 -170 158 -266 -205 148 -67 -56 -6 -265 133 1 -30 -97 -48 -30 -132 -42 63 -219 -243 83 -73 -79 -183
$$ packed form
3314B9O5m8j48j55L24k52J29J8K0K80k55k43J55n3j51K23K57j43q0J83k49L27
3336B33p8j66J9j16K9R8J93j62p2q6K2j01M7K14J05k19L6J84m4j56m4J16r5o8
3360a11j74MM9L53k52K64k30J03j79J54P4J7p5j19K08K09l62N2J55j64P4r3K00
3383A57l22K90o9j57M8k6j24M26j81j10K41m41M46j56k44J86j30k7L02pJ28j30
3405A00k3R5j22J26j76J53k54mJ38r1j52K09j16K7K09j08l6k1K03K25k95q3K24
3428B28k61n7L89l29L11m03K5o2L13J9j88J69K0j51k6J75j56M01l47j9O8j01l32
3451c14L85K7k75R3J52k58L30j01j91K15j63j4j8J44j72j1J84n1j42L08j90l1
3473i3j2o5L28m24O1L53k15J1N0k59L98j32l1o7M9J8j02R0J05k82k4L26j56oj04
$$ plain form
3498 -183 -124 -205 -154 10 201 74 -125 263 13 192 -130 -60 39 141 -110 14 108 -106 65 287 -211 -100
3520 -100 -303 -185 52 -60 -44 109 141 -90 1 48 80 -103 47 102 182 61 92 -28 220 -1 270 277 -19
3543 -19 -119 -4 168 85 -88 154 204 108 -2 -1 294 -144 126 39 -137 -71 141 -192 158 93 -17 149 -68
3566 -68 -33 -42 -39 31 34 159 66 -125 193 52 -91 -37 56 -148 10 6 -27 -29 164 -249 103 28 64 -249 -35 -128 -45
3593 -45 -52 -132 51 -314 316 -299 173 126 -112 64 -231 -40 76 -113 -75 -258 -130 -145 87 32 199 139 340
3616 340 -60 -140 -39 33 157 -3 -60 -170 36 -149 127 -144 -185 -146 110 33 -54 -337 -251 70 71 16 -76 -101
3640 -101 -106 -66 -7 -61 -82 -329 -235 48 122 172 10 -16 -43 69 62 197 65 118 -171 -52 -158 -180 -57 -208 -5
3665 -5 -47 -266 75 -35 254 71 89 -115 52 118 -190 0 2 195 -6 -9 210 -43 -112 117 26 91 -38 -118
$$ packed form
3498a83N9q1N1J64J91j27j99L88k50J79l22P0R9J02k51J24R4k14J71K22m98J11
3520a00k03J18K37j12J6J53L2k31R1M7L2j83J50N5Q0j21L1j20K48k21K71Pk96
3543a9j00J15J72q3j73K42N0r6j10JK95m38K70q7j76O6K12l33L50o5j10J66k17
3566f8L5rLP0LJ25r3j91L18j41j43N4R3k04J58ml3kJ93m13L52p5L6l13K14r3Q3
3593d5pq0J83l65O30o15M72m7k38J76k95J91J16j89L8j83J28j5K32n5J67o0K01
3616C40m00q0J01P2J24j60n7j10K06j85K76k71m1L9K56p7q7k83Q6L21Jn5r2k5
3640a01nM0N9n4k1k47R4K83P4N0j62k6k7J12pJ35j32N3k89J19j06k2J23j51K03
3665em2k19L41j10K89j83J8k04J67O6l08J90KJ93k01lK19k53o9K29r1O5j29q0
$$ plain form
3689 -118 -172 220 29 263 41 135 288 -52 108 103 57 -104 182 -35 130 31 140 271 25 197 -14 135
3711 135 66 64 270 196 130 242 245 -121 -102 -209 -168 108 238 -144 133 -134 -54 139 208 220 -181 -116 8 34 -45
3736 -45 150 -25 194 -34 123 -94 -273 -16 -161 -51 -128 209 55 78 -33 -123 28 -87 -90 -140 -259 -21
3758 -21 -44 -148 14 -88 -4 -98 -211 -152 -155 -284 -79 117 15 -194 104 112 -166 25 207 41 -199 -264 -231 -84
3782 -84 228 -35 42 107 55 -210 173 149 83 -26 118 101 42 80 -100 140 -124 -49 98 208 50 -123 325
3805 325 143 87 146 229 10 70 31 504 64 151 150 -199 -58 -50 13 309 66 82 46 -20 169 246 175 281 485
3830 485 -126 275 128 115 211 -236 188 106 271 -63 -156 75 -34 164 113 -244 -198 37 -84 187 -27 117
3852 117 -116 45 154 244 -100 -152 74 218 196 130 210 -180 -111 153 16 -45 -63 -35 -141 57 -23 -109 -295 138
$$ packed form
3689a18n4L92j91K34k22R4J53l40J60nm6j61K86k17J65r9J09J31k46J72k11J49
3711A35o9kK06p4o6J12Ll66J9j07M1K76J30l82K77k67Q0J93O9J2m01O5J24K6p9
3736d5J95j75K19k28J57k17j79K57j45J10p7L37j54K3j11r0J51j15ln0j19K38
3758b1k3j04J62j02Q4r4j13N9lj29K05J96j02k09K98Qk78J91J82j66k40o5L3J47
3782h4L12k63P7O5n2k65L83k4o6j09J44j7n9L8j80K40k64P5J47J10j58j73M48
3805C25j82n6N9Q3k19O0l9M73m40Q7jl49J41QO3K96k43J6l6o6J89P7p1J06K04
3830D85o11M01j47j3R6m47M24q2J65l34r3K31j09J98n1l57M6K35j21K71k14J44
3852A17k33J61J09R0l44n2K26J44k2o6Q0l90O9K64j37o1j8K8j06J98q0q6j86M33
$$ plain form
3876 138 -221 -69 -125 -87 -6 -78 -124 -59 -248 -59 109 120 192 -94 78 -250 -81 19 129 -95 116 168 -317
3899 -317 -88 -263 3 -93 20 151 -109 -257 -11 -134 214 -48 -129 -124 15 -267 9 -27 -28 102 31 -99 -480
3922 -480 -328 128 142 -282 -19 74 -6 59 -71 71 81 -53 -64 175 -22 -57 0 -102 94 132 -44 -267 -175
3945 -175 -56 179 -116 -154 -44 1 -134 281 -89 -31 296 232 -113 89 -89 -102 57 83 57 54 68 -146 166
3968 166 -55 -219 36 -124 -229 118 136 -48 -176 50 20 122 -88 -294 140 23 469 -162 7 45 -197
3989 -197 2 -63 291 231 -221 -298 137 104 -91 -330 16 222 203 -218 -347 301 -24 -96 -123 -40 98 -63 -92
4012 -92 44 -174 83 -10 -70 88 -72 107 -214 -68 46 9 -152 90 -97 3 -94 120 -93 -142 -13 198
4034 198 -126 119 181 164 110 141 18 -86 -9 6 17 -108 -160 33 84 -11 34 184 50 -94 119 14 -78 -93
$$ packed form
3876A38l59J52n6L8Q1p2m6O5j89J89J68J1P2k86J72l28J69J00J10k24K11N2m85
3899c17K29j75K66r6J13J31k60j48K46j23L48k62q1NJ39k82K76l6jJ30p1j30l81
3922d80J52M56J4m24K63R3q0O5j30J42J0j34j1K39j97l5N7j02J96L8j76k23R2
3945a75J19K35k95l8J10M5j35M15l70N8L27o4l45K02j78j3J59K6k6lJ4k14L12
3968A66k21j64K55j60j05L47J8j84j28K26l0J02k10k06M34j17M46o31J69L8k42
3989a97J99o5L54o0m52p7M35l3j95k39L46K06j9m21j29O48l25p2k7Q3J38j61k9
4012i2J36k18K57r3o0J58j60J79l21J46J14l7j61K42j87J00r7K14k13m9J29K11
4034A98l24K45O2j7n4L1j23j04P7J5J1j25n2J93N1r5M5J50j34j44K13j05r2j5
$$ plain form
4058 -93 -21 -219 41 138 -2 -266 -109 -69 -110 -147 54 89 42 204 70 -56 152 -210 93 16 -78 126 -247
4081 -247 -109 73 -196 99 -81 -201 92 -76 280 -118 -189 -58 167 -49 36 21 269 1 -53 282 -101
4102 -101 169 34 201 12 -152 -137 -37 -38 150 -71 -182 -82 68 108 -4 103 -223 -47 -122 -95 -223 -107
4124 -107 116 -122 -18 -58 -45 -103 -69 215 78 -19 25 159 258 -111 -5 -60 40 -80 147 33 157 -282 -202
4147 -202 -70 45 124 -204 -74 -90 49 187 75 7 -120 262 38 200 206 -159 -304 -166 271 7 -228 296
4169 296 185 120 -17 94 -114 88 -12 -55 25 -120 283 -12 -106 61 -193 -422 168 108 261 -248 -108 206
4191 206 81 67 138 48 26 30 -82 97 -45 -138 -129 108 -51 156 22 77 -129 -19 -116 -26 63 -109 237 41
4215 41 10 0 61 -203 61 -85 178 178 181 -13 -32 -43 49 14 -111 -87 -7 -36 38 142 322 158 -15 -112 171 64
$$ packed form
4058i3P2j98K60R7j40k64J57M0m1l7K01L5m7J62j34j26K08l62L03p7r4K04l73
4081b47J38J82k69K95j80j20K93j68L56l98p1J31K25k16Q5j5K48k68n4L35l83
4102a01K70j35J67j89j64J5J00jJ88k21j11J00J50M0j12J07l26J76p5K7j28J16
4124a07K23k38J04m0J3n8L4K84j37r7M4J34R9l69J06n5J00j20K27j14J24m39Q0
4147b02J32J15P9l28J30j6J39J38j12o8j27L82k24J62Ol65j45J38M37k64k35N24
4169B96j11o5j37J11k08K02j00m3Q0j45M03k95r4J67k54k29N90o0J53n09J40L14
4191B06j25j4P1r0k2Mj12J79j42r3RK37j59K07j34N5k06J10r7R0Q9j72L46j96
4215D1l1j0O1k64K64j46K63%Lj94j9j1R2l5j25K4Q0k9P4J04J80j64j73r7K83j07
$$ plain form
4241 64 -381 -33 177 -47 -88 195 4 18 -32 -114 2 108 -24 -42 80 -163 -52 120 -28 -146 77 119
4263 119 41 104 -200 239 15 48 6 100 -42 141 -326 -139 -21 81 222 -145 186 -208 95 18 187 -136
4285 -136 -105 185 -53 61 51 119 118 -38 53 -26 -90 -127 244 -86 -42 89 212 -188 107 -198 -127 45 24 -75
4309 -75 -158 76 95 -209 149 110 -19 60 -33 -129 0 -187 -145 16 72 64 -125 -117 -71 -105 251 109 -153 -47 -207
4334 -207 7 163 -65 51 -98 -36 56 241 372 103 -41 -252 273 68 -161 229 79 91 -40 -122 100
4355 100 -61 -108 -224 -33 41 21 -68 43 37 163 195 -42 90 -60 -110 -49 11 13 -96 -16 153 47 45 -70 146
4380 146 5 -207 -100 -113 -41 -114 -375 161 -225 -98 -95 -4 58 26 166 46 35 148 -269 -264 -76 50 -65 -242
4404 -242 -121 82 -21 -108 71 -26 296 -132 108 -110 86 1 -5 -152 -197 -194 -35 -7 -56 -25 22 -99 -230 -51
$$ packed form
4241F4m45L48K10k24m1K83j91J4n0q2J16J06j32j8J22k43J11J72j48j18K23M2
4263A19p8O3l04M39k24L3m2R4j42J83m67J87J18J02J41l67L31l94L03p7J69l23
4285a36L1K90k38J14j0O8jj56R1p9o4l7L71l30M4J31J23m00K95l05P1J72k1r9
4309g5q3K34J9l04L58l9j29P9r3r6J29j87M2J61N6qj89QM6l4L56j42k62J06j60
4334b07K14J56k28J16j49O2R2J85J31k69j44k11N25k05k29L90j50J2j31q2K22
4355A00j61m7j16J91P4k0q9J11oJ26L2k37J32j50n0O1O0Kj09Q0J69j06kj15K16
4380A46j41k12J07j3P2p3k61N36l86J27LR1O2l2J40j20j1J13m17NJ88J26j15j77
4404b42J21K03j03q7J79r7L22m28K40k18J96q5oj47m5LJ59K8m9L1M7j21j31J79
$$ plain form
4428 -51 -71 -219 -301 124 -79 232 -53 -84 -204 -88 15 -165 -186 -174 -36 -95 -139 -42 112 15 -40 19 196 -276
4452 -276 177 -80 209 -137 -118 241 149 -108 22 174 -64 164 20 -121 -52 285 240 269 95 -10 195 -131
4474 -131 54 91 -140 321 47 -14 219 -26 151 49 169 -162 76 -134 -103 -76 221 120 -118 35 -222
4495 -222 13 62 -67 87 45 146 81 249 282 179 18 -250 68 145 149 101 -45 -117 -49 147 6 76 161 225
4519 225 -84 111 -42 26 172 113 134 -23 -153 -227 -284 198 102 226 51 -31 65 29 15 -138 53 -29 -159 -154
4543 -154 -131 14 -226 -26 17 183 -224 75 -79 -95 -7 -90 116 52 -112 78 -502 93 -71 -163 412 -85
4565 -85 59 -78 59 150 -45 -222 -66 -59 36 36 25 -333 -179 -19 15 -192 102 8 233 -55 -70 -103 -138 234
4589 234 12 -87 -136 -208 -188 -32 -27 118 -63 86 16 -99 80 203 -381 113 205 -179 -123 104 185 -101 187
$$ packed form
4428e1k0j48q2M25k03L11k85l1j20J16J03j80k1J2J38n9m4R7J54r7n5N9J77m72
4452b76M53k57K89l46J9L59r2k57J30J52k38K28j44j41O9L37m5K9j74j05K05l26
4474a31J85L7k31M61k74o1K33k45J77j02J20l31K38k10L1K7K97j01k38J53k57
4495b22K35M9j29J54m2J01o5J68L3j03j61k68L18P7Mm8j46p2O8J96j41P0Q5O4
4519B25l09J95j53O8J46n9K1j57j30p4n7M82r6J24j75q2R6l6j4j53J91q2j30N
4543a54K3J45k40K00M3J66m07K99j54j6Q8q3K06o4j64J90n80N95j64r2N75m97
4565h5J44j37J37R1j95j77J56PR5%j1l58J54J60L4k07K94r4K25k88j5l3l5L72
4589B34k22r9m9p2K0J56NJ45j81J49p0j15J79J23n84M94R2l84N6K27Q1k86K88
$$ plain form
4612 187 344 209 207 -143 2 216 15 347 -86 -191 -73 -33 -156 -61 -15 -4 122 50 88 46 94 150 -41 94
4636 94 13 -33 -69 231 58 172 5 -120 -93 56 -13 -30 17 2 -234 -107 216 -157 244 174 -172 235 -166
4659 -166 -9 -149 -109 -147 -14 149 149 54 73 39 3 -131 242 -182 -58 34 -117 -159 53 -55 51 -97 -1 54
4683 54 -10 73 -210 42 -214 -30 19 166 18 -188 69 66 147 -169 -166 -151 27 1 83 -276 -250 53 -4 -153 -68
4708 -68 20 -188 191 -259 -224 -85 -115 147 -103 -6 62 66 57 -53 47 -157 202 140 147 183 -175 -146 -106 244 -77
4733 -77 -197 292 30 -126 -81 114 122 -244 -16 209 154 306 -223 226 287 -106 352 -36 -75 28 58 52 108 27
4757 27 93 50 174 322 145 4 69 -44 -121 -162 16 -18 128 239 155 -169 28 217 34 139 65 -161 89
4780 89 276 134 61 -41 9 -109 -108 -26 198 -79 -183 3 163 -15 71 8 174 -105 -32 267 -94 -160 247
$$ packed form
4612A87J57j35kl50J45K14k01L32m33j05J18M0j23R5M6J1J26p2L8m2M8N6j91J35
4636I4q1m6l6L00j73J14j67j25K7J49o9j7M7j5k36J27L23l73M01p0l46M07m01
4659a66J57j40M0l8J33J63%r5J9l4l6j34L73m24J24R2j51m2K12j08J06j48R6N5
4683E4o4Q3k83K52k56J84M9J47j48k06K57lQ1l16LJ5J78k6Q2l59K6L03n7j49Q5
4708f8Q8k08L79m50L5J39l0K62k50R7O8Mrj10J00k04L59o2PL6l58K9M0L50l21
4733g7j20M89k62j56M5J95Ql66K28K25n5J52n29M49O1l93M58l88l9J03L0oN6q1
4757B7O6m3J24J48j77j41O5j13p7m1J78l4J46J11q4l24J97J89j83J05p4k26K50
4780H9J87j42p3j02N0j18JQ2K24k77j04J86J60j78Q6o3J66k79P3K99l61o6M07
$$ plain form
4803 247 135 -280 81 -194 142 15 -32 -210 -148 118 -46 191 -161 -119 -95 -189 -191 -81 -218 -146 23 17 -53 -103
4827 -103 -24 -245 -33 96 -126 186 48 9 -1 241 -49 63 87 -210 36 -131 -116 -5 145 63 -234 -105
4849 -105 146 24 -104 -202 105 296 67 -165 215 7 32 218 198 51 -133 26 -260 -71 120 -149 -43
4870 -43 137 74 -99 -247 -179 -254 -100 -69 -162 60 75 116 84 254 8 -20 -31 66 -125 102 95 143 33 2 202
4895 202 -243 292 -131 -108 -22 51 46 285 48 29 247 93 268 -193 47 29 60 -287 -233 88 64 103 218 48
4919 48 -102 234 140 -48 202 -54 12 73 62 -138 -13 -171 104 -181 0 47 -98 -134 146 -162 249 126
4941 126 109 -107 121 97 -36 -47 -83 -116 -257 53 -189 -77 84 69 -215 -83 2 -81 -178 204 230 71 137 -252
4965 -252 -10 -12 -76 47 86 111 109 -138 81 -8 -202 -117 357 -79 -243 216 -261 -119 230 70 318 68 265
$$ packed form
4803B47j12m15L61k75L36j27m7j78O2K66j64K37l52M2K4r4kJ10j37P2J69op0n0
4827a03P9k21K12J29k22L12j38l9j0K42k90J12K4k97K46j67J5J11J50q2k97J29
4849a05K51j22j28r8L07J91k29k32L80k08K5J86k0j47j84J59k86J89J91k69J06
4870d3J80o3j73j48O8p5J54L1r3K22J5M1l2J70k46k8j1R7j91K27pM8j10l1K00
4895B02m45N35m23K3Q6P3nK39k37j9K18j54J75m61K40j8L1l47N4L21k4L9J15j70
4919D8j50L36r4j88K50k56O6O1j1k00J25j58K75k85J81M7j45l6K80l08M11j23
4941A26j7k16K28k4j33j1l6l3j41L10k42J12J61j5k84J32Q5q3r7L82K6j59O6l89
4965b52K42ko4J23L9K5kk47K19q9j94Q5M74m36j64M59m77J42L49j60K48k50J97
$$ plain form
4988 265 213 -109 -132 36 135 157 167 40 110 196 143 201 27 -75 -151 115 97 -195 144 -154 72 330 -174 138
5012 138 -8 46 34 104 47 -127 146 -35 152 0 46 135 -125 -170 173 -145 -120 117 195 63 39 -154 22
5035 22 -26 13 38 -36 -75 -7 -127 -98 -64 249 -124 -156 -206 -126 66 -93 79 -18 -97 41 70 125 -90 145 -192
5060 -192 16 -84 31 65 126 -16 -193 -243 171 107 2 25 -241 30 110 160 75 -180 -52 44 -96 -6 -144
5083 -144 123 -120 153 23 -52 101 -134 -196 60 3 139 10 137 79 -36 -51 242 69 4 -130 7 -183
5105 -183 -120 -61 15 -55 -209 104 136 155 -64 -160 -118 -154 185 51 172 119 69 -54 45 -11 -217 -22 101 -2
5129 -2 -147 -245 46 -231 -154 -223 139 -97 -179 -108 -72 71 20 -85 291 77 277 199 110 -190 -142 44 144 147 -101
5154 -101 113 74 197 280 105 -233 -51 -361 71 -300 348 91 133 291 0 138 14 232 -35 136 11
$$ packed form
4988B65n2l22k3J68R9K2J0j27P0Q6n3N8j74j02p6K66j8k92L39k98K26K58n04L12
5012A38j46N4j2P0n7j74K73j81J87j52M6Q9k60m5L43l18K5K37P8j32k4j93J76
5035B2m8L9K5p4l9O8j20K9L4L13l73l2n0Q0J92j59J72r7p9J38K9N5k15K35l37
5060a92K08j00J15L4O1j42j77n0M14o4j05K3k66K71Q0N0q5k55J28R6j40R0j38
5083a44K67k43K73j30p5J53k35o2K56n7J36j29J27n8j15j5K93j73o5j34J37j90
5105a83O3N9P6p0j54L13L2J9k19r6M2l6L39j34J21n3n0j23R9n6k06J95J23j03
5129bj45r8K91k77P7o9L62k36q2P1L6J43n1j05L76k14K00p8q9l00M8J86J00Lk48
5154a01K14l9J23Q3j75l38J82l10M32l71O48k57M2J58k91J38j24K18k67J71j25
$$ plain form
5175 11 -114 263 167 -79 166 47 -213 -204 -33 67 156 81 -48 -33 -308 154 98 52 120 -179 -5 -71 234 45
5199 45 81 -18 91 14 -21 27 60 283 -26 46 -110 -36 106 29 2 -142 -113 -38 -73 27 -215 -44 315 -248 208
5224 208 81 78 9 -39 -50 -23 -137 7 -48 -8 68 103 193 -214 -82 -57 0 31 141 -59 148 -135 -178 -216 -201 153
5250 153 -222 27 196 36 -19 117 25 247 90 -24 -213 37 -4 51 -151 166 -60 214 304 13 42 400
5272 400 37 182 143 143 -66 81 -147 34 -98 37 40 -249 -153 -4 102 -38 -48 -69 14 242 -62 -292 146
5295 146 -60 36 68 32 149 -183 -91 -78 234 -188 -141 -7 122 192 -6 304 -161 224 215 67 -113 24 244
5318 244 -94 191 -137 -78 49 220 165 -170 228 77 -162 -39 -67 -90 -220 75 68 -137 2 -104 98 -4
5340 -4 -113 7 68 -45 -57 54 -71 6 -28 78 -43 -22 -137 46 -178 13 -101 86 -58 -110 -73 8 240
$$ packed form
5175A1j25L77r6k46K45j19k60RJ71J00Q9p5j29J5k75M62n6m6O8k99J74o6L05j89
5199D5L6r9J09p7l5M8L3K23l09P2j56P4J42p7k7j44K9P5l5J00k42J71L59n63M56
5224B08j27lo9m8j1K7j14J44n5M0P6L5R0m07J32K5N7L1J10k00K07k83m3l8J5L54
5250A53l75K49J69j60n5J36r2K22j57j14j89K50m1N5k02L17k26K74R0k91K9L58
5272D00l63J45l9%k09J47k28J81j32J35Lk89R6J49J06j40j0k1Q3K28l04k30M38
5295A46k06R6L2l6J17l32R2J3L12m22M7J34J29P0j98L10m65L85rj48j80J37K20
5318B44l38K85l28N9J27J71n5l35L98j51k39J23k8k3j30K95pk05J39j06K02j02
5340dj09J20O1j13j2J11j25P7l4J06j21K1j15J83k24J91j14J87j44n2L7Q1K32
$$ plain form
5363 240 29 29 177 -126 -130 50 58 17 -134 -17 116 -277 39 109 182 113 -5 117 -162 280 -48 -142 -162 -121
5387 -121 65 -14 -26 155 -132 -262 -22 197 62 266 248 60 -73 -14 25 -40 98 -131 76 29 104 -49 -4
5410 -4 136 168 137 -258 56 -113 -104 -42 195 -112 145 45 37 136 8 -16 111 -340 223 150 148 112 -65 172 98
5435 98 117 -34 51 -66 -115 -8 113 -83 38 62 -193 -141 89 -390 -244 24 -215 93 -248 -4 -142 -205
5457 -205 158 -125 184 -254 118 -125 9 81 102 -11 -70 -88 -198 -56 21 100 -16 -245 -89 -6 -27 271 2
5480 2 -125 -27 -194 -11 -18 -124 -157 -204 -85 215 70 -402 -191 68 5 -48 250 -88 95 183 -338 161 -25
5503 -25 -14 35 7 -25 -135 -3 114 118 150 -247 -52 -36 176 51 -54 -102 185 238 257 268 -180 3 5 198 26
5528 26 125 149 90 -87 18 185 -141 25 57 54 180 24 -141 92 131 -180 -58 139 158 -92 160 102 93 111
$$ packed form
5363B40k11%J48l03mJ80Qm1j51J17J33l93L16P0P3o9j18J22k79M42l28r4k0M1
5387a21J86p9j2J81k87j30K40K19j35K04j8j88j33N9L9o5J38k29K07m7P5j53M5
5410dJ40L2l1l95L14j69RO2K37l07K57j00qR9j28k4J27m51N63p3kl6j77K37p4
5435I8J9j51Q5j17m9J07J21j96J21K4k55N2K30m79J46K68k39L08l41K44j38o3
5457b05L63k83L09m38L72k43J34P2K1j13n9j8j10J42P7P9j16k29J56Q3k1K98k69
5480Bj27R8j67J83pj06l3m7J19L00j45m72K11K59o3n3K98l38J83Q8n21M99j86
5503b5J1M9k8l2j10J32J17ML2l97J95J6K12j25j05m8K87N3J9J1m48J83KJ93j72
5528B6R9K4n9j77J05J67l26J66L2lJ26j56j65K33L9l11J22J97J9k50K52n8rJ8
$$ plain form
5552 111 90 52 23 45 57 -457 -89 255 192 38 -389 214 98 -138 -183 -254 -98 -75 -129 25 -60 52 -157 39
5576 39 5 -147 114 63 -222 -381 -13 -120 99 -263 59 13 13 -41 34 -60 281 -85 105 -54 -106 38 13 -145
5600 -145 3 -261 90 11 -147 -198 -67 -176 -68 227 3 50 11 25 38 35 8 138 68 251 -32 75 31 158
5624 158 -136 -23 -65 -89 127 -62 81 240 168 92 -38 -67 8 -153 21 245 -17 18 27 191 136 -273 174
5647 174 340 71 -26 67 -29 -85 275 -90 83 -207 29 -230 104 -44 170 121 20 58 163 148 274 178 -72
5670 -72 -48 -44 49 -61 103 -164 -74 12 -31 43 33 -228 -107 92 -144 -107 -80 61 45 79 169 -118 -52 -151 -144 -77 194
5697 194 -163 174 279 163 102 -49 76 221 -76 -38 87 147 -360 147 26 -17 -260 -44 -83 -290 -215 -127
5719 -127 208 -11 -26 -112 -112 -220 -190 -22 -231 -127 288 -104 3 50 -136 33 251 -160 -100 -75 170 -258 -46
$$ packed form
5552A11k1l8k9K2J2n14L68L44o3j54m27O03j16k36m5p1J56K3n4J54q5J12k09J96
5576C9l4j52K61n1k85j59L68j07K19l62L22m6%n4P5r4L41l66J90j59n2J44k5j58
5600a45J48k64L51p9j58n1J31j09J08K95k24M7l9J4J3lk7J30p0J83k83J07m4J27
5624A58k94J13m2k4K16j89J43J59p2p6j30k9P5j61J74K24k62L5RJ64n5m09M47
5647A74J66k69r7R3r6n6L60l65J73k90K36k59L34j48K14m9j01L8J05j5J26r6k50
5670g2K4MR3j10J64k67R0Q6m3P4j0k61J21J99k36L7K7J41j6L4R0k87O6r9PO7K71
5697A94l57L37J05j16o1j51J25J45k97L8J25O0n07N07j21m3k43K16l9k07P5Q8
5719a27L35k19j5q6%j08L0J68k09J04M15l92J07M7j86J69K18m11O0K5K45m28K12
$$ plain form
5742 -46 127 8 -78 -139 -49 -371 242 -67 -28 -62 -293 171 -160 -79 206 173 -80 -17 -15 -61 -147 -47 72 96 88
5767 88 250 -50 13 -7 -115 -233 22 215 37 214 120 -57 -95 -119 147 32 161 -95 285 -87 -6 -39 -95
5790 -95 -154 132 -30 -94 187 -4 -122 -294 63 -145 56 -4 -140 58 104 3 -83 56 -116 5 88 -5 19
5813 19 9 -262 60 194 12 11 32 78 201 -15 -16 -224 -125 211 -78 -175 270 -135 141 222 -155 53 326 -221
5837 -221 -173 -109 308 202 189 236 40 -121 -27 -42 81 35 69 182 317 -118 -100 230 286 -36 -39 -26 -226 72
5861 72 71 -32 8 174 251 -117 91 -77 148 -228 -161 73 209 -45 -205 56 35 74 -50 -86 -9 -72 51 17
5885 17 -8 -75 -17 -22 39 -65 -187 -103 -27 119 -79 -78 -196 -173 -92 254 -285 -64 45 11 193 196 -76 96 -215
5910 -215 16 -231 -22 285 96 35 -12 78 -194 -65 -155 145 114 -22 57 -53 186 -47 143 -59 -154 88
$$ packed form
5742d6J73j19q6o1R0l22O13l09L9l4k31M64l31Q1K85l3k53O3Km6q6J00J19K4q
5767H8J62l00O3k0j08j18K55J93j78J77r4j77l8k4K66j15J29k56L80l72Q1l3n6
5790i5n9K86j62o4K81j91j18j72L57k08K01o0j36J98M6j01q6J39j72J21Q3r3K4
5813A9j0k71L22J34j82jK1M6J23k16jk08R9L36k89r7M45m05K76Q1l77K08K73n47
5837b21M8O4M17j06j3M7j96j61R4j5J23m6L4J13J35m35J8L30N6l22lJ3k00K98
5861G2jj03M0J66P7l68K08j68K25l76O7K34J36k54j60K61k1L9j24l6P7o3J23l4
5885A7k5o7N8nO1j04j22Q4P6J46j98Jj18K3Q1L46n39K21J09l4J82Lk72J72l11
5910b15K31k47K09L07j89o1m7R0k72J29r0L00l1j36P9j10K39k33J90k02r5K42
$$ plain form
5932 88 6 44 14 -135 -7 201 -21 126 215 144 115 -28 186 55 159 -156 70 38 -35 63 -161 24 -88
5955 -88 -187 -127 -87 97 98 -31 -2 172 -64 -211 -34 -48 92 -80 138 -14 4 174 -70 133 94 30 -94 18
5979 18 -182 -75 180 133 125 103 -188 -8 38 -101 -171 166 20 57 34 -125 -61 -101 40 179 -110 86 162 212
6003 212 37 8 177 103 77 54 -96 110 137 -136 102 -37 106 146 195 -80 -12 -128 -48 61 112 -73 -23 105
6027 105 -15 -144 16 117 297 -36 23 20 76 -208 155 -134 -21 115 -46 90 42 -298 -30 -13 55 -147
6049 -147 -96 -63 -16 102 -123 -156 -49 156 -40 243 10 -386 -194 -94 -357 134 -202 10 -43 -42 -91 -112 56
6072 56 -164 181 77 -143 -166 114 -19 -2 -280 -278 215 -115 -63 320 248 -69 145 -63 249 5 -189 40
6094 40 -142 -128 -119 103 83 -173 71 58 -158 15 -111 31 183 27 302 13 -23 -54 -157 33 -105 165 62
$$ packed form
5932H8q2L8l0j49J28K08k22J47Q9p1k9j43K14j31J04l15K26l2p3R8k24J85j12
5955h8r9O0M0J84Jj29K9J74k36j47J77j4J40j72K18j52J8J70k44K03l9o4j24J12
5979A8k00J07K55m7qk2k91J80M6j39p0L37j46L7k3j59O4m0J41J39k89J96P6N0
6003B12j75k9J69p4k6k3j50K06K7k73K38j39J43M0M9k75O8j16Q0J09N1j85N0J28
6027A05j20j29J60J01J80l33N9lN6k84L63k89J13J36j61J36m8l40K68J7O8k02
6049a47N1L3M7J18k25l3J07K05j96K83k33l96J92J00k63M91l36K12n3Jm9k1J68
6072E6k20L45j04k20k3K80j33J7k78KM93l30N2L83p2l17K14k08L12k44j94K29
6094D0j82J4RK22k0k56K44j3k16J73j26J42J52j56K75k89l6l1j03J90j38K70j03
$$ plain form
6117 62 -192 -71 114 304 -198 121 158 55 273 -12 193 17 -271 -84 191 57 124 434 210 -270 -31
6138 -31 215 138 -150 -105 -25 -88 -97 -218 58 84 -202 -134 -87 -9 -212 209 48 -141 43 -74 -92 97 77 -214
6162 -214 -120 67 78 93 246 -117 -118 94 -86 144 43 -101 -208 -330 -11 -171 -141 -162 37 305 6 28 -365
6185 -365 -74 -193 -57 172 -4 -268 -41 253 -121 -370 21 40 0 15 70 -49 -38 111 18 -5 -105 145
6207 145 33 97 136 17 247 -105 -320 -145 -55 -261 167 39 26 1 57 -68 63 291 62 79 89 219 155
6230 155 159 -33 -165 223 -129 -146 1 -67 -32 -83 -421 -93 55 114 73 170 77 14 203 29 -139 19 -363 131
6254 131 -16 114 98 -5 54 143 75 -31 -67 230 -78 66 -239 13 194 -123 -77 20 -15 -56 -42 -198 -53
6277 -53 138 -90 -71 -56 98 -35 131 -161 167 113 60 126 -94 261 15 217 36 -40 -71 77 41 -156 80
$$ packed form
6117F2k54J21J85J90n02L19L7j03K18k85K05j76k88J87K75j34O7L10k24m80K39
6138c1K46p7k88M5Q0o3rj21K76K6k86O8M7P8k03M21j61j89J84j17j8J89k0k91
6162b14R4J87J1J5J53l63jK12j80K30j01j44j07j22L19j60L0k1J99K68k99K2l93
6185c65K91j19J36K29j76k64K27K94l74k49L91J9m0J5N5j19J1J49r3k3j00K50
6207A45j12O4L9j19K30l52k15J75R0k06M28j28j3k5N6j25J31K28k29J7J0J30o4
6230A55Mj92j32L88l52j7J47o8L5n1l38L28J48N9m1R7r3o3J89j74j68J58l82M94
6254A31j47J30j6j03N9Q9o8j06l6K97l08J44l05K52J81l17M6R7l5m1J4j56J45
6277e3J91k28J9J5J54j33J66k92L28n4n3O6k20L55k46K02j81p6l1J48l6j97K36
$$ plain form
6300 80 60 106 -143 -132 -175 -102 55 -180 -90 148 -243 149 66 -99 118 494 -40 -98 43 -231 179 -60 90
6323 90 -191 41 20 -22 -21 182 -46 34 32 -282 -193 20 150 54 -40 77 -138 -131 -137 -159 -156 -98 -157 99 -53 -198 58
6350 58 -100 -240 -25 -190 251 10 262 -186 -105 -128 -156 -148 17 -235 12 175 -119 32 -10 9 -183 -7 -169
6373 -169 -14 44 -5 -211 -40 86 -25 -262 -202 134 80 35 120 105 69 17 -75 -160 183 -210 32 -202 -95 -163
6397 -163 150 -7 85 -163 -232 67 32 152 183 -284 87 361 38 76 -220 158 -101 141 -243 -88 261 -72
6419 -72 114 92 -193 -131 24 -26 211 -112 85 -118 63 225 -289 -255 284 -45 -41 28 53 29 23 115 -173 -54
6443 -54 -51 -56 29 137 -197 108 -157 -32 -239 128 -26 33 139 47 -27 173 170 19 -123 -76 -337 163 424 132
6467 132 -50 -91 -235 -45 -97 -11 -157 -124 197 -118 103 -192 -81 -16 -41 -130 80 12 92 -46 -84 -65 -123 -133
$$ packed form
6300H0k0M6k49J1m3P3J57k35R0K38l91L92q3j65K17L76n34n8J41k74M10k39J50
6323I0k81K32k1m2JK03k28Q0kl14Q9K13J30r6r4J17k15Pok2LN8n9K56j52j45K56
6350E8j58j40K15j65M41k41K52m48Q1k3k8QJ65k52K47J63k94J51m2J9j92J76j62
6373a69J55N8m9k06J71J26j11k37O0L36n4m5Q5j5l6n2r2q5L43l93K42k34J07o8
6397a63L13j57R2k48o9K99l5J20L1m67L71K74l23L8k96L78k59K42l84J55L49l33
6419g2J86k2k85O2J55n0K37l23J97k03J81J62n14L4N39l29MO9K5k4oR2k88J19
6443e4LnQ5J08l34L05k65J25k07L67j54N9J06r2p4K00lj51j42M7k61N00K61k92
6467A32j82m1j44J90n2Q6j46L3L21l15K21k95J11O5k5q9K10o8Q0j38l8J9n8j0
$$ plain form
6491 -133 -75 -136 -37 100 43 -164 129 -121 48 -182 -12 99 249 57 64 -125 220 148 -67 108 -35 -170
6513 -170 13 190 -83 40 41 91 147 -150 -43 118 -209 -195 -177 111 146 -59 -102 2 -126 315 -30 124 -103
6536 -103 29 129 -84 232 -179 -32 204 -235 142 42 -175 85 -79 -184 -172 -140 34 -5 -52 81 168 -24
6558 -24 -72 -61 -23 344 -154 170 199 72 100 -36 44 18 -240 -50 -68 -96 -274 -222 45 194 152 27 -77 66
6582 66 -112 13 66 -66 -24 -269 21 53 -30 218 -227 -141 189 190 99 242 113 -75 101 179 91 -7 38 -266
6606 -266 83 -42 -56 -163 348 32 -402 -328 82 -103 43 167 -66 80 -74 154 -92 -60 95 158 -119
6627 -119 123 191 -180 -200 44 -19 -25 59 -14 -45 52 107 43 -79 -181 -127 55 -79 36 -57 126 -51 50 -50
6651 -50 -21 43 -87 53 -241 -238 212 -182 -42 87 -226 34 99 -106 -104 28 168 145 15 146 171 65 52 -167
$$ packed form
6491a33N8o1R9J37n7k07K93k50J69k30J70J11J50j92Pj89L45p2k15J75j43j35
6513a70J83J77k73J23JN0N6k97J07J61l27J4J8K88L5k05m3J04j28M41l45J54k27
6536a03J32J00k13L16m11J47K36m39L77j00k17K60j64j05J2L2J74l9m7J33Q7j92
6558b4m8J1L8L67m98L24K9j27K8j36Q0k6k58J90j8k8j78N2K67J49m2j25j04J43
6582F6j78J25N3j32M2k45K90L2q3K48m45Q6L30Jr1J43j29j88J76P8q8r8M5l04
6606b66L49j25j4j07N11l16m34P4M10j85J46J24k33J46j54K28k46L2J55O3k77
6627a19K42O8l71k0K44o3oQ4p3l1R7N5o4j22j02N4J82j34J15r3J83j77J01j00
6651e0K9O4j30J40k94LM50l94J40J29l13K60O5k05KJ32J40k3j30J31K5j06j3k19
$$ plain form
6675 -167 30 211 133 111 144 106 -223 -72 -30 -320 -108 -115 -252 79 -21 194 83 290 99 -89 -6 -118 209
6698 209 352 101 -100 -230 -117 159 146 275 162 -178 41 59 -73 393 -128 -71 98 111 9 -68 -88 -45
6720 -45 -117 -132 79 -61 -257 -272 -73 132 116 -56 76 -130 58 70 153 -248 -86 202 -242 131 -238 28
6742 28 -82 -99 47 -142 -200 -72 -93 -43 79 62 -127 116 -39 -198 130 43 -127 48 -84 -21 -71 -29 -103 -162
6766 -162 -191 258 174 15 -30 -72 -171 -105 13 75 -53 -32 202 -146 2 -208 -196 -120 25 86 316 -243 132 234
6790 234 205 21 205 -46 293 102 38 95 -83 -144 -146 70 -215 -95 -93 -36 -68 -53 -48 128 -42 125 304 280 79
6815 79 65 -26 59 -138 -66 92 123 146 -62 21 -166 42 31 134 459 109 -224 113 -42 -116 -51 140 26 99
6839 99 99 6 -20 -159 -99 101 -426 -50 231 50 158 -163 75 38 127 141 -85 -64 247 -285 -45 22 -56 37
$$ packed form
6675a67J97J81p8k2L3l8l29J51M2k90K12pj37L31j00K15j11K07j91j88Q3j12L27
6698B09J43k51k01j30J13K76j3J29j13l40K19J8j32M66n21N7J69J3j02p7k0M3
6720d5p2j5K11j40j96j5J99K05j6j72J32k06J88J2Q3m01J62K88m44L73l69K66
6742B8j10j7J46j89n8J28k1N0J22j7j89K43j55j59L28q7j70J75j32O3n0M2p4n9
6766a62k9M49q4j59m5m2r9O6J18O2j28K1K34l48J48k10J2P6J45O1K30n59L75J02
6790B34k9j84J84k51L39j91o4N7j78o1kK16k85J20KN7l2J5NJ76j70J67J79k4k01
6815G9j4r1Q5j97P2J58L1K3k08Q3j87K08j1J03L25l50l33L37j55p4O5J91j14P3
6839I9%r3k6j39O0K00n27L76K81j81J08l21K38l7Q9J4k26K1L11n32K40O7p8R3
$$ plain form
6863 37 177 211 117 103 -127 -109 -170 39 17 186 -64 -108 114 97 -30 -43 78 100 62 -82 72 -13 58 -93 -120
6888 -120 17 36 -105 -85 -191 -123 27 -104 -67 -152 -189 -234 38 -102 81 -10 63 201 -135 98 46 -42 -130 -62
6912 -62 -55 -143 -19 9 -92 179 175 -178 124 163 47 -16 216 -39 -140 -168 -59 -133 17 94 15 -52 -126 153 -82
6937 -82 64 -10 34 57 -7 4 -85 205 -194 -80 101 -155 119 40 45 137 -9 -25 54 124 55 101 -27 98 -33
6962 -33 -308 28 260 -164 36 105 -119 86 157 -37 -22 173 -171 -57 -44 10 89 -23 -12 -98 164 -30 37
6985 37 -19 131 6 75 71 113 55 104 -19 -238 -100 105 -7 -259 294 -71 -112 -94 -132 34 109 186 104 64 194
7010 194 140 -13 118 12 241 -72 -96 100 -82 145 345 183 -294 -253 -125 48 -63 7 54 101 272 -128
7032 -128 -47 140 163 90 29 303 -57 16 -40 38 197 189 -76 -36 22 97 -113 116 -91 -68 272 -56 8 0 193
$$ packed form
6863C7J40L4r4j4k30J8o1K09k2J69k50m4K22j7j27j3J21K2l8j44J54q5P1j51k7
6888a20J37J9j41K0j06O8J50j31L7q5l7m5K72j40J83r1P3J38l36K33n2q8q8O8
6912f2Pq8J24K8j01K71ml53L02L9j16o3K32k55j01k8J09p4J50P7p9o7p4K79k35
6937h2J46p4M4K3o4J1q9K90l99J14J81k56K74p9NR2j46j6P9P0o9M6j28J25j31
6962c3k75L36K32m24K00O9k24K05P1j94J5J95l44J14J3N4P9j12J1q6K62j94O7
6985C7n6J50j25O9mM2n8M9j23k19J38K05j12k52N53l65m1J8l8J66P5P7q2m0J30
7010A94n4j53J31j06K29l13k4J96j82K27K00j62m77M1J28J73j11P0M7M7J71m00
7032a28Q1J87K3p3o1K74l60P3n6P8J59qk65M0N8P5k10K29k07K3L40l28O4qJ93
$$ plain form
7057 193 184 28 217 80 -81 88 -120 195 -145 -169 -117 -107 -69 -176 215 112 -20 60 -194 147 -46 -89 54
7080 54 117 72 6 -62 -115 -118 -21 216 156 -29 51 -123 37 237 188 130 -157 -39 33 -56 -44 40 6 -37 -81 -36 72
7107 72 -51 -66 -19 -58 -49 130 -131 8 203 -97 167 57 37 26 65 51 15 -90 1 190 225 186 -7 110 -184
7132 -184 97 188 57 194 149 -3 60 114 66 48 -136 40 -1 4 121 -5 19 169 -11 -155 158 -168 123
7155 123 -381 -187 19 222 -56 -241 110 -47 38 391 104 77 312 -141 -247 -48 121 58 218 7 -81
7176 -81 99 30 -89 -282 74 308 -191 -130 -131 102 53 250 130 -18 -26 225 32 -272 197 337 -14 15 -150
7199 -150 -13 -241 -22 74 163 169 -123 -409 -56 -126 243 70 31 43 10 -113 -82 -88 47 -210 -52 235 108 -95
7223 -95 18 34 20 211 113 -16 119 -196 -30 61 27 -122 1 -68 -187 -148 -154 338 88 27 124 395 -76 -118
$$ packed form
7057A93rj56J89j37j61J69k08L15l40k4N2J0L8j07L91j03j32Q0k54L41j93m3J43
7080E4O3m5o6o8n3lR7K37o0j85Q0j74J60K00m9n8k87J18P2q9J2Q4l4m3m4M5J08
7107G2j23j5M7l9RJ79k61J39J95l00K64j10k0j1L9j4l6j05R1J89L5l9j93J17k94
7132a84K81R1j31J37m5j52O3N4m8j8j84J76m1NJ17j26K4J50j80j44L13l26K91
7155A23n04J94K06K03k78j85L51j57Q5L53k87k7K35m53j06J99J69o3J60k11q8
7176h1J80o9j19j93L56K34m99O1jK33m9J97j20j48qK51j93l04M69J40l51K9j65
7199a50J37k28K19R6Q9Ok92k86L53p0L69j73l9J2l3j23L1oJ35k57J58K87j27k03
7223i5J13J6j4J91r8j29J35l15J66R1l4j49J23o9j19L9oM92k50o1R7K71m71m2
$$ plain form
7247 -118 186 171 113 44 -60 -6 -75 40 17 93 233 108 -160 -56 -25 42 223 104 67 227 -29 205 91
7270 91 174 42 -235 48 144 137 126 -70 -130 75 -33 97 -156 132 73 -283 -48 117 -13 -32 130 273 396
7293 396 43 135 -71 -124 -18 99 -134 175 9 -11 52 3 114 -11 46 -59 98 -245 141 46 -224 448
7315 448 -182 29 211 179 208 119 90 141 -177 273 -82 -98 -31 -241 112 -53 36 71 -128 -34 -102 74 183 -30
7339 -30 60 273 -94 -26 169 10 -59 160 -5 119 -218 223 -1 36 44 -82 -59 -359 -58 40 -74 33 -24
7362 -24 83 253 -151 26 353 -4 292 -59 -82 188 180 90 -55 240 -2 -227 60 -86 -40 -72 80 62 -31
7385 -31 176 22 -30 -85 -29 81 44 180 158 -116 -348 205 -89 -265 -85 48 -314 48 218 -423 -70 -6
7407 -6 95 -100 -30 -90 81 103 195 53 -162 166 152 -74 -2 -258 113 121 156 -12 14 -67 7 -124 66 -84 155
$$ packed form
7247a18L04j5n8o9j04N4o9J15k3P6J40j25k68J04L1O7J81j19l7J60k56K34j14
7270I1Q3j32k77K83R6pj1j96o0K05j08J30k53K88n9l56K35J65j30j9J62J43J23
7293C96l53R2k06n3J06J17k33L09j66k0O3m9J11j25N7j05J57l43L86r5k70O72
7315D48o30K11J82l2K9q9k9N1l18M50l55j6O7k10L53j65Q9L5j99R4o8J76J09k13
7339c0R0K13l67O8J95j59o9K19j65J24l37M41k24L7Qj26K3l00L01R8j14J07n7
7362b4J07J70m04J77L27l57K96l51k3K70qr0j45K95k42k25K87j46M6l2J52j8r3
7385c1K07j54n2n5N6J10l7J36k2k74k32N53k94j76J80J33l62L62J70o41L53O4
7407fJ01j95P0o0J71K2R2j42k15L28j4k26P2k56L71QL5j68K6q1P4j31J90j50K39
$$ plain form
7432 155 -158 125 378 266 242 20 -83 -88 21 -18 -214 171 -60 -295 -24 -2 169 205 161 -207 -90 -89 233
7455 233 -165 -18 110 -183 51 83 -29 255 -107 -90 -112 205 49 -115 -66 -18 70 15 447 83 -61 156
7477 156 49 197 141 -62 136 -70 -12 -280 110 25 -20 156 242 -2 15 164 -91 210 -7 -82 50 -65
7499 -65 58 -139 -36 -156 -80 -6 167 -131 68 -87 -168 354 4 149 -16 -21 61 -27 376 -45 128 -330 132
7522 132 43 264 -225 -108 246 134 78 67 176 -49 -149 -84 -27 -204 8 -136 33 -12 61 187 170 -11 101
7545 101 76 -169 -120 198 192 -74 -78 -61 77 8 83 182 -206 -274 -72 -47 134 -110 -109 70 113 152 -277 205 -7
7570 -7 181 -187 193 -265 65 29 2 -141 73 179 158 84 64 69 -221 189 -203 -17 60 323 -63 -355 183
7593 183 -176 -58 134 -154 175 -23 -217 -71 -92 -2 350 121 -40 58 -263 -64 68 -153 71 -61 108
$$ packed form
7432A55l13K83K53j12k4k22j03nJ09l9j96L85k31k35K71K2J71L6m4l68J17JL22
7455B33l98J47J28k93K34L2j12K84l62J7k2L17j56j64M9M8Q8n5M32l64j44K17
7477A56j07J48n6k03J98k06N8k68L90q5m5J76Q6k44J7J49k55L01k17p5J32j15
7499f5J23j97J03j20P6P4J73k98J99j55q1N22l50J45j65nQ2q8M03m21J73m58M62
7522A32q9K21m89J17L54j12n6j1J09k25j00O5N7j77K12j44J69m5P3J26j7j81J12
7545A01k5k45M9L18ok66mJ7J38o9P5R9l88o8K02K5J81k44JJ79M3L9m29M82k12
7570gJ88l68L80m58L30l6k7j43K14J06k1p4k0Nk90M10l92J86P7K63l86k92N38
7593A83l59J18J92k88L29j98j94J46k1R0L52k29j61R8l21J99J32k21K24j32J69
$$ plain form
7614 108 -25 288 6 -70 -84 147 -140 -169 254 -72 323 53 220 -8 -115 99 68 6 57 95 -52 59
7636 59 335 25 83 -108 -432 69 -156 -58 -57 10 -44 67 -164 -4 -97 61 168 -125 17 -35 -264 202 4
7659 4 -84 52 -239 123 -170 15 215 127 63 -242 -195 214 173 41 156 -288 42 -169 -8 25 23 -88 -102 25
7683 25 109 -147 -55 -132 7 3 -72 -62 13 101 -69 -103 -40 85 -38 141 -148 -250 -64 -97 -90 -26 -162 -297 -10
7708 -10 21 -11 -9 -180 257 43 92 -135 177 148 135 -166 -26 -109 86 9 141 -242 17 126 197 309 96 1
7732 1 -123 -606 205 -30 -133 121 -168 -46 -157 23 93 -48 -215 -65 -214 -135 -154 -125 -92 -39 121 -4 -40
7755 -40 108 -150 -17 -8 -248 73 -16 8 -40 87 -4 -135 -288 228 41 -152 -84 -197 10 170 -78 70 26
7778 26 265 229 21 -45 140 1 334 35 -77 -44 145 47 44 51 221 -2 -167 16 25 218 -3 201 -134 207
$$ packed form
7614A08j33L13k82p6j4K31k87k9M23l26L95k70J67k28j07K14l1o2N1L8j47J11
7636E9K76l10N8j91l24N01k25R8JO7n4J11k31J60r3J58J07k93J42n2k29M66j98
7659Dq8J36k91L62k93J85K00q8o4l05M7M09m1j32J15m44L30k11J61L3kj11j4J27
7683B5Q4k56R2p7J39mp5J0P5Q8j70l4O3J25j23J79k89j02J86l3PO4j36j35K87
7708a0L1l2Kj71M37k14M9k27L12k9j3l01J40q3J95p7J32l83K59J09P1J12k13r5
7732Aj24m83Q11k35j03K54k89J22j11J80P0j41j67J50j49P9j9K9L3N3J60j25l6
7755d0J48k58J33Rk40L21q9K4m8J27r1j31j53N16j87j93O8j13K07J60k48J48m4
7778B6K39l6k08o6J85j39L33k99j12L3J89r8lPJ70k23j65J83RJ93k21K04l35L41
$$ plain form
7802 207 124 -53 -189 -96 50 -176 -207 81 112 -26 277 -120 210 171 -18 -15 -16 -243 196 -171 -114 151 46
7825 46 51 15 66 34 -159 -5 -7 73 -120 -115 -343 -89 248 67 -133 -114 70 -97 -21 -96 87 -151 -62 -135 89
7850 89 55 -174 -260 -16 151 -125 -152 189 4 264 12 47 -154 63 293 51 -9 -9 -46 -227 -10 -168 -11
7873 -11 203 -236 -189 -278 -212 -74 25 -72 140 123 185 -28 59 -45 62 75 76 -70 -45 277 93 26 450 -53 -95
7898 -95 -29 291 -42 -150 98 -42 153 -98 -144 203 -92 158 47 -150 30 -170 24 -81 -220 270 -53
7919 -53 23 -62 -43 -26 155 274 -58 -71 125 158 87 32 -134 45 -42 283 -194 -22 127 -191 93 177 -141 -236
7943 -236 193 -229 48 -17 -5 153 208 -270 180 -116 -194 44 -68 -79 11 68 -191 178 118 -64 -28 -160 -193
7966 -193 -116 199 -130 119 50 43 -51 49 214 -165 -48 -125 -6 -189 205 -222 -153 -220 -22 447 66 -62 -60
$$ packed form
7802B07q3j77j36R3J46k26l1K88L1j38L03l97L30l9j89Ljk27M39l67N7K65j05
7825D6Nl6N1l2j93J54kQ0j93Nk28K54L37j81k00J9J84j67P6p5J83k38Q9p3K24
7850H9l4k29q6K44J67k76k7L41j85K60k52L5k01K17K30k42o0%l7j81K17j58J57
7873a1K14m39M7q9O6J38R9r7K12j7O2k13Q7j04J07J3Jj46K5L22j84o7M24n03m2
7898i5O6L20l33j08K48j40J95k51m6L47k95K50j11j97J80k00J94j05j39M90l23
7919e3P6q5J9J7J81J19l32j3J96L3p1n5j66J79q7L25m77J72J49l18K84Q4l18r5
7943b36M29m22K77o5J2J58N5m78M50k96p8K38j12j1R0N7k59L69o0j82L6j32l3
7966a93P7L15l29K49o9pr4J00J65l79J17p7J19j83L94m27O9o7J98M69l81j28K
$$ plain form
7989 -60 254 -72 -253 -89 -250 -117 -27 46 127 -47 -208 35 -78 -39 105 28 -260 120 -176 -343 17 -108
8011 -108 -133 233 -36 -68 47 184 37 63 33 -87 338 118 48 117 91 -86 -108 196 -44 140 266 73 54
8034 54 -77 -296 -61 -107 180 -76 16 113 -126 -48 -155 -103 -180 -103 -18 128 -106 156 -202 -145 153 331 236 -213
8058 -213 -6 -15 46 -100 11 47 7 72 -101 -143 138 -127 -50 -26 -353 -194 -117 44 -100 87 28 81 -65 -49
8082 -49 -60 -250 157 271 -44 -51 68 117 109 215 22 -15 196 -142 19 -278 -70 42 76 -43 92 -73 -117
8105 -117 -186 83 -10 -112 95 -110 -149 -242 217 -237 -183 -216 76 -185 -274 299 109 11 153 -413 -123 14 10
8128 10 9 95 17 88 151 58 -83 -5 41 150 229 88 34 146 -60 -141 -111 368 85 186 28 -66 3 -261 175
8153 175 -20 -42 -181 -207 -13 -55 -144 -87 -66 -208 -169 50 -124 -72 -54 -134 153 -89 -455 1 -73 -276 -131 15
$$ packed form
7989f0L14l26j81J64j61J33R0P3Q1j74j61K43j13L9J44p7k88L80k96j67L60j25
8011a08k5L66k69l2J15J37j47K6l0j20M25k20p0O9k6j77k2L04k40J84J26j93j9
8034E4j31k19K35m6K87k56R2R7k39P8j07N2p7P7Q5J46k34K62l58N7K98J78r5m49
8058b13K07rO1j46J11L6m0O5j73m2K81k65P7K4l27J59P7J61j44J87n9N3j46J6
8082d9j1j90M07J14l15pJ19M9qJ06j93l7K11l38J61k97K08J12L4j19J35j65m4
8105a17o9K69r3j02K07k05l9r3M59m54N4l3K92k61q9N73j90r8J42n66K90J37m
8128A0jQ6p8P1O3r3j41P8M6J09P9j41n4J12k06q1L0M79k83J01j58r4O9k64M36
8153A75j95k2j39k6J94m2q9N7K1j42L9K19j74N2J8q0K87k42l66M56p4k03J45J46
$$ plain form
8177 15 -213 43 -109 145 -139 -42 87 223 107 41 -90 44 40 -109
$$ packed form
8177A5k28K56j52K54k84R7J29J36j16o6j31J34mj49
8191a09
$$ Imaginary data points
##PAGE= N=2
##DATA TABLE= (X++(I..I)), XYDATA
$$ plain form
0 0 0 0 0 0 0 0 8 0 0 -8 8 -8 16 -16 24 -24 32 -32 48 -52 64 -72 88 -104 125 -142 166 -189 220 -249 286
31 286 -324 369 -415 470 -525 592 -659 738 -818 913 -1010 1121 -1239 1371 -1512 1669 -1837
48 -1837 2025 -2228 2458 -2707 2986 -3296 3649 -4043 4499 -5027 5645 -6383 7277 -8392
62 -8392 9827 -11741 14437 -18511 25354 -38957 76310 -400953 -1117297 -211255 103471
73 103471 -495203 -606495 -153793 -268540 -560638 -516356 -484636 -606754 -484257 -381484
83 -381484 -465416 -401960 -281173 -592147 -897314 -613057 -218797 -368550 -649796 -577472 -394028
94 -394028 -410019 -530251 -651687 -644896 -440423 -287345 -391667 -482372 -426163 -487436 -614518
105 -614518 -459845 -229532 -310004 -462828 -375981 -268358 -293757 -330329 -410919 -471620 -240761
$$ packed form
0@%%%%%%Qq%qJ6j6K4l2M0m8N6o4Q0j00J16j36J60j92K29k67L08l55M09m69N35
31B86o10O93p84Q85r95J117j251J397j556J731j923K131k360K610k883L181l506
48a837L862m253M686n165N693o282O945p692Q542r526J0672j2028J3660j5669
62h392J8219k1568K6178l2948M3865o4311J15267m77263p16344R06042L14726
73A03471n98674j11292M52702j14747k92098M4282L1720j22118J22497J02773
83c81484q3932O3456J20787l10974l05167K84257L94260j49753k81246P2324J83444
94c94028j5991j20232j21436O791K04473J53078j04322r0705N6209o1273j27082
105f14518J54673K30313q0472j52824Q6847J07623k5399l6572q0590o0701K30859
$$ plain form
116 -240761 37100 -119827 -397837 -290454 -122309 -217506 -224006 -52011 -70680 -185332 -71255
127 -71255 51025 -63431 -164450 -107276 -51349 26363 166846 132049 -89812 -114168 108645
138 108645 183839 42037 6548 122624 173692 153418 155105 118189 41049 65887 197768
149 197768 276343 235074 145561 94116 133369 223082 239697 166429 132324 197315 274273 274516
161 274516 194415 104853 109733 214382 287980 260895 198784 152178 143623 201509 251944 191582
173 191582 105363 138790 236560 254802 190728 117224 80265 115828 197030 224040 163569 91819
185 91819 83147 132877 171774 140845 64394 35787 99106 176594 160710 55882 -18416 18153
197 18153 101789 121955 72120 24210 12866 29489 56439 60020 11374 -46380 -29076 53696
$$ packed form
116b40761K77861j56927k78010J07383J68145r5197o500J71995j8669j14652J14077
127g1255J22280j14456j01019N7174N5927P7712J40483l4797k21861k4356K22813
138A08645P5194j41802l5489J16076N1068k0274J687l6916p7140K4838J31881
149A97768P8575m1269q9513n1445L9253Q9713J6615p3268l4105O4991P6958K43
161B74516q0101q9562M880J04649P3598k7085o2111m6606q555N7886N0435o0362
173A91582q6219L3427R7770J8242o4074p3504l6959L5563Q1202K7010o0471p1750
185I1819q672M9730L8897l0929p6451k8607O3319P7488j5884j04828p4298L6569
197A8153Q3636K0166m9835m7910j1344J6623K6950L581m8646n7754J7304Q2772
$$ plain form
209 53696 89927 21805 -73929 -90853 -24159 38979 25368 -50192 -94111 -48687 11282 -9120
221 -9120 -75878 -101073 -80544 -48132 -11225 -9887 -77407 -139577 -111597 -36360 -10101 -58879
233 -58879 -125132 -125963 -53031 -8844 -63495 -140844 -136549 -68587 -22469 -35972 -88055 -126885 -115772
246 -115772 -68732 -33434 -44966 -92549 -118929 -83134 -21825 -16155 -81487 -134027 -100084 -16268
258 -16268 13646 -42337 -103858 -94550 -38661 -3009 -16095 -56961 -76456 -47206 716 16794
270 16794 -13461 -59435 -69686 -18162 46033 39161 -29540 -61581 -18642 40833 48570 2814
282 2814 -37618 -17755 39585 64937 34467 -10673 -23977 9582 62173 76675 34652 -11826
294 -11826 -5529 45078 82130 58195 2011 -10466 39578 88562 76744 21454 -13036 10414
$$ packed form
209E3696L6231o8122r5734j6924O6694O3138j3611p5560m3919M5424N9969k0402
221i120o6758k5195K0529L2412L6907J338o7520o2170K7980P5237K6259m8778
233e8879o6253q31P2932M4187n4651p7349M295O7962M6118j3503n2083l8830J1113
246a15772M7040L5298j1532m7583k6380L5795O1309N670o5332n2540L3943Q3816
258a6268K9914n5983o1521R308N5889L5652j3086m0866j9495K9250M7922J6078
270A6794l0255m5974j0251N1524O4195o872o8701l2041M2939N9475P737m5756
282B814m0432J9863N7340K5352l0470m5140j3304L3559N2591J4502m2023m6478
294a1826O297N0607L7052k3935n6184j2477N0044M8984j1818n5290l4490K3450
$$ plain form
306 10414 65364 86795 52496 7768 466 34360 73778 71194 22515 -13020 11592 65608
318 65608 80670 39110 -12033 -15128 33975 73385 52636 1035 -20565 4749 45629 55500
330 55500 17031 -26021 -21278 22887 51491 31013 -17487 -41552 -11981 35691 39589 -4476
342 -4476 -43444 -34773 9749 35493 6681 -41756 -52239 -16484 21257 19835 -21079 -58029 -46458
355 -46458 -172 20994 -6668 -48342 -57633 -21574 18158 9948 -38310 -65614 -41357 2912
367 2912 18456 -11048 -54340 -59721 -17680 17789 5423 -35349 -56959 -33505 9173 20270
379 20270 -14643 -50656 -44635 -3235 26986 12467 -30753 -50243 -20131 21493 26807 -5831
391 -5831 -37926 -31081 10196 36859 16290 -24318 -34715 -3221 35292 37719 -290 -30638 -14165
$$ packed form
306A0414N4950K1431l4299m4728p302L3894L9418k584m8679l5535K4612N4016
318F5608J5062m1560n1143l095M9103L9410k0749n1601k1600K5314M0880R871
330E5500l8469m3052M743M4165K8604k0478m8500k4065K9571M7672L898m4065
342d476l8968Q671M4522K5744k8812m8437j0483L5755L7741j422m0914l6950J1571
355d6458M6286K1166k7662m1674r291L6059L9732q210m8258k7304K4257M4269
367B912J5544k9504m3292n381M2041L5469j2366m0772k1610K3454M2678J1097
379B0270l4913l6013O021M1400L0221j4519m3220j9490L0112M1624N314l2638
391e831l2095O845M1277K6663k0569m0608j0397L1494L8513K427l8009l0348J6473
$$ plain form
404 -14165 26885 43971 21971 -13142 -21794 9828 45635 41754 3843 -21070 -5027 33989
416 33989 52188 25754 -14183 -16137 20651 51175 40528 1846 -19453 2613 41673 49846
428 49846 18328 -14150 -11768 21166 47083 34983 -2358 -20109 1687 35123 42299 12415
440 12415 -23013 -19073 21182 45213 23005 -16850 -27878 -410 31868 30444 -3424 -28029
452 -28029 -17466 12226 27627 10515 -23207 -33556 -7691 21981 19259 -13299 -39692 -29712
464 -29712 7795 26927 -1011 -40032 -40538 -6444 18332 6632 -26471 -41953 -23403 5306
476 5306 11605 -10620 -37432 -39644 -12208 14709 7082 -27902 -46847 -27317 9505 18627 -12829
489 -12829 -45302 -36338 1296 19731 -311 -30334 -36240 -13286 13028 12394 -12217 -32371 -26180
$$ packed form
404a4165M1050J7086k2000l5113q652L1622L5807l881l7911k4913J6043L9016
416C3989J8199k6434l9937j954L6788L0524j0647l8682k1299K2066L9060Q173
428D9846l1518l2478K382L2934K5917j2100l7341j7751K1796L3436P176k9884
440A2415l5428L940M0255K4031k2208l9855j1028K7468L2278j424l3868k4605
452b8029J0563K9692J5401j7112l3722j0349K5865K9672k722l2558k6393R980
464b9712L7507J9132k7938l9021n06L4094K4776j1700l3103j5482J8550K8709
476E306O299k2225k6812k212K7436K6917p627l4984j8945J9530L6822R122l1456
489a2829l2473Q964L7634J8435k0042l0023n906K2954K6314o34k4611k0154O191
$$ plain form
502 -26180 1192 21734 9582 -22815 -34747 -9163 23461 24046 -7544 -32953 -17345 20450
514 20450 31210 4651 -20554 -16612 7466 26753 22391 -1789 -19123 -6994 21549 34258
526 34258 15179 -13433 -17203 11321 37131 28580 -2870 -19177 509 33236 37096 7241 -16137
539 -16137 -6325 21099 33922 22069 -2742 -14753 1792 28434 32670 9070 -14945 -11887 16556
552 16556 35888 19486 -11869 -19271 5197 30242 25948 -3002 -21572 -8858 17541 25877 9023
565 9023 -15380 -21126 -538 22224 17243 -9150 -25363 -14355 10815 20362 793 -25302 -25967
578 -25967 -1510 17433 8899 -17578 -32501 -16563 9827 13525 -8579 -29351 -26770 -4385 12825
591 12825 3205 -23776 -33114 -13518 8175 8141 -11524 -29935 -25130 -1729 13545 2284 -23335
$$ packed form
502b6180K7372K0542j2152l2397j1932K5584L2624N85l1590k5409J5608L7795
514B0450J0760k6559k5205L942K4078J9287m362k4180j7334J2129K8543J2709
526C4258j9079k8612l770K8524K5810q551l1450j6307J9686L2727L860k9855k3378
539a6137R812K7424J2823j1853k4811j2011J6545K6642M236k3600k4015L058K8443
552A6556J9332j6402l1355p402K4468K5045m294k8950j8570J2714K6399Q336j6854
565I023k4403n746K0588K2762m981k6393j6213J1008K5170R547j9569k6095o65
578b5967K4457J8943q534k6477j4923J5938K6390L698k2104k0772K581K2385J7210
591A2825r620k6981r338J9596K1693l4j9665j8411M805K3401J5274j1261k5619
$$ plain form
604 -23335 -32522 -12388 13697 12671 -13272 -29831 -18469 5535 16132 1235 -21571 -22872 -569
617 -569 16445 11358 -6669 -19399 -11618 12023 24390 9249 -13757 -15382 6725 27634 23190
630 23190 -2072 -15366 2352 27422 29899 10323 -6502 -1065 20397 33450 24614 5990 -980
643 -980 10131 30036 37187 20799 -235 1919 26560 43216 30560 5087 -1082 19891 41235
656 41235 35804 14273 2452 10977 30408 39408 26226 6537 3888 18803 34404 34789 16829
669 16829 -1136 4363 28904 39241 20489 -3217 -2657 18481 33778 22998 715 -7557 5582
682 5582 21660 22922 8571 -7627 -8738 5839 19507 14208 -6557 -19101 -8411 13098 15539
695 15539 -6023 -24458 -18888 1637 10467 -2977 -23434 -27426 -13002 1148 -1445 -16865 -29921
$$ packed form
604b3335r187K0134K6085j026k5943j6559J1362K4004J0597j4897k2806j301K2303
617e69J7014n087j8027j2730P781K3641J2367j5141k3006j625K2107K0909m444
630B3190k5262j3294J7718K5070K477j9576j6825N437K1462J3053q836j8624o970
643i80J1111J9905P151j6388k1034K154K4641J6656j2656k5473o169K0973K1344
656D1235n431k1531j1821Q525J9431R000j3182j9689k649J4915J5601L85j7960
669A6829j7965N499K4541J0337j8752k3706N60K1138J5297j0780k2283q272J3139
682E582J6078J262j4351j6198j111J4577J3668n299k0765j2544J0690K1509K441
695A5539k1562j8435N570K0525Q830j3444k0457l992J4424J4150k593j5420j3056
$$ plain form
708 -29921 -27602 -11466 -533 -11379 -31699 -37084 -21984 -4896 -7520 -28298 -42545 -32121 -11188
721 -11188 -7552 -23570 -38847 -38310 -23902 -11115 -15087 -31920 -42237 -33024 -15681 -9709 -23121
734 -23121 -39793 -39200 -20759 -7400 -14730 -33201 -40133 -26919 -8895 -7819 -22971 -34846 -30242
747 -30242 -14046 -3895 -9965 -25238 -30544 -17718 -1711 193 -13466 -26843 -21506 -1285 8637
760 8637 -2872 -18509 -18971 -4118 9608 8953 -5045 -14451 -6318 10017 16611 7880 -5945 -7476
774 -7476 7805 22798 19669 3126 -4733 5694 23224 27944 15258 1423 4023 20262 30836
787 30836 25808 11215 4724 15320 30624 33046 20225 7827 10299 25748 37145 29210 11885
800 11885 7920 20888 34545 33495 19420 8218 13646 28372 34309 24893 11593 8123 18606
$$ packed form
708b9921K319J6136J0933j0846k0320n385J5100J7088k624k0778j4247J0424K0933
721a1188L636j6018j5277N37J4408J2787l972j6833j0317R213J7343N972j3412
734b3121j6672N93J8441J3359p330j8471o932J3214J8024J076j5152j1875M604
747c0242J6196J0151o070j5273n306J2826J6007J904j3659j3377N337K0221R922
760H637j1509j5637m62J4853J3726o55j3998r406Q133J6335O594q731j3825j531
774g476J5281J4993l129j6543p859J0427J7530M720j2686j3835K600J6239J0574
787C0836n028j4593o491J0596J5304K422j2821j2398K472J5449J1397p935j7325
800A1885l965J2968J3657j050j4075j1202N428J4726N937r416j3300l470J0483
$$ plain form
813 18606 31561 30015 14714 4771 10567 24648 30125 19191 4304 2637 15899 26272 21231
826 21231 6546 -1192 5363 18632 21077 9266 -3468 -3045 8109 17804 12483 -3392 -10845 -1945
840 -1945 11704 12750 -864 -13438 -10953 2652 9850 1520 -12233 -16321 -7899 3823 4228 -9155
854 -9155 -20327 -16084 -2968 3651 -4521 -18773 -22457 -11277 890 -1657 -15083 -23507 -18190 -5273
868 -5273 97 -9286 -21769 -22620 -10919 -967 -4086 -16466 -23696 -17252 -3802 -128 -9810 -21471
882 -21471 -21135 -8829 1337 -3451 -16347 -21347 -12590 -679 1400 -8651 -18926 -16419 -3597
895 -3597 4046 -1381 -13175 -17487 -8225 4519 4942 -6606 -15369 -11101 1512 7795 1588 -10441
909 -10441 -12730 -1746 9276 6740 -4184 -11113 -6029 6776 11665 3550 -7460 -8134 2491 11968
$$ packed form
813A8606J2955j546j5301r943N796J4081N477j0934j4887j667J3262J0373n041
826B1231j4685p738O555J3269K445j1811j2734M23J1154R695n321j5875p453Q900
840a945J3649J046j3614j2574K485J3605P198q330j3753m088Q422J1722M05j3383
854i155j1172M243J3116O619q172j4252l684J1180J2167k547j3426q424N317J2917
868e273N370r383j2483q51J1701R952l119j2380p230O444J3450L674r682j1661
882b1471L36J2306J0166m788j2896n000Q757J1911K079j0051j0275K507J2822
895c597P643n427j1794m312R262J2744M23j1548q763M268J2613O283o207j2029
909a0441k289J0984J1022k536j0924o929N084J2805M889q115j1010o74J0625R477
$$ plain form
923 11968 9899 -1451 -7974 -1451 10619 13396 4650 -5258 -4455 6338 14559 10530 -881 -5770
937 -5770 1212 12641 14347 4703 -5100 -2643 8192 14786 9998 -1113 -5428 2813 13548 13138
951 13138 2870 -5348 -1824 8884 14371 7278 -3895 -5881 3042 12098 10967 190 -7481 -3307
965 -3307 7650 11601 3645 -6793 -7484 1300 9475 6780 -4401 -10556 -4770 5337 7893 -548
979 -548 -10454 -10169 -714 6520 2319 -8030 -12908 -7047 2469 3965 -4904 -13582 -11993 -2547 3628
994 3628 -923 -11556 -15463 -7809 1462 1519 -7718 -14758 -12494 -2560 3279 -3161 -12688 -14705 -6467
1009 -6467 1955 1317 -8228 -14578 -10143 81 3913 -2156 -11203 -12184 -3290 5440 3381 -6585 -10973
1024 -10973 -5590 3849 7174 141 -8239 -7402 2292 9254 6342 -2653 -6787 -180 9658 11455 3713
$$ packed form
923A1968k069j1350o523O523J2070K777q746r908Q03J0793Q221m029j1411m889
937e770O982J1429J706r644r803K457J0835O594m788j1111m315Q241J0735m10
951A3138j0268q218L524J0708N487p093j1173j986Q923R056j131j0777p671M174
965c307J0957L951p956j0438o91Q784Q175k695j1181o155N786J0107K556q441
979e48r906K85R455P234m201j0349m878N861R516J496q869q678J589R446O175
994C628m551j0633l907P654R271N7r237p040K264R934N839o440r527k017Q238
1009f467Q422o38r545o350M435J0224L832o069r047r81Q894Q730k059r966m388
1024a0973N383R439L325p033q380Q37R694O962k912q995m134O607R838J797p742
$$ plain form
1039 3713 -3771 -1846 7300 14041 10190 940 -1768 5508 14308 14934 6711 -315 2815 13212 17371
1054 17371 11276 3297 1770 8726 16777 16452 7885 1501 5245 14156 17767 12148 3401 2131 10221
1069 10221 17475 14662 5765 992 4990 14142 16313 8658 337 1263 8672 14497 11227 1914 -2252
1084 -2252 2637 10733 11391 3841 -3602 -2951 5177 10742 5669 -3443 -6531 -580 6353 6316 -1725 -8737
1100 -8737 -6264 1885 5052 69 -8200 -10409 -4031 3077 1702 -6958 -12038 -9175 -1511 1840 -3647
1115 -3647 -12016 -12856 -5634 454 -1888 -9781 -14396 -10245 -2095 -738 -6531 -13471 -13220 -5887 165
1130 165 -2825 -11305 -14648 -8915 -1267 -451 -6317 -13511 -11945 -3570 1338 -2597 -10433 -12623 -6622
1145 -6622 900 1111 -5964 -11331 -8516 -879 3195 -794 -8548 -9881 -3015 3848 3171 -4028 -8931
$$ packed form
1039C713p484J925R146O741l851r250k708P276Q800O26q223p026L130J0397M159
1054A7371o095p979j527O956Q051l25q567o384L744Q911L611n619q747j270Q090
1069A0221P254k813q897m773L998R152K171p655q321R26P409N825l270r313m166
1084b252M889Q096O58p550p443O51Q128N565n073r112l088N951O933l7q041p012
1100h737K473Q149L167m983q269k209O378P108j375q660n080K863P664L351n487
1115c647q369q40P222O088k342p893m615M151Q150J357n793o940K51P333O052
1130A65k990q480l343N733P648Q16n866p194J566Q375M908l935p836k190O001
1145f622P522K11p075n367K815P637M074l989p754j333O866O863o77p199m903
$$ plain form
1160 -8931 -5590 2320 5483 759 -6422 -6640 2 6135 4532 -2383 -6598 -2294 5283 7301 1548
1175 1548 -4793 -4277 2882 8179 5495 -1549 -4762 65 6838 8126 2375 -3881 -2685 4628 8877
1190 8877 5649 -1599 -3816 1203 8015 8353 2043 -3661 -1654 5577 9073 4830 -2274 -3712 2416
1205 2416 8245 7424 670 -4196 -1110 5741 8636 3827 -3064 -3501 2418 7917 6319 -305 -4242
1220 -4242 -1295 5765 7562 2068 -3837 -3542 2298 7346 5122 -2067 -5029 -850 5624 6673 1478
1235 1478 -4461 -3721 2521 7010 4134 -2777 -5227 -759 5573 5897 -51 -4975 -3256 3059 6453
1250 6453 2766 -3617 -4926 110 5976 5606 -1099 -5839 -2913 3701 6384 1870 -4005 -4880 290
1265 290 5888 4567 -1701 -5415 -2346 4027 6129 1135 -4675 -4686 1396 5946 3967 -2322 -5451 -1785
$$ packed form
1160h931L341P910L163m724p181k18O642O133j603o915m215M304P577K018n753
1175A548o341N16P159N297k684p044l213M827O773J288n751o256J196P313M249
1190H877l228p248k217N019O812L38o310n704K007P231L496m243p104j438O128
1205B416N829q21o754m866L086O851K895m809o891m37N919N499j598o624l937
1220d242K947P060J797n494n905K95N840N048k224p189k962M179O474J049n195
1235A478n939P40O242M489k876o911k450M468O332L24n948m924J719O315L394
1250F453l687o383j309N036N866l70o705m740K926O614K683m514n875q75N170
1265B90N598j321o268l714L069O373K102m994n810j1O082M550j979o289l129L666
$$ plain form
1281 -1785 4805 5973 235 -5095 -3735 1747 5947 3350 -2964 -5242 -829 4808 5310 64 -4982
1296 -4982 -3783 2698 5895 2375 -3622 -4880 -312 4950 4603 -1252 -5622 -2761 3021 5696 1564
1311 1564 -4252 -5364 216 5308 3442 -2171 -5679 -2820 3016 5236 588 -4975 -4872 511 4635
1326 4635 2813 -3220 -6010 -2566 3012 3961 -801 -5482 -5249 224 4598 1797 -4356 -6259 -2528
1341 -2528 2959 3066 -2006 -6472 -5338 680 3548 381 -5254 -6828 -2800 2674 2188 -3125 -7041
1356 -7041 -4948 238 2773 -406 -6168 -6846 -2049 2469 1512 -3725 -7305 -4779 986 2905 -1468
1371 -1468 -6278 -6197 -1209 2390 1208 -4448 -7395 -3667 1589 3079 -1696 -6465 -5585 -342 3091 698
1387 698 -4259 -6486 -2963 2419 3266 -1701 -5988 -4561 733 3596 926 -4201 -5762 -1227 3215
$$ packed form
1281a785O590J168n738n330J360N482M200k597o314k278M413N637N02n246n046
1296d982J199O481L197l520n997j258M568N262l47n855m370K861N782K675m132
1311A564n816j112N580N092j866n613l508K859N836K220m648n563J03N383M124
1326D635j822o033k790L444N578R49m762m681K33N473M374k801o153j903L731
1341b528N487J07n072m466J134O018K868l167n635j574M028N474m86n313l916
1356g041K093N186K535l179n762o78M797M518r57n237l580K526N765J919m373
1371a468m810Q1M988L599j182n656k947L728N256J490m775m769Q80N243L433k393
1387F98m957k227L523N382Q47m967m287J427N294K863k670n127j561M535M442
$$ plain form
1402 3215 2986 -1530 -5238 -3457 1748 4553 1243 -4051 -4470 -480 4184 3282 -1077 -4486 -1899 3208
1418 3208 5195 1419 -3079 -3323 1289 5424 4057 -1078 -3586 -468 4616 5992 1949 -2528 -2191
1433 -2191 2842 6517 4192 -440 -2409 655 5655 6188 1980 -1608 -604 3878 6868 4471 -504
1448 -504 -1734 1779 6760 6092 1914 -1520 -200 4688 7256 4126 -494 -1469 2625 6514 5867 1247
1464 1247 -2039 585 5236 6652 3075 -1276 -1524 2648 6183 4956 302 -2666 111 4350 5475
1479 5475 1508 -2610 -2151 1892 4985 2934 -1453 -3976 -1106 3365 3774 -293 -4365 -3403 969 3540
1495 3540 904 -3711 -5113 -1789 1918 2063 -2371 -6334 -4708 -115 2037 -1086 -5351 -6123 -2607
1510 -2607 948 212 -4163 -7358 -4976 -859 877 -2251 -6407 -6770 -2929 483 -878 -5171 -7290
$$ packed form
1402C215k29m516l708J781N205K805l310n294m19L990M664r02m359l409K587N107
1418C208J987l776m498k44M612M135j367n135k508L118N084J376m043m477L37
1433b191N033L675k325m632j969L064N000N33m208l588J004M482K990k397m975
1448e04j230L513M981o68m178l434J320M888K568l130m620r75M094L889o47m620
1464A247l286K624M651J416l577m351k48M172L535j227m654k968K777M239J125
1479E475l967m118M59M043L093k051m387k523K870M471M09m067m072R62M372K571
1495C540k636m615j402L324L707J45m434l963J626M593K152l123m265p72L516
1510b607L555p36m375l195K382M117J736l128m156l63L841L412j361m293k119
$$ plain form
1525 -7290 -4949 -513 631 -2941 -6867 -6411 -2059 907 -801 -4843 -6755 -3969 77 1010 -2695
1540 -2695 -6183 -5146 -1053 1962 -363 -4440 -5608 -2117 1579 1578 -2082 -5194 -3518 756 2612 429
1556 429 -3628 -4242 -851 3047 2585 -1458 -3669 -2085 2324 3761 1095 -2633 -2738 844 4324 3272
1572 3272 -731 -2788 -1015 3204 4025 1227 -2137 -1929 1543 4470 3061 -945 -2455 241 3677
1587 3677 4483 934 -2315 -1235 2418 4668 2753 -1019 -1992 547 4510 4105 721 -2114 -732 2987
1603 2987 4976 2651 -1316 -1743 1240 4473 3906 557 -2121 -583 3316 4972 1923 -1398 -1545 1677
1619 1677 4923 3992 -60 -1888 416 3598 4722 1879 -1263 -1068 2609 5062 3532 121 -1417
1634 -1417 647 4117 4769 1683 -1419 -620 2618 4747 3359 -146 -1318 952 4526 4310 1001 -1562
$$ packed form
1525g290K341M436J144l572l926M56M352K966j708m042j912K786M046R33l705
1540b695l488J037M093L015k325m077j168L491L696jl660l112J676M274J856k183
1556D29m057o14L391L898m62m043k211J584M409J437k666l728j05L582L480j052
1572C272m003k057J773M219Q21k798l364K08L472K927j409m006j510K696L436
1587C677Q06l549l249J080L653K250j915l772r73K539L963m05l384k835J382L719
1603B987J989k325l967m27K983L233n67l349k678J538L899J656l049l321j47L222
1619A677L246r31m052j828K304L182J124k843l142J95L677K453j530l411j538
1634a417K064L470O52l086l102P99L238K129j388l505j172K270L574k16l309k563
$$ plain form
1650 -1562 -617 2896 4699 2735 -557 -1514 1348 4194 3837 541 -1862 -240 2965 4338 2024 -1125
1666 -1125 -1704 1155 4055 3158 -243 -2279 -519 2617 3615 1324 -2271 -1858 1110 2827 2046 -1086
1682 -1086 -2744 -680 2437 2727 -301 -2820 -2478 614 2327 1039 -2182 -3619 -1270 1694 1670 -1189
1698 -1189 -3879 -2916 90 2217 -107 -3458 -4174 -1478 1160 962 -2109 -4223 -2923 -159 1450 -719
1714 -719 -3941 -4133 -1469 1099 527 -2942 -4443 -2889 154 1106 -1207 -3995 -3870 -1078 1177 149
1730 149 -2711 -4471 -2331 328 1261 -1548 -3898 -3327 -520 1300 75 -2760 -3967 -1799 1045 1141
1746 1141 -1400 -3420 -2977 251 1654 28 -2798 -3222 -1097 1658 1227 -1382 -3118 -2031 1085 2203
1762 2203 409 -2598 -2531 -59 2395 1367 -1235 -2370 -1240 1525 2632 490 -2159 -1848 689 2588
$$ packed form
1650a562R45L513J803j964l292r57K862K846l57l296k403J622L205J373k314l149
1666a125n79K859K900q97l401k036J760L136R98k291l595M13K968J717p81l132
1682a086j658K064L117K90l028k519L42L092J713j288l221j437K349K964k4k859
1698a189k690R63L006K127k324l351p16K696K638j98l071k114J300K764J609k169
1714g19l222j92K664K568n72l469j501J554L043R52k313k788J25K792K255j028
1730A49k860j760K140K659R33k809k350N71K807J820j225k835j207K168K844R6
1746A141k541k020M43L228J403j626k826m24K125K755m31k609j736J087L116J118
1762B203j794l007O7K472K454j028k602j135J130K765J107k142k649L11K537J899
$$ plain form
1778 2588 1818 -860 -2095 -327 2709 2909 625 -1442 -890 1428 3347 1860 -822 -1539 237 2941
1794 2941 2965 438 -1631 -521 2366 3788 1989 -422 -1192 1035 3455 3196 592 -1196 -10 2314
1810 2314 3519 1777 -627 -862 1424 3494 2728 198 -1232 43 2646 3302 1205 -957 -958 1279
1826 1279 3063 2229 -369 -1579 -2 2413 2614 699 -1532 -1344 1286 2777 1415 -1254 -1824 -437
1842 -437 1828 2213 -329 -2098 -1660 693 2059 531 -1820 -2220 -556 1665 1151 -962 -2426 -1780
1858 -1780 931 1653 -54 -2362 -2365 -202 1516 1025 -1294 -2624 -1406 1064 1526 -283 -2262 -2031 62
1875 62 1933 1015 -1264 -2214 -853 1518 1883 -35 -1950 -1175 809 2110 1257 -1108 -1742 -113 2059
1892 2059 1986 -1 -1695 -874 1479 2339 1127 -569 -1151 494 2128 2156 55 -1517 -339 1898 2350
$$ packed form
1778B588p70k678j235J768L036K00k284k067N52K318J919j487k682p17J776K704
1794B941K4k527k069J110K887J422j799k411p70K227K420k59k604j788J186K324
1810B314J205j742k404k35K286K070p66k530j430J275K603O56k097k162jK237
1826A279J784q34k598j210J577K415K01j915k231J88K630J491j362k669n70J387
1842d37K265L85k542j769M38K353J366j528k351m00J664K221n14k113j464O46
1858a780K711P22j707k308lK163J718m91k319j330J218K470M62j809j979K31K093
1875F2J871r18k279r50J361K371L65j918j915P75J984J301q53k365o34J629K172
1892B059p3j987j694Q21K353Q60j212j696n82J645J634K8k101j572J178K237M52
$$ plain form
1909 2350 983 -847 -1253 699 2142 1735 -405 -1494 -437 1862 2078 471 -1466 -922 843 2164
1925 2164 1392 -671 -1649 -364 1460 1931 -12 -1705 -1195 514 1941 826 -1280 -1936 -349 923
1941 923 1255 -632 -1940 -1607 685 1440 206 -1489 -2011 -329 1259 950 -866 -1946 -1435 555 1390
1958 1390 20 -2033 -1941 -509 1100 555 -1298 -2360 -1274 739 1210 -623 -2078 -1893 -294 1124
1974 1124 395 -1356 -2513 -1110 709 925 -671 -2115 -1759 -7 1277 400 -1413 -2216 -674 692
1990 692 1094 -729 -2131 -1559 233 1438 386 -1738 -1980 -598 1160 912 -821 -2054 -962 584
2006 584 1226 255 -1364 -1445 116 1504 899 -774 -1888 -572 967 1297 -135 -1255 -1269 356 1491
2023 1491 992 -814 -1549 -445 1522 1446 82 -1279 -743 960 2135 969 -621 -1104 236 1688
$$ packed form
1909B350j367j830m06J952J443m07k140j089J057K299K16j607j937N44J765J321
1925B164p72k063r78J285J824M71j943j693N10J709J427j115k106o56J587J272
1941I23L32j887j308L33K292P55j234j695n22J682J588l09j816j080N11J990Q35
1958A390j370k053R2J432J609n45j853j062J086K013M71j833j455J85J599J418
1974A124p29j751j157J403J819K16j596j444L56J752J284q77j813q03J542J366
1990F92M02j823j402N72J792J205j052k124k42J382J758k48j733j233J092J546
2006E84O42r71j619q1J561J388o05j673j114J316J539L30j432j120j4J625J135
2023A491m99j806p35J104J967p6j364j361N36J703J175j166j590m83J340J452
$$ plain form
2039 1688 1487 400 -670 -549 1449 2026 1025 -438 -515 489 1900 1957 511 -651 -130 1424 2289
2056 2289 1034 -234 -364 861 2025 1606 107 -746 75 1432 1506 767 -779 -589 836 1419 1235
2073 1235 -510 -830 179 1078 1450 77 -1204 -1134 720 1338 404 -1108 -1444 -633 763 828 -261 -1416
2091 -1416 -1022 240 808 -167 -1622 -1555 -496 674 464 -1176 -1918 -1528 213 625 -585 -1901 -1915 -964
2109 -964 358 -86 -1328 -1867 -1500 -39 248 -717 -1791 -2128 -639 94 -175 -1476 -2256 -1021 78
2126 78 239 -1082 -2026 -1939 -441 207 -434 -1609 -1873 -904 274 155 -790 -2052 -1172 -256 385 -332 -1552
2145 -1552 -1671 -955 554 244 -951 -1835 -946 231 736 -271 -1459 -1326 -527 581 355 -761 -1319
2162 -1319 -621 770 578 -85 -1157 -1012 327 1323 806 -486 -870 -167 980 1316 183 -813 -384 690
$$ packed form
2039A688k01j087j070J21J998N77j001j463p7J004J411N7j446j162N21J554Q65
2056B289j255j268j30J225J164m19j499q53Q21J357P4p39j546J90J425N83j84
2073A235j745l20J009Q99L72j373j281P0J854O18r34j512l36Q11J396O5j089j155
2091a416L94J262N68r75j455O7J059J170k10j640p42L90J741M12j210j316j4R51
2109i64J322m44j242n39L67J461K87r65j074l37J489P33k69j301p80J235J099
2126G8J61j321r44Q7J498O48o41j175k64R69J178j19r45j262Q80R16O41p17j220
2145a552j19P16J509l10j195q84Q89J177N05j007j188J33P99J108k26j116n58
2162a319O98J391j92o63j072J45J339R96n17j292l84P03J147L36j133r96M29J074
$$ plain form
2180 690 1262 862 -6 -619 320 1595 1586 328 -507 -157 1230 1852 1043 17 -252 850 1899 1574 409
2199 409 -138 300 1716 1928 917 202 -107 1046 1915 1498 512 -448 349 1490 1805 834 -7 68 841
2218 841 1509 1373 376 -143 493 1250 1329 209 -513 -209 903 1506 1128 -232 -594 227 1151 1403 254
2237 254 -712 -345 742 1179 326 -476 -912 122 851 681 -507 -1058 -656 578 937 142 -1008 -1024 -115
2256 -115 565 245 -526 -1220 -744 173 433 -456 -840 -951 -5 613 312 -950 -1236 -462 456 498 -489 -1306
2276 -1306 -1114 76 599 271 -692 -936 -535 653 563 -209 -1036 -758 44 783 104 -622 -730 -119 745
2295 745 602 -395 -951 -463 682 901 177 -547 -959 348 801 667 -323 -1010 -530 594 958 342 -632
2314 -632 -556 421 678 832 -250 -760 -115 592 619 160 -705 -498 494 929 410 -413 -782 69 498 562 29
$$ packed form
2180F90N72m00q68o13R39J275rj258q35L50J387O22q09j026k69J102J049l25j165
2199D09n47M38J416K12j011p15l09J153Q69m17r86r60P97J141L15r71q41P5P73
2218H41O68j36r97n19O36P57P9j120p22L04J112O03l78j360l62Q21R24K52j149
2237B54r66L67J087M37q53q02m36J034P29j70j188n51M02J234L59p95j150j6R09
2256a15O80l20p71o94M76R17K60q89l84j11R46O18l01j262k86P74R18M2r87q17
2276a306J92J190N23l28r63k44M01J188r0p72q27K78Q02P39o79p26j08O11Q64
2295G45j43r97n56M88J145K19p24p24m12J307M53j34r90o87M80J124L64o16r74
2314f32P6R77K57J54j082n10O45P07K7m59q65K07R92M35n19q23l69Q51M29O4n33
$$ plain form
2335 29 -758 -676 136 855 106 -494 -862 -208 701 425 -292 -776 -628 67 465 -236 -920 -836 -280 448 284
2356 284 -500 -1059 -590 -26 373 -419 -718 -928 -50 556 259 -674 -1088 -391 104 353 -408 -974 -848 55
2376 55 520 174 -432 -934 -481 341 530 -521 -1061 -766 163 521 -14 -556 -935 -80 742 543 -127 -778
2396 -778 -331 412 406 218 -471 -330 169 995 848 -142 -306 -150 529 676 232 -174 -166 -14 591 772 -68
2417 -68 -180 203 972 779 349 -243 -294 354 1056 585 -268 -286 144 615 671 223 -736 -376 467 981 477
2438 477 -385 -392 36 534 609 143 -326 135 574 814 383 -476 -536 162 540 337 -267 -671 -534 370 684
2459 684 133 -513 -288 222 194 433 -522 -385 90 420 789 40 -713 -620 18 526 300 -333 -423 -12 540
2480 540 570 -1 -422 -400 517 445 127 -390 -485 151 575 700 2 -284 -161 153 485 505 -392 -462 173 484
$$ packed form
2335B9p87Q2Q12P19p49o00l68O54R09k76p17m84J48O95L98p01o84Q4N56P28j64
2356B84p84n59M69N64L99p92k99k10Q78O06k97r33m14O97M95K49p61n66J26R03
2376E5M65l46o06n02M53Q22J89j051n40K95R29L58n35n42l79Q55Q22j99o70o51
2396g78M47P43oj88o89J41M99Q26j47r90j64J56O79J47m44m06QJ52O05J81q40
2417f8j12L83P69j93m30n92n1O48P02m71q53j8M30M71N6m48r59L60Q43N14n04
2438D77q62pM28M98P5m66m69M61M39K40m31q59o0O98L78k03o04m04J37R04L14
2459F84n51o46K25N10k8K39r55J37M75L30L69p49p53R3O38N08k26o33r0M11N52
2480E40L0n71m21K2R17p2l18n17r5O36M24J25o98k86J23L14L32K0q97p0O35L11
$$ plain form
2502 484 382 -122 -200 -59 494 476 36 -174 -433 126 531 343 81 -614 -247 549 277 -70 -468 -507 8
2523 8 421 247 -323 -712 18 374 439 -167 -493 -439 74 519 52 -321 -591 -1 82 402 -167 -426 -507 -210
2545 -210 350 -260 -475 -727 -311 288 245 -140 -722 -430 223 422 -79 -447 -479 -82 -62 412 -211 -526 -282
2566 -282 -58 241 -165 -84 -199 -328 406 362 -307 -533 -79 106 450 -72 -394 -228 25 459 189 -307 -557
2587 -557 -27 287 270 -155 -406 -129 403 310 -41 -337 -540 -315 413 320 -88 -577 -175 41 341 -324 -305
2608 -305 -460 -4 228 190 -288 -403 -217 -4 349 20 -637 -356 -94 153 207 -271 -487 -200 32 188 332
2629 332 -339 -170 -34 386 575 -79 -442 60 482 506 -206 -293 -71 388 231 414 -269 -260 116 422 638
2650 638 214 -236 -56 418 732 319 83 -124 617 574 692 310 -104 466 627 698 198 3 -18 443 520
$$ packed form
2502D84j02n04p8J41N53j8m40k10k59N59M05j88k62o95L67P96k72l47l98l9N15
2523HM13j74n70l89P30L56O5o06l26N4N13M45m67l73k70N90Q3L20n69k59q1K97
2545b10N60o10k15k52M16N99m3l85n82K92O53J99n01l68l2L97K0M74o23l15K44
2566b82K24K99m06Q1j15j29P34m4o69k26M54J85L44n22l22J66K53M34k70m96k50
2587e57N30L14j7m25k51K77N32r3l51k96k03K25P28r3m08m89M02K16L00o65J9
2608c05j55M56K32l8m78j15J86K13L53l29o57K81K62K47N4m78k16K87K32J56J44
2629C32o71J69J36M20J89o54l63N02M22K4p12q7K22M59j57J83o83RL76L06K16
2650F38m24m50J80M74L14m13k36k07P41m3J18l82m14N70J61P1n00j95k1M61P7
$$ plain form
2671 520 348 295 178 88 588 699 449 -180 220 211 594 570 -97 -172 320 782 420 64 -174 -229 197 339
2693 339 339 -209 -76 270 158 285 -52 -473 -165 106 58 204 -214 -159 60 125 78 -348 -336 -466 -239 136
2715 136 -193 -356 -463 -435 87 -152 -541 -685 -457 131 39 -278 -559 -511 -230 -154 42 -396 -726 -360 -122
2736 -122 40 -232 -405 -670 40 494 -197 -309 -207 -8 188 42 87 -665 -297 302 387 -140 -422 -612 -57
2757 -57 168 151 71 -483 101 109 240 -5 -104 -393 -147 206 183 -354 -214 12 418 256 34 -1 -212 -68 43
2780 43 298 -106 -89 40 68 399 59 -212 -428 103 263 -130 -149 -397 -137 172 402 -41 -171 55 347
2801 347 258 303 -47 -391 -85 36 447 -120 108 -85 350 284 -13 152 -196 41 -42 246 121 -246 -137
2822 -137 368 194 147 135 -152 174 194 -66 172 -234 375 510 606 344 -191 104 175 351 326 326 -92 64 325
$$ packed form
2671E20j72n3j17r0N00J11k50o29M00rL83k4o67p5M92M62l62l56k38n5M26J42
2693C39%n48J33L46j12J27l37m21L08K71m8J46m18N5K19O5m7m26J2j30K27L75
2715A36l29j63j07K8N22k39l89j44K28N88r2l17k81M8K81P6J96m38l30L66K38
2736a22J62k72j73k65P10M54o91j12J02J99J96j46M5p52L68N99Q5n27k82j90N55
2757e7K25j7q0n54N84QJ31k45r9k89K46L53k3n37J40K26M06j62k22l5k11J44J11
2780D3K55m04J7J29K8L31l40k71k16N31J60l93j9k48K60L09K30m43j30K26K92
2801C47q9M5l50l44L06J21M11n67K28j93M35o6k97J65l48K37q3K88j25l67J09
2822a37N05j74m7j2k87L26K0k60K38m06O09J35R6k62n35K95P1J76k5%m18J56K61
$$ plain form
2845 325 -32 261 -89 227 174 472 176 -74 -185 186 576 275 -94 42 -72 -262 468 75 -25 -275
2865 -275 5 315 248 -33 -219 86 106 253 118 -305 -350 1 128 21 30 -371 -145 -1 113 83 -306 -88
2887 -88 -203 200 82 -337 -110 -272 121 -33 -525 -598 -430 -420 0 -32 -579 -222 -137 59 19 -99 -214 -590
2909 -590 -166 -1 -149 -375 -212 -172 -26 -210 -424 -334 -298 51 -212 -160 -84 -437 -190 -157 -75 -59 -147 86 39
2932 39 194 55 -261 -157 215 208 152 -16 -468 -130 504 396 -176 146 75 34 310 186 51 -232 -142 228
2954 228 420 10 -69 -4 -36 304 174 -198 -139 -70 107 1 59 -130 -183 341 118 2 -42 -108 280 50 315
2977 315 55 11 34 257 173 289 275 -255 243 112 -25 -140 64 2 -137 242 131 -218 -205 -82 222 -45
2999 -45 -54 -186 -39 159 52 -24 -180 273 114 402 149 -85 37 -30 172 296 139 -290 -53 200 5 96
$$ packed form
2845C25l57K93l50L16n3K98k96k50j11L71L90l01l69J36j14j90P30l93j00k50
2865b75K80L10o7k81j86L05K0J47j35m23m5L51J27j07Rm01K26J44J14l0l89K18
2887h8j15M03j18m19K27j62L93j54m92p3J68J0M20l2n47L57Q5J96m0j18j15l76
2909e90M24J65j48k26J63M0J46j84k14R0L6L49k63N2P6l53K47L3Q2J6q8K33m7
2932C9J55j39l16J04L72pn6j68m52L38O34j08n72L22p1m1K76j24j35k83R0L70
2954B28J92m10p9O5l2L40j30l72N9O9J77j06N8j89n3N24k23j16m4o6L88k30K65
2977C15k60m4K3K23q4J16j4n30M98j31j37j15K04o2j39L79j11l49J3J23L04k67
2999d5rj32J47J98j07p6j56M53j59K88k53k34J22o7K02J24j57m29K37K53j95R1
$$ plain form
3021 96 -9 -166 31 312 -29 -144 28 -85 81 162 116 3 -139 94 -36 91 -28 11 -210 196 43
3042 43 27 -254 -302 171 237 47 78 49 73 -65 121 150 -369 -179 171 141 -75 -38 -144 44 327 171 16
3065 16 -61 -136 -92 218 3 -275 -197 -16 -119 74 85 -87 106 -156 123 94 -373 -101 98 43 -28 -1 -222
3088 -222 -148 207 142 80 -8 -175 10 389 40 -124 -282 -23 114 159 -32 -89 -309 -115 -8 40 -119 124
3110 124 62 199 147 142 -97 11 2 -50 145 72 -221 68 166 197 -225 -150 177 149 261 171 -75 -1 -102 309 91
3135 91 -74 -104 35 105 -30 -193 5 -161 -15 45 192 -169 -90 238 19 110 -51 -182 -24 217 -118 229
3157 229 -44 231 -105 -78 -3 92 -232 12 -139 101 6 -204 -158 -331 -133 -226 -150 -171 -290 81 200 101 -174
3180 -174 -40 -71 62 -76 -454 -412 -191 -18 -261 256 -192 -98 17 -84 -274 -39 -305 -112 -26 348 10
$$ packed form
3021I6j05j57J97K81l41j15J72j13J66Q1m6j13j42K33j30J27j19L9k21M06j53
3042D3j6k81m8M73O6j90L1k9K4j38J86K9n19J90L50l0k16L7j06J88K83j56j55
3065A6p7p5M4L10k15k78P8J81j03J93J1j72J93k62K79k9m67K72J99n5p1K7k21
3088b22P4L55o5o2q8j67J85L79l49j64j58K59J37M5j91n7k20J94J07M8j59K43
3110A24o2J37n2nk39J08rn2J95p3k93K89R8L1m22P5L27k8J12r0k46P4j01M11k18
3135I1j65l0J39P0j35j63J98j66J46O0J47l61P9L28k19R1j61j31J58K41l35L47
3157B29k73K75l36K7P5R5l24K44j51K40r5k10M6j73J98r3P6k1j19L71J19r9k75
3180a74J34l1J33j38l78M2K21J73k43N17m48R4J15j01j90K35k66J93Q6L74l38
$$ plain form
3201 10 -24 109 -198 71 122 -4 -136 -236 -87 26 -218 -246 -134 -49 -159 24 -219 -82 85 -32 201 -27
3223 -27 -194 -36 107 373 35 150 75 97 12 104 206 -35 -45 173 207 30 -6 -1 281 121 -93 -106 132 335
3247 335 233 51 128 59 28 -76 -84 -7 -133 26 124 106 73 -93 105 160 19 172 194 -65 -123 -222 -32 148
3271 148 69 76 -121 -58 301 -138 -134 -91 -227 -167 -211 -149 -161 29 -226 215 -193 -15 -158 146 53 -25 -10 -135 -141
3296 -141 -169 -120 90 -7 126 -145 88 -91 -257 -453 -89 -158 -20 -234 -332 -42 -202 41 -267 -180 -11 -149
3318 -149 213 -49 -329 141 -135 -230 -345 36 -63 -106 -89 -175 216 -50 -52 -35 62 -45 168 -221 -34 -73 193
3341 193 103 -95 -141 60 23 -54 -54 -44 40 -8 72 -121 -233 -56 -140 -70 68 -42 18 59 -217 33 58 -82 -201
3366 -201 25 109 -161 44 -64 -6 -59 53 49 53 104 102 275 116 -34 -173 -49 134 320 118 -99 -108 77 223
$$ packed form
3201A0l4J33l07K69N1j26j32j00J49J13k44k8J12Q5j10J83k43J37J67j17K33k28
3223b7j67J58J43K66l38J15p5K2q5R2J02k41j0K18L4j77l6NK82j60k14j3K38K03
3247C35j02j82P7o9l1j04qP7j26J59R8j8l3j66J98N5j41J53K2k59n8r9J90J80
3271A48p9Pj97O3L59m39MM3j36O0m4O2j2J90k55M41m08J78j43L04r3p8J5j25o
3296a41k8M9K10r7J33k71K33j79j66j96L64o9J38k14r8K90j60K43l08Q7J69j38
3318a49L62k62k80M70k76r5j15L81r9m3J7q6L91k66kJ7R7j07K13l89J87l9K66
3341A93r0j98m6K01l7p7%J0Q4m8Q0j93j12J77q4P0J38j10O0M1k76K50K5j40j19
3366b01K26Q4k70K05j08N8n3J12mMN1kJ73j59j50j39J24J83J86k02k17rJ85J46
$$ plain form
3390 223 49 316 220 -129 7 105 70 -281 72 -114 -58 27 -153 -2 22 33 218 19 145 32 -2 111 -214
3413 -214 -76 -353 263 81 -180 100 -84 -29 188 258 -18 34 -143 -69 -83 158 -13 3 -14 -162 23 79 56
3436 56 -226 -33 -124 85 -70 78 -76 -33 246 -161 -180 -253 -302 -192 126 -326 16 -6 13 94 211 236 -142
3459 -142 -144 -29 -44 -50 -27 -305 -93 35 -95 -171 164 -158 -14 19 49 57 -401 -85 235 -29 5 -52 118 55 0
3484 0 -5 -121 -138 334 -3 -12 -45 242 117 -3 71 -3 69 121 -135 130 275 -109 9 129 318 36 -25 232
3508 232 10 -23 58 270 -105 -176 10 -179 -41 100 133 450 80 330 144 -165 158 -59 272 -77 61
3529 61 -104 68 282 54 -53 -31 247 8 -119 -72 -70 89 179 43 -132 -210 -3 -25 141 12 82 -68 -71 -184
3553 -184 -68 124 -86 -164 -148 -56 -411 -231 136 135 -9 58 5 -20 9 -97 -140 -61 -117 2 34 -46 -34 113 -84
$$ packed form
3390B23j74K67r6l49J36R8l5l51L53j86N6Q5j80J51K4J1J85j99J26j13l4J13l25
3413b14J38k77O16j82k61K80j84N5K17P0k76N2j77P4j4K41j71J6j7j48J85N6k3
3436E6k82J93r1K09j55J48j54M3K79m07j9p3m9J10L18m52L42k2J9Q1J17K5l78
3459a42kJ15j5oK3k78K12J28j30p6L35l22J44L3L0Qm58L16L20k64L4n7J70o3n5
3484@nj16j7M72l37rl3K87j25j20P4p4P2N2k56K65J45l84J18J20J89k82o1K57
3508B32k22l3Q1K12l75p1J86j89J38J41L3L17l70K50j86l09L23k17L31l49J38
3529F1j65J72K14k28j07K2K78k39j27M7KJ59R0j36j75p8K07k2J66j29P0j50lj13
3553a84J16J92k10p8J6R2l55J80L67jj44O7n3k5K9j06m3P9n6J19L2q0J2J47j97
$$ plain form
3578 -84 85 -46 -257 -93 -17 -57 -235 -31 -57 54 59 112 13 -416 -99 116 -79 -23 -71 -19 -77 248 -17 -26 122
3603 122 115 -42 -29 -19 -86 -178 113 -224 -141 -203 182 -18 80 80 -170 -61 182 162 -2 110 230 84 54 -241
3627 -241 -74 -47 74 260 -97 -210 -216 194 -150 -114 -198 -296 -113 91 40 -341 97 160 26 42 156 -116 37
3650 37 253 -77 -70 100 -196 150 87 -39 23 -154 191 2 -14 -7 -76 -9 -73 97 267 -274 -41 206 39 231
3674 231 83 199 8 214 262 211 -21 -41 -77 100 266 232 -55 -14 -83 224 2 69 -201 -11 65 125 18
3697 18 88 -186 73 -97 -103 7 -140 56 155 201 -125 -143 -15 113 16 119 -32 18 247 -263 178 -132 -136 -318
3721 -318 50 -55 -238 61 -264 -500 77 -51 -97 167 194 118 -302 -182 -100 -8 143 85 -203 -221 -383 -274
3743 -274 -245 -224 79 -221 25 -339 -39 -212 -315 112 -90 101 231 -31 -43 174 184 111 -92 36 144 52
$$ packed form
3578h4J69j31k11J64P6m0j78K04k6J11NN3r9m29L17K15j95N6m8N2n8L25k65rJ48
3603A22pj57J3J0o7r2K91l37Q3o2L85k00R8%k50J09K43k0j64J12J20j46l0k95
3627b41J67K7J21J86l57j13oM10l44L6q4r8J83K04n1l81M38O3j34J6J14k72J53
3650C7K16l30PJ70k96L46o3j26O2j77L45j89j6Po9O7o4J70J70n41K33K47j67J92
3674B31j48J16j91K06M8n1k32k0l6J77J66l4k87M1o9L07k22O7k70J90P6O0j07
3697A8P0k74K59j70oJ10j47J96R9M6l26j8J28J28r7J03j51N0K29n10M41l10mj82
3721c18L68j05j83K99l25k36N77j28m6K64K7p6m20J20Q2R2J51n8k88j8j62J09
3743b74K9K1L03l00K46l64L00j73j03M27k02J91J30k62j2K17J0p3k03J28J08r2
$$ plain form
3765 52 109 -54 220 -16 143 -124 192 107 -232 355 -3 -57 106 289 78 -188 87 24 -127 59 173 455
3787 455 85 -16 116 229 -21 255 217 57 111 -37 4 369 166 -56 203 -40 206 65 -145 74 -272
3808 -272 17 146 148 244 228 -36 181 -51 143 123 171 -206 -23 217 147 -70 -67 -153 200 56 197 -70 -112 221
3832 221 -267 -20 -57 -67 -38 221 107 -69 -149 36 -11 59 -58 191 -106 77 23 -51 -22 -78 -15 -52 -202 119
3856 119 70 -97 -122 238 -202 -151 -122 -230 152 -203 130 -17 106 -34 -45 -169 -40 -110 177 205 -240 -106
3878 -106 43 -51 11 225 -140 -428 29 -294 -175 21 103 28 -176 22 121 -246 -271 -154 106 -192 -62 202
3900 202 54 -102 -62 -170 -136 -63 -152 114 -30 180 -82 -14 -59 54 8 142 236 -85 -103 -215 126 -116 -336
3923 -336 7 60 56 -49 -156 -53 -52 -6 -88 15 -141 151 -174 -7 102 54 -122 -90 89 -101 -35 -198 146
$$ packed form
3765E2N7j63K74k36J59k67L16q5l39N87l58n4J63J83k11k66K75o3j51J86J14K82
3787D55l70j01J32J13k50K76l8j60N4j48M1L65k03k22K59k43K46j41k10K19l46
3808b72K89J29KR6j6k64K17k32J94k0M8l77J83K40p0k17Lq6L53j44J41k67m2L33
3832B21m88K47l7j0K9K59j14j76q0J85m7P0j17K49k97J83n4p4K9n6O3l7j50L21
3856A19m9j67k5L60m40N1K9j08L82l55L33j47J23j40j1j24J29p0K87K8m45J34
3878a06J49r4O2K14l65k88M57l23J19J96Q2p5k04J98R9l67k5J17K60k98J30K64
3900B02j48j56M0j08L4P3q9K66j44K10k62O8m5J13m6J34R4l21j8j12L41k42k20
3923c36L43N3mj05j07J03JM6q2J03j56K92l25J67J09m8j76L2J79j90O6j63L44
$$ plain form
3946 146 -14 164 184 154 131 126 264 30 25 -2 -49 179 -292 -87 137 94 138 -145 -53 -256 145 60 -168 -107 -124
3971 -124 123 -126 -136 -335 -60 176 69 47 66 -45 -98 -122 -145 168 -51 -76 -108 -5 -131 106 -105 90 70
3994 70 -45 231 -67 -143 -48 32 -54 33 34 -147 -30 324 133 -212 -65 261 -23 204 -69 -177 -130 -127 212 71
4018 71 -274 -63 23 40 107 -240 -105 -151 -11 -227 -32 -92 -35 -93 43 14 -269 -338 133 6 38 -146 -73 -212
4042 -212 81 212 12 -44 86 -156 200 114 205 -58 142 41 102 -13 -217 -197 80 -38 -97 -26 229 -36
4064 -36 -67 -6 18 64 -232 -169 11 232 -44 92 42 -125 76 -374 -64 27 231 30 128 265 -267 346 -97
4087 -97 -102 19 -114 -152 -104 -111 -25 213 -120 -38 16 424 -116 -1 51 -44 -103 -38 -7 122 148 137 253 19 -146 -80
4113 -80 128 -133 216 70 -97 51 -152 -213 -87 -137 -23 149 68 20 -45 43 38 -9 136 -91 -78 -25 -40 -99 100
$$ packed form
3946A46j60J78K0l0k3nJ38k34nk7m7K28m71K05K24m3M4k83R2k03M01q5k28O1j7
3971a24K47k49j0j99K75K36j07k2J9j11n3k4k3L13k19k5l2J03j26K37k11J95k0
3994G0j15K76k98p6R5Q0q6Q7Jj81J17L54j91l45J47L26k84K27k73j08M7LL39j41
4018G1l45K11Q6J7O7l47J35m6J40k16J95o0N7n8J36k9k83o9M71j27L2j84P3j39
4042b12K93J31k00n6J30k42L56q6R1k63K00j01O1j15k04K0K77j18n9P1K55k65
4064c6l1O1K4M6k96O3J80K21k76J36n0j67K01m50L10R1K04k01R8J37n32O13m43
4087i7nJ21j33l8M8pQ6K38l33Q2N4M08n40J15N2r5n9O5L1J29K6j1J16k34j65O6
4113h0K08k61L49j46j67J48k03o1J26n0J14J72q1m8o5Q8nm7J45k27J3N3j5n9J99
$$ plain form
4138 100 -197 69 187 -143 -63 72 164 89 260 148 60 -78 -13 -18 284 -173 201 34 -264 -246 75 16 66
4161 66 -107 194 -93 254 10 -211 15 94 4 -248 50 -27 254 -205 251 93 10 -17 27 -118 -2 125
4183 125 107 49 -230 -21 57 -41 -167 -107 -58 -34 -133 -48 129 -117 189 30 48 68 150 -57 -29 -227 9 -38 25
4208 25 -218 97 12 162 470 -97 -394 15 215 -134 387 -91 163 -99 -72 135 -98 102 25 400 23
4229 23 59 68 -65 -10 27 7 -187 -137 -51 -232 34 -56 -144 134 159 -221 58 85 -2 89 33 59 -154 67 22 -13
4255 -13 -136 73 192 157 212 25 25 -229 70 12 70 -127 190 258 30 -251 -203 -79 158 -221 5 118 73
4278 73 -35 -91 115 -124 59 -233 141 153 -59 -78 99 317 85 -219 -260 -5 172 98 -90 -101 -103 175 128
4301 128 -31 -43 12 -245 -114 111 381 -138 235 85 -6 -24 65 299 119 219 71 318 198 -7 -69 185
$$ packed form
4138A00k97K66J18l30Q0J35R2p5J71j12q8j38O5nL02m57L74j67k98J8L21n9N0
4161F6j73L01k87L47k44k21K26P9r0k52K98p7K81m59M56j58q3k7M4j45J16J27
4183A25j8n8k79K09P8r8j26O0M9K4r9Q5J77k46L06j59J8K0Q2k07K8j98K36m7O3
4208B5k43L15q5J50L08n67k97M09K00l49N21m78K54k62K7K07k33K00p7L75l77
4229B3L6Rj33N5L7k0j94N0Q6j81K66r0q8K78K5l80K79K7q7R1n6K6k13K21m5l5
4255a3j23K09J19l5N5j87%k54K99n8N8j97L17O8k28k81M8J24K37l79K26J13m5
4278G3j08n6K06k39J83k92L74J2k12j9J77K18k32l04m1K55J77p4j88j1kK78m7
4301A28j59j2N5k57J31K25K70n19L73j50r1j8Q9K34j80J00j48K47j20k05o2K54
$$ plain form
4323 185 -70 85 6 -115 168 108 -316 71 -60 54 134 139 189 -10 160 -121 -385 12 -267 14 202 136
4345 136 3 103 49 90 11 -112 -75 -42 -31 14 -158 244 -9 172 65 34 -166 -41 -352 -16 15 247 -88
4368 -88 16 43 -79 88 147 87 13 127 -79 -61 -104 46 -28 121 35 -178 19 -62 27 256 -196 -11 212 70
4392 70 118 58 -73 -92 -34 -258 -210 101 -202 -120 -63 -165 165 -34 -103 16 -65 -122 148 113 -74 41 -37 -218
4416 -218 56 26 176 -97 98 39 52 -55 40 154 269 160 -238 -237 105 203 288 23 93 355 -233 31 -63
4439 -63 -36 141 95 173 152 146 135 192 313 -113 106 -4 131 103 -73 -4 -92 41 -71 -50 265 129 100 -15 97
4464 97 -161 34 12 47 266 110 39 184 -124 72 141 154 108 25 162 -12 -24 -49 116 382 103 121 8 -2
4488 -2 -124 -14 -58 -100 101 -84 7 -53 285 111 -273 -64 42 -215 109 146 -82 124 20 -42 -113 -101 -180 46
$$ packed form
4323A85k55J55p9j21K83o0m24L87j31J14Q0NN0j99J70k81k64L97k79K81J88o6
4345A36j33J00n4M1p9j23L7L3J1M5j72M02k53J81j07l1k00J25l11L36L1K32l35
4368h8J04K7j22J67N9o0p4J14k06J8m3J50p4J49q6k13J97q1Q9K29m52J85K23j42
4392G0M8o0j31j9N8k24M8L11l03Q2N7j02L30j99o9J19q1n7K70l5j87J15p8j81
4416b18K74l0J50k73J95n9J3j07R5J14J15j09l98JL42R8Q5k65P0K62n88K64r4
4439f3K7J77m6P8k1oj1N7J21m26K19j10J35k8j76O9q8J33j12K1L15j36k9j15J12
4464I7k58J95k2L5K19j56p1J45l08J96O9J3m6q3J37j74j2k5J65K66k79J8j13j0
4488bj22J10m4m2K01j85R1o0L38j74l84K09J06k57L24L7k28K06j04o2p1J2p9K26
$$ plain form
4512 46 -64 163 -61 32 -263 -17 123 56 84 -316 149 46 14 -191 110 -173 -106 -28 -379 -225 27 190
4534 190 -34 224 46 -63 231 163 39 191 11 -164 16 -53 253 -129 21 -188 267 -251 -2 165 -58
4555 -58 -94 52 102 -183 -138 -229 121 -264 33 -39 -139 -202 -52 -181 301 140 -122 40 141 -256 103 -84
4577 -84 15 186 112 186 -62 0 15 101 -79 -131 -57 84 399 -36 273 -16 179 56 9 -75 144 -103 275 0
4601 0 -4 -29 -49 63 16 28 5 -24 -43 4 -112 202 208 157 -55 -42 82 125 22 -183 -310 221 -4 -41 -283 289
4627 289 -42 -147 58 86 -159 -56 187 -104 81 -12 58 -79 66 40 75 -86 89 -45 -17 -47 -27 -271 -1
4650 -1 269 -329 76 -110 -68 83 -37 -11 92 18 206 107 17 -123 255 -147 -115 -141 -58 -193 -177 -9 196 -99
4674 -99 -96 79 -304 128 -17 -72 -12 -282 -120 222 -117 -71 166 6 -214 -349 -128 -44 -231 168 125 197 203 101
$$ packed form
4512D6j10K27k24R3k95K46J40o7K8m00M65j03l2k05L01k83O7P8l51J54K52J63
4534A90k24K58j78j09K94o8j24J52j80j75J80o9L06l82J50k09M55n18K49J67k23
4555e8l6J46N0k85M5r1L50l85K97p2j00o3J50j29M82j61k62J62J01l97L59j87
4577h4R9J71p4P4k48O2J5Q6j80n2P4J41L15m35L09k89J95j23m7q4K19k47L78k75
4601@mk5k0J12m7J2k3k9j9M7j16L14On1k12J3J24M3j03k05j27N31k25l7k42N72
4627B89l31j05K05K8k45J03K43k91J85r3P0j37J45k6L5j61J75j34K8l0K0k44K70
4650aK70n98M05j86M2J51j20K6J03p4J88r9r0j40L78m02L2k6Q3j35J6J68K05k95
4674i9LJ75l83M32j45n5O0k70J62L42l39M6K37j60k20j35K21Q4j87L99m3P2Oj02
$$ plain form
4698 101 148 -89 -129 33 164 77 19 86 -81 -25 34 46 19 79 178 286 119 45 188 -112 21 -107 68 329
4722 329 86 87 -73 -114 -25 -114 -72 4 63 194 -51 -33 -102 -41 82 269 -132 177 248 58 75 52 2 -3 -81 -64
4748 -64 -50 -60 -242 124 136 -30 256 89 -29 -11 234 156 231 60 -97 -474 -99 -38 112 -127 60 13 -84
4771 -84 55 106 -12 -285 129 293 -123 140 -97 65 -96 -66 -126 -103 -51 9 -74 -222 82 8 129 112 0
4794 0 117 -212 115 -227 -79 79 -45 -66 -91 -92 -95 -92 82 45 -196 -163 -20 92 -79 -115 136 -54 -323 27
4818 27 -16 -261 -194 88 -168 178 95 45 84 -81 89 123 94 134 63 -11 157 104 -44 111 157 65 -35 -53 -233
4843 -233 84 68 333 14 -196 -143 -73 187 -15 -16 329 132 -234 -33 -132 -284 106 85 -57 111 52 -176 -68
4866 -68 -12 -134 163 222 41 25 -28 -58 111 141 74 133 -54 -87 160 -43 249 -6 15 34 306 -73 30 72
$$ packed form
4698A01M7k37m0J62J31q7n8O7j67N6N9J2k7O0R9J08j67p4J43l00J33j28J75K61
4722C29k43Jj60m1Q9q9M2P6N9J31k45J8o9O1J23J87m01L09P1j90J7k3n0np8J7
4748f4J4j0j82L66J2j66K86j67j18J8K45p8P5j71j57l77L75O1J50k39J87m7r7
4771h4J39N1j18k73M14J64m16K63k37J62j61L0o0K3N2O0q3j48L04p4J21j7j12
4794@J17l29L27l42J48J58j24k1k5jlLJ74l7k41L3J43J12j71l6K51j90k69L50
4818B7m3k45O7K82k56L46q3n0L9j65J70L4k9M0p1p4J68n3j48J55M6r2j00j8j80
4843b33L17j6K65l19k10N3P0K60k02jL45j97l66K01r9j52L90k1j42J68n9k28J08
4866f8N6j22K97N9j81j6n3l0J69L0o7N9j87l3K47k03K92k55K1J9K72l79J03M2
$$ plain form
4890 72 250 -73 214 -144 18 33 284 224 -253 58 147 128 -205 246 26 148 -269 164 12 165 132 22
4912 22 64 -387 22 41 38 52 -171 215 84 184 -83 52 -162 45 122 -232 46 -163 -336 -43 -16 136 -243
4935 -243 -204 33 170 -148 -28 -203 -190 346 65 -149 113 -97 -155 -112 140 -151 -135 -217 1 -9 16 -311 -204
4958 -204 -207 41 139 225 -19 28 18 75 -4 -62 57 185 -133 188 -120 6 328 367 180 144 69 104 -65 33 155
4983 155 60 -266 233 1 -20 164 77 -93 253 4 78 15 -18 230 76 -336 231 -145 159 19 -118 -215
5005 -215 -141 51 252 70 -69 -195 -303 -4 2 83 -23 -203 254 -75 232 -8 -130 40 1 -270 -83 56
5027 56 -218 -70 131 -89 -83 -115 -79 -107 143 274 -6 7 34 -66 60 -151 106 142 -400 11 -14 -201 90
5050 90 -197 23 -60 -74 -55 -152 -218 -72 -18 71 73 19 125 -209 106 -73 -293 137 41 36 79 140 -279 44 25 24
$$ packed form
4890G2J78l23K87l58J62J5K51o0m77L11Q9j9l33M51k20J22m17M33j52J53l3j10
4912B2M2m51M09J9lJ4k23L86j31J00k67J35k14K07P7l54K78k09j73K93K7J52l79
4935b43L9K37J37l18J20j75J3N36k81k14K62k10n8M3K52k91J6q2K18j0K5l27J07
4958b04lK48R8Q6k44M7j0N7p9n8J19J28l18L21l08J26L22L9j87l6p5L5j69R8J22
4983A55r5l26M99k32k1J84q7j70L46k49P4o3l3K48j54m12N67l76L04j40j37r7
5005b15P4J92K01j82j39j26j08K99OQ1j06j80M57l29L07k40j22J70l9k71J87J39
5027E6k74J48K01k20Ol2L6k8K50J31k80J3K7j00J26k11K57L6n42M11k5j87K91
5050I0k87K20q3j4J9r7o6J46N4Q9Kn4J06l34L15j79k20M30r6nM3O1m19L23j9j
$$ plain form
5076 24 -86 73 -237 23 -36 244 71 -195 118 137 187 -233 83 273 135 -137 93 57 13 -115 223 70
5098 70 347 70 -17 -196 124 1 -201 68 122 62 -110 -73 -257 187 179 148 10 76 91 -157 261 381 -80
5121 -80 -80 56 164 -129 237 -42 -178 79 180 -143 -48 109 99 68 -12 128 -155 -100 -223 -266 79 275 -76
5144 -76 116 78 332 3 -25 -50 99 164 195 -53 -265 131 -66 124 165 -170 45 97 -4 -42 11 20 125 187
5168 187 -260 -125 -83 3 -120 -86 -278 -293 289 326 -86 -112 91 -214 30 44 -67 -177 -85 91 169 7 -108
5191 -108 57 15 -93 289 267 193 75 217 80 71 157 -58 334 -104 -347 46 174 64 -43 -67 150 -194
5213 -194 50 -38 -127 -324 50 -217 109 -18 -171 10 -163 -93 -139 -12 -30 88 -41 -157 233 -206 175 -258
5235 -258 40 -102 179 51 -91 120 -6 -33 40 77 30 63 -149 -150 51 282 32 286 120 -229 111 269
$$ packed form
5076B4j10J59l10K60n9K80j73k66L13J9N0m20L16J90j38k72K30l6m4j28L38j53
5098G0K77k77q7j79L20j23k02K69N4o0j72L7j84M44ql1j38O6J5k48M18J20m61
5121h0%J36J08k93L66k79j36K57J01l23R5J57j0l1q0J40k83N5j23m3L45J96l51
5144g6J92l8K54l29k8k5J49O5L1k48k12L96j97J90M1l35K15N2j01l8N3RJ05O2
5168A87m47J35M2Q6j23L4j92j5N82L7m12k6K03l05K44J4j11j10R2J76P8j62j15
5191a08J65m2j08L82k2p4j18J42j37rQ6k15L92m38k43L93J28j10j07k4K17l44
5213a94K44q8q9j97L74k67L26j27j53J81j73P0m6J27j8J18j29j16L90m39L81m33
5235b58K98j42K81j28j42K11j26k7P3L7m7L3k12jK01K31k50K54j66l49L40J58
$$ plain form
5257 269 -43 48 38 181 205 -129 -64 -136 217 -92 -134 235 57 153 135 -135 -65 14 112 -112 57 -72 -54 -92
5281 -92 20 -198 -76 -50 -140 -63 -91 117 236 100 -16 -228 -14 -106 20 164 -92 -134 41 -45 26 -35 195
5304 195 -182 -115 -238 2 177 -234 94 -43 -217 -92 -150 117 173 -201 -120 -206 154 -36 -112 107 -54 75
5326 75 -220 -164 -61 32 -29 359 -81 100 -22 61 -128 100 110 -45 -158 -129 -32 147 -279 -129 -32 46 -121
$$ packed form
5257B69l12R1j0J43K4l34O5p2L53l09m2L69j78R6j8k70P0P9R8k24J69j29J8l8
5281i2J12k18J22K6r0P7k8K08J19j36j16k12K14r2J26J44k56m2J75q6P1o1K30
5304A95l77O7j23K40J75m11L28j37j74J25n8K67N6l74Q1q6L60j90p6K19j61J29
5326G5k95N6J03R3o1L88m40J81j22Q3j89K28J0j55j13K9R7J79m26J50R7P8j67
$$ [...]
8191c0
##END NTUPLES=NMR FID
##END=
