##TITLE=1H_Pr NCS-29
 CDCl3
 8 sc, 
 30.06.2022
##JCAMPDX= 6.0         $$ Bruker NMR JCAMP-DX V2.0
##DATA TYPE= NMR FID
##DATA CLASS= NTUPLES
##ORIGIN= UXNMR, Bruker Analytische Messtechnik GmbH
##OWNER= root
$$ XWIN-NMR		Version 3.5
$$ Thu Jun 30 13:51:33 2022 Russian Standard Time (UT+4h)  she@DPX200
##.OBSERVE FREQUENCY= 200.1313499994
##.OBSERVE NUCLEUS= ^1H
##.DELAY= (6, 6)
##.ACQUISITION MODE= SIMULTANEOUS
##.ACQUISITION SCHEME= undefined
##.AVERAGES= 8
##.DIGITISER RES= 18
##SPECTROMETER/DATA SYSTEM= spect
##.PULSE SEQUENCE= zg30
##.SOLVENT NAME= CDCl3
##.SHIFT REFERENCE= (INTERNAL, CDCl3, 0, 15.7039)
##AUDIT TRAIL= $$ (NUMBER, WHEN, WHO, WHERE, WHAT)
$$ ##TITLE= Audit trail, XWIN-NMR		Version 3.5
$$ ##JCAMPDX= 5.01
$$ ##ORIGIN= Bruker BioSpin GmbH
$$ ##OWNER= she
$$ F:/spectra/data/she/nmr/H-F/1/audita.txt
$$ ##AUDIT TRAIL=  $$ (NUMBER, WHEN, WHO, WHERE, WHAT)
(   1,<2022-06-30 13:50:27.31 +0400>,<she>,<DPX200>,
      <created by zg, POWCHK disabled, PULCHK disabled
       configuration hash MD5:
       00 E9 B6 7A A2 85 ED C7 34 08 36 98 17 FE 4E 26
       data hash MD5: 16K
       11 6E 99 FD 16 FE 91 AA F0 D6 93 0F F0 FC 5D 5E>)
$$ ##END=
$$ 
$$ hash MD5
$$ C3 98 49 00 A6 2C BC 35 6A 5A 8E D7 7A 43 92 BA
##$RELAX= 
##$RELAX= 
##$RELAX= 
##$RELAX= 
##$RELAX= 
##$RELAX= 
$$ Bruker specific parameters
$$ --------------------------
##$DU= <F:/spectra>
##$EXPNO= 1
##$NAME= <H-F>
##$PROCNO= 1
##$TYPE= <nmr>
##$USER= <she>
##$AMP= (0..31)
100 100 100 100 100 100 100 100 100 100 100 100 100 100 100 100 100 100 
100 100 100 100 100 100 100 100 100 100 100 100 100 100 
##$AQSEQ= 0
##$AQ_mod= 1
##$AUNM= <au_zg>
##$AUTOPOS= <>
##$BF1= 200.13
##$BF2= 200.13
##$BF3= 200.13
##$BF4= 200.13
##$BF5= 200.13
##$BF6= 200.13
##$BF7= 200.13
##$BF8= 200.13
##$BYTORDA= 1
##$CFDGTYP= 0
##$CFRGTYP= 5
##$CHEMSTR= <none>
##$CNST= (0..31)
1 1 145 1 1 1 1 1 1 1 1 1 1 1 1 1 1 1 1 1 1 1 1 1 1 1 1 1 1 1 1 1 
##$CPDPRG= <>
##$CPDPRG1= <>
##$CPDPRG2= <>
##$CPDPRG3= <>
##$CPDPRG4= <mlev>
##$CPDPRG5= <mlev>
##$CPDPRG6= <mlev>
##$CPDPRG7= <mlev>
##$CPDPRG8= <mlev>
##$CPDPRGB= <>
##$CPDPRGT= <>
##$D= (0..31)
0 1.2 0 0 0 0 0 0 0 0.06 0 0.03 0 0 0 0 0.0002 0 0 0 0 0 0 0 0 0 0 0 0 
0 0 0 
##$DATE= 1656582626
##$DBL= (0..7)
120 120 120 120 120 120 120 120 
##$DBP= (0..7)
150 150 150 150 150 150 150 150 
##$DBP07= 0
##$DBPNAM0= <>
##$DBPNAM1= <>
##$DBPNAM2= <>
##$DBPNAM3= <>
##$DBPNAM4= <>
##$DBPNAM5= <>
##$DBPNAM6= <>
##$DBPNAM7= <>
##$DBPOAL= (0..7)
0.5 0.5 0.5 0.5 0.5 0.5 0.5 0.5 
##$DBPOFFS= (0..7)
0 0 0 0 0 0 0 0 
##$DE= 6
##$DECBNUC= <off>
##$DECIM= 32
##$DECNUC= <off>
##$DECSTAT= 4
##$DIGMOD= 1
##$DIGTYP= 9
##$DL= (0..7)
0 120 120 120 120 120 120 120 
##$DP= (0..7)
150 150 150 150 150 150 150 150 
##$DP07= 0
##$DPNAME0= <>
##$DPNAME1= <>
##$DPNAME2= <>
##$DPNAME3= <>
##$DPNAME4= <>
##$DPNAME5= <>
##$DPNAME6= <>
##$DPNAME7= <>
##$DPOAL= (0..7)
0.5 0.5 0.5 0.5 0.5 0.5 0.5 0.5 
##$DPOFFS= (0..7)
0 0 0 0 0 0 0 0 
##$DQDMODE= 0
##$DR= 18
##$DS= 0
##$DSLIST= <SSSSSSSSSSSSSSS>
$$ [...]
##$SUBNAM2= <"">
##$SUBNAM3= <"">
##$SUBNAM4= <"">
##$SUBNAM5= <"">
##$SUBNAM6= <"">
##$SUBNAM7= <"">
##$SUBNAM8= <"">
##$SUBNAM9= <"">
##$SW= 18.0517283424941
##$SWIBOX= (0..15)
0 0 2 0 0 0 0 0 0 0 0 0 0 0 0 0 
##$SW_h= 3612.71676300578
##$TD= 16384
##$TD0= 1
##$TE= 0
##$TE2= 300
##$TE3= 300
##$TEG= 300
##$TL= (0..7)
0 120 120 120 120 120 120 120 
##$TP= (0..7)
150 150 150 150 150 150 150 150 
##$TP07= 0
##$TPNAME0= <>
##$TPNAME1= <>
##$TPNAME2= <>
##$TPNAME3= <>
##$TPNAME4= <>
##$TPNAME5= <>
##$TPNAME6= <>
##$TPNAME7= <>
##$TPOAL= (0..7)
0.5 0.5 0.5 0.5 0.5 0.5 0.5 0.5 
##$TPOFFS= (0..7)
0 0 0 0 0 0 0 0 
##$TUNHIN= 0
##$TUNHOUT= 0
##$TUNXOUT= 0
##$USERA1= <user>
##$USERA2= <user>
##$USERA3= <user>
##$USERA4= <user>
##$USERA5= <user>
##$V9= 5
##$VALIST= <valist>
##$VCLIST= <CCCCCCCCCCCCCCC>
##$VD= 0
##$VDLIST= <DDDDDDDDDDDDDDD>
##$VPLIST= <PPPPPPPPPPPPPPP>
##$VTLIST= <TTTTTTTTTTTTTTT>
##$WBST= 1024
##$WBSW= 4
##$XGAIN= (0..3)
0 0 0 0 
##$XL= 0
##$YL= 0
##$YMAX_a= 532940
##$YMIN_a= -368955
##$ZGOPTNS= <>
##$ZL1= 120
##$ZL2= 120
##$ZL3= 120
##$ZL4= 120
##$ABSF1= 10
##$ABSF2= 0
##$ABSG= 5
##$ABSL= 3
##$ALPHA= 0
##$AQORDER= 0
##$ASSFAC= 0
##$ASSFACI= 0
##$ASSFACX= 0
##$ASSWID= 0
##$AUNMP= <proc_1d>
##$AZFE= 0.1
##$AZFW= 0.1
##$BCFW= 1
##$BC_mod= 2
##$BYTORDP= 1
##$COROFFS= 0
##$CY= 11.3945322036743
##$DATMOD= 1
##$DC= 2
##$DFILT= <>
##$DTYPP= 0
##$F1P= 2.36226072786647
##$F2P= -0.459571619588291
##$FCOR= 0.5
##$FTSIZE= 0
##$FT_mod= 4
##$GAMMA= 1
##$GB= 0.15
##$INTBC= 1
##$INTSCL= 1
##$ISEN= 128
##$LB= 0.24
##$LEV0= 0
##$LPBIN= 0
##$MAXI= 10000
##$MC2= 0
##$MEAN= 0
##$ME_mod= 0
##$MI= 1.114404
##$NCOEF= 0
##$NC_proc= 0
##$NLEV= 6
##$NOISF1= 3.799351
##$NOISF2= 2.8
##$NSP= 1
##$NTH_PI= 0
##$NZP= 0
##$OFFSET= 15.70392
##$PC= 1
##$PHC0= -18225.49
##$PHC1= 46.60069
##$PH_mod= 1
##$PKNL= yes
##$PPARMOD= 0
##$PSCAL= 0
##$PSIGN= 0
##$REVERSE= no
##$SF= 200.130013532006
##$SI= 16384
##$SIGF1= 3
##$SIGF2= 2
##$SINO= 400
##$SIOLD= 16384
##$SREGLST= <1H.CDCl3>
##$SSB= 0
##$STSI= 0
##$STSR= 0
##$SW_p= 3612.71676300578
##$SYMM= 0
##$S_DEV= 0
##$TDeff= 0
##$TDoff= 0
##$TI= <>
##$TILT= no
##$TM1= 0
##$TM2= 0
##$TOPLEV= 0
##$USERP1= <user>
##$USERP2= <user>
##$USERP3= <user>
##$USERP4= <user>
##$USERP5= <user>
##$WDW= 1
##$XDIM= 8192
##$YMAX_p= 0
##$YMIN_p= 0
$$ End of Bruker specific parameters
$$ ---------------------------------
##NTUPLES= NMR FID
##VAR_NAME=  TIME,          FID/REAL,        FID/IMAG
##SYMBOL=    X,             R,               I
##VAR_TYPE=  INDEPENDENT,   DEPENDENT,       DEPENDENT
##VAR_FORM=  AFFN,          ASDF,            ASDF
##VAR_DIM=   8192,          8192,            8192
##UNITS=     SECONDS,       ARBITRARY UNITS, ARBITRARY UNITS
##FACTOR=    0.0002768,     1,               1
##FIRST=     0,             0,               0
##LAST=      2.2672688,     0,               0
##MIN=       0,             -368955,         0
##MAX=       2.2672688,     532940,          0
$$ Real data points
##PAGE= N=1
##DATA TABLE= (X++(R..R)), XYDATA
0 0 0 0 0 0 0 0 0 0 0 -7 8 -8 8 -16 16 -24 32 -40 45 -55 64 -79 89 -105 127 -146 169 -199 229 -263 300
31 300 -341 389 -440 496 -558 628 -701 788 -877 975 -1086 1203 -1333 1474 -1629 1797 -1982
48 -1982 2184 -2409 2651 -2920 3220 -3552 3925 -4345 4821 -5370 6007 -6756 7655 -8758
62 -8758 10143 -11943 14393 -17937 23535 -33725 58179 -239941 -33368 494255 -48804 -259478
74 -259478 28752 143003 -36842 -26324 -72193 -87724 108301 204317 -83745 -196274 26275
85 26275 165830 418 -147901 -34289 172943 86753 -139010 -111466 100370 99103 -47791
96 -47791 -64246 -6221 22007 89686 24198 -137082 -43286 140682 18627 -124254 5240
107 5240 88569 -17129 -11819 30766 -85181 -66365 126376 70095 -122772 -42329 119160
118 119160 14078 -128390 -16960 97218 1766 -41107 42451 6348 -79817 5256 87522
129 87522 -33894 -92672 77366 109370 -93073 -107285 80326 83372 -63330 -52736 51971
140 51971 30913 -19334 2902 -17007 -36424 41848 59338 -42099 -66434 37851 75017 -26478
152 -26478 -71488 10833 48651 -2717 -22413 5309 3778 -9734 14605 4479 -41625 -912
164 -912 47777 -10892 -33273 29301 13771 -53463 -9713 58624 -2988 -50692 28526 38562
176 38562 -48150 -28165 47665 13568 -42101 3420 41131 -9853 -25038 12106 -5484 -15952
188 -15952 35082 29932 -44327 -43228 46932 55702 -42292 -57042 29658 49658 -9117 -33598 -5282
201 -5282 15461 11783 3345 -18433 -21842 24676 33166 -25614 -35570 24535 35931 -30311 -40650
214 -40650 32738 39725 -23956 -29753 4774 12713 9908 914 -23745 -16440 36246 30013 -46106
227 -46106 -38642 40127 34195 -26231 -24263 15315 14761 -7194 -3600 -571 -6524 9614 13638 -10281
241 -10281 -11702 10025 12804 -10021 -12659 16819 12914 -18747 -7301 18371 3966 -15969 -932
254 -932 11924 -6324 -3920 13893 -8520 -19673 12671 15866 -12852 -14302 7116 7837 -5254
267 -5254 -301 480 -10763 1983 15796 -13 -15968 -5482 14966 8355 -12456 -2844 9597
280 9597 -2333 -4153 8387 4101 -10381 -3318 12382 1205 -6644 6233 -3547 -11763 11960
293 11960 15430 -12928 -18191 9375 17811 -5264 -12188 -416 2462 5091 3799 -5663 -6733 311
307 311 7591 3159 -8325 -1637 6125 -3732 -4351 7481 5545 -11565 -9148 14176 9261 -11554
321 -11554 -6304 1812 1668 6789 2088 -10798 -7079 10213 11008 -8417 -9429 5648 4894 96 -290
336 -290 -1008 -827 -2054 2862 7208 -2381 -6502 1292 4213 2133 -330 -2085 -4445 -657 10445 1611
352 1611 -13657 -2411 8681 1975 -3024 -3359 -2201 426 3516 2490 -5773 -4154 3619 2027 453
367 453 -1155 -3052 1320 506 352 4364 -1822 -6133 1896 6986 1968 -5031 -2684 811 1281 7684
383 7684 1537 -12432 -3110 11567 5848 -6422 -8780 457 7904 5146 -3580 -10028 -491 11716
397 11716 2703 -7090 -4840 1510 6959 1004 -6141 -1270 3407 1729 -3103 -3293 5078 4434 -4963
412 -4963 -6627 1709 10469 105 -14249 -3133 12410 8207 -6344 -14265 -2086 14116 8516
425 8516 -8457 -13346 1968 15198 4526 -11219 -12470 4808 20620 1189 -21039 -2697 16601
438 16601 4015 -9816 -3224 5044 1841 1672 -1625 -7768 4479 10389 -8329 -10429 5810 8501
452 8501 -373 -7497 -6584 4969 13350 -3885 -23495 862 27840 2650 -21127 -6119 6437
465 6437 6796 5168 -6135 -11432 4838 17754 -1209 -19431 -5387 11771 13015 1139 -16253
478 -16253 -6976 16709 5335 -16902 -3410 16429 2269 -13402 252 6722 -2945 1285 1304
491 1304 -8854 525 14061 2253 -16304 -7705 17707 13774 -16118 -21149 8016 27420 4352
504 4352 -23561 -10704 11157 9626 -1977 -9049 -2692 9757 9265 -4858 -17911 -8008 16261
517 16261 16603 -7599 -16960 4099 16740 -8127 -21353 7926 22114 -590 -14547 -3863 7301
530 7301 4010 -3164 -5316 -1265 9612 8701 -6671 -11418 -3128 10870 14618 -11007 -24500 9963
544 9963 31386 -4089 -31488 -1774 21824 -452 -10609 2187 148 2315 10953 -4951 -21570
557 -21570 -2522 22024 9285 -13771 -6718 8344 6097 -7697 -15523 4761 24767 2301 -21359
570 -21359 -2855 15210 -964 -14416 429 9642 5565 5774 -7506 -19890 3515 22135 -446
583 -446 -20337 -3602 19344 11477 -12255 -19161 -1123 19848 9240 -17488 -6772 15963 4260
596 4260 -10760 -3091 1343 -2892 4808 10531 -5377 -8240 8999 -297 -17328 646 18530 5237
610 5237 -12344 -6249 7181 3803 -6928 -9162 1350 14452 8854 -8002 -10321 -5330 1848 9654
624 9654 4663 -6818 -4439 8665 6563 -11396 -10413 6706 9133 1845 -1750 -3060 -1529 -471
638 -471 -43 -101 -412 2683 2175 -2512 -1413 855 433 -1933 -3963 858 5724 3240 -3445 -7297 1698
655 1698 8419 -4450 -9175 4869 10215 651 -5355 -3824 -2754 1205 8134 820 -8385 2797
669 2797 7345 -4069 -6713 -370 2708 3482 3185 -1857 -5973 998 3657 -3167 606 3769 -4106
684 -4106 -1196 5567 -526 -4337 1141 1202 -2761 2405 5397 -4549 -4038 5643 1135 -3184 251 -2722
700 -2722 -1593 6817 5043 -6046 -7858 1907 4437 1113 541 -4002 -3012 6683 3734 -6941 -5547
715 -5547 2719 5396 1749 -679 -2155 -3394 1496 3327 -894 414 538 -2212 1060 3497 790
730 790 -4492 -4400 3327 5978 778 -3937 -4956 1031 5567 700 -4513 -3718 2567 5260 -697 -3184
746 -3184 -1739 -1332 2523 3129 -1001 -1573 -847 338 942 715 -69 -2454 57 4561 1300 -2868 -2574
763 -2574 -1220 2765 3491 -1121 -2963 -566 2167 678 -2508 -735 -91 1041 2926 -1102 -3492 -259
779 -259 997 1216 929 -724 -898 -97 1938 596 -2428 -635 1015 1465 2133 -1973 -3003 802 1762
796 1762 1183 -367 -2270 -470 1311 1566 -782 -3260 -59 2034 1720 1047 -2997 -2905 1639 2500 1171
813 1171 -1607 -2714 477 2358 2004 -1291 -3678 493 3131 1672 704 -3454 -3273 2265 3907 918
829 918 -2661 -3033 1039 2794 1485 -2545 -4187 970 3980 1360 -1370 -3707 -1596 2826 2133 -90
845 -90 -1591 -1746 552 1745 1590 -723 -3306 387 2719 1803 632 -3105 -3451 2442 4883 224 -4195
862 -4195 -2912 2801 2893 -367 -2631 -3287 2055 4208 -446 -2802 -2247 922 3081 -154 -1140 -312 196
879 196 643 -457 133 264 -1237 529 1439 411 725 -1541 -2559 1627 3516 -163 -3761 -1236 3417
896 3417 1388 -1991 -1939 -1470 1971 3379 -1062 -3665 -2180 2787 4406 -2091 -4854 589 4301 1575
912 1575 -3266 -1041 1658 -316 897 1383 -2716 -1038 3273 1341 -2684 -1339 1922 -745 -1911
927 -1911 2794 1856 -2238 -2359 -1476 1913 3880 -1214 -4865 -442 5318 1949 -4901 -2523 1785 2324
943 2324 3095 -907 -5435 -785 5407 3579 -3766 -4848 1410 4086 1315 -2005 -2272 1812 691 -3541
959 -3541 833 3378 -2291 -2231 3546 1837 -4851 -1658 3618 -1835 -838 7439 433 -10139 -2248 7880
975 7880 3253 -4465 -1874 2652 1708 933 -2031 -4830 1223 5221 1436 -1381 -3350 -2080 2797 2803
991 2803 -2634 -3981 2860 4356 -3060 -2927 2149 402 -2080 -444 2009 2078 -1139 -2160 391 1504
1007 1504 126 -2302 -449 2616 1124 1407 738 -4963 -3230 4807 5476 -3607 -6436 4776 6791
1022 6791 -5197 -6458 2437 2705 -464 2282 2767 -5726 -4492 6313 2016 -6663 583 6417 -629
1037 -629 -3501 310 411 -2263 490 1957 394 1926 -538 -4636 2113 4439 -2806 -2114 2322 167
1053 167 50 3412 -1268 -7238 796 7223 -1522 -4062 2138 934 621 1475 -4817 -4381 5747 6007
1069 6007 -3528 -1634 3165 -4762 -3374 7878 729 -6512 5001 5661 -6949 -3757 5769 -622
1083 -622 -5408 5388 5657 -5521 -3630 1961 -52 1095 2118 -2482 -2350 2522 2475 -1675 -2036 -1008
1099 -1008 -1034 4096 2528 -5544 -723 5254 -670 -3841 494 214 -1383 3030 3790 -3927 -3712 3223
1115 3223 -975 -1996 3679 1165 -3698 711 2911 -2686 -3504 2219 1220 -1069 2931 1121 -5639
1130 -5639 -1756 4637 1684 -2732 -1272 1741 849 463 477 -2295 -2152 2386 3008 158 -2714 -1016
1146 -1016 2914 1183 -2115 -962 -189 -282 1046 2118 -496 -4064 -935 2537 68 -609 906 -453
1162 -453 -757 811 1211 -1509 -3004 1891 4083 -94 -2209 -1107 -300 359 1492 1689 -1927 -2016 3032
1179 3032 1300 -3214 -1392 1475 660 161 1130 -467 -3285 420 3394 -1174 -2358 941 348 -282
1195 -282 1245 795 -1807 -1505 2392 1263 -1826 -211 885 693 718 -295 -1298 -962 367 2537 690
1212 690 -1825 -1576 595 1761 -642 -1159 681 -257 -387 2087 -507 -3562 -178 3265 1066 -2281
1228 -2281 -432 568 -951 1487 2114 -2360 -2064 1890 2226 -429 -1552 -264 -48 288 1736 -255
1244 -255 -2393 -424 1802 1598 -1077 -2328 -120 754 990 990 -1089 -2386 -49 2322 933 -2106 -987
1261 -987 1440 415 689 587 -2253 -1704 1897 2390 -521 -2023 -273 789 515 806 -523 -1983 1
1278 1 1783 1147 -1334 -2384 386 1640 195 -9 -591 -927 14 1530 920 -1982 -1214 2007 912
1295 912 -374 -9 -990 -834 1164 1858 -380 -2128 409 1719 -208 -486 -476 -473 725 886 -27 -1027
1313 -1027 -1056 1012 921 -426 -558 -308 351 475 62 -66 -989 113 1703 274 -1231 -318 -115 740
1331 740 848 89 -668 -856 996 1560 -879 -1530 -88 1075 1112 -110 -1183 -1352 -226 1974 642
1348 642 -1900 -1174 416 1553 39 -1397 -657 -129 955 1484 -357 -1608 -792 867 1626 452 -979
1365 -979 -974 -133 1285 1020 -1048 -1310 -276 1310 1865 -699 -2017 -905 900 1981 418 -1864 -1193
1382 -1193 889 1600 237 -1552 -875 620 1226 1277 -767 -1966 -186 1250 1284 -381 -1120 40 204
1399 204 778 503 -1083 -812 181 1194 1240 -715 -1720 -349 736 983 -394 -1201 -390 578 645 23
1417 23 -1305 -755 515 1609 631 -1971 -850 1242 581 -397 11 27 170 366 172 -776 -1196 528
1435 528 795 27 381 -1027 -527 1261 131 -776 -96 131 -778 260 1720 -744 -2265 944 1662
1452 1662 -909 -656 221 -184 1053 863 -1188 -1770 502 1401 527 384 -718 -1886 1381 1727 -2336
1469 -2336 -1488 1787 806 -734 373 12 -2535 -682 2895 432 -1551 -182 82 -21 941 -224
1485 -224 -1314 -387 1381 1402 400 -652 -2474 -470 2674 659 -2074 -453 1403 680 354 -413 -1739
1502 -1739 -1355 2022 2814 -378 -1435 -812 -159 383 -210 -515 920 989 301 -472 -1223 -1462 -1030 1686
1520 1686 2990 207 -1551 -1188 -376 150 352 794 683 -271 810 793 -2040 -2260 903 2716 641
1537 641 -1484 -72 -19 -781 313 180 -1221 92 1845 866 -702 -1028 -492 -313 433 598 -267 896
1555 896 1384 -645 -957 -620 -1544 -60 2763 1954 -1344 -1592 -523 -1579 -188 1829 265 -145 1644
1572 1644 45 -2403 -1368 115 481 2178 2219 -1991 -2671 1441 753 -1717 757 1332 -1187 58
1588 58 2127 -1306 -2970 1155 2002 -1016 335 1070 -1485 -300 1820 -344 -1934 -145 942 710
1604 710 1401 -95 -2556 -595 1567 -302 -263 1227 -380 -163 1541 -535 -3114 -399 2775 955
1620 955 148 471 -1681 -1945 1501 1253 -1377 278 1081 -54 -546 -213 -1120 -1223 1852 1851 -517 -952
1638 -952 -454 -585 251 1113 41 -1055 -78 1220 548 -783 -781 -72 734 138 -187 -59 -413 405 1519
1657 1519 -293 -1608 -353 1157 900 132 -170 -912 -630 57 334 -351 85 419 474 280 -1221 -1345
1675 -1345 701 1180 489 131 -314 -1373 -732 1519 358 -1345 388 892 -501 73 193 -1528 -384
1692 -384 1559 887 -1375 -528 633 -235 612 905 -1345 -1005 1567 1170 -528 -505 -254 -202 119 1132
1710 1132 -671 -613 623 403 117 -45 -949 -350 1266 908 -622 -974 -21 -14 -42 1164 -521 -1544 887
1729 887 973 -509 -400 159 -308 161 901 -217 -1745 92 1397 16 -389 -408 -385 346 811 365 -922
1748 -922 -732 792 522 66 -106 -706 -48 712 212 -452 -663 -304 479 633 -468 -435 -507 589 563 48
1768 48 -82 -590 249 1211 48 -936 -488 141 791 238 -156 -650 -414 619 577 -211 -992 -35 932 569
1788 569 -345 -416 -662 130 954 296 -636 -420 638 1008 -57 -589 -152 -259 84 861 4 -1021 -424
1807 -424 940 721 -164 -643 -305 -265 395 550 -759 -831 106 794 211 -583 -861 -213 69 591 -367 -760
1827 -760 -176 463 681 -241 -438 12 13 502 388 -523 -614 257 400 107 -550 -470 224 -27 653 -5 -428
1848 -428 -141 138 875 -311 -1037 -225 576 218 -153 -402 -651 -47 317 523 -590 -981 383 966 303
1867 303 -290 -154 -29 286 418 192 -673 -53 731 444 -53 -396 -204 465 561 614 -33 -978 17 695 304
1888 304 -374 -484 -574 413 296 -288 -593 -869 820 843 -377 -700 -9 362 429 290 -143 -692 -320 1238
1908 1238 695 -476 -599 0 465 233 108 -299 -607 273 796 273 -568 -598 337 635 246 -550 -720 114
1928 114 552 415 -12 -311 -430 273 675 14 -647 -210 315 507 26 -307 -610 138 514 -85 -542 22
1948 22 -44 109 501 -280 -895 48 590 171 -234 151 4 -587 529 547 -521 -185 564 385 143 -278
1968 -278 -408 -79 759 469 -539 -223 188 -277 418 388 -627 -430 529 546 -743 -728 459 100 -219 324
1988 324 -466 -761 316 768 30 -470 -388 -149 350 587 -198 -533 262 277 -290 184 -218 -363 502 1088
2008 1088 45 -1231 -550 474 189 393 218 -678 -299 447 158 -622 -599 157 949 518 -144 -1089 -477
2027 -477 586 437 -49 379 -158 -455 622 591 -482 -914 268 937 315 -297 -304 -503 -165 16 367 -419
2047 -419 -436 748 819 -232 -718 -782 -173 458 761 262 -215 -215 -184 -306 113 -292 76 1195 662 -774 -825
2068 -825 -207 -94 312 844 465 -1041 -9 513 -671 -311 558 42 116 572 -494 -1208 66 910 -123
2087 -123 180 703 -300 -336 1087 -330 -1029 269 761 127 75 537 -367 -381 602 -6 -761 303 676
2106 676 -14 511 -158 -1202 -146 797 195 121 565 -444 -812 349 331 -971 169 1242 -71 -649
2124 -649 -72 -627 -349 827 1189 -488 -657 158 -63 168 403 -622 -430 622 514 15 -590 -182 218
2143 218 270 466 -379 -693 234 526 590 -402 -727 -299 323 560 165 -260 -339 -439 295 609 -226 -486 482
2164 482 493 -208 -543 -638 -225 436 901 163 -532 -445 155 194 100 -261 -52 422 407 -75 -46 -449 -186 381
2186 381 512 -102 -438 247 340 33 248 -134 -534 205 483 -67 -220 -43 -21 -230 19 179 -493 99 585
2207 585 -194 -587 -118 -30 152 440 328 -178 -244 285 66 -184 -7 20 406 489 -354 -469 0 185 279 298
2229 298 -73 -422 -48 450 -74 -414 -13 64 63 368 -55 -569 -242 320 327 -171 -238 -54 -64 339 255 -424 -361
2252 -361 129 522 306 -264 -292 -11 121 358 33 -286 -160 203 486 -68 -560 -128 186 285 191 -192 -420
2273 -420 -64 351 285 -247 -304 24 116 255 45 -380 -168 150 336 192 -330 -223 172 257 183 -203 -235 -30
2295 -30 202 328 -209 -450 58 343 132 -103 -221 -160 -3 285 154 -364 -211 328 154 -29 -73 -213 25
2316 25 207 190 -25 -286 -64 243 166 3 -284 -107 159 94 -10 -256 -226 179 290 -26 -257 -242 55 267
2338 267 14 -102 -277 -60 350 43 -209 -207 -1 149 150 26 -129 -248 187 393 10 -249 -228 157 237 -1
2360 -1 -71 -118 -118 212 216 -184 -325 -106 236 205 -119 -252 -138 126 341 -44 -193 -162 -22 292 199 -249 -201 -36
2384 -36 220 209 -138 -172 -75 222 262 -79 -210 -118 -23 304 111 -304 -260 82 283 85 -248 -83 -71 100 276
2407 276 -100 -276 -74 170 210 -82 -271 -23 123 190 61 -185 -170 -32 259 234 -194 -251 37 183 164 -108
2429 -108 -212 44 129 150 -29 -191 -151 109 287 169 -285 -202 180 188 132 -109 -176 21 205 178 -95 -215 -37
2452 -37 165 230 40 -371 -54 349 103 -75 -82 -136 -53 211 227 -197 -337 82 175 -18 -21 -198 -103 247 213 -69
2476 -69 -169 -29 100 210 200 -115 -333 170 270 -112 -73 -23 -9 84 213 -24 -360 -60 235 -8 -78 -177 -252
2499 -252 91 268 -117 -164 -5 47 40 151 -2 -292 44 371 -90 -254 47 70 124 257 -49 -280 -116 226
2521 226 136 -41 31 -153 -27 225 -55 -269 -31 177 84 36 -113 -223 -76 326 216 -189 -114 -89 28 298
2543 298 19 -279 -29 140 22 -2 -44 -179 -61 316 102 -390 -71 184 68 152 14 -376 -187 177 228
2564 228 -7 -90 -47 -100 234 68 -376 6 301 44 55 37 -260 -111 349 272 -192 -180 96 -83 178 256 -320
2587 -320 -231 212 121 -73 80 -17 -259 87 295 -288 -332 304 177 -116 93 -113 -298 58 338 36 -148
2608 -148 57 -1 -25 99 -47 -163 297 231 -148 -20 -47 -234 73 287 -35 -289 24 139 -166 5 32 -160
2630 -160 119 240 -121 -294 14 90 -15 94 3 -184 73 327 -54 -178 -41 19 66 120 57 -99 -60 167
2652 167 125 -42 -150 -111 163 252 -71 -202 -132 -89 158 156 -70 -187 -52 203 18 -172 -57 -1 135 223 -6
2675 -6 -167 -85 -5 189 80 -202 -180 -9 149 103 -78 -87 -161 36 235 -19 -155 32 116 26 26 -120 -164 87 339
2700 339 69 -260 -58 -17 38 170 154 -117 -85 153 96 -177 -45 16 -48 74 55 -205 -153 60 30 108 -44 -128
2724 -128 -59 101 43 -168 -72 40 -24 110 113 -167 -75 138 36 -142 3 62 62 104 115 -181 -220 122 100 -12 21
2749 21 -38 -92 -4 88 -28 -151 50 101 23 -60 -175 -107 102 81 -9 -66 -94 42 60 23 -160 -106 118 197 -53 -35
2775 -35 -95 -85 137 147 -23 -144 -93 153 55 -27 -27 -124 14 234 20 -172 -183 3 160 32 -4 -108 -38 106
2799 106 102 -36 -147 -75 97 177 -28 -155 -81 -10 136 83 -62 -176 -42 153 69 -111 -81 -59 27 82 35 -114
2823 -114 -83 39 156 13 -66 -40 -4 131 82 -40 -95 20 117 106 -64 -73 -26 36 71 -4 -108 -34 -16 91 40 -155
2849 -155 -46 -10 68 25 -69 -96 -66 69 138 -80 -96 48 38 35 24 -32 38 54 111 24 -91 4 82 72 1 -78 -36 38
2877 38 11 78 -69 -156 12 129 17 -126 -140 -2 67 56 12 -135 -47 83 154 13 -117 -123 25 38 66 -89 -97
2902 -97 3 135 -15 -33 -63 17 87 -4 17 -66 -134 23 132 10 -20 -127 34 36 -30 -13 -73 -73 87 81 -62 -140 -30
2929 -30 134 48 -27 -72 -126 56 86 -13 -48 -84 -29 123 58 -45 -157 -23 87 17 -13 -44 -89 29 130 -2 -95
2954 -95 17 28 76 103 -4 -52 25 93 3 -25 14 6 22 120 -3 -115 -16 56 49 -52 15 -7 -39 108 1 -106 36
2981 36 59 -22 57 -51 -133 -58 109 98 -79 25 19 9 110 4 -78 -41 151 80 -63 -23 -3 -54 101 17 -157 -7
3007 -7 103 26 23 3 -70 -86 36 107 -18 -84 12 -6 -57 39 -90 -17 145 134 -1 -85 -74 -43 101 153 -33 -67 68
3034 68 70 -46 32 -54 -42 93 82 -8 -105 6 8 84 12 -72 -89 73 134 12 -47 -24 -40 41 82 30 -54 -15 50 -20 -17
3063 -17 -59 -35 67 93 -35 -70 -118 -13 110 65 -19 -40 -42 -1 -16 38 26 -68 84 85 -12 -47 -49 30 144 118 -27 -42
3091 -42 82 51 -66 -9 -19 -65 94 58 -59 -82 78 33 16 -25 -30 -99 34 108 49 -45 -17 -34 46 82 17 -51 2 59
3119 59 -31 -8 3 0 4 79 9 -118 15 -3 35 75 23 -92 -38 99 35 -54 64 41 24 22 -17 -57 -50 79 15 -86 -91
3148 -91 28 -10 27 100 -27 -3 45 51 34 -30 3 -41 78 58 -22 -61 52 0 26 32 -80 -113 67 45 29 -58 -1 -12
3176 -12 23 65 -41 -68 -2 51 4 13 -53 -44 111 96 -70 -31 -18 -9 50 51 -45 -101 22 63 -10 -29 -94 -9 79 38 -68 -52
3206 -52 -29 -1 35 29 -35 -86 93 137 1 -35 -31 -17 35 8 0 -60 -11 80 31 13 -53 -80 51 66 -20 -26 -79 5 -5 0 -17
3237 -17 -64 -61 70 5 -43 -47 -26 70 45 -45 -80 -20 53 60 -21 -45 -6 -21 69 4 -33 -69 11 26 -8 -20 -62 0 23 53 15
3268 15 -21 -12 -11 28 3 -14 -3 -35 8 -29 -61 -45 -2 -29 10 -60 11 14 30 -27 -10 -71 30 2 85 3 -36 -21 -13 37 77 -1
3300 -1 6 0 39 -17 -45 47 74 49 42 9 -12 -10 -5 71 24 -50 -33 4 17 -27 -24 -21 6 29 10 -51 -8 37 24 4 -3 -11 -8 107 46
3335 46 19 -43 9 40 75 78 -66 -11 25 27 97 -11 -5 7 -16 58 46 11 -38 31 -12 9 -36 -64 15 41 23 -15 -99 4
3365 4 67 -8 -7 -31 21 -14 40 -7 -32 -29 56 33 41 21 -87 33 31 5 9 -13 7 76 -18 -31 -4 22 72 26 14 23 40 69 -29
3398 -29 -40 -16 -21 7 39 -56 -49 -47 3 30 33 35 -18 8 38 -6 -49 -48 -1 8 30 41 -62 11 20 30 -26 -29 -6 -9 83 17 9 -31 19
3433 19 -1 75 36 -32 3 36 -11 39 -39 -67 41 73 -54 -26 -7 2 12 -11 5 -9 -26 16 38 -70 -51 -6 18 13 59 -27
3463 -27 46 67 49 17 -14 -27 19 8 45 20 5 -3 55 43 -25 -68 -8 -17 -37 11 -28 -4 -1 32 23 -46 4 -4 -12 31 53 -47 -19
3496 -19 11 0 -26 -100 10 0 -30 16 -21 -26 17 3 -20 17 37 -9 33 26 -25 -90 0 68 -20 -6 29 -68 0 49 -8 -1 41
3527 41 29 16 -47 55 -14 13 95 -6 15 -23 86 -40 33 7 -25 -26 -9 5 -36 -4 -22 -62 12 23 -15 -12 85 29 -12
3556 -12 -15 -32 -54 50 85 16 1 -13 11 9 81 28 -11 12 88 0 -81 -64 -10 50 -2 -83 -38 -30 -1 50 7 14 -67 -15 25 -38
3588 -38 -60 5 -18 -18 37 -18 -53 11 50 45 9 -10 8 8 92 55 7 -36 -6 -1 31 10 -21 24 38 -4 -29 -19 36 34 36 34 -50 -120
3622 -120 0 4 40 27 77 -57 -20 23 -28 -21 21 39 32 -42 -37 -23 27 49 -9 -16 -5 -19 59 20 -8 47 -13 63 -61 -22 10
3653 10 18 16 40 -48 -67 29 61 29 31 -33 -4 5 -20 27 11 -34 28 -14 -52 -66 -48 56 4 31 -22 -49 -35 15 -2 -33 -53 -44
3685 -44 53 14 17 -21 4 -22 3 -9 3 5 2 60 25 -29 -58 -48 57 57 23 -41 -21 -26 16 -27 -8 -9 49 -3 -48 -62 -31 -34 -5
3718 -5 37 48 -57 15 1 17 -14 25 45 74 -16 61 -74 -25 76 63 4 -36 8 -2 53 30 -53 -47 -12 18 30 23 8 -62
3748 -62 -55 46 39 18 -45 38 -18 10 -4 1 36 42 24 -16 32 -30 24 60 -13 -62 -15 96 45 20 -43 17 28 73 16 -76 4
3779 4 59 49 16 32 -57 -14 49 70 -13 -48 50 29 -27 43 -30 -23 -23 52 50 -90 -32 -46 63 24 -67 -49 60 16 0 26 -28
3810 -28 -32 60 -8 33 -57 19 87 73 2 -54 -61 44 53 43 -39 -36 -39 1 38 17 -27 -53 20 15 -15 -27 4 -50 25 -30 -29 -46 7
3843 7 62 18 -50 -17 13 3 21 17 -43 39 27 25 9 19 -17 23 52 39 -3 -36 24 39 -12 -103 -65 -21 41 14 13 -4 -27 42
3875 42 23 -15 -36 -66 44 88 13 -34 -24 -56 -34 -44 -20 -45 -9 32 8 -37 -90 -95 22 64 -3 -29 2 52 77 5 -11 -28
3905 -28 -22 44 66 -11 -3 -38 37 21 39 7 -78 28 -32 -30 -65 -11 19 62 26 -13 -49 -44 13 5 -4 -16 8 28 -5 -51 -25 13 3
3938 3 11 9 12 -5 25 55 76 -41 17 57 -15 29 -40 -32 19 84 5 34 -85 16 21 -1 -2 -19 -33 14 30 -13 -64 -43 3 -15
3970 -15 -5 -78 -35 1 51 90 5 -53 13 49 12 -7 -28 0 38 21 4 -24 -63 -11 37 82 -9 -20 -17 54 18 -3 -11 -69 -13
4001 -13 68 21 -70 -7 3 8 0 -25 -119 -45 130 -4 -15 -6 -26 10 40 10 -22 -35 -3 24 -14 -38 20 -8 29 18 -47 -8 60
4032 60 -6 21 -3 -20 -80 17 18 -63 21 42 36 10 30 -16 -26 54 46 -18 22 -31 -32 -10 35 -5 -6 75 58 -60 -45 16 -58 19
4064 19 70 -31 -127 8 55 0 50 17 -40 -33 43 32 -56 -42 15 63 37 -3 -76 -43 77 34 -85 -52 -18 -29 86 -4
4092 -4 -107 -36 42 50 -10 -5 -62 4 32 7 -21 -54 21 47 40 37 -63 -79 -17 -14 57 21 -59 -18 34 32 8 -64 6 99 89 -10 -29
4125 -29 8 34 22 39 -33 -38 12 56 12 -50 -18 -46 -57 83 20 -94 29 12 -16 -54 -49 -42 -10 74 45 -147 -32 12 -35
4154 -35 55 70 -17 -24 54 -25 -37 -17 53 -23 30 48 -58 -2 86 53 -4 14 -5 -58 -3 38 -43 -31 96 -47 -78 6 -44
4183 -44 -7 -23 49 -108 -145 49 31 69 -62 -82 -19 40 98 -7 41 51 -27 36 64 -96 -4 -3 91 31 -3 -23 -21 42 83
4212 83 25 -68 33 32 -34 40 -15 -42 27 63 23 -92 -80 -21 -2 24 26 -54 -29 54 50 -52 -16 -70 65 46 43 -33 -19 -33
4242 -33 12 97 -7 -32 4 48 9 -23 -33 -27 -14 41 43 -72 -5 45 43 -3 9 -52 -51 36 33 -27 -65 16 33 30 -6 -71 -51 4
4274 4 -29 19 27 -58 -7 16 31 -115 48 30 13 -20 21 -45 22 -11 77 -42 12 18 78 63 48 -110 -8 42 46 7 -87 -35
4304 -35 -5 12 -4 -18 -60 31 32 49 -32 -35 -29 -19 15 -32 -66 -11 19 8 8 -35 -60 -13 29 12 -63 54 60 78 17 -26 -89 -18
4336 -18 50 35 -46 -55 -44 5 55 11 -38 -69 10 44 26 -66 -95 10 72 -36 -48 -66 -49 84 51 -41 -26 -9 4 42 16
4365 16 0 -39 -7 -7 13 11 -48 0 33 19 -70 -21 1 30 44 -15 -75 -83 -19 42 35 -45 10 -30 45 -25 -68 -24 43 76 20 -4
4397 -4 -99 -40 6 45 -5 -42 2 37 60 -40 -65 12 14 59 -10 -53 -16 8 28 51 -7 -38 26 24 53 -13 -15 -24 33 30 6 -7 -13
4430 -13 70 29 14 -45 -47 20 -5 122 -27 -113 48 65 19 2 -26 -39 36 21 -2 -45 -28 21 20 10 -7 -88 14 89 22
4459 22 5 -64 -13 9 47 6 -40 -4 29 -21 -35 -46 0 -16 54 35 -34 -56 10 70 34 -32 -75 -19 80 9 -108 -72 -29 52
4489 52 12 -47 -21 -48 -8 16 6 -25 -124 -57 46 72 -45 -35 -3 28 101 -36 -44 -35 71 -22 -9 -4 -43 28 78 -24 -28 -64
4519 -64 15 13 48 -17 -113 17 34 -37 -67 1 -28 47 33 -72 -79 13 59 32 0 -25 9 0 54 39 -36 -17 27 44 -1 30 -82
4550 -82 78 154 30 -62 -12 -22 -38 87 84 -130 -78 13 -23 10 10 -58 -53 106 62 -70 -6 10 -9 0 6 -24 -60 51 47 -2
4580 -2 -27 -13 -29 21 15 -10 -33 56 75 -31 18 -1 -22 106 68 -37 -71 -61 91 10 71 9 -49 53 67 -7 -58 -10 11
4609 11 82 15 -37 -5 46 75 -21 22 -59 -50 88 24 -37 -65 -4 -63 12 30 31 -12 6 85 -48 -64 -6 -18 65 109 -14 -72
4639 -72 -5 51 49 30 -9 -101 21 59 -23 -46 -25 6 -15 21 -63 -124 2 48 -25 -35 30 -118 -49 107 -30 -128 86 65
4667 65 -2 69 58 -39 33 135 45 -78 16 76 21 108 16 -118 -33 76 11 -24 10 -39 -61 38 20 -70 -36 125 8
4694 8 -28 -4 -36 -55 71 78 -60 -60 -18 -19 -4 55 -24 -51 43 24 -67 -45 58 41 6 62 -10 -46 59 72 -32 23 8 -11
4724 -11 54 51 15 -82 -2 43 -32 -13 -76 45 69 48 -5 -17 -43 49 123 4 -22 -52 -84 26 29 -58 -39 -74 93 11 -48
4753 -48 -26 -29 9 109 -3 -41 -19 -16 4 93 -8 -84 -15 47 58 -30 -53 -30 26 73 81 -57 -79 31 51 -16 0 -78 -57
4782 -57 42 65 -35 -57 -40 26 -30 20 -25 -79 -10 74 33 -29 10 -24 39 -17 -25 46 -19 36 42 -3 -22 -13 40 82 65 -40 -44
4813 -44 30 6 -21 -68 4 28 81 2 -66 1 13 2 32 38 4 9 16 55 -36 -26 -10 -25 50 5 -1 -2 47 4 -10 -32 29 13 34
4846 34 11 -9 10 21 2 9 3 -7 -61 8 9 0 -32 -12 50 15 11 -17 -12 31 36 25 -39 -41 30 25 -12 -86 -20 18 8 18 -14 -4 -72
4881 -72 25 48 30 -23 -92 42 49 9 48 15 -12 6 22 -57 29 19 67 11 45 -14 -21 16 26 17 40 -55 -23 35 72 4 -11
4912 -11 -32 33 8 4 -20 -63 10 -11 -18 -28 -9 -34 42 -19 -58 -26 -5 91 11 15 -19 8 19 38 -16 -1 -4 -10 89 8 -47 26 34
4945 34 68 -2 -11 3 -5 14 21 -56 -23 14 42 42 -14 -17 -21 20 23 -4 -42 -31 32 71 -30 -64 -33 64 10 -57 -15 -7 20 7 43 16
4979 16 -38 25 67 -2 -17 -10 -48 35 47 8 -39 -1 63 -3 39 -38 -23 14 2 18 -32 -26 31 -25 -8 48 -18 -43 4 73 42
5010 42 1 -7 -34 -9 22 8 -35 17 -24 2 -34 -1 9 7 67 25 27 7 46 -11 6 -23 17 4 20 47 -58 -73 -5 -5 -61 3
5042 3 -46 13 68 35 9 -70 30 -25 -42 20 7 -117 68 48 -79 31 8 -17 31 63 33 -51 63 78 8 35 31 -120
5070 -120 -5 26 -4 -48 -9 7 -13 20 12 -28 -32 75 -25 -40 -59 22 -36 -6 -2 -32 24 0 15 -7 -24 -38 -39 -23 9 -41
5100 -41 24 1 44 -9 -25 -5 15 58 41 -8 9 56 -29 37 24 -1 -12 -17 18 -25 -72 6 -20 -1 22 1 -6 -11 -22 56 -6 -13
5132 -13 -61 -17 39 -18 -17 -28 40 7 -26 -67 -3 42 11 84 7 5 -31 17 40 -21 -11 23 29 21 53 -28 -14 47 11 -26 -14 -12 -7
5165 -7 67 7 -28 17 -21 -42 -8 -7 -83 -6 3 19 -48 -38 -9 -65 13 -1 -13 -43 50 62 7 40 16 -72 -49 21 -44 5 14 45
5197 45 -28 -16 -11 -50 18 54 -76 -47 -37 -27 -35 -17 7 -34 -33 11 -9 60 45 -48 -53 45 34 -41 -33 -3 -29 -42 -51 -55 22 -28 10
5230 10 3 -23 -42 32 4 0 21 -3 4 50 -18 10 7 -40 63 27 27 -33 -28 17 -36 -47 -29 40 15 -10 7 -55 5 -33 -24 -18 12 60
5264 60 -36 -31 4 -45 7 -31 -25 -7 -67 0 14 41 -18 -37 -32 28 76 5 -7 18 7 12 27 -35 -19 -32 48 -15 56 15 -40 -24
5296 -24 -3 1 32 -34 -78 26 -21 4 28 -9 -3 15 -48 1 -28 25 20 7 27 15 75 -16 27 24 -17 7 37 32 -6 46 4 38
5328 38 -24 46 49 15 -27 16 -37 -30 8 41 -7 -23 27 -17 52 34 -27 12 -13 -3 6 15 -12 29 -6 -40 -7 -20 -9 1 10 -10 21
5361 21 58 29 21 -4 14 10 -21 39 -12 30 -4 12 35 -4 -15 4 24 -2 -15 5 18 8 46 -28 -32 -29 21 -8 -29 13 10 26 -30
5394 -30 -25 -61 3 -5 -15 -4 1 10 27 33 38 23 7 50 26 -5 1 2 -37 -1 -4 24 -54 -10 16 36 42 32 -19 -19 12 -29 4 -25 -32 -6
5430 -6 5 13 -20 10 -2 -12 -60 -18 53 10 7 -11 -25 0 17 -5 43 -20 -32 41 -9 40 15 -21 6 -30 -41 19 -26 4 41 19
5462 19 8 7 -6 -30 -17 -9 28 60 14 -23 13 -6 -15 -57 -50 68 4 -26 -8 -29 -45 -7 21 25 55 26 -2 29 1 3 30 -18 42
5495 42 76 -34 -35 -27 30 -9 7 38 16 22 24 -25 14 -18 -5 -3 -8 -20 -14 -34 -38 -67 -43 -44 -41 36 -42 -37 24 12 13 -12 -32 -36 -13 -27
5531 -27 -3 29 58 9 0 -36 -16 19 13 -5 -18 -7 -62 -14 -28 -37 71 -40 26 -17 65 38 -54 -40 -34 16 4 23 -41 -35 18 56
5563 56 -23 8 46 -8 37 -10 -3 -25 50 32 -1 2 4 -13 20 17 -11 -31 28 57 1 -19 -60 13 10 41 12 -6 14 36 -6 -7 -14 -32
5597 -32 -40 19 37 -65 -52 43 6 -63 -39 -2 -56 -27 -51 9 12 -26 2 -17 -34 48 15 44 24 11 12 33 5 12 -44 -6 -55 54
5629 54 70 -30 31 24 58 46 8 -21 27 -28 -13 6 -28 -2 -19 3 -50 -41 29 -3 -120 -42 36 2 -19 66 4 -22 51 -12
5659 -12 7 -15 102 9 -1 -19 -37 -17 -27 8 -109 22 39 50 49 4 -19 9 51 -30 -25 4 -27 59 -43 48 -9 7 69
5688 69 9 -19 16 -11 -65 8 -7 -35 17 52 -5 -1 -9 11 26 -9 124 -15 -11 63 -4 -28 -8 11 -17 67 -50 -14 -39 32
5718 32 24 -41 22 14 -12 -32 81 -16 -14 -55 1 -6 -15 -5 -41 -6 4 61 -59 -17 35 -24 34 35 -18 -51 26 -41 19 3 3 -30 -19
5751 -19 45 -19 34 25 51 -68 39 9 33 48 1 44 -35 24 27 1 4 -45 -71 -51 -32 -4 14 -21 23 77 -13 -56 -43 -23 -12
5782 -12 -8 -58 -3 0 19 6 52 -5 -1 15 40 -4 -50 27 -12 -7 24 -3 17 -32 51 -13 -5 -1 30 87 43 -5 -20 80 32 7 -28
5815 -28 -16 -56 -1 35 2 -53 -17 -48 -2 33 -3 -59 -5 11 47 28 -18 -24 55 73 -29 -20 -4 40 29 -17 10 -19 60 104 25
5846 25 22 35 -27 52 31 -42 11 3 -4 43 -27 -18 8 -29 37 39 23 -23 -28 -2 -40 -19 -34 22 79 -38 -45 -28 -53 -57 30 61 -1 -21
5880 -21 29 53 20 -28 13 102 86 42 17 -12 9 29 -5 -24 -47 17 38 23 1 -62 16 -12 -14 -58 -34 -5 13 11 -17 -13 -35 -21
5912 -21 -1 -31 2 -32 -12 -4 -23 19 35 -21 6 -15 58 -34 11 -41 25 43 -7 28 -14 40 -18 -40 -36 -23 56 44 -20 -11 -51 24
5944 24 -20 31 -14 15 -42 76 39 0 41 -74 52 59 32 -58 17 -6 22 7 -59 -60 -39 20 8 12 -13 61 99 75 14 -1
5974 -1 -32 59 81 -44 -20 -22 -9 -6 33 -50 -12 -50 23 26 -23 -34 20 -34 16 -3 -22 -16 34 31 -6 -35 -27 9 68 8 -108 -40 5
6007 5 70 35 -20 27 -30 -10 88 4 31 -5 73 29 21 -57 -35 34 17 -38 -10 -45 1 16 -27 -40 -63 -48 19 59 -34 -46 15
6038 15 -1 48 -5 -35 -3 53 75 -24 -66 29 20 2 -7 -46 -24 41 4 -50 50 31 19 63 88 61 -148 39 18 27 -10 -70
6068 -70 -80 57 35 -15 -33 -56 -7 17 42 29 -56 55 54 -45 -29 20 -11 -16 69 -6 -115 -54 -3 -27 7 -91 -17 -45 35 102
6098 102 -70 -4 71 -3 42 40 9 -88 27 62 18 26 26 -8 -11 66 -27 -82 63 70 1 13 -51 -83 -32 1 21 -62 22 65 15
6129 15 -6 -44 -78 14 35 6 0 -3 15 31 21 5 26 44 55 -32 -39 6 22 35 41 22 19 -50 82 47 -71 -78 19 38 31 -2 -17
6162 -17 -36 -29 87 -30 3 -21 36 -32 80 25 -111 -60 90 66 -36 30 31 -53 69 75 -58 -57 -25 44 24 4 -106 -63
6190 -63 90 28 31 -37 -29 -31 64 -48 22 -12 18 106 -56 -34 -31 -17 65 43 -69 -128 -31 101 53 -34 18 31 -26 13 -51 31
6220 31 -11 11 12 11 -2 44 -87 50 32 -55 -51 -35 70 40 17 -48 -43 35 -1 -2 -53 -52 23 -10 42 -6 -70 35 28 -14 -27 -28
6252 -28 -20 27 33 19 -61 28 72 -45 -53 -18 -52 -41 25 -8 -62 34 27 18 6 29 21 43 16 113 -21 6 28 -9 -19 0 -8 52 62
6285 62 32 -9 -77 0 -10 77 37 -18 -93 -15 54 10 -65 -59 -45 -26 44 65 -75 -59 100 39 58 5 16 -41 63 44 -2
6314 -2 -62 55 94 -5 10 -26 -73 12 86 2 -22 -73 -23 -13 16 -16 -67 44 42 20 -42 62 29 1 33 2 -109 -1 37
6343 37 47 5 -42 -43 41 40 54 -43 6 1 44 8 19 -49 32 -2 28 4 -28 10 18 63 54 10 -13 46 11 17 -49 -33 -24 43 -61
6376 -61 -40 -23 1 9 -5 -22 1 -32 14 -21 -3 -58 -14 26 56 27 -13 -94 93 77 10 -51 -49 40 73 -13 -18 -2 46 45 20 -27
6408 -27 -103 -1 -2 17 76 -61 -13 43 43 64 -63 8 47 6 -21 -67 -52 -15 0 35 -19 -34 -12 -15 -5 6 4 -73 22 80 13
6439 13 10 -51 22 80 -37 -53 -26 32 -2 41 17 -20 -46 7 33 -30 -40 -33 4 22 36 -47 -49 -1 48 14 18 -52 0 56 69 11
6471 11 -59 -17 -5 -2 -7 -34 -36 -1 75 32 -3 -40 21 44 31 -19 -55 -41 46 -46 -28 -47 -31 41 12 -34 -30 -11 -25 36 -36 -26
6503 -26 -30 4 31 5 -48 -56 13 32 25 -84 -84 -1 64 93 -4 -10 34 35 91 36 -63 1 9 84 27 -17 -15 -5 82 46 23 -10 -28 17
6537 17 87 33 -29 14 16 -38 62 5 -114 3 34 -25 -4 69 29 9 76 13 -39 0 84 5 -7 7 -48 14 27 35 -86
6566 -86 -30 95 54 -53 53 -33 10 108 5 -58 -58 34 31 32 41 -80 -63 35 80 -5 -20 60 17 -20 22 -72 -65 58 70 -92
6596 -92 -15 -56 -79 3 112 24 -73 54 38 -88 5 37 -85 94 79 0 -70 -49 104 -10 49 -37 -61 -8 105 15
6622 15 -20 5 29 8 57 -41 -6 -9 -15 21 -115 -102 -32 -3 47 87 -13 -149 -72 -50 33 63 77 -93 -152 136 -30 -17
6650 -17 -78 40 12 -39 -38 -174 -78 13 154 0 -49 205 -44 -105 61 49 96 98 -56 -134 -14 69 -131 -68 67 -95
6676 -95 -297 78 27 -67 -110 52 -26 -133 100 65 38 -44 60 39 -78 -7 -24 195 180 -210 -249 94 -13 67 181
6701 181 116 -58 -79 130 49 -171 173 -54 -79 169 34 -174 -139 112 63 -53 3 -102 -156 7 229 -185 -151
6724 -151 16 132 62 72 -15 -107 115 65 -50 -16 -43 -10 168 137 -133 -131 -127 15 193 -85 -33 -29 -73 238 -71 -119
6750 -119 122 46 -59 -39 -92 -95 84 220 77 -159 28 -10 -7 162 -2 -82 92 142 50 -5 -56 -75 14 108 90 118
6776 118 -86 91 150 -89 -178 56 -63 158 164 232 49 -72 27 -78 103 -72 60 132 1 -138 -173 -171 23
6799 23 -3 144 -74 73 9 119 196 -82 -47 90 -64 207 -43 -136 -86 161 50 -193 14 -197 57 47 -271
6822 -271 -102 -34 -11 -66 77 -50 6 343 153 105 32 -159 -256 204 -16 135 247 -141 104 29 149 -127 -64
6845 -64 -9 48 -145 -181 144 -27 -84 -219 -70 -100 -158 91 -76 -68 -82 -84 -121 -15 53 -34 -277 -43 -14 111 50 -64
6871 -64 153 58 -48 82 -11 -134 -136 -21 52 -56 5 -130 -21 45 -47 12 49 202 28 -188 16 45 79 -209
6895 -209 -25 -95 68 41 -101 103 -149 -197 9 86 -98 126 30 142 -15 -32 -81 71 -74 125 -21 141
6917 141 -102 -41 90 52 29 -135 132 -162 -15 212 0 -96 -39 -4 -31 -24 17 -90 54 -28 -84 276 153 33
6941 33 181 -30 -182 0 211 -63 94 -34 -24 -64 -66 63 -106 99 87 -129 -196 152 5 138 77 -43 -111
6964 -111 -227 -41 4 52 -77 46 5 45 146 -9 -56 4 -27 40 6 -33 -86 -35 -7 215 54 -123 124 -20
6988 -20 38 -8 -147 57 -38 38 171 -27 42 -49 89 113 184 -56 136 13 126 50 -33 -29 119 -69 -103 -167 -15
7013 -15 59 204 74 4 -32 184 172 15 -44 -192 45 -61 117 -147 -1 35 327 62 113 -24 -63 41 92
7036 92 -42 35 -75 67 85 106 -93 170 -45 51 59 -36 63 16 140 210 -10 -12 -7 47 -72 11 -114 -149 9 165
7062 165 -218 -34 -219 -242 181 -30 -172 -111 264 -44 -79 42 14 -212 -44 133 -114 -75 240 177 -42 134
7084 134 82 -275 340 98 -11 70 27 -53 116 26 289 -202 33 149 -167 -118 104 -108 -168 80 -76 -55 55
7107 55 -83 1 87 67 -178 230 3 -37 184 43 92 -151 134 41 -47 -52 -44 -56 -126 98 54 -19 52 42 -302 -232
7133 -232 80 75 -24 42 -160 -250 477 91 226 -12 120 -6 77 -41 -312 65 19 100 -127 181 39 -23 -63
7156 -63 -54 96 30 -90 93 -79 19 -159 75 2 -152 211 83 -7 195 30 -133 19 171 -207 265 63
7178 63 26 257 -57 93 -181 -64 -30 -1 78 177 128 -201 -170 168 -201 -73 79 132 36 -321 -70 -454 68
7201 68 -24 77 8 78 2 -438 73 138 -247 -363 275 -165 -116 -62 190 -295 -80 124 -58 -26 83 111 2
7224 2 182 -160 147 41 159 -62 -171 -85 37 -11 78 -41 -251 149 -20 -135 -80 -200 -26 50 173 63
7246 63 163 -157 -185 -77 45 -124 -178 19 72 -29 84 -204 -126 3 217 -18 -175 -122 48 188 121 -107
7268 -107 -252 20 -23 106 -123 199 -39 147 166 160 28 -79 -186 103 555 223 -81 143 66 -121 -56 84
7290 84 -70 45 235 -49 -1 189 251 -107 23 -73 -179 -41 -13 -145 -78 -63 117 100 197 -12 -175 141 34
7313 34 -9 53 159 -27 77 -103 -69 52 -32 -117 -18 -74 85 -68 117 89 -47 -5 -120 18 -96 42 95 84
7337 84 -55 87 -118 5 132 95 94 21 144 -117 -14 -92 121 7 -95 -144 162 97 11 -10 -187 132 -138
7360 -138 -44 -96 143 -75 55 71 -69 -51 -274 47 11 8 -230 10 -112 146 348 59 81 40 25 -84 57
7383 57 134 57 -218 55 114 -143 -228 35 -170 101 -1 -72 -114 -47 202 3 145 43 48 100 -203 154 -87 -195
7407 -195 -54 21 -203 -62 -9 -132 -102 30 -287 98 -231 -99 8 112 -252 47 -187 -105 -108 -226 -37 58
7429 58 310 50 13 36 -124 68 17 22 182 95 125 -17 -82 -277 8 -60 -37 -419 -59 11 -97 85 -197 198
7453 198 119 -61 -99 -193 -178 93 -293 109 113 -49 -10 238 -136 -57 -432 176 73 -292 -327 155 214 -106 -206
7476 -206 -214 230 -559 33 100 169 137 -216 -248 38 -28 -73 -191 -167 -169 292 -4 -288 189 -233 503 -103 164 199
7500 199 -138 67 638 359 110 -63 -65 136 243 216 -211 280 114 64 -246 -169 16 208 249 244 71 87 -76
7523 -76 119 138 19 32 82 157 123 23 -38 6 155 100 -2 256 69 -386 -20 112 20 -37 -278 213 -91 -33
7547 -33 49 -103 -131 -122 93 -265 152 266 -74 113 -51 38 91 204 -470 -71 -223 -211 17 -188 314 -178 191
7570 191 -173 156 -152 -86 -220 -260 -418 -218 -160 -316 -63 174 53 -263 309 -225 -37 -55 341 -334 310
7591 310 -36 16 413 -96 152 -172 -381 154 49 30 -296 88 -35 4 -77 -105 243 -143 -268 -334 178 49
7613 49 -144 -61 -113 -159 -85 160 -223 -81 -69 -9 23 -45 -37 54 -100 -16 -22 69 -41 78 211 99 -267 -73 130
7638 130 51 71 285 -15 -316 203 221 117 29 249 -277 249 190 -84 -54 160 166 -169 -120 84 74 -7 47 394
7662 394 135 212 80 -25 -156 -34 -13 21 84 -191 -96 46 -92 -291 -266 -91 361 -181 138 -57 -221 -73
7684 -73 45 139 -396 101 178 -109 32 25 -89 15 193 -44 -51 -219 8 -12 -201 156 -245 -66 -146 120 -37
7707 -37 -81 -296 -253 369 127 -116 -484 -118 -110 -147 -47 166 -292 185 242 195 -143 -87 -56 22 -176 104 -66 249
7731 249 52 -1 107 205 -118 -111 268 330 397 72 -31 -222 -53 -109 -120 227 -51 -162 -247 -42 -54 -214 29
7754 29 -135 -160 -155 -4 460 -20 86 297 -21 -261 27 -97 17 -27 316 73 -107 -91 54 53 50 -25 45 39 94
7779 94 63 38 119 -53 -130 -32 114 -312 -37 -9 63 90 118 36 -37 -89 103 353 -7 -45 -76 8 158 -110 -62 -209
7805 -209 6 -76 -276 -16 113 -4 59 211 -61 -140 -237 169 129 -83 61 59 -140 -219 -151 152 -145 48 99
7828 99 -128 4 23 17 -3 105 -7 -211 0 201 11 18 -363 189 -5 68 -36 -107 -65 126 141 241 106 -102
7852 -102 -33 8 -157 -72 98 70 117 229 -89 -65 -270 -17 99 -43 10 -53 226 -56 -210 125 117 24 346 100
7876 100 -98 47 48 -10 -31 11 35 -90 67 307 -162 100 -82 -9 -25 115 -204 -69 66 13 239 18 86
7899 86 142 58 -157 31 46 -74 159 -260 -42 -124 36 1 20 12 17 -25 -89 129 -39 55 -16 111 72 25 35 -66
7925 -66 -56 63 156 -147 -117 -15 -156 181 63 -28 -49 99 -39 54 32 -25 -5 60 76 -47 -15 57 78 -131 -103
7950 -103 198 -94 6 179 -36 -171 128 157 27 80 -75 -91 62 80 15 46 117 59 25 102 -23 -124 -113 -244
7974 -244 -64 -176 -56 -35 -86 -32 80 -283 -94 37 -156 -123 -120 -62 184 115 28 9 109 123 -5 25 16 132 191
7999 191 264 67 -11 -264 174 -45 23 53 -28 -342 -125 -117 37 -331 -107 -14 98 3 -30 -65 -99 161 -27 62
8023 62 -61 25 35 -79 -11 -115 -106 -21 53 17 29 95 115 132 166 147 174 -119 -169 245 -14 85 14 155 -176 247
8049 247 97 41 144 91 -43 148 -71 -97 -6 -39 85 146 -48 -177 -254 274 -54 -9 45 -149 -52 124 221 -19
8073 -19 303 123 -39 28 171 -82 181 110 -238 -27 210 6 -145 -139 149 42 -184 238 -208 -22 125 23
8095 23 54 -19 289 -15 128 58 -69 -11 86 67 -174 -29 -53 -192 22 167 160 -154 81 148 61 124 -57 -22 50
8120 50 -126 -5 -255 -117 133 -4 86 93 130 168 37 83 82 149 -350 -23 -8 0 61 -234 32 -66 76 -46 -114
8145 -114 138 161 -127 12 7 54 64 139 -160 -321 -98 -115 -133 -46 133 162 -58 195 -160 -78 -119 34 5 144
8169 144 -167 -183 -60 208 172 -71 -127 -65 21 -71 0 -121 -13 -64 19 159 -86 -127 81 69 -200 65
8191F5
$$ Imaginary data points
##PAGE= N=2
##DATA TABLE= (X++(I..I)), XYDATA
0 0 0 0 0 0 0 0 0 0 0 0 0 0 0 0 -4 8 -8 8 -8 8 -16 16 -16 22 -24 28 -32 36 -44 48 -52 60 -68 76 -87 98 -109
37 -109 120 -136 149 -166 183 -203 223 -247 271 -299 329 -362 398 -438 484 -534 592 -655 730
56 730 -818 919 -1040 1191 -1377 1616 -1935 2377 -3033 4080 -5952 9966 -21904 125843
70 125843 532940 -15841 -368955 33376 195401 -46541 -84028 -17113 -26351 99465 156631
81 156631 -104634 -211137 52462 181156 -11335 -149708 -14249 164239 61382 -159555
91 -159555 -103857 120756 109418 -73078 -82079 25454 44611 48546 1438 -120726 -40467 142534
103 142534 33802 -134087 -5969 109344 -14505 -57681 19005 -40308 -50241 112917 71974
114 71974 -129385 -60428 117373 24124 -125925 -14003 118853 14065 -68852 18759 20004
125 20004 -63054 1233 87770 -14006 -86880 58087 102702 -88488 -110353 90173 98754
136 98754 -70082 -66532 59400 42746 -37663 -15284 162 -20929 31855 49601 -44425 -63888
148 -63888 40113 69738 -34378 -76741 17463 61240 -5833 -35666 2012 11400 -9308 3437
160 3437 7284 -29173 -3226 47767 -4160 -42952 18694 22032 -42330 -10337 59434 6154 -55391
173 -55391 15448 45112 -39518 -32841 50662 22457 -43586 -3810 42743 -6709 -34609 11982
185 11982 11464 -12484 22571 22547 -41568 -36667 46456 50111 -45879 -58239 37115 54010 -20214
198 -20214 -42971 -182 23834 7955 -7250 -15987 -14305 21082 27951 -26730 -36183 24000 34944
211 34944 -27132 -38147 33062 41627 -29814 -35521 15172 21777 3885 -4659 -15767 -7734 30723
224 30723 24102 -41931 -35084 45576 38067 -33215 -28869 20153 19319 -11062 -9448 3466 -2057 5286
238 5286 10770 -11368 -13623 9394 11566 -10031 -13346 13024 12774 -18658 -10417 18779 5493 -16956
252 -16956 -2518 14364 -2244 -8264 10331 -2405 -17733 11457 18345 -13476 -15072 9776 11308
265 11308 -6201 -4639 2786 -5828 1046 14058 -1776 -16364 -2732 15525 7926 -13704 -5899
278 -5899 11606 509 -6288 5930 4009 -8970 -3387 12327 2942 -10260 2594 1885 -9203
291 -9203 8521 13500 -13642 -17179 11057 18132 -8099 -16221 2014 6396 2185 678 -7004 -5794
305 -5794 3165 6651 1567 -8120 -3269 7440 -1001 -4973 5680 5057 -9142 -7321 13607 9965
319 9965 -13064 -7417 7681 4216 3313 382 -9227 -4190 10985 9555 -9469 -10444 7138 7168 -2602
334 -2602 -2602 -1503 -650 -377 1396 4660 -3097 -7510 2168 5628 533 -2796 -2815 -1741 779 7301 1216
351 1216 -12909 -2033 11681 1969 -5981 -2638 87 2283 2719 801 -5042 -4249 4951 3214 -1657
366 -1657 -1425 -2364 1064 2251 -414 2249 -1195 -5501 2430 7028 535 -5834 -2460 3781 2516 3845
382 3845 629 -10443 -1973 13092 4101 -9399 -7834 3134 8756 1993 -6352 -8152 624 10910
396 10910 1431 -10218 -4205 3828 5903 -79 -6987 -1368 4339 1331 -2681 -2675 4659 4255 -5124 -5093
412 -5093 3575 8563 -363 -12182 -909 14498 5727 -9624 -11455 2196 15425 5750 -11866
425 -11866 -11476 5041 14654 711 -13775 -8328 7835 16957 -1813 -21875 -2173 19061 3144
438 3144 -13009 -3447 7700 2571 -1908 -1325 -4813 2750 9516 -6863 -10639 7963 9735 -3522
452 -3522 -8216 -3229 6060 9726 -4832 -18458 2564 26470 503 -26421 -4637 13956 7039
465 7039 -239 -6590 -8539 5461 14986 -3328 -19565 -1638 17053 9896 -4823 -15104 -5340
478 -5340 16911 6845 -16597 -3979 16866 2834 -15220 -1269 10375 -1916 -3105 2247 -5711
491 -5711 -228 11442 36 -15497 -5088 17098 10709 -17708 -17520 12947 24896 -1604 -26781
504 -26781 -8732 17891 10817 -5479 -8655 -194 9831 5403 -8343 -13954 -1229 18548 13775
517 13775 -12035 -17657 4659 16100 -5719 -18662 9144 22644 -4931 -18913 -2415 10472
529 10472 4018 -5325 -4181 1345 7755 5164 -9067 -10740 2521 11487 8974 -10696 -19687 11191
543 11191 28423 -7573 -32601 619 27456 1117 -16286 1941 5314 -545 4848 -5207 -17114
556 -17114 2074 23075 6802 -18329 -8711 10166 5211 -7832 -9864 6918 21700 -872 -24310
569 -24310 -3568 18043 1253 -14390 1944 13468 2717 -2641 -7186 -13997 5797 22387 -1765
582 -1765 -21336 -1432 19722 7030 -17236 -16024 5452 20062 6491 -19081 -9139 16578 4907
595 4907 -14004 -3781 6224 920 2573 7595 -5320 -10751 6562 3564 -13215 2042 19480
608 19480 2426 -15897 -6656 8727 4765 -6986 -5590 4922 12703 3972 -13143 -11458 589
621 589 6489 8969 2311 -8491 -4576 6943 4596 -10309 -8807 10196 10966 -2151 -5171 -3573
635 -3573 -685 1436 1229 960 389 1502 1443 -3083 -2270 1550 472 -1406 -1924 1641 5283 708 -5154
652 -5154 -5655 1883 7947 -2911 -8767 5246 10075 -2514 -8626 -2913 1436 2999 6360 731 -8459
667 -8459 846 7863 -4211 -7283 2251 5221 2754 328 -3321 -5223 902 5124 -1927 -1610 3722
682 3722 -2835 -2801 4876 -177 -5402 547 2802 -1452 509 4129 -3703 -4903 5418 2673 -4664
697 -4664 -72 375 -326 5387 3251 -6901 -6975 4013 6882 -51 -1789 -2443 -2302 5401 3275 -7497
713 -7497 -4884 5041 5891 -332 -3542 -2529 -1957 1860 3648 -1038 -1654 993 -1401 382 2902 -392
729 -392 -3947 -2428 4530 5480 -1373 -4929 -3253 2292 5689 51 -4991 -2125 3512 4574 -1992 -4985
745 -4985 -856 814 2215 2688 -2291 -2729 -169 594 1087 214 -405 -1292 149 3904 759 -4250 -1678
762 -1678 958 3134 2753 -1848 -3166 349 2579 861 -2534 -686 1562 682 1615 -1412 -3927 530
778 530 2155 639 41 -1457 -1121 53 1065 413 -2408 -569 2123 924 680 -1810 -2697 1652 2489
795 2489 440 -915 -1870 147 1860 844 -732 -2556 283 2984 845 -632 -2596 -2448 2550 2947
811 2947 -508 -2111 -2242 896 2590 645 -1830 -2958 1038 3815 505 -1229 -2591 -1875 3216 3700
827 3700 -566 -3147 -2071 2248 3214 146 -2329 -3056 1683 4226 -294 -2949 -2605 -770 3527 1927
843 1927 -1523 -2206 -1419 1030 1972 375 -1448 -2633 483 3318 551 -1093 -2591 -2180 3343 4592
859 4592 -1012 -4336 -1719 3798 3086 -1920 -2699 -1636 2232 3921 -1498 -3764 -1180 1722 2853 -431
875 -431 -2156 -279 361 541 -276 -728 268 -713 240 1856 -302 -577 -920 -1582 1969 2982 -859 -3478
893 -3478 -793 3988 1601 -2694 -1507 222 2090 2647 -1686 -3654 -782 2852 3139 -2688 -4998 1186
909 1186 4914 751 -4042 -1771 2711 569 -327 1355 -1852 -1297 3334 1132 -2892 -1232 2209 583
925 583 -1940 1969 1875 -3107 -1934 473 2176 3056 -1667 -4693 460 5009 1237 -5522 -2643 3428
941 3428 2589 586 -1759 -4703 118 5747 2111 -4482 -4561 2771 4773 118 -2799 -2092 1616 1696 -2468
958 -2468 393 3765 -1595 -2871 2836 1892 -4378 -2006 4529 502 -2316 4528 168 -9638 -1123
973 -1123 9252 2989 -6100 -2706 3685 1356 -1081 -1956 -2892 2148 5635 104 -3603 -2676 -282 3364
989 3364 2611 -2683 -3402 2736 4299 -3112 -4078 2693 1457 -2137 -146 1930 1272 -1781 -2464 489
1005 489 1612 -173 -1851 -171 2899 937 -833 -578 -3635 -1804 5481 4832 -4097 -5939 3959 6591
1021 6591 -5204 -6972 3917 5033 -1032 -41 1027 -4560 -4163 6009 3775 -6643 -586 6674
1035 6674 -1091 -5103 573 1694 -1255 239 2919 51 -364 -549 -3633 1106 5232 -2248 -3569
1050 -3569 2871 1727 -1162 1314 -676 -5590 960 7987 -1015 -5632 2024 1953 -1210 179 -2988
1065 -2988 -3210 5822 5787 -4900 -4365 2651 -1991 -3156 6984 2182 -7314 2406 6142 -6515 -5082
1080 -5082 6843 2119 -5279 3574 6097 -6105 -5186 4387 1622 -334 1329 -2005 -2151 2564 2234
1095 2234 -2373 -2456 229 515 2583 2229 -5224 -1985 5748 211 -4927 560 2189 -674 1796 2817
1111 2817 -3807 -4034 3753 1694 -2503 2855 1902 -3762 -408 3071 -1944 -3098 2937 2779 -1820 552
1127 552 1002 -4848 -1365 5564 1514 -3537 -1758 2028 1340 -491 -340 -1538 -1548 2760 2797 -1169 -2841
1144 -2841 -739 3139 1393 -2678 -1051 880 882 1194 962 -917 -3396 -472 3170 796 -1409 493
1160 493 -407 -958 381 599 -1404 -2234 1903 3889 -1065 -3500 -634 719 982 1156 908 -1359 -2048
1177 -2048 2494 1758 -3204 -1482 2288 1196 -355 236 -281 -2235 326 3639 -813 -3162 1006 1165
1193 1165 -570 461 203 -1596 -1217 2222 1373 -2365 -621 1453 212 192 -481 -1010 -268 1093 1955
1210 1955 372 -2338 -1406 1295 1672 -444 -1584 584 543 -762 1119 -263 -3008 214 3465 580
1226 580 -2911 -907 1318 -411 450 1700 -2129 -2026 2333 2207 -1043 -1996 -35 955 261 992 -124
1243 -124 -2069 223 2315 1044 -1419 -2162 353 1657 593 239 -1391 -2064 660 2244 439 -2499
1259 -2499 -1183 1844 713 -423 21 -1579 -960 2306 2095 -1164 -2440 107 1663 515 188 -367
1275 -367 -1500 463 1995 532 -1473 -1930 897 2136 -183 -787 -567 -730 269 1149 370 -1913 -1346
1292 -1346 2150 1114 -1293 -438 -366 -490 1267 1365 -688 -1943 345 2009 -189 -1072 -27 36 733
1309 733 655 -640 -944 -660 1162 1214 -714 -904 28 409 455 -258 -391 -382 -26 1533 166 -1634 -447
1328 -447 361 671 562 -518 -765 -413 868 1472 -1099 -1339 563 1256 743 -492 -1508 -303 577 1712
1346 1712 552 -1777 -1078 1013 1167 -22 -1477 -522 616 576 915 -896 -2100 -159 1424 1036 -202
1363 -202 -1496 -624 513 985 710 -1290 -1223 583 1334 1195 -965 -2207 -50 1622 1604 -303 -2061
1380 -2061 -987 1237 1307 -336 -1905 -654 1152 931 541 -1278 -1729 352 1588 839 -607 -1356 262
1397 262 638 398 307 -766 -914 579 1131 531 -868 -1704 301 1305 855 -511 -1639 129 897 184
1415 184 -345 -1195 -464 1014 1277 -50 -1984 -990 1931 842 -902 -105 334 -56 228 182 -527 -552 699
1434 699 880 -310 -271 -441 -660 1197 360 -1031 -138 596 -321 -30 883 -514 -2254 893 2104 -1136
1452 -1136 -1343 431 368 444 635 -1220 -1569 895 1926 43 -565 -558 -1439 1178 2072 -1617 -1544 2171 1310
1471 1310 -1253 -322 116 -1500 -347 2814 656 -2482 -387 389 120 645 -60 -1148 -134 1241
1487 1241 1186 -539 -1094 -1702 243 2900 661 -2336 -251 1972 275 -794 -518 -1036 -420 2317 2251
1504 2251 -1241 -2477 -473 382 657 268 -311 632 622 -211 -961 -1510 -685 97 1866 2359 -861 -2940
1522 -2940 -1006 346 727 640 856 691 -743 -389 397 -1468 -1235 1775 2743 206 -2023 -502 686
1539 686 -517 293 603 -636 -88 1347 454 -1478 -1093 -194 363 430 685 -273 252 972 -895 -1225 -269
1558 -269 -56 554 2215 1165 -2115 -2130 222 132 230 2004 536 -1057 596 -194 -2423 -902 1578
1575 1578 1334 918 893 -2380 -3108 1726 1981 -1541 393 1614 -1084 -544 1427 -1116 -2594 1455 2844
1592 2844 -864 -727 1159 -991 -985 1761 -132 -1902 208 1643 586 15 -605 -2614 -770 2399
1608 2399 282 -924 953 -204 -730 675 -417 -2565 337 3460 1154 -1310 -535 -1198 -1419 1951
1624 1951 1866 -1184 -220 1271 -379 -1015 -250 -188 -439 1657 1817 -1297 -1640 -151 -318 565 1131 -151
1642 -151 -1128 -221 973 501 -1091 -815 278 838 603 -458 -46 -135 206 826 -265 -1423 292 1478
1660 1478 756 -162 -494 -897 -241 493 744 -247 -81 142 38 -70 -1109 -1210 989 1334 132 -260 -430
1679 -430 -897 12 1683 729 -1291 32 1258 -618 -230 503 -884 -293 1569 736 -1977 -632 1348
1696 1348 -11 -205 551 -994 -1134 1408 1044 -946 -858 83 -198 396 582 -676 -779 760 565 -602
1714 -602 -231 -399 -5 1409 791 -1168 -657 -18 337 86 728 -272 -1296 699 1400 -1030 -844 323
1732 323 322 168 634 -233 -1772 -341 1432 211 -1016 -116 -155 -138 314 -104 -1157 -680 1145 579 -546
1751 -546 -407 -99 99 739 377 -708 -501 29 799 662 -391 -859 -260 511 376 1 -221 -446 -100
1770 -100 937 -288 -953 -272 542 743 -347 -317 -480 -200 922 891 -771 -1041 359 771 180 -323 -529
1789 -529 110 208 801 181 -1238 -470 688 858 -113 -601 -153 -64 171 656 -159 -1032 -7 823 957 -614
1809 -614 -569 433 562 466 252 -801 -825 452 847 114 -798 -506 524 431 415 -450 -466 80 638 262 -290
1830 -290 -760 115 667 24 322 -232 -771 181 744 0 -811 -627 591 428 -363 300 -414 -723 573
1849 573 434 -287 -914 155 794 198 -144 -160 -199 160 337 105 -304 -963 629 568 -376 -98 -119 203 202
1870 202 297 -2 -817 -402 719 418 -462 -333 258 179 386 -39 -397 -464 79 884 12 -497 -584 -5 667
1891 667 287 -460 -664 -378 442 685 -433 -1080 93 639 214 -379 -388 -429 11 1030 545 -1008 -726 208
1911 208 644 -15 -48 -261 -358 47 714 -188 -793 -144 270 863 190 -856 -550 446 1081 347 -588 -472
1931 -472 -461 372 632 -514 -976 3 334 419 -355 -617 -268 548 624 -65 -674 27 269 124 526 -159 -713
1952 -713 217 946 311 -460 -75 209 -608 380 665 -369 -451 399 394 -230 -520 -199 306 631 742 -497
1972 -497 -321 410 -23 127 209 -375 -373 588 481 -748 -564 689 385 -463 98 -178 -416 654 559 -224
1992 -224 -562 -509 247 407 388 -235 -781 204 405 -414 83 50 -467 473 858 -447 -1100 -278 874 438
2012 438 -32 123 -686 -230 612 -1 -485 -314 222 643 -6 -374 -864 -240 773 483 -18 -38 -316 -121
2032 -121 552 224 -753 -725 329 1310 157 -371 -86 -16 104 207 182 -61 -163 774 502 -915 -961 -291
2052 -291 172 696 827 -194 -577 -392 -109 61 71 343 120 562 172 -1134 -872 420 529 461 767 153
2072 153 -1078 -516 720 -199 -70 869 134 -167 304 -482 -1173 340 801 -181 -314 427 -392 -645 822
2091 822 36 -1221 24 970 -9 -260 167 -369 -884 481 390 -573 202 1009 -130 -225 -433 -1008 54
2110 54 1208 424 -253 11 -457 -841 337 840 -671 -191 1077 -179 -731 -73 -232 -57 1009 813
2128 813 -539 -974 317 361 -296 225 -149 -99 720 590 -483 -511 -257 383 310 412 -217 -733 176 496
2148 496 -47 -273 -613 20 633 372 -339 -176 -177 59 201 213 -251 -510 506 512 -548 -495 -239 215 673
2169 673 597 -31 -785 -517 302 222 -105 -74 -133 239 204 -356 -139 -257 17 389 218 -335 -480 35 250 -149
2191 -149 -240 -20 -246 299 715 -399 -327 64 -81 19 339 265 -209 81 597 -137 -610 58 257 188 327
2212 327 -98 -404 -65 120 264 -246 -114 83 126 195 -364 -422 165 312 224 71 -217 -441 7 452 168
2233 168 -383 101 275 47 83 -129 -492 -16 518 256 -264 -339 70 107 133 112 -412 -330 285 424 87 -460
2255 -460 -337 89 222 212 -38 -375 -52 321 342 -143 -491 70 443 190 28 -234 -350 92 400 174 -296
2276 -296 -314 121 178 105 -65 -415 -83 230 222 -14 -413 -253 308 314 1 -272 -202 116 162 208 -115 -407 101
2299 101 497 23 -193 -168 -104 88 236 75 -287 -258 343 186 -162 -123 -113 79 204 54 -118 -180 -6 286
2321 286 118 -110 -185 -34 208 125 -48 -170 -153 185 276 -78 -242 -81 123 235 -43 -182 -165 -24 298 63
2343 63 -247 -171 15 170 85 -172 -165 -134 157 314 -86 -321 -65 246 294 -60 -177 -34 -17 270 220 -269 -310
2366 -310 49 251 187 -232 -272 -64 161 195 -57 -327 -73 85 264 42 -375 -153 110 267 129 -208 -237
2387 -237 30 230 213 -130 -227 41 122 221 93 -262 -190 259 316 -2 -290 -66 54 38 198 -116 -321 -35
2409 -35 295 136 -96 -313 -36 190 141 -48 -228 -109 106 192 114 -180 -277 157 251 41 -129 -152 90 162 38
2432 38 -37 -212 -50 143 167 27 -313 -122 216 156 14 -202 -173 106 183 82 -179 -140 49 156 69 -57 -271
2455 -271 -37 363 129 -228 -101 -55 -35 188 122 -235 -273 77 204 -140 -66 -76 -80 254 124 -152 -202 17 100
2478 100 93 124 -181 -296 183 326 -101 -207 94 68 74 95 -135 -260 28 302 56 -118 -33 -116 85 281 -198
2501 -198 -311 73 105 -28 60 -11 -204 -53 290 -2 -354 0 150 57 123 -135 -267 14 223 233 -97 -31
2523 -31 -89 -42 198 48 -280 56 275 23 -76 -96 -174 44 354 146 -239 -231 -12 101 209 -14 -231 3 218
2546 218 79 -56 22 -38 -25 243 103 -412 -70 284 141 -13 -58 -314 -122 303 196 -108 -175 -17 -37 149
2568 149 146 -270 -84 309 68 -183 -52 -186 -75 316 229 -246 -227 178 73 40 181 -214 -224 316 178 -192
2590 -192 -16 87 -154 61 296 -186 -324 323 242 -264 -42 -72 -225 116 357 -45 -227 25 94 -96 67
2611 67 -15 -162 244 198 -184 -136 44 -63 68 217 -39 -337 82 158 -161 -110 120 -53 -28 194 -113 -284
2633 -284 35 184 -8 -66 -34 -168 -63 270 -44 -295 -20 103 106 109 -11 -74 -58 150 155 -154 -156 45 142 213 -128
2658 -128 -298 -48 78 179 188 -134 -243 -37 175 21 -163 -60 88 61 98 -123 -172 -11 145 203 36 -202
2680 -202 -182 96 186 8 -137 -87 2 77 220 -66 -247 20 156 -2 -73 -43 -23 41 237 19 -345 -81 90
2703 90 32 113 139 -215 -106 134 114 -98 -33 61 84 66 22 -188 -48 103 70 46 -106 -158 11 79 15 -123 -87
2728 -87 124 12 -21 108 -139 -78 182 39 -127 -1 89 66 -16 -28 -121 -165 138 201 -54 -11 -36 -25 50 14 -42
2753 -42 -55 101 97 -48 -97 -58 -42 152 101 -80 -99 -108 70 104 -21 -137 -88 138 190 -49 -165 -35 -32 135 152 -16
2779 -16 -167 -10 144 58 -51 -52 19 66 134 8 -176 -128 101 192 47 -99 -113 -40 101 143 -122 -152 -10 143
2803 143 152 -56 -137 -14 68 137 66 -98 -143 16 179 33 -128 -67 36 29 59 -19 -144 -62 34 148 -49 -159 11
2828 11 60 37 22 -103 -44 19 154 75 -45 -98 15 137 109 -51 -68 -9 41 51 1 -83 42 53 -26 47 -58 -126
2854 -126 2 92 99 -134 -105 40 68 -33 -41 -32 11 55 -3 9 -95 3 93 50 -22 -70 -73 84 49 -21 -12 -85 1 123 -10
2883 -10 -75 -145 8 95 29 -10 -80 -24 143 68 -42 -147 -71 75 33 28 -71 -133 63 70 29 -108 -57 29 103 38 -5 -88
2911 -88 -63 26 152 -13 -116 -96 82 76 -61 -44 -14 3 73 106 -91 -153 32 99 87 -92 -82 4 41 133 37 -90
2937 -90 -38 17 44 73 -106 -10 4 3 4 -81 -63 -50 37 155 -58 -104 -37 35 70 10 -68 -65 34 108 -4 -79 61 72 -27
2966 -27 90 -43 -111 -35 55 6 -113 -10 7 21 24 12 -151 39 32 -7 -10 -93 -106 -39 57 12 -105 6 70 -44 32
2993 32 17 -103 -39 88 11 -81 2 18 -5 27 103 -123 -23 147 57 -67 -53 -125 -45 108 80 -99 -123 40 -39 -43
3019 -43 35 -43 -8 104 79 -82 -93 -12 11 80 41 -8 -86 99 49 -22 -9 -37 -95 31 41 -71 -133 -11 21 -15 55
3046 55 -97 -19 68 79 -54 -31 -20 -85 46 70 -70 -77 -25 17 14 -51 31 36 47 80 -87 -119 -79 23 97 87 -37 -46 -1
3075 -1 36 8 3 -13 -37 77 16 -80 -98 -43 44 108 26 -109 -94 65 58 18 -18 37 -7 25 80 -45 -81 51 36 2 -30
3104 -30 18 33 73 44 5 -126 -45 38 42 82 -48 -132 19 54 -49 -51 31 40 48 42 -3 -121 37 99 93 7 -92 -44 -46 48 51
3135 51 -73 -24 66 -40 -20 -55 -28 -18 76 62 -71 -68 12 -23 -10 36 -64 -55 14 36 -55 0 -25 -6 -16 66 -21 -51 60
3164 60 34 -34 -27 -59 -22 84 93 -14 -27 -14 -2 -18 3 -36 -44 22 24 -35 -31 22 15 106 10 -56 -97 -8 37 10 4 -6 -96 -37 90
3197 90 0 -56 -23 -43 32 -15 -47 -87 66 59 -51 -8 2 2 30 75 4 -100 -66 73 25 -12 -20 -57 43 117 69 -41 -39
3226 -39 -10 48 58 -92 -131 -20 36 48 -1 -54 -87 -60 61 -35 -40 -19 27 46 13 8 -60 -13 37 35 -17 -23 -5 -4 37 22 -8
3257 -8 -53 75 88 15 -22 -15 -33 28 19 -63 -32 6 10 -17 -31 -39 47 29 -16 -42 -71 -16 -30 39 28 -43 -33 -12 52 13 -32 -60
3289 -60 35 27 72 -13 -82 -17 35 51 -22 -32 6 11 20 36 9 -20 -43 51 0 -31 -74 13 21 68 -42 -42 54 58 28 14 -51 14 2
3322 2 4 31 -38 -49 63 47 8 -43 -91 -8 54 64 -4 -110 2 50 35 12 -33 27 44 62 18 -43 -61 16 73 4 -20 -14
3352 -14 -45 34 24 20 -3 -19 -3 65 21 -26 -15 -5 -30 -20 -27 -9 27 36 52 -24 -45 -14 -22 14 -46 -47 -52 45 56 -11 42 58 23
3385 23 48 -14 -1 22 7 27 -28 14 -31 -5 32 -3 -41 -4 -32 -10 31 -10 -24 -64 67 18 -6 -19 -9 -42 -1 -52 -30 -9
3415 -9 21 44 22 -2 -34 -31 1 35 7 -48 -24 35 -21 -5 -63 -17 33 37 -2 -29 -2 -1 36 16 -58 -71 -17 43 78 -4 -32 -40 1
3448 1 27 -13 -78 -75 -2 5 -3 -60 -60 38 28 3 20 10 -18 17 23 31 -29 34 2 -36 52 -28 2 -7 55 28 -18 -33 -66 0 43 -20
3482 -20 -26 -51 26 -30 23 -29 17 38 3 -35 -2 -31 -8 59 -2 2 -52 -35 42 -32 -40 39 -77 34 -8 -26 -11 -15 23 43 1
3513 1 4 -54 5 85 23 -12 -7 -13 -24 69 25 -20 19 46 -40 -70 4 -46 -7 112 50 -24 38 40 -33 30 6 -25 -67 22 76 -69
3545 -69 -45 -17 9 7 -3 -61 -40 -6 21 -95 -1 -17 -13 76 108 -46 -27 9 11 22 60 17 20 14 78 -48 -32 27 -7 58 12
3576 12 -36 -84 -9 23 11 23 -28 -15 35 53 -14 -99 17 3 18 13 -41 -38 16 60 -28 -44 -61 2 88 88 -9 -97 16 20 11 17
3608 17 27 55 20 53 6 -31 44 7 5 -2 -3 -87 -48 -33 -10 31 31 7 -21 8 18 -88 -41 18 37 -48 -10 33 -23 60 38 -42
3640 -42 -30 20 29 25 3 -14 -13 33 -12 -14 -45 -1 11 -28 19 -47 -50 74 49 -10 -98 -74 24 67 -4 -47 -26 -22 24 -2 -21 -38 -77
3673 -77 31 63 45 -59 -77 -11 61 64 -27 12 -48 57 30 -12 -39 34 42 9 11 11 4 -14 50 15 -59 -47 -4 45 50 -31 -24 -53
3705 -53 82 43 -21 32 -13 -44 73 -86 -30 -40 73 -33 -28 -67 -68 -25 20 56 -21 -7 1 -9 21 -41 -3 22 57 5 -43
3734 -43 -15 20 12 19 12 -53 -29 -30 14 17 -22 -24 -14 14 68 42 -6 -44 -39 22 9 5 -2 8 40 -11 -25 -44 37 40 15 -26 2 -18 43
3769 43 34 -22 -50 -40 20 42 40 -75 20 73 -11 -7 22 -27 -73 -1 6 7 -24 35 22 -32 22 -48 -27 12 5 19 -27 -8 16 19 93
3802 93 -6 -34 12 39 29 -43 -19 0 91 58 -13 -20 -59 -10 30 14 1 -21 31 84 -31 -51 32 15 58 70 -24 4 -39 42
3832 42 -45 42 -66 -27 5 80 -29 -40 0 40 89 39 -62 1 20 21 30 -6 3 -30 51 -2 -20 -12 -10 74 63 -10 -7 -14 6 58
3864 58 19 -11 -75 -9 34 -2 -53 -70 -48 21 62 -23 -32 -17 49 33 -23 -58 35 -19 27 46 -32 -35 24 34 11 -55 -63 0 -2 -8 -10
3897 -10 -55 7 40 28 21 -46 5 -1 74 9 -35 -53 -7 1 -23 -33 -37 4 -6 20 51 -11 -3 17 20 32 -51 2 71 20 -4 -41 -15
3930 -15 0 38 -22 -67 -52 -61 -19 4 9 -23 10 47 39 33 -54 -27 -4 38 5 -30 -9 34 144 32 -10 -44 -35 83 21 24 -33 -8
3962 -8 11 1 -2 -3 -19 33 59 -16 -44 -75 -18 -25 -1 -60 -112 -19 66 0 -16 -30 -36 73 46 3 -11 -15 7 66 12 -20 -107 31
3994 31 74 -9 -23 18 -4 26 15 -12 -107 13 12 52 -26 5 -24 -28 55 -38 -23 -23 -13 -44 63 -1 -15 -28 17 105 -17 -12 -5
4025 -5 -45 10 71 -64 -27 7 9 -29 5 -5 -60 26 54 -1 2 27 -36 -28 -7 -65 -47 26 73 -38 -84 3 -26 -1 48 -6 -44
4056 -44 13 -29 -43 -28 11 19 14 92 -16 -119 -13 37 -29 26 -55 -2 -7 31 -61 -64 -17 39 26 -4 -25 -53 31 35 -55 -96 -35
4087 -35 44 34 54 41 -118 -22 61 41 58 -22 -49 -26 11 46 -57 -28 -20 36 32 -67 -57 -93 58 70 1 -44 -43 -17 20 1
4117 1 -14 -76 -7 102 31 -36 -45 21 78 25 -14 -32 -64 40 75 32 -99 -37 23 19 11 -13 -35 34 42 -53 -88 51 8 29 118
4148 118 -30 -27 -12 49 -26 37 11 -23 -53 72 15 -97 0 63 -20 -22 6 -52 -68 89 50 -47 -11 22 -48 10 34 -36 -34
4177 -34 -5 42 -55 24 -9 -54 -1 -26 -67 -38 88 77 1 -10 -56 -49 6 59 -32 -44 1 19 -2 6 -42 -3 69 56 -39 -66 -5
4208 -5 24 38 45 -10 -106 4 47 44 -96 -9 1 45 45 -29 -38 -26 27 -3 47 13 -106 -48 48 20 -19 6 -1 32 53 -20 -72 13
4240 13 11 12 45 20 -19 3 63 2 -53 -30 3 36 65 24 -77 3 48 -7 -46 -44 -50 40 -4 39 -61 -44 57 8 19 -17 -92
4271 -92 -30 71 7 1 -26 -28 -3 -12 34 -34 -64 31 21 -74 -71 -27 0 77 17 -48 -10 -22 65 -8 36 -51 -24 86 29 -60 -56 -20
4303 -20 -11 87 1 -4 -18 4 48 -6 -109 -29 -41 31 14 -140 -24 -71 13 17 -36 -84 -21 25 17 -6 -107 -11 5 56 64 -40
4333 -40 -9 23 54 9 -56 -13 4 31 13 -55 -13 49 40 60 -5 -90 -36 22 -1 -2 -55 -76 -44 120 44 -40 -51 -12 60 72 -17
4364 -17 -65 5 29 42 -33 -39 -61 -12 56 49 -8 -50 -1 54 70 -24 -57 11 -14 32 81 -27 -22 4 56 -34 -48 -73 73 73 -21
4395 -21 -21 -47 31 22 44 -68 -114 -14 38 37 -17 -52 -16 -14 104 -29 -86 -50 7 4 15 -21 -6 18 91 34 -29 -25 -12 49 68
4426 68 -17 -98 -45 46 73 -14 -56 -82 6 55 -17 10 16 -15 40 -18 -13 -49 -80 -16 12 -98 -62 -6 48 -8 -23 -16 -53 67 80
4457 80 -32 -32 -72 20 72 49 -53 -23 -21 66 -4 -78 0 -21 29 65 42 -30 -4 -12 56 -48 -49 -7 -60 66 -4 -33 -38 15 -6
4488 -6 80 -30 -53 -20 74 48 19 -34 -58 32 -27 13 -39 -40 0 -21 62 -83 -22 -67 13 12 -32 -74 -8 51 28 -69 -51 31 18
4519 18 75 31 -75 -91 25 22 -15 -40 23 1 14 50 -68 -109 42 75 42 -14 -64 -38 15 64 69 -70 54 17 -49 20
4547 20 1 -64 8 81 32 -108 -69 12 -1 19 32 -113 -42 63 5 6 -1 -110 -40 93 47 -42 26 92 41 7 7 -10 -40
4576 -40 85 38 -84 -98 16 -54 50 87 -61 -45 27 28 -33 34 7 24 88 73 -73 -65 65 100 17 29 -44 -51 -27 28
4604 28 -41 -19 8 -39 49 5 -91 -39 6 59 -25 7 -44 -66 53 98 -61 -90 -31 36 108 25 -18 -111 29 26 -35 -58 11
4633 11 -31 52 72 -93 -67 0 59 32 37 -28 -105 0 72 -41 -10 88 23 49 1 -27 -66 -25 82 -30 -37 -40 -57 22 90
4662 90 23 -68 -4 90 -9 15 1 -33 -8 81 9 -126 -24 44 17 44 29 -50 -43 86 54 -52 18 -35 -83 -25 32 -32 -14
4691 -14 102 2 -10 -28 -12 -23 74 79 -61 -109 1 17 -49 -15 -35 -61 8 52 -37 -43 86 28 -33 39 25 -50 54 53 -35
4720 -35 -4 -26 50 31 24 -37 -50 50 20 5 -40 -61 -30 20 115 -11 -62 -16 18 56 19 15 -50 -16 63 94 -45 -8 32 55
4750 55 -8 -34 -36 -29 -21 63 4 -45 -47 20 60 23 51 -55 7 90 -11 -22 -19 2 21 -9 40 -65 -62 1 38 -5 14 -54 -21 45
4782 45 71 -15 -63 34 20 7 26 -47 -36 37 38 -32 -26 18 -20 -23 0 -64 -8 70 19 -55 -49 -13 3 48 -1 2 -23 -23 48 53 -4 -8
4816 -8 -6 32 26 17 -13 14 -18 -8 -22 -7 31 13 17 31 -68 -17 41 42 -5 20 -32 -33 15 34 -10 -45 -40 -4 52 -38 -33 -34 -14 41 -8
4851 -8 -10 -64 43 28 10 -24 -65 -10 -19 78 3 -76 -35 28 22 27 -16 -17 33 47 91 -24 -44 -15 25 -17 -12 -32 -53 12 38 33 -39
4884 -39 -50 11 53 -6 -36 -40 -60 44 -24 -33 37 -57 -6 48 -19 40 11 69 105 -54 15 -21 40 24 3 45 -63 -42 63
4913 63 20 -18 -2 26 -12 60 -40 -17 -44 -13 27 12 -51 -13 5 80 24 -28 -25 11 59 -8 26 -2 -9 30 1 34 -47 5 44
4944 44 -2 -33 -33 42 50 45 20 -51 -12 25 -23 26 -60 -16 -19 17 -18 -40 -62 3 39 42 22 -16 64 82 15 32 -14 -4 99 26
4976 26 31 -24 -55 74 37 32 33 -95 16 27 31 -2 -68 -17 47 45 -21 -9 -85 -23 4 46 -57 -55 30 10 42 -14 -26 -50 69
5007 69 85 -14 -50 -1 45 49 15 -53 -87 -4 46 -38 -106 8 16 31 46 -14 -79 -42 64 22 -25 33 -43 48 -5 -29 7 -15
5037 -15 -21 34 -29 -36 -23 7 -10 -25 -64 -69 61 -9 -11 48 -5 -53 27 51 -50 1 33 -34 -62 57 -17 -12 18 44 -46 -18 30
5068 30 -13 -7 48 -5 -39 32 66 -65 -45 -5 -16 -22 13 46 -57 -10 -22 11 -17 -10 -57 -70 58 -44 -19 25 -9 25 67 10
5098 10 -6 12 38 36 -18 -43 31 8 -24 27 29 -24 -5 -23 -28 7 55 -12 -31 -25 2 -15 -20 64 11 -4 16 -39 55 -24 41 17 -48
5131 -48 50 -15 6 -16 34 18 37 -15 -10 7 13 28 -3 -24 45 -1 29 25 -7 -2 -25 -10 52 17 58 -26 22 -18 43 -12 -34 -8
5163 -8 -22 86 4 -26 -46 54 -13 32 34 -35 10 14 13 -24 9 -41 30 -19 18 -56 11 36 -30 5 -14 -8 -39 11 46 27 1 -7
5195 -7 30 21 11 4 16 80 22 -29 -34 -26 42 -9 -6 -9 -12 2 57 4 -10 -7 -18 14 -20 -24 -6 16 6 -51 -32 -13 -2 -14 7 62 -42
5230 -42 -48 -4 9 35 17 -7 27 35 24 -3 -24 16 44 -5 -9 -14 13 -26 42 41 -11 -6 13 38 29 38 -38 -55 -12 -11 1 -39 -3 14 42
5265 42 -37 21 -28 15 -32 40 -77 -59 -41 42 -31 21 37 -36 8 3 -13 -34 12 11 18 24 -18 -19 13 -2 52 -4 50 61 -7 -13 6
5298 6 31 -12 34 -14 6 -53 -40 -41 -41 -12 41 16 0 -3 -39 -32 -9 73 -37 -14 27 18 -1 -39 20 8 9 -39 -3 35 -20 -32 10
5331 10 49 -10 7 -39 -52 14 30 44 2 -31 24 12 2 -66 -12 15 -1 -3 -37 -4 -20 -22 73 -25 -77 53 -3 -8 17 9 -25 -4
5363 -4 43 23 5 35 10 28 15 -56 -65 -21 62 5 -9 55 8 -29 16 -14 -2 -29 -7 24 -19 -47 4 -20 -12 48 -57 -68 -14
5394 -14 -2 24 4 7 -35 0 -18 -13 -22 10 5 -29 -25 26 -41 2 -6 26 27 -72 10 25 17 -30 -32 -10 -1 -11 15 21 11 -8 -58 -9 -46 -29
5430 -29 -40 -37 -12 -3 13 -3 6 -20 -29 24 7 -9 -35 0 -29 -25 -24 19 5 18 -49 29 -1 -33 16 29 2 -26 7 -18 -40 -34 -4 -18
5464 -18 2 28 -15 -83 -21 -24 -21 -17 7 -12 -10 -4 -12 -57 34 -19 -28 7 -77 22 22 37 31 -31 -48 21 36 -6 22 39 -53 24 6 9 -21
5499 -21 6 -21 8 -23 -23 20 7 38 -34 24 12 -14 -12 -4 11 92 17 -4 19 -25 11 43 3 -30 32 -12 -50 35 -18 -1 -23 -4
5531 -4 1 32 -61 41 14 -6 21 -55 52 12 17 5 -25 -2 9 61 4 2 13 20 -2 24 24 -7 -36 -51 -16 -22 3 13 -18 18 4
5564 4 29 -13 14 -30 -55 45 12 -36 8 5 9 11 47 24 7 -13 -63 -44 37 8 -17 2 75 35 22 5 24 41 74 46 10 65
5596 65 -19 35 45 -72 -8 -22 7 0 -15 -66 -77 -32 -14 -34 -68 -3 1 67 -28 42 11 15 64 9 4 30 -12 25 18 -57 5 -16
5628 -16 70 -22 0 2 -10 -5 25 20 -27 44 3 39 -18 1 -2 6 -10 -31 -5 3 8 16 45 -73 -56 41 42 6 4 -30 -32 58 -1 55 -38
5663 -38 57 48 38 -11 -48 26 0 47 3 -45 6 -21 16 16 -5 -12 4 -35 -12 -8 -10 -19 31 46 -12 -74 33 -6 -45 -26 -52 -26 -43
5696 -43 1 18 -5 -88 51 -41 22 14 22 -42 10 64 -19 -23 -6 12 -11 -2 5 -40 41 61 -36 -7 -28 21 37 -19 -11 -32 -45 -38 -2
5729 -2 32 1 19 26 5 18 -84 6 56 2 30 49 12 -11 31 6 5 11 -18 3 52 21 -6 -29 22 11 54 -40 -20 -15 47 25
5761 25 13 -37 20 0 -24 -18 -35 -14 17 9 8 -14 30 14 -9 -29 7 -21 -5 42 -16 -10 -68 4 3 4 -37 -37 -20 21 10 -5 -9 -55
5795 -55 2 -24 -19 63 -80 27 52 -2 9 -33 -34 5 18 10 6 15 76 14 -19 -15 -44 29 46 -2 -19 -38 -12 -25 16 0 -27 22
5827 22 110 -3 -22 12 16 -25 16 -52 12 -64 -28 38 67 3 53 13 -21 34 41 -46 -51 55 47 20 -7 14 12 -11 -43 -10 -49 -11
5859 -11 14 -34 -12 -81 19 -41 -50 -68 -63 2 11 32 -49 -51 -12 50 -25 42 -15 13 80 11 2 -15 -37 -29 7 48 -30 -78 -16 -4 12
5892 12 -23 13 -31 0 29 -50 15 15 -54 6 -6 -46 -27 17 -6 10 -32 -37 15 5 -6 -11 -39 -2 58 3 27 8 -3 33 23 16
5924 16 -6 -39 0 30 -1 -57 -32 26 35 41 -60 35 45 22 -5 42 -39 -23 -20 -22 22 -33 19 -11 34 -3 -83 0 10 -1 -49 -20
5956 -20 -21 -40 54 47 3 -19 -22 19 74 37 -3 -29 26 57 20 -15 -22 -19 20 66 -48 -9 -23 39 -52 -30 -16 -43 -74 68 -14 -36
5988 -36 -31 -42 26 49 -3 -38 -23 74 53 -33 -58 -42 -36 2 -37 -69 -29 -24 77 -19 -28 2 -36 -2 -6 10 -5 13 33 -33 7 33
6020 33 -31 4 73 -1 -58 -26 70 39 -4 -63 -27 -9 94 32 22 11 -16 -28 -52 8 -60 18 102 74 -71 -53 -2 -16 37
6049 37 83 -3 -91 36 34 -45 -3 -111 68 19 37 -75 -92 59 76 -19 33 10 -12 -12 27 44 -42 15 83 8 46 -19 -220
6078 -220 40 52 -26 -36 -27 6 -14 47 -29 -52 8 71 49 56 40 7 2 50 28 -35 5 44 -29 20 3 -11 -29 30 68 -50
6108 -50 -35 -5 -29 13 74 2 -11 26 32 -7 -52 -32 13 30 54 11 7 -8 60 -30 -65 -7 7 34 -8 -28 -24 -34 7 21 -5 11
6140 11 -7 60 31 -57 -71 -45 82 93 48 13 -7 -32 -24 46 -18 -7 35 54 11 -109 -37 -79 42 67 93 -2 -53 77 23
6169 23 -18 -34 -64 -35 40 83 -40 -59 -43 -68 69 33 15 -36 37 177 -75 9 -31 47 17 136 -69 18 -22 -20 -10 101
6197 101 65 -99 -78 94 -153 -61 24 15 -18 153 76 -30 -59 -35 64 -65 -19 13 -1 -27 13 -88 -37 51 24 12 -54
6224 -54 49 10 61 37 -47 4 36 41 -34 10 -38 -105 -7 -16 -12 8 42 31 -35 -71 -83 -53 11 105 -9 -11 1 0 34 8 22 -53
6256 -53 47 16 -26 -60 -49 -20 18 53 -9 -45 -50 16 21 -61 0 -31 -9 94 47 -42 -66 12 51 28 22 -38 -47 -9 14 -34 -39 -61
6288 -61 84 89 39 -70 -42 1 93 42 -22 -49 5 26 -5 26 -50 -13 76 53 -10 7 -33 16 75 28 -40 10 50 31 29 -6
6318 -6 -11 -47 50 94 13 -29 40 16 68 53 -46 -13 14 73 -3 -56 -61 10 30 5 3 -5 15 61 19 20 -45 -18 3 23 45 10 22
6351 22 -38 28 20 -48 -21 -9 30 60 -72 -37 -21 23 27 19 0 -32 25 -2 38 -27 17 -22 -6 -46 -60 -62 58 39 33 19 -63 12
6383 12 20 24 -7 -61 35 56 -2 -21 -49 -34 35 53 12 -85 -62 44 17 -27 -22 -84 10 85 60 -39 -60 37 15 53 -3 -45 -62
6414 -62 16 23 15 -33 -29 -31 20 -1 17 -9 18 20 30 -38 -83 -16 25 7 -39 -68 -31 59 36 3 -60 -57 -29 8 19 -76 -36 13 64
6447 64 59 -26 -39 28 18 25 25 -22 -27 19 18 -45 -79 -56 6 55 -34 -50 -25 -29 18 -15 -56 -39 11 82 6 -41 -38 -32 0 51 2 -56
6481 -56 -10 53 -34 15 -28 -38 -26 19 16 -59 -38 7 -14 -10 35 -88 -32 65 48 -28 -11 14 -3 15 42 8 7 -28 31 7 -42
6512 -42 -87 -29 6 45 -56 -54 -23 14 0 -21 -56 -58 -10 5 65 -44 8 44 69 19 -17 -33 -8 69 43 -20 -100 -30 24 41
6542 41 -29 3 -56 -9 8 2 -43 -8 35 -31 4 -58 -114 27 99 -13 -34 -36 -9 -44 21 47 -86 -22 62 -18 -39 -8 34 -46
6572 -46 97 82 -80 -80 63 39 18 19 -92 -56 0 67 -19 -49 10 -37 -9 53 8 -50 73 44 -71 -36 -7 -73 24 130
6600 130 7 -59 -63 102 -42 2 49 -54 28 100 -60 -79 -32 66 12 27 23 -18 -113 23 37 38 -22 -14 64 -24 109 -46
6628 -46 -25 84 15 -23 -101 16 62 10 -2 -32 -81 104 103 -67 -92 32 61 -42 37 -16 -19 -2 59 157 -197 7 -80
6655 -80 77 121 103 -161 -106 29 117 -61 42 32 -153 90 25 50 -100 152 60 -26 6 -174 5 99 143 -70
6679 -70 -155 -35 -16 -36 80 16 -99 176 14 -150 -81 71 104 72 4 -31 -207 20 23 21 -101 230 35 -127 9
6704 9 22 -47 112 9 -55 104 -15 5 -54 120 38 -24 -125 204 32 12 -27 -147 -85 110 73 46 16 7 -150 177
6730 177 4 -45 -129 -20 65 -7 -22 -83 -316 -8 220 57 66 -32 -82 219 79 91 -107 -32 -3 72 11 -126 -49
6755 -49 169 -7 78 34 -60 -69 -50 -68 -192 -81 36 -3 40 0 107 84 19 53 -8 -100 -88 -54 -1 -142 28 -83
6781 -83 71 134 55 -199 48 22 -34 130 -115 -54 153 -108 97 224 -99 -12 148 60 -87 90 -64 54 -4
6804 -4 147 91 -5 -17 -168 -38 -119 -23 -39 6 19 -63 -200 114 -107 92 21 -53 34 -29 297 -223 -227 -80 88 -81
6830 -81 96 3 54 -55 215 151 200 18 -92 15 -35 85 -27 143 15 180 112 98 -194 126 -40 -27 -109
6853 -109 32 11 9 117 -63 -206 -96 254 221 11 -94 -92 101 -102 -79 -29 101 -29 121 23 -109 -74 59
6876 59 -47 59 -54 68 -51 -181 104 22 -131 -85 -13 -33 -108 -94 115 -83 15 51 -50 31 20 104 58 -13 62
6901 62 -15 123 -113 93 -50 -197 33 -17 35 -34 4 -63 -31 -54 62 0 -213 71 -113 22 -417 63 56 -24
6925 -24 -126 -64 140 22 -85 -5 -151 69 137 329 84 -86 -71 -52 -65 1 32 -70 70 123 61 -176 -86 -75
6949 -75 164 -155 -76 88 -51 185 3 230 -108 -220 45 -10 -221 83 96 -41 -2 19 117 -199 214 -108
6971 -108 -49 -182 -178 49 266 260 -28 88 -198 208 91 225 -62 -112 154 -20 83 -112 57 -166 29 10
6993 10 9 21 38 165 136 131 58 -2 -35 150 128 -179 -146 121 133 6 188 -6 124 121 43 -36 -106 -73 145 137 -23
7020 -23 -62 -54 47 116 21 -1 -1 128 61 -187 -150 -124 -2 65 -8 -70 -56 -175 -106 11 -106 -63 62 60 -8 -102 -105 -129
7048 -129 30 110 9 3 -18 133 30 168 -78 -55 -199 96 -147 -99 54 141 179 -151 -50 -89 -5 70 123 -9
7072 -9 167 -90 -111 -102 136 119 -23 32 43 48 130 -69 -157 -7 151 -46 -122 45 66 79 47 47 -92 -137 -64 13 -225
7099 -225 41 11 62 245 -110 -222 -7 -17 72 103 -13 -84 -282 -63 174 -288 -98 329 30 -71 170 34
7121 34 68 17 294 -143 -115 -41 -72 78 -83 -219 -265 254 120 165 -106 43 101 23 -6 -158 -26 -55 -43 -284
7145 -284 -122 12 125 -80 -23 91 -153 253 133 1 49 95 194 80 107 -91 23 -52 173 57 23 106 -24
7168 -24 -7 73 -47 3 -192 -106 -74 206 33 161 -187 -76 221 26 -48 76 2 27 -6 -69 -28 -40 27 184 -43
7193 -43 -41 10 209 143 63 21 -37 110 176 -56 -56 -38 126 21 405 62 -244 178 -240 -150 -8 135 -105 135
7217 135 18 152 -215 -85 -122 87 -78 -199 -494 141 334 -28 130 -145 139 85 3 75 -89 -52 199 43
7239 43 -54 -191 76 -104 -73 6 -217 -66 -20 70 -106 44 154 64 100 276 18 -54 29 270 -124 91 151 -99
7263 -99 -31 -108 99 -209 -162 92 83 155 -280 -145 -93 181 -44 -139 46 -40 97 136 -91 -411 96 233 -16 -75
7287 -75 -44 -79 -203 49 41 59 -121 -298 -149 20 111 54 126 -45 113 -216 -34 5 -75 20 -132 -166 -2 96 261
7312 261 133 -101 -12 -257 -85 -8 17 21 131 -157 -202 -106 -126 -31 -103 191 165 -11 -94 112 53 -71 -89 -170 7
7337 7 -112 43 -25 -35 225 45 70 301 -47 -77 62 26 113 71 51 -105 76 -54 -88 -17 -44 126 199 -81 119
7362 119 -136 -157 115 84 79 47 88 -84 -109 -84 -65 42 149 45 24 -108 -78 173 23 -101 -28 -227 171 89
7386 89 -82 122 35 114 217 -169 99 -98 -102 -34 106 3 -61 163 76 -148 95 -43 -79 -76 198 -33 -285 28
7410 28 -34 -174 -176 -75 -237 64 38 70 -41 138 -76 218 58 -225 50 -21 -137 -89 79 -8 29 2 14 -2
7434 -2 -210 105 507 -169 96 -83 221 276 123 179 -5 231 0 190 -146 165 -113 -382 -165 143 -128
7455 -128 -155 222 -111 112 59 -419 91 283 150 43 47 158 -131 160 140 172 -318 -48 -131 -99 16 359 -99
7478 -99 -94 -51 289 -316 143 59 150 -54 110 77 145 33 -228 402 -172 -26 80 243 232 84 -428 49 27
7501 27 208 -31 151 -194 -98 -7 71 123 338 -282 -132 -159 -434 7 36 53 257 -157 -75 206 -188 19 -76
7524 -76 -35 14 60 -134 -10 390 352 -127 -354 246 -108 167 -302 90 299 -67 94 110 27 -254 383 -47
7546 -47 32 69 311 -86 -140 -269 23 -100 216 -148 231 -132 44 -133 -82 -89 94 170 129 50 157 219 -69 -44
7570 -44 -168 -158 49 -430 -412 212 -252 66 96 299 -107 -157 -144 143 295 -131 100 6 401 -213 -58 -278
7592 -278 -213 197 240 92 -20 -248 -144 90 -25 -127 285 300 333 248 -102 21 59 -22 280 37 232 27
7614 27 -7 65 336 -117 -131 163 175 -147 -309 -193 32 141 127 -162 -37 -98 -95 75 -202 67 -157 33 503
7637 503 -2 -123 66 -264 195 71 -54 117 -56 -47 208 61 -6 -299 25 126 -367 -254 -74 -43 -145
7658 -145 406 -297 185 38 -74 40 59 -48 -63 -129 -283 205 -124 -184 -229 242 185 -111 166 2 -259 -44
7680 -44 190 -22 82 -36 20 81 -174 189 -91 -115 38 110 -81 77 62 -133 -315 -318 -41 188 548 253 15
7703 15 15 81 -196 26 245 94 21 183 -59 46 -63 -54 130 -37 -93 169 -11 41 155 -139 -266 235 -328
7726 -328 74 -97 -221 69 73 -230 -29 138 -16 -5 433 -39 -100 -179 214 -124 57 -4 -68 101 -159 166
7748 166 -200 -290 155 256 147 190 -45 175 -44 -31 -129 88 -22 -295 46 71 103 -53 19 210 125 44 25
7771 25 -162 129 273 -282 45 39 76 86 -53 95 -95 -36 56 153 -26 127 4 11 -162 -2 107 -46 -15 -112
7795 -112 10 182 100 112 112 -58 -148 105 208 1 -136 50 61 -136 350 172 -25 -92 -111 183 33 107 -7
7818 -7 -146 5 -14 44 -18 -58 -11 227 248 47 -37 25 150 48 -8 -46 -130 -6 -130 -148 -67 -172 115 22 -66 49
7844 49 188 45 57 19 66 -6 -220 -129 133 99 -286 43 -85 10 -86 255 -171 203 -78 95 16 -89 -58 93
7868 93 -60 30 -107 -15 170 130 88 -134 -107 187 -47 107 -32 140 144 -36 133 110 93 -299 15 25 -214 207
7892 207 -57 51 218 -65 -71 -214 8 57 55 -110 -60 -2 -16 254 -73 -146 101 187 30 19 28 -76 115 62 132
7917 132 -211 115 26 95 -119 0 -80 69 26 35 -45 -143 107 244 194 29 -77 23 48 12 -258 54 7 -69
7941 -69 -21 13 -47 117 60 -102 31 -183 113 12 -96 -19 16 48 -27 48 133 -64 40 12 81 5 -177 -52 274
7966 274 91 -70 104 94 -110 49 152 210 -38 -168 19 179 -108 -94 -80 -76 75 59 -14 6 30 53 101 12
7990 12 197 56 25 122 -242 -155 -61 108 37 -39 -5 -89 61 207 -74 -176 -160 50 -151 124 56 -108 263 -94
8014 -94 -139 20 -102 -178 120 144 91 -153 -138 -58 19 146 33 -200 -95 154 110 -120 -216 34 -133 -14 96
8037 96 25 -27 283 -42 77 -15 -171 -33 50 0 -144 -54 101 -204 121 83 -28 225 197 18 85 -108 73
8060 73 84 71 44 37 80 97 63 79 -71 -6 -48 -184 27 -25 12 -186 -25 -171 120 -134 -110 -171 -97 201 -82 23
8086 23 59 24 54 63 -96 -73 101 177 224 -92 -87 130 -81 71 9 -7 256 97 -85 -172 56 102 -51 -74 113
8111 113 -153 100 122 -150 -87 -68 35 -90 18 142 -164 187 138 59 118 84 36 115 -88 78 -120 -141 27
8134 27 -28 -28 34 -150 14 74 -104 35 -65 53 -36 205 79 -248 -45 -202 -59 -133 -66 27 -38 98 -54 102
8158 102 -122 -150 73 -66 245 82 -122 254 155 -196 193 -171 -170 149 312 36 58 -185 -185 27 87 -41 -13
8181 -13 82 -104 -39 -32 80 98 -42 47 -67 -80
8191h0
##END NTUPLES=NMR FID
##END=
