##TITLE=1H_Pr NCS-27
 CDCl3
 8 sc, 
 27.06.2022
##JCAMPDX= 6.0         $$ Bruker NMR JCAMP-DX V2.0
##DATA TYPE= NMR FID
##DATA CLASS= NTUPLES
##ORIGIN= UXNMR, Bruker Analytische Messtechnik GmbH
##OWNER= root
$$ XWIN-NMR		Version 3.5
$$ Mon Jun 27 16:13:53 2022 Russian Standard Time (UT+4h)  she@DPX200
##.OBSERVE FREQUENCY= 200.1313499994
##.OBSERVE NUCLEUS= ^1H
##.DELAY= (6, 6)
##.ACQUISITION MODE= SIMULTANEOUS
##.ACQUISITION SCHEME= undefined
##.AVERAGES= 8
##.DIGITISER RES= 18
##SPECTROMETER/DATA SYSTEM= spect
##.PULSE SEQUENCE= zg30
##.SOLVENT NAME= CDCl3
##.SHIFT REFERENCE= (INTERNAL, CDCl3, 0, 15.7039)
##AUDIT TRAIL= $$ (NUMBER, WHEN, WHO, WHERE, WHAT)
$$ ##TITLE= Audit trail, XWIN-NMR		Version 3.5
$$ ##JCAMPDX= 5.01
$$ ##ORIGIN= Bruker BioSpin GmbH
$$ ##OWNER= she
$$ F:/spectra/data/she/nmr/H-F/1/audita.txt
$$ ##AUDIT TRAIL=  $$ (NUMBER, WHEN, WHO, WHERE, WHAT)
(   1,<2022-06-27 16:12:48.64 +0400>,<she>,<DPX200>,
      <created by zg, POWCHK disabled, PULCHK disabled
       configuration hash MD5:
       00 E9 B6 7A A2 85 ED C7 34 08 36 98 17 FE 4E 26
       data hash MD5: 16K
       83 57 94 80 64 5D 92 0D 57 E8 0D 3D D5 72 7C AF>)
$$ ##END=
$$ 
$$ hash MD5
$$ 2B A1 6B 24 5F B2 76 79 8C 09 E5 98 BC 38 00 95
##$RELAX= 
##$RELAX= 
##$RELAX= 
##$RELAX= 
##$RELAX= 
##$RELAX= 
$$ Bruker specific parameters
$$ --------------------------
##$DU= <F:/spectra>
##$EXPNO= 1
##$NAME= <H-F>
##$PROCNO= 1
##$TYPE= <nmr>
##$USER= <she>
##$AMP= (0..31)
100 100 100 100 100 100 100 100 100 100 100 100 100 100 100 100 100 100 
100 100 100 100 100 100 100 100 100 100 100 100 100 100 
##$AQSEQ= 0
##$AQ_mod= 1
##$AUNM= <au_zg>
##$AUTOPOS= <>
##$BF1= 200.13
##$BF2= 200.13
##$BF3= 200.13
##$BF4= 200.13
##$BF5= 200.13
##$BF6= 200.13
##$BF7= 200.13
##$BF8= 200.13
##$BYTORDA= 1
##$CFDGTYP= 0
##$CFRGTYP= 5
##$CHEMSTR= <none>
##$CNST= (0..31)
1 1 145 1 1 1 1 1 1 1 1 1 1 1 1 1 1 1 1 1 1 1 1 1 1 1 1 1 1 1 1 1 
##$CPDPRG= <>
##$CPDPRG1= <>
##$CPDPRG2= <>
##$CPDPRG3= <>
##$CPDPRG4= <mlev>
##$CPDPRG5= <mlev>
##$CPDPRG6= <mlev>
##$CPDPRG7= <mlev>
##$CPDPRG8= <mlev>
##$CPDPRGB= <>
##$CPDPRGT= <>
##$D= (0..31)
0 1.2 0 0 0 0 0 0 0 0.06 0 0.03 0 0 0 0 0.0002 0 0 0 0 0 0 0 0 0 0 0 0 
0 0 0 
##$DATE= 1656331968
##$DBL= (0..7)
120 120 120 120 120 120 120 120 
##$DBP= (0..7)
150 150 150 150 150 150 150 150 
##$DBP07= 0
##$DBPNAM0= <>
##$DBPNAM1= <>
##$DBPNAM2= <>
##$DBPNAM3= <>
##$DBPNAM4= <>
##$DBPNAM5= <>
##$DBPNAM6= <>
##$DBPNAM7= <>
##$DBPOAL= (0..7)
0.5 0.5 0.5 0.5 0.5 0.5 0.5 0.5 
##$DBPOFFS= (0..7)
0 0 0 0 0 0 0 0 
##$DE= 6
##$DECBNUC= <off>
##$DECIM= 32
##$DECNUC= <off>
##$DECSTAT= 4
##$DIGMOD= 1
##$DIGTYP= 9
##$DL= (0..7)
0 120 120 120 120 120 120 120 
##$DP= (0..7)
150 150 150 150 150 150 150 150 
##$DP07= 0
##$DPNAME0= <>
##$DPNAME1= <>
##$DPNAME2= <>
##$DPNAME3= <>
##$DPNAME4= <>
##$DPNAME5= <>
##$DPNAME6= <>
##$DPNAME7= <>
##$DPOAL= (0..7)
0.5 0.5 0.5 0.5 0.5 0.5 0.5 0.5 
##$DPOFFS= (0..7)
0 0 0 0 0 0 0 0 
##$DQDMODE= 0
##$DR= 18
##$DS= 0
##$DSLIST= <SSSSSSSSSSSSSSS>
$$ [...]
##$SUBNAM2= <"">
##$SUBNAM3= <"">
##$SUBNAM4= <"">
##$SUBNAM5= <"">
##$SUBNAM6= <"">
##$SUBNAM7= <"">
##$SUBNAM8= <"">
##$SUBNAM9= <"">
##$SW= 18.0517283424941
##$SWIBOX= (0..15)
0 0 2 0 0 0 0 0 0 0 0 0 0 0 0 0 
##$SW_h= 3612.71676300578
##$TD= 16384
##$TD0= 1
##$TE= 0
##$TE2= 300
##$TE3= 300
##$TEG= 300
##$TL= (0..7)
0 120 120 120 120 120 120 120 
##$TP= (0..7)
150 150 150 150 150 150 150 150 
##$TP07= 0
##$TPNAME0= <>
##$TPNAME1= <>
##$TPNAME2= <>
##$TPNAME3= <>
##$TPNAME4= <>
##$TPNAME5= <>
##$TPNAME6= <>
##$TPNAME7= <>
##$TPOAL= (0..7)
0.5 0.5 0.5 0.5 0.5 0.5 0.5 0.5 
##$TPOFFS= (0..7)
0 0 0 0 0 0 0 0 
##$TUNHIN= 0
##$TUNHOUT= 0
##$TUNXOUT= 0
##$USERA1= <user>
##$USERA2= <user>
##$USERA3= <user>
##$USERA4= <user>
##$USERA5= <user>
##$V9= 5
##$VALIST= <valist>
##$VCLIST= <CCCCCCCCCCCCCCC>
##$VD= 0
##$VDLIST= <DDDDDDDDDDDDDDD>
##$VPLIST= <PPPPPPPPPPPPPPP>
##$VTLIST= <TTTTTTTTTTTTTTT>
##$WBST= 1024
##$WBSW= 4
##$XGAIN= (0..3)
0 0 0 0 
##$XL= 0
##$YL= 0
##$YMAX_a= 568052
##$YMIN_a= -923567
##$ZGOPTNS= <>
##$ZL1= 120
##$ZL2= 120
##$ZL3= 120
##$ZL4= 120
##$ABSF1= 10
##$ABSF2= 0
##$ABSG= 5
##$ABSL= 3
##$ALPHA= 0
##$AQORDER= 0
##$ASSFAC= 0
##$ASSFACI= 0
##$ASSFACX= 0
##$ASSWID= 0
##$AUNMP= <proc_1d>
##$AZFE= 0.1
##$AZFW= 0.1
##$BCFW= 1
##$BC_mod= 2
##$BYTORDP= 1
##$COROFFS= 0
##$CY= 11.3945322036743
##$DATMOD= 1
##$DC= 2
##$DFILT= <>
##$DTYPP= 0
##$F1P= 2.36226072786647
##$F2P= -0.459571619588291
##$FCOR= 0.5
##$FTSIZE= 0
##$FT_mod= 4
##$GAMMA= 1
##$GB= 0.15
##$INTBC= 1
##$INTSCL= 1
##$ISEN= 128
##$LB= 0.24
##$LEV0= 0
##$LPBIN= 0
##$MAXI= 10000
##$MC2= 0
##$MEAN= 0
##$ME_mod= 0
##$MI= 1.114404
##$NCOEF= 0
##$NC_proc= 0
##$NLEV= 6
##$NOISF1= 3.799351
##$NOISF2= 2.8
##$NSP= 1
##$NTH_PI= 0
##$NZP= 0
##$OFFSET= 15.70392
##$PC= 1
##$PHC0= -18048.99
##$PHC1= 13.20069
##$PH_mod= 1
##$PKNL= yes
##$PPARMOD= 0
##$PSCAL= 0
##$PSIGN= 0
##$REVERSE= no
##$SF= 200.130013532006
##$SI= 16384
##$SIGF1= 3
##$SIGF2= 2
##$SINO= 400
##$SIOLD= 16384
##$SREGLST= <1H.CDCl3>
##$SSB= 0
##$STSI= 0
##$STSR= 0
##$SW_p= 3612.71676300578
##$SYMM= 0
##$S_DEV= 0
##$TDeff= 0
##$TDoff= 0
##$TI= <>
##$TILT= no
##$TM1= 0
##$TM2= 0
##$TOPLEV= 0
##$USERP1= <user>
##$USERP2= <user>
##$USERP3= <user>
##$USERP4= <user>
##$USERP5= <user>
##$WDW= 1
##$XDIM= 8192
##$YMAX_p= 0
##$YMIN_p= 0
$$ End of Bruker specific parameters
$$ ---------------------------------
##NTUPLES= NMR FID
##VAR_NAME=  TIME,          FID/REAL,        FID/IMAG
##SYMBOL=    X,             R,               I
##VAR_TYPE=  INDEPENDENT,   DEPENDENT,       DEPENDENT
##VAR_FORM=  AFFN,          ASDF,            ASDF
##VAR_DIM=   8192,          8192,            8192
##UNITS=     SECONDS,       ARBITRARY UNITS, ARBITRARY UNITS
##FACTOR=    0.0002768,     1,               1
##FIRST=     0,             0,               0
##LAST=      2.2672688,     0,               0
##MIN=       0,             -923567,         0
##MAX=       2.2672688,     568052,          0
$$ Real data points
##PAGE= N=1
##DATA TABLE= (X++(R..R)), XYDATA
$$ plain form
0 0 0 0 0 0 0 0 0 8 -8 8 -8 16 -16 21 -24 32 -40 54 -64 77 -93 112 -130 152 -183 214 -247 286 -331 381
30 381 -435 496 -565 640 -724 815 -916 1026 -1148 1284 -1428 1587 -1763 1951 -2159 2386
46 2386 -2634 2904 -3201 3526 -3883 4277 -4716 5201 -5746 6355 -7051 7845 -8765 9843
60 9843 -11134 12704 -14664 17193 -20598 25450 -32951 46184 -76367 293837 -323398 -756931
72 -756931 350403 455713 -238669 -423418 172883 314289 87782 -16767 -131803 -264920
82 -264920 27014 145895 -148501 -309344 72511 434068 149931 -268349 -37267 217715
92 217715 21926 -190007 -118899 27701 88014 138823 109741 -176818 -181522 155199 34839
103 34839 -331580 -140903 276019 232974 -74354 -29217 138413 -3587 -58508 16038 -132496
$$ packed form
0@%%%%%%%Qj6J6j6K4l2L7m5N6p2R4j18J41j70K05k42K82l35L97m61N33o17P12
30C81q16R31j061J205j364J539j731J942k174K432k712L015l350L714m110M545
46B386n020N538o105O727p409Q160q993R917j0947J2101j3406J4896j6610J8608
60I843k0977K3838k7368L1857l7791M6048n8401P9135j22551L70204o17235m33533
72g56931J107334J05310o94382j84749N96301J41406k26507j04549j15036j33117
82b64920K91934J18881k94396j60843L81855L61557k84137m18280K31082K54982
92B17715j95789k11933P1108J46600O0313N0809k9082k86559m704L36721j20360
103C4839l66419J90677M16922m3045l07328M5137J67630j42000n4921P4546j48534
$$ plain form
114 -132496 -98301 196863 150843 -164176 -123441 200930 71382 -343969 -154647 239706
124 239706 40608 -202334 76854 338771 41475 -276178 9515 212890 -147584 -244299
134 -244299 123703 217463 -34229 -96204 74534 20258 -150755 -39684 23873 -84094 38599
145 38599 189705 58402 -81995 9964 110117 -63627 -187867 13694 93785 -38300
155 -38300 -8838 85033 25047 -84406 -49932 30637 -76279 -109559 96104 140527 9984
166 9984 -1334 49598 23150 -62328 -63546 -10018 -40791 19936 123776 -810 -90327 37717
178 37717 67000 -97503 -149399 54482 126462 -65274 -30447 161234 54736 -114268 -44354
189 -44354 58453 -30043 -136415 11255 143599 11512 -61968 16332 32159 -24520 -69825
$$ packed form
114a32496L4195K95164m6020l15019M0735L24371j29548m15351J89322L94353
124B39706j99098k42942K79188K61917k97296l17653K85693K03375l60474r6715
134b44299L68002R3760k51692o1975J70738n4276j71013J11071O3557j07967J22693
145C8599J51106j31303j40397R1959J00153j73744j24240K01561Q0091j32085
155c8300K9462R3871n9986j09453L4474Q0569j06916l3280K05663M4423j30543
166I984j1318N0932k6448q5478j218N3528l0773O0727J03840j24586q9517J28044
178C7717K9283j64503n1896K03881P1980j91736L4827J91681j06498j69004O9914
189d4354J02807q8496j06372J47670J32344j32087p3480P8300J5827n6679m5305
$$ plain form
200 -69825 -35116 15726 36474 89840 39816 -63894 21397 84963 -53007 -142033 -24077
211 -24077 111610 29223 -85908 23521 87457 -18891 -59411 -36621 -26519 -7250 32387
222 32387 57979 -4154 -11911 78425 20431 -97402 -60485 13703 25431 -5160 -2654 42513
234 42513 22450 5625 10527 -64439 -65490 39283 56668 -12655 -37160 63455 103815 -52062
246 -52062 -110478 7328 29410 -33728 -40960 20381 62450 15549 -9437 -9685 -46165 -9289
258 -9289 20695 -28041 -11374 52629 62933 5374 -44472 5606 15012 -57772 -31815 28136
270 28136 18954 10403 18781 29939 -8762 -50837 188 7041 -42520 -2268 46655 34414 2398
283 2398 -15729 7052 -14007 -47774 -10540 -3670 -5479 38481 30293 -3012 -8878 3042 7905
$$ packed form
200f9825L4709N0842K0748N3366n0024j03710Q5291O3566j37970q9026J17956
211b4077J35687q2387j15131J09429O3936j06348m0520K2790J0102J9269L9637
222C2387K5592o2133p757R0336n7994j17833L6917P4188J1728l0591K506M5167
234D2513k0063j6825M902p4966j051J04773J7385o9323k4505J00615M0360j55877
246e2062n8416J17806K2082o3138p232O1341M2069m6901k4986k48l6480L6876
258i289K9984m8736J6667O4003J0304n7559m9846N0078R406p2784K5957N9951
270B8136r182q551Q378J1158l8701m2075N1025O853m9561M0252M8923j2241l2016
283B398j8127K2781k1059l3767L7234O870j809M3960q188l3305n866J1920M863
$$ plain form
296 7905 -43719 -37846 44943 34738 -6531 13118 24786 9894 -31950 -37174 451 -14139 -6819
309 -6819 33568 13538 2724 11323 -2442 -16530 -37442 -13736 20656 -4801 8507 35435
321 35435 6415 -4936 -8381 -17567 -18912 -23741 14219 29973 -6189 15240 34177 -3289 -24041
334 -24041 -23920 -7 7141 -15667 14420 31941 5183 5117 -9821 -25438 -12750 -13924 -2912
347 -2912 1361 3511 36122 14702 -23153 -4842 -2675 -13544 -16533 -8533 28295 21800 -487
360 -487 15321 -669 -15570 -6989 -17525 -6830 6263 11975 27613 4627 -6169 8945 -13614
373 -13614 -20241 -10199 -8965 12151 11533 7971 14550 -12055 -10561 1809 -22494 -17698 1433 15130
387 15130 24882 393 342 13580 -9474 -12557 -11582 -14013 13853 17846 11129 9460 -7081 4275
$$ packed form
296G905n1624N873Q2789j0205m1269J9649J1668j4892m1844n224L7625j4590P320
309f819M0387k0030j0814Q599j3765j4088k0912K3706L4392k5457J3308K6928
321C5435k9020j1351l445r186j345m829L7960J5754l6162K1429J8937l7466k0752
334b4041J21K3913P148k2808L0087J7521k6758o6j4938j5617J2688j174J1012
347b912M273K150L2611k1420l7855J8311K167j0869k989Q000L6828o495k2287
360d87J5808j5990j4901Q581j0536J0695J3093N712J5638k2986j0796J5114k2559
373a3614o627J0042J234K1116o18l562O579k6605J494J2370k4303M796J9131J3697
387A5130R752k4489n1J3238k3054l083R75k431K7866L993o717j669j6541J1356
$$ plain form
401 4275 2863 -27327 -16695 591 11748 21139 -2442 -4015 9967 -1147 -7544 -26007 -22972
414 -22972 19649 17041 -1670 -272 1735 19143 1490 -33175 -15662 3652 15591 16829 -9112
427 -9112 3620 25628 7342 -16204 -33986 -7271 30945 966 -16075 8911 18986 13947
439 13947 -18291 -29432 2392 -167 -5490 6052 705 8516 9906 1240 -2118 -24356 -12654
452 -12654 15333 -3577 -4439 14902 15061 13150 -9341 -16423 522 -9228 -3739 12312 8640 12058
466 12058 -162 -3193 11631 -16800 -28543 1971 14126 8652 -11708 -6960 25427 6414 -19162
479 -19162 -12848 -12436 6912 13027 -8473 -1646 11044 20943 13972 -30692 -31858 11403 29015 6351
493 6351 -35313 -1467 63332 9732 -56200 -20385 26423 20832 -19456 -22450 16884 19337 5587
$$ packed form
401D275j412l0190J0632J7286J1157R391k3581j573J3982j1114o397j8463L035
414b2972M2621k608j8711J398K007J7408j7653l4665J7513J9314J1939J238k5941
427i112J2732K2008j8286k3546j7782K6715L8216k9979j7041K4986J0075n039
439A3947l2238j1141L1824k559n323J1542n347P811J390q666l358k2238J1702
452a2654K7987j8910q62J9341J59j911k2491p082J6945r750N489J6051l672L418
466A2058j2220l031J4824k8431j1743L0514J2155n474k0360M748L2387j9013k5576
479a9162O314M12J9348O115k1500O827J2690R899o971m4664j166M3261J7612k2664
493F351m1664L3846O4799n3600o5932L5815M6808n591m0288k994L9334K453j3750
$$ plain form
506 5587 -7339 -25342 -3134 15319 -1020 -11832 -22775 8035 49024 4848 -40606 -13169
518 -13169 27050 16871 -35457 -24373 38094 30893 -4520 -14924 -9835 13868 3455 -21671
530 -21671 -5692 7422 14021 13372 -6997 -8816 -6563 -829 10969 -17187 -21208 20825 17233 -7481
544 -7481 -6821 6390 9037 -19295 -15989 16257 943 -9082 12131 20886 10976 -24552 -20195 28593
558 28593 6232 -35800 -3704 37829 24364 -22713 -21685 14651 -872 -12258 3027 -9892
570 -9892 -1223 20477 7155 -9457 -19048 -672 23086 -5794 -29487 -6185 27697 29778 -20637
583 -20637 -30756 23087 24104 -14303 -24564 -7164 26146 21796 -9863 -12178 -2569 14749 11329
596 11329 -25842 -18882 15084 18733 3166 -22977 -12037 28218 14087 -24981 -30436 5710 35284
$$ packed form
506E587j2926j8003K2208J8453j6339j0812j0943L0810M0989m4176m5454K7437
518a3169M0219j0179n2328J1084O2467p201l5413j0404N089K3703j0413k5126
530b1671J5979J3114O599o49k0369j819K253N734J1798k8156m021M2033l592k4714
544g481O60J3211K647k8332L306L2246j5314j0025K1213Q755r910l5528M357M8788
558B8593k2361m2032L2096M1533j3465m7077J028L6336j5523j1386J5285j2919
570i892Q669K1700j3322j6612r591J8376K3758k8880k3693K3302L3882K081n0415
583b0637j0119N3843J017l8407j0261J7400L3310m350l1659k315R609J7318l420
596A1329l7171O960L3966L649j5567k6143J0940M0255j4131l9068n455L6146K9574
$$ plain form
609 35284 -6386 -30394 17172 25468 -6747 -15339 -7847 6154 2097 -1387 9611 883 2017
622 2017 11088 -4962 -8456 -6615 -2873 14820 -194 -13328 10143 11703 -3345 -12342 -7963 7070
636 7070 -5672 -10950 10944 6465 435 2364 -8344 -1764 1112 -6699 117 1463 9648 10789
650 10789 -7779 482 6505 -6069 -2058 -4958 -1706 15050 4174 -7755 -2853 5855 9432 -14542
664 -14542 -17845 10975 7108 -3076 -2548 -3199 10866 3268 -17107 -4537 4296 2086 -30 -3687
678 -3687 8205 4972 -3647 5711 -5554 -8788 8575 1786 -87 3513 -1386 7087 3422 -6851
692 -6851 -3541 -5663 3358 3797 -9622 3391 8043 -1539 -125 -9598 -6090 5781 -3738 -2041 2312
707 2312 3008 9164 -3419 -6938 3647 -4405 -1313 3554 -1178 7651 3620 -2421 4497 -2648 -3193
$$ packed form
609C5284m1670k4008M7566Q296l2215q592P492J4001m057l484J0998q728J134
622B017R071j6050l494J841L742J7693j5014j3134K3471J560j5048q997M379J5033
636G070j2742n278K1894m479o030J929j0708O580K876p811O816J346Q185J141
650A0789j8568Q261O023j2574M011k900L252J6756j0876j1929M902Q708L577k3974
664a4542l303K8820l867j0184N28o51J4065p598k0375J2570Q833k210k116l657
678c687J1892l233q619R358j1265l234J7363o789j873L600m899Q473l665j0273
692f851L310k122R021M39j3419J3013M652r582J414r473L508J1871r519J697M353
707B312O96O156j2583l519J0585q052L092M867m732Q829m031o041O918p145n45
$$ plain form
722 -3193 -133 -4063 5125 -266 -4451 10203 1008 -7195 -2184 -5389 985 -1097 -7018 5932 4684
737 4684 1051 511 -8569 1297 3973 -8734 897 4527 3648 6779 -4882 -564 6326 -4333 -1659
752 -1659 -887 -113 7684 -2363 -616 5603 -4072 -735 -2230 -7270 3308 -121 -1907 4273 -2399
767 -2399 1433 930 -7182 751 -1731 -3051 7017 334 1064 3769 -2243 4421 -2052 -6691 5588
782 5588 1656 -110 3791 -1268 5341 779 -8087 1310 -1277 -2102 2466 -3859 2903 4212 -5293
797 -5293 284 -3140 -3690 2849 -5213 669 6197 -2059 2475 166 -2261 3599 -4959 -1387 6253
812 6253 -1247 2857 2903 -592 4715 -3941 -3812 3369 -3178 1004 2343 -2620 4840 -1182 -4517 1136
828 1136 -5425 -952 1684 -4294 3606 1832 -2544 2602 -3656 -864 2237 -5420 2796 3965 -778
$$ packed form
722c193L060l930R188n391m185J4654r195q203N011l205O374k082n921J2950j248
737D684l633n40r080R866K676j2707R631L630q79L131j1661M318O890j0659K674
752a659P72P74P797j0047J747O219r675L337j495n040J0578l429j786O180o672
767b399L832n03q112P933k482j320J0068o683P30K705o012O664o473m639J2279
782E588l932j766L901n059O609m562q866R397k587q25M568o325O762J309r505
797e293N577l424n50O539q062N882N528q256M534k309k427N860q558L572P640
812F253p500M104M6l495N307q656J29P181o547M182J339m963P460o022l335N653
828A136o561M473K636n978P900j774m376N146o258K792L101p657Q216J169m743
$$ plain form
843 -778 4650 -632 -222 3631 -4744 -62 1616 -2339 5704 441 -2425 3134 -2693 -264 -1264 -7214
859 -7214 3086 2090 -2585 2377 -3158 250 3704 -5845 -1855 -489 299 6866 -3242 -2805 7363
874 7363 814 -363 -3704 -3385 8026 917 -3677 3971 163 3077 1490 -7115 216 -103 -592 3439
890 3439 -5073 -973 5737 -2229 -2040 -3973 -2841 5085 -2480 -2202 3273 -2239 4569 3134 -6555 107
906 107 1175 1219 2579 -4170 3087 5108 -2213 3340 -2494 -5324 4088 233 215 -695 -4597 7011
922 7011 3071 -8952 -2822 484 2772 -426 -7740 3363 4370 -2320 3281 -3834 -5238 5485
936 5485 2438 -43 -4473 -1157 13131 2384 -10016 -328 3496 4836 -1392 -8653 4956 7368
950 7368 -941 -2034 -7061 848 6118 -4676 -2270 -1080 -496 7077 -2191 -6814 46 414 5249
$$ packed form
843g78N428n282M10L853q375M682J678l955Q043n263k866N559n827K429j000n950
859g214J0300r96m675M962n535L408L454r549L990J366P88O567j0108M37J0168
874G363o549j177l341L19J1411p109m594P648l808K914j587q605P331l19m89M031
890C439q512M100O710p966J89j933J132P926p565K78N475n512O808j435r689O662
906A07J068M4J360o749P257K021p321N553n834k830R412l855j8r10l902J1608
922G011l940j2023O130L306K288l198p314J1103J007o690N601p115j404J0723
936E485l047k481m430L316J4288j0747j2400R688L824J340o228p261J3609K412
950G368q309j093n027P909N270j0794K406J190N84P573r268m623O860L68M835
$$ plain form
965 5249 -1422 -9459 4349 7483 325 -3339 -4729 8369 5287 -10095 265 5656 -449 1582
979 1582 236 2370 -1643 -6731 6778 3194 -10508 -398 6232 2710 -5280 -7528 7251 2580
993 2580 -10100 1674 2273 -3136 1885 2046 3007 -3696 -5352 9705 3404 -9864 -1273 6166 8195
1008 8195 -1708 -9933 4864 7315 -3262 -2389 -4344 2941 7093 -3975 -2741 290 -1301 3459
1022 3459 -3166 -6752 -178 2755 8332 -2054 -12579 4037 8820 -2037 -7258 -4655 12070 9378
1036 9378 -11927 -3879 8944 2502 -3436 -3635 5140 2124 -5760 5783 1426 -10591 4291 8630
1050 8630 -3398 -9394 -3208 9780 1572 -11342 2592 5612 -1974 -3702 -4408 2995 1576 -4870
1064 -4870 3521 2854 -3412 961 1523 1376 -1101 -2866 6529 1052 -6292 3553 986 -1703 4010 -1523
$$ packed form
965E249o671q037J3808L134p158l664j390J3098l082j5382J0360N391o105K031
979A582j346K134m013n088J3509l584j3702J0110O630l522p990k248J4779m671
993B580j2680J1774N99n409N021J61R61o703j656J5057o301j3268Q591P439K029
1008H195r903q225J4797K451j0577Q73j955P285M152j1068J234L031j591M760
1022C459o625l586O574K933N577j0386j0525J6616M783j0857n221K603J6725k692
1036I378k1305Q048J2823o442n938j99Q775l016p884J1543m357j2017J4882M339
1050H630j2028n996O186J2988q208j2914J3934L020p586j728p06P403j419o446
1064d870Q391o67o266M373N62j47k477j765R395n477p344R845k567k689N713n533
$$ plain form
1080 -1523 -2543 -747 -1668 1519 -1866 831 2552 -5850 2224 3376 -10029 -1224 6916 519 -3130
1095 -3130 -2421 6398 4307 -8756 -1718 5078 1556 1257 -1605 2205 2546 -4741 3986 3144 -8135
1110 -8135 1367 5949 -1748 -4747 -1504 7577 465 -10396 1032 3391 -3271 -511 -1417 1475 2224
1125 2224 -2501 1842 -2289 -4638 5578 2629 -2019 1675 528 2275 -2425 -3394 6443 1002 -3123
1140 -3123 2872 -1837 -1470 1664 -586 1037 -2392 -47 3279 -6886 -2097 5255 -2913 -827 2439
1155 2439 -395 -854 -4135 901 3959 -3235 2219 3278 -2954 744 -244 1205 2577 -3653 2693
1170 2693 3886 -5289 525 3907 22 -887 -2597 2710 137 -6354 3390 2039 -4638 2267 1253
1185 1253 -2542 -2630 -2249 3968 -717 -3824 6111 1031 -4518 1086 714 1075 -56 -834 5019 -1344
$$ packed form
1080a523j020J796r21L187l385K697J721q402Q074J152j3405Q805Q140o397l649
1095c130P09Q819k091j3063P038O796l522k99k862L810L41p287Q727q42j1279
1110h135R502M582p697k999L243R081p112j0861J1428K359o662K760r06K892P49
1125B224m725M343m131k349J0216k949m648L694j147J747m700r69R837n441m125
1140c123N995m709L67L134k250J623l429K345L326j0165M789P352q168K086L266
1155B439k834m59l281N036L058p194N454J059o232L698r88J449J372o230O346
1170B693J193r175N814L382l885r09j710N307k573o491R744j351o677O905j014
1185A253l795q8L81O217m685l107R935n080n549N604l72L61j131p78N853o363
$$ plain form
1201 -1344 -2296 4932 -1144 -1634 1375 -1372 1533 -1133 -1723 3150 -2782 -1251 2958 -2589 -1365 -116
1217 -116 -780 1672 -3427 279 4620 -4181 -852 2993 -2046 498 778 1088 1574 -2852 3278 3108
1233 3108 -4856 1597 2936 -1624 630 -554 1102 448 -3734 3101 314 -4850 1664 101 -1742
1248 -1742 39 -1840 2678 -125 -4439 2609 423 -2612 1703 8 1007 459 -1237 3842 -1213
1263 -1213 -2676 4792 -131 -1514 2057 -366 1458 -474 -1499 2506 -2677 -1135 2852 -3154 -648
1278 -648 1177 -882 750 -3110 -895 2893 -3203 -963 2218 -1462 1386 305 -917 2057 -1556
1293 -1556 1704 1988 -3605 2151 2753 -1914 834 -420 712 913 -3247 1351 952 -3161 2051 -274
1309 -274 -2183 956 -1517 902 -649 -3092 2932 187 -2910 2516 -164 343 99 -1572 3253 10
$$ packed form
1201a344r52P228o076m90L009k747K905k666n90M873n932J531M209n547J224J249
1217a16o64K452n099L706M341q801L329L845n039K544K80L10M86m426O130j70
1233C108p964O453J339m560K254j184J656o54m182O835k787n164O514j563j843
1248a742J781j879M518k803m314P048k186l035M315j695R99n48j696N079n055
1263a213j463P468m923j383L571k423J824j932j025M005n183J542L987o006K506
1278f48J825k059J632l860K215L788o096K240L181l680K848j081j222K974l613
1293a556L260K84n593N756O02m667K748j254J132K01m160M598l99m113N212k325
1309b74j909L139k473K419j551k443O024k745l097N426k680N07k44j671M825l243
$$ plain form
1325 10 -1577 3602 -315 -781 2304 -1013 921 -132 -1394 3369 -1158 -1707 2337 -1309 -267 79
1341 79 -2402 1596 -1114 -1652 1882 -2045 16 1303 -2272 1143 10 -1394 2227 -833 519 2014
1357 2014 -1878 2193 1347 -2383 2327 437 16 1358 -1836 2099 1109 -3062 1587 -287 -1581 1148
1373 1148 -1804 -11 247 -2352 1883 -765 -2973 1793 -439 -433 465 -1911 2491 1207 -2306 1827
1389 1827 -102 32 1836 -1575 1729 1261 -1204 2387 -917 -1574 2123 -1247 -347 294 -2222 1805
1405 1805 -247 -2189 1004 -1641 -190 719 -3244 957 674 -1356 1667 -1422 -128 1994 -1660
1420 -1660 1223 1420 -1432 2391 239 -331 1536 -1856 1273 1946 -2552 1085 276 -597 1280 -2514
1436 -2514 100 1669 -2455 400 -45 -1745 1490 -919 -451 1080 -2609 1013 1311 -1941 722 -62
$$ packed form
1325A0j587N179l917m66L085l317J934j053j262M763m527n49M044l646J042L46
1341G9k481L998k710n38L534l927K061J287l575L415j133j404L621l060J352J495
1357B014l892M071q46l730M710j890m21J342l194L935r90m171M649j874j294K729
1373A148k952J793K58k599M235k648k208M766k232OQ98k376M402j284l513M133
1389A827j929J34J804l411L304m68k465L591l304o57L697l370R00O41k516M027
1405A805k052j942L193k645J451R09l963M201k83k030L023l089J294K122l654
1420a660K883J97k852L823k152n70J867l392L129O73m498L637q09q73J877l794
1436b514K614J569m124K855m45j700L235k409M68J531l689L622K98l252K663p84
$$ plain form
1452 -62 1397 1860 -3236 1362 2763 -2094 1189 275 -601 1802 -1029 7 893 -1168 1705 -970
1468 -970 -2184 1135 -1948 -10 2104 -3334 -412 1715 -1456 -828 -1455 886 2239 -2175 1213 1430
1484 1430 -1371 1735 -714 -1070 2900 -50 -106 1278 -637 752 -482 435 2027 -3779 -33 3890
1500 3890 -3347 -1604 1869 -653 -1042 -1416 724 715 -2823 959 946 -1619 1657 -978 -1132 2363 -1906
1517 -1906 -150 3788 -240 -581 -108 962 1067 -2158 1965 2331 -2952 1058 969 -3014 580 8 -176
1534 -176 1319 -1762 -252 -528 -1850 790 -1465 108 3119 -2320 -1628 798 -1011 1393 -12 -240
1550 -240 2541 -1324 -24 1984 -435 774 -73 -586 2002 -1733 -394 3070 -1929 -1370 598 -187
1566 -187 -412 -2729 407 3009 -2479 -373 1405 -2620 -728 -76 525 2334 -1261 -147 1758 -1965
$$ packed form
1452f2J459M63n096M598J401m857L283r14q76K403k831J036Q86k061K873k675
1468i70j214L319l083J938K114n438K922K127l171O28o27K341J353m414L388K17
1484A430k801L106k449l56L970k950n6J384j915J389j234R17J592n806L746L923
1500C890p237J743L473k522l89l74K140rl538L782j3k565L276k635j54L495m269
1517a906J756L938m028l41M73J070J05l225M123L66n283M010q9l983L594n72j84
1534a76J495l081J510k76j322K640k255J573L011n439O92K426j809K404j405k28
1550b40K781l865J300K008k419J209q47n13K588l735J339L464m999N59J968p85
1566a87k25k317L136K602n488K106J778m025J892O52O01J809l595J114J905l723
$$ plain form
1582 -1965 323 947 462 1471 -1346 1272 2043 -2946 1079 1569 -2013 1141 173 -485 617 -1892
1598 -1892 399 99 -1821 1917 -1408 -2500 1934 -614 132 725 -1344 1366 -719 -1343 3174 -273
1614 -273 -941 1940 -456 544 -233 -309 2402 -1568 -383 3161 -1100 -1585 -68 -906 1358 -1260 -168
1631 -168 2629 -2932 -2088 1436 -1332 -487 219 573 903 -2635 368 1835 -2765 1029 1794 -785 1667
1648 1667 89 -89 1119 -1463 1384 1423 -1317 1183 -150 -431 800 -1606 591 683 -2818 1224
1664 1224 111 -1884 1447 -230 -703 -1009 -1556 2659 -811 -2123 3522 -102 -1976 1506 158 -347
1680 -347 -518 749 2879 -1643 -627 3061 -1429 -672 1200 -502 1173 -953 -1518 1506 -1424 -796
1696 -796 1158 -921 -509 -1084 46 1741 -2800 -532 2588 -2472 -131 1866 -636 289 166 535
$$ packed form
1582a965K288O24m85J009k817K618P71m989M025M90l582L154r68o58J102k509
1598a892K291l00j920L738l325j092M434k548P46N93k069K710k085o24M517l447
1614b73o68K881k396J000p77p6K711l970J185L544m261m85J517q38K264k618J092
1631a68K797n561Q44L524k768Q45P06L54L30l538L003J467m600L794P65k579K452
1648A667j578j78J208k582K847L9k740K500j333k81J231k406K197R2l501M042
1664A224j113j995L331j677m73l06n47M215l470j312N645l624j874L482j348n05
1680c47j71J267K130m522J016L688m490P57J872j702J675k126n65L024k930O28
1696g96J954k079M12n75J130J695m541K268L120n060K341J997k502R25j23L69
$$ plain form
1712 535 769 -1491 2005 1060 -1907 1952 884 -1278 579 -1105 365 699 -1514 1352 228 -2308
1728 -2308 902 -309 -584 -143 -981 2166 -943 -2645 2528 -114 -2205 1374 248 555 -115 -124 2802
1745 2802 -1213 -1127 3277 -661 -666 1408 29 779 -698 -416 1687 -1815 -960 1367 -1261 -115 -454
1762 -454 -701 793 -2213 -400 2034 -2204 -305 1825 -1006 349 105 427 992 -1686 1645 1662 -2479
1779 -2479 1129 1528 -837 391 -57 963 173 -2144 1798 511 -2508 1133 114 -968 -204 -1258
1795 -1258 1368 -530 -2588 2065 73 -1457 1231 34 169 236 -657 1967 -336 -1150 2517 -336
1811 -336 -879 1466 80 609 -486 -644 2189 -1831 -639 2035 -1432 -404 670 -595 319 -1481
1827 -1481 40 1438 -2670 35 1958 -1509 -312 488 523 873 -1586 1659 1939 -2400 816 1673
$$ packed form
1712E35K34k260L496r45k967L859j068k162J857j684J470L34k213K866j124k536
1728b308L210j211k75M41q38L147l109j702N173k642k091L579j126L07o70rK926
1745B802m015Q6M404l938nK074j379P50j477K82K103l502Q55K327k628J146l39
1762d54k47J494l006J813K434m238J899K130k831J355k44L22N65k678L331J7m141
1779b479L608L99k365J228m48J020p90k317L942j287l019L641j019j082P64j054
1795a258K626j898k058M653j992j530K688j197J35O7q93K624k303q14L667k853
1811c36n43K345j386N29j095j58K833m020J192K674l467J028J074j265R14j800
1827a481J521J398m108K705J923l467J197Q00L5L50k459L245K80m339L216Q57
$$ plain form
1843 1673 -632 254 -511 1393 676 -2221 1364 1009 -2195 756 56 -529 -187 -1469 1090 -11 -2167
1860 -2167 1386 -195 -1341 1055 -744 -149 335 -989 1408 -131 -567 1882 -949 -470 1646 -517
1876 -517 415 308 -219 1624 -1464 -443 2069 -1610 -630 1010 -615 -118 -1161 168 1407 -2740
1892 -2740 -49 1811 -1949 -279 -56 36 771 -1694 866 1954 -1683 294 1269 -469 1138 -490
1908 -490 676 1554 -1651 865 1287 -1321 660 -165 -337 648 -1749 493 598 -1831 956 -397 -1185
1925 -1185 1382 -1008 -747 1088 -783 660 -408 -409 1733 -1154 -45 2238 -1276 415 979 -537
1941 -537 1015 -387 6 1788 -1053 -310 732 -771 752 -1174 -470 1549 -2503 -1049 1565 -1417
1957 -1417 14 206 -434 439 -1661 -142 1454 -1202 993 727 -917 1634 -830 -696 2090 -218
$$ packed form
1843A673k305Q86p65J904p17k897L585l55l204K951p00n85L42j282K559j101k156
1860b167L553j581j146K396j799N95M84j324K397j539m36K449k831M79K116k163
1876e17R32j07n27J843l088J021K512l679R80J640j625M97j043J329J239m147
1892b740K691J860l760J670K23R2P35k465K560J088l637J977R75j738J607j628
1908d90J166Q78l205K516M22k608J981q25j72R85k397K242J05k429K787j353p88
1925a185K567k390K61J835j871J443j068jK142k887J109K283l514J691N64j516
1941e37J552j402L93J782k841P43J042j503J523j926P04K019m052J454K614k982
1957a417J431J92o40Q73k100J519J596k656K195k66j644K551k464J34K786k308
$$ plain form
1973 -218 193 783 -343 715 -1212 -319 1904 -1756 -103 1345 -1794 -212 -354 -1083 889 -1047
1989 -1047 -601 672 -871 643 -589 -1015 2085 -1227 -1301 2600 -510 -443 1150 -34 644 -709 552
2006 552 1603 -1875 498 1425 -1457 1359 86 -1749 1013 -238 -755 421 -412 298 -1591 -1168
2022 -1168 1859 -1372 -1070 2257 -780 -563 565 -772 766 -783 162 1902 -544 815 599 -1361
2038 -1361 1484 -191 -1374 2050 -360 -1196 574 -75 195 -1299 -526 1474 -2703 -595 2452 -1831
2054 -1831 -361 931 -1545 -48 -4 -90 607 -763 1491 214 -1529 1722 -584 -1198 2893 521
2070 521 -262 833 -1021 -70 -180 4 1461 -1075 222 336 -2378 591 522 -1905 1067 55 -1642
2087 -1642 207 -168 215 -938 -573 2197 -1176 -1102 2283 -1048 -497 1824 -108 184 -86 -381 1327
$$ packed form
1973b18M11N90j126J058j927Q93K223l660J653J448l139J582j42p29J972j936
1989a047M46J273j543J514j232m26L100l312p4L901l110O7J593j184O78j353J261
2006E52J051l478K373R27k882K816j273j835K762j251n17J176q33P10j889M23
2022a168L027l231L02L327l037K17J128j337J538j549R45J740k446J359k16j960
2038a361K845j675j183L424k410q36J770o49K70j494P73K000m177K108L047m283
2054a831J470J292k476J497M4q6O97j370K254j277j743L251k306o14M091k372
2070E21p83J095j854R51j10J84J457k536J297J14k714K969o9k427K972j012j697
2087a642J849l75L83j153L65K770l373P4L385l331N51K321j932K92k70k95J708
$$ plain form
2104 1327 -298 668 479 -1474 980 -379 -1406 2043 -495 -1547 1201 -1038 -762 151 -484 323
2120 323 -1164 129 978 -1663 764 966 -2090 1028 1126 -615 1098 117 442 646 -884 1036 -133
2137 -133 -1243 1544 -122 204 841 -1484 364 -335 -1717 1221 67 -1119 365 -808 35 -457
2153 -457 -1190 1249 -525 -1260 1658 -160 -692 408 -486 1041 60 -13 1681 -523 -276 1094 -1031
2170 -1031 611 377 -1089 942 -639 -568 1336 -1534 -466 473 -1442 -513 -893 -399 650 -1235 260
2187 260 1279 -1603 661 505 -972 1018 406 697 643 -1389 1105 930 -967 1394 522 -176 225
2204 225 -992 928 301 -1671 1374 -113 -1446 613 -652 -422 -177 -787 1260 -342 -1322 979
2220 979 -896 -178 1314 -736 614 509 -830 1101 -212 -131 1002 -492 418 453 -550 1248 -600
$$ packed form
2104A327j625R66j89j953K454j359j027L449k538j052K748k239K76R13o35Q07
2120C23j487J293Q49k641K427K02l056L118R8j741J713r81L25K04j530J920j169
2137a33j110K787j666L26O37k325J848o99j382K938j154j186J484j173Q43m92
2153d57p33K439j774p35K918j818n32J100q94J527r81p3J694k204K47J370k125
2170a031J642k34j466K031j581P1J904k870J068R39j915R29l80M94J049j885J495
2187B60J019k882K264j56j477J990o12K91n4k032K494j75j897K361q72o98M01
2204B25j217J920o27j972L045j487j333K059j265K30K45o10K047j602r80K301
2220I79j875P18J492k050J350j05j339J931j313Q1J133j494R10L5j003J798j848
$$ plain form
2237 -600 -708 1162 -1135 -388 1084 -1311 40 -177 -179 338 -1490 29 694 -1489 526 1047 -735
2254 -735 534 -338 110 662 -743 970 1009 -1042 908 273 -61 815 -820 796 848 -1323 644 263
2272 263 -937 462 -730 -182 291 -1531 687 -156 -1377 912 -525 -364 657 -790 771 264
2288 264 -533 1585 -451 -501 1238 -417 281 832 -376 697 -797 -254 1420 -1335 -164 790 -1139
2305 -1139 24 99 -736 430 -914 -90 622 -1349 75 279 -622 684 -663 -126 1135 -1144 492
2322 492 1078 -849 751 192 -29 1070 -630 543 735 -1179 872 260 -896 851 -683 -473 115
2339 115 -1202 287 -402 -960 793 -982 -1078 687 -614 76 64 -783 976 -179 -288 1579 -388
2356 -388 -26 717 -403 789 -235 -393 1579 -703 -359 1041 -581 209 -131 -563 803 -1111 -657
$$ packed form
2237f00j08J870k297P47J472k395J351k17kN17j828J519O65k183K015N21j782
2254g35J269q72M48N52j405J713L9k051J950o35l34Q76j635J616N2k171J967l81
2272B63j200J399j192N48M73j822K218q43j221K289j437J61J021j447J561n07
2288B64p97K118k036n0J739j655O98N51j208J073j494N43J674k755J171R54j929
2305a139J163P5q35J166j344Q24P12j971J424K04r01J306j347N37J261k279J636
2322D92N86j927J600n59k21J099j700J173J92j914K051o12j156J747j534K10N88
2339A15j317J489o89n58J753j775r6J765j301O90j2q47J759j155j09J867j967
2356c88L62P43j120J192j024j58J972k282L44J400j622P90l40m32J366j914M54
$$ plain form
2373 -657 681 -1380 -294 125 -1082 475 -593 -340 1255 -799 167 715 -292 800 64 -231 1255
2390 1255 -598 428 886 -647 536 352 -717 1009 -486 -573 692 -705 44 -135 -1044 885 -725
2407 -725 -1207 727 -751 -58 166 -700 1070 -318 -560 1313 -596 181 846 -333 1089 84 -548
2424 -548 1356 -276 -543 1094 -128 186 -450 -461 935 -923 -615 900 -921 -698 550 -829 185
2441 185 -346 -444 612 -646 240 235 -707 1219 110 -413 1471 -232 -449 998 48 656 453 -321 878
2460 878 -832 -197 860 -1023 389 252 -1229 386 -149 -1227 587 -264 -226 -381 -913 901 -657
2477 -657 -775 1466 -372 -1006 933 -263 -198 539 -163 798 -585 202 769 -865 1272 816 -799 980
2495 980 -109 -1317 726 -98 -233 120 -285 341 -1350 -715 964 -1206 -439 1414 -970 -121 561
$$ packed form
2373f57J338k061J086M19j207J557j068K53J595k054R66N48j007J092p36k95J486
2390A255j853J026M58j533J183j84j069J726j495q7J265j397P49j79r09J929j610
2407g25m82J934j478O93K24q66J770j388k42J873j909P77O65j179J422j005o32
2424e48J904j632k67J637j222L14o36j1J396j858L08J515j821K23J248j379J014
2441A85n31r8J056j258Q86nr42J926j109n23J884j703k17J447r50O08k03p74J199
2460H78j710O35J057j883J412j37j481J615n35j078J814q51L8j55n32J814j558
2477f57j18K241j838o34J939j196O5P37p02R61j383P87N67j634K137m56j615J779
2495I80j089j208K043q24j35L53m05O26j691O35J679k170P67J853k384Q49O82
$$ plain form
2512 561 -529 437 -48 554 456 -646 871 -43 -1050 1357 -9 -929 1297 -317 -372 544 -320 233
2530 233 -913 -300 688 -1567 99 898 -1771 658 544 -1478 259 13 -509 565 -12 712 -306
2547 -306 -429 1327 -810 -165 2020 -414 -338 1498 -618 -32 -57 -15 88 -357 1032 156 -1267 754
2565 754 -763 -1418 1100 -291 -840 662 -285 -805 -170 134 539 -593 356 1316 -1154 672 1092 -1029
2583 -1029 431 698 -457 697 -38 59 66 -300 704 -1045 -504 1505 -903 -761 1536 -1095 -1057 -123
2601 -123 -545 -313 -229 896 575 -1622 498 438 -1139 1374 650 -693 694 150 -322 169 -127 725
2619 725 -483 173 1394 -1040 -230 1245 -1075 -292 367 -639 30 -573 -125 546 -741 381 -333
2636 -333 -1523 966 -58 -677 1420 -103 -475 85 231 858 -482 422 1689 -846 -210 1255 -803
$$ packed form
2512E61j090R66m85O02r8j102J517r14j007K407j366r20K226j614n5R16q64N53
2530B33j146O13R88k255J666P99k669K429j14k022J737k46n22J074n77P24j018
2547c06j23J756k137O45K185k434P6J836k116N86k5M2J03m45J389q76j423K021
2565G54j517o55K518j391n49J502r47n20O35L04M05j132R49R60k470J826M20k121
2583a029J460K67j155J154p35R7Pl66J004j749N41K009k408J42K297k631L8R34
2601a23m22K32Q4J125l21k197K120o0j577K513p24j343J387n44m72M91k96Q52
2619G25j208O56J221k434Q10J475k320P83O59j006O69o03M48O71j287J122p14
2636c33j190K489j024o19K097j523l72N60J46O27j340R04J267k535O36J465k058
$$ plain form
2653 -803 -95 649 -129 313 -583 -23 250 -1231 239 81 -1188 842 -555 -983 815 -451 -426 321
2671 321 -185 50 -300 655 1018 -968 265 949 -883 1003 729 -582 613 205 -43 589 -553 478
2689 478 -244 -838 1077 -401 -943 847 -673 -552 513 -447 104 -489 -385 522 -652 255 666 -653
2707 -653 806 307 -519 1009 -37 -377 815 -172 380 167 -357 740 -758 -322 684 -921 -176
2724 -176 219 -940 224 -92 -326 451 -908 -253 309 -539 426 -141 -360 961 -535 -152 643 -796
2742 -796 778 707 -412 985 -119 -278 478 -582 559 412 -755 798 -512 -709 793 -560 -358
2759 -358 270 -960 326 -617 -699 512 -477 -435 515 -358 502 80 -462 1080 -180 -212 1139 -367 269
2778 269 339 -181 916 -480 -433 710 -662 37 269 -704 302 -371 -583 523 -665 -65 166 -1135
$$ packed form
2653h03P08P44p78M42q96N60K73j481J470j58j269K030j397m28J798j266K5P47
2671C21n06K35l50R55L63j986J233O84j832J886k74j311J195m08k48O32j142J031
2689D78p22n94J915j478n42J790j520J21J065r60N51n93J04R07j174R07M11j319
2707f53J459m99q26J528j046l40J192r87N52k13n24J097j498M36J006j605P45
2724a76L95j159J164l16k34P77j359O55N62q48R65n67k19J321j496L83P95j439
2742g96J574p1j119J397j104j59P56j060J141j47j167J553j310j97J502j353K02
2759c58O28j230J286r43q2J211r89M2R50q73Q60m22n42J542j260l2J351j506O36
2778B69P0n20J097j396M7J143j372O99K32r73J006o73k12J106j188O00K31j301
$$ plain form
2796 -1135 469 179 -865 539 -281 -126 537 -504 624 294 -520 791 -159 -245 866 -107 437 265
2814 265 -591 1109 -50 -601 847 -465 -243 159 -907 497 -578 -858 818 -524 4 705 -529
2831 -529 292 -3 -595 616 -308 -282 1105 -415 481 464 -231 833 -79 -325 765 -537 337 427 -900
2850 -900 282 -69 -819 234 -470 -99 422 -993 302 46 -873 457 -219 -183 247 -399 558 337 -626
2869 -626 665 115 -426 588 -276 369 499 -573 848 49 -494 890 -381 -135 128 -751 479 -51
2887 -51 -816 269 -374 -451 40 -681 45 201 -665 663 -309 -231 935 -470 154 262 -425 931 318
2906 318 -624 863 -25 173 189 -761 875 209 -929 477 -505 -81 239 -871 218 26 -976 384
2924 384 95 -603 237 -352 243 190 -701 740 226 -762 797 -163 -94 561 -707 692 271 -805 695
$$ packed form
2796a135J604k90j044J404q20J55O63j041J128l30q14J311r50q6J111r73N44j72
2814B65q56J700j159n51J448j312K22M02j066J404j075k80J676j342N28P01j234
2831e29Q21k95n92J211r24K6J387j520Q96j7o95J064r12k46J090j302Q74R0j327
2850i00J182l51p50J053p04L71N21j415J295k56r19J330o76L6M30o46R57k21r63
2869f26J291n50n41J014q64O45J30j072J421p99n43J384j271K46K63q79J230n30
2887e1p65J085o43p7M91p21P26J56q66J328r72P8J166j405O24J08o87J356o13
2906C18r42J487q88J98J6r50J636o66j138J406r82M24L20j110J089j92j002J360
2924C84k89o98Q40n89N95n3q91J441n14r88J559r60O9O55j268J399m21j076J500
$$ plain form
2943 695 58 -299 394 -803 535 165 -880 567 -222 -643 373 -925 161 67 -755 561 -87 -516
2961 -516 511 -595 -34 520 -542 520 410 -279 834 57 370 745 -768 685 180 -798 483
2978 483 -127 -216 509 -511 -43 300 -911 211 -254 -188 435 -770 435 305 -1101 592 488 -793
2996 -793 344 474 256 174 -293 728 43 -800 1022 -89 -141 738 -586 127 493 -879 355 -123
3014 -123 -226 277 -600 497 13 -1172 875 -113 -1171 455 -147 -27 779 -236 174 -164 -142 610
3032 610 -269 223 854 -617 527 540 -815 354 105 53 427 -304 280 -454 -847 746 -443 -672 722
3051 722 -825 -584 352 -642 88 12 -321 377 -269 -84 587 -277 669 341 -654 522 87 -227 636 12
3071 12 374 106 -791 512 -556 -406 558 -423 115 368 -1007 31 -269 -550 582 -340 22 478 -1032
$$ packed form
2943F95o37l57O93j197J338l70j045J447p89m21J016j298J086r4q22J316o48m29
2961e16J027j106N61N54j062J062j10o89J113p77L13L75j513J453n05r78J281
2978D83o10q9P25j020M68L43j211J122m65O6O23j205J205j30j406J693j04j281
2996g93J137J30k18q2m67J021o85q43J822j111n2Q79j324P13L66j372J234m78
3014a23j03N03q77J097m84j185K047r88j058J626o02J20Q06j015M10l38K2P52
3032F10q79M92O31j471J144J3j355J169k49n2L74p31N84p34l93J593j189k29J394
3051G22j547K41R36r94P30p6l33O98o46J85O71q64R46l28r95J176m35l14Q63o24
3071A2L62k68q97J303j068J50R64r81N38K53j375J038l00k81J132r22L62M56j510
$$ plain form
3090 -1032 395 259 -502 452 485 107 697 -556 403 -131 -367 1095 12 -41 748 -527 -396 472 -644
3109 -644 168 143 -566 354 -91 -316 92 -744 322 -33 -979 748 -461 -337 698 14 249 390 -385
3128 -385 219 -391 477 1085 -347 289 286 -1162 283 567 38 318 -57 -375 -414 -635 548 -268 -676 608
3148 608 -614 -645 732 -864 -153 373 -111 112 -182 20 450 -685 1021 409 -582 1001 5 -797
3166 -797 877 356 75 -72 -113 -97 -127 -430 525 -139 -304 606 -874 250 320 -564 185 61 -132 -90 -451
3187 -451 150 -200 -283 1065 -21 -396 647 -522 16 741 -109 363 309 -359 411 -302 96 296 -841
3206 -841 260 129 -894 150 -338 -438 61 -413 217 53 -691 119 -388 -210 616 -366 -38 373 -366
3225 -366 612 361 -377 883 -26 -116 1207 -779 -76 274 -510 901 92 -261 32 -648 -407 -509 -140
$$ packed form
3090a032J427j36p61R54L3l78N90j253R59n34k36J462j083n3P89j275J31Q68j116
3109f44Q12k5p09R20m45k25M08q36J066l55r46J727j209J24J035o84K35J41p75
3128c85O04o10Q68O08j432O36lj448J445K84n29K80l75l18l9k21J183q16m08J284
3148F08j222l1J377j596P11N26m84K23k94K02M30j135J706o12r91J583r96q02
3166g97J674n21k81j47m1J6l0l03R55o64j65R10j480J124P0q84P49j24j93M2l61
3187d51O01l50q3J348j086l75J043j169N38P25q50M72n4o68P70p13L98K00j137
3206h41J101j31j023J044m88j00M99m74O30j64p44Q10n07J78Q26r82L28M11p39
3225c66R78k51p38J260r09r0J323j986P03L50p84J411q09l53K93o80K41j02L69
$$ plain form
3244 -140 -555 -176 -1032 340 177 -195 903 -530 792 86 -1045 681 -102 -624 861 -470 259
3261 259 462 -386 414 37 -77 489 -444 230 -158 -599 245 -371 -150 109 -675 207 421 -648 179 -111
3281 -111 -404 482 -142 116 343 -338 435 191 -252 611 -47 -105 652 -366 347 330 -287 216 -236 -173 355
3302 355 -86 140 -59 -828 372 -297 -531 446 -355 -219 227 -646 315 181 -413 509 98 141 617 -259
3322 -259 322 371 -126 278 39 -44 311 -446 165 402 -549 381 -262 -262 -35 -288 -68 329 -753 361 215
3343 215 -702 194 -364 13 359 -563 620 439 -636 535 -60 -27 672 -325 329 288 -508 341 -140 -126
3363 -126 203 -373 -42 453 -505 188 -58 -424 266 -229 -245 227 -741 26 35 -492 492 -179 -93 398 -340
3384 -340 336 439 -268 257 -140 6 443 -390 270 443 -538 46 -10 -610 434 -597 -227 417 -826
$$ packed form
3244a40m15L79q56J372j63l72J098j433J322p06j131J726p83n22J485j331P29
3261B59K03q48Q00l77j14N66r33O74l88m41Q44o16K21K59p84Q82K14j069Q27k90
3281a11k93Q86o24K58K27o81P73k44m43Q63o58n8P57j018P13j7o17N03m52O3N28
3302C55m41K26j99p69J200o69k34R77q01J36M46q73R61j34n94R22m11M3M76q76
3322b59N81M9m97M04k39q3L55p57O11K37r51R30o43%K27k53K20L97j082J114j46
3343B15r17Q96n58L77L46r22J183j81j075J171n95L3O99r97O54m1p96Q49m81J4
3363a26L29n76L31M95r58O93k46l66O90m95j6M72r68P67Rn27R84o71Q6M91p38
3384c40O76J03p07N25l97J46M37q33O60J73r81N84n6o00J044j031L70O44j243
$$ plain form
3403 -826 -211 31 -639 62 -379 -183 337 -545 250 254 -276 523 209 103 359 -160 324 495 74 530 205
3424 205 -241 450 -282 -29 337 -482 170 -43 -546 178 -374 -246 452 -412 -114 5 -594 452 117 -189
3444 -189 439 -199 -120 260 -224 505 119 62 803 -416 91 677 -361 168 153 -183 288 -424 89 244
3464 244 -441 -273 113 -334 234 -405 -383 281 -588 129 202 -339 275 -281 173 417 -141 305 559 -519
3484 -519 334 258 -37 313 -63 103 602 -456 316 330 -366 314 -283 -603 297 -349 -307 148 -47 -57 -105
3505 -105 -2 172 -626 541 555 -439 404 115 22 196 216 -5 631 180 193 -105 -203 585 -591 -183 585
3526 585 -577 -65 67 -594 -148 -246 -95 337 -197 97 256 -737 -8 51 -282 1025 -198 -228 182 -386
3546 -386 576 338 11 510 2 -287 181 -93 113 209 -110 505 -348 -591 316 -393 -185 310 -484 -302
$$ packed form
3403h26O15K42o70P01m41J96N20q82P95Mn30P99l14j06K56n19M84J71m21M56l25
3424B05m46O91p32K53L66q19O52k13n03P24n52J28O98q64K98J19n99J046l35l06
3444a89O28o38P9L80m84P29l86n7P41j219N07N86j038N29j5l36M71p12N13J55
3464B44o85J68L86m47N68o39K2O64q69P17P3n41O14n56M54K44n58M46K54j078
3484e19Q53p6k95L50l76J66M99j058P72J4o96O80n97l20R00o46M2M55j95j0m8
3505a05J03J74p98J167J4r94Q43k89r3J74K0k21O36m51J3k98r8P88j176M08P68
3526E85j162N12J32o61M46r8J51M32n34K94J59r93P29N9l33J307j223l0M10n68
3546c86R62k38l27M99n08k89M68k74K06R6l19O15q53k43R07p09K08M95p94J82
$$ plain form
3566 -302 -287 -281 336 -572 259 461 -379 66 -149 -327 650 374 263 6 -293 44 -119 273 487 -366 11
3587 11 603 -875 -495 645 -252 -150 219 62 -386 -747 -195 -125 -541 649 -50 -831 235 -97 -461
3606 -461 522 381 -64 -154 -105 502 -452 328 766 -177 360 451 -360 233 242 -170 245 -405 76 177 -682 332
3628 332 8 -272 436 -170 -357 166 -421 -281 -67 278 437 -228 62 298 -358 289 390 -219 537 301
3648 301 118 221 -297 81 127 -341 209 -217 -610 168 -581 -183 472 -459 -72 -100 -410 592 -161 -106 875
3669 875 -498 -88 112 -20 422 220 405 596 -286 150 125 -434 533 258 -257 559 -248 -51 98 -712
3689 -712 135 23 -340 62 -476 -432 381 -206 153 -95 -53 479 -226 -90 241 -474 130 355 -356 434 143
3710 143 -276 357 -136 -87 118 -318 406 -97 -423 244 -262 -554 286 -518 124 -67 -232 327 -294 -88
$$ packed form
3566c02J5OO17r08Q31K02q40M45k15j78R77k76j11k57k99L37j63L92K14q53L77
3587A1N92j478L80J140q97J02L69j57m48l61N52P0m16J190o99p81J066l32l64
3606d61R83j41m45r0M9O07r54P80M38r43N37R1q11N93Rm12M15o50M81J01q59J014
3628C32l24k80P08o06j87N23n87J40K14L45J59o65K90K36o56O47J01o09P56k36
3648C01j83J03n18L78M6m68N50m26l93P78p49L98O55r31L87k8l10J002p53N5R81
3669H75j373M10K00j32M42k02J85J91q82M36k5n59R67k75n15Q16q07J97J49q10
3689g12Q47j12l63M02n38M4Q13n87L59k48M2N32p05J36L31p15O04K25p11P90k91
3710A43m19O33m93M9K05m36P24n03l26O67n06k92Q40q04O42j91j65N59o21K06
$$ plain form
3730 -88 502 -684 -173 367 -460 267 235 77 180 -2 174 402 195 478 -200 -153 508 -245 -232 564 -342
3751 -342 236 28 -193 209 -227 7 70 -638 413 190 -582 148 -118 -211 324 105 101 134 -208 447 136
3772 136 -89 759 -189 -280 414 -295 67 343 -419 73 86 -356 146 -461 52 -183 -535 674 -538 -409
3792 -409 283 -540 -261 163 -154 123 -254 -140 344 -172 28 251 -270 299 324 -198 431 -160 95 472
3812 472 -394 147 -127 -326 45 -108 75 401 -343 -17 275 -429 76 -20 -381 351 -37 216 348 -284
3832 -284 318 -88 -330 644 67 180 800 -417 169 188 -54 178 60 -206 166 -281 73 212 -189 228
3852 228 -483 -352 217 25 -139 -102 -438 84 -173 37 232 -19 -7 149 4 400 40 -149 313 -268 -85
3873 -85 477 -256 77 265 -338 298 -155 -348 270 -218 -39 129 -407 122 -56 -239 45 -244 -66 226
$$ packed form
3730h8N90j186N11N40q27P27l2j58J03j82J76K28k07K83o78M7O61p53J3P96r06
3751c42N78k08k21M02m36K34O3p08J051k23p72P30k66r3N35k19mL3l42O55l11
3772A36k25Q48r48r1O94p09L62K76p62M92J3m42N02o07N13k35l52J209j212J29
3792d09O92q23K79M24l17K77l77J14M84n16K00K23n21N69K5n22O29n91K55L77
3812D72q66N41k74j99L71j53J83L26p44L26K92p04N05r6l61P32l88K53J32o32
3832b84O02m06k42R74n77J13O20j217N86J9k42K32j18k66L72m47L54J39m01M17
3852B28p11J31N69j92j64L7l36N22k57K10J95k51J2J56j45L96l60j89M62n81J83
3873h5N62p33L33J88o03O36m53j93O18m88J79J68n36N29j78j83K84k89J78K92
$$ plain form
3893 226 -414 157 236 -241 611 211 -147 177 -340 53 62 -338 397 66 -99 452 -369 -15 165 -579 107
3914 107 -203 -330 100 -278 42 99 -410 -52 -55 -183 227 -463 -123 167 -196 -101 -52 31 171 43 -262 571
3936 571 -240 282 152 -272 329 117 -252 352 -96 8 -132 -686 272 -220 -723 210 -164 -252 231 -24
3956 -24 152 260 -343 463 93 -369 408 -143 418 243 -254 539 249 -369 405 -9 43 90 -308 187 -157
3977 -157 -412 550 -154 -29 263 -426 -404 128 -94 116 27 -45 40 100 235 -12 -149 416 -18 -48 349 25
3999 25 73 427 -128 369 -45 39 335 -526 27 285 -473 460 62 -570 214 -183 -413 83 -100 44 -168
4020 -168 -342 287 -273 -197 377 -165 10 680 -156 263 336 -255 404 199 371 199 -270 318 272 -227 511
4041 511 -74 -571 316 -312 -217 134 -300 395 -248 -575 465 -325 116 613 -671 313 123 -333 186 -139
$$ packed form
3893B26o40N71P9m77Q52m00l58L24n17L93Rm00P35l31j65N51q21L54J80p44O86
3914A07l10j27M30l78L20N7n09L58lj28M10o90L40K90l63R5M9Q3J40j28l05Q33
3936E71q11N22j30m24O01k12l69O04m48J04j40n54R58m92n03R33l74q8M83k55
3956b4J76J08o03Q06l70m62P77n51N61j75m97P93k90o18P74m14N2M7l98M95l44
3977a57k55R62p04J25K92o89K2N32k22K10q9p2Q5O0J35k47j37N65m34l0L97l24
3999B5M8L54n55M97m14Q4K96q61N53K58p58R33l98o32P84l97k30M96j83J44k12
4020a68j74O29n60P6N74n42J75O70q36M19P3n91O59k05J72j72m69N88m6m99P38
4041E11n85m97Q87o28R5L51m34O95o43l27J040p90M41M97j284R84j90m56N19l25
$$ plain form
4061 -139 158 139 -132 92 107 85 289 -110 138 484 -47 -147 -108 -418 110 -161 -150 33 -148 65 -299 -539
4083 -539 371 232 -138 329 -258 2 294 -134 227 117 -332 465 156 22 435 -404 263 163 -151 262
4103 262 -139 -131 423 -324 -298 76 -413 116 23 -426 119 -461 -16 9 -489 164 -18 -171 520 10 44 286
4125 286 -76 143 218 -364 461 394 59 632 -261 -101 -118 -264 153 -156 -82 507 -272 -190 -79 -419 -41 274
4147 274 -182 170 -104 -254 -129 -426 215 126 -191 484 -27 -70 480 -29 9 57 -176 288 78 -370 7
4168 7 -527 234 -131 -532 393 -217 -460 360 -131 -6 45 -152 240 -122 -174 284 -20 -17 369 -168 168 129
4190 129 -269 237 167 96 70 -130 171 -20 -178 465 -103 -104 436 -204 -390 329 -509 2 71 -24 -136 -243
4212 -243 5 141 -309 244 163 -234 469 16 -184 518 -29 -38 358 54 172 -98 -9 723 -299 -158 510
$$ packed form
4061a39K97j9k71K24J5k2K04l99K48L46n31j00L9l10N28k71J1J83j81K13l64k40
4083e39R10j39l70M67n87K60K92m28L61j10m49P97l09j34M13q39O67j00l14M13
4103B62m01QN54p47K6L74m89N29r3m49N45n80M45K5m98O53j82j53O91n10L4K42
4125B86l62K19P5n82Q25o7l35N73q93J60j7j46M17l09P4N89p79Q2J11l40L78L15
4147B74m56L52k74j50J25k97O41q9l17O75n11m3N50n09L8M8k33M64k10m48L77
4168Gn34P61l65m01R25o10k43Q20m91J25N1j97L92l62n2M58l04LL86n37L36l9
4190A29l98N06p0p1k6k00L01j91j58O43n68jN40o40j86P19q38N11O9r5j12j07
4212b43K48J36m50N53q1l97P03m53k00P02n47rL96l04J18k70Q9P32j022J41O68
$$ plain form
4233 510 -609 99 140 -130 189 -201 -36 -83 -311 198 141 -296 409 -289 -297 531 -203 9 269 -25 188
4254 188 -50 91 181 -132 358 291 -249 410 101 -439 420 -115 -245 312 -233 117 -64 -314 5 -499 -156
4275 -156 264 -425 74 133 -341 208 81 22 223 -81 -10 381 -337 308 99 -164 232 -142 -51 378 -224
4296 -224 143 74 -186 145 -274 -207 -31 -339 -128 160 -569 108 -317 -88 353 99 -150 121 -208 286 191
4317 191 -37 603 -115 117 124 -106 188 140 38 244 -298 -188 120 -136 263 216 -237 51 -90 -171 118 -370
4339 -370 152 -38 -298 269 -205 -252 170 -184 -68 106 -216 162 24 36 337 -45 37 168 -188 376 163
4360 163 -408 37 -208 -148 460 -413 102 -102 -30 332 -259 -264 294 -78 -154 201 -163 59 -45 -162 340 -18
4382 -18 94 235 -214 398 223 68 364 -37 136 419 -54 -204 -10 -232 -15 134 -275 193 -422 -21
$$ packed form
4233E10j119P08M1k70L19l90J65m7k28N09n7m37P05o98qQ28p34K12K60k94K13
4254A88k38J41R0l13M90o7n40O59l09n40Q59n35j30N57n45L50j81k50L19n04L43
4275a56M20o89M99N9m74N49j27n9K01l04P1L91p18O45k09k63L96l74R1M29o02
4296b24L67o9k60L31m19O7J76l08K11K88p29O77m25K29M41k54k49K71l29M94r5
4317A91k28O40p18K32Pk30K94m8j02K06n42J10L08k56L99m7m53K88j41q1K89m88
4339c70N22j90k60N67m74m7M22l54J16J74l22L78j38J2L01l82Q2J31l56N64k13
4360A63n71M45k45O0O08q73N15k04P2L62n91nN58l72p6L55l64K22j04j17N02l58
4382a8J12J41m49O12j75j55K96m01J73K83m73j50J94k22K17J49m09M68o15M01
$$ plain form
4402 -21 -124 -672 172 -13 -121 161 -439 -74 281 -360 226 44 3 425 -107 256 379 -248 102 237 -271
4423 -271 303 -34 5 201 -343 2 -59 -287 -84 -152 -389 -8 -60 15 398 -443 -13 30 -121 126 -26 -80
4445 -80 333 -88 207 151 -224 82 -38 -82 314 24 -105 193 -275 14 -115 -266 65 -455 -94 160 -394
4466 -394 -47 -204 -51 -48 -400 18 206 -232 267 255 -136 126 140 34 371 239 -110 190 116 313 -42 1
4488 1 512 -165 -324 160 -416 -33 -100 -251 93 -52 -25 45 -458 331 -125 -168 18 -271 190 390 -359 39
4510 39 66 -311 295 267 52 114 -211 3 302 -419 238 -308 -293 -46 -456 -213 126 -347 -36 -118 -375 12
4532 12 -103 69 149 -161 -65 -191 -327 22 174 298 153 -175 297 356 -588 151 88 -178 119 -207 92 88
4554 88 -417 112 -144 -333 35 -266 -24 73 -340 280 320 -267 -28 -25 -352 18 -71 223 -15 -53 164 -45
$$ packed form
4402b1j03n48Q44j85j08K82o00L65L55o41N86j82m1M22n32L63J23o27L50J35n08
4423b71N74l37L9J96n44L45o1k28K03o8k37L81n2P5L83q41M30M3j51K47j52n4
4445h0M13m21K95n6l75L06j20m4L96k90j29K98m68K89j29j51L31n20L61K54n54
4466c94L47j57J53Ll52M18J88m38M99j2l91K62J4j06L37j32l49L00p4J97l55M3
4488AN11o77j59M84n76L83o7j51L44j45K7P0n03P89m56m3J86k89M61K00p49L98
4510C9K7l77O06k8k15O2l25K14K99p21O57n46J5K47m10K43L39m73L11q2k57L87
4532A2j15J72Q0l10R6j26j36L49J52J24j45l28M72N9r44P39o3k66K97l26K99m
4554H8n05N29k56j89L68l01K42R7m13O20M0n87K39Ll27L70q9K94k38l8K17k09
$$ plain form
4576 -45 -14 339 -31 51 457 -42 0 -255 26 231 -53 586 -49 -327 33 -293 -309 224 236 -160 -40 43
4598 43 -379 -175 -137 261 -218 -48 217 -152 116 92 -150 8 399 -97 -90 81 106 132 -423 342 -116 -546
4620 -546 206 -263 127 -67 -15 -13 -203 -402 -180 -472 -163 214 20 66 101 -359 -4 74 -20 384 195 235 -6
4643 -6 -441 222 146 -68 64 248 -299 148 31 73 -120 -250 165 -236 -170 230 -426 -49 217 67 -31 266
4665 266 -123 -80 -124 335 89 -365 109 45 -219 196 247 -74 200 252 -77 -199 96 61 -320 30 499 -289
4687 -289 12 52 -541 -67 158 -134 37 62 -159 -190 -192 342 -80 -212 252 -202 -233 442 -3 47 -13 13 362
4710 362 -178 234 34 -102 42 10 -151 55 -118 -372 252 -15 -105 44 -63 28 -207 80 137 -230 -2
4731 -2 352 -274 138 123 -362 216 330 -107 220 -83 310 100 10 459 -210 -163 104 -520 24 -47 24 202
$$ packed form
4576d5L1L53l70Q2M06m99M2k55K81K05k84O39o35k78L60l26j6N33J2l96J20Q3
4598D3m22K04L8L98m79J70K65l69K68k4k42J58L91m96PJ71K5K6n55P65m58m30
4620e46P52m69L90j94N2Kj90j99K22k92L09L77j94M6L5m60L55P8r4M04j89M0k41
4643fm35O63p6k14J32J84n47M47j17M2j93j30M15m01O6M00o56L77K66j50r8K97
4665B66l89M3m4M59k46m54M74o4k64M15N1l21K74N2l29j22K95l5l81L50M69p88
4687b89L01M0n93M74K25k92J71K5k21l1kN34m22j32M64m54l1O75m45N0o0K6L49
4710C62n40M12k00j36J44l2j61K06j73k54O24k67r0J49j07R1k35K87N7l67K28
4731bL54o26M12j5m85N78J14m37L27l03L93k10r0M49o69M7K67o24N44p1P1J78
$$ plain form
4753 202 -81 -348 -39 -9 -69 -147 -269 90 -88 -348 311 97 68 305 -259 12 -96 -36 174 -76 -101 149
4775 149 -65 278 122 39 166 134 -210 125 -124 -135 -8 -212 -133 -224 -305 98 3 -45 55 -195 -66 22 -43
4798 -43 184 47 -33 65 -3 195 115 -20 156 54 -56 169 -370 141 218 -102 -3 48 -7 89 -26 -28 44 -94
4822 -94 30 78 -276 58 -306 79 108 -287 -26 -23 -269 241 -50 -159 114 -18 265 144 103 276 60 -166
4844 -166 67 -323 -268 65 -159 16 -52 -255 351 -172 -195 -140 -345 219 -117 -207 250 78 -224 109 17 -239
4866 -239 -18 192 193 -111 -107 72 -157 -160 71 -26 187 -29 -38 51 -138 5 166 -134 190 -27 -301 194 -46
4889 -46 -268 56 -224 77 319 -102 54 -7 -24 408 -75 -43 166 -147 399 84 -161 308 -1 -143 99
4910 99 -240 -208 -160 -192 360 -140 -283 207 -365 -119 341 -231 -5 -188 -137 30 -155 27 34 -229 182 198 -94
$$ packed form
4753B02k83k67L09L0o0p8j22L59j78k60O59k14k9K37n64K71j08O0K10k50k5K50
4775A49k14L43j56q3J27l2l44L35k49j1J27k04P9r1q1M03r5m8J00k50J29Q8o5
4798d3K27j37q0R8o8J98q0j35J76j02j10K25n39N11P7l20R9N1n5R6j15kP2j38
4822i4J24M8l54L34l64L85K9l95K61Lk46N10k91j09K73j32K83j21m1J73k16k26
4844a66K33l90N5L33k24J75o8k03O06n23k3N5k05N64l36r0M57j72l02L33r2k56
4866b39K21K10Jl04MJ79k29lK31r7K13k16rQ9j89J43J61l00L24k17k74M95k40
4889d6k22L24k80L01K42m21J56o1j7M32m83L2K09l13N46l15k45M69l09j42K42
4910I9l39L2M8l2N52n00j43M90n72K46M60n72K26j83N1J67j85J82Pk63M11J6k92
$$ plain form
4933 -94 253 48 -17 -162 -81 260 -141 -127 90 89 -262 75 -207 -126 256 -292 191 53 -32 69 -213 47 -150
4956 -150 -203 173 63 71 119 251 38 278 -202 344 44 187 422 -178 33 235 -206 35 314 -310 155
4977 155 -88 -38 -35 -182 -32 58 -197 236 -127 -222 301 -320 -306 220 -185 -190 -16 -113 136 145 336 27 -88 369
5001 369 117 -182 315 -268 -433 281 -71 54 110 -285 -23 79 -181 174 -379 -356 223 -62 7 175 -46
5022 -46 213 -1 36 -43 -46 366 79 -150 448 66 -41 213 -58 252 86 -468 -123 -271 161 256 -318 -56
5044 -56 297 -449 -290 160 -206 122 -11 -44 -125 44 62 118 -134 122 -62 -131 242 -44 122 380 31 16
5066 16 114 -8 -194 -129 264 146 -315 140 -117 -180 174 82 -294 -33 -53 33 -143 -135 128 -157 -308 416 -194
5089 -194 -249 235 -424 227 46 150 132 54 -221 -106 -282 282 43 -111 342 -130 -161 210 -256 -195 88 -302
$$ packed form
4933i4L47k05o5j45Q1L41m01J4K17jl51L37k82Q1L82n48M83j38q5J01k82K60j97
4956a50n3L76j10QM8J32k13K40m80N46l00J43K35o00K11K02m41K41K79o24M65
4977A55k43N0Lj47J50R0k55M33l63r5N23o21J4N26m05nJ74r7K49RJ91l09j15M57
5001C69k52k99M97n83j65P14l52J25N6l95K62J02k60L55n53K3N79k85O9J68k21
5022d6K59k14L7p9lM12k87k29N98l82j07K54k71L10j66n54L45j48M32R5n74K62
5044e6L53p46J59M50l66L28j33l3q1J69J8N6k52K56j84o9L73k86J66K58l49j5
5066A6R8j22j86O5L93j18m61M55k57o3L54r2l76K61k0Q6j76QK63k85j51P24o10
5089a94n5M84o59O51j81J04j8p8k75J15j76N64k39j54M53m72l1L71m66O1K83l90
$$ plain form
5111 -302 88 -141 -50 -15 -400 129 253 -171 103 -10 -170 250 52 -41 -129 -36 148 -197 -86 329 -61 231
5133 231 591 -64 -82 3 -52 164 88 25 -81 -431 -154 42 -260 292 -95 -118 76 -16 -145 -104 -5 115 124 -16
5157 -16 574 -145 209 327 -27 45 112 -125 -152 -218 -33 -148 -250 44 -232 -132 394 -262 -377 373 -256 -151
5179 -151 175 39 95 -7 228 230 -46 79 143 -166 220 102 -143 -89 184 131 -71 176 307 -97 -360 172
5201 172 -305 -40 201 -317 -73 -79 -522 156 62 -26 -399 -304 102 78 -513 484 154 -164 606 179 -323 302
5223 302 -71 368 -2 5 347 333 312 319 -130 253 -175 -415 270 312 403 -30 106 -50 182 -15 -2 92 -278
5246 -278 87 -56 491 -69 -226 297 -5 -27 429 234 -70 142 -27 62 -67 -237 276 298 -146 -10 -255
5267 -255 -69 26 -342 28 -45 -411 56 45 -23 -87 -129 43 48 -245 239 -23 170 161 -105 71 260 333 -134 93
$$ packed form
5111c02L90k29R1L5l85N29J24m24K74j13j60M20j98r3q8R3J84l45J11M15l90K92
5133B31L60o55j8Q5n5K16p6o3j06l50K77J96l02N52l87k3J94r2j29M1R9J20Rj40
5157a6N90p19L54J18l54P2O7k37k7o6J85j15j02K94k76J00N26o56j15P50o29J05
5179a51L26j36N6j02K35Kk76J25O4l09L86j18k45N4K73n3k02K47J31m04k63N32
5201A72m77K65K41n18K44om43O78r4q8l73R5M06k4n91R97l30l18P70m27n02O25
5223C02l73M39l70PL42j4k1Pm49L83m28k40O85M2R1m33J36j56K32j97J3R4l70
5246b78L65j43N47n60j57N23l02k2M56j95l04K12j69Q9j29j70N13K2m44J36k45
5267b55J86R5l68L70p3l66M67j1o8o4m2J72Nk93M84k62J93rk66J76J89P3m67K27
$$ plain form
5291 93 9 98 -136 11 227 -296 -125 143 -94 44 159 -55 17 -1 219 6 -143 374 -177 -2 378 -196
5313 -196 233 229 -139 396 21 -56 196 -76 34 63 136 167 -39 -145 293 -255 225 184 -150 108 -227 -342
5335 -342 164 -177 87 157 -310 78 -169 4 90 33 104 267 -24 -58 124 -107 402 37 56 294 -319 210
5357 210 212 -43 186 24 -328 116 -80 46 14 10 -192 -7 -311 -340 173 18 -37 -208 -91 -72 -738 -234 -179
5380 -179 763 -215 -106 141 -564 -103 413 -87 -283 131 -306 235 222 -149 438 -96 168 220 -435 247 5
5401 5 -661 146 317 -305 -463 464 530 197 -147 -570 -578 -90 -228 85 229 317 -798 -72 -62 7 -93 -65 -342
5424 -342 292 233 -336 191 -316 62 -125 -497 144 -52 -140 121 -169 -59 24 -198 -14 -14 148 119 -75 -49
5446 -49 185 -16 148 321 -140 51 -24 20 -9 -391 -176 89 -182 231 -27 -53 324 76 157 57 -177 118
$$ packed form
5291I3q4Q9k34J47K16n23J71K68k37J38J15k14P2j8K20k13j49N17n51J75L80n74
5313a96M29ml68N35l75p7K52k72J10K9P3L1k06j06M38n48M80m1l34K58l35j15
5335c42N06l41K64P0m67L88k47J73Q6n7P1J63k91l4J82k31N09l65J9K38o13N29
5357B10Kk55K29j62l52M44j96J26l2mk02J85l04k9N13j55n5j71J17J9o66N04N5
5380a79R42r78J09K47p05M61N16n00j96M14m37N41j3l71N87n34K64N2o55O82k42
5401Eo66Q07J71o22j58R27O6l33l44m23qM88j38L13J44Q8j115P26J0O9j00K8k77
5424c42O34n9n69N27n07L78j87l72O41j96q8K61k90J10Q3k22J84%J62k9j94K6
5446d9K34k01J64J73m61J91p5M4k9l82K15K65k71M13k58k6L77k48Q1j00k34K95
$$ plain form
5468 118 -128 -16 47 -58 153 3 -164 106 61 3 -47 66 -20 235 94 173 77 -182 67 -253 -134 64
5490 64 -45 49 121 17 -11 -195 124 19 -51 -73 78 -76 -115 -196 -59 95 -178 121 17 30 127 218 -55 199
5514 199 127 -273 206 -5 -88 -42 -286 -11 -42 -141 -44 40 357 204 -215 153 -19 -218 309 -109 -173 148 -117
5537 -117 11 -168 -146 198 -234 62 271 -45 -86 0 -104 169 148 45 -24 -197 -109 17 -113 335 25 -438
5559 -438 157 -292 -125 278 -56 -20 -377 175 230 -270 407 930 114 515 166 -654 316 -9 -129 -109 87
5580 87 70 159 -187 249 -135 -121 436 -71 -106 -1 -198 -140 33 -91 85 -160 191 -246 -22 133 -81 -153
5602 -153 36 -74 -172 102 190 152 -36 -53 300 165 178 365 -310 -111 176 -286 -111 121 -217 144 -238 73
5624 73 -42 -51 56 7 -171 96 -227 84 400 -131 -358 117 -47 -74 396 108 122 -253 340 238 -294 320
$$ packed form
5468A18k46J12O3j05K11j50j67K70m5n8n0J13q6K55j41P9r6k59K49l20J19J98
5490F4j09R4P2j04k8j84L19j05p0k2J51j54l9q1J37J54k73K99j04J3R7R1k73K54
5514A99p2m00M79k11q3M6k44K75l1r9R7Q4L17j53m19L68j72j99N27m18o4L21k65
5537a17J28j79K2L44m32K96K09l16m1Q6j04K73k1j03o9j73Q8J26j30M48l10m63
5559d38N95m49J67M03l34L6l57N52N5n00O77N23q16M01l49q20R70l25j20K0J96
5580H7j7Q9l46M36l84J4N57n07l5J05j97N8J73j24J76k45L51m37K24J55k14p2
5602a53J89j10r8K74Q8l8j88j7L53j35J3J87o75J99K87m62J75K32l38L61l82L11
5624G3j15rJ07m9j78K67l23L11L16n31k27M75j64k7M70k88J4l75N93j02n32O14
$$ plain form
5646 320 217 -320 396 139 -31 218 -15 129 -219 103 309 -360 -182 118 -235 -102 198 75 -8 62 -78
5667 -78 130 124 254 85 -302 380 -139 -40 256 -21 -178 126 170 -222 77 54 -177 -380 -32 202 -314 -191
5689 -191 39 -357 -65 88 -293 -84 41 -15 -169 -99 312 -83 88 337 -400 -96 60 -161 67 179 46
5710 46 32 -58 -138 -78 -375 184 -91 -287 -224 -235 -40 113 -42 -140 -141 32 241 -302 81 311 -247 112 196 -184
5734 -184 28 170 -54 154 121 113 44 -405 209 2 -160 25 -98 36 115 -226 -184 -151 -71 181 -93 79 383
5757 383 -328 -170 -36 -4 143 -2 51 -89 15 -168 99 -76 51 150 -235 114 -94 55 10 -121 28
5778 28 172 -67 40 -7 -55 73 -26 28 254 -432 -48 -194 -42 302 66 -11 231 -97 40 -117 62 -5
5800 -5 -62 69 35 -62 58 54 67 210 197 -113 136 -288 -240 3 -248 115 -87 -140 31 -27 199 9 -52 -109 32
$$ packed form
5646C20j03n37P16k57j70K49k33J44l48L22K06o69J78L00l53J33L00j23q3P0j40
5667g8K08oJ30j69l87O82n19R9K96k77j57L04M4l92K99k3k31k03L48K34n16J23
5689a91K30l96K92J53l81K09J25n6j54P0M11l95J71K49p37L04J56k21K28J12j33
5710D6j4r0q0O0k97N59k75j96O3j1J95J53j55r8jJ73K09n43L83K30n58L59Q4l80
5734a84K12J42k24K08l3qo9m49O14k07j62J85j23J34P9l41M2L3Q0K52k74J72L04
5757C83p11J58J34L2J47j45N3j40J04j83K67j75J27R9l85L49k08J49m5j31J49
5778B8J44k39J07m7m8J28r9N4K26o86L84j46J52L44k36p7K42l28J37j57J79o7
5800en7J31l4r7J20mJ3J43j3l10K49m24M8K43k51L63k02n3J71n8K26j90o1n7J41
$$ plain form
5825 32 98 -77 -145 -121 117 -37 168 101 33 171 -52 19 77 -222 -207 297 14 78 -116 -76 20 -324 -3 -109
5849 -109 -178 -74 35 -24 -101 -103 21 39 89 82 -91 -74 60 -7 -48 264 -357 152 109 -77 231 -73 -158 302 -162
5874 -162 39 103 -361 38 -92 -73 201 -119 1 -33 -214 26 -92 -127 -82 -39 -249 146 -90 258 95 20
5896 20 164 64 112 281 83 66 31 -224 196 60 24 198 -321 -187 80 -146 87 68 -145 -40 35 225
5918 225 90 -214 -129 -151 -90 78 134 -146 215 138 201 51 -30 209 199 191 -27 -113 -48 49 -131 -174 -144 -35 147
5943 147 -100 56 24 -139 138 123 -215 222 -158 185 62 6 279 254 80 -28 -52 123 239 -155 52 181
5965 181 108 42 3 -200 43 -24 76 -57 -202 -146 -90 -38 191 22 -168 -155 96 144 -117 -254 45 -176 25
5988 25 115 192 432 -138 247 -92 201 428 -21 -421 171 425 -31 137 114 -49 23 0 -112 172 -283 96
$$ packed form
5825C2O6j75o8K4K38j54K05o7o8J38k23P1N8k99J5N04k83O4j94M0R6l44L21j06
5849a09o9J04J09n9p7kJ24J8N0pj73J7J34o7m1L12o21N09m3j86L08l04q5M60m64
5874a62K01O4m64L99j30J9K74l20J20l4j81K40j18l5M5M3k10L95k36L48j63p5
5896B0J44j00M8J69j98j7l5k55M20j36l6J74n19J34K67k26K33j9k13J05P5J90
5918B25j35l04Q5k2O1J68N6k80L61p7O3j50q1K39j0qk18q6O5R7j80m3L0J09J82
5943A47k47J56l2j63K77j5l38M37l80L43j23n6K73k5j74j08k4J75J16l94K07J29
5965A81p3o6l9k03K43o7J00j33j45N6N6N2K29j69j90J3K51M8k61j37K99k21K01
5988B5R0P7K40n70L85l39K93K27m49m00N92K54m56J68k3j63P2k3j12K84m55L79
$$ plain form
6010 96 -146 5 -168 -106 -90 107 -171 -76 -270 -484 -18 -106 -23 -172 -27 -130 1188 82 119 -76 48 454
6032 454 -397 -112 -56 41 204 -66 -144 76 -121 123 -45 25 -133 -52 -161 -71 4 -3 4 -159 174 -56 -129 -20
6056 -20 -112 81 -8 167 -120 41 -193 103 35 -317 118 108 -31 54 -27 -85 149 -131 -135 93 -374 52 -345
6079 -345 -43 -1 -131 35 -205 -130 165 1 141 649 -128 110 -30 -172 236 117 62 10 -84 212 131 -279
6101 -279 226 -239 -294 126 111 -109 96 70 157 -201 -281 303 -114 171 328 -307 202 181 -140 69 -153 270
6123 270 18 -144 157 270 -129 59 127 -147 210 -86 -278 -51 -4 -150 -120 133 -103 -262 5 1 -399 -29
6145 -29 -111 -221 109 229 -11 222 -112 -215 19 102 176 -139 242 284 -221 -291 221 -30 -17 105 190 -58 -291
6168 -291 71 -56 -15 120 78 -263 -32 -42 -179 -257 -154 14 88 13 -64 58 53 112 45 -135 -24 4 71 7 79
$$ packed form
6010I6k42J51j73O2J6J97k78R5j94k14M66q8Q3j49J45j03J318j106L7j95J24M06
6032D54q51K85N6R7J63k70p8K20j97K44j68P0j58Q1j09R0P5pPj63L33k30p3J09
6056b0r2J93q9J75k87J61k34K96o8l52M35j0j39Q5q1n8K34k80mK28m67M26l97
6079c45L02M2j30J66k40P5K95j64J40N08p77K38j40j42M08j19n5n2r4K96q1m10
6101b79N05m65n5M20j5k20K05k6Q7l58q0N84m17K85J57o35N09k1l21K09k22M23
6123B70k52j62L01J13l99J88O8k74L57k96j92K27M7j46L0K53k36j59K67mm00L70
6145b9q2j10L30J20k40K33l34j03K34Q3P4l15L81M2n05p0N12k51J3J22Q5k48k33
6168b91L62j27M1J35m2l41K31j0j37p8J03J68P4p5p7J22nN9o7j80J11K8O7o4P2
$$ plain form
6193 79 -35 89 260 -95 -272 14 42 -74 195 88 -75 137 -259 -31 115 41 178 -39 -190 11 -147
6214 -147 7 151 -75 69 290 298 208 53 114 -108 212 25 6 -126 -127 -148 -6 -55 -203 33 -1 -200 74
6237 74 71 -219 -77 -197 -94 23 -79 147 -135 -144 27 -42 102 155 -152 -60 17 69 291 -44 165 53 122 -8
6261 -8 -65 42 243 -76 -30 -200 -262 52 -17 -91 355 -99 -299 226 -159 -138 86 -17 -36 89 142 93 -30 -62
6285 -62 339 -20 -26 -47 -272 314 248 -121 425 17 140 96 -265 -28 28 -25 401 -261 -111 118 18 11 20 -162
6309 -162 261 -210 14 63 -66 60 -56 -49 -81 174 128 88 -53 49 90 -43 211 36 -95 493 -130 -71 -284
6332 -284 -251 -36 -208 -206 -24 -199 -213 -5 62 75 18 219 -78 -166 -129 105 -183 208 75 -82 59 -9 -51 217
6356 217 -45 -171 236 53 -67 48 -266 76 -305 -173 45 -121 144 -31 33 65 -45 -155 -232 -199 -75
$$ packed form
6193G9j14J24J71l55j77K86K8j16K69j07j63K12l96K28J46p4J37k17j51K01j58
6214a47J54J44k26J44K21Qr0j55O1k22L20j87j9j32jk1J42m9j48K36l4j99K74
6237G4lk90J42j20J03J17j02K26k82rJ71o9J44N3l07R2P7N2K22l35K09j12O9j30
6261hn7J07K01l19M6j70o2L14o9p4M46m54k00N25l85K1K24j03j9J25N3m9j23l2
6285f2M01l59ok1k25N86o6l69N46m08J23m4l61K37N6n3M26o62J50K29j00pRj82
6309a62M23m71K24M9j29J26j16Pl2K55m6m0j41J02M1j33K54j75j31N88o23N9k13
6332b84L3K15j72KJ82j75j4K08O7J3n7K01k97q8L7K34k88L91j33j57J41o8m2K68
6356B17k62j26M07j83j20J15l14L42l81J32K18j66K65j75O4L2j10j10p7L3J24
$$ plain form
6377 -75 -90 -107 211 2 39 169 227 141 36 -165 -129 -39 57 130 -238 112 153 -32 72 78 155 89 -348 -56 159
6402 159 -86 96 -137 -159 179 -144 59 99 -42 249 79 210 12 -113 -14 108 -51 177 -120 25 84
6423 84 18 -21 109 13 23 166 -190 208 -142 -27 67 -24 -214 -20 -135 90 -86 -41 -42 80 31 81 -26 43
6447 43 224 -29 233 99 -39 94 -13 78 2 108 203 -21 40 25 157 -21 21 -229 -37 475 -104 134
6469 134 -73 163 -218 78 -117 -137 -41 54 110 46 57 -13 154 76 -9 -7 -22 65 11 57 76 23 -193 -61 156 -329
6495 -329 -34 -184 2 276 23 57 -304 97 226 19 207 252 -135 -51 110 22 279 -29 -44 -52 147 -52
6517 -52 150 37 -10 0 9 379 -138 163 67 -265 121 -1 -297 211 56 32 26 -35 180 80 73 332 82 -24
6541 -24 15 -211 -190 29 -61 101 -76 -129 -25 -180 67 -164 13 -259 -97 -261 80 -159 -81 -13 -94 27 201
$$ packed form
6377g5j5j7L18k09L7J30N8q6j05k01L6R0R6P3l68L50M1j85J04OP7o6m37K92K15
6402A59k45J82k33k2L38l23K03M0j41K91j70J31j98j25R9J22j59K28k97J45N9
6423H4o6l9J30r6J0J43l56L98l50J15R4r1j90J94j15K25j76M5jJ22m9N0j07O9
6447D3J81k53K62j34j38J33j07R1p6J06R5k24O1j5J32j78M2k50J92N12n79K38
6469A34k07K36l81K96j95k0R6R5N6o4J1p0J67p8q5Kj5Q7n4M6J9n3k16J32K17m85
6495c29K95j50J86K74k53L4l61M01J29k07J88M5l87Q4J61q8K57l08j5qJ99j99
6517e2K02j13m7J0RL70n17L01r6l32L86j22k96N08j55k4oo1K15j00pK59k50j06
6541b4L9k26K1K19r0J62j77n3J04j55K47k31J77k72J62j64L41k39P8O8q1J21J74
$$ plain form
6564 201 -40 124 -49 -219 -114 265 175 -294 -113 271 154 21 19 -39 514 -75 -25 -236 -275 56 130 -101
6586 -101 -265 -26 -113 -237 -95 -159 -48 63 -41 278 -69 222 48 -135 257 224 -163 -257 -207 175 192 19
6608 19 20 173 322 224 167 -21 209 -228 9 -9 -152 168 -138 -157 141 -153 -160 -67 41 227 0 60 124 -152
6632 -152 161 200 -66 176 43 -97 253 -33 77 55 69 148 -154 223 118 89 -99 125 28 -235 115 -69
6654 -69 -103 -43 -165 100 -17 5 101 -163 -183 -271 121 121 -7 -61 200 -99 -20 250 -166 134 -48 -178 115 -18
6678 -18 354 170 -14 105 -98 -103 118 -4 -187 -116 -18 -3 71 -281 190 -12 2 -8 -164 20 71 -115 283
6701 283 33 297 287 -38 183 62 178 216 -51 44 43 -192 135 -205 -110 -82 241 -64 -19 43 -132 -94 -115 37
6725 37 -79 -137 80 -44 16 127 -199 -285 44 -173 55 88 -117 352 -60 72 359 -133 63 -88 -100 103
$$ packed form
6564B01k41J64j73j70J05L79r0m69J81L84j17j33kn8N53n89N0k11l9L31P4k31
6586a01j64K39q7j24J42o4J11J11j04L19l47K91j74j83L92l3l87r4N0L82J7j73
6608A9JJ53J49r8n7j88K30m37K37j8j43L20l06j9K98k94pR3J08J86k27O0O4k76
6632a52L13L9k66K42j33j40L50k86J10k2J4P9l02L77j05k9j88K24r7k63L50j84
6654f9l4O0j22K65j17K2R6k64k0q8L92%j28n4K61k99P9K70m16L00j82j30K93j33
6678a8L72j84j84J19k03nK21j22j83P1R8J5P4l52M71k02J4j0j56J84N1j86L98
6701B83k50K64j0l25K21j21J16L8k67R5jk35L27l40R5K8L23l05M5O2j75L8k1J52
6725C7j16n8K17j24O0J11l26q6L29k17K28L3k05M69m12J32K87m92J96j51j2K03
$$ plain form
6747 103 48 -62 -106 28 -66 153 -30 180 -268 83 90 -33 83 211 -222 106 -31 202 66 -77 391 62
6769 62 -12 147 -189 -214 212 -52 194 -15 -105 -318 6 -106 51 -246 -57 -10 -86 -75 -72 3 89 -174 -39 114
6793 114 103 94 24 -88 124 91 22 218 -28 -61 173 -95 210 54 -132 -93 -77 173 82 -322 -37 -209 -226 65
6817 65 -136 19 116 -74 -67 127 -73 139 -90 -107 38 -45 99 -66 -42 -64 201 54 91 -125 -74 52 -153
6840 -153 26 -7 -169 -163 51 -47 137 76 174 -6 -101 -19 -97 -144 -76 -84 135 -40 -4 72 -70 -230 44 95 -148
6865 -148 62 135 28 17 -106 -38 -26 -130 1 -219 -13 -165 -143 -73 -79 -66 225 -84 -48 58 -259 110 -48
6888 -48 -155 51 47 13 -140 41 63 -70 -173 130 -115 -53 277 -24 -134 30 117 -64 -178 -150 -42 -28 5
6911 5 -14 -120 1 -32 -175 39 -301 -255 113 -135 -12 42 -1 358 93 11 148 271 303 -52 -86 -135 -107 -166
$$ packed form
6747A03n5j10m4J34r4K19j83K10m48L51Pj23J16J28m33L28j37K33j36j43M68l29
6769F2p4J59l36k5M26k64K46k09r0k13L24j12J57k97J89M7p6J1LP5Q6k63J35J53
6793A14j1rp0j12K12l3o9J96k46l3K34k68L05j56j86L9J6K50r1m04K85j72j7K91
6817F5k01J55R7j90PJ94k00K12k29j7J45q3J44j65K4k2K65j47L7k16N1J26k05
6840a53J79l3j62OK14r8J84o1R8j80r5Q2p8m7O8qK19j75L6P6j42j60K74N1k43
6865a48K10P3j07j1j23O8J2j04J31k20K06j52K2P0oJ3K91l09L6J06l17L69j58
6888d8j07K06ml4j53J81K2j33j03L03k45O2L30l01j10J64Q7j81j14K8J08J4L3
6911Ej9j06J21l3j43K14l40M6L68k48J23N4m3L59k65q2J37J23L2l55l4m9K8n9
$$ plain form
6935 -166 163 -14 283 -201 -82 324 199 -77 -19 -168 -153 -244 -13 -118 189 -17 -134 -89 -309 247 -58
6956 -58 304 -47 -36 -19 -41 108 -47 155 -70 42 -116 0 -150 -58 -31 171 -227 133 -310 -119 -30 -13 267
6979 267 -62 40 -43 -136 -138 94 109 64 30 166 47 -9 92 181 -117 141 -117 -20 1 45 -105 276 114 25
7003 25 -248 -134 12 -129 -88 206 -397 -76 -156 -153 249 -201 65 112 -27 19 29 7 107 15 123 252 -281
7026 -281 98 62 -116 40 82 94 90 224 46 -251 103 -98 -288 -17 121 -260 105 287 150 -68 120 -128
7048 -128 246 -116 -97 206 -45 299 142 92 168 -74 116 148 68 36 -28 -195 71 -211 -21 50 -202 -11 -13
7071 -13 -120 -127 89 -39 262 94 -24 110 -202 94 -88 -230 -52 138 31 269 -40 179 13 -49 53
7092 53 -38 -217 129 -101 126 8 -13 220 204 -93 86 6 -160 -122 -88 161 -58 -87 -196 -159 194 80 -102
$$ packed form
6935a66L29j77K97m84J19M06j25k76N8j49J5r1K31j05L07k06j17M5k20N56l05
6956e8L62l51J1J7k2J49j55K02k25J12j58J16j50R2K7K02l98L60m43J91Q9J7K80
6979B67l29J02q3r3kK32J5m5l4J36j19n6J01Q9k98K58k58R7K1M4j50L81j62q9
7003B5k73J14J46j41M1K94o03L21q0LM02m50K66M7j39M6J0k2J00r2J08J29n33
7026b81L79l6j78J56M2J2mJ34j78k97L54k01j90K71J38l81L65J82j37k18J88k48
7048a28L74l62J9L03k51L44j57n0P6k42J90L2q0l2o4j67K66k82J90P1k52J91k
7071a3j07pK16j28L01j68j18J34l12K96j82j42J78J90j07K38l09K19j66o2J02
7092E3r1j79L46k30K27j18k1K33j6k97J79q0j66L8L4K49k19k9j09L7L53j14j82
$$ plain form
7115 -102 114 -160 -127 -63 -112 -20 200 75 104 272 6 63 -159 -262 143 -37 106 224 -76 -287 211 -485
7137 -485 252 -79 -131 -214 3 -59 -6 155 8 0 142 208 321 -62 -47 37 -224 -129 -144 16 -194 40 110 -101
7161 -101 -341 172 36 100 -156 -6 267 -152 -120 27 -236 224 65 -166 185 -449 -213 -256 -3 148 -48
7182 -48 -129 323 -168 50 140 -53 -160 -140 0 38 19 15 163 10 377 120 40 68 -59 -98 6 -105 -71 88
7206 88 -51 -112 -209 206 -117 -36 79 228 189 162 89 -12 38 -54 -13 -144 34 7 7 -91 40 46 -226 -67 -117 124
7232 124 -108 -175 -39 -25 -33 -13 -53 -171 -1 -61 53 -71 10 258 21 70 57 -130 58 -29 -6 92 118 82 189
7257 189 71 -143 97 -174 -84 -243 -105 176 -327 75 -139 -142 40 -304 -119 -51 -120 -97 109 -46 13 -29 3
7280 3 196 -81 75 158 31 68 -72 101 67 46 160 139 -30 135 50 -86 76 -181 -118 -112 94 -135 86 -105
$$ packed form
7115a02K16k74L3O4m9R2K20j25K9J68k66N7k22j03M05j80J43J18l00k11M98o96
7137d85P37l31n2q3K17o2N3J61j47qJ42O6J13l83J5Q4k61R5j5J60k10K34P0k11
7161a01k40N13j36O4k56J50K73m19L2J47k63M60j59k31L51o34K36m3K53J51j96
7182d8q1M52m91K18R0j93j07K0J40L8j9mJ48j53L67k57q0K8j27l9J04j11L4J59
7206H8j39o1r7M15l23Q1J15J49l9k7p3j01N0r2M1j31J78k7%r8J31Ok72J59n0K41
7232A24k32o7J36J4qK0m0j18J70o0J14j24Q1K48k37M9j3j87J88q7K3R8K6l6J07
7257A89j18k14K40k71R0j59J38K81n03M02k14lJ82l44J85O8o9K3K06j55N9m2L2
7280CJ93k77J56Q3j27L7j40J73l4k1J14k1j69J65q5j36J62k57O3OK06k29K21j91
$$ plain form
7304 -105 -197 -45 79 258 -155 34 -72 -88 -56 84 177 14 -62 76 -236 -225 139 115 -202 76 -145 -321
7326 -321 40 141 -258 -55 61 -39 -75 -79 35 -106 144 234 -64 132 -7 22 -117 -202 -97 137 -24 185
7348 185 55 57 -157 241 148 22 -178 -193 -133 -173 -113 19 -44 60 44 -136 109 -105 59 -25 -205 320 19
7371 19 19 40 -172 -26 103 -86 -16 8 -108 113 -99 275 -105 -72 -155 184 -23 -191 -41 -103 -114 -154 -44 -108
7395 -108 -76 -175 -190 67 159 41 -11 -99 -150 37 189 -90 38 -126 -77 264 147 224 -173 -112 -37 -131 184 40
7419 40 38 68 109 -125 196 130 37 -85 101 29 -154 46 -100 -22 -2 -98 81 -146 -32 183 218 131 -40 -12 -78
7444 -78 -144 117 -169 150 2 -41 35 -146 74 79 -53 49 -124 -38 -67 236 -402 -166 73 96 -54 57 170
7467 170 38 34 -95 64 2 270 -81 -169 -209 -93 -124 11 91 -64 -146 -149 -177 204 139 -78 -201 30 -179 -40
$$ packed form
7304a05r2J52J24J79m13J89j06j6L2J40R3j63p6J38l12J1L64k4l17K78k21j76
7326c21L61J01l99K03J16j00l6mJ14j41K50R0k98J96j39K9j39q5J05K34j61K09
7348A85j30Kk14L98r3j26k00j5O0m0O0J32o3J04j6j80K45k14J64q4j80N25l01
7371A9%K1k12J46J29j89P0K4j16K21k12L74l80L3q3L39k07j68J50o2j1m0J10o4
7395a08L2r9j5K57R2j18n2q8n1J87J52k79J28j64M9L41j17P7l97O1P5r4L15j44
7419D0kL0M1k34L21o6r3j22J86p2j83K00j46P8K0r6J79k27J14K15L5q7j71K8o6
7444g8o6K61k86L19j48m3P6j81K20Nj32J02j73Q6k9L03o38K36K39K3j50J11J13
7467A70j32mj29J59o2K68l51q8m0J16l1J35Q0j55q2lk8L81o5k17j23K31k09J39
$$ plain form
7491 -40 -177 16 -104 98 272 142 -210 214 203 -170 42 -13 192 114 -145 172 146 -105 74 -89 -202 121
7513 121 53 -45 33 -45 -84 -159 39 212 -103 -167 -54 -222 273 -81 -135 -64 89 -53 -98 37 1 85 6 -89 20
7538 20 167 44 36 -105 69 6 174 57 -73 169 88 20 -84 101 161 -76 -37 -57 17 -206 68 16 -71 57
7562 57 -166 -9 132 64 108 -2 90 133 -27 125 145 -112 56 102 148 -112 71 25 0 176 267 87 -262 -378
7586 -378 -5 45 -30 112 -45 -20 -155 209 -109 -60 39 -107 -44 24 -169 -64 62 49 -80 25 -101 -135 -340
7609 -340 -144 14 -45 228 -279 -161 238 355 118 541 -297 13 -38 177 18 34 21 -100 -70 273 -67 96
7631 96 20 186 64 -163 -290 -345 154 -51 24 -64 -84 -51 518 298 430 91 25 32 -61 27 -57 -187 -70 -228
7655 -228 -15 110 -7 -2 -5 84 77 -80 75 -64 -205 -8 -61 37 -14 57 -29 -93 160 397 -55 108 90 -155 -128
$$ packed form
7491d0j37J93j20K02J74j30l52M24j1l73K12n5K05p8k59L17k6k51J79j63j13L23
7513A21o8r8P8p8l9p5J98J73l15o4J13j68M95l54n4P1J53j42m5J35l6Q4p9r5J09
7538B0J47j23qj41J74o3J68j17j30K42q1o8j04J85O0k37L9k0P4k23K74n2q7J28
7562E7k23J57J41o8M4j10R2M3j60J52K0k57J68M6M6k60J83m6k5J76R1j80l49j16
7586c78L73N0p5J42j57K5j35L64l18M9R9j46O3O8j93J05J26j3j29J05j26l4k05
7609c40J96J58n9K73n07J18L99J17k37M23q38L10n1K15j59J6j3j21L0L43l40J63
7631I6p6J66j22k27j27n5M99k05P5q8k0L3N69k20J32l39o6Pr3Q8q4j30J17j58
7655b28K13J25j17NlQ9pj57J55j39j41J97n3R8n1P1q6o4K53K37m52J63j8k45K7
$$ plain form
7680 -128 -162 -316 243 55 138 98 -26 61 -266 144 -110 -236 131 83 59 2 16 78 183 149 14 171 -99
7703 -99 -192 -17 153 269 34 34 166 103 -16 132 -53 -37 -26 -89 134 -377 -51 115 27 -49 -72 -123 91 198
7727 198 -39 -95 -191 109 111 52 129 60 -154 261 105 62 221 -116 -167 -59 -65 -361 -93 -115 35 -30 117 228
7751 228 -308 -256 -118 -74 -183 23 -305 -158 -104 -63 281 227 82 -98 -16 -79 198 385 205 67 -158 -26
7773 -26 -53 -185 -183 -29 61 -136 -70 -188 -106 -37 -59 260 22 -8 -43 -76 -63 31 -115 -102 23 -178 -9 176 -40
7798 -40 -84 -140 -127 87 -43 25 -97 -28 234 -217 -100 -55 20 -111 28 -89 -72 14 47 -150 -261 -100 -8 73
7822 73 21 121 -34 145 174 -116 38 -219 -13 -5 227 182 45 -183 140 -75 62 32 -92 102 195 95 -51
7845 -51 42 51 33 -44 -28 105 -315 -60 -136 -82 -109 121 217 143 186 -43 -113 -166 89 82 212 -35 -253 -45 -69 100
$$ packed form
7680a28l4j54N59j88Q3m0j24Q7l27M10k54j26L67m8k4n7J4O2J05l4j35J57k70
7703i9r3J75J70J16k35%J32o3j19J48j85J6J1o3K23n11L26J66q8p6k3n1K14J07
7727A98k37n6r6L00Kn9P7o9k14M15j56m3J59l37n1J08ok96K68k2J50o5J47J11
7751B28n36N2J38M4j09K06l28J47N4M1L44n4j45j80Q2o3K77J87j80j38k25J32
7773b6k7j32KJ54R0j97O6j18Q2O9k2L19k38l0l5l3J3R4j46J3J25k01J69J85k16
7798d0m4n6J3K14j30O8j22O9K62m51J17M5P5j31J39j17J7Q6L3j97j11J61R2Q1
7822G3n2J00j55J79K9k90J54k57K06QK32m5j37k28L23k15J37l0j24J94R3j00j46
7845e1R3Rj8p7J6J33m20K55p6N4k7K30R6p4M3k29p0n3K55pJ30k47k18K08k4J69
$$ plain form
7871 100 170 -35 6 10 -67 -186 -47 32 -191 -326 110 245 -203 -1 14 -79 -20 -236 122 285 121 120 -27 -4
7895 -4 94 -123 -203 3 -74 -122 -19 127 133 43 50 169 -30 -92 -40 -167 54 -104 -205 15 -39 -121 -86 120 55 -244
7921 -244 -147 44 24 -57 114 -86 -2 122 20 -17 -145 -86 108 41 -40 398 -54 87 60 -84 -51 -198 251
7944 251 46 196 -14 203 215 -187 85 -78 -8 -49 -12 -1 -119 93 -101 6 82 -14 35 50 -9 129 87 -21
7968 -21 -1 122 -193 -9 154 -159 118 111 -183 173 -172 114 -127 -20 287 80 60 238 194 -214 152 42
7990 42 -64 -191 49 -175 80 169 -8 191 6 16 -9 -43 82 -241 46 35 104 -124 -13 93 5 127 -47
8013 -47 -129 191 -35 -183 139 323 42 -131 -2 156 29 174 -36 -236 176 -153 -11 -96 -18 146 -1
8034 -1 -66 -20 176 -43 73 89 53 -50 1 104 -43 271 -114 -19 -119 0 -24 174 -1 -288 134 -142 26
$$ packed form
7871A00P0k05M1Mp7j19J39P9k23j35M36J35m48K02J5r3N9k16L58J63j64jj47K3
7895dR8k17q0K06p7m8J03J46Or0PJ19j99o2N2j27K21j58j01K20n4q2L5K06o5k99
7921b44R7J91k0q1J71k00Q4J24j02l7j28N9J94o7q1M38m52J41k7j44L3j47M49
7944B51k05J50k10K17J2m02K72j63P0m1L7J1j18K12j94J07P6r6M9J5n9J38m2j08
7968b1K0J23l15J84J63l13K77pk94L56l45K86k41J07L07k07k0J78m4m08L66j10
7990D2j06j27K40k24K55Q9j77J99j85J0k5l4J25l23K87j1O9k28J11J06q8J22j74
8013d7q2L20k26j48L22J84k81j73J29J58j27J45k10k00M12l29J42q5P8J64j47
8034ao5M6J96k19J16J6l6j03N1J03j47L14l85R5j00J19k4J98j75k87M22k76J68
$$ plain form
8057 26 299 159 72 190 143 -20 43 148 163 -246 -186 36 -339 -47 179 51 -22 84 70 -245 -291 -39 36
8080 36 69 -51 291 64 82 -52 87 -30 -108 98 54 -48 -163 226 23 191 22 34 -56 -141 -124 -51 -151
8103 -151 94 -193 -44 97 86 39 -67 -125 379 -146 -191 123 247 58 137 194 188 -113 -82 133 -71 139 6
8126 6 118 109 -43 -198 -45 281 -112 -189 -9 -28 12 -4 -102 -233 196 67 -249 259 140 110 3 17 -60 92
8150 92 -127 -84 162 -83 -87 78 27 144 31 60 152 -3 128 -74 -278 -160 -11 -248 -77 144 -39 112
8172 112 26 -59 -57 -20 6 348 83 156 10 79 16 -18 -121 119 503 49 -73 92 -169
$$ packed form
8057B6K73j40q7J18m7j63O3J05J5m09O0K22l75K92K26j28p3J06j4l15m6K52P5
8080C6L3j20L42k27J8j34J39j17p8K06m4j02j15L89k03J68j69J2r0q5J7P3j00
8103a51K45k87J49J41j1m7j06n8N04n25m5L14J24j89P9N7ol01L1K15k04K10j33
8126FJ12rj52j55J53L26l93p7J80j9M0j6r8j31M29j29l16N08j19l0j07J4p7J52
8150I2k19M3K46k45mJ65n1J17j13K9R2j55J31k02k04J18J49k37J71K21j83J51
8172A12q6q5KL7K6L42k65P3j46O9o3l4j03K40L84m54j22J65k61
8191a69
$$ Imaginary data points
##PAGE= N=2
##DATA TABLE= (X++(I..I)), XYDATA
$$ plain form
0 0 0 0 0 0 0 0 8 0 0 -8 8 -8 16 -16 24 -32 40 -48 56 -64 80 -96 110 -129 152 -176 204 -237 273 -311 355
31 355 -406 460 -520 586 -658 738 -827 924 -1028 1142 -1270 1408 -1556 1720 -1898 2096
47 2096 -2309 2544 -2803 3086 -3402 3752 -4139 4580 -5076 5643 -6298 7065 -7978 9081
61 9081 -10449 12197 -14519 17755 -22587 30573 -46074 87065 -422280 -923567 363664
72 363664 568052 -227078 -382139 312165 452779 34150 -146737 -106681 -165488 63579
82 63579 181891 -111006 -245272 104754 353430 20152 -403461 -135534 216057 19412
92 19412 -187334 -24836 171330 184229 108519 37534 -164575 -183727 128029 72890 -281586
103 -281586 -99605 300607 182572 -190684 -163373 80626 -5978 -109538 33673 3139
$$ packed form
0@%%%%%%Qq%qJ6j6K4l2M0n6P2q8J04j20J44j76K06k39K81l28L80m41N10n84O66
31C55p61Q66r80J106j244J396j565J751j952K170k412K678k964L276l618L994
47B096m405M853n347N889o488P154p891Q719r656J0719j1941J3363j5043J7059
61I081j9530K2646k6716L2274m0342N3160p6647J33139n09345n01287J287231
72C63664K04388p95130j55061O94304J40614m18629j80887M0056n8807K29067
82F3579J18312k92897j34266L50026K48676l33278m23613K67927L51591j96645
92A9412k06746J62498J96166J2899p5710p0985k02109j9152L11756n5139l54476
103b81586J81981M00212j18035l73256K7311K43999q6604j03560J43211l0534
$$ plain form
113 3139 -4206 233770 176202 -151949 -131382 162687 70713 -310343 -148258 277975 86689
124 86689 -224609 17132 253507 -36928 -331369 -37069 249493 -61094 -193280 189498
134 189498 273003 -52268 -152525 33058 29997 -149057 -58432 78425 -27930 14575 148163
145 148163 5040 -143138 -35314 86962 -31483 -136717 68482 183538 6836 -24811
155 -24811 68872 -421 -110620 -74423 23866 -32223 -82206 91416 133810 -46159 -74847
166 -74847 8031 -628 -57412 -39306 48713 45258 44084 110325 20 -116872 3708 53140
178 53140 -90515 -121499 68711 146971 -50285 -74075 119452 36796 -147275 -52178 83859
189 83859 16746 -78379 40596 161721 5623 -111980 -13090 18426 -46062 -68700 -16448
$$ packed form
113C139p345K37976n7568l28151K0567K94069r1974l81056J62085M26233j91286
124H6689l11298K41741K36375k90435k94441K94300K86562l10587j32186L82778
134A89498Q3505l25271j00257J85583l061j79054R0625J36857j06355M2505J33588
145A48163j43123j48178J07824J22276j18445j05234K05199J15056j76702l1647
155b4811R3683o9293j10199L6197R8289n6089m9983J73622M2394j79969k8688
166g4847Q2878q659n6784J8106Q8019l455j174O6241j10305j16892J20580M9432
178E3140j43655l0984J90210P8260j97256k3790J93527q2656j84071R5097J36037
189H3859o7113r5125J18975J21125j56098j17603R8890L1516o4488k2638N2252
$$ plain form
200 -16448 49171 45856 45409 10969 -79373 -12614 73762 -41096 -104804 30467 147351 49798
212 49798 -90491 -3104 80907 -42180 -93840 -25336 4701 18694 36972 40609 -10028 -37607
224 -37607 37531 9623 -99610 -40018 62928 54041 7051 -6699 25580 7211 -36994 -22694
236 -22694 -50989 -48441 58108 70598 -13659 -32740 42984 73665 -60505 -114836 31964 75545
248 75545 -11452 -20583 35040 55867 -6476 -52259 -28287 -36255 -12888 33653 -7614 -8664 50525
261 50525 39354 -22409 -59379 -8586 28371 -32878 -18060 55447 33258 367 2119 1023
273 1023 -22584 -52908 -3610 31067 -18307 6666 58005 24411 -17716 -28896 -6086 -2998
285 -2998 -33292 3108 28949 6130 26719 16870 -30285 -29456 -11865 -2667 -26172 -23524 54033
$$ packed form
200a6448O5619l315m47l4440r0342O6759Q6376j14858o3708J35271J16884r7553
212D9798j40289Q7387Q4011j23087n1660O8504L0037J3993J8278L637n0637k7579
224c7607P5138k7908j09233N9592J02946q887m6990j3750L2279j8369m4205J4300
236b2694k8295K548J06549J2490q4257j9081P5724L0681j34170n4331J46800M3581
248G5545q6997r131N5623K0827o2343m5783K3972p968K3367M6541m1267j050N9189
261E0525j1171o1763l6970N0793L6957o1249J4818P3507k2189l2891J752j096
273A023k3607l0324M9298L4677m9374K4973N1339l3594m2127j1180K2810L088
285b998l0294L6400K5841k2819K0589r849m7155Q29J7591R198k3505K648P7557
$$ plain form
298 54033 47675 -19463 -3718 14780 -5863 -30425 -28118 19326 19497 3235 34883 14187 -18444
311 -18444 -5199 -13723 -22757 -21449 -760 36415 12208 -956 25884 -4692 -26982 -13944 -16289
324 -16289 -7691 -1717 18909 34740 -7955 -8681 17957 -18991 -36141 -13588 11004 23947 1280
337 1280 12731 33646 -3320 -14266 -10336 -22234 -2404 6668 7755 15224 5844 17902 3354
350 3354 -39456 -17243 3280 -10182 -4402 5952 28052 21503 -15480 -5052 -4776 -23771 -5305
363 -5305 -2042 2280 19885 14278 15416 -1928 -21469 -207 -7691 -17160 6299 10048 18968 18419
377 18419 -859 1807 -14338 -20746 2907 -11025 -10906 16151 17898 14494 -7727 -18455 2158
390 2158 -11977 -18502 -61 723 19546 23751 769 -1557 -11209 -7545 3554 -19181 -8270 20042
$$ packed form
298E4033o358o7138J5745J8498k0643k4562K307M7444J71j6262L1648k0696l2631
311a8444J3245q524r034J308K0689L7175k4207j3164K6840l0576k2290J3038k345
324a6289Q598N974K0626J5831m2695p26K6638l6948j7150K2553K4592J2943k2667
337A280J1451K0915l6966j0946L930j1898J9830R072J087P469r380J2058j4548
350C354m2810K2213K0523j3462N780J0354K2100o549l6983J0428K76j8995J8466
363e305L263M322J7605n607J138j7344j9541K1262p484r469K3459L749Q920n49
377A8419j9278K666j6145o408K3653j3932J19K7057J747l404k2221j0728K0613
390B158j4135o525J8441P84J8823M205k2982k326r652L664J1099k2735J0911K8312
$$ plain form
404 20042 18618 16922 -4386 -14517 5407 -3889 -12964 -12714 -8659 27477 24930 -10286 -7616 -2353
418 -2353 3098 -4839 -33369 -11066 20509 17133 11783 -9936 -7391 17548 -3027 -24275 -20360
431 -20360 4881 39208 10355 -19744 9449 17090 282 -20259 -26895 10099 17148 -2445 7888
444 7888 4761 873 4601 -9453 -11530 -17060 -9258 22102 6865 -8389 12830 7800 -3773 -15422
458 -15422 -20979 3125 4475 609 17351 10108 2937 -1786 -10312 4480 -7692 -20917 14201
471 14201 24771 6506 -9231 -8863 17787 3947 -28786 -12214 1189 9007 16129 -7591 -6475
484 -6475 10782 6860 -2190 -30803 -26639 23416 31880 1043 -27589 -3987 50843 4557 -64310
497 -64310 -14806 41918 23181 -18056 -19921 22207 24281 -7181 -12723 -18368 269 22260 -1321
$$ packed form
404B0042j424j696k1308j0131J9924r296r075K50M055L6136k547l5216K670N263
418b353N451p937k8530K2303L1575l376n350k1719K545K4939k0575k1248L915
431b0360K5241L4327k8853l0099K9193P641j6808k0541o636L6994P049j9593J0333
444G888l127l888L728j4054k077n530P802L1360j5237j5254K1219n030j1573j1649
458a5422n557K4104J350l866J6742p243p171m723q526J4792j2172j3225L5118
471A4201J0570j8265j5737L68K6650j3840l2733J6572J3403P818P122k3720J116
484f475J7257l922r050k8613M164N0055Q464l0837k8632K3602N4830m6286o8867
497f4310M9504N6724j8737m1237j865M2128K074l1462n542n645J8637K1991k3581
$$ plain form
510 -1321 -13425 -8606 9085 36998 -4341 -51250 -12390 29894 13550 -29826 -20033 41073 29983
523 29983 -22351 -23079 -6170 12307 8828 -17011 -1023 19688 12635 6182 -11550 -13520 445
536 445 1820 9446 -6269 -16282 22309 20504 -15644 -12475 2439 4115 -15264 -16056 18384 9508
550 9508 -11952 8001 12887 -3773 -24444 -19786 26528 15186 -30441 518 40803 15655 -29689
563 -29689 -25731 18558 10911 -13836 5485 3467 -845 18232 2468 -17260 -14536 965 19744
576 19744 -4034 -27766 1919 28701 17997 -25056 -34998 20472 25955 -21659 -23274 4630 27770
589 27770 18421 -18344 -16563 4104 12274 8508 -19714 -14233 25144 20807 -4391 -19096 -8713
602 -8713 25992 11714 -29573 -22502 14013 34136 -4247 -35170 11531 26382 -16631 -22551 -3246
$$ packed form
510a321j2104M819J7691K7913m1339m6909L8860M2284j6344m3376R793O1106j1090
523B9983n2334p28J6909J8477l479k5839J5988K0711p053o453j7732j970J3965
536D45J375P626j5715j0013L8591j805l6148L169J4914J676j9379p92L4440q876
550I508k1460J9953M886j6660k0671M658M6314j1342m5627L0959M0285k5148m5344
563b9689L958M4289p647k4747J9321k018m312J9077j5764j9728K724J5501J8779
576A9744k3778k3732K9685K6782j0704m3053r942N5470N483m7614j615K7904K3140
589B7770r349l6765J781K0667Q170l766k8222N481L9377m337k5198j4705J0383
602h713L4705j4278m1287P071L6515K0123l8383l0923M6701J4851m3013n920J9305
$$ plain form
615 -3246 9451 6922 -3205 5819 2311 -5189 5504 -5142 -11302 1250 3546 13844 5285 -13001
629 -13001 7461 13021 -8232 -11771 -3847 9912 3192 -9007 10550 9615 -7664 -3143 -7718 -5454
643 -5454 3646 -4553 62 5208 4227 5565 -10371 -7443 7161 -5524 -3860 3299 1147 13432
657 13432 4886 -11098 -1936 6295 6143 -9284 -14348 15141 14736 -6628 -2709 -1026 4871 2805
671 2805 -17181 -5132 10716 2100 -1284 -3589 2576 3977 -8885 -1254 -1997 -9385 8912 6560
685 6560 -3969 3638 -263 2380 3375 -7898 -2268 1611 4190 7933 -5361 1033 10702 -3861
699 -3861 -4712 -5094 -5607 8045 892 -4272 4135 1185 2415 -4400 -11565 2748 -202 -3687 5901
714 5901 -164 2584 3656 -6222 862 -374 -4851 3393 520 4657 5336 -4048 6945 3598 -10074
$$ packed form
615c246J2697k529j0127R024l508p500J0693j0646o160J2552K296J0298q559j8286
629a3001K0462N560k1253l539P924J3759o720j2199J9557r35j7279M521m575K264
643e454R100q199M615N146r81J338j5936K928J4604j2685J664P159k152J2285
657A3432q546j5984R162Q231j52j5427n064K9489m05k1364L919J683N897k066
671B805j9986J2049J5848q616l384k305O165J401j2862P631p43p388J8297k352
685F560j0529P607l901K643R95j1273N630L879K579L743j3294O394R669j4563
699c861q51l82n13J3652p153n164Q407k950J230o815p165J4313k950l485R588
714E901o065K748J072r878P084j236m477Q244k873M137O79r384J0993l347j3672
$$ plain form
729 -10074 -591 347 1094 3918 -4318 3980 6173 -4818 -3077 -6996 -2296 5968 -6703 -1317 7576
744 7576 49 1527 -5135 -5655 6008 -2757 -3331 3794 1477 6777 950 -4207 5779 -1919 -3718
759 -3718 2530 -3704 4493 5353 -2960 3478 -1151 -3212 1334 -6929 -843 2510 -3475 4995 1078
774 1078 -4356 1591 -3565 -989 29 -7054 5331 5512 -2580 3213 -256 1357 2335 -7873 1386
789 1386 5166 -1206 4629 63 748 4976 -5578 -2486 1000 -3809 3544 -966 -1923 6247 -2907
804 -2907 -3223 233 -5370 1043 -2040 -3555 7401 441 -1328 3013 -2902 1392 -1313 -4619 5808
819 5808 1109 12 5563 -1528 2219 1343 -5912 1829 -738 -1711 4890 -2048 1157 3062 -4890 -330
835 -330 -2515 -4197 2781 -3276 -202 5560 -3167 610 -52 -4160 2707 -2633 -1608 4939 -445 3684
$$ packed form
729a0074R483R38P47K824q236Q298K193j0991J741l919M700Q264j2671N386Q893
744G576p527J478o662n20J1663q765n74P125k317N300n827n157R986p698j799
759c718O248o234Q197Q60q313O438m629k061M546q263O086L353n985Q470l917
774A078n434N947n156K576J018p083J2385J81q092N793l469J613R78j0208R259
789A386L780o372N835m566O85M228j0554L092L486m809P353m510r57Q170r154
804b907l16L456n603O413l083j515J0956o960j769M341n915M294k705l306J0427
819E808m699j097N551p091L747q76p255P741k567r73O601o938L205J905p952M560
835c30k185j682O978o057L074N762q727L777o62m108O867n340J025O547n384M129
$$ plain form
851 3684 3138 -4319 2827 87 -2197 2500 -3772 2969 6476 -3313 825 -679 -2702 3368 -5083
866 -5083 -3673 3091 -251 3754 -2249 -6688 5489 381 -5080 -2150 -2596 6633 3566 -5653 2995
881 2995 2258 -279 2108 -5562 210 5154 -149 3850 -1379 -2356 6519 -1837 -4536 -631 -2171 4843
897 4843 9 -4784 3206 -1348 -858 2373 -7936 -2121 3903 -314 1771 -2794 84 5645 -3216
912 -3216 -456 818 -4890 4805 4245 -1422 1711 -2097 4427 4757 -9268 -2314 4906 2195 720
927 720 -5908 1324 6481 -4995 -1188 -1896 -6397 4884 3255 -3736 -2897 -1595 8698 1805 -13086
942 -13086 -831 6966 2559 -539 -6453 4399 9740 -3194 -3665 -2992 1217 8461 -2499 -4137
956 -4137 3226 423 4383 -960 -8731 1120 2819 1276 -765 -8741 2456 8537 -3605 -5271 -3692
$$ packed form
851C684n46p457P146k740k284M697o272O741L507r789M138j504k023O070q451
866e083J410O764l342M005o003m439J2177n108n461K930m46R229l067r219Q648
881B995p37k537K387p670N772M944n303L999n229r77Q875q356k699L905j540P014
897D843m834m793P990m554M90L231j0309N815O024m217K085m565K878N561q861
912c216K760J274n708R695n60n667L133l808O524L30j4025O954P220k711j475
927G20o628P232N157j1476L807p08m501J1281j629o991Q39J302J0293o893j4891
942a3086J2255P797m407l098n914J0852N341j2934m71O73M209P244j0960j638
956d137P363k803L960n343p771R851J699j543k041p976J1197O081j2142j666J579
$$ plain form
971 -3692 4544 5666 -9947 -2094 9323 -397 -726 916 256 361 -4444 4853 6443 -8945 -324
986 -324 9123 1075 -4591 -5676 5533 5291 -9863 -606 6094 -3836 -76 1648 -1312 -3205 -5931
1001 -5931 5808 4103 -11075 -948 8463 4718 -3239 -9834 4000 10091 -5149 -3344 975 2975
1015 2975 7985 -2638 -4940 2882 -152 1946 -929 -6032 2595 4630 3543 -2572 -12374 1891
1029 1891 10379 -4718 -7863 -1903 8782 7948 -12902 -7350 10809 2802 -5413 -2768 4379 4717
1043 4717 -4961 2471 5387 -8066 2849 10361 -4301 -8263 273 10059 3467 -11484 580 8756
1057 8756 -3723 -4929 -2380 2255 3678 -5793 -690 3834 -4901 -1082 2111 -349 -627 -2624 3685
1072 3685 3588 -6787 2010 4766 -2335 2929 434 -3356 1499 632 1752 919 -582 2749 -3816 -932
$$ packed form
971c692Q236J122j5613P853J1417r720l29J642o60J05m805R297J590j5388Q621
986c24R447q048n666j085J1209k42j5154R257O700r930L760J724k960j893k726
1001e931J1739j705j5178J0127R411l745p957o595J3834O091j5240J805M319K000
1015B975N010j0623k302P822l034K098k875n103Q627K035j087o115r802J4265
1029A891Q488j5097l145N960J0685q34k0850N552J8159q007q215K645P147L38
1043D717r678P432K916j3453J0915P512j4662l962Q536R786o592j4951J2064Q176
1057H756j2479j206K549M635J423r471N103M524q735L819L193k460k78j997O309
1072C685r7j0375Q797K756p101N264k495l790M855q67J120q33j501L331o565K884
$$ plain form
1088 -932 4694 -7622 -2887 8657 -144 -5013 -2016 3043 3092 -8822 -3966 7361 1105 -1171 -1240
1103 -1240 -349 3262 -3497 564 5241 -6163 -131 8554 -1399 -3725 571 6014 2109 -9745 323
1118 323 7456 -2887 -1341 1018 -151 1688 -3338 -1397 -232 -5022 4291 3768 -5083 -194 503
1133 503 -219 -797 -3252 5466 2979 -5162 2150 879 -2030 3317 554 620 -172 -798 3703 -3120 -2943
1150 -2943 6941 -1207 -3315 3040 -1276 -2272 -2729 -469 4222 -2741 -1371 3238 -3879 -1217 1111
1165 1111 -645 2163 -2308 -40 5080 -3978 -814 5840 -417 -1346 -1024 1755 2182 -4335 2666 4965
1181 4965 -4514 703 2663 -3413 -1949 -784 2828 943 -4823 3100 1793 -6589 14 1706 -722
1196 -722 287 -1353 2719 -49 -4142 4068 632 -3366 2930 625 792 1437 -1915 2957 208 -2444
$$ packed form
1088i32N626j2316M735J1544q801m869K997N059M9j1914M856J1327o256k276o9
1103a240Q91L611o759M061M677j1404O032Q685r953k326M296N443l905j1854J0068
1118C23P133j0343J546K359j169J839n026J941J165m790R313n23q851M889O97
1133E03p22n78k455Q718k487q141P312j271k909N347k763O6p92o26M501o823J77
1150b943R884q148k108O355m316r96m57K260M691o963J370M609p117K662K328
1165A111j756K808m471K268N120r058L164O654o257r29L22K779M27o517P001K299
1181D965r479N217J960o076J464J165L612j885n766P923j307q382O603J692k428
1196g22J009j640M072k768m093Q210l436l998O296k305J67O45l352M872k749k652
$$ plain form
1212 -2444 3950 -1017 -2315 1715 -539 1180 -1533 -1776 3923 -3048 -3681 3615 -1796 -1588 1381 -498
1228 -498 854 -2337 187 3504 -4763 -136 4861 -1858 18 1453 638 1982 -2126 1649 3027
1243 3027 -4318 1359 2883 -2233 675 -363 995 918 -4841 853 2147 -4008 490 859 -983 172
1259 172 -2094 1461 -276 -4307 3644 1603 -3090 2079 578 372 1242 -1500 2240 145 -1700 3749
1275 3749 -511 -1428 2999 -530 -173 -742 -1914 3230 -1769 -2795 2675 -1277 -731 490 -2376 837
1291 837 -913 -828 2153 -2827 421 3450 -2166 -301 1331 -44 2063 -1741 581 3227 -2450 1528
1307 1528 2201 -2409 934 166 44 434 -2295 2055 2279 -3555 1287 200 -2118 -97 -1665 260
1323 260 596 -3022 1679 957 -2604 1858 -340 -442 1292 -974 2695 940 -2321 2902 299 -1389
$$ packed form
1212b444O394m967j298M030k254J719k713k43N699o971o33P296n411K08K969j879
1228d98J352l191K524L317q267M627M997o719J876J435q15J344m108L775J378
1243C027p345N677J524n116K908j038J358p7n759N694J294o155M498L69j842J155
1259A72k266L555j737m031P951k041m693N169j501k06Q70k742L740k095j845N449
1275C749m260r17M427l529L57n69j172N144m999j026N470l952N46J221k866L213
1291H37j750Q5K981m980L248L029n616J865J632j375K107l804K322K646n677L978
1307A528O73m610L343p68j22L90k729M350K24n834M842j087k318K021j568J925
1323B60L36l618M701p22l561M462k198j02J734k266L669j755l261N223k603j688
$$ plain form
1339 -1389 1808 -1384 1196 1041 -2104 2002 -329 -2007 1651 -2282 -737 941 -2340 1429 14
1354 14 -1899 1732 -1912 -644 1780 -2623 750 1671 -1040 1474 -617 461 2554 -2444 969 2211
1370 2211 -1554 1803 320 -738 1674 -1697 800 1031 -3503 1136 857 -1799 421 -1718 176
1385 176 1500 -3241 147 719 -1278 1361 -1210 -381 2557 -1312 1014 1217 -1679 2619 387 -746
1401 -746 1986 -990 1110 1592 -2299 972 313 -710 1733 -2421 -284 2222 -2377 -2 -556 -1912
1417 -1912 1790 -1631 -1075 1955 -2200 490 826 -1892 1173 -792 -195 2768 -1825 401 2193 -1112
1433 -1112 1568 -385 -619 3033 -1483 -141 1729 -1619 951 -79 -1622 1383 -1616 -771 1711
1448 1711 -2426 -768 673 -680 1207 -2762 -507 3472 -2179 -746 1577 -918 1697 340 -727
$$ packed form
1339a389L197l192K580j55l145M106k331j678L658l933J545J678l281L769j415
1354A4j913L631l644J268K424m403L373R21k711K514k091J078K093m998L413J242
1370B211l765L357j483j058K412l371K497K31m534M639k79k656K220k139J894
1385A76J324m741L388N72j997K639k571Q29K938l869K326K03k896M298k232j133
1401g46K732k976K100M82l891L271o59j023K443m154K137K506m599K375n54j356
1417a912L702l421N56L030m155K690L36k718L065j965N97K963m593K226J792l305
1433a112K680j953k34L652m516J342J870l348K570j030j543L005k999Q45K482
1448A711m137J658J441j353J887l969K255L979n651J433K323k495K615j357j067
$$ plain form
1463 -727 1938 -270 977 844 -1929 1957 663 -930 2732 -1762 -1579 2466 -1436 -1303 -386 -120
1479 -120 2075 -2427 -1282 1909 -2555 -332 539 -2054 2130 380 -1780 1193 -417 64 548 135
1495 135 2305 -1498 -807 4748 -1608 -2310 3199 211 -1025 -267 319 959 -2380 166 1930 -2175
1511 -2175 106 80 -2450 1900 -772 -2135 3022 -756 -2324 37 323 1497 -1020 345 3379 -2166
1527 -2166 -239 2847 -2171 522 2312 -266 1224 -709 -980 980 -1260 707 308 -1006 2301
1542 2301 -2159 -3139 1504 -613 -413 256 -1592 1202 -840 -1969 1931 -681 -280 1121 -905 1761
1558 1761 -331 -1121 3200 -253 -1928 1702 479 -252 -914 352 3438 -1558 -2322 2107 -1960 -1240
1574 -1240 1215 -378 1383 -1188 -1814 1255 -2039 -861 1867 -503 594 -818 -539 2252 -1955
$$ packed form
1463g27K665k208J247j33k773L886j294j593L662m494J83M045l902J33R17K66
1479a20K195m502J145L191m464K223Q71k593M184j750k160K973j610M81M84m13
1495A35K170l803O91N555o356p02N509k988j236P58N86O40l339K546J764m105
1511b175K281k6k530M350k672j363N157l778j568K361K86J174k517J365L034n545
1527b166J927L086n018K693J790k578J490j933k71J960k240J967l99j314L307
1542B301m460r80M643k117K00O69j848K794k042j129L900k612M01J401k026K666
1558A761k092p90M321l453j675L630j223p31o62J266L086m996p64M429m067P20
1574a240K455j593J761k571o26L069l294J178K728k370J097j412K79K791m207
$$ plain form
1589 -1955 -198 3101 -1180 192 1839 -747 856 -471 -57 1450 -1246 1228 382 -2421 1876
1604 1876 550 -1629 539 -1589 -77 -6 -1924 2123 213 -2650 1123 -126 -719 740 -551 2040
1620 2040 -297 -1381 2647 -186 -2020 1321 294 1722 237 -596 2625 -1726 -2532 2640 319
1635 319 -1037 1096 -360 456 -2141 -1241 1973 -2140 -715 2231 -1493 -183 271 -1329 798 -646
1651 -646 214 2207 -1408 262 1248 -619 1769 -155 60 1881 -1894 812 1876 -1901 814 726
1667 726 -1621 -646 -755 1555 443 -3090 1922 664 -3489 767 692 -1308 -242 318 1744 -1176
1683 -1176 -2101 2888 -455 -1336 2388 370 442 529 -1423 2054 233 -1385 1788 -53 -677 192 -466
1700 -466 1470 -1838 -1920 2750 -1701 -2256 2319 -1110 -1069 322 -589 491 -1137 400 1749 -1891 896
$$ packed form
1589a955J757L299m281J372J647k586J603j327M14J507k696K474q46k803M297
1604A876j326k179K168k128J512P1j918M047j910k863L773j249n93J459j291K591
1620B040k337j084M028k833j834L341j027J428j485q33L221m351q06N172k321
1635C19j356K133j456Q16k597R00L214m113J425K946l724J310M54j600K127j444
1651f46Q60J993l615J670R86j867K388j924K15J821l775K706J064l777K715q8
1667G26k347R75j09K310j112l533N012j258m153M256p5k000J066N60J426k920
1683a176r25M989l343q81L724k018P2Q7j952L477j821j618L173j841o24Q69o58
1700d66J936l308q2M670m451n55M575l429M1J391r11J080j628J537J349l640K787
$$ plain form
1717 896 2214 -1558 466 294 197 1853 -701 785 1299 -2138 952 1128 -1015 304 -715 708
1733 708 161 -3030 1393 1027 -3053 633 779 -663 -212 -909 1277 -254 -2353 2304 301 -2149
1749 -2149 1443 361 265 395 -679 2141 -97 -1343 2452 -20 -637 1065 -727 834 -743 -1344
1765 -1344 2108 -1569 -1748 1936 -1107 -901 342 -545 541 -1631 227 2157 -2273 -52 2396 -1462
1781 -1462 19 922 288 1073 -1194 1081 2007 -2227 1104 1852 -1027 272 -304 703 596 -2654 1007
1798 1007 1196 -2454 598 404 -1207 192 -1048 577 158 -2154 1716 152 -2013 1385 500 -177
1814 -177 341 -801 1774 -301 -1277 2490 -5 -867 1645 -365 -90 -282 -517 1610 -1891 -1176 2182
1831 2182 -1353 -1155 851 -452 232 -1535 -147 2050 -2169 -425 2203 -1193 -453 461 457 1278 -1588
$$ packed form
1717H96J318l772K024j72r7J656k554J486N14l437L090J76k143J319j019J423
1733G08n47l191M423l66m080L686J46j442M51o97K186j531k099M657k003k450
1749b149L592j082r6J30j074K820k238j246L795k472o17J702j792J561j577o01
1765a344L452l677j79L684l043K06J243q87J086k172J858J930m430K221K448l858
1781a462J481R03o34P85k267K275R26m234L331P48k879J299n76J007j07l250L661
1798A007J89l650L052j94j611J399j240J625m19k312L870j564k165L398q85o77
1814a77N18j142K575k075r76L767k495q62K512k010K75j92k35K127l501P15L358
1831B182l535J98K006j303O84j767J388K197m219J744K628l396P40R14mQ21k866
$$ plain form
1848 -1588 802 2370 -1894 427 1620 -736 629 -64 548 1082 -1941 580 1161 -1907 490 -42
1864 -42 -1371 693 -1219 -112 282 -1685 1056 -103 -1813 1540 -499 -707 1146 -598 1248 -303
1880 -303 -1011 2683 -411 -993 2117 -6 -96 44 -14 1636 -1277 -1044 2253 -1568 -997 1012 -577
1897 -577 73 -945 -995 1628 -1598 -908 1563 -950 49 -15 -514 1510 -1211 86 2162 -1110 77
1914 77 869 -350 1100 -636 134 1617 -1235 232 688 -1479 1206 -234 -1378 1389 -375 -677
1930 -677 0 -1053 1084 -764 -1309 1771 -974 -957 1185 -819 410 311 -865 1698 -304 -807 1635
1947 1635 150 441 249 -306 1825 -884 -1596 2428 -213 -789 725 -663 36 -1180 -576 1726 -954
1964 -954 -490 732 -1746 38 -24 -1699 1717 95 -1132 1257 -375 314 -147 -216 2114 -429 -737
$$ packed form
1848a588K390J568m264K321J193k356J365o93O12N34l023K521N81l068K397n32
1864d2j329K064j912J107L94j967K741j159j710L353k039k08J853j744J846j551
1880c03p08L694l094n82L110k123r0J40n8J650k913K33L297l821N71K009j589
1897e77O50j018n0K623l226O90K471k513R99o4m99K024k721J297K076l272J187
1914G7P92j219J450j736P70J483k852J467M56k167K685j440j144K767j764l02
1930f77O77j053K137j848n45L080k745J7K142k004J229r9j176K563k002n03K442
1947A635j485K91j92n55K131k709p12M024k641n76J514j388O99j216O04K302k680
1964i54M64J222k478J784o2j675L416j622j227K389j632O89m61o9K330k543l08
$$ plain form
1981 -737 2351 -847 -598 1244 -755 692 60 -1179 904 -739 -363 207 -1524 1329 -507 -2548
1997 -2548 1893 -364 -2034 985 -217 -286 -108 -181 1319 -832 -42 2221 -1015 262 1199 -1373 1085
2014 1085 1365 -866 985 78 -148 -350 -1490 1548 -319 -1874 1970 -523 -1775 532 -867 -63
2030 -63 -155 -658 1385 -820 -818 1156 -1526 504 1319 -1516 1609 702 -1550 997 815 273 -98 -410
2048 -410 1886 -961 -1392 2696 -717 -1677 1509 -1062 -740 420 -482 429 -435 -56 484 -2148 753
2065 753 266 -1629 1979 707 -1741 540 -618 -596 720 439 1368 -154 -729 1345 -1269 212 2039
2082 2039 -1461 560 1460 -1967 -177 149 -273 -381 -1049 1447 -542 -2261 1706 -260 -1859 1541
2098 1541 -418 -812 406 -635 1268 422 -148 1182 -1092 213 1048 -972 1817 800 -1836 1084
$$ packed form
1981g37L088l198K49J842j999J447o32j239K083j643L76N70j731K853j836k041
1997b548M441k257j670L019j202o9J78p3J500k151P90K263l236J277R37k572K458
2014A085K80k231J851r07k26k02j140L038j867j555L844k493j252K307j399Q04
2030f3r2n03K043k205KJ974k682K030Q15k835L125r07k252K547j82n42l71l12
2048d10K296k847m31M088l413r60L186k571L22J160r02R11q64L79N40k632K901
2065G53m87j895L608j272k448K281j158K2J316k81R29j522n75K074k614J481J827
2082B039l500K021R00l427J790L26m22j08o68K496j989j719L967j966j599L400
2098A541j959l94J218j041J903q46n70J330k274J305Q35k020K789j017k636K920
$$ plain form
2114 1084 22 -1281 908 -433 -67 -244 -793 947 -1761 -771 1317 -1833 -29 1513 -1242 23
2130 23 331 -485 418 -602 371 798 -1281 1194 1060 -673 1064 -799 -183 1286 -694 903 1276
2147 1276 -1359 399 -185 -495 413 -989 906 286 -1896 932 121 -1574 277 -659 -53 724 -895
2164 -895 1076 -335 -1277 1040 219 49 1251 -925 736 271 -831 1417 142 -280 1121 -17
2180 -17 285 871 -451 904 -1015 -870 1075 -1626 -557 973 -1542 -75 263 -670 163 -1282 -45
2197 -45 1338 -1157 695 843 -911 432 -182 543 1363 -920 799 1228 -1460 310 329 -574 486
2214 486 -519 673 445 -1841 500 -42 -1314 937 -770 -556 458 -1570 493 292 -944 816
$$ packed form
2114A084j062j303K189j341L66j77n49J740k708R90K088l150J804J542k755J265
2130B3L08q16R03j020R73M27k079K475j34j733J737j863O16J469j980J597L73
2147A276k635J758n84l10R08j402J895o20k182K828q11j695J851r36O06P77j619
2164h95J971j411r42K317q21j70J202k176J661m65j102K248j275m22J401j138
2180a7L02N86j322J355j919J45J945k701J069J530k515J467L38r33Q33j445J237
2197d5J383k495J852J48j754J343o14P25Q20k283J719M29k688J770J9r03J060
2214D86j005J192k28k286K341n42j272K251j707K14J014k028K063k01j236J760
$$ [...]
8191a40
##END NTUPLES=NMR FID
##END=
