##TITLE=1H_Pr Ncs-26
 200.13MHz, CDCl3,
 8 sc
 
 26.8.2025
##JCAMPDX= 6.0         $$ Bruker NMR JCAMP-DX V2.0
##DATA TYPE= NMR FID
##DATA CLASS= NTUPLES
##ORIGIN= UXNMR, Bruker Analytische Messtechnik GmbH
##OWNER= pz
$$ XWIN-NMR		Version 3.5
$$ Tue Aug 26 14:41:32 2025 Russian Standard Time (UT+4h)  she@DPX200
##.OBSERVE FREQUENCY= 200.1313
##.OBSERVE NUCLEUS= ^1H
##.DELAY= (6, 6)
##.ACQUISITION MODE= SIMULTANEOUS
##.ACQUISITION SCHEME= undefined
##.AVERAGES= 8
##.DIGITISER RES= 18
##SPECTROMETER/DATA SYSTEM= spect
##.PULSE SEQUENCE= zg30
##.SOLVENT NAME= CDCl3
##.SHIFT REFERENCE= (INTERNAL, CDCl3, 0, 14.3821)
##AUDIT TRAIL= $$ (NUMBER, WHEN, WHO, WHERE, WHAT)
$$ ##TITLE= Audit trail, XWIN-NMR		Version 3.5
$$ ##JCAMPDX= 5.01
$$ ##ORIGIN= Bruker BioSpin GmbH
$$ ##OWNER= she
$$ F:/spectra/data/she/nmr/H-C/1/audita.txt
$$ ##AUDIT TRAIL=  $$ (NUMBER, WHEN, WHO, WHERE, WHAT)
(   1,<2025-08-26 14:39:29.34 +0400>,<she>,<DPX200>,
      <created by zg, POWCHK disabled, PULCHK disabled
       configuration hash MD5:
       00 E9 B6 7A A2 85 ED C7 34 08 36 98 17 FE 4E 26
       data hash MD5: 16K
       B8 B5 AE 44 4A B7 B5 56 17 DD B5 5C CC 15 F7 E9>)
$$ ##END=
$$ 
$$ hash MD5
$$ 3D 30 6E 2C 5E 34 59 4B 75 79 94 24 78 71 CB 58
##$RELAX= 
##$RELAX= 
##$RELAX= 
##$RELAX= 
##$RELAX= 
##$RELAX= 
$$ Bruker specific parameters
$$ --------------------------
##$DU= <F:/spectra>
##$EXPNO= 1
##$NAME= <H-C>
##$PROCNO= 1
##$TYPE= <nmr>
##$USER= <she>
##$AMP= (0..31)
100 100 100 100 100 100 100 100 100 100 100 100 100 100 100 100 100 100 
100 100 100 100 100 100 100 100 100 100 100 100 100 100 
##$AQSEQ= 0
##$AQ_mod= 1
##$AUNM= <au_zg>
##$AUTOPOS= <>
##$BF1= 200.13
##$BF2= 200.13
##$BF3= 200.13
##$BF4= 200.13
##$BF5= 200.13
##$BF6= 200.13
##$BF7= 200.13
##$BF8= 200.13
##$BYTORDA= 1
##$CFDGTYP= 0
##$CFRGTYP= 5
##$CHEMSTR= <none>
##$CNST= (0..31)
1 1 145 1 1 1 1 1 1 1 1 1 1 1 1 1 1 1 1 1 1 1 1 1 1 1 1 1 1 1 1 1 
##$CPDPRG= <>
##$CPDPRG1= <>
##$CPDPRG2= <>
##$CPDPRG3= <>
##$CPDPRG4= <mlev>
##$CPDPRG5= <mlev>
##$CPDPRG6= <mlev>
##$CPDPRG7= <mlev>
##$CPDPRG8= <mlev>
##$CPDPRGB= <>
##$CPDPRGT= <>
##$D= (0..31)
0 0.7 0 0 0 0 0 0 0 0 0 0.03 0 0 0 0 0 0 0 0 0 0 0 0 0 0 0 0 0 0 0 0 
##$DATE= 1756204768
##$DBL= (0..7)
120 120 120 120 120 120 120 120 
##$DBP= (0..7)
150 150 150 150 150 150 150 150 
##$DBP07= 0
##$DBPNAM0= <>
##$DBPNAM1= <>
##$DBPNAM2= <>
##$DBPNAM3= <>
##$DBPNAM4= <>
##$DBPNAM5= <>
##$DBPNAM6= <>
##$DBPNAM7= <>
##$DBPOAL= (0..7)
0.5 0.5 0.5 0.5 0.5 0.5 0.5 0.5 
##$DBPOFFS= (0..7)
0 0 0 0 0 0 0 0 
##$DE= 6
##$DECBNUC= <off>
##$DECIM= 32
##$DECNUC= <off>
##$DECSTAT= 4
##$DIGMOD= 1
##$DIGTYP= 9
##$DL= (0..7)
0 120 120 120 120 120 120 120 
##$DP= (0..7)
150 150 150 150 150 150 150 150 
##$DP07= 0
##$DPNAME0= <>
##$DPNAME1= <>
##$DPNAME2= <>
##$DPNAME3= <>
##$DPNAME4= <>
##$DPNAME5= <>
##$DPNAME6= <>
##$DPNAME7= <>
##$DPOAL= (0..7)
0.5 0.5 0.5 0.5 0.5 0.5 0.5 0.5 
##$DPOFFS= (0..7)
0 0 0 0 0 0 0 0 
##$DQDMODE= 0
##$DR= 18
##$DS= 0
##$DSLIST= <SSSSSSSSSSSSSSS>
$$ [...]
##$SUBNAM0= <"">
##$SUBNAM1= <"">
##$SUBNAM2= <"">
##$SUBNAM3= <"">
##$SUBNAM4= <"">
##$SUBNAM5= <"">
##$SUBNAM6= <"">
##$SUBNAM7= <"">
##$SUBNAM8= <"">
##$SUBNAM9= <"">
##$SW= 18.0517328524113
##$SWIBOX= (0..15)
0 0 2 0 0 0 0 0 0 0 0 0 0 0 0 0 
##$SW_h= 3612.71676300578
##$TD= 16384
##$TD0= 1
##$TE= 0
##$TE2= 300
##$TE3= 300
##$TEG= 300
##$TL= (0..7)
0 120 120 120 120 120 120 120 
##$TP= (0..7)
150 150 150 150 150 150 150 150 
##$TP07= 0
##$TPNAME0= <>
##$TPNAME1= <>
##$TPNAME2= <>
##$TPNAME3= <>
##$TPNAME4= <>
##$TPNAME5= <>
##$TPNAME6= <>
##$TPNAME7= <>
##$TPOAL= (0..7)
0.5 0.5 0.5 0.5 0.5 0.5 0.5 0.5 
##$TPOFFS= (0..7)
0 0 0 0 0 0 0 0 
##$TUNHIN= 0
##$TUNHOUT= 0
##$TUNXOUT= 0
##$USERA1= <user>
##$USERA2= <user>
##$USERA3= <user>
##$USERA4= <user>
##$USERA5= <user>
##$V9= 5
##$VALIST= <valist>
##$VCLIST= <CCCCCCCCCCCCCCC>
##$VD= 0
##$VDLIST= <DDDDDDDDDDDDDDD>
##$VPLIST= <PPPPPPPPPPPPPPP>
##$VTLIST= <TTTTTTTTTTTTTTT>
##$WBST= 1024
##$WBSW= 4
##$XGAIN= (0..3)
0 0 0 0 
##$XL= 0
##$YL= 0
##$YMAX_a= 367952
##$YMIN_a= -386538
##$ZGOPTNS= <>
##$ZL1= 120
##$ZL2= 120
##$ZL3= 120
##$ZL4= 120
##$ABSF1= 10
##$ABSF2= 0
##$ABSG= 5
##$ABSL= 3
##$ALPHA= 0
##$AQORDER= 0
##$ASSFAC= 0
##$ASSFACI= 0
##$ASSFACX= 0
##$ASSWID= 0
##$AUNMP= <proc_1d>
##$AZFE= 0.1
##$AZFW= 0.1
##$BCFW= 1
##$BC_mod= 2
##$BYTORDP= 1
##$COROFFS= 0
##$CY= -3
##$DATMOD= 1
##$DC= 2
##$DFILT= <>
##$DTYPP= 0
##$F1P= 0
##$F2P= 0
##$FCOR= 0.5
##$FTSIZE= 0
##$FT_mod= 4
##$GAMMA= 1
##$GB= 0.15
##$INTBC= 1
##$INTSCL= 1
##$ISEN= 128
##$LB= 0.25
##$LEV0= 0
##$LPBIN= 0
##$MAXI= 10000
##$MC2= 0
##$MEAN= 0
##$ME_mod= 0
##$MI= 1.114404
##$NCOEF= 0
##$NC_proc= 0
##$NLEV= 6
##$NOISF1= 3.799351
##$NOISF2= 2.8
##$NSP= 1
##$NTH_PI= 0
##$NZP= 0
##$OFFSET= 14.38212
##$PC= 1
##$PHC0= -1564.887
##$PHC1= 19.39228
##$PH_mod= 1
##$PKNL= yes
##$PPARMOD= 0
##$PSCAL= 0
##$PSIGN= 0
##$REVERSE= no
##$SF= 200.129724274929
##$SI= 16384
##$SIGF1= 3
##$SIGF2= 2
##$SINO= 400
##$SIOLD= 16384
##$SREGLST= <1H.CDCl3>
##$SSB= 0
##$STSI= 0
##$STSR= 0
##$SW_p= 3205.1282051282
##$SYMM= 0
##$S_DEV= 0
##$TDeff= 0
##$TDoff= 0
##$TI= <>
##$TILT= no
##$TM1= 0
##$TM2= 0
##$TOPLEV= 0
##$USERP1= <user>
##$USERP2= <user>
##$USERP3= <user>
##$USERP4= <user>
##$USERP5= <user>
##$WDW= 1
##$XDIM= 8192
##$YMAX_p= 0
##$YMIN_p= 0
$$ End of Bruker specific parameters
$$ ---------------------------------
##NTUPLES= NMR FID
##VAR_NAME=  TIME,          FID/REAL,        FID/IMAG
##SYMBOL=    X,             R,               I
##VAR_TYPE=  INDEPENDENT,   DEPENDENT,       DEPENDENT
##VAR_FORM=  AFFN,          ASDF,            ASDF
##VAR_DIM=   8192,          8192,            8192
##UNITS=     SECONDS,       ARBITRARY UNITS, ARBITRARY UNITS
##FACTOR=    0.0002768,     1,               1
##FIRST=     0,             0,               0
##LAST=      2.2672688,     0,               0
##MIN=       0,             -386538,         0
##MAX=       2.2672688,     367952,          0
$$ Real data points
##PAGE= N=1
##DATA TABLE= (X++(R..R)), XYDATA
$$ [...]
1819a77J41K17J13n01M48j22k78L59k15J62p9n30M98j89l43J65M05J56k43l31
$$ -177 -36 181 294 -207 241 119 -159 200 -15 147 68 -462 36 -153 -496 -331 74 230 -13 -344
1839c44O49M1m29M6M01J3k64J06J89k99m69o6P51k88m59M1N96k01k83L42L88n92
$$ -344 305 346 -83 -37 364 377 113 219 408 109 -360 -426 325 37 -422 -381 215 14 -269 73 461 -131
1861a31k8M00P2k53k80L98l4K09n99L56J78l1j59j9m04j98L83O2J19l12K21K31
$$ -131 -159 241 313 60 -220 178 144 353 -246 110 288 257 98 79 -325 -523 -140 -78 41 -271 -50 181
1883A81j72j94mM02n7l1J75ok97l59M20R0k02k41J28J64j78k19M10K85n73lM65
$$ 181 9 -185 -189 213 156 125 300 294 -3 -362 58 148 -54 -295 -167 -3 -181 -400 10 295 -278 -281 184
1906A84LL5l56l7M18j91K6K90Q6m83PN9K7l5k52L32o1j98L73o7k94L14l80K67
$$ 184 187 222 -134 -171 247 56 82 372 458 -25 -18 41 68 33 -219 113 52 -146 227 160 -134 180 -200 67
1930F7J38k55M34n32J80J3q6K37m25K58J38m31l60P00K17l86j77K02L28k22J60
$$ 67 205 -50 384 -148 32 45 -41 196 -229 29 167 -264 -624 76 293 -93 -270 -68 260 38 198
1951A98k77J25L43n02M07l17K71l77K19P9k57J41k56K65N9l25k00K90K52J13o44
$$ 198 -79 46 389 -113 294 -23 248 -129 90 169 -88 53 -203 62 121 -204 -404 -114 138 251 -393
1972c93K66m6k9K71j66K71m6j27KL7J08l35r6N23k5l65k24N47M0k05o6K37l03
$$ -393 -127 -173 -202 69 -97 174 128 1 3 40 148 -187 -283 240 215 -150 -374 173 213 8 -58 179 -124
1995a24J3J6K87J20k86J27J05J61j84k04j1L79n00j86J28K58j25j81J81k30L14
$$ -124 -111 -95 192 312 26 153 258 419 235 31 20 399 -101 -287 -159 99 -26 -207 -26 -256 58
2016E8k07K75j63K87m10K0P4J46L15m91P4K21o2l89P0M64j73m05N1O7L53j01l11
$$ 58 -149 126 -37 250 -160 -140 -66 80 395 -96 -22 199 137 -252 -182 282 109 -296 -245 -178 175 74 -237
2039b37J95N61n33j06J32K16L1m04L14K28n15L9J39K68l66j80N28j14l87k59J41
$$ -237 -42 519 -14 -120 12 228 259 -145 169 397 -118 -79 60 328 -38 -218 310 196 -191 -450 -309
2060c09L00k34K11O9K52O7m41K29n5j03J86R8k59j79K59j32L2K4J01k42j15J07
$$ -309 -9 -243 -32 37 289 356 -85 144 89 -14 172 270 11 -168 91 -41 -9 15 116 -126 -241 -134
2082a34L66J7m52L27K12k09k59L45j32m9k29J68J82k20k72M91j0k16j73R3K91
$$ -134 232 249 -203 124 336 127 -132 213 81 32 -197 -29 153 -67 -339 152 142 -74 -247 -154 137
2103A37l66LJ10K13l7j99K64Lk27P4J84k0J5k64K98o3j46j39L96j98o2l28K81
$$ 137 -229 -226 -116 97 60 -139 125 128 -99 -25 159 139 154 -110 188 125 -21 -160 236 38 -24 -352 -71
2126g1jn0j1K37j34j62M85l74J18l0m7K28l00J53J29j27m8j79L97l16J15j00j35
$$ -71 -72 -122 -133 104 -30 -192 293 -81 37 7 -40 188 -112 41 170 43 -5 -184 213 -103 12 -88 -223
2149b23M76l47j56P01k66l89N3M36j17k11l25P88n01k96L16J10j49k47K82M3J63
$$ -223 253 -94 -250 451 185 -204 -151 285 168 -43 -368 420 -81 -377 -61 49 -100 -347 -65 -22 141
2170A41r7l1L24r0j43L9j0k8l43J03K91m10J25N95l53l02J70n8n7j37K31O4M2
$$ 141 44 13 337 247 104 143 133 105 -238 -135 156 -254 -129 466 113 -189 -19 -77 -134 -271 -40 24 66
2193F6l27K13L14j69k81K15rk03J46K14m0l11L2L27p2k21r4K33J43n2k65K80J41
$$ 66 -261 -48 266 97 -184 31 22 -181 -35 179 139 -172 -140 187 115 -106 -200 33 176 124 -141 139 280
2216B80k66L80k07k33r1L12J10n5j36j6j29J61k86J42Q7j10l66K15M41k13p6M7
$$ 280 14 394 187 -46 -137 175 285 230 94 78 -51 110 -176 -34 53 -57 -423 -208 233 20 -56 -9
2238in0j53K09j64K30K5j43j99K00j81L33K20n54n4K03K31j45m91L74K11k21j01
$$ -9 -59 -212 -3 -167 63 88 -55 -254 -54 -235 98 318 -236 -290 -87 144 -1 -492 -118 93 -128 -229
2260b29J34K96k01J38j00k84M3N8J90L82l71J17k14J71k84LJ85M9K44l35J9J12
$$ -229 -95 201 0 138 38 -246 -203 -145 45 427 56 173 -41 130 -154 -151 34 83 327 -8 11 123
2282A23k12J98n9j19J93j87K18Kj03OJ18K60l53o4L10j41l75M07j52K08m21j94
$$ 123 -89 109 50 -69 124 -63 155 157 54 60 178 438 85 21 331 190 -185 222 70 278 -143 -337
2304c37N12k86J29L3j08N9lQ4o0Q1l08J90L54l41P5n9Oj03J33q2k79j1K96O1k07
$$ -337 175 -111 18 51 -57 2 -1 83 23 104 -204 -14 340 -1 74 15 21 -82 51 -31 -310 -321 -25 36 -171
2329a71l8K47j43N4j3J95J60k65q6j21K43l7k67L54k0o6p0M4l29K46l3j47N10
$$ -171 -209 38 -105 -51 -64 131 291 26 -60 -181 62 25 -242 112 92 26 -44 0 -329 -83 -116 -263 247
2352B47l65j3J53K5j39Q8J6K54k42QO4j50K9j90K95n8k46J30L4k64P9R2K18k53
$$ 247 -118 -131 22 47 -92 -4 12 266 24 32 96 -54 -25 -215 80 22 -224 -94 -60 -324 -245 -153 65 -188
2376a88P1q3L02j85K16N8J6k95J26l1j66k4J57J33j8k16jK52p6j19pJ36k60J62
$$ -188 -117 -200 102 -83 133 191 207 -88 38 7 -159 -183 -26 107 89 -127 -128 124 48 -71 -78 58 -202 -40
2400d0J45j71J76Q2j11J62l27j61K05K21k42j7m7K92M8m18OL3K95k23L27J46l70
$$ -40 105 -66 110 192 81 243 -84 -245 -40 181 -61 -78 -125 167 215 -203 -197 -164 131 -92 235 381 11
2423A1nK65l01p5R5j94L97k40K86j18k26o3L61j77L6l33J4J13J77J7%J32n4O2
$$ 11 6 271 -30 -105 -10 -204 193 -47 239 121 -105 -168 193 16 52 -281 -267 -154 23 40 40 172 118 180
2447A80J06l27l6L41mKk53J30j36L56n22k8J80N7l28L55KR8j3k36j41M80l38J41
$$ 180 286 -41 -77 264 260 262 9 139 3 359 -163 -191 -11 46 -282 73 75 173 160 -76 -217 263 -75 66
2471F6K5L30o52L55Q1Lj45K28k62J42n34M16n52K81L09j60j87J97N4l8k47J23
$$ 66 91 421 -231 124 205 208 63 291 29 171 -363 53 -499 -218 91 -69 -256 -59 -5 -43 -290 -167
2493a67M64k12k86L21Or7M0n61M82k5J01j44%K50m05L33r4P7P4p7L07k27J10j52
$$ -167 297 85 -201 120 126 29 69 -492 -10 -35 66 -78 -78 172 -233 100 6 83 157 80 387 160 270 118
2517A18n2K51l88R4J63k87r2J29Q8r2Q5m59M69j58P6L3J09l3M03k77j83j2K05
$$ 118 66 317 -71 23 186 -101 -193 -64 24 -68 17 -442 27 -131 -55 -22 87 54 457 180 -3 -15 190
2540A90j26j69L20l31K09m71M20J6n0k14L4l6N03k45j86K93O6n66N12J29m60L35
$$ 190 64 -105 215 -116 93 -378 42 58 8 -206 -172 -208 295 50 -136 157 223 -343 169 298 -162 173
2562A73k71K62k03j19K75k33L44l32J17J50k65K84j22j13j28J58m7J77K20l89
$$ 173 -98 164 -39 -158 117 -116 228 -104 13 163 -102 182 60 -53 -181 -23 -70 107 327 -62
2582f2J65m58M71m2R6l68K65L7l86N0J24J51J31n19K24L08J04j52l57K33M1J27
$$ -62 103 -355 116 74 170 -198 67 104 -282 -232 -108 43 174 -345 -121 187 291 139 -218 15 56 183
2604A83m43J49J36j61k7p6M02k11k86M32m42N36l58L00l9j59O9J88j79j29J40
$$ 183 -260 -111 25 -136 -163 -239 163 -48 -334 98 -344 192 -166 134 95 -64 5 193 14 -115 25
2625B5O3m9j4R9J72p0O7l8O7k72k39J49M8j85K10J45m74J17k7K69p5m5J42K17
$$ 25 88 39 25 124 296 226 293 255 322 50 -189 -40 8 -177 33 178 -296 -179 -206 63 -12 -57 85 302
2649C02k76L4P5j9j33p9J30K03m03PJ42J16l52o5K34K59O2l92J29J88M1l90K85
$$ 302 26 60 135 116 -17 -96 34 237 -166 -159 -17 99 -253 -318 -84 175 237 -155 -26 162 203 -187 98
2672I8J55n61K50J96J38m18j96M91j97J40j28K31l40P0K53k79J40q0J18R8l33
$$ 98 253 -308 -58 138 276 -142 -338 153 -44 96 -32 199 -141 -71 182 -97 43 -37 81 179 -154
2693a54L01L7Pm51K42p7K16m11K40L82j35m50K46J12l52J16J22J37j57o2J7J86
$$ -154 147 184 191 -260 -18 -95 121 -290 -50 332 197 -253 -7 105 -247 -131 -9 128 -29 -91 -74 112
2715A12n7k20pL85k60J56Q8jp7m94O01j28j92k41K68O9q1J73j7J64j73k20J33
$$ 112 55 -165 -172 213 -47 109 197 196 119 -375 226 98 -94 -335 -67 2 -79 94 77 241 68 -152 -19
2738a9J27l20m5L49J03l78J46J41j32j59Q1M7j18K31m00O42k12k59Q0L76l41p9
$$ -19 108 -212 -257 92 195 -183 -37 104 -28 -187 -106 -59 -177 54 -346 296 84 -175 -95 281 -60 -139
2760a39N7M03j64k21L87r4oj49q3J23k82Nj81K62j31K38L7j05o1N0L65O0l49q6
$$ -139 -82 321 157 -64 323 229 223 74 -9 114 -168 -163 -344 -82 -213 25 62 -43 -104 -54 311 371 22 -64
2784f4k1K48k42L01J5j0m31L47j38j34k4O2j03q0R6L35J59n19J06K8Q0Q5j2J08
$$ -64 -85 163 -79 222 237 227 -204 143 5 -129 -153 -91 -194 -274 -178 157 316 -203 -97 -69 11 96 84 192
2808A92k12l0j3K92K2m74K25N5r8MQ8J98O3l08O6J29l51q4J75K65l0m7O9Q2m97
$$ 192 -20 -50 -63 229 251 -223 2 57 -41 -37 51 249 312 4 70 199 -152 -236 -61 204 174 127 196 278 -219
2833b19NK74k5K10k85K77r1k18p1L55j46M1k86R1J25l54L96K3M92k64j62n8j35
$$ -219 -214 60 35 245 -40 237 146 -72 -143 212 66 107 -179 -88 37 -317 79 102 594 330 168 110 -25
2856b5p3PJ54k3l13L12r2J11j95j33K44l99K12L68l3k65J35K11K00l47p3J38O
$$ -25 -98 -91 63 40 -273 39 -53 58 -137 -270 -26 -425 -213 155 122 -143 -8 203 403 56 -17 121 127
2879A27k38L2L4j09o1L11J24k38J08k22J43j38K10K1J3k80J52R5j23J55m1JJ1
$$ 127 -111 -79 -45 -154 -215 96 220 -18 90 -132 11 -127 83 104 117 -163 -11 84 -39 116 75 76 87
2902H7l86R5L00k40L2P3Q1J82j73j32m0J92j1m45L25J87j18K24k18P0m0k73M01
$$ 87 -299 -204 96 -144 -112 -39 42 224 51 -81 -121 71 60 -385 -60 127 9 233 15 85 45 -228 173
2925A73k16R8k74J70J76j16K68j79m6OL2p3q0J78k86M64k16Jn6J33m65L29K4k4
$$ 173 -43 55 -219 -49 127 11 279 100 54 60 92 19 -61 117 -169 295 79 80 24 157 -308 21 45 21
2949B1J40k55L87l77j19k72L89M0j42Q7j72L74n2K14K0J27k33J78k83o7q0k7L51
$$ 21 161 -94 293 -84 -203 -475 -86 -46 -188 -101 -273 101 49 263 283 410 177 355 72 5 -75 -102 249
2972B49l3j24j42P0J3j26k20O13p32L89K04k39L38k35K7R3K5r6j12Q7j23K60j79
$$ 249 216 92 -50 20 33 -93 -313 300 -432 -43 161 -78 260 25 52 145 170 74 -38 49 -74 186 7
2995Gj63q1O9Q3kj9J34K8ok9K00j44l30K04P2J27l76k6M61j16j31q6L78k58j20
$$ 7 -156 -237 -168 -85 -87 -106 28 56 50 21 221 77 -253 -49 23 150 -226 -252 209 93 -38 -124 254 -4 -124
3020a24Q0j5J25j01k4J01j00j44J19l0P3K32j21r0q7K49k22K1Q2J31n5j00K28
$$ -124 -44 -59 66 -35 -59 42 -58 -202 -83 -113 -40 192 71 -19 -106 143 -79 -58 24 155 100 0 228
3043B28l85J67n6k64L21N4L9Q7n9n0m4l49M79l4l03n0K21K4j05N2k29K04k92L09
$$ 228 -157 10 -46 -310 11 65 104 191 132 82 38 -311 168 134 -169 -219 2 26 -79 -27 -256 -52 -344 -35
3067c5j74J83j9P0K25k66J93j62k0J7L3N0p1O9J54k46J09n7l01K06k85M86j91
$$ -35 -209 -26 -45 25 250 -16 177 15 -5 12 45 95 24 93 247 1 110 53 -248 -42 -327 159 -32
3090c2n4p1L18q9j16J38O3Nj11l2n57L32J34Q8oO2k00k8J8L32l47K32l44M18j18
$$ -32 -86 -157 161 72 -44 94 157 162 51 19 -538 -206 -72 16 10 72 -128 -156 -138 194 -153 79 -265 153 35
3115C5Qj33J53q1L0j0R3k35K51k9j60j78M61k20N0j40j61L57J2k38M46k56k1J36
$$ 35 43 -90 63 -18 12 2 95 -140 111 82 -78 -256 205 -15 35 -105 -266 91 103 -135 311 55 34 170
3139A70k52l5o5J84R0M1l02K25J1J63o09M72j30K5M1J12m12Q8M8j00L78Mj36r9
$$ 170 -82 -117 -182 2 92 133 -169 56 67 230 -379 93 -37 -12 29 141 -271 -183 -135 -235 143 147 11 -88
3163h8M0K47j74J31j84p2J56j51P3M6o9p6JJ73j7k4P4R1k80M5n5P2o5R8N4j87
$$ -88 -48 199 25 156 -28 -100 56 -95 -22 24 -45 -121 -120 53 36 12 86 177 -103 -58 -113 -41 -106 -8 46 -141
3189a41q5M99m04N6k4N4L10m65J39j32K88k82K43J7O3j80M6n0r2M8L3P9M9k02
$$ -141 -226 273 -131 -75 -99 -45 265 -200 -61 -193 95 -187 56 73 136 -44 2 -48 -140 -92 -59 20 69 -133
3213a33P3L00k48N8k25L91j10L3j45j1J50j21l5N7J81m14J36Q0P4l1M2o5J09O1
$$ -133 -60 240 -8 50 -175 216 106 139 -6 -17 133 12 -23 34 215 -199 -63 17 91 60 102 37 146 207
3237B07k23J19o3n1k6r7j6K57m38K33L5q2j03o2J20M45j2l95K65m5j71qL17mP
$$ 207 -16 103 40 -11 -37 -134 -150 107 -331 -98 -63 -145 -248 -310 -190 255 243 -152 113 68 -103 -111 206 202 209
3262B09l67K27j4l4L3n3K0M9k31N07l10o0l0J47j2l0k6J95r8j64R6J61K9K5k29
$$ 209 -158 69 55 21 54 1 21 70 -161 346 36 -24 -54 93 81 51 25 220 122 -42 54 215 244 269 40
3287D0k4L10k94J26j69J32K84m20j14Lo8M41k15J43p7k8k8Jj11J7k85N19m50K77
$$ 40 16 326 32 158 -11 121 405 -15 -129 -126 -194 247 32 175 98 70 42 43 -68 -51 -336 183 -267 10
3311A0j10K06J5j24K47l87K5j58L26J27k72J31J18k01Q9K4j13j11L65l84J72p6
$$ 10 -100 106 121 -3 244 -143 -118 -276 50 177 -95 36 154 -47 42 66 -47 -158 207 -177 -5 -81
3333h1K0K09j86K78k39O5k41Q7J43J00j64K94k10L6j0n4q8k6qj71K06L14m14%
$$ -81 -61 148 -38 240 1 66 -175 -88 55 155 -9 285 75 111 101 47 -41 -67 -75 -246 -40 274 -140 -140
3357a40o2J64J0q3J14j32K68l48L36j04j22M83n39j42M47k62N0Q1k42k0L70j48
$$ -140 -202 -38 -28 -111 3 -129 139 -209 127 23 -99 384 -155 -297 150 -112 -62 19 -223 -243 127 -21
3379b1j66K18l5NJ65k27n9L9L9M3O8N9k29K09j35J77k95L00O9j94j49J37j5Mk35
$$ -21 -187 31 -4 1 166 -61 -120 -81 -42 1 69 128 -101 108 -27 150 -145 155 224 30 -119 18 3 7 -228
3404b28%K58j64K33K34k97K5MK42m97J75pK35l97K88k27N3j78K33k91N48k89p4
$$ -228 -228 30 -134 99 333 36 61 65 307 -190 -15 -22 213 -184 104 -123 -70 -248 -15 -306 242 -47 -121
3427a21K87j50oj09J84r6o5L4P2q2OM8J25l20K00Q3l67K50Nq3K20k21N5J00n6
$$ -121 166 16 10 -99 85 -11 -76 -42 30 -52 -46 2 127 -193 7 90 -277 -27 -22 -105 115 -106 -51 49 -7
3452gJ39k94L04k06K2L8J04j06m3K47m42J75p7J09J80m64P6L85l4l50J21K0K85
$$ -7 132 -162 142 -64 -42 -4 100 -6 -49 198 -244 -69 -146 -37 143 -321 -245 140 106 -244 -123 -103 182
3475A82j50j88J13J39N5j72r3L77m83M07j30o0k23K19M0k42K57O4m9K51k49J48
$$ 182 32 -156 -43 96 151 -21 -114 263 -220 187 57 -3 -226 -7 33 -209 48 112 63 314 65 213
3497B13n2j86K60k44K6%k71N8KJ46J76m2j7l83L31J6Q0k83K00K6J13j86O2n8N6
$$ 213 161 -25 235 -9 17 17 -254 -196 -194 -48 128 86 69 -314 17 33 113 -170 30 56 169 -17 45 -13 43
3522D3oK0%r2Q8J60j41j34L33k14J4M8l61J98M1kj81K80l49L16J19j49n6N9j95
$$ 43 37 57 57 -35 53 213 72 -62 271 57 71 119 -242 -44 -3 -5 -186 94 -255 61 180 31 -25 34 -161
3547a61M4L56j76K79j75j37J36j84n6L5r7M09k08k25K79J02j79l8K13k89N1nL0
$$ -161 -117 239 63 342 167 30 166 -18 -74 -39 -136 273 65 -160 119 221 42 4 217 -72 -21 -26 4
3570DL4kp5p9kN78n80P0j27L36k25J55nk42K56j90J09P6p5M5k43J25K34j03J39
$$ 4 38 36 -39 -118 -120 458 -122 -52 -179 157 -68 87 82 -160 96 -94 15 91 16 61 -182 -57 177 74 213
3595B13k69O4q1n8J26k76J56J7J0M1L72k52n3Ro7o1P0J98L5R6n24M14r0j31j50
$$ 213 -56 8 -73 -131 -5 -281 -125 -108 -98 -57 315 63 10 19 -48 -109 -39 159 194 290 -234 180 90 -41 -191
3620a91J91Rj99J5o0L24J69k37K94n41J23K70l20M1L93k17J44O4k40r0J14j14
$$ -191 0 9 -190 -175 -235 89 258 21 315 -226 -103 167 -153 -112 281 64 208 272 32 -58 56 -58
3642e8k4l33K35n8J57L31l01k07P21m93R9l31M03k07O8j09n1K58J9j71O4L9k62
$$ -58 -82 -415 -180 -238 -81 250 -51 -258 463 -30 69 -262 141 -66 2 -107 -158 100 119 -52 12 51 -211
3665b11J33N3Q0k17Q8j91L81k17J11J89q2P2j98L4L6k10K19j37j06k5M10k70M
$$ -211 -78 -25 55 -162 -74 -265 116 -101 10 199 117 189 -9 25 61 -149 70 -67 -173 -198 212 -58 -54
3688e4J70o4j89lp5L21j95k60M11m7K49m06Q6p2J04n2J05j99L60k22J81OJ3k31
$$ -54 116 52 -137 -140 -215 106 -89 -349 62 15 264 -142 -56 -128 -24 -76 29 -170 190 -32 149 155 168 -63
3712f3q1L71l90J79j54J57J14j53k87L06j4K8p5j72L84j45N8J3o1o2J80q0l38
$$ -63 -144 227 -163 16 -138 19 133 -20 -307 -1 -15 13 -62 -234 150 5 63 76 15 -47 133 53 -285
3735b85J71J34j7j3j06M4l2P7K00j05L1K00k73J36n3O5k8K7j60N2j57K81k06J17
$$ -285 -114 20 3 -10 -116 -72 -104 -27 173 68 99 299 26 162 109 174 146 173 13 65 -92 189 -17 100
3759A00k32j58L74N7l64L18j16J93k57q3J93K02k1Pk83j8p2r3L12j76K89m1k97
$$ 100 -132 -290 84 141 -223 95 -21 172 -85 -168 25 227 206 213 -70 -88 -160 -253 59 -117 172 131 -166
3782a66K57j53J0J65p1k15J48J97l32L52m23L62j87K6J13p6L7j41j26J72K79m68
$$ -166 91 -62 -52 113 42 -173 -25 172 -160 192 -231 131 -56 -30 83 7 44 -97 -223 -51 228 -240
3804b40K99L2o0j95N4o0J83o2j33K04J11k63O5P0K6k19K95j84K04j81K51l30J24
$$ -240 59 91 31 -164 -110 -170 13 -49 -182 22 133 -130 -65 5 31 -188 107 -77 127 -54 197 -133 -9
3827ipR3j36K8o2J2J84m9m91L62M57n05K51k25K50j79K14k58O5K62k43P5k2k54
$$ -9 -16 77 -59 -31 -93 -81 103 54 -437 -75 382 -123 128 -97 153 -26 188 -70 -5 257 14 89 67 -187
3851a87QK03j26L22m54K10M4j4p6J18n7M9l37L13J78rk93k2J26N5k0N3l56K37
$$ -187 -179 24 -102 220 -234 -24 20 6 -70 48 -9 40 -297 16 194 185 -108 -130 -4 51 31 84 -272 -35
3875c5P0p0Q6l2J87q2L9l25JM11j04j52J42k46K8J18r9K9k66M36J9k22J98o1P9
$$ -35 35 -35 51 19 206 124 163 -162 -161 250 146 -6 136 -110 -82 36 -63 -34 -300 136 155 -67 131 70 149
3900A49p2k50l8K49K83l45J32r7J16p1N3j75M4k34J57J13j55J58P7N5l04J04J9
$$ 149 77 -173 -211 38 321 -24 108 11 127 56 109 -66 -22 -256 -99 14 -141 17 94 149 -155 -51 -32
3923c2L7R8j67j95Q3K37PK44k38j18j78L48l9k42K31J8pn0m6L3J10j17J58k63
$$ -32 5 103 -64 -259 -176 61 68 312 74 -44 -222 126 87 -155 76 94 87 37 -9 24 134 17 175 -88
3947h8K01P0l6L8l31J09k6J7K10j53j54J04J13k00J70J71q0j46j35N32n04K13
$$ -88 113 183 147 185 -146 -37 -63 -46 164 11 -143 -39 74 -126 44 215 135 -11 -146 386 -118 95
3969I5J22r3o2K00l55J36N4k04K51L7k37K13j48N2n4j10K24N0N2k28L5j1q4j47
$$ 95 217 124 62 262 -93 43 97 -107 144 181 -56 157 9 61 7 -103 121 171 223 -5 30 19 -65 -212
3993b12L94j23j91M03j28j8p3j14l6M6j15J22L06k41J3N3o5J82l10L5j6k7J37
$$ -212 182 59 -132 271 143 125 52 -62 -98 -52 -167 -45 261 20 33 86 21 203 -107 -72 -88 -115 22
4016B2j26K98l87M46k05r4N6r1J92j63NJ24l9r1J43J09l87p6K7N32k06o2J05k97
$$ 22 -104 194 -193 253 48 -46 10 -81 111 -52 -47 77 38 -53 90 199 -188 -264 -237 295 89 27 132 -165
4040a65R3K49l98L56P0m56L85l04K2P1J11Jp5q5L8R5j19M7o1J48P4l37J33L53
$$ -165 -72 177 -221 135 205 -251 134 -170 -148 -77 34 35 -40 -125 -87 8 -111 -64 -125 23 97 -240 -107 246
4064B46Q4n04K14J55k40J87L8k01k8K85k21p7pJ29%j35M35k5j75m40L51k6J22
$$ 246 330 -174 40 195 -45 142 180 -21 -49 236 15 -62 -69 60 60 -75 360 335 160 -280 71 45 167
4087A67l78L52j91k88M54J23M0k51K11N4l46M5Nl45K66J07q3M4o8K20j90n7j9
$$ 167 -211 141 -50 -338 116 239 279 28 239 293 -53 -8 -3 -348 -82 25 -58 -14 -82 138 -52 -109 -128
4110a28J41j52K25QJ6k58J13l9r5p6qJ89K03j68k08K68K05k06l63M76k53j50J48
$$ -128 13 -139 86 94 110 -148 -35 -74 -169 -245 -253 -64 139 -29 -237 31 236 30 -333 143 -110 -260 -112
4133a12R5p8K97O9j92j91J60J78r1j51j44o2O2J05J33K6k32J67o5J7j08J2J04
$$ -112 -17 -95 202 271 79 -112 48 226 135 -16 -160 -222 -160 -55 78 104 -128 39 -26 -9 -117 -105 -1
4156aj06r8K62J47p2o4l55N51k03j14q2L75l30J37q3O3J3j72M9J86q8K70l00o1
$$ -1 -107 -205 57 204 132 68 -287 264 61 -53 -135 240 -90 47 -36 27 40 -132 -83 103 15 285 -15 -76
4180g6K19J96n33K92P6J1k45L5p2K3j10j22L28j63M30j96k71K47l70J41J53k1
$$ -76 143 339 -194 98 174 185 -60 -25 -97 -74 -184 -306 22 -141 289 93 -178 69 -301 -160 -7 -28
4202b8K69j22r5p4N0k74K52l28K09J76o5j7J74j11n0p5K8J74l30L97l34K29j50
$$ -28 241 119 24 -50 0 -274 -22 -350 -141 35 -30 -47 127 16 -34 -109 -81 93 -237 160 -174 55 -95
4225i5K08n7J01mj50j13j94K59J91l3o0M9k5j97P8l8q6Q5K06m1m53M34j3K02k90
$$ -95 113 56 157 153 3 -110 -304 -45 146 113 53 102 77 -120 -42 -80 -166 -81 125 84 -369 65 52 254 -36
4250c6r9R4Q9N6n1O4j93jJ31k52L48q6m0J43m9J5j50K42k02m19N42k46J17O4r7
$$ -36 -135 -41 48 104 53 117 -76 -77 54 -198 150 64 24 167 118 133 -17 225 23 -396 146 -100 17 81 -16
4275a6J08o5j41nN3J05j03o7L06l84J87K5O2k12k5L28J42l49J07J88k12K6r5l1
$$ -16 92 27 -114 -119 -66 39 -64 -131 175 -209 -22 3 65 -147 -172 156 298 -51 56 244 32 58 -37 -68
4299f8m3K3O9o9O2J40ln0j77L8M1J41j84M07j21j59j81K4k2J96M6n25M47l6M4
$$ -68 -111 -88 -19 -88 -26 114 111 61 -116 -78 -37 104 -80 327 206 47 -134 -110 -132 64 110 -415 32 -4 40
4324D0j85J98NQ3l15J4J59J31j13k7P0L4j57J05N3jR2m52J44p6P9K25m1r9L9m2
$$ 40 -145 53 58 141 -174 -160 -1 130 17 -10 60 94 -63 42 95 94 186 -266 -122 -198 -119 106 65 -34 5 -37
4350c7l7jJ18l0j08J01J14J05k4j34M4k23k9K82lk76J20k6n8K52l17J31l2M3J05
$$ -37 -74 -75 43 13 -95 6 120 225 201 67 111 -112 -141 141 138 -138 -18 -44 -102 150 -167 -36 -68 -25 80
4375H0k92L35mj79J01j89K94p9O2pj16J2j19l6N8M6M1KJ37o2j31k83K45J44K02
$$ 80 -212 123 119 -60 41 -148 146 67 129 122 6 18 -101 -137 -79 -33 8 10 147 85 -46 -329 -84 60 262
4400B62j46l05K13P3L9r1j4j23p3J05Q7J28j19J02K48k64j71Q1R4J06l16M5p8
$$ 262 116 -189 24 97 136 45 31 -92 -165 -60 27 155 36 138 386 122 -49 32 126 232 -84 -39 -117
4423a17M26j31L6j43j0j02M4Q5J05k07q3J21O8P5j40n5k28M05j50J62j37l6K55
$$ -117 309 178 214 71 61 -41 3 88 193 -14 -97 24 92 167 27 -28 -256 149 -1 161 24 -12 243
4446B43l90J87K61q4j62k84J95L7k20K31J00j95J65k82J80K66k69r4L23j17j70
$$ 243 -147 40 301 217 55 -229 -34 3 -217 14 114 -81 84 -198 -18 248 -21 -115 208 91 -79
4467g9K28j72J21o6k28J38O7K00j05j21j13J48p2j9R9M2m0J2J50j62J05K7k78
$$ -79 149 -23 98 32 -196 -58 9 209 104 -17 -130 18 -54 -73 26 68 28 40 190 28 133 160 -118
4490a18J80n0J07j27o1m8L2J7L4J6J18j62j5o2O3K77l84J63j53N18l25k0J38l18
$$ -118 62 12 119 -8 -69 -117 -85 -68 -34 -18 100 -62 -77 -139 -76 201 -183 -20 -173 345 20 0 138 -180
4514a80M38j85L7j34o0J64n8j76P5R1O4O7k75J13l7K12J52k59l35K75p3J05M0
$$ -180 258 73 110 -24 -84 80 22 -154 -79 12 76 143 -132 -19 -56 156 308 49 -286 -11 -84 21 61
4537F1k5N9m14K04J77n6n5J72K9k72M67l08k43R7K26k08r8J43o5K10j92JK44P2
$$ 61 36 95 -319 -115 62 6 -49 123 152 -120 347 39 -204 -107 119 -89 -187 -44 -109 101 -91 -90 154 226
4561B26l52M6K0j24L46j65O6l28K07M1O8n2j45k37O53m37N74k18p7p2k9Q5r3O8
$$ 226 -126 -80 -60 -184 162 -3 63 -265 -58 -17 51 -1 -146 -383 270 -167 407 189 112 40 11 96 3 71
4585G1Q6m13R0J31j52J08k94K58K74K02M9l63j24N4j03J40j97L33j94k06K30j10
$$ 71 157 -256 -166 -35 -187 -79 -373 -115 159 361 410 47 -77 -23 -126 14 -183 150 -44 -250 -20 -130
4607a30j26J99J2j7l4j7j28K68p4k4N7o0l4M7k0R6r7K36j07j44K77q1j05l18L44
$$ -130 -256 -57 -45 -62 -96 -113 -241 27 -47 -71 -14 -74 -108 -61 -81 15 -82 154 47 -97 180 99 -6 -324 20
4632B0p9j3J04J84k50n9j38PK77N1K13m56Q5k81K27K97k79q7J20j20K36K65l64
$$ 20 -59 -72 32 216 -34 -93 -231 -224 53 104 317 -139 -54 -335 -108 189 -90 -177 -57 -177 59 324 -40
4655d0J84p9j65L5l22M88J20Jj80oj05o5j03L22L41n90L3Q0m8J70lmk74N43m32
$$ -40 144 65 -100 -65 -387 101 221 222 42 36 -69 -134 -237 85 426 -164 -131 -51 -99 71 68 64 -210 333 -99
4680i9o%m1L32j64p6K9j46L72Q6j03j64j42O4q3J91j50O3J01J31k01j23M48r3
$$ -99 -105 -105 -146 186 22 -54 -25 -171 201 287 184 20 -122 -58 -141 50 -100 -37 64 195 -6 -129 319 226
4704B26j28J30j98j57K52j62N7K11j73j89K67j19l36K12R9L0J8l7j42ql0M6o8
$$ 226 98 228 30 -127 125 -37 20 231 58 -131 136 17 -319 -107 -8 22 40 3 -139 -147 -177 -131 -199
4727a99O6K99k74K7J26j71J15N1N8l31K73o38O09j34J30p2J63j29m17O07j87m8
$$ -199 -133 166 -108 -81 45 -126 -11 40 98 -233 40 -598 11 -123 7 -65 98 -31 -448 159 -28 -76
4749g6J4o5J97L11j71j50n0n9o8K02l19L10j21J62J0n7pJ74o3l19j96J34K50j27
$$ -76 -62 -127 70 381 210 60 10 -49 -117 85 -234 76 -45 117 127 70 63 237 174 -145 -341 -207 43 -84
4773h4k50Q6L52l74K2K14J32k05K01K32j87J42m07K69nnj69j26R5J42rm0l58O91
$$ -84 -334 -248 104 -270 -248 -34 98 -107 94 326 139 281 -126 143 138 133 -36 -162 -67 75 66 26 -332 359
4797C59n96M50o5j76N5l0j1nL09m89J56J12l3k88L04r1j92L27J05m0r2J85l0k26
$$ 359 -237 213 148 -28 27 -3 -14 -19 290 -199 -43 69 36 -252 52 -39 -231 96 201 161 69 254 224 -2
4821bJ24J58l46j20o3K77K8k24O2K14k18r9K71P1k37M2K76l09j36J55K55j38N8
$$ -2 122 280 -66 -186 -249 28 56 -168 -106 108 -110 -209 62 133 -104 -62 214 -95 -231 -76 179 41 99
4844I9k84J69j44J65k8K8r0L01l26L10k39m0N5K49m0qqn3l87J43O2J9J51k90J74
$$ 99 -185 -16 -160 5 -23 5 -85 216 -110 200 -39 -79 -24 225 185 177 169 116 -271 -128 -66 -47 104 -186 -12
4869a2k19L20J39l18M12l65L7m4j60l1K84j27J86L7j12mK44l29j75K13p3M64n82
$$ -12 -231 89 228 -90 322 -43 -6 -50 -210 -241 43 -84 102 139 27 23 267 -62 -237 -24 -97 367 -215
4892b15K92n1k4LJ03l0l73L2j0K22Q4J9l19L35j07L2L2j70K10l93K64M3k35J90
$$ -215 77 26 2 5 108 78 -295 -263 -273 -51 33 52 -267 68 -39 -7 25 -145 65 -328 -64 -21 -256 -66
4916f6l6J69R3q7M2k14M1J91k99L22j90R2j76L9P7j53J14j70J57q2RK86n9j44
$$ -66 -102 67 160 73 115 -99 -58 133 -166 156 -34 58 -118 -79 -2 -155 -41 -211 -54 -136 -127 159 100 -44
4940d4L10n72P4M05n7q4Q7l4k92l4K22j82J80j25J56k15K14J08k42M95k44o4J16
$$ -44 266 -306 -232 173 116 32 119 85 -207 -241 -19 -201 -21 -146 10 -205 9 117 -125 370 126 62 178
4963A78m21K9mK05m0l54M27k20R5L42l3n03K69o8K84k21o0P3j14J19J68k25K08
$$ 178 -243 -214 -218 -13 -53 -407 20 -200 -105 237 204 -299 -30 -98 186 -35 -95 -22 -136 -17 151 -74 134
4986A34k83K02J41j00L1k04K0j16m8L52l80K38Q9PJ23j54L8j22j26L36j09m9o0
$$ 134 -149 53 194 94 125 -79 -59 -175 -223 129 -251 -13 76 83 206 52 90 -32 -158 178 69 20 -40
5009d0M6j20J35J4p1k2j00J17Q8j10K24m0j20L9j14L77m9j64J09j30jl05J50R0
$$ -40 6 -114 21 35 -36 -58 -158 -41 47 -63 161 121 1 40 -74 303 254 90 199 69 68 -237 -87 3
5033Cq2K02j70%J04j77K09j91j45K54O2j01K67k88k11Q9J54J37k01r6K02J85m90
$$ 3 -79 123 -47 -47 57 -120 89 -102 -247 7 69 -32 235 -53 -264 -175 -21 116 -85 -181 21 206 -284
5056b84M45j15Lr0J72p6j30q0Q7KJ26l78L56k03R2K8K91j51M3j25o9R7m37M68
$$ -284 161 46 49 -41 131 55 -75 -155 -68 -66 60 -318 38 -165 -73 -45 246 95 138 13 -56 41 -396 72
5080G2j54j36r2J78j53J83O8J02l6j4J54k5o2k64K79N7Q1k14nq3J3P9P9j48j78
$$ 72 -82 -218 -310 -132 -285 -102 -34 68 32 18 172 147 85 -179 100 157 238 24 19 -64 -51 28 107 -41 -219
5105b19K37j78J79J49l10K74l5l1j46K13k50J08J40q8O2j26K93k71J71j77K53
$$ -219 18 -160 19 168 -142 132 97 66 -80 133 -117 -9 131 43 105 -21 272 1 172 -5 248
5126B48m17L21k36M2J96J50n68J74N9p0J62j27m5J03p6k40N94k26j1l9Q5j11J79
$$ 248 -169 152 -84 -42 154 304 -264 -90 -31 -101 61 -66 -111 -8 -84 -324 270 44 33 -6 79 -32 147
5149A47k11r2J71q7j62N7J12K90j85J37j45j4L2j64K20l88J70J85l0p7O1L0k18
$$ 147 -64 -156 15 -72 -234 -177 -65 225 40 177 32 18 50 -114 106 -282 -112 73 43 -34 27 57 -161
5172a61J95q8J00r2K3J03k68J46m8J95O9k2O8l6r6P4l0j43J60l2k65P7J00l7j25
$$ -161 34 -54 46 -46 -23 80 -188 -42 -90 105 174 152 220 184 88 162 132 -11 149 117 -148 -71 29 -8 -133
5197a33j73L80j49R5n8L0j93K09j78N1k52M18r8k19K50j84K43L6k17m5MP0J76
$$ -133 -306 74 -75 20 -38 -8 -201 8 -170 -119 -371 47 -51 -270 -20 -204 39 75 -142 -187 -183 -113 63
5220F3N9J06j18k51L23l15L7L63j52m5j90j11P5R6K98q2j94J96k54j17J70K12
$$ 63 122 228 110 -141 182 -133 -96 267 115 70 -120 -231 -156 -60 238 156 -38 158 -96 -213 -43 169
5242A69l5K30k15p2l6K76l25p9Q4%rJ00r4K6j63Q4k0J0L4K4j55R5R6j82L62L7
$$ 169 134 364 149 77 41 317 -8 -87 -3 -3 -12 88 -6 20 -143 -59 -79 -69 -35 -11 -166 -71 25 -157 205 242
5268B42l81K23j62K43k81j05K25R7L2r6j93J68j55M13m31K66J89k11k44LK41r3
$$ 242 -139 84 -78 165 -116 -221 4 101 133 37 -156 12 -143 270 -161 105 294 83 -161 -158 83 -10
5290a0j33j68K42R5J53j5k29j37K25K4J98k11K2k92M59k22M2k33L0j17K05K60
$$ -10 -143 -311 -69 26 179 164 -65 -202 23 47 245 34 56 -236 223 1 43 -190 -160 -277 -72 188
5312A88l80N3L86m5J8l18k99N72n4q9N7p1Lk0J37j16k28L67j03j21OP1p2R4k40
$$ 188 -192 -139 247 202 220 -98 -397 175 121 32 89 18 21 1 138 22 -206 161 58 -63 -57 14 -58 36 -204
5337b04L15Kj27l77Q09n21M5k4J85j45J46O5k37N2K51j42k58K05j07j82K54k36
$$ -204 111 113 -14 -391 418 -103 -58 -82 103 -42 104 169 -68 -16 235 93 -165 40 -67 -249 5 -231
5359b31J61Q9R3p1P2j98K92k54r4K82k86l3O5J93m2L4J33j56Kq3N8J34l15J46
$$ -231 -70 19 112 41 113 -85 207 -47 -141 141 -145 -178 -113 80 38 72 205 49 51 -32 26 160 -155 -9
5383ij52L19k99L96l82K09k34P5Mj0K71L9l45r3K03J13k7j44L0J95Q8O7l39N7
$$ -9 -161 158 -141 255 -127 82 -152 -77 -73 -83 188 227 -118 -211 -8 105 78 -66 -36 159 247 314 -25 32
5407C2r9Q9J05k78K32j0N0j14j95k3K90k31P8j56K52k40L41o22O08k06P1N3l0
$$ 32 -67 22 127 -151 81 71 121 7 -188 -211 79 -152 -74 -230 22 -218 123 -499 109 -97 -26 27 -3
5430cj35R8P6J8k07K35N1P3j55k15J31L78l01L4j71J10O3J84k83j2m00O56l25
$$ -3 -138 -40 36 54 -153 82 133 206 51 -164 -33 345 44 78 -93 17 80 264 -19 -31 -431 225 -100
5453a00j67K36m0J13q4j41J29K38R3k68N0l95K45J16K1RJ0j02j36J24j86K57l7
$$ -100 -267 -31 -71 42 -42 -183 -54 184 277 9 59 -336 -91 25 46 55 65 -37 -173 -49 -235 22 -15
5476a5J27Q8P2k05j3J89m24J69r9J05K03k16J93N7m15J28J76p0j28R7k4j29L94
$$ -15 112 200 272 67 54 243 -181 -12 -111 -6 197 -19 174 231 -184 -56 120 50 -78 19 -5 -134 260
5499B60l94K85k02J03O8j4l66K37lk23M21J69j96j68J57j88J68m31K90M3j42J78
$$ 260 -134 151 -51 52 120 106 -260 -23 -26 -249 172 341 145 -23 134 -54 114 -317 -27 16 -126 52
5521E2J28j29K24j63J25o8j88J98r0k33K18l23L26J45k9n4k26j76J73J60pq4N
$$ 52 180 51 275 112 237 169 -19 179 89 -144 74 -249 77 222 193 139 -87 -263 -90 70 63 -21 -16
5544a6J22n2J04J77l65j3J06J87k16J13n3J2k52J50k24K76K53j55k47J20oj49
$$ -16 106 54 158 335 -30 -43 63 250 34 147 94 106 -146 4 -220 56 309 154 -93 27 21 -128
5566a28K89j13R0l80K45J05K6k24L79m62k5K68K1J30j51k43n1N14j01nj37k7k79
$$ -128 161 48 138 -242 3 108 134 -90 289 -173 -198 70 91 221 70 -173 -224 290 189 184 47 20 -259
5589b59K74j95K45Q9j21j60M2N9k64M38k15K41j69K09l88L59j14j54L4J14j67
$$ -259 15 -180 65 154 33 -127 -85 -26 -290 148 -67 174 5 214 -174 185 71 -83 -49 65 -102
5610a02m4o2M49l41Q8l1j46K85Kj22K18j65j32K60j20q3J3Pj83L71m08J49N0n
$$ -102 -146 -208 241 -100 -12 -43 -189 96 98 -24 194 29 -103 157 37 -46 -33 -26 -209 162 -246 -97 -47 -52
5634e2rk38J60K80l25L64j47k11j1M00r0j52j9L4n2K41l46K80O3n4j67J56j43
$$ -52 -61 -299 -139 141 -184 180 33 -178 -189 211 121 -31 -50 -16 -68 173 -173 107 170 116 -51 105 -38
5657c8K7j05n7k83N41j30J46K2l68K68J5j14O6R4j63o7K03K29k71l3J18k77O8
$$ -38 -11 -116 -173 -456 85 -45 101 123 -245 23 38 -76 -10 84 -79 -146 57 286 15 -18 100 -177 -109
5680a09Nl5n5k3J61L49l38J51K06m04R7MJ4j48n4M37m45K98p0r1J08N0l54J12
$$ -109 -104 -139 -194 -217 -56 293 -45 106 312 -92 5 9 23 -125 -179 258 -187 111 41 -50 58 108 -246 -134
5704a34r6J05j80K53N3N5R7K8q1j54k78J29J67R3K43l58K75j29J55k82m5o7K37
$$ -134 -230 -125 -305 -52 1 56 153 181 100 -54 -332 -203 -36 57 300 -58 217 88 243 -39 -84 -151 86
5727H6k8J03j08r9K62l88J31M9j33K35j06k42L09k54L08j17J58l6J37k87J74j68
$$ 86 58 161 53 -46 216 -172 -41 8 -125 110 4 -238 71 -183 125 8 166 130 267 -20 154 -14
5749a4j4Q1Jq8l5q8K9j36J50J82l45L65k06K17%%j40P1J4M9k8nJ63j87l51L36
$$ -14 -28 53 54 -34 -69 -157 -128 -264 -114 68 -277 88 -118 99 99 99 -41 30 44 93 65 60 223 36 -315 21
5775B1j8j69K24KJ5n6o4k8J21l0J73Kl31K54k62L67j82O5J23P5l69k8K29k63j33
$$ 21 3 -166 58 60 75 19 -45 -73 48 18 191 193 -138 116 -146 221 39 104 227 302 -67 -95 134 -129 -262
5800b62J84J1P8k19J60K12J9j8L6k66Q5p9J03M0l7J45k03j48J70K02k69K22j23
$$ -262 -78 -67 11 -208 -48 164 183 165 201 -65 20 -59 44 84 47 192 -11 -159 11 213 -56 166 43
5823D3j05K55l23K05k17J31J06q3L9R6L9P2q3k29k9J02R5j85L2O2l64M00l06J28
$$ 43 -62 193 -130 75 -142 -11 95 12 51 147 186 258 175 -54 -83 19 114 -71 -39 23 -341 59 -247 -119
5847a19J57r0l76L28L33rl94j2P3K78k38K87k86J16p5k0K55l40L72j88k67J69
$$ -119 38 -52 -428 -100 233 224 -170 -182 -109 169 -69 218 -68 48 -27 -47 208 -132 240 52 -215 -46
5869d6m7K30P0k40J80k0k51N09m92k1Q2jR8P4j05l0L5j03K10j36O6J8k36K08J1
$$ -46 -93 137 207 -33 147 127 -124 385 -107 -128 -46 -47 51 125 20 -10 25 -78 132 -4 62 80 -156 52 63
5894F3j47L15n4l30J68K6j30j00J05j48M49r2m4j73K77k80K6l3L9r2R5M2R0r7
$$ 63 -84 231 177 -153 15 41 -89 -189 -84 -232 217 125 81 -92 185 -95 -69 -102 -63 -155 -60 -18 72 -25
5918b5j84L07j46m5J80j7l45L49m7j33M11k44Lk25l6J40Ok51L41l51L55p4P6r2
$$ -25 -209 98 -48 -93 87 70 -275 74 27 -106 305 61 64 -161 -197 -57 -51 -302 39 -312 43 -31 45 -47
5942d7j70L28j63K02k23J15n5K35J54l28n6j95J65J71k34J4R1P1P3k11K15r1k29
$$ -47 -217 111 -52 150 -73 42 -13 222 376 48 -8 -203 -38 133 -101 -87 4 75 148 -63 152 61 -168
5965a68K42l20K61m2K54k01L3oJ46o5j3k87J92M0l4J51k94K04j52M6J05j27Q9
$$ -168 74 -246 15 -27 227 26 59 53 199 134 121 -166 26 66 32 183 -111 93 -59 -13 92 -35 54
5988E4K06k26l94O38j41j80O8j10N2l4j43L25j92J96k8J60j08O1j49j97L26Rj05
$$ 54 260 34 -360 278 137 -43 25 -85 -33 -67 -210 115 -77 119 91 251 143 204 55 -142 184 193 88
6011H8K41o17O5J9m9K49k7o7K3J43l66J21K56j29j60K09q9j1J91k21J6j83J93
$$ 88 329 -288 -223 -204 -253 -4 -31 -98 -75 68 -298 -177 79 -50 -210 -1 -90 -101 90 -131 -115 -298 -105
6034a05O6J92k82J20K13J58l02K7l91J78m2J11l5J18K2J99l40K53j41J54k50m5
$$ -105 -39 153 -129 -9 204 362 60 87 -304 -126 -168 -57 -92 26 48 247 -93 160 19 173 -77 -122
6056a22J32J83k36mp7L5K39k01K20k85j10K21O5p0L4M4k7J12k17m2K59j72J78
$$ -122 10 193 -43 -47 -124 -89 150 -51 169 -116 -226 -5 60 -10 24 68 41 153 -64 -106 153 -19 159
6079A59k15K03j43M9K40l06L0Pr1J01p5p5k4L64o0l22L99l22J80P9k27J78o7J17
$$ 159 -56 147 4 53 293 -13 17 24 -67 34 -41 -116 -140 224 164 -158 241 -81 99 178 -49 129 62 179
6103A79q2q7j16L12k72J7k06M04j30K30l37Q7o5J33j52rJ76j8k16R4R8J24j12
$$ 179 97 10 -106 206 -66 -49 -255 149 19 249 -88 -1 -66 67 -85 -94 82 64 -152 -58 40 164 52
6126E2j58k00N50k19n3no9J44K4p2j20J06O2J9j92rK22L08n18J86q1J20j25r4
$$ 52 -106 -306 244 25 -28 -33 -102 42 66 -6 -126 -20 42 61 -131 -140 82 390 -128 58 -23 97 -28 -122
6150a22K56k9j39J43j61l4o1J08k67J99p2K96k8K0K5m7l09R4j82K33R7m3q4j07
$$ -122 134 105 -34 109 -52 -86 -147 -39 -306 -107 -179 117 89 109 134 87 -222 -128 -310 -77 20 -23 -107 -214
6174b14K63r8P9N9j18J2K57m07K53M9j04l76N27r5k01K32J3j30J74J08m01K46
$$ -214 49 -49 30 89 -29 -17 240 -167 86 135 31 -345 182 87 -114 118 131 1 175 283 -118 128
6196A28k22P1k65M98p0j3j4l82K48K55k06l09K95j82J29J65J0Q0n35M21k64K72
$$ 128 -94 -23 -288 210 140 127 113 -269 -21 234 28 -281 14 -168 -39 126 136 216 -319 102 -162 110
6218A10m3J19l81J28K28l9r5n1m7K41k89rp1J15J13n7j86K51K23k29M3rq5nJ02
$$ 110 67 186 -195 -67 161 122 27 -24 -71 170 -119 -128 -199 -84 29 -28 -214 37 260 31 74 65 -20 -25 77
6243G7j93j22J19o2M4L15k61j6J61K8p3p1j12j1K41j21J17k24o2M51l91K03J23
$$ 77 -116 -238 -119 -181 -137 178 -83 -99 62 90 17 -54 -166 -177 64 -57 60 -164 -226 225 -166 37 160
6266A60k36J33J98j34k65J37j77K88K0j70K66ro8k15L3J18j42K27j87oM0m0r0
$$ 160 -76 57 255 121 -144 -7 -184 104 124 -46 220 211 143 -72 -39 79 -63 164 -23 -29 11 -29 -119
6289a19L59k64J02j85L6q1J2J44K77k09Ok42J70j52J3J24J81q9m7P2p8L7Q3pj88
$$ -119 240 -24 78 -107 -71 -152 -140 4 281 72 78 -164 6 -146 -133 -9 172 83 36 108 30 67 150 143 -45
6314d5j07J01J79j01J4J17Jj27l4K28j39k13O9j18n8J88J17Q7j57r5L17j04K7
$$ -45 -152 -51 128 27 41 158 159 32 -2 226 87 -126 -57 -175 -233 -45 72 159 2 -93 224 120 147
6337A47k98P5K35n5L9j24j7k29K49j08N1J11m5l4k49L52P6k4l04M9J55j20R6k11
$$ 147 -151 -76 159 104 143 19 2 -227 22 -86 -35 76 31 -3 -252 100 176 152 -152 -103 52 -68 28 -183
6361a83M62j67l35K37j54k19K03M9J01j01K10K5l3j66L62k91mm3M4ol08M09k51
$$ -183 279 112 -223 14 -140 -359 -156 -107 -6 -107 103 128 95 -71 291 0 -4 -47 -3 -9 -317 92 -159
6384a59K88k70Q7L1O7M5O2qj83J49j00j62o2M02k11J58l31M13k43l0M5M5j44L19
$$ -159 129 -141 -54 -23 44 89 151 143 -40 109 9 -153 -215 187 -24 134 -197 216 -27 -57 -12 33 -111 208
6408B08l95K73q6L81n11J65N0k37K07l07J60J64l02jJ09K56j2m18L80j62l01L66
$$ 208 -187 86 0 381 -130 35 85 -152 55 -252 -92 72 -230 -231 -122 134 122 -296 84 -78 -379 -13
6430a3j0K46r6m32L81r6j47J70r8M3j00K38j2j14P7j49L58m94J60oj3L31l08R2
$$ -13 -23 223 127 -305 76 -20 -167 3 -95 -52 -152 86 74 -40 37 -112 246 -248 -88 -94 -107 224 -84 8
6454Hj48L51j74L98k88k06J57k33K13K1j83P4l8J6k80L27K35k77o8N5P6k01J10
$$ 8 -140 211 37 435 147 -59 98 -135 78 99 -84 -10 -48 -32 -312 15 250 -27 -95 -40 36 -165 -55
6477e5q6J73j09K31k64J80l6l57M67P0K7q8o4J46q1n8p7j97K86K3j67R4r0j5L0
$$ -55 -141 32 -77 154 -110 70 34 -323 144 214 241 153 89 235 154 96 19 -178 108 131 -36 58 -32 -47 -17
6502a7j94K91KJ88k96J7Q8k77K17O7M6j96J90j40J2J71l37L44p4n3m05K31j21
$$ -17 -211 80 82 270 -26 -9 79 -198 19 86 132 -64 126 -14 -2 169 -168 176 102 49 -356 -125 -246
6525b46J12M4J50J09Q3l19L4R2o2j74L25J4j78p9K43j46j71J1j03J97J29l23K19
$$ -246 -134 -90 60 169 252 -67 -33 59 -3 -177 148 162 -16 -95 148 2 -169 -158 -261 -64 65 -258 -39
6548c9j5O3j71J21K91l13j2Q9K7q1Q6k1J36k69p2J03J35j12R5n3P1J40k2L3j37
$$ -39 -54 9 -162 -41 250 -63 -75 14 41 -40 46 25 161 -108 -180 -77 58 -54 41 -12 59 199 177 210 73
6573G3p4j47m2J55J9q5M1rQ3q1J66J0n7l13L67M4l6Q8p2m7k99P7J96j3J65n38
$$ 73 -1 -148 -190 -35 -16 -101 -60 -69 14 -67 99 109 52 -261 106 150 114 202 130 83 -216 -139 57 44 209 -329
6599c29M73j35L04l09j57M1P8J75k67K9L30k76J68m3k65L77j64k7P1K60l40O6
$$ -329 144 9 313 4 -153 -112 -34 141 -126 -97 233 -43 125 82 -183 194 30 3 74 334 -6 60
6621F0k17J30q6J11q8L10j66k81K85l60K81J25j38M6J87j58J48j14l4N7j52J20
$$ 60 -157 -27 -113 -2 -90 220 54 -227 58 -302 -21 104 -34 12 199 41 189 75 41 98 -54 66
6643F6j45J61L2p8j9M1l30K05k95K48J27k47O2M64j02j53Q9k61J45j57K22k29
$$ 66 -79 82 114 36 17 58 -272 -67 -362 -114 13 -234 -172 292 190 37 126 -135 10 -147 75 -154
6665a54q5K61p2n3P0j26K41n0m5qL21l33j32n4J38O1N3P7j31N8L1l32R7K55kL0
$$ -154 -239 22 -50 -103 -33 -159 82 32 -13 -21 300 -33 -165 -219 -81 -20 33 110 -21 37 68 -264 -167 88 86 116
6691A16J4j20m4p5K25m58R6L99P2k69L04k75J20Nj3o9j74N9J24j34K30m71N54
$$ 116 130 10 -34 -109 116 -342 -246 153 225 -44 260 -15 105 110 97 28 -146 -87 37 -97 133 -338 216
6714B16j15j27K63lm0m59K88j80L41k64oo1K49P1l09j5mK43n3k63K67KJ27l7k6
$$ 216 101 -26 237 234 194 -265 23 -157 184 -80 -86 -147 102 173 -136 -151 -155 88 35 -228 39 41 168 131 105
6739A05p6m1K60j43J7J74l45J6k53L73j6j6Q4j67L33q4l70L25j56j16K14j37N7
$$ 105 29 -12 248 105 122 296 -49 -33 -286 87 71 55 139 -28 305 221 -149 176 20 -96 118 -19 38
6762C8J12l41P1M7L20j07j6k28j53J68K17j09k32K19K8k26K58j77J59N4k19R4
$$ 38 150 -191 -120 -73 247 140 124 -104 -257 -89 128 19 -213 6 34 -192 66 -111 48 102 -117 -23
6784b3l02L74m5o9J69J7k39k56M80n6l5k46M17j32j06n3J35R9j34O6J2l29K69
$$ -23 -325 49 4 -65 104 121 -118 -374 106 50 15 -231 186 54 -52 -105 30 129 -5 61 73 -256 13
6807A3rNj37L0J46j79j40J00qJ26J54O8L1k81J46k39L96j17j03R1p2j80O8J70
$$ 13 4 9 -128 -98 48 -131 -271 -171 -179 -53 101 169 200 -81 65 -174 222 105 2 93 21 -159 -91 79
6831G9K0k18J43j53J13K18j54j80N0K30k90K2J46k00K51p7M0k6j9LL2J14k46K86
$$ 79 99 -119 24 -129 -16 202 48 -132 -82 148 -142 -120 26 -174 77 0 40 14 -5 -2 30 144 -102 184
6855A84k23J04OL5l78K25R3K94m15J00j32J50K49j28j36o9J27J98k17j78L47n1
$$ 184 -39 65 71 106 -272 -47 46 340 -75 25 -107 43 292 164 28 -41 86 284 67 -111 236 185
6877A85l18J38J5k95k3N28J3k13P6p0n3K9p9P0J07j01Q0j87K00j2p0K41l16P2
$$ 185 -133 5 20 -275 -298 230 243 30 106 36 -17 12 -67 3 110 9 89 -98 102 90 20 261 -55 17
6901A7J23k76J3k2M59j89j44j92J44K63m19J50L7OO2J96k4j97K13j2q1K0n1J01
$$ 17 140 -136 -123 -145 314 125 -19 -211 -67 196 -223 -73 -36 -30 32 228 204 7 220 208 127 147 96 197
6925A97N7m4r3j40k67L13k9j11J05J08j17O3J95j17k79J4Q0P7j3K87l20J8J83
$$ 197 254 210 117 -23 -290 23 -6 -117 -12 96 -21 42 237 120 -159 -145 -65 12 -1 286 -34 -16 167
6948A67j65J40m37K67j3o7M69l29l93M01O7p3J7j5J57k73j03M28j80M2q7Oj7M6
$$ 167 2 142 -295 -28 -41 -108 361 32 -361 40 107 34 51 36 193 -80 -183 245 65 107 20 26 9 55
6972E5lM4Rk9N0j01ol6j34K88m53M97j08j75p6P5P0Q3J57j85r2k95N1K84J55j19
$$ 55 52 96 105 76 126 25 19 -17 -151 137 -316 181 73 -102 -178 -103 -33 50 207 22 -70 -365 -314 -30 125 6
6998FL6J68k48n2N2m5K2r8K28k89L63j34M1k39K5M33n5j57k29J72o6j82K16J07
$$ 6 42 210 -38 -90 -38 -83 -61 -159 69 -220 143 9 50 -189 -164 269 214 57 -172 0 -66 -248 -32 75
7022G5j55L48k47J00k33L83j88l76N92m5k83k0R4J88j08j78m3N3j19J34K30j36
$$ 75 -80 268 21 121 -112 271 83 -293 299 254 -29 -49 45 233 125 -53 -96 -43 -162 -28 202 66
7044F6q7k21L84j69Q0k2Lj76J9K76j72J97j32j28n3K07j46J4m8K25q0J8O6J75
$$ 66 -21 -242 142 -27 53 31 34 -142 -123 153 -19 178 46 -82 -135 72 -74 -60 -108 117 37 55 121 296
7068B96l07k35K64j42O7OJ33j41P7Oj93O7RK42k04o1OJ62R9k52M06l54lN2o2o9
$$ 296 -11 -246 18 -124 -57 -51 82 -59 18 24 -169 -102 -93 149 -55 -116 -110 52 151 -101 305 -49 -52 0 -62 -131
7094a31k51J27M22J27m29j03J5L44m02L70k51m6J55r5m2K88j52J08m5K00m23K92
$$ -131 -382 -255 167 294 -135 -238 -223 121 -281 89 -162 -208 -53 -148 -190 98 -54 54 9 209 -214 78
7116G8n5K13j30k01J58r3P5l36K80m5J4J36o8J94k0k16r2p1K7K23j71n3K73J13
$$ 78 23 236 106 -95 63 -30 45 -291 -11 -56 -42 94 26 220 200 -16 -108 -179 -152 71 -100 -153 120 233
7140B33l49p4J23R3J32j11j73L08J3l28K26R5l25K16j72K13J38k62k56J96n1L2
$$ 233 -116 -190 -67 26 158 47 -126 182 195 -133 93 188 -137 79 -93 120 258 -4 -260 -64 -115 -83
7162h3J62k01o3K49j50l82L66JK38P5q4k07l0K52j64O2J3k04K04R9k56M3J09N7
$$ -83 79 -122 -185 64 -86 -468 -102 -101 137 212 128 -79 -109 143 -21 41 54 -150 54 153 -103 -60 49 106
7186A06nl16J38J56R1k60R1K98m48K84K4l5k19R8j26J65J8l82L97k06K84k30p0
$$ 106 101 -215 -77 79 170 -90 1 299 -149 135 159 124 -95 3 -123 42 60 -322 75 -131 153 -77 -147
7209a47R0k80M17r4l58K10m1k6J92M5k5k5j7k8j35L81l42O7l9L34j34QL9k50J65
$$ -147 -57 -337 80 -14 -372 -162 -203 -229 -37 8 -17 -42 -59 -87 -222 159 -183 -116 -155 179 45 53 92 -158 7
7234Gq9J79k66jj40K55K37P1m26J32n9N4j35J55M03m63J42J80J9k59J70L5j67
$$ 7 -82 97 -169 -170 -310 -55 182 253 -173 -41 -100 -46 -181 -26 377 -86 56 236 255 -4 166 201 34
7257C4mR2n07J85K94J02k60O3mJ18k18K96k70j90L42j1l31K02K05k07R9M0p2K6
$$ 34 30 122 -385 -200 94 196 -64 -1 -5 113 -105 191 -79 -269 73 62 -269 -67 138 -69 30 70 -2 24
7281B4N8p9K1J10l15K52O0l23K09m8k0n2O6n5K86q1k86J99K8K37m60j07K43k24
$$ 24 82 3 24 134 -181 71 131 -192 17 -31 -51 -103 -37 -92 194 113 -173 26 54 291 -169 -276 -33 -257
7305b57K47K91j96j11k68J95L80l31L35j12J84k86Kj28J51j07m3R8j36M9L1o0
$$ -257 -10 281 85 -26 -294 -99 281 -50 285 173 357 71 73 -55 96 -11 -54 44 -92 -43 -12 -72
7327g2P7K4k67L29O0l43L38L2k67J79o7J85j53j9k6j0J4K30k22k12M58m64K85
$$ -72 5 29 -238 91 151 -192 146 178 -89 90 23 208 55 36 10 0 14 244 22 -190 268 -196 89
7350H9Q9j87K35L9k14j74K59j29J81j84l1R1J04q2j07J31p7O9j97R9J89l91J68
$$ 89 178 -9 226 265 51 -123 136 7 188 4 -27 64 168 86 -21 110 33 102 -95 4 193 -198 -30
7373c0l7K47l21J30q2O9o7Q7r9J55J01k52J98j40P6j21Q0m8l78N99l39N2o6M62
$$ -30 -67 180 -141 -11 -93 -24 -91 -4 -103 52 153 -99 99 -41 35 -86 -6 -54 -432 167 -172 -120 -186 276
7397B76j08j03k89J84Q4k67Q5J47R3p4j38J14kL7o3j4J31j37J64K6n9r6o5L8j30
$$ 276 168 65 -224 -40 44 -223 -138 9 102 28 -110 4 2 39 -24 -38 93 -44 120 146 87 -9 -74 -36 -166
7422a66L01l5Q7j50j23J61k62M88j74k33k27K01J35n17M47P3N9j89o7K01O3j2
$$ -166 135 100 187 37 -86 75 -187 301 127 -106 -333 -132 3 -514 -67 6 65 -124 -191 10 73 61
7444F1j85j1J68q1O0k7J18l1l93L38Q3J99m53L46r3J5k28j9K34k08J51%r6J30
$$ 61 -124 -135 33 -48 12 -15 103 72 -321 17 100 299 -154 192 99 114 -114 -133 101 -107 44 44 -52 78
7468G8o2k85L48J11l34rK75l31L93O3l75k8K94L3j21j33J11j5J1K80m89K73j27
$$ 78 16 -269 79 190 -144 -153 122 -209 184 247 -128 -156 138 171 50 -83 28 13 24 304 -185 88 -39
7491c9m6K82j64p1j57J78R7N6j48J65O4j58P0k79%K31j87l6J70Oj21J1m2j1L10
$$ -39 -85 197 33 -38 -195 -17 80 136 -12 153 217 59 129 -150 -150 81 -106 -142 28 34 -87 -76 -118 -129 181
7516A81l96J90j95L39k51J27Q6l68K48J86k33j57L03O7j23j75K26j53L08M6m7
$$ 181 -215 -25 -220 119 -132 -5 81 -287 -39 147 -86 -243 60 127 4 -171 55 -98 210 256 209
7537B09j92j70K44j66r0K81k13j18lM6N4k58M91J5k3l64M42j8J10k71L0r4m8k30
$$ 209 17 -153 91 -75 -165 116 -97 -215 -218 -172 -118 -376 115 130 107 -257 185 167 277 6 36 -58 -106 -336
7561c36M53j65M12l31j97K23r6pR9p2k89L36L6k91K17q2M2J73k36M0J55M1j37
$$ -336 117 -48 364 33 -164 59 -37 -44 55 -17 -306 30 66 -225 -8 -90 -48 125 -111 -71 84 125 -12
7584a2O1l0J27j98pR2J54j9K3j0j48P7l1o2j8j84K65l11J28J1J93k3j69N4q1Q6
$$ -12 49 19 146 -52 -59 33 187 168 191 181 33 110 79 17 -1 -185 80 -231 -103 -92 101 78 -91 -37 -118 -32
7610c2l2j5J2K17Q7l64J9m4K82j69j35J22j60QK74L3J70j81j16o1M4K03m23L55
$$ -32 -64 -79 -67 150 237 -127 -108 -152 130 -39 -174 -52 -212 -204 70 103 273 92 -24 -85 -41 162 -261 94
7634I4k61L72k59O6j28K31k44K80j57jj27J20o1L3m2K39j14R5ll66K82k75J54
$$ 94 -167 205 -54 12 -116 115 -129 151 -6 -7 -134 -14 -75 -42 -84 155 41 136 133 -233 49 -226 -72
7657g2K02kj10J1k39K74P3o1j62J26QJ25j64N1L6R3j48j0j35O0K84m47l6K52K31
$$ -72 130 128 18 29 -210 64 137 76 -86 40 48 173 9 60 96 189 41 31 -104 -44 240 -207 -243 9 240
7682B40l49K1j8ON0J48r9j21K7j23L88J27j01o1J4j65j81J71L01j61p6O5k1L1
$$ 240 -109 -88 -106 -100 -50 98 -1 -122 -95 -218 170 297 196 135 149 -16 -197 -26 275 114 38 103 82 113
7706A13p3q1P5k9j73K16q4Q9j37P5L3m3Q9j41J6Q6L4k32K39r2P9N5k03J59j8K8
$$ 113 40 -41 34 5 -168 48 -36 53 -84 -9 24 -19 70 -71 -55 31 65 -167 72 -20 59 114 -89 70 52 80
7732H0j08j07J59J9%M4K3k01J00k17R1L4L9j22M52n27K36k50Q8K24K4J09k57J9
$$ 80 -28 -135 24 43 43 87 110 -91 9 -208 -117 -83 -44 -166 286 -241 -5 -255 -167 57 81 190 -67 -48
7756d8j16J87J14m0j12R8k16j51L44k12J71m6j01J57j30J31m4j55K02k2m6j04
$$ -48 -164 23 137 97 -15 83 -133 -284 60 -152 19 -27 -128 29 -101 30 -14 -169 33 11 -35 -139
7778a39K68j0P9l71J66L3p9P7M5j13O7R9j14m2k86J32N1J38q7ql3N3K22j63K21
$$ -139 129 119 198 -173 -7 26 -53 24 69 -44 23 122 8 -34 -320 -188 -137 1 -86 -94 -127 -74 148 -15 206
7803B06k23j94L9J84o7J18J3k35K20k6q3J73o5k21L09l22J97j9K24l07l2K0nr
$$ 206 -17 -211 -172 12 -55 63 76 -159 61 35 -48 125 60 -161 148 -174 23 4 228 -79 -111 -91 -96 -105
7827a05J85j01m3j0K03q2J80j20k8k21N7J14Lj56J24J03J35j90J97k01K42k10
$$ -105 80 -21 -64 -74 129 47 227 107 79 -142 -85 29 32 -124 0 103 238 48 245 44 286 76
7849G6k38J63j73p9J77K37k12P0k23M74j38Q8J02l85R3j47L80n18M85k73M6l5
$$ 76 -162 1 -172 -251 -74 163 -49 21 -202 272 134 222 324 -61 32 -115 265 -253 232 -41 5 -30
7871c0k01L44k1Q2m18L66K01j88J79j39j63l37K52K88j56k7j23J15j28j8J73k6
$$ -30 -231 113 92 174 -244 122 323 135 314 175 12 -325 -73 215 59 32 -91 24 -104 -122 51 25
7893B5P7q0j72O3K09J57l89nNj06J8K35j97K6J12k38J49k9K08mL2J90m93K49o9
$$ 25 102 22 -150 -87 122 279 -110 -115 -110 -216 -198 37 -160 -134 -22 -260 -111 -140 68 64 96 286 -207 42 -27
7918b7R1l6j22P6n9L22m37J96p1K42j84k59N05l34j62J33o4L19j60j54J01mJ43
$$ -27 64 28 -94 -18 -77 245 -192 4 -67 175 -9 -268 237 -97 -259 -126 -190 129 -31 -185 -84 -88 55
7941E5L6P4l10J47m12L95l16L08j10K05o3K01j37m7q6k14M34m65L53J41l14K45
$$ 55 91 165 -145 2 -410 -15 -331 -23 -133 72 9 210 73 26 -60 -274 160 -305 48 189 -125 120
7963A20j12j14j08J85NJ76l23K43P9r7J55k40Q0j33J54R0p1j10O2Mk44L3J65J19
$$ 120 8 -106 -214 -29 -24 152 -171 72 151 54 209 -31 49 -84 70 160 89 -21 41 45 -199 -166 -1 118
7987A18j88pJ88n1K95m70J30L40l57K59j42K6p6k94M11k67n4K93k86L83j33N6
$$ 118 -70 -77 111 60 355 -115 15 355 -2 257 115 141 65 -229 182 -85 -139 154 -132 251 118 174
8009A74J3k08j63kJ84l4L69o67L21m3m9K95nk01j81Q2m2J4K96Q8j43j91k4K33
$$ 174 187 -21 -184 -186 -2 -36 333 -334 -13 -56 -105 190 185 -16 -197 -115 -157 -143 153 241 98 -93 -117 116
8033A16j4o2mJ10j29N9k97J10j78L22r7m46O14R8j9k09k80L55j1j31J68m5j82
$$ 116 102 40 36 146 17 76 -221 -111 -289 33 -64 -510 104 202 183 -26 -306 49 38 -93 75 30 -152
8056a52J08J53m2oL1m3p8J13l42L49M5j22j41J14n7N5k02M63k13j7j47J97k56
$$ -152 -44 109 67 61 92 49 -29 84 -258 91 136 14 -127 -13 -70 -15 -217 246 33 16 -131 66 -190
8079a90L69k89L98j88k78N9r6J51M8L4j1k31K32N5J78k81k0M0J98m27K12K36k98
$$ -190 179 -110 288 100 -178 -119 -215 -64 -16 18 7 -224 8 63 241 -40 -60 -20 178 -249 -37 199 -99
8102i9QJ23%K04j97l7j9k20K79ln0k2r7K79j96L8k17K75Q4o6k08P8K38l49J59
$$ -99 -91 32 32 236 39 2 -17 -237 42 39 -11 -33 -130 149 -47 -9 -226 49 133 67 -141 -63 175 -174 -15
8127a5K41k15q6J70K2r7lKO5k25J99m8K63k87K39N3k59K00p2k11J78j0j56K16
$$ -15 226 11 -75 95 117 20 17 19 84 -141 58 10 273 -14 225 278 19 219 147 -64 114 104 -52 164
8151A64k68K78j40J08p5k73r7L18lQ8O3r2n5o1R4K42l41j35J87j00K71k11n4m9
$$ 164 -104 174 34 142 67 -206 -303 15 12 100 163 71 16 -45 49 291 -50 -185 2 -98 173 -38 -92 -141
8175a41R8M8m2K03k5J91m03L5L01l78J35j0PJ9N6J26
$$ -141 -43 5 -37 166 141 332 -71 -36 265 -113 22 12 19 38 94 220
8191B20
$$ Imaginary data points
##PAGE= N=2
##DATA TABLE= (X++(I..I)), XYDATA
0@%%%%%%%%%%Qj6J6j6J9k7L2m0M8n6P2q8J04j25J49j71J98k34K71l09L54m04M58
$$ 0 0 0 0 0 0 0 0 0 0 0 8 -8 8 -8 11 -16 16 -24 24 -32 40 -48 56 -69 80 -91 107 -127 144 -165 189 -215 243
33B43n20N89o64P47q39R40j049J170j300J442j599J771j958K162k386K630k896
$$ 243 -277 312 -352 395 -444 496 -553 617 -683 759 -840 931 -1027 1135 -1251 1379 -1517
50a517L189l515L874m273M718n217N782o428P176q049R087j0347J1910j3913J6589
$$ -1517 1672 -1843 2031 -2242 2476 -2741 3041 -3387 3789 -4260 4827 -5520 6390 -7523 9066
65I066k0358K6105l6050N7973j94359J52068L73507l16053k91182J20480K81354
$$ 9066 -11292 14813 -21237 36736 -157623 -5555 367952 51899 -239283 -118803 162551
76A62551m5621j39483l8028R304k9052J10954J25675j08857k29329Q0334K85694
$$ 162551 116930 -22553 -60581 -51277 -80329 30625 156300 47443 -181886 -101552 184142
87A84142J2726l03495j14702K11149J63615j05998j35542J3705Q6375N1688R708
$$ 184142 196868 -106627 -221329 -10180 153435 47437 -88105 -74400 11975 63663 73371
98G3371o5582r6777J4194J28794L0806j15756n2273R3817N6056m5959j6871J8551
$$ 73371 7789 -88988 -74794 54000 84806 -30950 -83223 10594 66650 20691 3820 22371
110B2371n3983m3479R0136P6790j06810j09601J04665J47316o7837j45786L4920
$$ 22371 -31612 -75091 15045 91835 -14975 -124576 -19911 127405 59568 -86218 -51298
121e1298J10821m0614q2463O4736O3966r8736n4980J50371Q6611j72960j34024
$$ -51298 59523 18909 -63554 1182 65148 -33588 -88568 61803 148414 -24546 -158570
132a58570J51128J53694j20916j62497P6146J45070l0214q9175K4284L5814m8404
$$ -158570 -7442 146252 25336 -137161 -61015 84055 53841 -35334 -11050 24764 -23640
143b3640n607P7226r902j12611n00J39571L9760j25375o4197R3737O8049o4922
$$ -23640 -29247 47979 38077 -74534 -75034 64537 104297 -21078 -85275 8462 76511 11589
155A1589o4754K5786L3391o627Q823J6237l2074k6712M6198L4859n4129m5780
$$ 11589 -53165 -27379 6012 -615 8208 24445 -7629 -34341 11857 46716 -7413 -53193
167e3193M4594M0612l4333j9312M3670J2277m9627q026N1501J846o2776j2266
$$ -53193 -8599 32013 -2320 -21632 22038 34315 -15312 -23338 28163 30009 -32767 -45033
179d5033N6702J6772l9271k115L3013j5608l1678L4267L6383n7871n9755O4758
$$ -45033 11669 28441 -10830 -12945 20068 4460 -27218 7049 43432 -14439 -74194 -9436
191i436Q7786m5404r6073K6192R4274l207p8550j7503L8259Q749m431J7421j1685
$$ -9436 78350 32946 -63127 -36935 57339 54132 -24418 -41921 -3662 5087 656 18077 6392
204F392m6140J5514P7930J221r7716l6414Q8754O2271o3106o9445L6995O7299
$$ 6392 -39748 -24234 53696 54917 -42799 -79213 9541 71812 8706 -60739 -23744 43555
216D3555m741m1467j0960K452k21K1387J7692l6349m0845L8123O5274j9470p1973
$$ 43555 38814 -2653 -13613 -11161 -11382 10005 27697 -8652 -49497 -11374 53900 34430 -37543
229c7543m449N9174J7011m1977k3051K0551K0736L614j59r213j7316N336K6165
$$ -37543 -41992 17182 34193 -7784 -30835 -10284 10452 14066 13907 4694 -12622 -7286 18879
242A8879k357l4992r240L1808J8072k1093j4444J5029P821j2615k753Q975p795
$$ 18879 16522 -18470 -27710 4098 22170 1077 -13367 1662 9483 -3132 -5885 3090 -4705
255d705j3302J6228K2625j4194k1364J6447K2305j8513k4199J4046J7965j6964
$$ -4705 -18007 -1779 20846 6652 -14712 1735 24040 5527 -18672 -4626 13339 -3625
267c625j4935K2138J6362k1926j6250K2672J5874k6725k0424K3135K1591j7989
$$ -3625 -18560 3578 19940 -1986 -18236 4436 20310 -6415 -26839 -3704 17887 -102
279a02j6657J9850J7242j6217j3325J4130N394j9206m546K0910L756k1437k126
$$ -102 -16759 3091 20333 4116 -9209 4921 10315 -8891 -13437 7473 11229 -10208 -12334
292a2334K4971M350k4944r899J8760R157j4676q446J0717J0139j313k931k57l352
$$ -12334 12637 16987 -7957 -17856 904 10061 -4615 -13061 -2344 7795 6482 3551 3294 -58
306e8j321N197P53j0176m800J1303R716o889r680L195O600k561m573j729k161
$$ -58 -1379 3818 4571 -5605 -10405 898 10614 3725 -5955 -2760 3840 1279 -3294 -5023 -7184
321g184K288R982M490j1140n769J3181R219j4297j4220R202J3538o066j1291N597
$$ -7184 -4896 5086 9576 -1564 -7333 5848 15067 770 -13450 -4248 9290 3224 -8067 -2470
335b470J0297m275p524L261K799p716l762J0196M828j0021l735J4968P628j4222
$$ -2470 7827 3552 -3972 -711 2088 -5628 -9390 806 5634 -4387 -8122 6846 14474 252
349B52j0312J1450R433j0927j1121Q894J0674m402p360L011L545m112l097K832
$$ 252 -10060 1390 10823 -104 -11225 -2331 8343 3941 -3419 -408 3137 -975 -4072 -1240
363a240J24m672M96Q606L985o344n277N745O388m376q751j42O121L292j425k815
$$ -1240 -1116 -5788 -5292 3314 7299 955 -4322 1423 7811 3435 -5316 -5458 663 3955 2530 -285
379b85j310J634K363l23m075m171K07M573M758n98m522k754O684P684m243j1972
$$ -285 -1595 39 2402 2079 -1996 -6167 -5960 -1387 3371 2773 -1749 -4503 2181 9865 5622 -6350
395f350k402J0627O953o040p789Q58O965L963k632o966n828Q07R780O378q308
$$ -6350 -8752 1875 8828 2788 -5001 -4143 2822 6785 4153 -2813 -8641 -7834 1946 8324 16
410A6j2027M924J8567M118j7659j2389J0400J4721k081j2153m529N521P752L723
$$ 16 -12011 -7087 11480 15598 -2061 -14450 -4050 10671 8590 -3563 -8092 -2571 5181 8904
424H904l649j0985o830R332J4282l397j9404n739J9676J6837j0270k1322j90J8294
$$ 8904 5255 -5730 -12560 -3228 11054 7657 -11747 -17486 2190 19027 8757 -12565 -12755 5539
438E539Q302j0576j1496M13Q282P567J630p678j1730K27J4605Q781j3480j8887
$$ 5539 13841 3265 -8231 -7818 464 8031 9661 1983 -9747 -9520 5085 13866 386 -18501
452a8501M420K3712R419j8852j7818R881K0497Q09j6660q301P001Q668K966j520
$$ -18501 -14081 9631 19050 198 -17620 -7739 12758 13567 -3093 -11394 -4393 4275 7241 5721
466E721n596q296J872J3810O568j6403j9167R816K6747K428k5410j2761J9503
$$ 5721 125 -8171 -6299 7511 14079 -2324 -21491 -11675 15072 17500 -7910 -20671 -1168
479a168J9166r105j7284r61R774L634O80J373n781j0984M829K0030K287k5473
$$ -1168 17998 8893 -8391 -9352 422 4056 4736 6109 328 -10656 -5827 14203 16490 -8983
493h983j6207K0638K6710r788k9886k036K5979J3138j5276j5729K898R733M001
$$ -8983 -25190 -4552 22158 12370 -17516 -19552 6427 19565 4289 -11440 -8542 1191 5192
506E192J582k904j0153m283J3519J6094r180k6197m900K6581J8132j9326k7297
$$ 5192 6774 3870 -6283 -10566 2953 19047 9867 -16330 -21230 5351 23483 4157 -23140
519b3140P119K8881P460k1235j5626R196J5373O64p456m157k169L11J0548J0564
$$ -23140 -16021 12860 20320 -915 -16541 -7345 8028 8692 1236 -2921 -5090 -4779 5769 16333
533A6333j1357k2100J724K7274J0120k6511k1871J7702K8759m389k6475n076J7406
$$ 16333 4976 -17124 -15400 11874 21994 -4517 -26388 -8686 20073 15684 -10791 -15867 1539
546A539Q387o648m964K91l730N84J3422O939j6751j8417J2622K5922l302k9410
$$ 1539 9926 3278 -1686 -1395 -5125 -4541 8881 15820 -931 -19348 -6726 19196 15894 -13516
560a3516r437K3888J8200j1848j9507L43J4168O893m526p229m204N95Q992R304
$$ -13516 -22953 935 19135 7287 -12220 -11877 2291 9184 4658 -2571 -6775 -6180 2812 12116
574A2116m595j6191m430J6616J4802j1334k2865j098K2754J2775j5914j9536O086
$$ 12116 7521 -8670 -13100 3516 18318 6984 -15881 -16979 5775 18550 2636 -16900 -10814
587a0814J9280M139j3078r460M147P772L859l02m939p857J708J3384O509j5042
$$ -10814 8466 12605 -473 -9933 -5786 1986 5845 5543 604 -7253 -5545 7839 14348 -694
601f94j5595R099K0226j524j9891o402J5006J1261p152j0824J085N455K198r3
$$ -694 -16289 -7190 13036 11512 -8379 -14781 225 11486 4334 -6490 -5405 50 2248 2155
615B155J00l428l726M616R080k087j1464l417R295P039n902q504R32O842K838
$$ 2155 2255 -1173 -4899 -283 8797 6710 -4754 -8171 1124 8163 2261 -6243 -5311 1531 4369
630D369l114l569m79J452K182J408j322l305p60L949L997m81n524l652M084N969
$$ 4369 1255 -2314 -2793 -1341 841 2249 927 -2378 -3138 811 4808 4327 -1197 -4849 -765 5204
646E204j690p334k219N777N135k218n592j269L351L102Q0k698k832jM923M292
$$ 5204 3514 -3820 -6039 -262 4873 2655 -2937 -4206 -855 2247 2327 -371 -3203 -3204 1719 6011
662F011l671o498Q73O693K643o043n465K327N646R02l545l183O96K787K129j013
$$ 6011 2340 -4158 -3285 3408 6051 8 -5457 -3130 2516 3418 -127 -3310 -2614 173 2302 1289
678A289m034j167L655L701j178l852k44L551J698j615k657n64R45J125K05o77
$$ 1289 -2745 -3912 -257 3444 2266 -1586 -1830 1721 3419 1804 -853 -1417 -472 653 858 181
694A81j966k05K572J364k355k269O02K391Q30p01q87K46R25P49J80q62j650k06
$$ 181 -1785 -1990 582 1946 -409 -2678 -2076 315 1145 444 -443 -197 728 1477 1657 795 -855 -1061
712a061J879R22j679k486R99K324J063k313k318Q66K274J136j888j728J204K233
$$ -1061 818 1740 61 -2425 -1426 898 1961 -352 -2670 -1804 470 1606 -282 -2010 -806 1427
728A427Q60j511j591L37J613M18p75k071n10K255J335j456k333K60K540P25k409
$$ 1427 2287 776 -815 -478 1135 1553 778 -1293 -1803 452 1787 331 -2002 -1742 798 1523 -886
745h86j565J347K008N26j402r01J357J246m04j078r71O20P28K94j214j178N82
$$ -886 -2451 -1104 904 1430 28 -873 484 1730 1326 248 -723 -103 625 919 -295 -1473 -891
762h91J452J97j586j531J463J957n19j677nJ991J071r60j172M51N62Nm13j040
$$ -891 561 758 -828 -2359 -896 1061 542 -1135 -1140 851 1922 962 -210 241 803 808 395 -645
780f45L56L56L91k93n86q10O29Q69m12j262J94J342J072m55r79J99J200K59j196
$$ -645 -289 67 458 165 -421 -1231 -602 267 -145 -1407 -1213 129 1201 746 -233 -34 1166 1425 229
799B29r72P65P36p28k58K0K13J91m63k32k04k03QR60M29p97J69Q61O06r70p40
$$ 229 -743 22 758 30 -228 -208 5 196 -267 -499 -703 -906 -898 62 491 -306 -137 724 1330 360 -380
820c80O27R28m07j328J98R42P8q61k83Q4q2n79Q09L97n99l35O55R89j23r99J89
$$ -380 247 1175 768 -560 -362 580 658 -203 -486 -402 -484 -1063 -254 143 -456 -791 -136 853 730 -269 -80
841h0Q41L58r89j81R8J22L1M41o30j064K01J090L87j527o97J114J200K71j063
$$ -80 761 1119 130 -51 47 169 200 641 11 -1053 -852 238 625 -902 -1599 -485 715 986 -77
860g7o20N97J245O7p13j136j62J609P71j143j681M08J356J11p01r82l73J322R98
$$ -77 -697 -100 1145 1212 499 -637 -799 810 1581 438 -1243 -835 521 632 -69 -1051 -1424 -102 896
879H96m0j752p84J742K352j153k760K46K522O52j878p14O92j19L8J057k04k377
$$ 896 856 -896 -1680 62 2414 1261 -1499 -1253 1269 1921 43 -671 21 -98 -60 997 793 -1584
897a584p04K599J722k274k947J805L928m76k933l15K279K8j072N61Q2j487k34
$$ -1584 -2288 311 2033 -241 -3188 -1383 2545 2069 -864 -1179 1100 1128 56 617 699 -788 -1022
914a022J881J526k693k869K000L422j094l191r32L207J693r07j971k02Q63J648
$$ -1022 859 2385 -308 -3177 -1177 2245 1151 -2040 -2972 235 1928 1021 -950 -1152 -289 1359
930A359L81j384j202K4J743P61r15j816n73J013K214j51l588j669L199M246k392
$$ 1359 1740 356 -846 -822 921 1682 767 -1049 -1622 -609 1605 1454 -2134 -3803 -604 3642 1250
947A250m784J088M884L50l537r77K239R92j814Q53J848k368l161K770M483k620
$$ 1250 -3534 -2446 2438 2788 -749 -1726 513 1505 -309 544 2392 24 -3137 -367 4116 1496
963A496o441J165P028N38o297j856N268K249l056k077J866J152j667O88K519j110
$$ 1496 -4945 -3780 3248 3786 -2511 -4367 901 3150 94 -1983 -117 1035 -632 56 2575 1465
979A465l847O12M242N48m650k561L256L740j382l533m62K634K417j340k367m67
$$ 1465 -2382 -1770 2472 3020 -1630 -4191 -935 2805 1423 -2110 -2572 62 2479 1139 -1228 -1695
995a695K062P92p50k98J72m76n15J803J277k292m099K104N502o08o569q65O467
$$ -1695 367 1159 409 111 283 -193 -708 1095 2372 80 -4019 -1915 3587 2979 -3590 -4455 2012
1012B012K620n267l660M449K654k776j980L123R33l788k65M757J026o587j770
$$ 2012 4632 -635 -4295 154 2808 32 -1948 1175 2108 -1680 -1945 2812 3838 -2749 -4519
1027d519O299K986n807m672M883M603l009l249J223K734j161j148J194Q37j834
$$ -4519 1780 4766 -1041 -5713 -830 3773 764 -2485 -1262 1472 311 -837 357 1194 -640
1042f40o56L015J152k706k448J773K566p77k387j192J425K058L91k233j400J569
$$ -640 -1296 1719 2871 165 -2283 -510 2056 1279 -1108 -2300 -875 1183 1574 -659 -2059 -490
1058d90K275j120k384O01K107l92j136J564R23k824q71L222J768m020l535L828
$$ -490 1785 665 -1719 -1118 989 597 -539 1025 1948 -876 -1747 1475 3243 -777 -4312 -484
1074d84M363k913n128K478M519j290l735J077K500j194k119K695K092l039k586
$$ -484 3879 966 -4162 -1684 2835 1545 -2190 -1113 1387 193 -1926 769 2861 -178 -2764
1089b764L519L169l329l918K258L588j641l065Q39K103p20q67J126L60j982J33
$$ -2764 755 3924 595 -3323 -1065 2523 882 -2183 -1344 759 39 -828 298 658 -1324 -1191
1105a191K508j06k198l57K603M71j660k87O99j41q57J198j5j894k33K440O33k399
$$ -1191 1317 1211 -987 -1344 1259 1730 70 -217 482 341 -516 682 667 -1227 -1460 980 1613 -786
1123g86j478K265J709k161q90J875O36j731K04J997l55k662L28K904o17k893R2
$$ -786 -2264 1 1710 -451 -1341 534 1170 -561 -357 1640 1285 -1377 -1049 1855 1238 -1655 -1563
1140a563K970l97k513K23J879j7k372J386J820j194k361K203K584j818k606J710
$$ -1563 1407 1010 -1503 -1280 599 582 -1790 -404 1416 222 -2139 64 2648 830 -1776 -66
1156f6K449j828k165J554J223j578p83J692P27k405n20K211P27k509p43K811L91
$$ -66 2383 555 -1610 -56 1167 -411 -1194 498 1225 -1180 -1700 511 1238 -1271 -2014 797 1188
1173A188j787k42J918N2j820M34J524o93j976Q61J847j095j803J045J806j434
$$ 1188 -599 -841 1077 1129 -691 -257 1267 574 -1402 -541 1306 211 -1592 -547 1259 -175
1189a75j487J416J155j279q24J426R53j560m17J767N39k061n69J957K97j866k94
$$ -175 -1662 -246 909 -370 -1194 232 1185 -375 -792 975 1514 -547 -1116 841 1138 -728 -1022
1206a022J888J99k151K9J937n54j843M61K129o62j864R94K025p29j952J088J593
$$ -1022 866 1065 -1086 -1057 880 326 -1517 -1056 1073 411 -1453 -459 1566 837 -1115 -27 1566
1223A566j022j424J034J131j235j197J412Q00j678r03J165J016j758m2J408P07
$$ 1566 544 -880 154 1285 50 -1147 265 1065 -613 -1516 -351 665 -1093 -1135 273 980
1239I80j465k58J922q2j475j58J660k67j853K43J606q3j797N95J271j096r32N94
$$ 980 -485 -743 1179 1097 -378 -536 1124 857 -996 -753 853 770 -1027 -432 839 -257 -1189 -595
1257e95J105o64r72R90J499j552q41J205J077j087r60J231N19j302k91J039N68
$$ -595 510 -154 -1126 -136 1363 -189 -1030 175 1252 165 -795 436 955 -347 -638 401 969
1274I69j686k94J338Q1j536O5J172M76j557M94J629o60j147N07J359q87r41L69
$$ 969 -717 -1011 327 408 -1128 -1063 109 585 -972 -478 1151 491 -656 -149 1210 323 -618 -249
1292b49J295o43j153N90O62o08j074R11M09p48n69Q24O02k29m21P64M79j011m96
$$ -249 1046 403 -750 -160 502 -106 -1180 -269 140 -608 -1177 -353 249 20 -401 363 842 -169 -665
1311f65Q74N28q92k05Q61n3n49j09P41m84j276O52R97n77n97P45M77m00j51N6
$$ -665 209 737 -155 -360 501 448 -101 -210 531 47 -1229 -577 420 -157 -754 -9 468 68 -83 -27
1331b7P28l71n95M72M28q11k27Q97k4q27k39P36K58r84j73M13Q8k19L11N50J18
$$ -27 701 330 -265 207 635 -176 -403 494 470 -357 -596 140 398 -586 -759 -346 -258 -477 -166 384 502
1352E02q52J54P32o6o82n2N87N3K7o80O43j72j88k98o1k25K8K90L31m59J02M99
$$ 502 -350 -196 536 470 -212 -264 323 376 403 -277 366 194 6 -292 -353 -578 -550 -260 71 -388 -286 213
1374B13L61m10j53Q2mJ19k65N89k27n01L81O44o08j046J85O16J32j56o46L44Q77
$$ 213 574 164 11 93 89 208 -57 532 305 -196 185 829 221 -825 -640 -24 108 -48 -694 -350 527
1395E27j67l11M0l35K13K85J03j20l74K16J03N00k12r66nO19j34l53l17O21L90
$$ 527 360 49 89 -246 -33 252 355 235 -139 77 180 680 468 -498 -503 116 -18 -371 -688 -67 323
1416C23o7o31M2N55j35l41M56j68r2j82L98N55p24n26M11M30k05o75l14P43M69
$$ 323 256 -375 -333 222 87 -254 202 34 -58 -240 158 713 -11 -537 -126 304 99 -576 -890 -147 322
1437C22k49n67L54M28R1o29LL23j17R6L30L52n40n18J84M75J51j379j09J040O81
$$ 322 73 -494 -140 288 379 -250 -247 76 -41 55 385 737 197 -321 -137 338 489 -890 -999 41 722
1458G22j121n20Q77J039p74p13N80N26q77k86R30N54r20r46J160Q56r37j355M21
$$ 722 -399 -919 -42 997 223 -490 90 616 -261 -547 383 937 17 -929 231 1087 150 -1205 -784
1477g84J496l86j229j02J302J12n43j75N44J20m80k50Q60N3j044J74J137L24j145
$$ -784 712 326 -903 -1005 297 409 -134 -309 235 355 -125 -375 485 538 -506 -332 805 1129 -16
1496a6o26L27Q62l56j230L42J044P7n93j79N33K26k94m07O72Mm30m07J134J46
$$ -16 -642 -315 547 191 -1039 -697 347 424 -169 -348 185 411 117 -290 382 386 -44 -451 683 829
1516H29q59r36N47J357q48j551Q46J531l38j392J9J380O9r73K7N35J04q61J40
$$ 829 -30 -966 -419 938 90 -1461 -615 916 578 -814 -795 585 654 -319 -292 243 347 -514 -374
1535c74J418j95j177k80J402L08j661m50J324J58m29p67Q36M80o09j96K00L61
$$ -374 1044 849 -328 -608 794 1102 -559 -1009 315 473 44 -723 113 593 -16 -212 -12 349
1553C49n36K5L76L26m46Q2J4K03Mq82k95N78K92K41n80l69Q10Km58q1N09k00j62
$$ 349 -187 -162 214 540 94 176 190 393 397 -485 -780 -202 90 331 -249 -618 192 194 -264 -345 164 -36 -198
1576a98m3N43O5o63J99R63n1j035l99R54L19j133j53O29N50o72l85J007j06r70
$$ -198 -241 302 367 -296 -97 866 815 -220 -619 335 654 -479 -632 -3 547 -125 -510 497 391 -579
1596e79J64O82o2p37M16R08j72n88l26Q92p7p39j67L36J49n30L65K05l30m43N81
$$ -579 -415 267 205 -532 -116 792 620 32 -294 598 521 -218 -385 -49 100 -430 -65 140 -190 -633 -52
1617e2J64k26j93J59L67m2k06K51J47m00M96j08k56m43J33L39l4n91N25J65m0
$$ -52 112 -114 -307 -148 219 177 -29 222 369 -31 465 357 101 -342 -209 130 96 -495 30 195 155
1638A55p79O62M17o31j95L80O28n04n56P87O13r71k59Q2N09l48n97N48L19m32
$$ 155 -624 38 455 -176 -371 9 637 133 -423 364 977 6 -253 -171 338 -10 -607 -59 260 -172
1658a72j55L45N23o82n25Q79J99n06n89R76L02n56l2J59O6o11J39L64j58l68k1
$$ -172 -327 18 541 -141 -666 213 412 -94 -683 293 595 39 7 166 232 -379 -240 124 -34 -402 -423
1679d23O63k16n35M85K54q2k06l61M55k26M2O14N1l89j00M37k27o40J71K90M4
$$ -423 240 24 -511 -26 228 146 -60 -421 34 -192 -150 464 515 126 26 463 236 -404 -233 57 101
1700A01m09J58L55o5m67P0N97n32l73N31P00m77p49L62P78n73m34N53J89j95o69
$$ 101 -308 -150 205 140 -327 -257 340 -192 -565 -34 666 189 -560 -198 580 7 -427 126 315 120 -549
1721e49K86L91m77J6J86N12m34j85M28j2n09K73J44K20Q0m73L24Q0l61Q2kq2l70
$$ -549 -263 128 -349 -333 -147 365 -69 -254 174 162 -347 -74 70 290 370 -103 221 301 -60 22 20 -62 -432
1744d32K81L86k61j5K16Q3k83k74J96L08m31J4O38K02n10o3K10L0k41l11M96%
$$ -432 -151 235 -26 -41 175 258 -25 -299 -103 205 -226 -212 426 628 118 55 265 295 54 -257 239 239
1766B39n54N0L63q3l07j7M42k57L8j76M92j09k13P6N30l91o19N97K53j99p51N52
$$ 239 -315 -265 98 15 -292 -309 133 -124 -86 -262 230 121 -92 -16 514 123 -496 101 354 155 -596 -44
1788d4J39j50n01M20M45l70l98L87J50k16l99O65J36j79j46N45P8o66p7L69L24
$$ -44 95 -55 -556 -136 309 -61 -459 -72 78 -138 -537 128 264 85 -61 484 562 -104 -181 188 512
1809E12q07K48L68j92m20J59JL3j42P0M74m08Q3o9L06j1m49N38j26j89K8m4N43
$$ 512 -295 -47 321 129 -291 -132 -131 -98 -240 -170 304 -104 -21 -90 216 205 -244 294 168 -21 7 -37 506
1832E06o31l9L35n4l73j69P61k80o08M28L0L15j28p6O98o78n1%K64k80m41M44
$$ 506 -125 -164 171 117 -256 -425 336 56 -552 -124 -94 221 93 17 715 37 -14 -14 250 -30 -471 -27
1854b7L13l23j01q4M06k67l10J82L37k25k35L55K13j52j47L21Q5m13J36k55M86
$$ -27 286 -37 -138 -222 184 -83 -393 -211 126 -99 -334 21 234 82 -65 256 341 -72 64 -191 295
1875B95k28m34L79k11k6L1K49k92ROK06R5l29J95J47j15m2J62M99m63n2j05N32
$$ 295 67 -367 12 -199 -225 -194 55 -237 -228 -222 -16 79 -250 -55 92 -23 -65 97 596 133 81 -24 508
1898E08l70J1J09K53p22j84K48K05k86k70K88L47m45J08L13R6k29k76K54L08j00
$$ 508 138 149 258 511 -211 -395 -147 58 -228 -498 -210 137 -308 -200 113 209 -20 -296 -42 266 166
1919A66p9j41K34R0j78j69J30l37N25m31l3K00Q8J41l5p2M37m10N4J29J3k99k90
$$ 166 87 -54 180 270 92 -77 53 -284 241 -190 -223 -23 65 206 171 99 536 126 180 309 322 23 -267
1942b67K16K13j00o55K87M42n1m77L44J26m3l16L91J69J07n69J79M08m54j89J88
$$ -267 -51 162 62 -593 -306 136 85 -392 -48 78 35 -281 110 279 386 -183 -4 404 -50 -239 -51
1963e1M12r7m10J0L55K4k22l40K8K58J68k60P7L54k34m12J43K97l9l41K93N58
$$ -51 361 264 -146 -136 219 243 21 -319 -291 -33 135 -125 -48 306 72 -340 -197 100 61 -280 13 571
1985E71m00j42j7j82J82k70j12K91L0p6k8J82oj8K9K07n23M05l13K41K03J89m11
$$ 571 171 29 12 -170 12 -258 -370 -79 -49 -125 -153 29 23 5 34 241 -282 123 -190 51 254 443 32
2008C2k7L88m32k26L5K18l7k3j6j3K55J10l55M6l7p6R6J47j6J92k44L3J24J19
$$ 32 5 393 -39 -265 -230 -12 -49 -72 -88 -101 154 264 -91 -45 -82 -158 -62 85 69 261 17 50 174 293
2032B93k38m3k41L62l36J57l17K40q5rM27Q0k53k34L55M3j58k20M45P4l82P4n3
$$ 293 55 12 -229 133 -203 -46 -363 -123 -208 -217 210 290 37 -197 158 201 43 -177 268 342 -40 34 -19
2055a9K2J3rK1J3q6J5j19K61j31L7Lj6m4K10MJQ1j40j20J90n9l40j52K8L3J30
$$ -19 3 16 7 28 41 -45 -30 -149 112 -19 18 21 5 -39 171 175 176 257 117 -3 187 128 -212 -364 -336 -303 -173
2082a73L61l27J45J50j33l49K5P08m20k37K80J61j91P7J71p0k17j82K79J93m2
$$ -173 188 -139 6 156 23 -326 -301 407 -13 -250 30 191 0 77 248 178 -39 -221 58 251 209
2103B09l75K75l2O3k41j57P45m22m25M08L42m67K29l36L87n1k18J88k77o0K76
$$ 209 -166 109 77 140 -101 -258 487 65 -360 48 390 -77 152 -184 203 152 -66 122 -155 -215 61
2124F1Nj5l92K58Q6j28j31l3J41J57l8q3K87j92j32L74O9m42R8K18o7m47M77M9
$$ 61 66 51 -341 -83 3 -125 -256 -289 -148 9 -29 -112 175 -17 -149 225 294 -148 -50 168 101 -346 131 180
2148A80%k63j8M40j33k89r2K86J37m23J28N33k30n51M10j34J59k18J22K43l65
$$ 180 180 -83 -101 339 206 -83 -175 111 248 -175 -47 486 256 -295 115 -19 140 -78 44 287 -78
2169g8N1n2K2k4%N7k4R2l08J16L38qJ0j58J35l21J15o0k4M6Q2J51J39m25J87R7
$$ -78 -27 -79 -57 -81 -81 -24 -48 44 -264 -148 190 182 192 34 169 -152 -37 -97 -121 -75 7 158 297 -128 59 156
2195A56n50L69k36L59n33K6N46P8k93q6J17Q1r3k0J69K30j17J2n2jo0m01L00j68
$$ 156 -394 -25 -261 98 -435 -409 137 215 -78 -164 -47 34 -59 -79 90 320 203 215 163 162 102 -299 1 -167
2219a67j19K29o9L24j14p0NN4j35j15R7J33k93M01k31j40o7P8N48n53l7J78o2
$$ -167 -286 -57 -126 198 84 14 19 73 -62 -177 -80 53 -240 161 -70 -210 -277 -199 349 -204 -241 -63 -125
2242a25K37m07K63l9j58K42J43m10Q9R6L41pk44p3M04l03k09JJ17q3k94K30K6
$$ -125 112 -295 -32 -71 -229 13 156 -254 -165 -69 272 265 21 -52 352 49 -160 -159 -42 -125 -419 -189 -163
2265a63o4j04L98K04k99k42L39Q4j80k40L03J26rJ78k4q4k20q8K01n2n02L11K19
$$ -163 -227 -331 67 271 -28 -270 69 153 -27 -267 36 162 153 331 307 223 3 -85 116 64 -438 -127 92
2288I2lj96J02K81n8l30l0M76m23J93j53K57j62l3K12k76O0r9K34K8l47J6L94
$$ 92 89 -107 -5 276 218 -112 -142 334 -89 104 -49 208 46 13 225 -51 9 -90 144 172 -175 -159 235
2311B35n8l45K87l27L61j35J21j63j06K91j64J74p3j68K74m73K04m6J62k9j34
$$ 235 177 -168 119 -208 153 18 139 -24 -130 161 -3 171 98 -70 204 -269 -65 -111 51 22 -112
2332a12P2j49J41J57q7k96L09j1O1j5o0j40J7J86P1m21L9K28J62k59m5K58l95
$$ -112 -40 -189 -48 109 22 -274 35 24 85 70 10 -130 -113 73 144 -277 -238 -10 152 -107 -152 106 -289
2355b89J75P0L48o72K17K0J64J18k74O9P1K07l76L13J18k81j21n9M00l60J82o0
$$ -289 -114 -44 304 -368 -151 -131 33 151 -123 -54 17 224 -152 161 279 -2 -123 -182 218 -142 40 -20
2377b0K79k80Qo9J94j47j46M39Pl33l6J67L9o1j23qL5J65m49M47j72J02j02J05
$$ -20 259 -21 -13 -82 112 -35 -181 258 265 -68 -104 63 102 41 -82 -90 -55 110 -339 108 -64 38 -64 41
2401D1k1r1J4N12k35k25K8K09J33m61J79K33m39j34K17k46K07r7M8K16r3R2j40
$$ 41 20 -71 -57 455 220 -5 23 232 365 -96 83 316 -123 -257 -40 -286 -79 -176 -128 88 -5 87 -53
2424e3J47N9j63j63J14L9M4p8J95j24P6K6k18P3O8j13pK04l43r0K93j2K66k77
$$ -53 94 153 -10 -173 -59 -20 24 -54 141 17 93 119 -99 -26 42 -71 -78 126 -217 -307 -14 -26 240 -37
2448c7l22L26J96j30k08j18L54p8o5J43n9N5k09j28K17J27l91J78l72K21K89l46
$$ -37 -359 -33 163 33 -175 -293 61 -17 -82 61 2 57 -152 -280 -63 64 -327 -149 -521 -300 -11 -357
2470c57K30J07Jr8L55J30k47r1k30O67l62J88l43j18J68j86L86l04R2k12j65L31
$$ -357 -127 -20 -19 -117 238 368 121 30 -200 467 105 293 -50 -168 0 -186 200 -104 -12 -224 -389 -58
2492e8r2J22k29P6K66l0r1K33n2o3M5k75L46m64K74J1K8J12k92j83K02L14j53
$$ -58 -150 -28 -257 -181 85 55 -36 197 145 82 127 -148 198 -266 8 19 47 159 -133 -316 -114 200 47
2515D7j14k4J74K8q7N6q5P2J6J5J18m55L89m33K73Q1l17J07J57O2j96k6K21Q7
$$ 47 -67 -91 83 111 24 80 -5 67 83 98 216 -239 150 -283 -10 71 -246 -139 18 80 -116 -142 79 166
2539A66l14k4L01k6O0k81M4L80l22L2j04J13J96m18K16N0k24l1K12J03l87P2J80
$$ 166 -148 -172 129 103 163 -118 -74 306 -16 16 -88 25 221 -197 19 69 -155 -186 26 129 -258 -186 -6
2562fl9J45k19Q1J42Q7J15k78L1P4n3j57J07R1J9j56j72L8J26k4j2J57Q2n2M8
$$ -6 -45 100 -119 -38 104 191 306 28 59 133 80 -77 30 121 140 -16 -188 -150 -24 -48 -60 97 179 127 175
2587A75k26K73l7k88K9M11k54n0j60J83K41q26M65K50j11j55K33l4j62k44K67
$$ 175 -51 222 185 -103 -74 337 83 33 -127 56 297 -529 -64 186 75 -80 153 119 -43 -287 -20
2608b0J90J06m17m6K89R2j42J40k89J72k57J15J11K18j71p7J55n9k17L3j10R3
$$ -20 170 276 -141 -187 102 194 52 192 -97 75 -182 -67 44 262 91 14 169 110 -107 -74 -184 -91
2630i1O4k15PL31j40K40N8l06M2K83j57r8R4l50K15l38N32J3l16j58K74O4j92
$$ -91 -27 -242 -235 96 -44 196 254 -52 -10 273 116 18 112 -238 -23 -361 171 184 -132 -290 -16 48 -144
2653a44J12L97n3k78p8J35J76k60j24%N16m74o8J19QNk59K23K71k39jL64l13J65
$$ -144 -32 365 312 34 -44 91 267 7 -117 -117 399 -75 -143 -24 -16 -11 -270 -47 224 -15 -16 348 35 200
2677B00K3k90L28j73J8J86m11K07k37L20j60L6j31K79J02m15J48J61n55M34K4
$$ 200 223 -67 261 88 106 292 -119 88 -149 171 11 47 -84 195 297 -118 30 191 -364 70 94
2698I4n5j44NK57k43J35KK3P9l93J54K09j58k71K57J71j77j45K74J72p4l09K81
$$ 94 39 -105 -100 157 -86 49 51 74 153 -240 -86 123 -35 -306 -49 122 -55 -200 74 246 172 -137 144
2721A44J20j90k26J47j04K45k38K28O9m0k17k3J93j30l39K90J42J40q7k8K18l58
$$ 144 264 74 -152 -5 -109 136 -102 126 195 155 -62 -85 108 -22 -361 -71 71 211 124 96 314 -44
2743d4J77j57J83k26P1J04M0l66K34QJ35p0nN3j58J4o3k3J74k33J55L4K70n98
$$ -44 133 -24 159 -67 4 108 148 -218 16 24 159 89 84 137 -21 -7 -70 -93 81 -152 3 37 307 -291
2767b91M55l10J33k9M34j87l31J63K14L5l18K1J5l98J40R9OK48l34K27J98k65
$$ -291 164 -146 -13 -42 392 205 -126 37 251 286 -32 -11 4 -394 -254 -155 -149 99 -235 -8 190 -75
2789g5n6J82K5k86J6L11J62m62r1K90J35l77K0L77qk56J00K48k71j22K54j05r9
$$ -75 -131 51 76 -210 -194 117 279 -183 -274 16 151 -226 -206 171 163 -93 7 255 -16 -138 116 11 -88
2812h8J8j04N63l5K6n09N51k60J26k29K2j55R5k54K24J06j90j6L44m53L32j67
$$ -88 -70 -174 389 354 380 -129 422 162 288 59 81 -74 21 -233 -9 97 -93 -109 235 -218 114 -53
2834e3L84l72j31M78q9k09r8K78O6k26l30M40k53O3r1J27k5m2L55j31N9n12P5
$$ -53 331 -41 -172 306 217 8 -90 188 254 28 -302 138 -115 -52 -143 -16 -41 -83 272 141 200 -312 -237
2857b37O31k43k43K06K28k35l0m12K99Pk57J51J62l66J0L71J12p8j66N2l08L46
$$ -237 394 151 -92 114 342 107 77 -335 -36 -29 -286 -135 27 -339 -329 42 154 76 -90 -38 -346 0
2879@Kj44K29J1j13R7j44p7J77k3k13r3K53Qk29J19M37L3n00j12N12O2j33o3j31
$$ 0 2 -142 87 98 -15 82 -62 -139 38 15 -198 -291 -38 -30 -259 -140 297 330 -170 -282 230 292 159 96 -35
2904c5L21j10L8P9m06J05j03J60O3j62m8n1K22k20K4J3K72j58j74M13Q7k68j94
$$ -35 286 176 214 293 -113 -8 -111 49 112 -50 -98 -149 73 -147 -123 -110 162 4 -170 243 330 62 -132
2927a32K79N8o0l74K02j11L54k35j73K86k74J52o9L75n74M88k01o2J44K49l34
$$ -132 147 205 145 -229 -27 -138 216 -19 -192 94 -180 -28 -97 278 -296 192 -9 -71 73 322 -12
2948a2K16j83N0M0n1J80j43p3j34Q6L41k00j47k34J27J98k85M85k38k31M5R7J93
$$ -12 204 21 71 111 60 240 97 24 -110 -24 317 117 -30 -264 -137 61 -224 261 23 -208 -163 -66 127
2971A27K07m31j68N45n78L59k64K8K13j50J70l04M77m92kL19jj1q2pP8j16J48
$$ 127 334 -97 -265 280 -298 61 -203 -175 38 -112 58 -246 231 -261 -263 56 55 44 -38 -45 33 -83 65
2994F5N6j31L89k92l30L56q2l46L01j33L64l06k3M4jJ00k97L31J00j88J41pk35
$$ 65 121 -10 379 87 -243 113 31 -315 -14 -147 217 -89 -112 -68 -69 31 -266 65 165 -23 118 111 -124
3017a24L34l16k7O0J67j88K5j39L7L1M70l79j18M53j05k52J72k9j38J65o3j06
$$ -124 210 -106 -133 -73 94 -94 -69 -208 -171 -140 330 -49 -167 286 181 -71 101 72 -66 99 36 -70
3039g0J74j4J6n30N82m18K49K1J13j38K55p8m29N1M1L03j0j27K68k08k9P0j41
$$ -70 104 90 106 -424 158 -260 -11 10 123 -15 240 162 -267 -216 -175 128 118 -9 259 51 22 92 -49
3062d9k54J92p3oN41l58n4L3M1j54J93K18l04N5l27K00L8K86j59k3K28k68L64
$$ -49 -303 -111 -184 -190 351 -7 -61 -28 13 -141 52 270 -34 21 -306 -106 -68 218 59 36 264 -4 360
3085C60m56p5L70J96n25Q7J77l06q2N3j42O08p11K95K41K83k69n41M90R7k13j29
$$ 360 -96 -171 199 395 -130 -43 134 -172 -254 -201 -343 265 -446 -151 90 373 104 -437 53 150 -63 -192
3107a92L69k19J21j05K13P4k58Q8j88R7K46l39j86J81L75k18Q7n7j66J41j90M6
$$ -192 177 -42 79 -26 187 261 3 91 -97 0 246 -93 -279 -98 277 59 146 89 -77 64 -126 -80
3129h0J85m84M00k56N42m47K28j03j17K0J33l37J97L23n1k03J52k71L08k07o9
$$ -80 105 -379 21 -235 307 -140 88 -15 -132 -112 21 -316 -119 204 153 -50 102 -169 139 -68 -137
3150a37l7J34j5J83P0j30o9n7J06m31R6J81l6L9p5Q5K8q2K11J7R2p8l33J33K02
$$ -137 -174 -40 -55 128 198 68 -1 -58 48 -383 -287 -106 -142 -103 -178 -93 -65 -147 64 81 173 95 -238 -105 97
3175I7l8J06k41n3K25k19K88l25p6K32K8j42J53M33l72q0j17L4o9L32p8k62L7
$$ 97 59 165 -76 -129 96 -123 165 -160 -236 -4 24 -118 35 468 96 16 -101 -67 -136 196 118 -144 -107
3198a07J77j64L27l16l1K2j15Q7J79r0N1J68k61J90K1q4N0o6mJ44k36j82J80L07
$$ -107 70 -94 233 -83 -114 -92 -207 -120 59 -31 20 188 -73 117 138 54 104 38 34 178 -58 -240 -60 247
3222B47j00l59J26Q7r3r3j55L19R2P0N1k71L0Q7J66j18o5q3M4m7J88j31k4K02
$$ 247 147 -212 -86 1 -92 -185 -340 -21 71 141 192 -79 -49 38 204 86 21 -62 -18 -65 123 -8 -32 170
3246A70l67N9R4r5J63NJ66k42n8J57J1j48L8J04j13l7K31n7j12k76J70L68j21
$$ 170 -197 -138 -44 -139 24 29 195 -47 -105 52 63 -85 -47 57 -56 -93 138 81 -31 -307 -137 231 110
3269A10j66n4J04R9k42J02K95l00pm1K54l08K63L1J27r4j70o6J65jk67L14j99
$$ 110 -56 -110 -6 93 -149 -47 248 -52 -59 -100 154 -154 109 140 267 173 3 -63 102 101 -166 148 -51
3292e1L7m9RJ16K3L2l91M22j50k61K91j14J99p0k24Q4J17N6M7l70N5K51k20j43
$$ -51 -14 -63 -54 62 85 117 -274 148 -2 -263 28 -86 113 43 -181 -97 20 76 123 -247 -192 59 -161 -304
3316c04J51P1K33o5O6o8p9O0k26J49rO0L1J74j39K9k45K39k87q6K03mk65L40j38
$$ -304 -153 -82 151 86 152 84 5 65 -161 -12 -21 39 70 244 105 134 -111 128 -159 -245 -42 -46 -311 29 -109
3341a09K45O7P7l56o7J0J11K08J24j07l12R5J23L3k03M6k82M18j76J53n4K40k96
$$ -109 136 203 280 -76 -143 -133 -22 186 310 203 -109 -14 109 142 -61 -15 -297 121 -55 98 44 284 -12
3364a2k8J59k24J3K73l28qK16K51k48K89k35K58j94k39L08l87P4J37j92k22K44
$$ -12 -40 119 -105 -92 181 -147 -155 61 312 64 353 118 376 182 -57 251 -136 -62 75 -117 -339 -95
3386i5J43k54P0O0N8j16L51l13K08J31o3J2k87M2L51o23N93n63K62J14l58l0K21
$$ -95 48 -206 -136 -76 -18 -134 217 -96 112 243 180 192 -95 -53 298 -325 268 -295 -33 81 -277 -307 -86
3409h6Qj63J87O5k13J91J6pJ92j91K8j60LL6j96J70L95k47m0p6J32n2L46j63n1
$$ -86 -78 -241 -54 11 -202 -11 5 -2 190 -1 27 -133 -130 -94 -290 -120 275 28 -12 -88 44 -8 338 175 124
3434A24j43P1J75m50J25J73J66m99o9J11L80m26K71m0J42K3l68k6K75r4J99j50
$$ 124 -19 52 227 -223 -98 75 241 -258 -327 -216 164 -262 9 -31 111 134 -234 -260 15 -79 120 -30
3456c0j92J65J10l21K37j8J67m8j49n6J09L6k91K16J79k32NJ96l58K08J52j12
$$ -30 -222 -57 53 -268 -31 -49 118 70 -79 -135 -26 10 -281 -65 114 -118 -113 83 -275 -67 85 -27
3478b7q6K85k61K83j84n0L8J6Q4j61K58m23J60J67j08n6n2J65j38R8p6n4n0j48
$$ -27 -113 172 -89 194 10 -40 -2 14 98 -63 195 -228 -68 99 -9 -65 -117 48 -90 8 -68 -122 -172 -320
3502c20L93q9O2k32LK32l5j08RO1m9j03K75N4j50j07j55L24j76j30R9Q3Q4J16
$$ -320 73 -16 46 -186 -183 49 14 -94 -85 -24 -73 -176 99 153 3 -104 -259 65 -111 -241 -142 -59 25 141
3526A41k90L71k53k40L66j21p0j02J15Q0K00l55J56k19J78o4J87l40R1J09J00
$$ 141 -149 222 -31 -271 95 -26 -96 -198 -83 -3 197 -158 -2 -221 -43 -107 80 -260 -169 -60 40
3547D0J22l5R5n1l35K86k81J23o6L68l43Q4L52m22%N3j60K56k45J52j82J49O8
$$ 40 162 127 222 171 -164 122 -159 -36 -102 266 -77 7 359 -63 -63 -10 -170 86 -159 -7 -189 -40 28
3570B8KL0j82K44j32r2Jj93L73M1j48N84o97J17R4o5j86K10m9M79l37j82K80j67
$$ 28 30 60 -122 122 -10 -102 -101 -294 79 120 -28 556 -141 -24 70 5 -181 29 -20 459 122 -60 220 53
3594E3k61N6K32k2j37K72j31j07o5L86j3l36O8j80N12l50j97J04P5P6l19M05J11
$$ 53 -208 -152 80 58 -79 193 62 -45 -110 276 263 -73 -5 -185 327 -23 -220 -116 -41 35 -284 121 232
3617B32k7l79K72J01m20L26k10P0O8j36j90N54m69J00p7O6L63k05p5J13l6P0j54
$$ 232 205 -174 98 199 -221 105 -105 -35 33 -103 -293 261 -208 -108 -185 -119 244 39 -36 77 41 111 -43
3640d3L6N2K66j14j74r5j3j27O7L10k54J14k17J23mM2j27K61J2r3j05n7K10J10
$$ -43 -7 45 311 197 23 -72 -85 -212 -145 165 -89 25 -192 -69 -73 -31 -158 103 115 22 -83 -140 70 180
3664A80m9o3k38K5L11n0j5j76O0J45p9K17j91j40o2L1J67j9l8j39J5J07o5J76
$$ 180 131 68 -170 -145 166 116 101 -75 -15 130 51 268 77 -63 -125 -94 73 54 16 -123 -108 -1 -66 110
3688A10k95OM50nj12k48O6J56j29j91K22j09R5k0n1m9M7NL6JP0K1j73o2K68J88
$$ 110 -185 -179 271 266 154 -94 -28 128 -1 -192 30 -79 16 -4 -55 -104 -57 -52 -16 -15 55 76 -97 -159 109 297
3714B97k14j18K65k59k78J34J98K79j29j69M6p8P1J87j88kQ9k01p3l3J23J42K2
$$ 297 83 -35 230 -29 -307 -173 25 304 175 6 52 -26 45 232 44 42 131 -70 -143 -176 -53 89 111
3737A11k53J22o8Q9L4j35k50K12k4N5J33j66N4j05L56k89J76o1K36j80M7l34n5
$$ 111 -142 -20 -88 1 35 -100 -350 -138 -162 -107 26 -140 -86 -191 165 -124 52 -9 227 47 94 -240 -295
3760b95L68o0M5J62k41j31J93J95l00J01j80K63K20l45o9J41m1o9J84q2j9klj65
$$ -295 73 13 58 220 -21 -152 41 236 -64 37 -143 120 340 -5 -74 67 26 -43 141 59 40 38 35 -130
3784a30j34J97J09P3n7Q1k43p5K00J35k34M5K16k07n2P0K10k3j33J00k55J15j04
$$ -130 -264 -67 42 115 58 139 -104 -179 21 156 -78 -33 183 -24 -76 -6 204 181 48 148 -107 8 -96
3807i6qK6K34k23l4K14k44J05j35J50k65K93k85l4K94J53k11J5J25P0k11K48k39
$$ -96 -104 -78 156 -67 -101 113 -131 -26 -161 -11 -276 17 -268 -302 -8 145 -66 -51 74 144 -67 181 -58
3830e8N1O3mj35N6J75r3L6Rj75j55L0K8p7K56J76k11Q9j59J54k98K38mK89j82
$$ -58 -7 56 52 -83 -27 148 55 91 100 -75 -230 -200 -172 -249 7 183 -28 61 -98 56 -242 -4 -8 281 99
3855I9l97L07R8j6m9K28Oj17m04K64j76J28j05J16Q8L9p5j70j29M8K54n1k07Q6
$$ 99 -298 9 107 91 42 270 276 159 -245 19 -157 -29 -134 -18 70 109 34 -136 -265 -217 37 -14 -221 -135
3879a35J62j4L7n8J4k91J32L65r6J99m96L88k82k34L17j03J95j16k6L8j59P9L37
$$ -135 27 13 50 -8 6 -285 -153 212 116 315 -181 207 -75 -309 8 -95 100 -16 -42 -4 -163 -84 253
3902B53j45o6Q0m7k00L2L65j25k46J84l99K07O2k9lJ92k81M70n19K28rj92K65
$$ 253 108 42 122 75 -125 -93 272 147 -99 85 -314 -107 -45 -74 -77 115 -166 304 -215 13 4 -188 77
3925G7N4k03R8l9NJ4r8K50p1J97j34N4j80j71O9J1QL6k73J26J2L60Q4r6j67k37
$$ 77 131 -72 26 -13 -8 6 -92 158 87 284 150 204 24 -147 -78 -67 -59 -23 -296 -170 -158 202 286 190 23 -214
3951b14K28J56k43K21k55L35o1lj67K67j83K23k78l2q3k8K14l7l10J47M42l08
$$ -214 14 170 -73 148 -107 228 167 164 -3 264 81 304 26 -6 -89 -117 97 60 -250 -103 339 31
3973C1j36L04q9Kmm8J47k30j16J14l1J72j38k33Q4L7Q0k0L5l2j34J59K43l36K70
$$ 31 -105 199 110 112 108 60 207 -23 -139 -25 -56 116 -22 -255 -171 -134 -54 -74 -39 -71 -205 -46 197 -139 131
3998A31J5m4l89K82R7J39k81j48K66r3L41l35n4Q2j18K9k3J01p1o4J28J69k68
$$ 131 146 102 -287 -5 92 231 -50 -198 68 -25 316 -19 -73 9 -109 -80 -103 -2 -73 -137 -9 160 -108
4021a08J29J42k80J68POM8m9k06K19j59k53L24J37O1M7l17L4J1Q9P4k63J16j31
$$ -108 21 163 -117 51 58 64 112 63 -143 76 -83 -336 -12 125 186 233 -84 -50 -39 50 124 -139 -23 -154
4045a54R5J41j18J08j28Q8l15K22j27K15Rj78L97p0k85j2P3rK59l5k45L65k77
$$ -154 -59 82 -36 72 -56 32 -283 -61 -188 27 36 -142 255 185 -100 -112 -39 -48 211 176 -69 296 19
4068A9j75Q5N3R7j38p5l9J54J35o8k12l6L31k8k01l60K27L12J2j16Q6k45jL37
$$ 19 -156 -71 -18 79 -59 -134 -173 -19 116 48 -164 -200 131 103 -98 -458 -231 81 93 -23 63 -182 -183 154
4092A54k0k79K89j06k66Q2p9K19L8j24k8K36M2k48L8nk19M12r0q4Q8o5j8L39k81
$$ 154 134 -145 144 38 -228 -146 -225 -6 32 -92 -120 116 158 -90 -52 -57 -276 136 46 -38 50 -15 -33 306 25
4117B5L10l20j94L94k78J60j70J41p5J53j07o6M0J08j91k31K80J44P9j58O2N3
$$ 25 335 15 -179 215 -63 97 -73 68 -7 146 39 -27 13 121 -70 -301 -21 123 202 44 106 159
4139A59k04N3K30l73L2K05l81J78J7l4o2k9J72m9J12o7K06P3KQ7j39l40R3q2K31
$$ 159 -45 8 238 -135 -103 102 -279 -101 -84 -118 -180 -209 -37 -86 26 -41 165 238 240 327 188 -152 -59 -141 90
4164I0j71P4o4k8J58l40K40j02Q9p3J80l73N58l94J37J04j70n1O9o4K79r8o1J40
$$ 90 -81 -7 -71 -99 59 -281 -41 -143 -54 -127 53 -320 238 -156 -19 85 -85 -136 -67 -131 148 50 -11 129
4188A29j9j21%k44J79J24K42m64J1J32P5j78PK35p6Q0Q0j0l67Q7P0j8o3J95M2
$$ 129 110 -11 -11 -255 -76 48 290 -174 -163 -31 44 -134 -127 108 32 112 192 182 -185 -98 -28 -46 -109 86 128
4213A28M3l82J77j05r9L61j36L49m29N6J42q6p0L1j1M0L9r3J51N1Mk70J38R2j98
$$ 128 171 -211 -34 -139 -238 123 -13 336 -93 -37 105 19 -51 -20 -31 9 48 -45 106 157 161 -109 29 121 -77
4238g7J17o0j14M17l69p1K25Q8j64j8J03j71K11K8j27l28M43o3J16j11rj45o3
$$ -77 40 -20 -134 283 -86 -157 68 156 -8 -26 77 -94 117 145 18 -310 133 70 186 75 66 -79 -142
4261a42QO6K6j83K13J96J17r3l48L22j04j61O0J27j3J45k79l8J52J67j38Q0l6
$$ -142 -134 -68 -42 -225 -12 184 301 208 -140 182 78 -83 -23 104 91 236 -43 -81 71 238 100 180 144
4284A44m02Q3O02m04j6N9K1Lk55J68M8Q7j54%o6N9k44K79J94k93K26l72M70m22
$$ 144 -258 -175 427 23 7 66 87 90 -165 3 51 138 -16 -16 -82 -23 -267 12 206 -87 139 -233 237 -185
4308a85J19Q2P7Lq8O0j59P6J79l18R5K65j20J56j41Mj78J34p2j83k09M09J55k07
$$ -185 -66 16 93 96 8 68 -91 -15 164 -154 -59 206 86 242 101 105 -73 61 -11 -194 -403 6 161 -46
4332d6n7K17j04N5K2Rk32N5R9P5j50K54k35q3K51pR9k25j39k9L01j80L66n69J61
$$ -46 -103 114 10 65 87 96 -136 -81 18 93 -57 197 -38 -121 130 123 222 -3 -142 -171 130 -50 316 -253 -92
4357i2p2L76l27L01r2p4KK40k46P5N1r7j45M6R9J25k2k83J70N6k7L7K30m42J30
$$ -92 -164 212 -115 186 94 20 22 262 16 91 142 45 -100 -54 45 170 148 -135 35 91 64 101 331 -111 19
4382A9j19L15m14j0K55K65k18j64R7L9K88k77k5j90K50l8MNj60k5J03RJ39l99
$$ 19 -100 215 -199 -209 46 311 93 -71 26 65 353 76 51 -139 111 73 77 82 -78 -103 0 9 148 -251
4406b51N0O3N1K78k61J64j38p8L9ok72M61K3l60M33k24L24l95Q7k66M67l12R6
$$ -251 -201 -138 -87 191 -70 94 -44 -122 -83 -89 -361 100 123 -237 196 -28 296 -99 -12 -278 189 -123 -27
4429b7P8k20J70Nj09J0J31k01J0J85J1j94Q2J32K76o05J20Q7J95Ro07M91K94k83
$$ -27 51 -169 1 6 -103 -93 38 -163 -153 32 43 -151 -69 63 339 -266 -146 -59 136 145 -462 29 323 40
4453D0p2k21K28l9J8j3K44j90j65J68q2K41k68M30k62j79J04l03L67M5L37l56
$$ 40 -32 -253 -25 -64 -46 -59 185 -5 -170 -2 -84 157 -111 319 57 -122 -18 -321 46 91 428 72
4475G2j34r5r4R3J36m2J57l02J48N5j8k9m0L3K63l09j04L48j56o9q5N89m40J59
$$ 72 -62 -157 -251 -158 -22 -64 93 -209 -61 -6 -24 -53 -93 -60 203 -106 -210 138 -18 -87 -172 417 -23 136
4499A36M2k34K46P6l06J13K79j16P6j26J04m14K64j16N1k20R0L03k32p2K84j88
$$ 136 178 -56 190 266 -40 73 352 236 312 186 290 -124 140 24 75 -145 -55 248 16 -56 228 40
4521D0Q8r2J26k03K75l06J83k00l1o2J22N0N8j09J3J72p7M99m56J36l15j10R0
$$ 40 128 36 162 -41 234 -72 111 -89 -120 -182 -60 -10 48 -61 -48 124 47 546 90 226 -89 -199 -109
4544a09R4j39J68M5k10K7k03M26J35l07J40j24k33M09o3Q0k1Q8m00J70mm9j17
$$ -109 -15 -154 14 59 -151 -124 -327 99 234 -73 67 -57 -290 119 56 136 115 203 -197 -27 -31 -80 -197
4567a97p0K60N4K5j48J02m3J56l16K77r6k07L50J5k75J99j04n4J81j40j4j18J15
$$ -197 -267 -7 47 72 -76 26 -17 139 -177 100 4 -203 147 162 -113 86 -18 -72 109 -31 -45 -163 -48
4590d8j8P1L4J86j52j96OK4q6K58j73J21R7k88J66JJ86j35%j78M1k2j50M9J85
$$ -48 -66 5 39 225 73 -123 -117 -93 -179 79 -94 27 124 -164 2 3 189 54 54 -124 -83 -105 -255 -206 -21
4615b1K8J49k31j39N1L83j87k43n4K46K8J83l0q1J02P8k73K75l50Q2o3M2Q0j49
$$ -21 7 156 -75 -214 -163 220 33 -210 -264 -18 10 193 163 82 184 262 -11 264 -86 -4 -67 -25 55 -94
4639i4K0L5oJ66Lp1j08l3K41k68j68J48J54M9j27J57k35O3k20L48K88m24K05l0
$$ -94 -74 -39 -45 121 124 53 -55 -88 153 -115 -283 -135 19 68 -59 98 -137 -74 -294 54 342 -82 123 93
4663I3o7P1R1k42oJ29L0N0k32Q6O7K7K35k93j51R4JN2K6n5N4l6j26J52o6j16K58
$$ 93 26 97 188 -54 -60 69 99 149 -83 3 70 97 332 39 -112 -18 -17 35 61 6 60 24 -102 50 -16 -132 126
4690A26k34P2J20n1k9M5qk0k35OK72q6J0K2m1Q3Q2j64q2K9J87k97M0J27M7L46
$$ 126 -108 -36 84 33 4 49 41 21 -214 -208 64 -22 -12 10 -31 52 134 -30 -112 -83 104 -193 -153 -26 21 367
4716C67m04J97k75K40j15j57K3J92LJ30j21K12N2m92K54J6k74NR2J9o8L93k11
$$ 367 -37 160 -115 125 10 -147 -124 68 71 201 80 292 344 -148 106 122 -152 -147 -55 -36 -104 289 78
4739G8Q4J85r3l85r1r4K21m5M39m20j50M48o2q8k6Q5J4O5j07k6r6m4J73J48O2
$$ 78 162 347 254 -131 -222 -316 -95 -140 299 -121 -271 177 115 27 1 86 100 165 58 32 -64 -108 65 213 275
4764B75k55j28J32M5k96J63J24k62J4J79j30p6J79r2O4J90j33p6O1O5P7k77J74
$$ 275 20 -108 24 69 -227 -64 60 -202 -188 -9 -139 -215 -36 -128 -64 126 -7 -83 -22 43 120 -157 17
4787A7o4m2J65J1j74Q7O0L4o8l6k27K79m9J27l50J18J62ql00M16j72R0Q4j78R7
$$ 17 -47 -89 76 87 -87 0 60 94 26 -10 -237 42 -7 120 -230 -112 50 42 -258 158 -14 76 160 -18 79
4812G9k07N5J05O6k24L9P5N8J24r3k62K84L0k32O2J16n7J33o6l43J69q2J88j52
$$ 79 -128 -73 32 98 -126 -87 -12 46 170 77 -185 99 129 -103 -41 75 18 151 85 -258 -89 -171 17 -135
4836a35L92j60K08j01l50K53r8k01m9M57k80j2J47k21K03o2j9O6k9N6j30J28j01
$$ -135 257 97 305 204 -146 107 9 -192 -241 216 -64 -76 71 -150 53 -9 -28 38 9 65 -65 63 -38
4859c8J63k28K74k79R4l0N1K9k30L80n6l40L95K60o17J55J18J7j89N9M5J25k27
$$ -38 125 -103 171 -108 -14 -44 7 36 -194 186 130 -210 185 445 -172 -17 101 118 -71 -12 33 158 -69
4882f9N0J26k38J42k01K70Pj35J78j15K4j03k5o1J39K6M0ok40L67l51M83j95j61
$$ -69 -19 107 -131 11 -190 80 87 -48 130 15 39 -64 -89 -150 -11 15 55 49 -191 176 -175 308 113 -48
4906d8K15j21p1J41j79O7J29j42k39L46j01J76l44L47j3j11K66m69J96J14j7m52
$$ -48 167 46 -25 116 -63 4 133 -9 -248 98 -3 173 -171 176 163 52 318 -151 45 159 142 -310
4928c10K93j97M0k07M30J2k05J13M20j08l51J44m0L0l41M34m8N6l22r2P0J25J21
$$ -310 -17 -214 -174 -381 49 61 -144 -31 389 281 -70 74 34 64 -277 157 109 165 -157 -249 -179 -54 67
4951F7j17j60K3Q1k00K07K63R8k33r1J19R0n0N8N2k55K42k99L13m8j65q6R8j94
$$ 67 -50 -210 -187 -106 -306 -99 164 262 29 -62 57 147 97 155 207 -48 194 -105 208 160 -5 -91 7 -187
4975a87J35J86l95L65k94J56L86m68j10L81k20N1L8J61k75J51p4J52n6m9j69K68
$$ -187 -52 134 -261 104 -190 -34 352 -116 -226 155 -65 -14 24 185 -90 61 -13 139 83 34 -135 133
4997A33j71m8J22P6k29J77L01m95K66j53L0K6r3J38j50K69k9r9p6j21N92m08n
$$ 133 -38 -86 36 112 -117 60 361 -134 132 -21 9 35 -58 80 -70 199 170 71 -5 -126 466 58 53
5020E3j49J7J23j45J50J09n8o4Jl12K37J7k9l1R9J8j48O0l57M15j44m3J54J3k05
$$ 53 -96 -79 44 -101 49 158 100 36 37 -275 -38 -21 -50 -81 18 36 -112 -52 -409 6 -138 -181 -27 -14 -219
5045b19L96o5j42J20K31j29k84N2N2J18k71MJ38k8J68k10j46J11L42k82K2K79
$$ -219 177 112 -30 90 321 192 -92 -40 12 130 -141 -137 1 -27 141 -69 -215 -104 238 -44 -22 257
5067B57m43q9L51k37J51o6j0L07n0k82J59J4jn8q6mJ44j34K38l03K65k74K88j81
$$ 257 -186 -275 76 -161 -10 -76 -86 221 171 -111 48 62 61 3 -83 -87 57 -77 161 -142 123 -151 137 -44
5091d4KJ5K02j24rj7l8K4J1j40j52K55L60l70M32m07J62j57J3q4K36J06n2k01
$$ -44 -42 -27 175 51 42 25 -13 11 22 -118 -270 -15 345 -25 407 0 162 5 18 -66 170 276 224 23
5115B3n9M5j25J68n1P1m53K64K76k28l2J49k71K48J69j68q1j36nK50m0k46J23
$$ 23 -36 9 -116 52 1 72 -381 -117 159 -69 -101 48 -223 25 194 26 -55 -191 -196 54 14 -232 -109
5138a09J25J30k24J12j53K14J81k03N8j02k81L41J00j81j62P9K87k51r3j78M56
$$ -109 16 146 -78 34 -119 95 276 73 131 29 -252 89 189 8 -154 -75 212 -39 -132 -310 146
5159A46K2n0J52k52j06K14r6j42J60k12J09J3j35K10J47k22N5K43J7l51J45m5
$$ 146 168 118 270 18 -88 126 30 -112 48 -164 -55 -42 -177 33 180 -42 13 256 273 -78 67 22
5181B2j08J56k73K46J02j74J19k3J11J39k08j72J25j68r0M27K2n19J14N3M1p3
$$ 22 -86 70 -203 43 145 -29 90 67 178 317 109 -63 62 -106 -196 231 253 -266 -152 -99 -58 -131
5203a31K95Np4l7j19j62J85rq0K68l37R5J8J31k48K84l13J86K97o62M76m0R1j38
$$ -131 164 169 95 58 -61 -223 -38 -47 -127 141 -196 -101 -83 48 -200 84 -229 -43 254 -408 68 28 119 -19
5227a9l5J56K0n9J4j76l28L21N9J16j39L20j73p9l29N45l12K64l18j44M13j6q
$$ -19 -54 102 122 63 77 -99 -427 -106 -47 69 -70 250 77 -2 -331 214 -98 166 -152 -296 117 101 93
5250I3k03N5J05L9l7k96M98l56K06j52p0J41j19P2Kr5KJ63j83L16k76pL47r0l15
$$ 93 -110 -55 50 89 52 -244 254 -102 104 -48 -118 23 -96 -24 -22 -117 -115 48 -135 181 -95 -102 245 155 -160
5275a60J65J15j94j47K96j54m4L52k01j44K12k2j80P4J71q8k17QJ19R7k61K65
$$ -160 5 120 -74 -221 75 -79 -123 229 28 -116 96 74 -106 -32 139 51 -166 -158 -39 58 -203 62
5297F2r2K22j09l8J06j40pj32J36N8k05O6j08q4L54P6k38K79j86n3J60j21o8O1
$$ 62 -30 192 83 45 151 11 4 -128 8 66 -139 -73 -181 -265 89 165 -73 206 20 -33 127 6 -62 -1
5321al9L41k33k2j55j7L06k74K90k14J34m04L45n7J49m9kr9J2k09J55r4K47L7
$$ -1 -40 301 68 46 -109 -126 180 -94 196 -18 116 -288 57 0 149 100 98 -1 11 -198 -43 -137 110 147
5345A47k59n2O7J99o3M3j83L74m40K49mM6l14K7K26j11k06O59l65K9L7J92r1j00
$$ 147 -112 -164 -97 102 39 82 -101 273 -167 82 78 124 -190 -163 63 -48 -254 405 40 69 106 298 207 107
5369A07j28K69m40J68j12J19J1J33j94q1J54k53M89l83K86k75R2J19J13j16Q3
$$ 107 -21 248 -192 -24 -136 -17 -6 127 -67 -148 6 -247 242 -141 145 -130 -38 81 194 78 161
5390A61k86J89r3j72M25j76m4j17j7N6K73j3l56J95q5J14Q6m31K45RJ88j70J6
$$ 161 -125 64 -29 -201 224 48 4 -113 -130 -74 199 186 -170 25 -60 54 140 -291 -46 -37 151 -19 -3
5413cj68K26J13q0K4j72p4J78L1k02K49k75p0N0O3n1k64J78o9M04l88K57j0j23
$$ -3 -171 55 168 88 112 -60 -134 44 75 -127 122 -153 -223 -173 -110 -161 -425 -247 -316 88 -300 -43 -53 -176
5437a76J79R1ooj21j46M01n12N35j23Q6l51J59l27L35k83Q1Q8l3p9J84O6jRl09
$$ -176 3 94 88 82 -39 -185 216 -296 239 116 202 -149 10 -317 18 -265 -184 -96 -129 -208 -24 42 41 50 -259
5462b59M01j55Lj17J47j21J44q0L0n9L2L0J74m4j45K89j97q0N8k25J87j0j6k83
$$ -259 142 -13 -10 -127 20 -101 43 -37 -7 -66 -34 -4 170 126 -19 270 73 -7 51 -174 13 3 -13 -296
5486b96M17m75L86pj80J56k02K58o5n9K12m41R8L05q0j62R0L19l14J27j08J52
$$ -296 121 -354 32 25 -155 1 -201 57 -8 -67 145 -296 -198 107 27 -135 -45 274 -40 87 -21 131
5508A31j44n3j40r6L18p0l17M15k78R8j32L45J4P9J78n16L37j08L4k77J61J67
$$ 131 -13 -66 -206 -302 16 -54 -371 44 -234 -136 -268 77 91 170 348 -168 169 61 95 -182 -21 146
5530A46M9n0J1k51L40m2l06n5L09k6k35J52K64J31o06L80m5k41L2j17L00q4K5
$$ 146 195 145 156 -95 245 203 -103 -158 151 125 -110 42 306 437 -169 211 166 -75 -43 -160 140 56 81
5553H1j06N8l31N49l87k3L85l34P8j47K63k63K13j16N6O2r3j2L5RJ07P3k10Q4
$$ 81 -25 33 -298 251 -136 -159 226 -108 -30 -177 86 -177 36 -80 -24 38 -55 -67 -32 -23 84 157 -53 31
5577C1m7j46K64j87Ql40O31J38m61K07m00L34J36k17n0N9k92O5kJ24J70J34pj07
$$ 31 -16 -162 102 -85 -77 -417 214 352 -109 98 -302 32 168 -49 -99 -40 -332 -267 -269 -145 25 159 152 45
5601D5j9r3Q1J02r7J38o1n5j3J19n3r1J2j11J65J27k77L8J2jN6k09P8j26J75J76
$$ 45 26 -67 14 116 19 157 96 41 28 147 94 3 15 -96 69 196 -81 -43 -31 -32 24 -185 -107 -233 -58 118
5627A18K7l35K62j04k09K00K09k84O4k16K91L6n5J7J26N3j99n5j95L41k69K55
$$ 118 145 -190 72 -32 -241 -41 168 -116 -52 -268 23 59 4 21 147 200 1 -54 -249 92 -177 78
5649G8L4j70J10K2k26j0J49Kj10J82o2n2K24l10n3J53L24M5n12J26j17L09l34
$$ 78 112 -58 52 74 -152 -162 -13 -11 -121 61 -1 -53 171 -139 -192 -39 285 330 -182 -56 -173 136 -198
5672a98M4J76Q8l15K90k92K47J47q3j50MK57k99n1J61K85m79L92m55K47K29j64
$$ -198 -154 22 110 -205 85 -207 40 187 104 -46 -42 215 -84 -135 26 311 -168 224 -231 16 245 81
5694H1k26L51l59l7K22r0J92k60Q1K42O1j62j43j0m1M06k79k90L1J75K02j41m1
$$ 81 -145 206 -153 -190 32 -58 134 -126 -45 197 258 96 -47 -57 -98 308 29 -261 -230 -55 147 6 -35
5717c5R1J14M5l32J55L01k78k96P3J64r2O3o5p0J63p5j7J72j3m0Q1J03m08K02
$$ -35 56 170 215 -117 38 339 61 -235 -162 2 -90 -27 -92 -162 1 -74 -91 81 68 28 109 212 -196 6
5741FLQ8j06J47l7k44J32K74k52oj6r8N5J3j6m9KJ41k95J46J29J03r2m7Q0kP3
$$ 6 9 97 -9 138 101 -143 -11 263 11 5 -11 -109 -54 -41 -57 -106 -104 37 -258 -112 17 120 28 -19 61 59 132
5768A32k48K02j39r7K49J54p7k51J57k89L99j56l0J02J51j98j34M7M0j71k6J30
$$ 132 -116 86 -53 -150 99 253 176 -75 82 -207 192 36 6 108 259 61 -73 -26 14 -157 -183 -53
5790e3QRJ31l09J56j68R8J95ML2j48q4R0k02R9J50j21J33j75K74p9l4j24J61P
$$ -53 -45 -36 95 -214 -58 -226 -128 67 71 103 -45 -129 -39 -241 -142 8 -113 20 -155 119 40 6 -118 43 50
5815E0M8j12M4J28j19j76J10k5J79j41K22l00mK50k50k5j23K21j59J77j6N2j1
$$ 50 98 -14 30 158 39 -137 -27 -52 127 -14 208 -92 -96 154 -96 -121 -244 -23 -182 -5 -21 31 20
5838B0J38k28L10j90j3J04k57j6Q3K65n25M1L88l81L99n3k01L50jm03L11j21j34
$$ 20 158 -70 240 50 37 141 -116 -132 -49 216 -309 -268 120 -261 138 85 -116 234 233 -170 141 20 -114
5861a14p6J19R9k71J5J77O0k5O4K03m60Q7J44j42J66j79O1J60k73K56l23L37j05
$$ -114 -190 -71 28 -243 -228 -51 9 -16 48 251 -209 -122 22 -120 46 -133 -72 88 -185 71 -252 85 -20
5884b0k7J88l85K76l7n5K13R6k60L55O4l56l02L33R6k91lJ26m02L23L85l37J66
$$ -20 -47 141 -244 32 -5 -60 153 249 -11 344 408 52 -250 83 179 -112 -115 11 -391 -68 317 -20 146
5907A46k33K40m9j51q7J26j62K13K12k15Q6J37j75r5j30K08r7M16m34L11L9j61
$$ 146 -87 153 104 -47 -134 -8 -170 43 255 40 126 263 88 -7 -137 71 -26 390 -44 267 306 145
5929A45k24J12m33N05k10Q8n4J00o7m5L57k48J96k74M1J5K3l04M52j65J12j50
$$ 145 -79 33 -400 105 -105 -17 -71 29 -38 -83 274 26 222 -52 -11 4 27 -277 175 10 122 -28
5951b8J61q6J33j16k01K55N2l19P1o2J10L13m15j80K51j20K09M4p2J05n5l5M3
$$ -28 133 47 180 64 -137 118 170 -149 -78 -140 -30 283 -132 -312 -61 -181 28 72 0 105 50 15 58
$$ [...]
8191c8
##END NTUPLES=NMR FID
##END=
