##TITLE=1H_Pr NCS-26-Me
 200.13MHz,CDcl3,
 8 sc
 
 26.8.2025
##JCAMPDX= 6.0         $$ Bruker NMR JCAMP-DX V2.0
##DATA TYPE= NMR FID
##DATA CLASS= NTUPLES
##ORIGIN= UXNMR, Bruker Analytische Messtechnik GmbH
##OWNER= pz
$$ XWIN-NMR		Version 3.5
$$ Tue Aug 26 16:25:40 2025 Russian Standard Time (UT+4h)  she@DPX200
##.OBSERVE FREQUENCY= 200.1313
##.OBSERVE NUCLEUS= ^1H
##.DELAY= (6, 6)
##.ACQUISITION MODE= SIMULTANEOUS
##.ACQUISITION SCHEME= undefined
##.AVERAGES= 8
##.DIGITISER RES= 18
##SPECTROMETER/DATA SYSTEM= spect
##.PULSE SEQUENCE= zg30
##.SOLVENT NAME= CDCl3
##.SHIFT REFERENCE= (INTERNAL, CDCl3, 0, 14.3821)
##AUDIT TRAIL= $$ (NUMBER, WHEN, WHO, WHERE, WHAT)
$$ ##TITLE= Audit trail, XWIN-NMR		Version 3.5
$$ ##JCAMPDX= 5.01
$$ ##ORIGIN= Bruker BioSpin GmbH
$$ ##OWNER= she
$$ F:/spectra/data/she/nmr/H-C/1/audita.txt
$$ ##AUDIT TRAIL=  $$ (NUMBER, WHEN, WHO, WHERE, WHAT)
(   1,<2025-08-26 16:24:20.75 +0400>,<she>,<DPX200>,
      <created by zg, POWCHK disabled, PULCHK disabled
       configuration hash MD5:
       00 E9 B6 7A A2 85 ED C7 34 08 36 98 17 FE 4E 26
       data hash MD5: 16K
       EF B4 0F EB 7F EB 6A F3 32 F1 0B D2 94 B4 74 EE>)
$$ ##END=
$$ 
$$ hash MD5
$$ 0F A1 95 86 FB 9A 7D 1E EE 6C 92 32 C9 58 76 CB
##$RELAX= 
##$RELAX= 
##$RELAX= 
##$RELAX= 
##$RELAX= 
##$RELAX= 
$$ Bruker specific parameters
$$ --------------------------
##$DU= <F:/spectra>
##$EXPNO= 1
##$NAME= <H-C>
##$PROCNO= 1
##$TYPE= <nmr>
##$USER= <she>
##$AMP= (0..31)
100 100 100 100 100 100 100 100 100 100 100 100 100 100 100 100 100 100 
100 100 100 100 100 100 100 100 100 100 100 100 100 100 
##$AQSEQ= 0
##$AQ_mod= 1
##$AUNM= <au_zg>
##$AUTOPOS= <>
##$BF1= 200.13
##$BF2= 200.13
##$BF3= 200.13
##$BF4= 200.13
##$BF5= 200.13
##$BF6= 200.13
##$BF7= 200.13
##$BF8= 200.13
##$BYTORDA= 1
##$CFDGTYP= 0
##$CFRGTYP= 5
##$CHEMSTR= <none>
##$CNST= (0..31)
1 1 145 1 1 1 1 1 1 1 1 1 1 1 1 1 1 1 1 1 1 1 1 1 1 1 1 1 1 1 1 1 
##$CPDPRG= <>
##$CPDPRG1= <>
##$CPDPRG2= <>
##$CPDPRG3= <>
##$CPDPRG4= <mlev>
##$CPDPRG5= <mlev>
##$CPDPRG6= <mlev>
##$CPDPRG7= <mlev>
##$CPDPRG8= <mlev>
##$CPDPRGB= <>
##$CPDPRGT= <>
##$D= (0..31)
0 0.7 0 0 0 0 0 0 0 0 0 0.03 0 0 0 0 0 0 0 0 0 0 0 0 0 0 0 0 0 0 0 0 
##$DATE= 1756211060
##$DBL= (0..7)
120 120 120 120 120 120 120 120 
##$DBP= (0..7)
150 150 150 150 150 150 150 150 
##$DBP07= 0
##$DBPNAM0= <>
##$DBPNAM1= <>
##$DBPNAM2= <>
##$DBPNAM3= <>
##$DBPNAM4= <>
##$DBPNAM5= <>
##$DBPNAM6= <>
##$DBPNAM7= <>
##$DBPOAL= (0..7)
0.5 0.5 0.5 0.5 0.5 0.5 0.5 0.5 
##$DBPOFFS= (0..7)
0 0 0 0 0 0 0 0 
##$DE= 6
##$DECBNUC= <off>
##$DECIM= 32
##$DECNUC= <off>
##$DECSTAT= 4
##$DIGMOD= 1
##$DIGTYP= 9
##$DL= (0..7)
0 120 120 120 120 120 120 120 
##$DP= (0..7)
150 150 150 150 150 150 150 150 
##$DP07= 0
##$DPNAME0= <>
##$DPNAME1= <>
##$DPNAME2= <>
##$DPNAME3= <>
##$DPNAME4= <>
##$DPNAME5= <>
##$DPNAME6= <>
##$DPNAME7= <>
##$DPOAL= (0..7)
0.5 0.5 0.5 0.5 0.5 0.5 0.5 0.5 
##$DPOFFS= (0..7)
0 0 0 0 0 0 0 0 
##$DQDMODE= 0
##$DR= 18
##$DS= 0
##$DSLIST= <SSSSSSSSSSSSSSS>
$$ [...]
##$SUBNAM0= <"">
##$SUBNAM1= <"">
##$SUBNAM2= <"">
##$SUBNAM3= <"">
##$SUBNAM4= <"">
##$SUBNAM5= <"">
##$SUBNAM6= <"">
##$SUBNAM7= <"">
##$SUBNAM8= <"">
##$SUBNAM9= <"">
##$SW= 18.0517328524113
##$SWIBOX= (0..15)
0 0 2 0 0 0 0 0 0 0 0 0 0 0 0 0 
##$SW_h= 3612.71676300578
##$TD= 16384
##$TD0= 1
##$TE= 0
##$TE2= 300
##$TE3= 300
##$TEG= 300
##$TL= (0..7)
0 120 120 120 120 120 120 120 
##$TP= (0..7)
150 150 150 150 150 150 150 150 
##$TP07= 0
##$TPNAME0= <>
##$TPNAME1= <>
##$TPNAME2= <>
##$TPNAME3= <>
##$TPNAME4= <>
##$TPNAME5= <>
##$TPNAME6= <>
##$TPNAME7= <>
##$TPOAL= (0..7)
0.5 0.5 0.5 0.5 0.5 0.5 0.5 0.5 
##$TPOFFS= (0..7)
0 0 0 0 0 0 0 0 
##$TUNHIN= 0
##$TUNHOUT= 0
##$TUNXOUT= 0
##$USERA1= <user>
##$USERA2= <user>
##$USERA3= <user>
##$USERA4= <user>
##$USERA5= <user>
##$V9= 5
##$VALIST= <valist>
##$VCLIST= <CCCCCCCCCCCCCCC>
##$VD= 0
##$VDLIST= <DDDDDDDDDDDDDDD>
##$VPLIST= <PPPPPPPPPPPPPPP>
##$VTLIST= <TTTTTTTTTTTTTTT>
##$WBST= 1024
##$WBSW= 4
##$XGAIN= (0..3)
0 0 0 0 
##$XL= 0
##$YL= 0
##$YMAX_a= 112295
##$YMIN_a= -99117
##$ZGOPTNS= <>
##$ZL1= 120
##$ZL2= 120
##$ZL3= 120
##$ZL4= 120
##$ABSF1= 10
##$ABSF2= 0
##$ABSG= 5
##$ABSL= 3
##$ALPHA= 0
##$AQORDER= 0
##$ASSFAC= 0
##$ASSFACI= 0
##$ASSFACX= 0
##$ASSWID= 0
##$AUNMP= <proc_1d>
##$AZFE= 0.1
##$AZFW= 0.1
##$BCFW= 1
##$BC_mod= 2
##$BYTORDP= 1
##$COROFFS= 0
##$CY= -3
##$DATMOD= 1
##$DC= 2
##$DFILT= <>
##$DTYPP= 0
##$F1P= 0
##$F2P= 0
##$FCOR= 0.5
##$FTSIZE= 0
##$FT_mod= 4
##$GAMMA= 1
##$GB= 0.15
##$INTBC= 1
##$INTSCL= 1
##$ISEN= 128
##$LB= 0.25
##$LEV0= 0
##$LPBIN= 0
##$MAXI= 10000
##$MC2= 0
##$MEAN= 0
##$ME_mod= 0
##$MI= 1.114404
##$NCOEF= 0
##$NC_proc= 0
##$NLEV= 6
##$NOISF1= 3.799351
##$NOISF2= 2.8
##$NSP= 1
##$NTH_PI= 0
##$NZP= 0
##$OFFSET= 14.38212
##$PC= 1
##$PHC0= -1721.484
##$PHC1= 15.99228
##$PH_mod= 1
##$PKNL= yes
##$PPARMOD= 0
##$PSCAL= 0
##$PSIGN= 0
##$REVERSE= no
##$SF= 200.129724274929
##$SI= 16384
##$SIGF1= 3
##$SIGF2= 2
##$SINO= 400
##$SIOLD= 16384
##$SREGLST= <1H.CDCl3>
##$SSB= 0
##$STSI= 0
##$STSR= 0
##$SW_p= 3205.1282051282
##$SYMM= 0
##$S_DEV= 0
##$TDeff= 0
##$TDoff= 0
##$TI= <>
##$TILT= no
##$TM1= 0
##$TM2= 0
##$TOPLEV= 0
##$USERP1= <user>
##$USERP2= <user>
##$USERP3= <user>
##$USERP4= <user>
##$USERP5= <user>
##$WDW= 1
##$XDIM= 8192
##$YMAX_p= 0
##$YMIN_p= 0
$$ End of Bruker specific parameters
$$ ---------------------------------
##NTUPLES= NMR FID
##VAR_NAME=  TIME,          FID/REAL,        FID/IMAG
##SYMBOL=    X,             R,               I
##VAR_TYPE=  INDEPENDENT,   DEPENDENT,       DEPENDENT
##VAR_FORM=  AFFN,          ASDF,            ASDF
##VAR_DIM=   8192,          8192,            8192
##UNITS=     SECONDS,       ARBITRARY UNITS, ARBITRARY UNITS
##FACTOR=    0.0002768,     1,               1
##FIRST=     0,             0,               0
##LAST=      2.2672688,     0,               0
##MIN=       0,             -99117,          0
##MAX=       2.2672688,     112295,          0
$$ Real data points
##PAGE= N=1
##DATA TABLE= (X++(R..R)), XYDATA
$$ [...]
$$ plain form
1062 2076 3675 713 -3145 -2987 352 2627 2206 242 -1792 -2679 -742 2557 3323 206 -3105 -2735
1078 -2735 329 2721 2305 -181 -2634 -2604 168 2831 2328 -697 -2681 -1780 574 2092 1957 228
1094 228 -1988 -2402 -105 2424 2530 1 -2499 -2552 -98 2627 2687 -331 -3096 -2460 799 2768 1747
1111 1747 -532 -2102 -2008 -14 2597 2794 -338 -3260 -2276 1268 2907 1399 -1015 -2168 -1604 257
1127 257 2356 2085 -622 -2682 -1800 783 2255 1739 -278 -2253 -2290 401 3101 2354 -1068 -3117 -1601
1144 -1601 1205 2470 1404 -760 -2435 -2028 582 2843 1885 -1190 -2814 -1501 1131 2606 1660 -858
1160 -858 -2688 -1612 1366 2760 1160 -1348 -2145 -1156 633 1985 1763 -711 -2825 -1880 1229 2822
1176 2822 1328 -1286 -2424 -1200 1177 2574 1589 -1204 -2663 -1106 1543 2370 939 -1112 -2211
$$ packed form
1062B076J599k962l858J58L339K275m21j964k034q87J937L299P66l117l311L70
1078b735L064K392m16k486k453L0K772K663n03l025j984R01K354J518j35j729
1094B28k216m14K297K529J06k529k500n3K454K725O0l018k765O36L259J969j021
1111A747k279j570R4J994K611J97l132k922R84L544J639j508k414j153N64J861
1127B57K099k71k707k060Q82K583J472n16k017j975l7K691K700p47l422k049J516
1144a601K806J265j066k164j675M07K610K261r58l075j624J313K632J475r46k518
1160h58j830J076K978J394j600k508p97R89J789J352k22k474k114R45L109J593
1176B822j494k614j138J224K377J397r85k793j459J557K649Q27j431k051j099
$$ plain form
1191 -2211 -1482 925 2760 1506 -1629 -3009 -943 1867 2309 606 -1261 -1988 -1067 1098 2540 1311
1207 1311 -1397 -2544 -903 1517 2331 925 -1319 -2520 -1226 1500 2671 728 -1876 -2273 -439
1222 -439 1491 1951 913 -1068 -2301 -1042 1640 2645 766 -1838 -2262 -553 1625 2225 619 -1702
1238 -1702 -2433 -631 1843 2125 242 -1659 -1941 -613 1355 2247 922 -1706 -2540 -441 2181 2273 70
1255 70 -1826 -1833 -384 1473 2019 495 -1773 -2228 -283 1803 2003 332 -1587 -1998 -423 1791 2337
1272 2337 271 -2110 -2032 196 2006 1654 -8 -1560 -1859 -402 1658 2061 204 -1969 -2038 78 1879
1289 1879 1878 13 -1843 -1871 66 2013 1911 -197 -1938 -1561 97 1684 1689 109 -1858 -2059 8 2093
1307 2093 1874 -433 -2049 -1579 319 1854 1630 -135 -1821 -1646 335 1935 1562 -265 -1707 -1549
$$ packed form
1191b211P29K407J835j254l135j380K066K810M42j703j867p27R21K165J442j229
1207A311k708j147J641K420Q14j406k244j201J294K726J171j943k604l97J834
1222d39J930M60j038j981j233J259K682J005j879k604m24J709K178O00j606k321
1238a702p31J802K474K82j883j901k82J328J968Q92j325k628q34K099K622R2k203
1255G0j896pJ449J857N46j524k268m55J945K086K00j671j919m11J575K214N46
1272B337k066k381P8K228J810l52j662j552k99J457K060M03j857k173o9K116J801
1289A879jj865j856k8J937J947j02k108j741L77J658J587Nj580j967k01K067K085
1307B093k19k307j616M70J898J535k24j765j686J75J981J600l73j827j442J58
$$ plain form
1323 -1549 52 1737 1697 -231 -2166 -1794 474 2072 1350 -568 -1797 -1286 320 1773 1575 -310
1339 -310 -1930 -1507 581 2091 1448 -618 -1967 -1371 617 1972 1287 -760 -1929 -1199 671 1704
1355 1704 1149 -459 -1671 -1308 488 2018 1453 -577 -1951 -1207 753 1911 1197 -735 -1938 -1250
1371 -1250 681 1839 1122 -803 -1846 -1158 726 1836 1174 -741 -1910 -1071 941 2029 972 -958
1387 -958 -1796 -804 907 1673 853 -834 -1714 -973 711 1702 1021 -766 -1907 -1010 949 1937 951 -1047
1405 -1047 -1886 -709 1108 1793 724 -1005 -1705 -870 935 1810 811 -1138 -1914 -723 1189 1714 532
1422 532 -1169 -1619 -554 1042 1658 691 -969 -1564 -606 1096 1678 596 -1007 -1673 -633 992 1682
1439 1682 725 -1193 -1886 -613 1281 1822 340 -1380 -1535 -176 1156 1541 484 -1111 -1646 -438
$$ packed form
1323a549J601J685m0j928j935L72K268J598p22j918j229N11J606J453j98j885
1339c10j620M23K088J510o43k066j349N96J988J355o85k047j169P30J870J033
1355A704n55j608j212L63J796J530n65k030j374P44J960J158p14j932j203O88
1371a250J931J158p17j925j043O88J884J110o62j915j169Q39K012J088j057j930
1387i58q38R92J711P66q20j687q80P41J684R91o81j787j141Q97J959R88r86j998
1405a047q39J177J817O85j069j729p00Q35J805Q75r99j949p76J191J912N25j182
1422E32j701m50J065J596O16r67j660n95R58J702N82j082j603o66J040J625O90
1439A682r57j918o93J273J894N41j482j720j55J359J332L85j057j595n35J208
$$ plain form
1455 -438 1353 1725 258 -1502 -1573 -80 1244 1347 159 -1141 -1421 -349 1074 1537 387 -1121 -1488
1472 -1488 -233 1318 1559 263 -1216 -1440 -253 1233 1506 195 -1352 -1546 -154 1409 1397 -65
1488 -65 -1466 -1319 54 1241 1316 185 -1211 -1483 -14 1515 1477 -143 -1506 -1140 225 1137 955 2
1506 2 -1132 -1298 -259 1251 1480 14 -1469 -1287 238 1477 1160 -110 -1295 -1184 97 1371 1282
1523 1282 -209 -1477 -1197 272 1406 1073 -290 -1362 -1080 267 1321 1059 -241 -1304 -1036 313
1539 313 1400 962 -293 -1249 -944 311 1250 999 -170 -1239 -1185 113 1432 1199 -486 -1590 -1017
1556 -1017 613 1350 811 -415 -1193 -929 313 1399 1076 -428 -1493 -847 650 1336 661 -538 -1220
1573 -1220 -854 387 1297 857 -578 -1338 -781 537 1263 732 -396 -1172 -823 459 1410 834 -588 -1354
$$ packed form
1455d38J791L72j467j760p1J493J324J03j188j300k80J072J423M63j150j508l67
1472a488J255J551K41j296j479k24J187J486K73j311j547j94J392J563j2j462
1488f5j401J47J373J187P5j131j396k72J469J529l8j620j363L66J365R12j82r53
1506Bj134j66J039J510K29j466j483J82J525J239l17j270j185J11J281J274q9
1523A282j491j268K80J469J134l33j363j072K82J347J054k62j300j063K68J349
1539C13J087m38j255r56L05J255R39k51j169j069N4J298J319k33j685j104N73
1556a017J630P37n39j226p78K64J242J086l23j504j065O46J497O86o75j199o82
1573a220L66J241R10m40j435p60N57J318P26n31j128p76L49J282R51n76j422p66
$$ plain form
1591 -1354 -704 637 1344 658 -677 -1256 -663 701 1208 542 -608 -1275 -622 641 1275 678 -692 -1314
1609 -1314 -545 850 1238 439 -726 -1150 -501 578 1169 553 -662 -1267 -591 704 1207 455 -647 -1129
1627 -1129 -478 743 1248 590 -787 -1243 -330 830 1095 337 -706 -1089 -455 688 1223 395 -897 -1247
1645 -1247 -300 835 1093 211 -780 -1045 -273 844 1128 296 -782 -1080 -290 812 1038 277 -792 -1159
1663 -1159 -295 887 1131 97 -905 -1022 -124 792 978 268 -832 -1027 -136 926 1094 133 -873 -940
1681 -940 -112 762 996 157 -893 -1086 -59 963 918 -31 -814 -815 -100 800 949 126 -874 -1045 9
1700 9 1051 847 -10 -916 -816 -52 854 893 -24 -995 -883 69 906 782 -73 -888 -844 37 964 971 -94
1721 -94 -978 -809 196 935 755 -106 -898 -804 52 953 791 -174 -999 -774 77 861 765 -109 -932 -781 189
$$ packed form
1591a354O50J341P07o86j335n79N93J364N07o66j150o67O53J263O34n97j370o22
1609a314P69J395L88p99j165m24O49J079N91o16j215o05O76J295N03p52j102m82
1627a129O51J221N05o58j377m56R13J160K65p58j043l83O34J143N35q28j292l50
1645a247R47J135K58q82r91k65P72J117K84q32j078k98P90J102K26p61j069l67
1663a159Q64J182K44j034j002j17Q98R16J86p10j100j95Q91J062J68r61j006o7
1681i40Q28Q74K34q39j050j93J027J022m5r49p83jP15R00J49q23j000j71J054
1700IJ042k04q57r06J00P64R06L9r17r71J12R52Q37j24q55q15M4Q81R27Pj065
1721i4q84J69J005P39j80q61p92R4Q56R01j62r65q25K25Q51P84r6q74q23J51R70
$$ plain form
1742 189 1016 748 -296 -913 -653 281 797 689 -229 -980 -763 253 1002 618 -335 -936 -539 331 914
1761 914 670 -232 -935 -623 362 949 554 -342 -882 -540 277 880 645 -419 -1087 -589 411 904 519
1780 519 -471 -842 -488 360 855 541 -362 -879 -394 475 880 470 -436 -854 -526 442 873 362 -553 -939
1800 -939 -399 485 881 393 -382 -835 -439 523 917 409 -561 -831 -345 480 867 352 -526 -946 -401 553
1820 553 899 258 -613 -832 -249 519 771 369 -475 -820 -307 645 953 250 -619 -792 -166 583 784 222
1840 222 -594 -833 -246 549 744 224 -574 -741 -171 563 793 247 -635 -804 -162 719 784 100 -592 -681 -140
1861 -140 585 772 63 -700 -767 -74 613 679 22 -605 -722 -75 647 750 40 -681 -652 70 633 616 68
1882 68 -565 -712 -126 676 700 30 -812 -699 -10 652 617 -26 -708 -634 8 669 611 -45 -705 -612 75 632
$$ packed form
1742A89Q27k68j044o17K60R34N16j08r18p51K17J016P49l84r53o01L97Q70N83
1761I14k44r02p03L12R85N87l95q96n40L42Q17O03k35j064o68M98J000M93l85
1780E19r90l71L54Q48M95l14r03n17M85Q69M05m10r06m18L28R68M31n11r15l86
1800i39N40Q84L96m88p75m53L96R62L94n08r70k70M86Q25L87n15q78m20N45R54
1820E53L46o41q71k19N83P68K52m02q44l45N13R52L08p03q69j73O26P49K01n62
1840B22q16k39N87P95J95n20p98j67N70P34K30n46q82j69O42Q81O5o84o92q9N41
1861a40P25J87p09p63o7O93O87O6o57o27j17O47P22J03p10p21K9P22N63j7n48
1882F8o33j47N86Q02K4o70q42J13O89O62l5o43o82P4O42O61n8o56o60R3O87N57
$$ plain form
1904 632 607 -82 -783 -632 93 741 532 -148 -675 -579 121 689 600 -78 -698 -563 235 724 507 -128 -698
1925 -698 -531 147 635 612 -117 -785 -590 169 726 438 -221 -672 -448 219 626 485 -133 -642 -503 247
1945 247 721 489 -276 -656 -405 261 687 378 -245 -645 -463 218 691 443 -231 -695 -424 324 751 401
1965 401 -320 -662 -330 354 715 394 -368 -720 -431 379 698 332 -438 -698 -326 342 633 360 -328 -683
1985 -683 -285 410 694 267 -309 -668 -215 350 612 247 -372 -628 -312 294 838 285 -462 -756 -235 499
2005 499 628 155 -391 -532 -253 396 640 224 -453 -646 -146 495 576 125 -535 -590 -223 437 656 211 -509
2026 -509 -685 -102 479 531 73 -454 -576 -110 422 615 159 -461 -660 -138 446 633 39 -560 -629 -104 560
2047 560 553 79 -517 -496 -106 446 569 161 -535 -585 22 578 515 -45 -464 -469 -34 400 522 67 -574 -590 45
$$ packed form
1904F32k5o89p01J51P25O48k09o80n27R6P00N68q9o78o20J35P98M89k17o35n70
1925f98J67O78M88k3p29o68J95P59N57k88o59m51K24O67M07j41o18n09J39P50
1945B47M74k32p65l80K51O66M26l09o23m00J82O81M73k48o74m64K71P48M27l50
1965D01p21l42L32O84L61l21p62l52K89Q10L19l66p70k60L72O68K91k73o88l55
1985f83L98O95K84m27n76l59M53N65K62l65o19k56L16O06N44n53p47k94N21P34
2005D99J29m73n46j41K79O49K44m16o77j93N00O41Q1m51o60n5L67O60K19m45p20
2026e09j76N83N81N2m58n27j22M66N32J93m56o20j99N22N84J87n94n99o9N25O64
2047E60pm74n96K1L90N52J23m08o96n0O07N56o3n60m19nM35M34J22m55o41j6O35
$$ plain form
2070 45 536 486 -82 -465 -517 -27 524 583 16 -578 -521 93 609 427 -110 -558 -477 34 508 528 -101 -611
2092 -611 -493 64 551 466 -101 -561 -439 157 592 480 -177 -590 -371 69 504 416 -71 -603 -479 171 611
2113 611 400 -254 -591 -319 226 546 396 -185 -594 -426 213 608 343 -223 -524 -259 114 487 367 -124
2133 -124 -657 -438 240 594 286 -315 -538 -291 182 515 349 -222 -628 -315 292 562 365 -355 -545 -397
2153 -397 258 600 338 -340 -619 -259 278 521 251 -249 -505 -290 226 662 316 -315 -543 -196 295 508
2173 508 257 -231 -491 -299 316 630 141 -374 -511 -188 335 538 222 -268 -546 -243 393 543 204 -440
2193 -440 -474 -84 354 463 167 -372 -565 -140 380 563 109 -365 -492 -178 363 540 178 -372 -479 -84
2213 -84 435 500 58 -381 -452 -107 409 488 57 -442 -546 -54 411 421 -12 -348 -493 -60 382 566 86 -509
$$ packed form
2070D5M91n0n68l83n2M90N51N9n67n94N7O14N16j82n37m48Q1N11M74K0o29n10
2092f11J18N57M87q5n67m60J22N96M35j12o57m13K19M40M35q8m87n32J24O50M40
2113F11k11o54l37K72N45L20j50n81m09J68O39L95k65n66l01K65L73L73j20m91
2133a24n33K19O78L54l08o01k23K47M73L33j66n71m06L13O07K70j97p20j90J48
2153c97O55L42k62o78k79L60N37K43k70n00k56K15N16M36l46o31k28L47M91K13
2173E08k51m88k60J92O15L14m89n15j37L23N23K03l16m90k78L03O36J50l39o44
2193d40l4L90M38J09k96n39j93M25N20J83m54m74j27L14N41J77l62n50j07L95
2213h4N19O5m42m39p1L45N16P9m31m99j04M92M65J0m33l36j45M33M42J84m80n95
$$ plain form
2235 -509 -487 -36 502 455 19 -376 -496 -44 397 508 48 -510 -439 62 449 466 28 -401 -455 44 504 504
2257 504 -27 -450 -375 74 472 456 -44 -418 -480 44 471 384 -88 -486 -370 58 368 354 -80 -492 -403 60
2279 60 521 390 -112 -392 -317 86 475 402 -118 -526 -367 137 523 300 -84 -404 -349 99 490 446 -81 -468
2301 -468 -341 181 542 310 -174 -469 -351 127 514 283 -220 -492 -312 179 464 228 -198 -477 -327 146
2321 146 512 312 -220 -494 -228 215 438 277 -153 -472 -319 202 503 206 -265 -503 -234 250 461 264
2341 264 -250 -458 -211 268 444 238 -251 -477 -173 243 526 221 -254 -500 -178 306 405 70 -258 -490
2361 -490 -195 238 481 197 -300 -552 -147 359 471 143 -249 -446 -151 254 501 135 -377 -465 -108 293
2381 293 469 103 -344 -450 -76 384 507 134 -349 -364 -55 347 424 134 -289 -431 -94 332 434 60 -361
$$ packed form
2235e09K2M51N38m7m36l95j20M52M41J11m60n58P1N01L87J7m38m29n4M99M60%
2257E04n31m23P5M49L98j6n00l74o2N24M27q7m72l98J16M28L10j4m34m12Q9M63
2279F0M61j31n02k80P5M03L89p3n20m08J59N04L86k23l84l20N5M48L91m4n27l87
2301d68J27N22L61k32m84k95J18M78L87k31n03k72J80M91K85k36m26k79J50M73
2321A46L66k00n32k74K66M43K23j61m30l19J53N21L01k97m71k38K69M84K11j97
2341B64n14k08K47M79J76k06m89k26L04M16K83l05m75k46L22M84R9l35l28k32
2361d90K95M33K43k84m97k52M05N06J12l28l92j97K95M05K47l66n12q8L57M01
2381B93J76l66m47j06L74M60J23l73m83j5L09M02P7k90m23j42L37M26J02l74m21
$$ plain form
2402 -361 -455 -103 346 396 43 -389 -477 -32 407 448 12 -327 -404 -26 370 447 122 -466 -416 -26 433 409 18
2425 18 -349 -339 -6 362 378 59 -393 -362 18 437 363 -7 -367 -381 37 417 359 15 -359 -394 -33 306 387
2448 387 -25 -415 -370 74 386 367 -41 -361 -350 139 393 332 -1 -389 -339 68 441 388 -15 -419 -242 89
2470 89 348 300 -100 -405 -348 34 443 318 -101 -422 -307 185 377 281 -93 -389 -327 85 422 268 -144 -481
2492 -481 -332 189 427 197 -146 -416 -255 186 421 327 -122 -441 -232 188 490 213 -158 -415 -223 136
2512 136 390 256 -160 -467 -230 209 437 274 -214 -355 -232 173 440 240 -193 -391 -239 232 485 221
2532 221 -270 -495 -166 293 385 147 -221 -404 -193 160 429 259 -192 -424 -162 269 484 142 -239 -398
2552 -398 -132 218 383 180 -230 -484 -158 201 394 109 -283 -325 -130 220 371 85 -287 -360 -126 291 421
$$ packed form
2402c61r4L52M49N0l53m32q8M45M39M1m36l39p7L78L96P7l25n88N0L90M59k4l91
2425A8l67J0L33L68J6l19m52L1L80M19p4l70l60j4M18L80n8l44l74l5L61L39Q1
2448C87m12l90M5M44L12j9m08l20J1M89K54o1l33l88N0M07L73n3m03m04J77L31
2470H9K59m8m00l05N7L82M09j25m19l21J15M92J92r6l74k96O2M12L37j54m12l37
2492d81J49N21K38k30l43k70J61M41K35r4m49l19K09M20L02k77l71k57J92L59
2512A36K54j34m16l07K37M39K28j63m88j41J23M05K67k00m33j98J52M71K53k64
2532B21m91k25L29M59R2k38l68j83K11L53K69j70m51k32K62M31K15l42l81j59
2552c98K66L50J65k03m10k54L26L59J93k85l92m2J95L50J51k86l72p3K34M17J30
$$ plain form
2573 421 90 -306 -330 -152 277 370 45 -290 -395 -126 243 369 63 -345 -341 -29 303 391 75 -274 -367 -21
2595 -21 354 388 -1 -302 -356 -57 319 374 29 -391 -335 25 320 269 44 -304 -302 -46 316 381 -8 -296 -278
2618 -278 43 294 312 -32 -317 -379 -17 355 393 -54 -318 -300 49 291 258 54 -333 -273 -5 321 311 -53
2640 -53 -297 -237 75 330 325 -32 -381 -346 4 364 218 -105 -359 -302 50 341 331 -85 -389 -236 114 389
2662 389 231 -121 -325 -252 49 363 318 -139 -365 -208 163 324 250 -91 -319 -269 35 353 310 -177 -407 -228
2684 -228 157 292 124 -76 -338 -250 103 326 239 -146 -407 -220 116 324 200 -131 -382 -208 221 434 222
2705 222 -129 -312 -174 146 274 206 -98 -409 -235 162 344 163 -250 -320 -113 152 293 230 -151 -363 -176
2726 -176 210 338 87 -210 -308 -62 147 258 118 -236 -357 -157 270 258 9 -258 -274 -123 246 334 127
$$ packed form
2573D21l31l96k4J78M29R3l25l35j05K69L69J26l06m08ML12L32Q8l16l49r3L46
2595b1L75L4l89l01n4K99L76N5l45m20N6L60K95n1k25l48KK56L62O5l89k88J8
2618b78L21K51J8l44k85o2L62L72L8m47k64J8L49K42l3k04l87O0K68L26j0l64
2640e3k44O0L12K55nl57l49L5L50L60j46l23k54N7L52K91j0m16l04J53L50K75
2662C89j58l52k04P3L01L14m5m57k26J57L71J61p4l41k28N0L04L18m3m87k30J79
2684b28L85J35j68k00k62Q8L53K23q7l85k61J87L36K08j24l31k51J74M29K13k12
2705B22l51j83J38L20J28o8l04l11J74L97J82j81m13p0K07K65J41o3l81k12J87
2726a76L86J28k51k97r8K46K09J11j40l54j21K00M27j2k49k67j6J51L69Q8k07
$$ plain form
2747 127 -205 -290 -83 267 349 126 -163 -356 -94 211 373 118 -253 -346 -48 167 227 70 -205 -335 -133
2768 -133 239 363 66 -251 -252 -59 193 297 77 -243 -345 -70 280 329 24 -315 -327 -22 163 289 24
2789 24 -268 -298 -30 237 310 48 -246 -257 -47 240 281 58 -301 -310 -10 318 192 -12 -304 -296 -44 245 288
2812 288 -34 -313 -307 18 283 295 12 -275 -259 30 255 273 -87 -314 -274 90 283 173 -25 -259 -259 39 285
2835 285 293 -33 -327 -222 49 282 164 -75 -235 -232 27 315 189 -76 -260 -186 73 306 221 -42 -304 -205
2857 -205 56 292 201 -50 -237 -162 62 252 252 -71 -282 -237 108 338 175 -165 -265 -160 90 206 231 -65
2879 -65 -299 -258 162 282 124 -134 -211 -141 67 293 181 -92 -247 -218 158 286 106 -164 -263 -150 92 232
2901 232 155 -136 -300 -136 100 254 116 -128 -291 -104 125 295 123 -181 -224 -142 156 276 105 -86 -237
$$ packed form
2747A27l32q5K07L50Q2k23k89j93K62L05J62k55l71r3K98K15O0j57k75j30K02
2768a33L72J24k97l17jJ93K52J04k20l20j02K75L50M9l05l39j2L05J85J26k65
2789B4k92l0K68K67P3k62k94j1K10K87M1k23l59rL00L28j26k04k92QK52K89M3
2812B88l22k79OL25K65J2k83k87J6K89K25J8l60k27M0L64J93j10j98k34%K98K46
2835B85Ql26k94J05K71K33j18k39j60LK59K88j26k65j84P4K59K33q5k63k62R9
2857b05K61K36r1k51j87P5K24J90%l23k11M5L45K30j63l40j00J05K50J16K5k96
2879f5k34M1M20J20j58k58p7P0K08K26j12k73j55K9L76J28j80k70r9J13K42J40
2901B32p7k91j64J64K36J54j38k44j63J87K29J70j72l04m3Q2K98J20j71j91j51
$$ plain form
2922 -237 -112 106 317 111 -227 -245 -77 132 257 82 -126 -236 -124 136 315 92 -249 -299 -46 157 224
2943 224 95 -143 -241 -98 206 329 122 -210 -191 -26 209 309 13 -193 -253 -91 181 216 71 -187 -241 -46
2965 -46 173 238 32 -220 -272 -14 224 230 28 -169 -221 -46 213 234 12 -210 -225 21 142 188 29 -180 -169
2988 -169 7 201 246 2 -163 -225 27 264 196 -5 -168 -173 -74 196 221 25 -183 -157 -28 202 191 40 -226
3011 -226 -162 -10 194 144 30 -190 -161 -16 240 242 6 -250 -256 33 232 166 -36 -245 -176 6 178 185 -55 -226
3035 -226 -151 17 284 198 -36 -212 -123 49 189 193 -54 -208 -131 5 219 139 -28 -189 -140 61 231 158 -57
3058 -57 -179 -162 66 197 170 -31 -155 -92 70 179 109 -63 -269 -133 38 218 167 -71 -204 -153 80 224
3080 224 150 -73 -173 -143 130 262 146 -65 -199 -107 82 213 181 -74 -205 -119 117 187 102 -116 -212 -82 106
$$ packed form
2922b37J25K18K11k06l38j8J68K09J25j75k08j10J12K60J79k23l41n0K53K03O7
2943B24j29k38r8J43L04J23k07l32J9J65K35J00k96k06o0J62K72L5j45k58n4J95
2965d6K19O5k06k52n2K58K38Ok02j97n2J75K59K1k22k22j5K46J21M6j59k09J1
2988a69J76J94M5k44j65o2K52K37o8k01j63nR9K70K5j96k08K6J29K30j1j51k66
3011b26O4J52K04n0j14k20K9J45K56Kk36k56oK89J99o6k02k09O9J82J72Pk40j71
3035b26P5J68K67q6k34j76Q9J72J40Mk47j54P7J36K14q0j67j61M9K01J70p3k15
3058e7j22J7K28J31k7k01j24O3J62J09p0j72k06J36J71J80n1k38j33N1K33J44
3080B24p4k23j00L0K73J32j16k11j34R2J89J31l2k55j31Q6K36P0q5k18r6J30J88
$$ plain form
3103 106 214 115 -45 -200 -77 40 216 100 -66 -215 -92 126 182 94 -115 -166 -97 156 207 75 -90 -184
3125 -184 -121 111 167 92 -106 -192 -42 141 171 63 -170 -202 -43 120 173 49 -177 -205 -73 98 139 89 -192
3148 -192 -244 -35 146 209 65 -107 -129 -122 136 224 73 -144 -215 -89 157 226 48 -161 -196 -22 87 160 54
3171 54 -78 -152 -46 160 178 -23 -177 -155 -62 115 192 -14 -115 -160 -48 207 124 32 -175 -180 -63 165 110 54
3195 54 -127 -109 -40 141 176 37 -179 -179 -23 160 185 19 -114 -130 -27 117 90 -29 -167 -159 -4 153 162 45
3219 45 -121 -136 37 111 114 59 -145 -144 18 176 174 -74 -135 -166 62 159 130 -26 -124 -143 86 193 150 -40 -159 -46
3245 -46 68 148 110 31 -163 -131 69 112 104 -17 -179 -73 31 68 125 -104 -176 -133 57 167 116 -4 -189 -82
3269 -82 18 161 110 -39 -202 -94 -1 153 114 -18 -162 -102 80 169 61 -65 -113 -71 64 153 123 3 -141
$$ packed form
3103A06J08r9j60j55J23J17J76j16j66j49J23K18N6q8k09n1O9K53N1j32j65r4
3125a84O3K32N6p5j98q6J50J83L0j08k33l2J59J63N3j24k26k8J32J71M1n0k81
3148a92n2K09J81O3j44j72k2PK58Q8j51k17p1J26K46O9j78k09l5J74J09P3j06
3171E4j32p4J06K06J8k01j54K2R3J77P7k06j01m5J12K55q3r2k07nJ17K28n5n6
3195E4j81J8O9J81L5j39k16%J56J83K5j66j33j6J03J44k7j19j38QJ55J57Rj17
3219D5j66j5J73P4Ln5k04JJ62J58kk48o1l1K28R7k9j56r8j9K29J07m3j90j19J13
3245d6J14Q0l8p9j94L2K00M3qj21j62J06J04L7N7k29p2M3J90J10n1j20j85J07
3269h2J00J43n1j49j63J08R3J54l9j32j44O0J82Q9j08j26m8M2J35Q9l0j20j44
$$ plain form
3292 -141 -140 79 116 153 -86 -137 -106 58 154 115 -66 -156 -65 91 131 73 -23 -169 -45 76 196 66 -89 -164 -26
3317 -26 129 92 53 -103 -139 -113 87 114 128 -42 -126 -42 121 168 68 -88 -115 -1 75 130 42 -74 -165 -90 79
3342 79 164 63 -64 -184 -58 81 156 64 -71 -131 -47 115 147 35 -70 -151 -55 69 179 55 -37 -126 -46 69
3366 69 180 -14 -114 -132 35 131 117 111 -116 -119 -70 61 135 31 -122 -105 -49 104 130 33 -80 -136 14 106 122 15
3392 15 -94 -99 -58 80 105 23 -80 -112 20 78 78 57 -141 -135 -36 105 96 17 -129 -88 13 58 131 -5 -119 -138 19
3419 19 112 63 57 -147 -103 -11 126 89 -48 -100 -98 13 73 106 4 -51 -117 28 139 166 -56 -104 -57 -14 40 83 -3
3446 -3 -111 -72 -14 146 183 7 -70 -62 32 92 132 -48 -17 -58 9 117 69 -49 -72 -81 8 112 35 50 -82 -34 -17 73
3474 73 82 -89 -104 -59 54 90 39 -4 -109 -22 31 126 59 -43 -97 -61 -14 103 34 4 -142 -55 45 49 99 -87 -73
$$ packed form
3292a41JK19L7L7k39n1L1J64R6l9j81r0R1J56M0n8r6j46J24J21J20j30j55p5J38
3317b6J55l7l9j56l6K6K00K7J4j70q4Q4J63M7j00j56k7J14P6N5q8j16r1P5J69
3342G9Q5j01j27j20J26J39P5r2j35o0Q4J62L2j12j05q1R6J24J10j24r2q9Q0J15
3366F9J11j94j00j8J67R6j4ok27lM9J31P4j04j53J7N6J53K6r7j13n6J50R2J6j07
3392A5j09nM1J38K5q2j03l2J32N8%k1j98OR9J41rp9j46M1J01M5P3j36j14j9J57
3419A9R3m9ok04M4R2J37l7j37n2KJ11O0L3j02n5o6J45J11K7k22m8M7M3N4M3q6
3446cj08L9N8J60L7j76p7QR4O0M0j80L1m1O7J08m8j18k3rQ9J04p7J5j32M8J7R0
3474G3Rj71j5M5J13L6n1m3j05Q7N3R5o7j02n4L6M7J17o9l0j46Q7J00MN0j86J4
$$ plain form
3501 -73 -99 26 112 31 37 -58 -58 25 96 97 -74 -70 -48 46 124 38 -54 -121 -48 24 134 73 -53 -72 -8 55 116 25 -96 -77
3531 -77 -84 78 147 78 -20 -157 -16 111 66 49 -112 -76 -10 20 65 77 -41 -63 -33 -4 99 17 -33 -80 -21 53 57 -10
3559 -10 -66 -61 -56 29 78 47 -75 -117 -58 30 102 -3 -69 -77 -54 65 144 -14 -84 -75 -23 7 86 21 -73 -150 -8 71 2 14
3589 14 -103 -93 19 41 124 2 -57 -56 -47 85 27 -5 -50 -73 3 29 43 51 24 -29 -17 55 154 -21 -84 -102 -13 159 12
3618 12 -3 -130 -106 47 87 72 -36 -50 -56 1 70 105 5 -68 -45 -19 34 14 46 -83 -2 0 56 110 49 -37 -57 -43 50
3647 50 43 -31 -65 28 -13 134 112 -18 -102 -33 23 100 89 -9 -9 -22 71 72 78 -17 -149 -77 -23 84 51 9 -51 -36 13 110
3677 110 57 35 -46 -45 64 120 40 -7 -91 -69 -14 35 67 -13 -89 -4 17 35 108 -49 -44 -50 -16 45 17 -28 -58 -40 -21 45
3707 45 46 -12 -52 -57 13 109 36 -32 -90 -41 89 29 47 -57 -104 -43 13 40 13 -29 -72 -56 32 60 -21 21 -72 4 60 52 2
$$ packed form
3501g3k6J25Q6q1Or5%Q3P1Jj71MK2R4P8q6r2o7P3P2J10o1j26j9O4O3O1r1j21J9
3531g7pJ62O9o9r8j37J41J27m5j7j61L6O6L0M5J2j18k2L0K9J03q2n0m7N9P4Mo7
3559a0n6NNQ5M9l1j22m2N9Q8P2j05o6qK3J19P9j58p0RN2L0P9o5r4p7J42P9o9J2
3589A4j17J0J12K2Q3j22n9JRJ32n8l2m5k3P6K6J4Qk7n3J2P2R9j75o3j8Q9J72j47
3618A2j5j27K4J53M0j5j08j4oN7O9L5j00p3K3K6N3k0L2j29Q1KN6N4o1q6k0J4R3
3647E0pp4l4R3m1J47k2j30q4O9N6P7j1r8%j3R3JOr5j32P2N4J07l3m2o0J5M9R7
3677A10n3k2q1JJ09N6q0m7q4K2N5M9L2q0p6Q5K1J8P3j57NoL4O1k8m5l0J8J9O6
3707D5Jn8m0nP0R6p3o8n8M9J30o0J8j04m7O1N6K7k7m2m3J6Q8K8q1M2r3P6N6qn0
$$ plain form
3738 2 -45 -16 -10 49 72 1 32 -23 -28 14 62 -8 -88 -87 -15 52 94 43 5 -56 -39 32 20 -26 -90 -48 -61 74 1 7 -47 -44 9
3771 9 28 2 -39 -30 -16 25 33 2 -23 -73 4 30 57 88 6 -40 -110 15 30 -7 -16 -67 -36 -6 29 6 -34 -58 -65 22 55 57 -41
3804 -41 -13 -37 47 77 7 -44 -36 -2 -10 15 -5 -12 -18 -20 14 -4 13 63 -55 11 7 49 32 12 -92 -31 -3 116 69 -10 -40 -20
3836 -20 -19 44 -22 -56 -25 -68 24 -11 29 -3 -21 5 26 83 46 -23 -13 -32 28 26 4 -83 -26 -15 35 71 61 -17 -87 32 -11
3867 -11 81 55 -49 18 -68 40 3 30 11 -39 11 69 56 15 3 -9 -22 -5 46 5 -20 -54 -39 29 25 37 -34 -42 -18 44
3897 44 49 24 -39 -78 -1 71 -10 -11 -53 0 26 70 75 -23 -22 -18 16 35 14 15 -11 -53 13 -16 12 -23 -36 -37 8 48 53 33 8 -26
3931 -26 -14 61 63 -2 -4 10 32 76 11 25 9 30 19 79 30 -27 -20 -40 -5 51 32 -17 -50 -77 -6 16 -13 -14 -2 38 53 15
3963 15 12 -49 -23 -7 -11 4 -33 -31 -15 -28 -2 36 27 4 0 24 44 25 -40 -113 -17 48 52 62 -2 -1 -45 7 64 36 14 -26 29 -16
$$ packed form
3738Bm7K9ON9K3p1L1n5nM2M8p0q0JP2O7M2n1l8o1J7P1j2m6o4M2j3J35p3On4LN3
3771IJ9k6m1RJ4M1Ql1k5n0P7K6K7L1q2m6p0J25J5l7rn1L1L0L5k3m0k4pQ7L3Kr8
3804d1K8k4Q4L0p0n1QL4qK5k0pokL4j8J7N0j18O6mM2j7k0j04O1K8J19m7p9l0K0
3836b0JO3o6l4L1m3R2l5M0l2j8K6K1N7l7o9J0j9O0kk2q7N7J1N0L6j0p8p0J19m3
3867a1R2k6j04O7q6J08l7K7j9n0N0N8j3m1j2j2j3J7N1m1k5l4J5O8mJ2p1qK4O2
3897D4Nk5o3l9P7P2q1jm2N3K6M4Nr8JML4J9k1Jk6m2O6k9K8l5j3jM5M0Nk0k5l4
3931b6J2P5Ko5kJ4K2M4o5J4j6K1j1O0m9n7Pk0L5N6j9m9l3k7P1K2k9jJ2M0J5l8
3963A5lo1K6J6mJ5l7KJ6j3K6L8rk3mK4K0j9o5p3R6O5MJ0o4Jm4N2N7k8k2m0N5m5
$$ plain form
3997 -16 23 88 35 -23 -49 2 51 31 -1 -24 -27 -36 -8 44 37 33 -26 34 -4 45 29 -37 -21 32 -19 2 0 -48 -12 36 36 33 -9 -41
4031 -41 13 -40 93 -30 32 -50 -55 38 20 27 -9 -41 -47 -19 26 47 -1 -13 -47 31 39 9 -55 -86 -71 35 16 24 6 0 -5 0 25
4064 25 -20 -32 -22 63 27 23 -8 -46 -50 -1 -24 -3 5 -17 19 -47 8 94 -36 15 5 13 15 34 -14 -66 -50 -16 -2 6 2 -23 65
4097 65 -40 32 -15 -24 -14 -13 -8 11 -7 -22 -8 -26 0 3 19 61 9 6 42 42 43 9 10 -5 20 26 45 -34 -54 -23 -49 67 -35
4130 -35 36 -62 40 -3 2 -6 -7 -24 -22 -2 -31 31 -26 -60 9 51 11 -5 -15 -27 7 28 -18 23 -33 -36 1 40 -9 47 -6 -21
4162 -21 -7 25 10 -7 -55 -22 8 1 -9 -49 2 7 -13 26 22 6 -7 -20 0 12 5 -52 -82 -33 8 43 15 -11 -46 -39 -28 15 -5
4195 -5 23 -22 -10 0 28 9 7 -19 -51 -3 18 -64 28 -35 -53 23 1 37 0 50 -18 11 17 46 -9 -28 -80 8 32 56 1 -47
4227 -47 29 32 5 44 21 -35 -22 14 20 28 13 -27 30 -27 44 83 -32 -26 -30 12 -45 8 11 -61 23 -4 -1 43 -14 -73 -56 -32 7
$$ packed form
3997a6L9O5n3n8k6N1M9k0l2k3lrK8N2pmn9O0l8M9j6o6J6N3n1K1km8L6M8%lm2l2
4031d1N4n3J33j23O2q2nR3j8Pl6l2oK8M5K1m8j2l4P8Ql0o4l1J5J06j9Qj8onNK5
4064B5m5j2J0Q5l6ml1l8mM9k3K1Qk2L6o6N5Q6j30N1j0QKJ9m8n2J6L4J4Qmk5Q8
4097F5j05P2m7rJ0JNJ9j8j5J4j8K6LJ6M2n2lL6%Jl4Jj5K5OJ9p9k0L1k6J16j02
4130c5P1r8J02m3Nqjj7KK0k9O2n7l4O9M2m0j6j0j2L4K1m6M1n6lL7L9m9N6n3j5
4162b1J4L2j5j7m8L3L0pj0m0N1Nk0L9mj6j3j3K0J2pn7l0M9M1L5k8k6l5PJ1M3k0
4195eK8m5J2J0K8j9kk6l2M8K1q2R2o3j8P6k2L6l7N0o8K9OK9n5j9n2Q8K4K4n5m8
4227d7P6Lk7L9k3n6J3L6OQj5m0N7n7P1L9j15OmM2n7N3Lp2Q4k7LM4n7n9J7K4L9
$$ plain form
4260 7 -6 31 -69 21 -5 17 7 -40 -59 -35 -34 39 49 -46 -30 -40 -47 62 4 -4 37 24 22 54 -21 -4 -33 9 27 29 0 -46
4292 -46 8 -20 37 71 10 37 -101 4 21 9 12 -36 -29 -15 8 17 20 -54 -54 -51 14 76 -9 -53 -42 -21 -49 22 -6 1 5 29 2
4325 2 48 42 -51 -6 -31 108 37 -4 -97 -9 -58 66 -27 -61 -63 -42 -21 32 119 -54 -29 -53 18 66 35 32 -80 -43 23 34
4355 34 63 -2 -16 -66 9 46 57 -20 -47 -8 43 -41 37 -51 -66 -34 -30 1 32 23 -65 1 24 42 44 -2 -59 -44 -30 32 47 -21
4387 -21 -6 -18 77 37 33 -56 -54 -36 25 47 -18 -18 -46 -52 71 35 -34 -33 -79 -9 -16 90 3 -53 -83 -59 -20 55 45 -4 -43 10
4419 10 56 12 15 -33 -11 -38 37 80 6 -58 -88 -31 -24 44 2 -75 11 22 45 -13 11 -56 1 -50 101 0 -10 -20 -26 65 37
4450 37 43 2 -39 -51 -21 66 87 49 23 -69 1 50 41 37 -51 4 26 64 13 -8 -3 11 57 15 -21 -33 5 -51 28 29 89 33 29
4483 29 -59 -14 7 52 45 -33 -29 3 48 72 -7 -28 -54 1 63 38 -8 -92 6 -66 47 74 -64 -69 -8 1 24 39 -37 -85 -21
$$ packed form
4260Gj3L7j00R0k6K2j0m7j9K4JP3J0r5J6j0pJ09n8qM1j3kL2p5J7k9M2J8Kk9m6
4292d6N4k8N7L4o1K7j38J05J7j2Lm8PJ4K3RLp4%LO5O2q5m4J1K1k8P1k8PMK4k7
4325BM6or3M5k5J39p1m1r3Q8m9J24r3l4kK1K1N3Q7j73K5k4P1M8l1lj12L7O6J1
4355C4K9o5j4n0P5L7J1p7k7L9N1q4P8q8j5L2ML1L1rq8O6K3J8Km6n7J5J4O2J5o8
4387b1J5j2R5m0mq9KJ8O1K2o5%k8oJ23l6o9Jm6P0pJ06q7n6l0K4L9P5j0m9l9N3
4419A0M6m4Lm8K2k7P5M3p4o4l0N7PO8m2p7Q6J1K3n8K4o7N7n1J51j01j0j0oR1k8
4450C7Om1m1j2L0Q7K1l8k6r2P0M9rmq8N5K2L8n1k1NJ4M6m2l6j2L8n6P9JO0n6m
4483B9q8M5K1M5pp8ML2M5K4p9k1k6N5O2k5m6q4R8p2J13K7j38nO1RK3J5p6m8O4
$$ plain form
4514 -21 2 22 25 34 -43 -37 37 42 -7 -24 -48 -26 57 -22 22 10 -88 -34 -7 22 11 -20 -15 20 -33 32 19 32 -68 -82 15 6 53
4547 53 -13 -81 -25 19 43 68 4 -12 -64 -13 30 47 22 -37 -5 14 86 18 54 6 -4 23 83 30 -13 -92 -86 -13 92 53
4577 53 -5 -84 2 42 117 82 -13 -32 -55 18 42 -18 -28 -61 -18 15 56 48 -14 -74 -22 -13 -23 82 3 -42 -5 38 -32 10 -3
4608 -3 -37 -30 52 91 86 -27 -27 -1 32 72 8 11 -40 30 -15 18 11 -2 -12 -27 42 40 -2 -44 -62 6 -5 5 -4 -5 -57 -22 15 109
4642 109 19 -13 -93 12 10 28 67 -30 -26 -7 14 46 63 -24 -90 28 99 88 67 -69 -9 -47 22 69 1 -23 -100 -46 47
4671 47 53 9 -65 -48 -74 43 44 52 -82 4 -72 27 109 44 -52 -50 31 16 75 40 23 -117 -16 74 -1 70 -12 -112 -44 38
4701 38 83 -50 -51 -61 -32 -2 63 3 -52 -80 -22 73 108 -14 -97 -102 -35 94 0 -23 -85 -40 19 76 58 0 -65 -82 6 122
4731 122 75 -21 -46 -29 15 71 64 18 -55 -33 -17 98 57 -26 -61 -34 -11 7 56 13 -64 -67 19 68 65 -3 -49 -5 -26 55 50
$$ packed form
4514b1K3K0LRp7OP4Nm9j7k4K2Q3p9M4j2r8N4K7K9j1l1NL5n3O5j3J3j00j4R7rM7
4547E3o6o8N6M4K4K5o4j6n2N1M3J7k5n9L2J9P2o8L6m8j0K7O0n3m3p9OP3J05l9
4577E3n8p9Q6M0P5l5r5j9k3P3K4o0j0l3M3L3M1qo2o0N2Rj0J05p9m5L7M3p0M2j3
4608cl4PQ2L9nj13%K6L3M0o4Ln1P0m5L3pj3j0j5O9km2m2j8O8j1J0rjn2L5L7R4
4642A09r0l2q0J05kJ8L9r7MJ9K1L2J7q7o6J18P1j1k1j36O0l8O9M7o8k4p7N4R3
4671D7Om4p4J7k6J17JQj34Q6p6R9Q2o5r6KQ1j5N9l5j7j40J01R0p5P1q2j00O8Q2
4701C8M5j33jj0K9L0O5o0n5k8N8R5L5j22q3nO7J29r4k3o2M5N9N7j8n8o5j7Q8J16
4731A22m7r6k5J7M4N6pm6p3K2J6J15m1q3l5K7K3J8M9m3p7lQ6M9lo8m6M4k1Q1n
$$ plain form
4762 50 -12 -88 -77 47 56 35 -34 -68 -58 -3 61 54 -18 -35 -43 51 21 23 12 -63 -27 -33 -15 48 -45 -86 -35 10 67 51 -47 -88
4794 -88 -7 -2 58 57 -29 -22 -19 44 56 56 -18 -59 -24 9 34 132 -36 -91 -27 49 55 51 0 -17 -59 30 71 12 -51 -71 -23 17 59
4827 59 57 -56 -82 -53 12 104 -2 -65 -51 -40 22 19 44 -19 -32 -5 71 98 13 -66 -67 16 57 84 27 -64 -43 -8 17 62 34
4858 34 -34 -67 10 54 93 45 -57 -57 -66 44 149 34 -43 -58 -47 -10 13 21 -25 -140 -60 13 89 -21 -12 -74 -71 82 33
4887 33 13 -90 -75 10 73 49 7 -38 -74 28 46 53 55 -26 -71 4 89 63 61 -74 -64 -39 12 65 30 -24 -89 22 81 54
4917 54 23 -22 -53 21 39 29 47 -27 -61 6 2 69 12 -81 -65 -41 84 42 13 -14 -47 12 18 104 48 -70 -58 -61 12 65 -7
4948 -7 -89 -92 -64 31 63 16 -45 -71 -44 78 49 -16 -24 -41 4 24 66 -23 -85 -23 5 87 75 -36 -70 -50 -37 30 26 -33 -22
4979 -22 -37 16 94 77 22 -33 -8 -28 11 56 11 15 -56 20 51 94 -25 -55 29 -2 60 75 -11 -48 -46 -48 65 121 -47 -141
$$ packed form
4762E0o2p6J1J24Rk1o9l4J0N5O4pp2j7qR4l0Kj1p5L6oJ8O3r3m1N1M5N7j6r8m1
4794h8Q1NO0jq6PLO3J2%p4m1L5L3K5R8j68n5O4P6Omn1j7m2Q9M1n9o3k0M8M0M2
4827E9kj13k6K9O5R2j06o3J4J1O2lK5o3j3K7P6K7q5p9jQ3M1K7n7r1K1L5K5M5k8
4858C4o8l3P7M4L9m8j02%rJ10J05j15p7j5J1L7K3Qm6j15Q0P3P6j10Ro2LJ53m9
4887C3k0j03J5Q5O3k4m2m5l6J02J8PKq1m5P5Q5k6kj35J0K5N1N3l5n4o5J11N9k7
4917E4l1m5l1P4J8j0J8p4l4O7mO7n7r3J6K4J25m2k9k7l3N9OQ6n6j18J2lP3N3p2
4948gq2lK8R5L2m7o1k6K7J22k9o5qj7M5K0M2q9o2O2K8Q2j2j11l4K0J3O7mn9J1
4979b2j5N3P8j7n5n5K5k0L9M5m5Mp1P6L1M3j19l0Q4l1O2J5q6l7KkJ13N6j68r4
$$ plain form
5009 -141 -62 14 90 41 17 -107 -20 22 77 60 -17 -48 -3 42 68 57 -22 -86 -64 -43 83 31 -29 -68 -85 36 66 -7
5037 -7 -14 -29 22 64 112 77 -8 -49 -22 18 56 43 -5 -85 -89 31 47 40 -16 -46 -57 38 32 77 -32 -62 -10 76 60 42 -20 -54
5069 -54 13 4 104 37 -22 -52 -41 40 88 47 -59 -38 -23 11 55 9 -56 -96 -60 48 94 43 -65 -39 -93 4 67 -21 -14
5098 -14 -47 7 40 80 26 -2 -45 -43 16 87 26 28 -73 0 33 75 13 -39 -111 -91 52 53 34 -72 -73 35 26 48 47 -10 -58
5129 -58 3 32 56 -24 -17 -46 -25 80 67 24 3 -26 -12 9 82 42 -56 -8 -16 49 17 -6 -28 -59 5 -2 71 17 -46 -76 23
5160 23 30 36 -11 -26 -93 1 49 29 8 -63 -101 2 47 47 25 -79 -58 39 75 56 18 -9 -49 -18 76 109 12 -70 -51 -22 78
5191 78 5 0 -78 -59 -30 43 64 19 -64 -95 10 52 68 24 -28 -12 28 60 -3 1 -94 -51 -36 43 91 -2 -67 -55 47 -4
5221 -4 82 -1 10 -59 4 44 70 -8 -116 -42 24 107 70 24 -33 -59 24 34 41 57 -43 -65 -12 35 90 11 -7 -4 5 81 46
$$ packed form
5009a41P9P6P6m9k4j24Q7M2N5j7p7l1M5M5K6j1p9o4K2K1J26n2o0l9j7J21L0p3
5037gpj5N1M2M8l5q5m1K7M0L8j3m8q0mJ20J6pn6l0j1R5oM5j09l0N2Q6j6j8o2l4
5069e4O7rJ00o7n9l0J1Q1M8m1j06K1J5L4M4m6o5m0L6J08M6n1j08K6n4R7O3q8P
5098a4l3N4L3M0n4k8m3KN9P1o1Kj01P3L3M2o2n2p2K0J43Jj9j06jJ08rK2jn7m8
5129e8O1K9K4q0Pk9K1J05j3m3k1k9J4K1P3m0r8M8qO5l2k3k2l1O4pP3n4o3l0R9
5160B3POm7j5o7R4M8k0k1p1l8J03M5%k2j04K1R7L6j9l8k7m0L1R4L3r7q2J9K9J00
5191G8p3np8J9K9P3K1m5q3l1J05M2J6m4n2J6M0L2o3Mr5M3J5P9M8r3o5J2J02n1
5221dQ6q3J1o9O3M0K6p8j08P4O6Q3l7m6n7k6Q3J0PJ6j00k2N3M7N5p9j8LRP6l5
$$ plain form
5252 46 -42 -31 -64 -12 105 36 -21 -48 -10 95 25 30 -28 -23 -71 14 93 91 -37 9 -37 83 102 40 -43 -101 -55 0 37 46
5282 46 29 -48 -89 4 61 17 19 -2 14 1 49 50 -66 -43 -44 39 66 29 -21 -52 -79 46 20 -16 0 -75 -24 18 55 63 -74
5313 -74 -33 -82 22 24 60 -11 -46 19 21 22 82 -21 -35 -57 42 104 -11 19 -92 -10 41 36 -15 -29 -15 -25 46 71 -5 1 -4
5344 -4 34 7 96 33 8 -30 -44 51 53 36 43 -5 -25 37 89 -2 -123 -7 -69 39 27 16 -59 -63 -54 100 67 -18 11 -44 14
5375 14 66 14 21 -35 4 33 57 36 19 -19 -13 -38 44 70 35 38 -36 4 77 43 25 -74 -88 -7 87 72 14 -15 -16 57 36 59
5407 59 33 -43 -115 -47 32 29 -18 1 -55 29 4 69 -36 -19 -62 -37 69 22 -46 -75 -37 11 95 33 -34 -87 7 3 108 8
5437 8 -5 -47 -48 41 65 89 35 -49 -35 17 89 26 -29 19 -87 11 32 4 -11 -64 14 -12 45 -30 -35 7 -54 11 81 43 12
5468 12 -81 -17 69 53 -6 -44 -44 -7 23 29 -14 41 -70 -20 -6 58 25 -36 -12 -48 -9 88 39 -48 -53 -22 46 66 0 -84 -71
$$ packed form
5252D6q8J1l3N2J17o9n7k7L8J05p0Nn8Nm8Q5P9kj28M6m6J20J9o2q3n8M6N5L7R
5282D6j7p7m1R3N7m4Kk1J6j3M8Jj16K3jQ3K7l7n0l1k7J25k6l6J6p5N1M2L7Qj37
5313g4M1m9J04KL6p1l5O5KJO0j03j4k2R9O2j15L0j11Q2N1nn1j4J4j0P1K5p6On
5344dL8k7Q9o3k5l8j4R5Kj7Pm8k0O2N2r1j21J16o2J08j2j1p5mRJ54l3q5K9n5N8
5375A4N2n2Pn6L9K9K4k1j7l8Ok5Q2K6l5Lp4M0P3l4j8r9j4Q1R4j5n8k9jP3k1K3
5407E9k6p6p2O8P9lm7J9n6Q4k5O5j05J7m3K5J06m7o8k9L8M8Q4o2o7n3R4mJ05j00
5437Hj3m2jQ9K4K4n4q4J4N2P2o3n5M8j06R8K1k8j5n3P8k6N7p5nM2o1O5P0l8l1
5468A2r3O4Q6j6n9l8%L7L0Om3N5j11N0J4O4l3o1K4l6L9R7m9q7nL1O8K0o6q4J3
$$ plain form
5499 -71 -34 40 47 50 -59 -5 -41 36 78 44 -4 -42 -10 54 35 -1 -12 -23 -50 32 60 28 -19 -32 -16 29 54 23 -80 -55
5529 -55 -14 43 83 0 -41 -64 -49 41 69 -6 -12 -60 8 17 61 32 -24 -16 -16 54 67 3 -33 -76 -26 26 73 65 -35 -45 17 92
5561 92 60 24 -61 -30 37 -7 12 -10 -4 -9 -54 88 88 -45 -31 -66 15 54 20 16 -74 -41 33 -17 42 -29 -47 -66 -15 46 24
5592 24 29 -28 -68 12 37 27 40 -65 -65 -29 112 87 11 -78 -76 73 35 30 10 -60 -69 9 20 46 -16 -86 -35 33 72 40 -8
5623 -8 -120 -17 29 85 59 -51 -75 4 -14 -10 33 20 -57 -34 -32 15 47 -36 -34 6 -21 26 0 14 -2 -45 14 19 59 9 -111
5654 -111 -27 -25 37 46 -46 -7 -12 6 51 53 -41 -28 -23 48 93 37 3 -63 37 60 54 -3 37 -59 -45 16 14 70 -3 -10 -36 51 53 47
5688 47 13 -48 -10 35 8 74 -47 -48 -27 8 41 48 -18 -48 16 24 54 9 37 -36 -42 93 2 8 11 -72 -9 25 -3 19 3 -78
5720 -78 -7 -7 78 49 -78 -82 -11 57 96 37 -58 -34 28 81 29 14 -23 -37 21 61 53 -28 6 -33 5 78 64 66 -30 -47 -35 117
$$ packed form
5499g1L7P4PLj09N4l6P7M2l4m8l8L2O4j9l6j1j1k7Q2K8l2m7j3J6M5K5l1j03K5
5529e5M1N7M0q3m1k3J5R0K8p5om8O8RM4k9n6Q%P0J3o4l6m3N0N2M7qj00j0O2P5
5561I2l2l6q5L1O7m4J9k2Onm5J42%j33J4l5Q1L9l4mr0L3P4n0N9p1j8j9N1O1k2
5592B4Nn7m0Q0K5j0J3j05%L6J41k5p6q9KJ49l8nk0p0rP8J1K6o2p0N1O8L9l2m8
5623hj12J03M6N6k6j10k4P9j8MM3j3p7K3KM7L2q3KM0k7M7k6J4j6m3N9NM0n0j20
5654a11Q4KO2Rr2L9nJ8M5Kr4J3NP1M5n6l4o6J00K3on7M0r6J4O1kN6p3pk6Q7Ko
5688D7l4o1L8M5k7O6j21jK1L5L3Po6l0O4QL0m5K8p3oJ35r1OLq3O3L4k8K2j6q1
5720g8P1%Q5k9j27mP1O8L9n9r5K4O2N3n2j5l7j4N8M0qq1L4l9L8P3j4Kr6j7J2J52
$$ plain form
5752 117 83 26 7 -35 -26 -1 63 -30 -48 -31 57 17 60 -5 -6 -6 1 46 27 18 -84 -27 28 20 40 29 -29 -30 28 63 30 49 -80
5785 -80 -65 -21 37 42 32 16 -51 -5 25 106 -3 -49 -10 25 2 61 -28 -39 -30 38 60 41 -7 -12 -44 3 -11 -2 -16 -10 16 -17
5817 -17 90 8 -6 -16 -47 3 59 87 -43 -52 -57 14 63 14 1 -51 -14 24 28 -3 -70 -78 33 74 20 82 31 -65 -38 28 24
5848 24 10 -23 -22 -53 -11 50 4 -20 -36 -41 28 33 8 -42 -24 4 34 30 60 -55 -64 -4 7 23 -15 -17 -80 -48 18 100 19 -26 11
5881 11 -9 99 29 59 5 -73 10 19 64 2 -44 -47 -49 -9 69 71 -7 -17 -21 10 -12 12 -5 -51 -7 -16 85 22 -47 -66 -24 1
5913 1 4 62 -35 -68 -25 69 53 17 -31 -18 -30 -7 65 18 -57 -35 16 59 29 28 -16 13 -6 37 21 -11 3 -18 19 -8 69 23
5945 23 -26 -29 -38 19 4 34 -61 -15 3 45 12 3 -23 -35 3 33 82 7 -24 -15 -62 37 80 39 -14 -13 -7 4 47 -7 -8 -60 -47 5
5979 5 70 -7 38 -56 -31 37 79 -27 -87 -107 -12 38 24 9 -12 -26 -21 6 56 -20 -34 -25 -9 60 27 4 -25 -34 12 42 -7 4
$$ packed form
5752A17l4n7j9m2RK5O4r3j8J7Q8m0M3o5j%PM5j9rj02N7N5qK0j1n8jN8L5l3J9j29
5785h0J5M4N8Nj0j6o7M6L0Q1j09m6L9L5k3N9q9j1RO8K2j9m8nl2M7j4Rj4OK6l3
5817a7J07q2j4j0l1N0N6K8j30rnP1M9m9j3n2L7L8Ml1o7qJ11M1n4O2n1r6K7O6m
5848B4j4l3Jl1M2O1m6k4j6nO9Nk5n0J8K8L0mL0j15rO0J1J6l8ko3L2O6Q2q1m5L7
5881A1k0J08p0L0n4p8Q3RM5o2m6lkM0P8Kp8j0mL1k2K4j7m6M4rJ01o3o9j9M2K5
5913ALN8r7l3M3R4j6l6m8J3j2K3P2m7p5K2N1M3l0jm4K9j9M3j6l2J4k1L7k7P7m6
5945B3m9lrN7j5L0r5M6J8M2l3rk6j2L8L0M9p5l1Rm7R9M3m1n3JOJ1M3n4jn2J3N2
5979EO5p7M5r4K5O8M2j06o0k0R5N0j4j5k1j4NK7N0p6j4RJ6O9l3k3k9rM6L0m9J1
$$ plain form
6011 4 -64 4 -37 4 22 -34 -3 -24 25 32 47 10 -20 -63 -18 27 52 14 62 -64 90 70 27 4 -32 -32 -19 22 9 -26 -37
6042 -37 -2 -3 33 -8 -8 -22 -33 50 74 43 34 12 7 3 8 50 -40 -69 3 70 -2 7 -32 -48 12 58 19 2 -7 -36 -23 47 33 33 -23
6077 -23 -38 23 -20 57 17 -30 -63 -20 7 -33 43 39 -39 -6 47 41 36 35 -10 51 24 65 42 -21 -65 19 -2 76 53 -7 -5 -16 54
6110 54 33 34 4 -67 -15 54 27 29 -14 -29 -47 50 71 57 -59 -73 -23 18 72 -7 -2 -53 14 46 56 45 -26 -43 12 11 50 61
6142 61 -29 -10 -9 44 33 -27 -47 -32 14 -40 -12 19 -4 47 -22 11 26 -21 14 2 -8 54 36 -19 -43 -71 42 34 54 36 26
6173 26 -29 31 38 51 21 8 -7 -5 82 42 -7 26 -32 1 57 45 -34 -69 -10 -46 8 82 30 -6 0 2 84 -20 14 -12 -5 22
6205 22 35 73 -15 -48 -29 45 -21 90 6 -59 -13 46 24 109 -12 -69 -18 8 6 52 1 -21 37 5 26 10 -21 -38 -50 34
6235 34 -14 29 -8 -14 -16 -13 43 -1 28 -29 -62 13 41 28 -20 -55 -51 12 56 38 -31 -67 28 -16 -15 -4 -67 -6 -39 8 19 69 -36
$$ packed form
6011Do8O8m1M1J8n6L1k1M9PJ5l7l0m3M5M5K5l8M8j26J54k0m3k3l6%J3M1j3l5j1
6042c7L5jL6m1%j4j1Q3K4l1rk2nmNM2r0k9P2O7p2Rl9j6O0M6l9j7rk9J3P0j4%n6
6077b3j5O1m3P7m0m7l3M3K7m0P6mp8L3N3onjm5O1k7M1k3o3m4Q4k1P8k3o0Kj1P0
6110E4k1Jl0p1N2O9k7Km3j5j8R7K1j4j16j4N0M1N4p9Nn1O7L2J0j1p1j7N5jL9J1
6142F1r0J9JN3j1o0k0J5M6n4K8L1k3N1o9L3J5m7L5j2j0O2j8n5k4k8J13qK0j8j0
6173B6n5O0PJ3l0j3j5KQ7m0m9L3n8L3N6j2p9l5N9l6N4P4n2l6OKQ2j04L4k6PK7
6205B2J3L8q8l3J9P4o6J11q4o5M6N9k2Q5j21n7N1K6kM6n1k2N8l2K1j6l1j7j2Q4
6235C4m8M3l7okLN6m4K9n7l3P5K8j3m8l5MO3M4j8o9l6R5m4JJ1o3O1l3M7J1N0j05
$$ plain form
6268 -36 -42 -29 34 71 8 2 -82 -75 -44 45 27 4 -55 20 6 68 24 -18 -14 46 59 55 64 -8 -13 -24 31 60 9 -44 -22 -4 30 20
6302 20 -21 -10 -30 7 35 35 32 1 17 14 -9 44 46 -18 -46 16 2 108 51 41 -20 -4 -46 -4 25 0 -30 -31 48 37 63 10
6334 10 -39 28 21 54 85 -1 -6 8 58 9 27 7 -23 -45 -11 113 42 0 -17 19 39 -50 -5 -1 13 -67 17 2 -44 -47 -30 0
6366 0 18 62 -13 -47 -24 4 71 -14 -16 13 -19 -13 59 52 25 49 43 -11 19 -36 0 -8 0 0 53 -15 -30 26 -49 47 17 -8 -20 -15 -66
6401 -66 -51 76 53 17 -11 -30 -4 35 14 -33 10 -47 -11 -5 31 -10 -25 -35 -16 25 -2 -11 11 10 96 40 50 -30 17 -16 -4
6432 -4 28 20 -21 -10 -67 -88 -6 -16 -16 -72 -42 24 -29 -15 4 -52 -4 5 1 35 11 40 -11 1 10 35 -2 -32 -31 24 58 32 -64 -9
6466 -9 -60 -8 67 31 -32 -46 -25 -2 19 1 -11 13 -1 -6 46 71 -13 -24 -57 13 -13 36 -9 15 -45 18 11 33 27 -106 31
6497 31 10 -20 45 38 -15 58 59 29 -14 20 -12 40 29 -5 -11 -7 -24 0 31 -20 5 -4 12 -64 -15 18 -41 -26 -23 28 36 34 -31 5
$$ packed form
6268c6oJ3O3L7o3oq4PL1Q9j8k3n9P5j4O2m4m2MO0J3mRp2nj1N5K9n1n3K2J8L4j0
6302B0m1J1k0L7K8%ll1J6lk3N3Ko4k8O2j4J06n7j0o1J6m2M2K9k5l0jP9j1K6n3
6334A0m9O7pL3L1q6nJ4N0m9J8k0l0k2L4J24p1m2j7L6K0q9M5MJ4q0Q4j5m6lJ7L0
6366@J8M4p5l4K3K8O7q5kK9l2OP2pk7K4on4L0n5L6qQ%N3o8j5N6p5R6l0k5j2Nn1
6401f6J5J27k3l6k8j9K6L9k1m7M3n7L6OL6m1j5j0J9M1k7rK2jQ6n6J0q0M7l3J2
6432dL2qm1J1n7k1Q2j0%n6L0O6n3J4J9n6M8RmL4k4K9n1J2RK5l7l0JN5L4k6r6N5
6466in1N2P5l6o3j4K1K3K1j8j2K4j4nN2K5q4j1l3P0k6M9m5K4o0O3pK2oj33J37
6497C1k1l0O5pn3P3Jl0m3L4l2N2j1l4oMj7K4L1n1K5rJ6p6M9L3n9J5LN1Qko5L6
$$ plain form
6531 5 -28 -45 39 51 41 27 9 -25 40 106 53 -18 -19 18 24 8 -25 -35 -18 73 53 17 -5 -26 5 65 47 46 28 -7 -25 2
6563 2 -5 38 -31 -45 -4 -3 79 -77 -42 48 -66 12 82 -3 63 -69 -24 -27 11 15 61 -9 -28 6 27 -34 19 30 -38 -10 42
6594 42 16 47 18 -56 -3 45 39 -61 -48 -26 16 22 10 -35 -64 -3 -40 30 19 -45 -24 -24 -71 31 32 -58 -67 6 -23 30 -10 10
6626 10 45 -22 19 9 18 0 -10 -5 -13 20 28 24 -28 44 3 47 1 -24 -10 -36 -10 17 6 -43 -48 -51 20 -8 37 -52 7 -3 -4 56
6660 56 53 -2 57 -25 -23 13 22 -105 9 -12 21 59 -13 -30 -41 19 44 115 -15 -75 -28 -35 47 36 1 -4 -13 21 -14 -47 28 -57
6692 -57 -40 26 -28 25 -46 1 10 -66 3 36 35 -33 9 -19 68 10 -8 -30 4 51 35 25 -39 -48 -17 -34 38 24 -27 13 -8 -31
6724 -31 39 70 7 44 -26 7 49 41 35 -12 -10 -15 99 50 -7 24 -7 -9 11 45 -5 -6 24 37 52 9 -52 -17 29 76 3 32 61
6757 61 24 14 -4 25 9 -9 63 -18 -3 27 46 12 24 -38 -8 54 35 43 -49 -45 31 11 25 39 2 5 7 -17 4 39 17 6
$$ packed form
6531El3j7Q4J2j0j4j8l4O5O6n3p1jL7Oj6l3j0J7R1k0l6k2k1L1O0j8jj8l5j8K7
6563BpM3o9j4M1JQ2j56L5R0j14P8P0q5O6j32M5lL8MM6p0j9L4K1o1N3J1o8K8N2
6594D2k6L1k9p4N3M8oj00J3K2M2Oj2m5k9O1l7P0j1o4K1%m7J02Jr0rP3k9N3m0K0
6626A0L5o7M1j0Rj8j0NqL3Qmn2P2m1M4m6k5J4k6K6K7j1m9nlP1k8M5q9N9j0jO0
6660E6ln5N9q2KL6Rj27J14k1L3L8p2j7j1O0K5P1j30o0M7pQ2j1l5nrL4l5l3P5q5
6692e7J7O6n4N3p1M7Rp6O9L3jo8M2k8Q7n8j8k2L4M7j6j0o4rL1j7P2j4n1M0k1k3
6724c1P0L1o3L7p0L3M2qom7KnJ14m9n7L1l1kK0L4n0jL0J3J5m3o1L5M6M7p3K9K9
6757F1l7j0j8K9j6j8P2q1J5L0J9l4J2o2L0O2j9Qr2MP6k0J4J4l7LKk4K1L5k2j1
$$ plain form
6789 6 20 15 49 6 -2 22 38 7 23 -36 -23 41 9 6 38 14 -11 0 11 29 17 -22 17 -34 0 31 -5 6 -10 -41 -11 -27
6821 -27 -5 -21 -41 14 72 -21 -52 4 27 -66 -13 21 -45 -63 -11 -30 84 63 44 24 -15 -8 7 64 0 -55 58 5 29 7
6851 7 -15 -14 -18 29 5 22 3 -31 -26 16 14 -43 -27 -11 -89 1 39 -37 10 -17 -10 -14 34 31 -6 -31 -70 -45 15 53 -5 -17 7 25
6885 25 26 11 34 -20 60 15 68 24 -13 -37 -22 54 12 45 29 -7 -29 23 1 15 -9 -64 33 -12 -47 6 -51 1 8 -30 38
6916 38 42 8 -33 -3 49 11 -2 59 -24 4 0 -19 10 -25 -11 1 41 19 63 22 61 35 3 43 16 -35 -41 75 5 28 -15
6947 -15 25 14 11 -9 -11 -46 -9 -8 -23 29 -35 52 -5 -15 -13 64 81 29 10 -43 50 -25 -7 -44 -66 -2 13 -7 10 10 -53 -58 -33
6980 -33 41 2 -20 33 -58 -38 32 -60 -15 23 -1 49 35 36 20 3 -36 -28 17 26 -11 -9 12 -65 22 17 -5 19 5 42 85 15 -13
7013 -13 -7 -73 7 24 -24 22 -12 18 11 45 23 7 -38 -1 12 -35 15 23 -14 -59 50 47 7 -19 34 7 -10 -10 74 34 -13 -30
$$ packed form
6789FJ4nL4m3qK4J6l1J6n9J3O4l2lL2k4k5J1J1J8j2l9L9n1L4L1l6J1j6l1L0j6
6821b7K2j6k0N5N8r3l1N6K3r3N3L4o6j8N2j9J14k1j9k0l9PJ5N7o4n5J13n3K4k2
6851Gk2JmM7k4J7j9l4NM2kn7J6J6p8R0L8p6M7k7PmM8ll7k5l9K5O0L8n8j2K4J8
6885B5Jj5K3n4Q0m5N3m4l7k4J5P6m2L3j6l6k2N2k2J4k4n5R7m5l5N3n7N2Pl8O8
6916C8Ml4m1L0N2l8j3O1q3K8mj9K9l5J4J2M0k2M4m1L9k6l2M0k7n1oJ16p0K3m3
6947a5M0j1lk0kl5L7Jj5N2o4Q7n7j0KP7J7n2j9n3R3p5J8l7k2O4J5k0J7%o3nK5
6980c3P4l9k2N3r1K0P0r2M5L8k4N0j4Jj6j7l9QM5Rl7KK1p7Q7nk2K4j4L7M3p0k8
7013a3Oo6Q0J7m8M6l4L0pL4k2j6m5L7J3m7N0Ql7m5J09lm0k6N3k7j7%Q4m0m7j7
$$ plain form
7045 -30 51 -1 64 19 -11 -14 -26 -42 17 33 -5 35 -19 30 7 -31 -5 31 -29 24 2 4 -36 -21 61 -7 40 -50 -13 20 8
7076 8 46 -20 -33 -31 39 -2 74 -6 -62 67 -58 5 -28 18 27 -9 -36 4 -2 14 4 -83 -34 -39 33 21 -30 -28 5 -65 24 5
7108 5 6 -6 -31 -54 1 19 2 -10 -88 -26 14 51 -2 -20 -4 40 9 24 43 -57 13 13 20 27 -31 -24 1 3 54 22 18 -31 2 -17
7142 -17 -26 25 6 -53 6 -47 6 -22 23 20 15 -12 -14 -3 -19 19 -30 37 -26 17 -14 8 48 12 6 1 11 -22 36 19 30 39 15 12
7176 12 12 44 30 37 -41 -67 -2 -2 -15 -7 -35 -17 11 -11 42 19 31 -40 -65 20 88 -6 -11 5 -16 -38 25 -9 -73 -8 -13 60 -21
7209 -21 -29 -58 -27 -30 -18 24 7 -4 0 -26 1 76 19 -38 22 13 -43 -32 11 -9 27 -3 42 8 23 26 -16 47 55 10 -15 -10 -9 4
7243 4 82 64 57 4 -9 -10 6 39 5 96 26 26 -4 32 -50 13 15 15 -39 11 16 18 -38 17 6 15 -2 7 -20 2 33 31 -16 -40 31 -33
7279 -33 -9 15 8 9 -41 46 2 1 -1 47 -28 57 -27 64 11 -31 3 -1 30 -42 14 32 -16 -7 46 -11 -71 -7 -46 -51 10 37 22 -16
$$ packed form
7045c0Q1n2O5m5l0lj2j6N9J6l8M0n4M9k3l8K6L6o0N3k2Km0J5Q2o8M7r0L7L3j2
7076HL8o6j3KP0m1P6q0n6J29j25O3l3M6Rl6k7M0oJ6j0q7M9nP2j2n1KL3p0Q9j9
7108EJj2k5k3N5J8j7j2p8O2M0L7n3j8J6M4l1J5J9j00P0%PPn8PK5KN1l2mm9L3j9
7142a7rN1j9n9N9n3N3k8M5lnk7kJ1j6L8m9O7o3M3l1K2M0l6onJ0l3N8j7J1Rk4l
7176A2%L2j4Pp8k6O5%j3Qk8J8K8k2N3k3J2p1k5Q5O8r4nJ6k1k2O3l4o4O5nP3q1
7209b1qk9L1lJ2M2j7j1Mk6K7P5n7n7O0rn6J1M3k0L6l0M5l4J5Lm2O3Qm5k5NJJ3
7243DP8j8pn3j3jJ6L3l4R1p0%l0L6q2O3K%n4N0NKn6N5j1Rj7Rk7K2L1km7k4P1o4
7279c3K4K4pJn0Q7m4jkM8p5Q5q4R1n3m2L4mL1p2N6J8m8RN3n7o0O4l9nO1K7j5l8
$$ plain form
7313 -16 -21 -20 -42 -23 -41 17 -9 28 18 22 57 -12 -60 -62 41 33 -31 -24 -64 -32 19 20 2 42 26 -23 7 31 -6 12 21 49 29 -5
7347 -5 -2 -37 -39 4 39 -16 -48 -30 -28 34 -48 24 50 -25 2 45 23 9 -7 -19 3 27 12 26 -63 -31 46 -7 71 -18 -1 -34
7379 -34 -57 -5 -43 30 22 -8 19 30 15 -79 24 -20 -26 31 -43 35 17 -8 31 -10 12 15 -14 -83 2 21 12 -22 -10 -20 -16 33
7411 33 43 22 59 9 -12 18 75 7 29 -24 -5 25 -33 -17 -1 -3 -57 -21 22 -38 -52 -7 -7 22 10 -18 -7 -26 57 -34 4
7442 4 -38 11 -38 59 23 -29 4 37 32 -6 14 -20 2 -58 -37 -13 48 57 9 21 -4 5 -36 -20 11 -15 19 7 50 -13 -8 -32 14
7475 14 3 17 -35 -24 41 -37 -36 83 9 -48 5 16 9 -35 35 4 -43 -35 -11 11 23 38 25 41 79 35 23 -9 34 -37 -1
7506 -1 45 34 4 -17 -9 -1 -42 20 -30 12 -2 -2 20 15 -10 -37 7 -4 46 -4 -13 -103 35 -1 40 -20 -25 -8 -15 -4 -9 43 9 -37
7540 -37 -20 25 19 13 -2 5 22 26 68 41 24 -17 6 26 2 -22 -14 -21 -19 19 3 38 -2 -5 -11 -3 -7 15 56 38 -31 8 -11 42 32 32
$$ packed form
7313a6nJk2J9j8N8k6L7j0ML5o9m8kJ03qo4Pm0L2N1Jj8M0j6m9L0K4l7J8RK8k0l4
7347eLl5kM3L5n5l2J8KO2q2P2K6p5K7M3k2j4j6j2K2K4j5J4q9L2P7n3P8q9J7l3
7379c4k3N2l8P3ql0K7J1j5r4J03m4oN7p4P8j8k5L9m1K2Lk9o9Q5J9rl4J2j0MM9
7411C3J0k1L7n0k1L0N7o8K2n3J9L0n8J6J6kn4L6M3o0j4M5%K9j2k8J1j9Q3r1L8
7442Dm2M9m9R7l6n2L3L3nl8K0l4K2o0K1K4O1Rm8J2k5Rm1J6L1k6L4j2M3o3Nk4M6
7475A4j1J4n2J1O5p8JJ19p4n7N3J1pm4P0l1m7QK4K2J2J5j3J6L8m4j2l2M3p1L6
7506aM6j1l0k1QQm1O2n0M2j4%K2nk5k7M4j1N0n0rr0J38l6M1o0nJ7pJ1nN2l4m6
7540c7J7M5ooj5PJ7MM2k7j7m1K3K0k4k4QpKL8j6L5m0loQmK2M1j8o9L9j9N3j0%
$$ plain form
7576 32 16 21 8 32 36 -11 -20 50 9 44 -32 14 30 9 40 33 -8 -46 -26 35 26 8 16 -8 4 51 -23 27 -3 -33 30 21 -14 -27
7610 -27 2 -4 -25 14 60 -47 -6 -14 17 27 80 4 -14 18 -30 25 5 77 -4 -10 4 64 12 -15 -26 -55 -5 5 83 19 -20
7641 -20 -35 -25 27 41 33 -60 10 -11 -12 64 -25 -15 5 40 5 -1 80 13 25 31 87 -63 -17 -1 10 -46 33 38 -10 -24 -6 15
7673 15 7 59 36 -49 -16 -52 16 -30 46 19 -22 45 -12 -42 -23 13 -47 27 -7 47 -24 -43 -42 -21 69 -83 -5 -48 25 25 49
7704 49 18 44 15 -3 15 2 0 -25 -9 9 -3 -10 -26 -34 -49 4 -25 -54 11 -11 -1 2 17 65 22 -13 -10 -21 41 2 48 5 1
7737 1 -38 -23 50 56 -17 -27 10 82 44 19 -2 -13 -37 3 14 24 -22 -32 3 31 28 -10 -26 31 6 21 -18 21 34 -24 4 21
7769 21 -8 64 -26 -7 3 21 -2 -34 -38 -21 22 2 40 2 37 -23 1 -9 38 113 -30 -57 9 13 50 32 21 10 -47 39 -22
7800 -22 -3 -8 6 -14 9 58 -8 20 -15 11 28 2 -38 -7 9 38 16 -1 17 -50 -13 14 61 -2 67 -34 -42 -41 2 31 -9
$$ packed form
7576C2j6Nj3K4Mm7rP0m1L5p6M6J6k1L1pm1l8K0O1rj8Qk4J2M7p4N0l0l0O3rl5j3
7610b7K9ok1L9M6j07M1qL1J0N3p6j8L2m8N5k0P2q1oJ4O0n2k7j1k9N0J0P8o4l9
7641b0j5J0N2J4qr3P0k1jP6q9J0K0L5l5oQ1o7J2ON6j50M6J6J1n6P9Nm8j4J8K1
7673A5qN2k3q5L3l6O8m6P6k7m1O7n7l0J9L6o0P4l4N4p1j9JK1R0j52P8m3P3%K4
7704D9l1K6k9j8J8j3kk5J6J8j2pj6qj5N3k9k9O5k2J0LJ5M8m3l5Lj1O2l9M6m3m
7737Al9J5P3Op3j0L7P2l8k5k1j1k4M0J1J0m6j0L5K8ll8j6N7k5J5l9L9J3n8K8J7
7769B1k9P2r0J9J0J8k3l2mJ7M3k0L8l8L5o0K4j0M7P5j43k7O6ML7j8j1j1n7Q6o1
7800b2J9nJ4k0K3M9o6K8l5K6J7k6m0L1J6K9k2j7J8o7L7K7M7o3O9j01qJM3K9m0
$$ plain form
7831 -9 -23 -51 18 23 4 -40 -13 -52 31 22 -5 16 14 -38 32 49 -18 -9 -12 -3 13 10 -53 55 11 23 49 -1 53 -6 -1 2 -53 6 -16
7866 -16 50 -43 21 2 81 46 -11 26 47 -22 60 26 33 13 -38 2 -1 0 -35 -16 -22 15 5 3 -9 -22 37 34 28 24 -5 10 27 -22
7900 -22 -37 -20 22 58 26 4 -6 -1 61 14 33 14 38 25 -25 32 -10 0 -20 -9 31 -68 -14 9 66 14 -18 60 15 -10 -12
7931 -12 29 21 23 -11 -33 -16 -18 -23 -10 -45 36 71 -1 -22 -2 -23 3 13 -18 -44 -66 42 5 26 2 41 -6 6 -31 -26 -11 -8 6
7964 6 45 23 -29 -23 -23 2 -24 34 44 43 33 13 23 14 13 35 -15 -15 10 -28 -11 -12 23 -74 30 -10 36 0 4 8 4 4 1 32 -13 -56
8000 -56 26 28 -7 -26 4 -37 26 48 -13 11 -16 -17 -23 42 -32 -14 17 -66 -2 66 -16 -21 -41 -6 -15 -43 -52 33 -12 -17 2 -2 16 -2
8034 -2 -28 26 32 17 37 -34 5 -26 55 3 -11 38 -9 48 -34 -19 33 -21 -29 -39 -9 -14 21 -18 -35 -30 37 13 28 4 -33 31 -21
8067 -21 6 32 49 11 18 -50 12 50 -48 -8 9 -40 5 4 -9 14 -23 -25 1 14 -51 37 -40 12 -59 -2 -27 -33 14 -56 4 19
$$ packed form
7831ij4k8O9Nj9m4K7l9Q3rk7K1kn2P0J7o7RlRJ6lo3J08m4J2K6n0N4n9NLn5N9k2
7866a6O6r3O4j9P9l5n7L7K1o9Q2l4Pk0n1M0lJl5J9oL7j0kj2j3N9lomk9J5J7m9
7900b2j5J7M2L6l2k2j0NO2m7J9j9K4j3n0N7m2J0k0J1M0r9N4K3N7n2l2P8m5k5k
7931a2M1qKl4k2J7knJ3l5Q1L5p2k1K0k1K6J0l1k6k2J08l7K1k4L9m7J2l7NJ5LJ4
7964FL9k2n2O%K5k6N8J0jj0k0J0rjK2n0%K5l8J7jL5r7J04m0M6l6MMm%lL1m5m3
8000e6Q2Kl5j9L0m1O3K2o1K4k7joO5p4J8L1q3O4O8q2nk0L5rk8rQ5m5nJ9mJ8j8
8034bk6N4Oj5K0p1L9l1Q1n2j4M9m7N7q2J5N2n4qj0L0nL5l9j7NO7k4J5k4l7O4n2
8067b1K7K6J7l8Po8O2L8r8M0J7m9M5jj3K3l7kK6J3o5Q8p7N2p1N7k5oM7p0O0J5
$$ plain form
8099 19 3 -15 -13 7 53 47 -38 10 -46 -8 49 25 15 -40 38 -42 -25 41 -1 6 -55 13 11 49 -30 -30 -26 -27 -18 19 23 10 29 11 -17
8134 -17 33 2 4 4 13 38 -12 17 -11 29 -5 -15 17 -29 -17 -37 7 -18 -37 0 -4 -29 4 -32 34 2 21 29 -4 -8 7 25 -16
8167 -16 -84 -50 -4 45 -57 -42 -21 4 24 31 -6 -34 32 35 6 35 28 -77 -19 70 8 36 -16 -32
$$ packed form
8099A9j6j8KK0M6oq5M8n6L8N7k4j0n5P8q0J7O6m2Po1O8kL8p9%MjRL7Mj3J9j8k8
8134a7N0l1K%RK5n0K9k8M0l4j0L2m6J2k0M4k5j9L7mk5L3l6O6l2J9Ql3mJ5J8m1
8167a6o8L4M6M9j02J5K1K5K0Pl7k8O6Lk9K9pj05N8Q9o2K8n2j6
8191c2
$$ Imaginary data points
##PAGE= N=2
##DATA TABLE= (X++(I..I)), XYDATA
$$ plain form
0 0 0 0 0 0 0 0 0 0 0 0 0 0 0 0 -2 8 -8 8 -8 8 -16 16 -16 24 -24 32 -34 40 -48 56 -64 72 -81 90 -105 115
36 115 -130 146 -163 180 -203 225 -249 276 -303 335 -372 409 -453 498 -547 604 -666 735 -812
55 -812 901 -999 1113 -1244 1400 -1589 1821 -2112 2495 -3016 3777 -5002 7283 -12999 59433
70 59433 55105 -99117 -74023 27979 71038 11490 -24672 -24405 -10031 -1314 20583 18698 -4133
83 -4133 -17724 -3736 -2880 -8536 7955 32014 6963 -37430 -31022 20870 38927 11011 -15947
96 -15947 -21153 -20288 -872 35278 37622 -17370 -56955 -21691 38877 44737 2594 -33170 -35456
109 -35456 -6612 33985 40274 -5066 -43114 -19550 23796 21881 -3934 -1427 8198 -15249 -31749
122 -31749 8007 48558 15928 -42597 -34651 17290 28213 1194 -5399 2420 -11728 -22827 5093
$$ packed form
0@%%%%%%%%%%%%%%kJ0j6J6j6J6k4L2l2M0m8N6o6P4q8J04j20J36j53J71j95K20
36A15k45K76l09L43l83M28m74N25n79O38p07P81q62R51j045J151j270J401j547
55h12J713j900K112k357K644k989L410l933M607n511O793q779J2285k0282P2432
70E9433m328j54222K5094J02002M3059n9548l6162K67J4374Q717K1897j885k2831
83d133j3591J3988Q56n656J6491K4059k5051m4393O408N1892J8057k7916k6958
96a5947n206Q65J9416L6150K344n4992l9585L5264O0568N860m2143l5764k286
109c5456K8844M0597O289m5340l8048K3564M3346j915k5815K507R625k3447j6500
122c1749L9756M0551l2630n8525P946N1941J0923k7019o593P819j4148j1099K7920
$$ plain form
135 5093 35888 19581 -21153 -32700 -9634 19045 32847 16548 -26231 -46868 -6311 47193
147 47193 36313 -22023 -42514 -6699 22223 13345 252 1232 -4621 -17739 -9666 17142 25414
160 25414 4036 -19330 -22217 -4726 20692 28147 681 -31337 -22829 13164 24097 4328 -7138
173 -7138 -3778 -10193 -16327 6549 34286 16613 -30024 -37485 5609 37094 20875 -11832 -24459
186 -24459 -15345 4510 22807 19646 -7890 -27292 -13629 11938 18280 7870 -3274 -13846 -17604
199 -17604 -257 24158 19533 -11224 -24137 -5032 12519 9398 3582 4011 -4578 -18874 -11721
212 -11721 16840 28495 3236 -28106 -26801 4741 30733 22907 -11716 -34431 -15784 22279
224 22279 30057 621 -21547 -11447 4727 4910 3371 9868 5888 -14088 -21060 916 23461
$$ packed form
135E093L0795j6307m0734j1547K3066K8679J3802j6299m2779k0637M0557N3504
147D7193j0880n8336k0491L5815K8922q878j3093R80n853j3118Q073K6808Q272
160B5414k1378k3366k887J7491K5418P455k7466l2018Q508L5993J0933j9769j1466
173g138L360o415o134K2876K7737j7673m6637p461M3094L1485j6219l2707j2627
186b4459R114J9855J8297l161k7536j9402J3663K5567O342j0410j1144j0572l758
199a7604J7347K4415m625l0757j2913J9105J7551l121n816M29q589j4296P153
212a1721K8561J1655k5259l1342J305L1542K5992p826l4623k2715J8647L8063
224B2279P778k9436k2168J0100J6174J83j539O497l980j9976o972K1976K2545
$$ plain form
237 23461 16548 -9184 -22363 -11882 8690 19879 11153 -9300 -19517 -8251 10074 15781 7742
250 7742 -4022 -13486 -13984 1712 21906 18060 -11055 -27926 -9302 18146 19453 213 -12798
263 -12798 -11497 -4047 4996 12514 9755 -4376 -15818 -11033 6110 18774 12891 -7693 -22068
276 -22068 -11748 13627 22973 4470 -17246 -16174 550 10275 8769 4227 -3014 -12934 -12109 5539
290 5539 20375 11402 -11726 -20416 -5569 14184 17768 3135 -13353 -14766 -1185 11245 10621
303 10621 1382 -6479 -9982 -7732 3110 15477 12306 -8542 -22456 -8482 16846 21083 558
316 558 -17144 -13322 2552 12305 9974 456 -8476 -10370 -3729 6613 12008 6371 -7690 -16566
330 -16566 -7636 11935 18901 3224 -16142 -15340 2345 14542 10057 -1594 -8628 -8691 -2823 6949
$$ packed form
237B3461o913k5732j3179J0481K0572J1189q726k0453j0217J1266J8325N707q039
250G742j1764r464m98J5696K0194l846k9115j6871J8624K7448J307j9240j3011
263a2798J301P450R043P518k759j4131j1442M785J7143J2664n883k0584j4375
276b2068J0320K5375R346j8503k1716J072J6724R725j506m542p241r920Q25J7648
290E539J4836q973k3128q690J4847J9753L584j4633j6488j413J3581J2430o24
303A0621r239p861l503K250J0842J2367l171k0848j3914J3974K5328M237k0525
316E58j7702L822J5874R753k331r518q932j894O641J0342N395n637j4061q876
330a6566Q930J9571O966j5677j9366Q02J7685J2197m485j1651p034o3N868R772
$$ plain form
344 6949 12621 5222 -10096 -15793 -3681 12727 14822 371 -14300 -13102 1857 13339 9712
357 9712 -2508 -9484 -7244 -470 6654 10557 5136 -8113 -15226 -4630 13439 16417 -350 -16744
371 -16744 -13329 4187 14640 8486 -4789 -11116 -6818 2212 8600 7940 931 -7845 -10349 -1997
385 -1997 10631 13055 334 -13513 -11731 3163 13092 7962 -4261 -10324 -6641 1319 7523 8197
399 8197 1493 -8440 -11565 -1868 12147 13883 -753 -15240 -12055 5487 16332 7995 -8224 -13260
413 -13260 -3790 6813 8180 2941 -2768 -6633 -6554 -97 8628 9207 -1029 -11164 -8841 3578 11683
428 11683 7162 -3722 -9669 -6152 2555 8790 7470 -1134 -9893 -9555 1039 11695 10235 -3249
442 -3249 -14272 -9619 6235 15152 6692 -8846 -13031 -2412 9316 9461 652 -6047 -5609 -1686
$$ packed form
344F949N672p399j5318n697J2112J6408K095j4451j4671J198J4959J1482l627
357I712j2220o976K240O774P124L903n421j3249p113J0596J8069K978j6767j6394
371a6744L415J7516J0453o154j3275o327M298R030O388o60p009q776k504Q352
385a997J2628K424j2721j3847J782J4894R929n130j2223o063L683P960O204O74
399H197o704r933l125R697J4015J736j4636j4487L185J7542J0845q337j6219n036
413a3260R470J0603J367n239n709l865P9O457Q725N79j0236j0135K323J2419Q105
428A1683m521j0884n947L517Q707O235j320q604q759L38J0594J0656j460j3484
442c249j1023M653J5854Q917q460j5538m185J0619J1728J45q809o699M38L923
$$ plain form
456 -1686 2123 5136 5396 -511 -8544 -8242 2400 11103 6673 -5564 -10699 -3881 5350 7851 3939
471 3939 -2089 -7209 -7131 1138 11110 9621 -4232 -14457 -7597 8365 13951 3454 -9897 -11605
485 -11605 -1463 8859 9221 324 -7903 -7333 391 6299 5484 694 -3264 -4628 -3108 1819 6898
500 6898 5489 -3097 -9439 -5089 5078 8959 3058 -5266 -7750 -3621 3169 7993 6060 -3182 -11485
515 -11485 -7257 7318 14821 4134 -11948 -12795 1935 12587 7125 -4600 -8273 -3428 1926 4059
529 4059 3863 1023 -3916 -5965 -1708 4583 5983 1767 -3664 -5801 -3078 3472 8179 4389 -5299
544 -5299 -9497 -2677 6908 8340 1268 -6308 -7884 -2587 5782 9409 2797 -8638 -11045 184 11565
559 11565 8659 -4179 -10273 -3680 5207 6291 1495 -2146 -2779 -2855 -1516 2757 5831 2273 -5314
$$ packed form
456a686L809L013K60n907q033L02J0642Q703m430j2237n135O818R231K501l912
471C939o028n120P8Q269R972j489j3853j0225O860J5962N586j0497j3351j708
485a1605J0142J0322L62q897q227N70P724N908q15m790l958j364J520M927N079
500F898j409q586o342M350J0167L881n901q324k484M129O790M824j933r242q303
515a1485M228J4575P503j0687j6082q47J4730J0652n462j1725l673M845N354K133
529D059j96k840m939k049M257O291J400m216n431k137K723O550M707l790r688
544e299m198O820R585J432p072p576j576N297Q369L627o612j1435k407J1229J1381
559A1565k906j2838o094O593Q887J084m796l641o33p6J339M273L074l558p587
$$ plain form
574 -5314 -7334 -905 6368 6163 -192 -5315 -5435 -1010 4884 7233 2261 -6357 -8567 -591 8560 7992
590 7992 -1337 -8695 -6715 1888 8085 5894 -2707 -8669 -5142 4102 7782 2364 -4194 -4513 -1029
605 -1029 1355 2549 3622 1654 -3796 -6317 -1051 6624 6667 -1315 -7525 -5016 2148 6121 3819 -1515
621 -1515 -5362 -4620 441 5806 5933 -417 -7170 -6217 2087 8543 5412 -3681 -8122 -3425 4281 6677
637 6677 2308 -3667 -5714 -2432 2672 4910 2436 -2130 -4580 -3069 1260 4851 4178 -1011 -5677
652 -5677 -4337 2163 6542 3649 -2744 -5581 -2941 1827 4854 3816 -1320 -6228 -5099 2155 7631
667 7631 4347 -4118 -7741 -2526 5135 6623 1169 -4516 -4870 -689 3370 3904 1441 -2022 -4033 -2878
683 -2878 1369 5025 3541 -2393 -6306 -3384 3457 6401 2318 -3837 -5543 -1612 3577 5161 1948
$$ packed form
574e314k020O429P273k05o355n123j20M425N894K349m972q618k210P976R151n68
590G992r329p358J980Q603O197k191q601n962L527R244L680n418o558l19L484
605a029K384J194J073j968n450k521N266P675M3p982o210K509P164L973k302n334
621a515l847P42N061N365J27o350o753R53Q304O456l131r093m441M697P706K396
637F677m369n975k047L282N104K238k474m566k450J511M329L591o73n189m666
652e677J340O500M379k893o393k837K640M768L027j038n136m908J129P254N476
667G631l284q465l623N215P661J488n454n685l54M181M059N34k463l463k011J155
683b878M247L656j484n934l913K922O841K944m083o155j706L931N189J584l213
$$ plain form
698 1948 -2959 -4906 -2297 2842 5443 2630 -3373 -6164 -2393 4118 5944 1049 -4715 -5089 -343
713 -343 3951 4034 718 -2817 -3847 -1580 2597 4792 2260 -3044 -5490 -1991 3899 5567 1159 -4531
729 -4531 -5243 -640 4189 4390 349 -3550 -4124 -927 3256 4634 1614 -3470 -5108 -1222 4290 5305
745 5305 554 -4699 -4614 144 4200 3745 -157 -3581 -3697 -728 3007 4003 1137 -3353 -4854 -1099
761 -1099 4276 5198 384 -4756 -4512 643 4785 3607 -810 -3955 -3143 199 3169 3314 356 -3319
777 -3319 -4175 -663 3977 4601 214 -4602 -4388 653 4929 3834 -977 -4294 -3112 851 3697 3174
793 3174 -261 -3704 -3807 -58 3988 3910 -524 -4618 -3807 1064 4537 3225 -1220 -4061 -2699 1039
809 1039 3724 2939 -465 -3488 -3333 242 3988 3745 -621 -4727 -3716 1315 4803 2881 -1972 -4366
$$ packed form
698A948m907j947K609N139K601k813o003k791L771O511J826m895n764l74M746
713c43M294Q3l316l535j030K267M177K195k532n304k446L499N890J668m408n690
729d531p12M603M829K01m041l899n74L197M183J378l020n084j638L886N512J015
745E305m751n253Q5M758M056m55l902l424j16K969L735R96k866m490j501L755
761a099N375R22m814n140K44N155M142j178m417l145Q12L342K970J45k958l675
777c319q56L512M640O24m387m816K14N041M276j095m811l317J182L963K846n23
793C174l435l443j03L749M046p8m434m094Q11M871L473j312m445k841J362L738
809A039K685p85l404l023J55L575L746k43m366m106J011N031L488j922m853k394
$$ plain form
825 -4366 -2257 1658 3709 2414 -969 -3380 -2639 722 3766 3224 -839 -4312 -3295 1326 4552 2770
841 2770 -2013 -4519 -2328 1909 3822 1956 -1415 -3525 -2525 1040 3970 3101 -1253 -4356 -2773
856 -2773 1984 4613 2280 -2343 -4345 -1799 2263 3691 1362 -2037 -3301 -1645 1350 3153 2199
871 2199 -1071 -3708 -2542 1705 4393 2360 -2237 -4084 -1613 2242 3785 1626 -2028 -3853 -2044
886 -2044 1892 3841 1752 -2197 -4074 -1888 2323 4297 1839 -2770 -4312 -1026 3280 3826 425
901 425 -2732 -2781 -557 1794 2650 1323 -1564 -3399 -1929 1855 3735 1653 -2351 -3835 -1376 2600
917 2600 3761 1089 -2455 -3408 -917 2297 3458 1333 -2320 -3904 -1531 2859 4193 695 -3597
932 -3597 -3743 -68 3196 2987 6 -2756 -2876 -124 2843 2934 152 -2321 -2352 -409 1732 2723 1407
$$ packed form
825d366K109L915K051j295l383k411P41L361L044n42m063l473J017M621L226j782
841B770m783k506K191M237J913j866l371k110J000L565K930q69m354l103J583
856b773M757K629k333m623k002K546M062J428k329l399j264J656K995J803r54
871B199l270k637J166M247K688k033m597j847K471L855J543k159l654j825J809
886b044L936J949k089l949j877K186M211J974k458m609j542L286M306N46l401
901D25l157m9K224K351Q56j327k887j835J470L784J880k082m004j484K459L976
917B600J161k672l544r53K491L214J161k125l653j584K373M390J334l498m292
932c597j46L675L264k09k981k762j20K752K967R1k782k473l1J943K141R91j316
$$ plain form
949 1407 -1857 -3894 -1596 2978 3979 306 -3535 -3250 23 2668 2701 593 -2295 -3357 -930 3072
965 3072 3958 313 -3667 -3455 475 3559 2705 -806 -3201 -2294 564 2567 1957 -254 -2230 -2341 -307
982 -307 2348 2868 325 -2630 -2721 -70 2644 2846 409 -2661 -3271 -375 3368 3391 -569 -3754 -2646
999 -2646 841 2859 2209 -145 -2712 -3151 -28 3848 3369 -1261 -4188 -1874 2083 2876 861 -922
1015 -922 -1696 -1674 -262 2120 2584 -65 -2951 -2603 483 2949 2350 -380 -2738 -2548 528 3216 2618
1032 2618 -649 -3222 -2378 886 3305 2383 -1098 -3533 -2249 1411 3246 1633 -1397 -3123 -1870
1047 -1870 1194 3185 1832 -1568 -3125 -1047 1819 2300 899 -531 -1627 -1998 -130 2796 2940 -839
1063 -839 -3861 -2155 1878 3191 1113 -1410 -2444 -1680 809 3051 2266 -1358 -3521 -1652 2074 3225
$$ packed form
949A407l264k037K298M574J001l673l841K85L273K645L3k108k888j062K427M002
965C072Q86l645l980K12L930L084q54l511k395R07K858K003o10k211j976j11K034
982c07K655N20k543k955r1K651K714K02k437l070o10K896L743K3l960l185J108
999b646L487K018o50k354k567m39L123L876m79m630k927K314L957P93k015j783
1015i22p74K2J412K382M64k649k886L48L086K466n99k730k358J90L076K688n98
1032B618l267k573Q44L264K419r22l481k435J284L660J835j613l030j726J253
1047a870L064J991j353l400j557K078K866M81j401j430j096l71J868K926J44l779
1063h39l022J706M033J313k078k523j034P64K489K242p85l624k163J869L726J151
$$ plain form
1079 3225 1242 -1657 -2850 -1452 1585 3062 1164 -2050 -2921 -774 1733 2229 779 -1202 -2354
1094 -2354 -1452 1187 2850 1522 -1326 -2739 -1375 1416 3054 1624 -1686 -3288 -1268 2184 2930
1109 2930 544 -1966 -2386 -1044 1230 2689 1502 -1722 -3333 -1021 2494 3005 271 -2194 -2133 -402
1125 -402 1491 2345 932 -1735 -2710 -777 1869 2292 484 -1556 -2414 -1185 1504 3027 1114 -2286
1141 -2286 -2999 -228 2546 2421 286 -1764 -2175 -788 1849 2788 708 -2309 -2778 -297 2194 2372
1157 2372 306 -2065 -2568 -425 2374 2572 5 -2263 -1893 111 1738 1959 605 -1647 -2583 -685
1173 -685 2200 2579 -3 -2471 -2260 34 2046 2140 139 -2177 -2400 118 2433 2133 -273 -1956 -1826
1190 -1826 -98 1956 2418 309 -2505 -2571 357 2704 1824 -757 -2103 -1646 34 1788 2050 80
$$ packed form
1079C225j983k899j193J398L037J477j898l214q71K147K507M96j450j981j152
1094b354R02K639J663j328k848j413J364K791J638j430l310j602K020L452P46
1109B930k386k510m20J342K274J459j187l224j611K312L515N11k734k465O1J731
1125d02J893Q54j413k667r75J933K646M23j808k040q58J229K689J523j913l400
1141b286p13K771K774j25k135k050m11J387K637R39k080l017m69K481K491J78
1157B372k066k371n03K143K799J98k567k268L70K004J627K21j354k252r36J898
1173f85K885L79k582k468K11K294K012R4k001k316k23K518K315l00k406j683J30
1190a826J728K054M62k109k814o6K928K347q80k581j346M57J680J754K62j970
$$ plain form
1206 80 -2230 -2213 278 2438 1929 -237 -2069 -1957 73 2305 2196 -475 -2685 -1823 667 2084 1399
1223 1399 -401 -1923 -1877 65 2196 2138 -394 -2457 -1744 745 2315 1654 -479 -2212 -1704 655 2404
1240 2404 1582 -957 -2304 -1354 558 1916 1535 -336 -2259 -1965 716 2697 1611 -1096 -2301 -1113
1256 -1113 908 2001 1458 -634 -2223 -1618 789 2284 1286 -952 -2127 -1382 679 2151 1544 -885
1272 -885 -2512 -1332 1304 2385 965 -1013 -1842 -1021 738 2008 1441 -880 -2412 -1271 1169 2176
1288 2176 1032 -1141 -2128 -1207 1047 2281 1066 -1267 -2129 -778 1253 1994 984 -885 -2047 -1172
1304 -1172 1102 2351 1059 -1405 -2310 -739 1319 1919 730 -1219 -2025 -809 1259 2070 769 -1214
1320 -1214 -1886 -654 1135 2019 1000 -1108 -2167 -887 1454 2185 474 -1547 -1911 -558 1191 1751
$$ packed form
1206H0k310J7K491K160n09k166j832J12K030K232j09k671k210Q62K490J417o85
1223A399j800j522M6J942K131n8k532k063P13K489J570o61k133j733N08K359J749
1240B404q22k539j347R50J912J358l81j871j923K94K681J981j086k707j205J188
1256a113K021J093n43k092j589O05K407J495r98k238j175P45K061J472o07k429
1272h85j627J180K636J081j420j978q29Q21J759J270n67k321j532J141K440J007
1288B176j144k173r87R21K254J234j215k333q62J351K031P41j010j869j162Q75
1304a172K274J249j292k464r05J571K058O00j189j949q06J216K068Q11j301j983
1320a214o72J232J789Q84j019k108j059J280K341P31j711k021l64J353J749N60
$$ plain form
1336 1751 654 -1245 -2005 -724 1393 2043 538 -1497 -1942 -423 1548 1936 407 -1531 -1848 -257
1352 -257 1497 1692 297 -1374 -1728 -520 1278 1903 521 -1464 -1943 -323 1554 1891 315 -1483
1368 -1483 -1767 -250 1519 1744 211 -1547 -1732 -247 1452 1616 195 -1589 -1864 -245 1581 1715
1384 1715 22 -1672 -1537 138 1601 1481 -24 -1381 -1430 -41 1418 1625 159 -1548 -1650 -167
1400 -167 1597 1648 -14 -1793 -1652 135 1694 1530 -181 -1597 -1417 125 1597 1530 -128 -1656 -1540
1417 -1540 226 1711 1382 -409 -1722 -1363 285 1483 1191 -244 -1482 -1279 226 1557 1299 -228
1433 -228 -1526 -1272 264 1547 1381 -164 -1588 -1452 245 1727 1332 -611 -1832 -1131 551 1548 994
1450 994 -429 -1472 -1193 385 1755 1369 -535 -1851 -1045 780 1643 861 -708 -1431 -930 374 1361
$$ packed form
1336A751j097j899p60J281K117O50j505k035m45J519J971L88j529j938l17J591
1352b57J754J95j395j671l54J208J798O25j382j985m79J620J877L37j576j798
1368a483k84J517J769K25j533j758j85J485J699J64j421j784k75J619J826J34
1384A715j693j694J35J675J463j20j505j357m9J389J459K07j466j707j02J483
1400a67J764N1j662j779J41J787J559j64j711j416J80J542J472o7j658j528J16
1417a540J766J485l29j791j313L59J648J198k92j435j238K03J505J331k58j527
1433b28j298K54J536J283j66j545j424J36J697J482l95j943j221P01J682R97n54
1450I94j423j043K79J578J370l86j904j316Q06J825Q63p82j569p23N01J304R87
$$ plain form
1467 1361 969 -460 -1544 -1101 510 1590 989 -535 -1557 -894 632 1642 1053 -546 -1581 -950
1483 -950 694 1697 985 -864 -1658 -797 765 1339 693 -653 -1485 -943 701 1640 847 -920 -1629 -595
1501 -595 1016 1395 465 -695 -1197 -789 487 1480 951 -775 -1723 -738 973 1555 558 -951 -1407 -586
1519 -586 754 1425 711 -847 -1474 -565 1020 1549 522 -940 -1380 -449 876 1300 435 -937 -1473 -532
1537 -532 922 1321 384 -947 -1329 -360 885 1291 408 -712 -1273 -527 813 1480 486 -1146 -1538 -299
1555 -299 1247 1320 124 -1009 -1189 -287 861 1351 433 -1023 -1457 -176 1258 1301 110 -1019 -1094 -187
1573 -187 978 1173 195 -1036 -1265 -195 970 1097 91 -1002 -1123 -220 949 1199 220 -1044 -1264
1590 -1264 -49 1174 1225 67 -1168 -1146 -10 1095 1106 -34 -1128 -1110 -17 1108 1071 37 -1183
$$ packed form
1467A361l92j429j084M43J611J080o01j524j022O63J526J010n89j599j035O31
1483i50J644J003p12j849p94Q61J562N74o46j346q32N42J644R39p93j767p09J034
1501e95J611L79r30j160n02M08J276R93n29j726r48R85J711N82r97j509m56Q21
1519e86J340O71p14j558o27R09J585N29j027j462m40R31J325M24q65j372n36R41
1537e32J454L99r37j331l82R69J245M06q83j120n61P46J340O67r94j632l92J239
1555b99J546P3j196j133j80R02J148M90r18j456m34J281J434M3j191j129p5R07
1573a87J165J95r78j231k29J070J165J27j006j093j21R03J169K50r79j264k20
1590a264J215J223N1j158j235K2J136J105J1j140j094J8J093J125l7j034j220
$$ plain form
1607 -1183 -1157 56 1269 1024 -245 -1084 -897 161 1055 993 9 -1070 -1071 59 1108 919 -199 -1162
1625 -1162 -933 94 1019 1029 -147 -1221 -1002 266 1183 873 -281 -1043 -778 208 1076 947 -149 -1153
1643 -1153 -956 336 1138 797 -341 -1154 -742 256 1054 782 -307 -1093 -788 354 1060 746 -309 -1016
1661 -1016 -779 297 1122 762 -490 -1183 -671 381 1026 624 -372 -1032 -702 378 1108 663 -445 -1100
1679 -1100 -588 507 1054 690 -338 -1077 -713 491 1165 539 -559 -1056 -491 434 942 548 -394 -1065
1697 -1065 -615 509 1170 555 -603 -999 -460 534 1033 490 -579 -1114 -481 591 1020 403 -575 -987
1715 -987 -418 525 1026 503 -647 -1054 -355 671 1038 316 -606 -931 -322 594 1015 381 -641 -983 -380
1734 -380 623 878 315 -642 -1001 -430 678 946 248 -722 -947 -178 749 853 228 -635 -987 -245 664
$$ packed form
1607a183K6J213J213k45j269q39J87J058Q94o2r84j079jJ130J049j89j118r63
1625a162K29J027R25J0j176j074K19J268R17l10j154p62K65R86Q68j29j096j004
1643a153J97J292Q02l41j138q13M12R98P98k72j089p86L05J142P06l14j055p07
1661a016K37J076Q25l60j252o93N12J052O45m02r96o60L30J080P30m45j108o55
1679a100N12J095N47l64j028p39L64J204O74o26j098m97N65R25N08l94r42o71
1697a065M50J124O61o15j158l96N39R94M99n43j069n35O33J072M29o17r78m12
1715i87N69R43N01n23j150m07O99J026L67p22r22l25O09R16M21o34j022l42O03
1734c80J003K55n63r57l59N71J108K68o98r70k25P69R27J04o25q63l52P42R09
$$ plain form
1753 664 931 208 -801 -911 -143 721 823 200 -678 -883 -176 843 901 111 -721 -823 -72 682 900 234
1773 234 -687 -902 -156 804 864 52 -768 -758 -94 698 776 109 -779 -830 -90 743 816 12 -729 -759 -20 740
1795 740 820 23 -857 -768 44 797 665 -65 -728 -670 26 756 760 -46 -809 -729 199 825 747 -64 -697 -703 146
1818 146 847 720 -191 -813 -641 128 729 600 -142 -788 -745 89 829 641 -244 -842 -629 259 782 592
1838 592 -179 -758 -568 173 815 635 -194 -784 -545 226 818 589 -235 -851 -611 248 829 535 -282 -766
1858 -766 -473 257 847 533 -261 -769 -470 315 701 444 -416 -752 -487 303 780 444 -438 -843 -390 364
1878 364 772 390 -288 -718 -403 302 829 448 -405 -818 -417 428 790 402 -443 -803 -312 422 777 327
1898 327 -390 -759 -309 514 742 366 -410 -755 -265 542 794 236 -527 -639 -222 396 627 314 -506 -763
$$ packed form
1753F64K67p23j009j10P68Q64J02o23q78k05P07J019N8p90q32j02P51P54K18o66
1773B34r21k15P46R60O0q12q20J0O64P92P8o67q88n1P40Q33P3q04p41l0P39P60
1795G40Q0p97q80Q9Q12P53j32p30o63N8O96P30Mq06p63Q0R28O26p8q11o33oQ49
1818A46P01j27r11o22J72P69O01j29p42o46M3Q34P40j88q85n98K13Q88N23j90
1838E92p71n79J90P41O42j80q29n90K39P71N92k29q24o16K40Q59N81k94q17m84
1858g66K93P30N90l14p94n08K99P85L86k57q60l36K65P90M77l36q82m05M53P54
1878C64M08l82o78m30L15P05N27l81q53m13M01Q45L62l88q45l60M91P34L55m50
1898C27p17l69M50Q23K28l76p76l45M90Q07K52n58p63j12M17O18K31l13q20k57
$$ plain form
1918 -763 -238 516 722 201 -476 -711 -181 465 788 279 -492 -765 -208 629 765 144 -520 -670 -137 476
1938 476 651 187 -519 -707 -157 565 732 123 -526 -671 -98 613 601 85 -538 -607 -133 505 630 131 -562
1959 -562 -716 -118 598 625 30 -630 -557 -39 593 598 89 -525 -674 -4 658 719 -13 -611 -558 44 587 547
1981 547 -9 -570 -600 10 539 626 -67 -581 -527 52 566 538 -12 -576 -550 -31 614 612 -37 -665 -614 105 689
2004 689 401 -202 -610 -465 73 528 496 -133 -627 -467 206 673 411 -180 -584 -347 225 540 515 -173 -606
2025 -606 -471 136 630 379 -202 -659 -401 168 615 452 -212 -648 -419 242 626 416 -178 -641 -432 242
2045 242 634 308 -298 -657 -350 259 551 380 -202 -618 -338 313 684 315 -377 -513 -251 326 543 327
2065 327 -297 -623 -376 257 665 222 -375 -552 -265 269 557 278 -346 -651 -275 450 614 193 -393 -534
$$ packed form
1918g63N25P54K06n21o77k35N30O46L23n09p71k73N57Q37J36o21o64j50N33O13
1938D76J75m64p06j88N50P22J67o09o49j45N73P11j2n16o23o9M74O38J25m99o93
1959e62j54N98P16K7n95o60P3N18O32Nn09o14j49O70O62O1p32n98N3O02N43m0
1981E47n56n61l0O10N29Q7o93n14N4N79N14k8n50n64K6N19O45ko49o28N1P19N84
2004F89k88o03m08J45N38M55l2o29m94J60O73M67k62n91m04K37N72L15k5o88m33
2025f06J35O07M94k51n81m57K58N69M47j63o64m36K29O61L84k10n94m63K09O74
2045B42L92l26o06l59L07O09K92j71n82m16K80O51L71l69o92j36K62N77K17k16
2065C27o24l26K47O33M08m43n97j77K87N34K88k79o24l05L76P25J64m21n86j41
$$ plain form
2085 -534 -171 318 558 275 -332 -632 -282 394 598 215 -363 -556 -225 412 597 213 -369 -517 -161 412
2105 412 505 153 -297 -587 -235 416 570 124 -491 -535 -136 394 450 102 -415 -626 -166 400 593 92 -519
2126 -519 -566 -80 415 483 174 -408 -585 -45 518 550 46 -522 -485 15 439 492 61 -402 -492 -63 479 543
2148 543 41 -467 -463 -53 428 492 60 -563 -522 -29 479 488 -33 -478 -521 -21 422 521 -70 -498 -458 100 522
2171 522 400 -32 -461 -392 -4 527 487 -89 -622 -432 188 531 405 -52 -439 -450 21 572 408 -80 -529
2192 -529 -406 188 478 367 -110 -475 -466 137 538 419 -146 -511 -383 142 468 406 -197 -544 -361 172 602
2213 602 324 -250 -519 -259 209 487 357 -109 -501 -405 277 559 258 -216 -487 -252 152 491 332 -246
2233 -246 -582 -336 318 525 242 -268 -439 -283 146 554 295 -246 -634 -243 311 479 197 -256 -514 -267
$$ packed form
2085e34L63M89K40k83o07l00L50O76K04l83n78j93L31O37J85l84n82j48L56N73
2105D12R3l52m50k90L52O51J54m46o15m4L99N30N6l48n17k11M60N66J93n01o11
2126e19m7M86M95O8l09n82j77N40N63L2n04n68L7N00M24N3m31m63r0M29N42O4
2148E43n02n08MM10M81O4m32o23M1M93N08Rn21m45m3N00M43R9n91m28M0N58M22
2171E22j22m32m29O9L88N31m0n76n33J90O20L43j26m57l87j1M71N51j64m88m49
2192e29J23N94K90j11m77l65RO03M01j19n65l65J28N25L26o2o03l47J83N33M30
2213F02k78n74k69K60M68K78j30m66l92R6O82K82l01m74k71K35M04L39j59n78
2233b46l36K46O54K07k83n10j71J56M29M08k59n41l88L91N54J68k82m53k58K47
$$ plain form
2253 -267 210 480 248 -310 -499 -170 314 496 260 -218 -469 -203 314 536 258 -340 -493 -103 306 499
2273 499 162 -314 -552 -185 341 523 105 -450 -505 -150 318 442 184 -305 -530 -170 400 484 104 -322 -461
2294 -461 -110 266 444 119 -397 -502 -164 407 454 98 -343 -416 -111 345 496 161 -401 -476 -57 391 377
2315 377 47 -424 -472 -136 303 418 27 -476 -498 28 372 372 -9 -336 -406 -86 389 417 38 -455 -463 67 442
2338 442 431 -16 -369 -457 -41 440 382 -18 -417 -387 46 419 348 12 -429 -389 46 498 381 -51 -433 -346
2360 -346 19 402 399 -38 -468 -420 110 444 313 -85 -393 -307 75 438 375 -84 -440 -349 115 536 338 -161
2382 -161 -440 -333 138 435 291 -141 -472 -316 134 418 309 -144 -424 -290 114 501 300 -163 -396 -262
2402 -262 199 387 278 -155 -478 -373 159 420 312 -168 -472 -292 119 436 282 -160 -513 -275 237 532
$$ packed form
2253b67M77K70k32n58j89L29M84J82k36m78k51K66N17K22k78n98j53L90M09J93
2273D99l37m76k38L67N26J82m18n55n5L55M68J24k58m89k25L60N70Q4l80m26j39
2294d61L51L76J78l25n16j05L38N71M7l56m41p3L05M56J51l35n62p5M19M48j4
2315C77l30m71m8L36M39J15l91n03k2N26L44%l81l27p0L20M75K8l79m93qN30L75
2338D42j1m47l53q8M16M81n8m00l99L0M33L73p1l36m41M0M35M52j17m32l82Q7
2360c46L65L83lm37m30M8N30L34j31l98l08Q6L82L63o3m59l56R1M64M21j98m99
2382a61k79J07M71K97j44m32l31J56M50K84j09m53k80J34M04L87k01m63k33J34
2402b62M61J88j09m33l23J05N32K61j08m80l04J80M11L17j54m42l53K38N12K95
$$ plain form
2422 532 303 -208 -452 -195 227 445 237 -189 -426 -214 184 488 225 -213 -408 -163 254 420 216 -215
2442 -215 -397 -279 213 438 207 -338 -461 -214 271 428 199 -295 -448 -188 223 367 169 -228 -421 -175
2462 -175 303 553 162 -284 -472 -102 241 426 74 -202 -386 -195 291 461 163 -298 -391 -133 287 378 103
2483 103 -259 -416 -158 303 467 159 -322 -458 -124 353 441 118 -428 -391 -34 317 368 41 -316 -449 -55
2504 -55 354 370 33 -332 -351 32 316 396 77 -325 -338 -32 360 400 63 -406 -352 -40 370 364 10 -329 -393
2527 -393 -19 298 349 11 -379 -336 26 371 312 -34 -413 -304 14 304 253 -74 -392 -382 37 399 372 -99
2549 -99 -347 -332 75 366 381 20 -346 -312 63 461 381 -133 -397 -334 91 389 289 -143 -348 -335 71 382
2571 382 289 -148 -417 -223 113 350 228 -100 -346 -298 118 400 248 -116 -371 -262 162 358 235 -184 -372
$$ packed form
2422E32k29n11k44K57M22K18k08m26k37K12L98L04k63m38j95K45M17J66k04m31
2442b15j82J18M92K25k31n45j23K47M85J57k29m94j53K60M11J44j98l97j93K46
2462a75M78K50l91m46j88L70L43J85l52k76j84J91M86J70k98m61r3K58M20R1k75
2483A03l62j57K58M61J64l08m81j36L34M77Q8l23n46L7L57L51N1l27l57j33L94
2504e5M09J6l37l65j9L83K84Q0l19m02j3L06L92M0l37m69N4L12M10ol54l39o4
2527c93L74L17N1l38l90M3L62L45n9l46l79J09L18K90n1l27l18J0M19L62k7m71
2549i9k48J5M07K91J5l61l66L4L75L98q0n14k64O3M25K98j00m32k05J3M06L11
2571C82r3m37k69J94L36K37j22l28k46M8M16K82j52l64k55J09M24J96j23m19j88
$$ plain form
2592 -372 -275 161 389 228 -164 -413 -211 147 430 316 -142 -404 -230 178 315 173 -149 -424 -235 145
2612 145 452 193 -202 -402 -203 195 349 165 -181 -335 -152 180 361 185 -196 -390 -163 183 386 136
2632 136 -164 -312 -142 185 424 216 -238 -366 -141 229 331 189 -200 -321 -122 222 323 134 -247 -353
2652 -353 -119 171 308 106 -270 -393 -172 234 305 64 -202 -288 -80 262 306 169 -209 -372 -44 315 357
2673 357 46 -250 -301 -94 206 349 120 -309 -359 -45 249 355 46 -230 -296 -91 276 308 105 -318 -342 0
2695 0 259 284 34 -332 -357 -47 230 351 6 -349 -275 -4 292 294 45 -286 -322 13 342 353 28 -292 -251
2718 -251 52 268 278 29 -243 -337 27 285 329 -45 -353 -210 6 286 304 -55 -301 -248 -6 343 206 -45
2740 -45 -308 -252 47 311 313 -29 -345 -303 97 344 236 -51 -332 -232 71 355 314 -100 -341 -214 156 327
$$ packed form
2592c72R7M36K28j61l92k49K02L58K83j14m58k62J74M08J37j42l22k75J89L80
2612A45L07k59l95k00J99L98J54j84l46j54J83L32J81j76l81j94K27L46K03k50
2632A36l00j48J70L27K39k08m54j28K25L70J02j42l89j21J99L44J01j89l81j06
2652c53K34K90J37k02l76j23K21M06P1k41k66q6K08L42M4j37l78j63L28L59M2
2673C57l11k96n1K07L00J43k29m29n0L14K94J06l09k76o6K05L67L2k03m23k4L42
2695@K59K5k50l66k5L10K77J21l45l55P4K71K96Kk49l31l6L35L29J1l25l20M1
2718b51L03K16J0k49k72r4L64K58M4l74l08J43K16K80J8l59k46N3K42L49j37k51
2740d5k63N6K99K64Kl42l16M2M00K47j08k87k81J00L03K84m1m14k41J27L70J71
$$ plain form
2762 327 214 -143 -279 -275 54 339 311 -79 -338 -211 158 341 227 -97 -283 -202 91 322 204 -166 -338
2783 -338 -153 135 263 154 -120 -310 -190 111 349 135 -154 -294 -206 141 304 190 -69 -287 -144 202
2803 202 412 173 -140 -279 -162 130 353 207 -120 -335 -159 150 334 92 -162 -310 -143 121 264 204
2823 204 -197 -296 -148 213 296 112 -228 -332 -109 157 324 164 -244 -351 -82 143 285 90 -186 -275 5
2844 5 180 344 93 -212 -339 -94 219 245 104 -171 -286 -155 194 268 95 -252 -275 -38 218 251 109 -262
2866 -262 -280 -47 209 335 47 -233 -243 -57 182 292 75 -220 -245 -94 232 246 -3 -220 -238 -30 224 248
2888 248 113 -194 -301 22 274 258 -20 -232 -243 -57 237 286 41 -258 -252 2 258 166 0 -234 -235 -10 233
2911 233 254 -50 -288 -209 28 331 195 23 -207 -235 -8 238 280 -58 -281 -254 89 278 215 -14 -221 -230 51
$$ packed form
2762C27j13l57j36ML29K85k8l90k59J27L69J83j14l24j86Q1K93K31j18l70j72
2783c38J85K88J28j09k74j90J20L01K38k14k89j40Q8L47J63j14k59k18J43L46
2803B02K10k39l13j39J17K92K23j46l27k15J76L09J84k42k54j48J67K64J43o0
2823B04m01r9J48L61Q3j84l40j04K23K66J67j60m08j07K69K25J42j95k76q9K80
2844EJ75J64k51l05j27K45L13K6j41k75j15J31L49P4j73l47k3K37K56L3j42l71
2866b62j8K33K56J26k88k80j0J86K39J10k17k95k5J51L26J4k49k17j8K08K54K4
2888B48j35l07j07L23K52j6k78k12j1J86K94M9k45k99OK54K56r2j66k34jK25K43
2911B33K1l04k38P9K37L03j36j72k30k8K27K46M2l38k23K7L43J89o3k29k07rK81
$$ plain form
2934 51 246 216 -67 -223 -155 62 242 136 -83 -279 -259 -1 203 120 -81 -315 -200 39 234 210 -50 -295
2956 -295 -171 17 328 188 -21 -192 -179 126 251 189 -75 -270 -203 51 288 180 -37 -269 -179 52 226
2977 226 180 -109 -280 -198 119 247 124 -111 -248 -167 60 264 146 -51 -247 -145 83 218 113 -72 -255
2998 -255 -141 133 241 106 -85 -313 -120 148 277 151 -137 -182 -119 136 256 91 -165 -262 -86 113 221
3019 221 95 -192 -222 -135 160 221 58 -172 -194 -122 121 221 52 -181 -187 -101 106 193 46 -99 -157 -67 104 192
3043 192 71 -128 -199 -70 159 236 99 -187 -222 -58 224 207 55 -158 -166 -35 93 178 57 -183 -245 -34 164
3066 164 214 -10 -167 -223 -53 186 207 59 -185 -212 -56 153 156 27 -190 -191 16 182 216 14 -124 -169 43
3089 43 179 221 22 -145 -194 -4 177 211 -1 -183 -133 -19 130 169 -18 -228 -196 24 133 172 -3 -160 -158
$$ packed form
2934E1J95l0k83j56O8K17J80j06k19j96K0K58K04q3k01k34J15K39J95k4k60k45
2956b95J24J88L11j40k09j71J3L05J25o2k64j95O7K54K37j08k17k32R0K31J74
2977B26m6k89j71Q2L17J28j23k35j37Q1K27K04j18j97j96J02K28J35j05j85j83
2998b55J14K74J08j35j91k28J93K68J29j26k88m5O3K55J20j65k56r7J76J99J08
3019B21j26k87l0Q7K95O1j63k30k2P2K43J00j69k33oQ6K07Q7j47j45n8R0J71Q8
3043A92j21j99p1J29K29P7j37k86l5J64K82j7j52k13qJ31J28Q5j21k40o2K11J98
3066A64N0k24j57n6J70K39K1j48k44k7J56K09Lj29k17jK07J66L4k02j38m5K12
3089D3J36M2j99j67m9J90J81L4k12j82N0J14J49L9j87k10L2K20J09L9j75j57K
$$ plain form
3112 -158 -17 160 133 -7 -181 -149 45 215 153 -72 -249 -182 -2 207 193 5 -154 -149 8 179 150 1 -147
3135 -147 -166 10 235 208 -64 -180 -134 71 210 196 -68 -181 -194 19 175 101 -103 -215 -127 47 256 145
3157 145 -15 -189 -133 17 202 178 -48 -192 -81 41 180 129 -56 -175 -105 25 233 139 -56 -171 -132 56
3179 56 221 109 -50 -179 -143 69 171 107 -107 -119 -127 27 164 133 -108 -206 -105 26 113 57 -100 -159 -153 23
3203 23 134 99 -101 -178 -26 93 221 94 -55 -134 -114 47 226 86 -89 -199 -27 121 154 146 -63 -164 -88
3226 -88 90 128 71 -118 -178 -32 110 144 48 -124 -154 -106 140 230 94 -55 -172 -54 83 147 40 -84 -163 -49
3250 -49 92 167 75 -103 -120 -16 137 145 15 -148 -138 -29 110 175 21 -152 -149 -55 134 123 22 -99 -218 -28
3274 -28 142 147 9 -118 -151 -35 86 165 49 -136 -98 19 159 158 -15 -122 -88 2 178 223 71 -133 -150 -30
$$ packed form
3112a58J41J77k7j40j74L2J94J70o2k25j77O7J80K09j4j88j59NJ57J71k9j49j48
3135a47j9J76K25k7k72j16M6K05J39j4k64j13j3K13J56p4k04j12Q8J74K09j11
3157A45j60j74N6J50J85k4k26j44J11J22J39n1j85j19P0J30K08r4j95j15L9J88
3179E6J65j12j59j29L6K12J02o4k14j2qJ54J37l1k41r8J01J31Q7n6j57n9OJ76
3203B3J11l5k00p7J52J19J28j27j49p9K0J61J79j40j75j10J72J48L3qk09j01P6
3226h8J78L8n7j89o0J46J42L4r6j72l0M8K46R0j36j49j17J18J37O4j07j24p9J14
3250d9J41P5r2j78j7J04J53Qj30j63J0J09J39O5j54j73LR4J89j1j01j21j19J90
3274b8J70Nj38j27l3J16J21P9j16j85L8J17J40jj73j07L4R0J76M5j52k04j7J20
$$ plain form
3298 -30 168 129 32 -121 -103 -40 173 118 -9 -92 -103 32 172 128 -9 -123 -133 -36 165 126 -50 -156 -127 -16
3322 -16 73 112 19 -117 -162 1 86 137 -54 -104 -117 -13 92 150 32 -114 -134 36 157 95 30 -141 -75 -19 142
3347 142 124 -13 -122 -138 -1 145 95 -24 -129 -131 17 160 65 10 -121 -102 53 106 92 26 -82 -73 -27 104 89
3372 89 14 -41 -116 93 96 91 -53 -118 -82 67 157 145 -4 -106 -53 36 143 85 -25 -140 -113 10 76 97 -76 -140
3398 -140 -89 63 101 33 -50 -145 -74 58 126 103 -6 -91 -55 96 86 78 18 -140 -87 37 142 110 -34 -124 -58 100
3424 100 124 45 -68 -164 -52 98 107 39 -79 -168 -63 82 133 6 -43 -140 -140 51 151 39 -42 -104 -37 35 122 50
3450 50 -100 -86 -49 108 54 20 -57 -161 -22 29 147 74 -79 -62 -28 72 164 82 -55 -102 -40 55 68 32 -120 -120
3476 -120 -40 78 69 41 -87 -121 -1 84 112 28 -130 -163 11 22 89 6 -42 -62 12 98 95 66 -44 -35 10 51 120 -32
$$ packed form
3298c0J98l9r7j53J8O3K13n5j27q3j1J35J40m4j37j14j0R7K01l9j76j06K9J11
3322a6Q9L9r3j36m5J63Q5N1j91n0j3J04J05N8j18j46k0J70J21o2o5j71O6N6J61
3347A42j8j37j09j6J37J46n0j19j05kJ48J43r5n5j31J9J55N3j4o6j08RM6J31j5
3372H9p5n5p5K09Lnj44o5L6J49R0j2j49j02N3Q9J07n8j10j15K7J23O6K1j73o4
3398a40N1J52L8o8q3r5P1J32O8k3j09q5L6J51j0qo0j58N3J24J05l2j44r0O6J58
3424A00K4p9j13r6J12J50Ro8j18q9J05J45N1j27m9r7%J91J00j12q1o2O7P2Q7p2
3450E0j50J4L7J57n4l4p7j04J39N1J18p3j53J7L4J00R2q2j37m7O2R5J3l6j52%
3476a20Q0J18rk8j28l4J20Q5K8q4j58l3J74J1O7q3m8k0P4Q6lk9j10RM5M1O9j52
$$ plain form
3504 -32 -99 -83 -27 55 79 -12 -81 -153 -32 69 76 -1 -71 -128 -42 119 62 65 -40 -52 -64 127 91 -49 -56 -92 -53 130
3532 130 69 47 -76 -97 91 81 48 7 -87 -72 34 60 75 -30 -56 -81 32 88 63 -35 -50 -85 26 53 104 5 -110
3559 -110 -67 -3 112 36 -19 -102 -66 -13 55 98 -25 -116 -97 -40 62 49 10 -80 -63 -6 151 108 -2 -63 6 35 118
3586 118 36 -31 -26 -91 59 65 39 16 -87 -106 21 63 13 -30 -91 -64 36 82 38 -45 -65 -59 -26 46 43 -50 -87 -87 19 47
3616 47 9 -64 -47 1 64 78 18 -8 -67 -61 23 112 65 -61 -63 -25 33 34 60 12 -69 -51 48 35 62 -65 -30 -51 85 92 9
3647 9 8 -81 -55 87 96 45 -30 -59 -3 75 82 78 -57 -54 5 52 68 154 -31 -106 -15 82 90 22 -20 -74 11 48 40 -2 -62 -82 -1
3680 -1 58 68 -17 -90 -83 26 41 9 28 -37 -38 11 28 80 -15 -104 -56 5 55 68 42 -114 16 27 52 72 70 -37 27 -42
3710 -42 94 95 19 -8 -36 7 89 75 -3 -49 20 -29 44 74 -3 -20 -26 -52 61 30 -32 -65 -38 -16 27 26 -33 -6 -40 52 86
$$ packed form
3504c2o7J6N6Q2K4r1o9p2J21J01Pp7p0n7Q6J61n7Lj05j2j2J91l6j40pl6L9J83
3532A30o1k2j23k1J88j0l3m1r4J5J06K6J5j05k6k5J13N6k5r8j5l5J11K7N1r9j15
3559a10M3O4J15p6n5q3L6N3O8M3j23r1J9N7J02j3l9r0J7N7J57m3j10o1O9K9Q3
3586A18q2o7No5J50Ok6k3j03j9J27M2n0m3o1K7J00M6m4q3k0OL3P2lr3l7%J06K8
3616D7l8p3J7M8O3J4o0k6n9OQ4Q9m7j26kL8N8JK6m8q1J8R9j3K7j27L5k1J36Pq3
3647Ijq9K6J42Rn1p5k9N6P8Pmj35LN9M7J6Q6j85p5R1R7Qo8m2n4Q5L7qm2o0k0Q1
3680aN9J0q5p3PJ09J5l2J9o5jM9J7N2r5q9M8O1N0J3k6j56J30J1K5K0kj07O4o9
3710d2J36Jp6k7k8M3Q2j4p8m6O9m9P3L0p7j7ok6J13l1o2l3K7K2M3jn9K7l4R2L4
$$ plain form
3741 86 62 -19 -39 4 -15 7 30 7 -64 -62 -4 78 32 -13 -36 36 28 67 58 -75 -70 -14 1 51 -35 -20 -13 -48 -3 50 29 -80
3773 -80 -75 -89 13 8 -7 -10 -40 -61 62 95 18 4 -45 3 25 28 31 3 -70 -3 56 44 35 32 -16 -7 44 66 -49 -47 -58 34 45
3806 45 89 38 -37 -25 -29 -8 46 -1 -36 -57 -1 36 91 71 -74 -59 13 25 45 4 -65 -31 -12 35 64 91 3 -77 -7 51
3836 51 47 6 -68 -58 17 -8 21 -77 -27 -52 11 31 77 65 -103 -51 1 4 38 -15 -14 35 -25 14 1 1 -48 -20 29 59 4 0
3868 0 -40 -16 68 39 27 15 -35 -9 64 56 -9 -12 -8 -49 -5 23 65 -40 -49 -13 9 6 -47 -27 -32 -33 16 42 27 -38 -21 -14 35 36 10
3903 10 6 -36 -24 -2 21 2 35 -56 -5 33 19 25 41 -15 -41 29 54 -41 -38 -36 6 -10 70 4 -47 -63 -20 40 25 -9 -59 -26
3935 -26 24 54 21 -13 -21 -53 -25 7 65 38 14 -14 -14 3 66 50 13 5 7 38 80 24 -1 -10 56 33 54 23 3 -16 3 42 69
3968 69 -12 -33 2 -19 72 31 22 -29 -44 17 74 22 -22 -24 7 -4 30 32 -2 -34 -50 4 40 41 32 -20 -4 36 68 68 47 -5 -62
$$ packed form
3741H6k4q1k0M3j9K2K3k3p1KN8Q2m6m5k3P2qL9rj33NN6J5N0q6J5Pl5M5N3k1j09
3773h0Nj4J02nj5ll0k1J23L3p7j4m9M8K2LLk8p3O7N9j2rlm8RN1K2j15Kj1R2J1
3806D5M4n1p5J2mK1N4m7l5k1N6L7N5k0j45J5P2J2K0m1o9L4J9M7K9K7q8q0P0N8
3836E1mm1p4J0P5k5K9r8N0k5O3K0M6j2j68N2N2LL4n3JM9o0L9j3%m9K8M9L0n5m
3868@m0K4Q4k9j2j2n0K6P3qo5lMm1M4K8M2j05rL6K2ln3K0njM9K6j5o5J7PM9Jk6
3903A0mm2J2K2K3j9L3r1N1L8j4OJ6n6k6P0K5r5LKM2j6Q0o6n1j6M3O0j5l4n0L3
3935b6N0L0l3l4ql2K8L2N8k7k4k8%J7O3j6l7qKL1M2n6k5rO6k3K1l1k0j9J9L9K7
3968F9q1k1L5k1R1m1rn1j5O1N7n2m4kL1j1L4Kl4l2j6N4L6Jrn2J6M0L2%k1n2n7
$$ plain form
4001 -62 8 12 1 -32 -61 20 3 2 57 35 -55 -8 4 47 23 -7 -72 -46 1 -46 2 47 -57 -3 37 -20 29 -32 -8 8 28
4032 28 39 49 17 2 22 3 -40 -4 -37 22 -52 -6 -22 4 -30 -25 24 2 37 -27 16 -78 -4 -1 16 19 11 -15 14 29 -1 -10 -9
4065 -9 -5 17 41 32 2 -20 11 -25 20 40 -45 30 17 47 -1 23 25 -35 -50 45 28 3 -8 -10 -45 -22 43 -45 -18 -3 -64 55
4097 55 52 -5 -50 -7 11 24 81 50 0 -63 23 -31 -7 0 41 -59 63 -25 60 35 1 -28 -28 -14 58 87 8 -10 33 -6 45
4128 45 23 -14 -44 -11 13 26 -39 -53 35 31 -14 77 14 -52 20 -21 62 -2 -38 -96 -24 18 9 18 13 6 10 9 13 29 28 -6 -21 -40 14
4163 14 34 31 -101 -1 33 30 40 -18 -2 12 -2 19 13 -37 -32 6 -21 -38 40 -37 16 -36 -30 30 -26 32 -7 -16 56 24 -5 -45
4195 -45 4 -31 41 40 15 31 47 26 -9 69 52 -26 -19 -5 -7 15 27 60 -15 -13 -29 27 7 -32 20 -57 -4 39 -34 -11 -26 -40
4227 -40 -55 15 38 1 -65 -36 -5 -5 -15 -11 -56 52 49 -3 17 -10 57 -21 -18 2 -4 21 -31 -13 35 10 -4 -83 -54 -88 23 11
$$ packed form
4001f2P0Mj1l3k9Q1j7jN5k2r0M7J2M3k4l0o5K6M7m7M8M5j04N4M0n7M9o1K4J6K0
4032B8J1J0l2j5K0j9m3L6l3N9p4M6j6K6l4NM9k2L5o4M3r4P4LJ7Lqk6K9J5l0rJ
4065iMK2K4rl0k2L1l6M5K0q5P5j3L0m8K4Ko0j5R5j7k5j1kl5K3O5q8K7J5o1J19
4097E5ln7m5M3J8J3N7l1n0o3Q6n4K4PM1j00J22q8Q5k5l4k9%J4P2K9p9j8M3l9N1
4128D5k2l7l0L3K4J3o5j4Q8mm5R1o3o6P2m1Q3o4l6n8P2M2rRnpMjMJ6jl4j5j9N4
4163A4K0lj32J00L4lJ0n8J6J4j4K1on0NL8k7j7P8p7N3n2OO0n6N8l9rP2l2k9m0
4195d5M9l5P2jk5J6J6k1l5P8j7p8PJ4kK2J2L3p5Kj6N6k0l9N2p7N3M3p3K3j5j4
4227d0j5P0K3l7o6K9L1%j0Mm5J08ln2K0k7O7p8LK0oK5n2J8M8k5j4p9K9l4J11j2
$$ plain form
4259 11 -18 -69 -65 -35 -12 -17 17 -66 -21 14 42 54 23 6 -50 -13 17 38 64 -63 0 -2 41 -4 -54 -44 18 47 73 13 14 55
4291 55 -12 -13 18 37 -45 -49 -45 -50 86 56 14 -21 -33 -55 -21 40 25 -14 -3 75 21 -5 -29 -45 61 27 -25 36 -25 -21 -6 -6
4323 -6 48 46 39 -42 -7 -1 32 -5 -20 -34 -30 33 24 -21 18 -65 10 29 4 3 -23 -37 10 33 23 25 -82 -35 -1 -17 29 -12 -14 -24
4357 -24 -29 14 43 -29 -23 -55 -68 23 55 16 -22 -51 7 24 16 65 -10 -20 18 10 34 23 -9 -54 -22 29 83 3 -33 3 -18 54
4389 54 13 2 -30 -49 -74 -7 45 -6 -12 -52 43 45 43 -16 21 -13 -21 95 69 -18 -14 -95 4 81 68 37 -8 -32 -9 -3 45 73 2
4422 2 -10 42 4 12 -63 -7 -83 8 20 38 11 -60 -112 -60 15 54 -14 5 -49 10 110 56 37 -37 -42 50 24 90 -86 -17 -60
4453 -60 -9 39 15 -61 -84 -39 -11 13 47 -25 -81 -56 -25 15 26 -32 -102 -40 0 71 34 -3 -43 -25 26 31 26 -29 -63 4 -10
4484 -10 -28 4 -29 -86 -6 20 41 49 16 -45 9 33 57 59 22 -84 -29 57 60 96 2 -47 -35 36 82 48 -21 -45 -45 61 23
$$ packed form
4259A1k9n1ML0K3nL4q3M5L5K8J2l1j7n6L7L0K1K6j27O3kM3m5n0J0O2K9K6o0JM1
4291E5o7jL1J9q2mMnJ36l0m2l5j2k2L4O1j5l9J1P8n4k6k4j6J06l4n2O1o1MJ5%
4323fN4kpq1L5OL3l7j5j4MO3rm5L9q3P5J9k5jk6j4M7K3j0Kj07M7L4j6M6m1kj0
4357b4nM3K9p2Ol2j3R1L2l9l8k9N8J7qM9p5j0L8qK4j1l2m5L2N1N4q0l6L6k1P2
4389E4m1j1l2j9k5O7N2n1om0R5Kkn9L7l4qJ16k6q7Mq1R9P7j3l1m5k4K3OM8K8p1
4422Bj2N2l8Qp5N6p6R1J2J8k7p1n2N2P5L9o8J9n4N9J00n4j9p4nR2k6O6j76O9m3
4453f0N1M8k4p6k3M5K8K4L4p2n6K5L1M0J1n8p0O2M0P1l7l7m0J8N1Nnn5l4O7j4
4484a0j8L2l3n7Q0K6K1Ql3o1N4K4K4Kl7j06N5Q6LL6r4m9J2P1M6l4o9k4%J06l8
$$ plain form
4515 23 42 -5 -12 -15 39 22 59 -26 -41 -67 -19 81 11 -59 -34 26 19 35 8 -29 -67 -15 50 63 -5 7 -45 -33 37 55 17
4546 17 -22 -71 -31 70 62 -13 -23 -56 -25 66 23 15 -26 -28 5 10 38 8 -12 -22 -49 85 38 46 -24 -36 5 84 29 15 -36 -37
4578 -37 76 5 22 -8 -38 -36 41 -12 11 34 -28 -63 -36 -10 22 10 -20 -47 8 47 28 -11 -33 -35 -11 77 23 -30 -45 -16 -11
4609 -11 101 86 -4 -74 -50 13 32 95 39 -107 -62 -12 88 78 -20 -1 -70 83 66 34 -12 -90 -49 24 58 2 -99 -92
4637 -92 -78 -9 24 16 -32 -32 -54 5 38 77 -46 -57 -12 5 58 43 -6 -19 -13 36 71 53 -42 -45 -83 0 50 11 -64 -52 -85 -7
4669 -7 74 39 -82 -68 -4 -22 65 38 -49 -19 -14 -17 41 109 -4 -53 -61 -11 46 64 -42 -58 -81 105 130 14 11 -25 -9 26
4699 26 93 34 -2 -57 -12 59 47 119 -14 -121 -18 -7 29 2 -36 -86 -62 -11 40 0 -14 -40 -63 28 37 33 -40 16 5 24
4729 24 72 14 -36 -44 -65 41 62 107 4 -24 6 71 96 44 -8 -86 -67 62 14 51 0 -40 -19 42 116 20 -66 -95 -45
$$ packed form
4515B3J9m7plN4j7L7q5j5k6M8J00p0p0K5O0pJ6k7l7l8N2O5J3o8J2n2J2P0J8l8
4546A7l9m9M0J01qp5j0l3L1R1m3qm1kL3NK8l0k0j0k7J34m7Qp0j2M1P9n5j4n1j
4578c7J13p1J7l0l0KP7n3K3K3o2l5K7K6L2j2l0k7N5L9j9l9k2kK4Q8n4n3j5K9N
4609a1J12j5r0p0K4O3J9O3n6j46M5N0J00j0r8J9o9J53j7l2m6p8M1P3L4n6j01P
4637i2J4O9L3qm8%k2N9L3L9j23j1M5J7N3j5m9j3OM9L5j8r5ll8Q3N0l9p5J2l3P8
4669gQ1l5j21J4O4j8Q7k7q7L0NlN8O8j13m9qN0N7J8j06j6k3J86K5j16ll6J6L5
4699B6O7n9l6n5M5P1j2P2j33j07J03J1L6k7l8n0K4N1N1m0j4k6k3R1Rmp3N6j1J9
4729B4M8n8n0qk1J06K1M5j03k8L0O5K5n2n2p8J9J29m8L7n1m0K1O1P4r6q6k9N0
$$ plain form
4758 -45 8 22 -9 -25 -123 -43 7 55 40 -17 -71 12 21 70 17 -7 -52 -44 44 95 15 -8 -23 -25 71 97 41 -47 -13 -16 63 74
4790 74 66 -71 -26 -28 24 80 -39 -52 -51 2 54 104 11 -103 -95 -5 74 65 -29 -32 -28 -26 57 53 -27 -50 -41 -35 26 58 44 -22 -87 -37
4824 -37 62 87 27 -63 -58 18 77 -10 -5 -93 -82 31 55 34 -5 -36 -42 -33 104 40 -40 -56 -80 16 57 27 4 -74 -68 -19 27 91
4856 91 9 -118 -46 -15 54 32 -56 30 -60 21 87 59 6 -28 -60 -27 8 45 -14 -29 -80 5 68 38 -60 -85 -62 -3 85 39
4886 39 -19 -116 -7 -6 52 22 26 -34 -70 57 122 2 -30 -97 -57 42 69 67 31 -98 -45 37 123 57 30 -49 -88 56 121
4915 121 18 -52 -90 -69 53 53 41 -41 -49 -50 10 23 -18 10 -119 -44 6 36 41 -71 -49 -39 53 117 38 -68 -32 -4 67
4944 67 95 13 -46 -98 -7 13 3 125 -12 -84 -42 44 104 13 -93 -93 -20 60 71 32 -10 -61 -28 55 98 22 -53 -38 -90
4973 -90 56 36 6 -15 -83 -15 43 64 80 32 -79 -26 15 81 31 -70 -111 14 36 11 41 -4 -39 -80 37 44 4 -44
$$ packed form
4758d5N3J4l1j6r8Q0N0M8j5n7n4Q3RM9n3k4m5QQ8N1q0k3j5kR6K6n6q8L4lP9J1
4790G4qj37M5kN2N6j19j3JN3N2N0r3j14QR0P9rr4lMKQ3mq0k3ROO1L2j4o6o5N0
4824c7R9K5o0r0NP6N9q7Nq8J1J13K4k1l9l1oRJ37o4q0j6k4R6M1l0k3p8OM9M6O4
4856I1q2j27P2L1O9k2q8Q6r0Q1O6k8n3l4l2L3L5L7n9j5n1Q5O3l0r8k5K3N9Q8m6
4886C9n8r7J09JN8l0Mo0l6J27O5j20l2o7M0R9K7kl6j29N3Q2Q6o6k7p9l9J44O5
4915A21j03p0l8K1J22%j2q2qjO0J3m1K8j29P5N0L0Nj12K2J0R2O4p9j06L6K8P1
4944F7K8q2n9n2R1K0j0J22j37p2M2Q6O0r1j06%P3Q0J1l9m2n1L3Q3M3p6p5J5n2
4973i0J46k0l0k1o8O8N8K1J6m8j11N3M1O6n0j01m1J25K2k5L0m5l5m1J17Pm0m8
$$ plain form
5001 -44 -76 -16 96 47 -8 -58 -44 -36 25 71 -19 -109 -23 -27 54 43 -6 -6 -65 -26 18 120 2 -45 -41 -8 27 36 41 -7 -90 29
5033 29 67 11 0 -33 -46 -49 60 98 33 -28 -76 4 62 51 6 -63 -134 27 54 79 5 -67 -148 -36 52 44 -1 -33 -55 -32
5063 -32 89 62 -7 -62 -67 13 60 117 -2 -37 -85 -32 33 21 -2 -67 -28 -23 67 43 12 -51 -110 20 36 25 2 31 -67 -33
5093 -33 27 -19 -9 12 -31 -57 18 -32 19 -67 -75 5 67 77 -11 -33 -39 19 97 28 10 -46 -128 35 97 47 -18 -70 -23 -2 81
5124 81 47 -25 -132 -35 21 26 40 -11 -28 -98 22 51 32 -56 -104 -43 25 57 31 -4 -62 -44 -10 57 12 -24 -53 26 9 40
5154 40 77 -1 -46 -66 30 39 -9 -41 -41 -25 29 66 10 -24 -82 -48 -36 21 56 40 -71 -25 48 64 18 -45 -46 -45 13 75 -8 -44
5186 -44 -59 -4 88 71 42 -57 -72 0 37 59 -4 -42 -36 7 98 33 66 -23 -68 -43 41 70 -12 -94 -67 -28 63 61 36 -56 -83
5217 -83 -17 -7 58 62 -24 -68 8 -1 115 28 -41 -78 -11 95 66 34 -27 -111 -87 91 70 13 -2 -46 -16 42 32 33 -67 15
$$ packed form
5001d4l2O0J12m9n5n0J4QO1M6r0r0Q6mQ1j1m9%n9L9M4J02j18m7ML3L5RNm8q3J19
5033B9L8n6j1l3j3lJ09L8o5o1m8Q0N8j1m5o9p1J61K7K5p4p2q1J12Q8qm5l2k2K3
5063c2J21k7o9n5nQ0M7N7j19l5m8N3O5j2k3o5L9NR0k4l1o3n9J30J6j1k3K9r8L4
5093c3O0m6J0K1m3k6P5n0N1q6qQ0O2J0q8k2oN8P8o9j8n6q2J63O2n0o5n2M7K1Q3
5124H1l4p2j07R7N6NJ4n1j7p0J20K9j9q8m8O1O8L2k6l5n8J8L4O7m5l6k9P9j7L1
5154D0L7p8m5k0R6Rm8l2%J6N4L7n6l4n8L4J2N7L5j6j11M6P3J6m6o3jJN8O2q3l6
5186d4j5N5R2j7k9r9j5P2L7K2o3l8OM3R1o5L3q9m5K5Q4K9q2q2K7L9R1kk5r2k7
5217h3O6J0O5Mq6m4P6rJ16q7o9l7O7J06k9l2o1q4K4J78k1n7j5m4L0N8j0Jj00Q2
$$ plain form
5247 15 22 65 15 14 -18 -31 -32 38 44 -22 -23 -38 7 30 75 56 -73 -66 -57 54 83 27 -40 -70 -23 50 83 -11 -15 -25 -1 71 55
5280 55 15 -8 -57 44 58 29 -14 -27 -14 14 35 27 -77 -41 -48 -6 74 52 -51 -77 -19 -4 54 -10 1 -86 -83 14 60 38
5310 38 6 -77 -40 -19 39 122 6 -64 -38 -19 59 40 -42 -70 -60 -8 123 56 -1 -109 -38 -31 72 58 -6 -119 -40 12
5338 12 61 -11 -22 -22 -54 10 23 31 -3 -48 13 -11 84 67 -32 -58 -26 28 46 29 -2 -68 -11 22 81 28 1 -15 -51 37 46 -13
5370 -13 -43 -45 -44 7 50 33 -56 -30 -51 56 47 26 -3 -31 -37 39 92 31 -45 -53 -23 34 80 -6 -5 -42 21 37 90 71 10 -28 27
5403 27 52 64 14 -10 -108 -33 42 -8 9 2 -34 -44 13 70 -22 -36 -100 -78 57 11 48 -38 -44 5 35 16 4 -18 -86 -9 63
5434 63 59 48 -99 -33 -23 25 24 19 -31 -48 4 48 47 -13 -16 -37 -40 -1 74 -24 -65 -102 2 63 36 -25 -18 -66 1 25 109 -10
5466 -10 -55 -59 -56 99 81 18 -99 -64 0 74 87 32 -37 -50 -24 73 -4 -4 -82 -48 0 88 75 -46 -6 -23 -28 -22 38 5 -77
$$ packed form
5247A5PM3n0jl2j3jP0Oo6jj5M5K3M5j9j29PRJ11K9n6o7l0M7P3L3r4mj0K4P2j6
5280E5m0k3m9J01J4k9m3j3J3K8K1qj04L6pM2Q0k2j03k6N8J5N8o4J1q7LR7M6k2
5310C8l2q3L7K1N8Q3j16p0K6J9P8j9q2k8J0N2J31o7n7j08P1PJ03j4o4j13P9N2
5338A2M9p2j1%l2O4J3Ql4m5O1k4R5j7r9k6L2N4J8j7l1o6N7L3N9n3k7j6l6Q8Rn9
5370a3l0kJN1M3j7q9K6k1J07rk1k9k8oP6N3o1p6qL0N7M6q6Jl7O3J6N3j9o1l8N5
5403B7K5J2n0k4r8P5P5n0J7pl6j0N7N7r2j4o4K2J35m6L7q6oM9L0j9j2k2o8P7P2
5434F3mj1j47O6J0M8jnn0j7N2M4jo0lk1lL9P5r8m1l7J04O1k7o1Pm8O7K4Q4j19
5466a0m5mLJ55j8o3j17L5O4P4J3n5o9j3K6R7p7%p8L4M8Q8j3j21M0j7nOO0l3q2
$$ plain form
5497 -77 -53 -46 31 1 -33 -58 -66 2 30 50 3 -121 -38 25 49 16 -9 -90 -12 8 45 26 -59 -40 -12 20 72 39 -22 -59 -47
5528 -47 -16 128 18 -60 -52 -57 4 53 81 0 -15 -66 32 44 40 5 -78 -41 -16 35 6 -39 -35 -54 -17 36 36 -55 -20 -6 42 69
5560 69 13 -6 -11 0 -24 70 9 -24 -42 -74 -4 7 -19 -54 -32 -22 32 33 63 -59 -18 -81 38 38 -8 -58 -85 -21 -33 22 9
5591 9 -29 -61 4 38 74 49 -1 -60 -22 -14 76 36 -57 -48 12 -7 27 39 -50 -35 -35 33 22 3 -91 -55 -7 24 106 -31 11 -93
5623 -93 -12 11 142 -51 -129 -33 -9 53 13 44 -19 -110 -33 20 32 48 9 -24 -34 80 80 8 -69 -48 -24 12 61 63 -33 -54
5653 -54 -7 21 -29 31 -1 -80 -23 89 16 51 -21 -55 -41 26 26 -28 -16 -45 33 9 39 53 -43 -82 -29 73 54 18 -38 -18
5683 -18 20 86 85 8 -61 -4 25 7 30 35 -49 -63 48 1 2 -10 -9 -91 0 2 -15 10 -12 -11 48 4 29 30 10 -101 13 25
5715 25 55 53 -50 -53 26 -15 -22 21 -104 -84 34 72 43 10 -69 -86 26 41 42 12 -41 34 23 42 78 -38 -50 -1 -11 62
$$ packed form
5497g7K4PP7l0l4k5qO8K8K0m7j24Q3O3K4l3k5q1P8K0L7j9q5J9K8L2N2l3o1l7J2
5528d7L1J44j10p8QnO1M9K8q1j5n1R8J2ml5q3L7K5N1k9m5Mj9L7N3%r1L5J4M8K7
5560F9n6j9nJ1k4R4o1l3j8l2P0J1k6l5K2J0N4JL0j22M1o3J19%m6n0k7O4j2N5j3
5591Il8l2O5L4L6k5n0n9L8QR0m0r3RO0j9L4J2q9J5%O8j1j9r4L6M8L1Q2j37M2j04
5623i3Q1K3J31j93p8R6K4O2m0L1o3r1P7N3J2J6l9l3j0J14%p2p7K1K4L6M9Kr6k1
5653e4M7K8n0O0l2p9N7J12p3L5p2l4J4O7%n4J2k9P8k4L0J4r6l9N3J02j9l6n6K0
5683a8L8O6jp7o9N7K9j8K3Nq4j4J11m7Jj2Jq2R1Kj7K5k2JN9m4K5Jk0j11J14J2
5715B5L0kj03lP9m1pM3j25K0J18L8k9l3p9j7J12J5Jl0n3P5j1J9L6j16j2M9j0P3
$$ plain form
5745 62 -10 39 -99 -8 24 89 65 -20 -20 -49 25 52 44 -26 -42 -17 60 121 49 -39 -52 -42 32 95 21 -31 -9 -38 26 49 89
5776 89 -60 -28 -26 56 92 19 -31 -25 -8 9 40 39 -24 -79 -49 10 32 77 -33 -110 -92 62 30 34 -27 -73 -23 20 111 9
5806 9 12 -9 -35 -3 44 65 -4 -69 -24 56 64 -40 -75 -49 15 -44 -19 31 -5 -34 18 -11 31 -33 -45 -62 -54 48 9 -63 -47
5837 -47 27 -51 12 47 30 -41 -67 -58 47 4 2 -14 -51 -34 -3 92 4 -11 -63 -18 64 44 -2 -62 -15 60 5 12 -26 -93 -41
5868 -41 -81 9 21 -40 -78 -75 -16 3 48 24 -81 -98 18 41 3 1 -45 -86 29 70 45 -28 5 -49 -10 46 7 22 9 -52
5898 -52 48 104 10 4 -71 -57 -62 18 63 -53 -34 -61 -33 26 54 -37 -34 -137 2 11 -13 -60 8 -17 -4 -17 -5 20 -52 -21
5928 -21 42 11 51 -41 -33 -39 35 86 19 39 -44 56 -7 54 102 49 -45 39 -2 65 20 -11 -14 -35 -47 70 33 3 -85 -79 -21
5959 -21 0 36 -25 -60 -82 46 72 38 -37 -23 -35 15 30 50 -24 16 -49 28 40 8 64 -52 -19 34 67 43 4 -47 -9
$$ packed form
5745F2p2M9j38R1L2O5k4q5%k9P4K7qp0j6K5P7O1p2q8j3J0P4O3p4n2K2k9O4K3M0
5776H9j49L2KQ2L6p3n0OJ7J7L1jo3n5L0N9K2M5j10p7J8J54l2Mo1m6N0M3R1j02
5806ILk1k6L2M7K1o9o5M5Q0Qj04l5K6O4n9K5N0l6k9N2k9M2o4j2j7QJ02l9p2J6
5837d7P4p8O3L5j7p1k6RJ05m3kj6l7J7L1R5q8j5n2M5Q2k0m6o0M7P5n5Pl8o7N2
5868d1m0R0J2o1l8LN9J9M5k4j05j7J16K3l8km6m1J15M1k5p3L3n4L9N6l9J5j3o1
5898e2J00N6r4op5J4nQ0M5j16J9k7K8N9K8r1Lj03J39Rk4m7O8k5J3j3J2K5p2L1
5928b1O3l1M0r2QoP4N1o7K0q3J00o3O1M8n3r4Q4m1O7m5l1lk1j2J17l7l0q8ON8
5959b1K1L6o1l5k2J28K6l4p5J4j2N0J5K0p4M0o5P7J2l2N6j16L3N3L3k4l9n1L8
$$ plain form
5988 -9 -1 14 13 -43 -33 -31 7 16 3 -18 -22 -29 35 -21 21 -29 -78 -23 -3 56 39 24 -29 -18 28 44 -5 -3 -70 -13 -10 -15 -1 -11 -35
6023 -35 -22 21 76 50 7 -43 -7 58 48 -15 -29 -51 -35 34 -3 -5 -60 -27 -52 14 28 -51 -68 -76 -28 28 53 31 -60 -35 66
6054 66 42 0 29 -46 -75 -49 97 73 18 -9 -4 -36 42 87 -31 -42 6 37 36 48 4 -46 -44 9 -29 -7 -20 -43 -87 -45 -5
6085 -5 36 -21 -75 -62 -54 40 29 26 -7 -33 19 25 58 4 6 23 42 76 65 38 -35 -17 -12 46 -2 -27 14 -121 -14 46 -6 14
6117 14 -29 -45 -7 11 -5 -34 36 -24 13 11 26 -57 -21 -20 19 48 -35 -20 -26 1 49 56 -7 31 -48 -80 -13 36 -14 -64 -27 46
6149 46 12 39 53 15 -70 -36 -39 -2 4 -14 -42 -13 16 60 43 -26 -97 -23 7 36 44 -23 -11 6 2 62 2 -22 -50 34 -3 -8 61
$$ packed form
5988iQJ5jn6J0KL8Rj3k1mpO4n6M2n0m9N5K0N9j7j5n3J1M6J6m9Ko7N7LnJ4j0k4
6023c5J3M3N5k6m3n0L6O5j0o3j4k2J6O9l7kn5L3k5O6J4p9j7qM8N6K5k2r1K5J01
6054F6k4m2K9p5k9K6J46k4n5k7Nl2P8M5j18j1M8L1jJ2m4n0KN3l8K2j3k3m4M2M0
6085eM1n7n4J3QR4j1ll3k6N2OL3n4KJ7J9L4j1k7p3J8NN8m8k5M1j35J07O0n2K0
6117A4m3j6L8J8j6k9P0o0L7kJ5q3L6JL9K9q3J5oK7M8Po3L8p9l2O7M9n0n0L7P3
6149D6l4K7J4l8q5L4lL7Oj8k8K9K9M4j7o9p1P4L0K9Qo7J2J7mO0o0k4k8Q4l7nO9
$$ [...]
8191d5
##END NTUPLES=NMR FID
##END=
