##TITLE=1H_Pr NCS-20-D
 200.13MHz, CDCl3,
 8 sc
 
 28.8.2025
##JCAMPDX= 6.0         $$ Bruker NMR JCAMP-DX V2.0
##DATA TYPE= NMR FID
##DATA CLASS= NTUPLES
##ORIGIN= UXNMR, Bruker Analytische Messtechnik GmbH
##OWNER= pz
$$ XWIN-NMR		Version 3.5
$$ Thu Aug 28 15:50:15 2025 Russian Standard Time (UT+4h)  she@DPX200
##.OBSERVE FREQUENCY= 200.1313
##.OBSERVE NUCLEUS= ^1H
##.DELAY= (6, 6)
##.ACQUISITION MODE= SIMULTANEOUS
##.ACQUISITION SCHEME= undefined
##.AVERAGES= 8
##.DIGITISER RES= 18
##SPECTROMETER/DATA SYSTEM= spect
##.PULSE SEQUENCE= zg30
##.SOLVENT NAME= D2O
##.SHIFT REFERENCE= (INTERNAL, D2O, 0, 14.3821)
##AUDIT TRAIL= $$ (NUMBER, WHEN, WHO, WHERE, WHAT)
$$ ##TITLE= Audit trail, XWIN-NMR		Version 3.5
$$ ##JCAMPDX= 5.01
$$ ##ORIGIN= Bruker BioSpin GmbH
$$ ##OWNER= she
$$ F:/spectra/data/she/nmr/H-C/1/audita.txt
$$ ##AUDIT TRAIL=  $$ (NUMBER, WHEN, WHO, WHERE, WHAT)
(   1,<2025-08-28 15:48:54.45 +0400>,<she>,<DPX200>,
      <created by zg, POWCHK disabled, PULCHK disabled
       configuration hash MD5:
       00 E9 B6 7A A2 85 ED C7 34 08 36 98 17 FE 4E 26
       data hash MD5: 16K
       91 35 2A 6B 6F 3A 6E 57 39 EE 1C 3F 25 93 DE FB>)
$$ ##END=
$$ 
$$ hash MD5
$$ 64 24 8C 3C 2D 3B F5 B4 64 62 B8 38 B0 FE 0F AF
##$RELAX= 
##$RELAX= 
##$RELAX= 
##$RELAX= 
##$RELAX= 
##$RELAX= 
$$ Bruker specific parameters
$$ --------------------------
##$DU= <F:/spectra>
##$EXPNO= 1
##$NAME= <H-C>
##$PROCNO= 1
##$TYPE= <nmr>
##$USER= <she>
##$AMP= (0..31)
100 100 100 100 100 100 100 100 100 100 100 100 100 100 100 100 100 100 
100 100 100 100 100 100 100 100 100 100 100 100 100 100 
##$AQSEQ= 0
##$AQ_mod= 1
##$AUNM= <au_zg>
##$AUTOPOS= <>
##$BF1= 200.13
##$BF2= 200.13
##$BF3= 200.13
##$BF4= 200.13
##$BF5= 200.13
##$BF6= 200.13
##$BF7= 200.13
##$BF8= 200.13
##$BYTORDA= 1
##$CFDGTYP= 0
##$CFRGTYP= 5
##$CHEMSTR= <none>
##$CNST= (0..31)
1 1 145 1 1 1 1 1 1 1 1 1 1 1 1 1 1 1 1 1 1 1 1 1 1 1 1 1 1 1 1 1 
##$CPDPRG= <>
##$CPDPRG1= <>
##$CPDPRG2= <>
##$CPDPRG3= <>
##$CPDPRG4= <mlev>
##$CPDPRG5= <mlev>
##$CPDPRG6= <mlev>
##$CPDPRG7= <mlev>
##$CPDPRG8= <mlev>
##$CPDPRGB= <>
##$CPDPRGT= <>
##$D= (0..31)
0 0.7 0 0 0 0 0 0 0 0 0 0.03 0 0 0 0 0 0 0 0 0 0 0 0 0 0 0 0 0 0 0 0 
##$DATE= 1756381733
##$DBL= (0..7)
120 120 120 120 120 120 120 120 
##$DBP= (0..7)
150 150 150 150 150 150 150 150 
##$DBP07= 0
##$DBPNAM0= <>
##$DBPNAM1= <>
##$DBPNAM2= <>
##$DBPNAM3= <>
##$DBPNAM4= <>
##$DBPNAM5= <>
##$DBPNAM6= <>
##$DBPNAM7= <>
##$DBPOAL= (0..7)
0.5 0.5 0.5 0.5 0.5 0.5 0.5 0.5 
##$DBPOFFS= (0..7)
0 0 0 0 0 0 0 0 
##$DE= 6
##$DECBNUC= <off>
##$DECIM= 32
##$DECNUC= <off>
##$DECSTAT= 4
##$DIGMOD= 1
##$DIGTYP= 9
##$DL= (0..7)
0 120 120 120 120 120 120 120 
##$DP= (0..7)
150 150 150 150 150 150 150 150 
##$DP07= 0
##$DPNAME0= <>
##$DPNAME1= <>
##$DPNAME2= <>
##$DPNAME3= <>
##$DPNAME4= <>
##$DPNAME5= <>
##$DPNAME6= <>
##$DPNAME7= <>
##$DPOAL= (0..7)
0.5 0.5 0.5 0.5 0.5 0.5 0.5 0.5 
##$DPOFFS= (0..7)
0 0 0 0 0 0 0 0 
##$DQDMODE= 0
##$DR= 18
##$DS= 0
##$DSLIST= <SSSSSSSSSSSSSSS>
$$ [...]
##$SUBNAM0= <"">
##$SUBNAM1= <"">
##$SUBNAM2= <"">
##$SUBNAM3= <"">
##$SUBNAM4= <"">
##$SUBNAM5= <"">
##$SUBNAM6= <"">
##$SUBNAM7= <"">
##$SUBNAM8= <"">
##$SUBNAM9= <"">
##$SW= 18.0517328524113
##$SWIBOX= (0..15)
0 0 2 0 0 0 0 0 0 0 0 0 0 0 0 0 
##$SW_h= 3612.71676300578
##$TD= 16384
##$TD0= 1
##$TE= 0
##$TE2= 300
##$TE3= 300
##$TEG= 300
##$TL= (0..7)
0 120 120 120 120 120 120 120 
##$TP= (0..7)
150 150 150 150 150 150 150 150 
##$TP07= 0
##$TPNAME0= <>
##$TPNAME1= <>
##$TPNAME2= <>
##$TPNAME3= <>
##$TPNAME4= <>
##$TPNAME5= <>
##$TPNAME6= <>
##$TPNAME7= <>
##$TPOAL= (0..7)
0.5 0.5 0.5 0.5 0.5 0.5 0.5 0.5 
##$TPOFFS= (0..7)
0 0 0 0 0 0 0 0 
##$TUNHIN= 0
##$TUNHOUT= 0
##$TUNXOUT= 0
##$USERA1= <user>
##$USERA2= <user>
##$USERA3= <user>
##$USERA4= <user>
##$USERA5= <user>
##$V9= 5
##$VALIST= <valist>
##$VCLIST= <CCCCCCCCCCCCCCC>
##$VD= 0
##$VDLIST= <DDDDDDDDDDDDDDD>
##$VPLIST= <PPPPPPPPPPPPPPP>
##$VTLIST= <TTTTTTTTTTTTTTT>
##$WBST= 1024
##$WBSW= 4
##$XGAIN= (0..3)
0 0 0 0 
##$XL= 0
##$YL= 0
##$YMAX_a= 14353
##$YMIN_a= -18465
##$ZGOPTNS= <>
##$ZL1= 120
##$ZL2= 120
##$ZL3= 120
##$ZL4= 120
##$ABSF1= 10
##$ABSF2= 0
##$ABSG= 5
##$ABSL= 3
##$ALPHA= 0
##$AQORDER= 0
##$ASSFAC= 0
##$ASSFACI= 0
##$ASSFACX= 0
##$ASSWID= 0
##$AUNMP= <proc_1d>
##$AZFE= 0.1
##$AZFW= 0.1
##$BCFW= 1
##$BC_mod= 2
##$BYTORDP= 1
##$COROFFS= 0
##$CY= -3
##$DATMOD= 1
##$DC= 2
##$DFILT= <>
##$DTYPP= 0
##$F1P= 0
##$F2P= 0
##$FCOR= 0.5
##$FTSIZE= 0
##$FT_mod= 4
##$GAMMA= 1
##$GB= 0.15
##$INTBC= 1
##$INTSCL= 1
##$ISEN= 128
##$LB= 0.25
##$LEV0= 0
##$LPBIN= 0
##$MAXI= 10000
##$MC2= 0
##$MEAN= 0
##$ME_mod= 0
##$MI= 1.114404
##$NCOEF= 0
##$NC_proc= 0
##$NLEV= 6
##$NOISF1= 3.799351
##$NOISF2= 2.8
##$NSP= 1
##$NTH_PI= 0
##$NZP= 0
##$OFFSET= 14.38212
##$PC= 1
##$PHC0= -1480.869
##$PHC1= 26.99228
##$PH_mod= 1
##$PKNL= yes
##$PPARMOD= 0
##$PSCAL= 0
##$PSIGN= 0
##$REVERSE= no
##$SF= 200.129724274929
##$SI= 16384
##$SIGF1= 3
##$SIGF2= 2
##$SINO= 400
##$SIOLD= 16384
##$SREGLST= <1H.CDCl3>
##$SSB= 0
##$STSI= 0
##$STSR= 0
##$SW_p= 3205.1282051282
##$SYMM= 0
##$S_DEV= 0
##$TDeff= 0
##$TDoff= 0
##$TI= <>
##$TILT= no
##$TM1= 0
##$TM2= 0
##$TOPLEV= 0
##$USERP1= <user>
##$USERP2= <user>
##$USERP3= <user>
##$USERP4= <user>
##$USERP5= <user>
##$WDW= 1
##$XDIM= 8192
##$YMAX_p= 0
##$YMIN_p= 0
$$ End of Bruker specific parameters
$$ ---------------------------------
##NTUPLES= NMR FID
##VAR_NAME=  TIME,          FID/REAL,        FID/IMAG
##SYMBOL=    X,             R,               I
##VAR_TYPE=  INDEPENDENT,   DEPENDENT,       DEPENDENT
##VAR_FORM=  AFFN,          ASDF,            ASDF
##VAR_DIM=   8192,          8192,            8192
##UNITS=     SECONDS,       ARBITRARY UNITS, ARBITRARY UNITS
##FACTOR=    0.0002768,     1,               1
##FIRST=     0,             0,               0
##LAST=      2.2672688,     0,               0
##MIN=       0,             -18465,          0
##MAX=       2.2672688,     14353,           0
$$ Real data points
##PAGE= N=1
##DATA TABLE= (X++(R..R)), XYDATA
$$ plain form
0 0 0 0 0 0 0 0 0 0 0 0 0 0 0 0 0 0 0 0 0 0 0 0 0 0 -4 8 -8 8 -8 8 -8 8 -16 16 -16 16 -20 24 -24 28 -32 32 -40 41 -48
45 -48 52 -56 64 -71 77 -85 94 -104 113 -125 140 -155 172 -192 217 -245 280 -324 382 -461 573
66 573 -752 1084 -1879 8636 846 -17480 -2799 11272 7014 -5989 -5555 -611 1774 2470 3609
81 3609 -2264 -7454 -1562 8781 4910 -7628 -8475 3902 8342 -34 -6034 -1634 3211 3091 1284
96 1284 -508 -3199 -1977 3428 3943 -3011 -5578 683 4404 28 -2959 -75 1179 -1158 -86 2846
112 2846 82 -4319 -1010 5003 2697 -3922 -2755 3536 3118 -2294 -1845 1998 14 -3483 110 4075
128 4075 -862 -6033 -378 6578 1941 -5758 -2783 4608 3547 -2418 -2605 1090 1262 -93 879 730
144 730 -1998 -1619 2484 2731 -2348 -4031 554 3293 -94 -2947 -796 1567 838 85 577 -199 -1194
$$ packed form
0@%%%%%%%%%%%%%%%%%%%%%%%%mJ2j6J6j6J6j6J6k4L2l2L2l6M4m8N2o0O4p2Q1q9
45d8J00j08J20j35J48j62J79j98K17k38K65k95L27l64M09m62N25o04P06q43J034
66E73j325J836k963J0515p790j8326J4681J4071m258j3003M34M944K385O96J139
81C609n873n190N892J0343l871j2538q47J2377M440q376o000M400M845j20j807
96A284j792k691J222N405N15o954k567O261L721m376k987K884J254k337J072K932
112B846k764m401L309O013k306o619J167O291m18n412M49L843j984l497L593L965
128D075m937n171N655O956m637p699K975P391j061n965j87L695J72j355R72j49
144G30k728L79M103K47n079j683M585K739l387k853K151K363p29p53M92p76r95
$$ plain form
161 -1194 825 2564 -227 -2935 -345 2764 617 -2413 -732 1790 202 -1813 -105 1342 -653
176 -653 -1897 362 1813 -173 -1497 561 1687 -94 -635 1167 889 -1613 -1188 1946 1508 -2410
192 -2410 -2613 1552 2617 -943 -2656 -165 1655 564 -572 -542 -561 -121 1518 1531 -984 -1982 785
209 785 2883 553 -2526 -1509 1411 1345 -824 -1453 -549 92 571 832 -203 -1626 -398 2128 1474
226 1474 -1608 -1811 1129 2166 -93 -1461 -159 936 368 -180 -186 -575 -724 222 697 -496 -1436 -112
244 -112 1393 518 -1018 -357 1101 706 -470 -228 606 95 -489 177 540 -327 -712 213 503 -401 -828
263 -828 42 369 -337 -427 266 326 -163 -47 644 523 -269 -122 600 370 -485 -430 269 161 -478 -322 191
284 191 -101 -447 11 346 -258 -563 225 635 -80 -467 226 812 237 -259 47 305 81 -152 -98 -168 -423
$$ packed form
161a194K019J739k791k708K590L109k147l030J681K522j588k015J708J447j995
176f53j244K259J451j986j324K058J126j781n41J802k78k502M25L134m38l918
192b410k03M165J065l560j713K491J820j091j136L0j9M40J639J3k515r98K767
209G85K098k330l079J017K920o6k169o29R04O41M79K61j035j423J228K526o54
226A474l082k03K940J037k259j368J302J095n68n48ol89j49R46M75j193r40J324
244a12J505q75j536O61J458l95j176K42Q34n11n84O66L63q67l85R25K90r04m27
263h28Q70L27p06r0O93O0m89J16O91j21p92J47P22k30q55N5O99j08o39J56N13
284A91k92l46M58L35o04l05P88M10p15l87O93N86n75m96L06K58k24k33N4p0k55
$$ plain form
305 -423 -186 245 -27 -560 -302 500 398 -417 -416 417 537 -65 -212 215 251 46 108 171 -147 -316 91 208
327 208 -368 -613 -147 224 -70 -416 -118 341 257 -31 81 252 167 73 137 151 -99 -76 223 139 -324 -296 111
350 111 90 -291 -358 -51 68 -92 -67 21 69 156 276 184 14 15 167 230 -52 -259 -151 101 10 -222 -267 -88
374 -88 -20 -31 18 -69 -214 -36 312 232 -83 -81 282 426 184 -43 -39 11 62 107 -144 -332 -267 14 145 -61 -365
399 -365 -217 176 350 35 -263 -118 249 391 169 -67 -222 121 390 179 -328 -448 -3 253 12 -370
419 -370 -389 -155 222 279 -62 -352 -136 402 582 39 -453 -161 488 532 -81 -577 -206 397 315 -190 -432 -337
441 -337 31 275 83 -319 -464 24 599 402 -264 -469 107 744 450 -407 -597 91 591 202 -432 -503 -74
462 -74 240 169 -113 -377 -333 137 498 280 -331 -484 233 816 390 -486 -500 342 694 8 -571 -321 62 130
$$ packed form
305d23K37M31k72n33K58Q02j02q15JQ33J20o02j47M27L6k05O2O3l18j69M07J17
327B08n76k45M66L71k94l46K98M59q4k88J12J71q5r4O4J4k50K3K99q4m63K8M07
350A11k1l81o7L07J19j60K5Q8M8Q7J20r2j70JJ52O3k82k07J08K52r1k32m5J79
374h8O8j1M9q7j45J78L48q0l15KL63J44k42k27MN0N1M5k51j88O5K81J31k06l04
399c65J48L93J74l15k98J45L67J42k22k36j55L43K69k11n07j20M45K56k41l82
419c70j9K34L77N7l41k90K16N38J80n43m92K92O49M4o13m96L71O03q2n05k42R5
441c37L68K44j92m02j45M88N75j97o66k05N76O37k94q57j90O88N00l89o34p1M29
462g4L14p1k82k64M4M70L61k18o11j53P17N83m26q76j4Q42L52o86n79K50L83O8
$$ plain form
484 130 5 -101 -300 -417 4 596 320 -544 -668 314 969 259 -758 -454 578 763 -37 -518 -242 113
504 113 215 146 -130 -505 -449 240 647 70 -710 -520 566 980 11 -888 -301 758 800 -194 -696 -154 409
525 409 333 -83 -329 -350 -147 202 342 -145 -711 -370 603 766 -270 -866 0 941 503 -479 -473 240 461
546 461 32 -209 -97 -171 -145 193 300 -225 -650 -146 647 471 -473 -642 268 789 233 -456 -279 279 435
567 435 85 -173 -224 -149 27 217 67 -363 -450 27 521 194 -548 -538 300 741 118 -595 -302 449 559 34
589 34 -399 -173 180 214 34 -187 -328 -234 166 342 -77 -592 -256 516 526 -251 -537 87 560 260 -243 -228
611 -228 74 213 98 -42 -150 -194 -63 147 88 -251 -393 -39 286 145 -208 -217 131 298 150 -53 -90 73
633 73 144 84 -23 -75 -70 -95 27 83 -61 -248 -162 152 195 -100 -231 -41 265 230 -37 -129 20 167 139 -7 -87
$$ packed form
484A30j25j06j99j17M21N92k76q64j24R82O55p10j017L04J032J85q00m81K76L55
504A13J02o9k76l75N6O89M07n77p80J90J086M14r69q99N87J059M2r94n02N42N63
525D09p6m16k46k1K03L49J40m87n66L41R73J63j036n96Q66R41m38r82OP13K21
546D61m29k41J12p4K6L38J07n25m25N04P93j76r44j69R10N21n56o89J77N58J56
567D35l50k58n1P5J76J90j50m30q7M77M94l27p42J0Q38M41o23p13K93P51J10n25
589C4m33K26L53L4j80k21j41R4M00J76m19n15L36P72J0p77k86O24M73l00n03J5
611b28L02J39j15j40j08m4J31K10n9l39j42L54L25j41l53rL48J67j48k03l7J63
633G3P1o0j07n2Nk5J22N6j44j87Q6L14M3k95j31J90L06l5k67r2J49J47k8j46q0
$$ plain form
658 -87 -124 -17 99 53 -205 -300 -56 193 30 -214 -183 69 217 93 -80 -52 73 202 136 -28 -73 9 96 73
682 73 -60 -192 -122 50 46 -60 -186 -44 69 100 15 -65 15 98 110 49 -17 26 -1 27 11 -7 -92 -90 -42 8 -42 -111
710 -111 -79 17 44 -1 -14 8 72 109 82 6 21 37 93 77 -48 -83 6 66 -12 -120 -123 -37 -1 -14 -91 -50 -1 76 35 -19
740 -19 -23 51 103 37 -6 -40 -16 18 28 -56 -108 -68 5 -29 -85 -68 -23 38 -1 -45 11 90 65 46 31 19 51 47 20 -13 -64 1
772 1 17 -66 -96 -73 -14 -3 -53 -58 -27 22 69 -33 -3 26 57 33 -19 5 -22 24 8 7 -65 -64 -27 -27 -37 -79 -34 41 3 3 -11
805 -11 58 64 35 15 45 66 15 18 -12 9 -34 -10 1 -60 -82 -62 -33 -42 -75 -34 -10 11 -6 32 22 13 13 41 11 5 6 7 42 -40 -67
840 -67 -22 -18 -15 -56 -44 -20 -21 0 37 20 -5 55 68 49 -2 2 32 37 9 -10 -49 -41 -10 -51 -59 -86 -85 2 34 -18 -45 9 77 52 2
875 2 1 29 67 52 27 -64 -37 3 49 -36 -110 -84 7 -1 -67 -40 -36 19 52 70 43 -28 -6 87 130 -29 -86 -2 73 23 -101 -97
$$ packed form
658h7l7J07J16m6k58r5K44K49j63k44L1K52J48j24j73K8J25J29o6j64m5Q2Q7k3
682G3j33j32P0J72mj06j26J42J13L1q5q0Q0Q3J2o1o6M3k7K8j6j8q5KM8N0n0o9
710a11L2R6K7m5j3K2O4L7k7p6J5J6N6j6j25l5Q9O0p8j08lQ6L6j3p7M1M9P7m1n4
740a9mP4N2o6m3l4K4L4J0q4n2M0P3l4n6J7M5O1l9m4N6P9k5j9j5j2L2mk7l3n1O5
772AJ6q3l0K3N9J1n0nL1M9M7j02L0K9L1k4n2K4k7M6j6jp2JL7%j0m2M5P5l8%j4
805a1O9Ok9k0L0K1n1Ll0K1m3K4J1o1k2K0K9rl3M1K4K1j7L8j0r%K8l0oJJL5q2k7
840f7M5MLm1J2K4jK1L7j7k5O0J3j9n1ML0Nk8j9l9QL1m1qk7JQ7L2n2k7N4O8k5n0
875BjK8L8j5k5r1K7M0M6q5p4K6R1qo6K7MN5L3J8k7p1K2R3M3j59n7Q4P5n0j24M
$$ plain form
907 -97 -14 -8 -35 -34 -33 -70 -33 28 54 -46 -77 55 138 53 -59 -49 76 91 32 -38 -41 -27 27 32 -56 -93 -92 6 47 -1 -39 -60
939 -60 43 111 83 -46 -73 60 158 32 -110 -70 88 44 -78 -98 -61 -54 -56 8 34 -21 -111 21 208 50 -158 -42
965 -42 182 170 -65 -129 36 86 -41 -17 -1 -14 -87 -37 49 -10 -129 -104 112 123 -43 -99 43 164 53 -76 -44
990 -44 40 74 -6 -39 -59 -35 10 5 -16 -46 -68 -47 29 77 -38 -131 -19 143 140 -62 -77 97 170 -13 -127 -23 109
1017 109 -22 -96 12 15 -98 -78 84 97 -105 -159 74 206 34 -139 15 134 85 -43 -38 28 3 -45 1 35 -60
1042 -60 -104 -6 55 -6 -122 -46 60 91 -16 -59 -7 82 119 11 -88 -7 60 77 -22 -69 12 -2 -47 -19 -13 -60 -118 22
1070 22 71 -11 -138 -58 178 90 -81 -101 93 88 -33 -45 59 18 -82 -39 67 -38 -140 -33 109 30 -123 -57
1094 -57 75 83 -9 -13 34 35 25 27 37 -6 -57 10 27 -36 -78 -39 30 -8 -43 -53 -26 -13 28 40 11 -42 33 94 40 -47 2 57
$$ packed form
907i7Q3Ok7JJl7L7O1K6j00l1J32Q3q5j12J0J25J5n9p0lJ4N4Nq8l7JR8M1m8l8k1
939f0J03O8k8j29k7J33R8j26j42M0J58m4j22k0L7PkO4K6n5r0J32J87j58k08J16
965d2K24j2k35o4J65N0j27K4J6j3p3N0Q6n9j19K5K16J1j66n6J42J21j11j29L2
990d4Q4L4q0l3k0K4M5nk1l0k2K1P6M8j15r3J12J62lk02j5J74P3j83j14J04J32
1017A09j31p4J08Lj13K0J62J3k02n4K33J32j72j73J54J19m9j28NO6k5m8M6L4r5
1042f0m4R8O1o1j16P6J06L1j07m3N2Q9L7j08r9Q1O7J7r9m7Q1j4m5K8Om7n8J40
1070B2M9q2j27Q0K36q8j71k0J94nj21j2J04m1j00M3J06j05j02J07J42p9j53O6
1094e7J32Qr2mM7Jj0KJ0m3n1O7J7o3m2L9O9l8l5j0K7J3M1J2k9n3P5O1n4q7M9N5
$$ plain form
1126 57 -2 -60 -18 18 -55 -63 16 -4 -70 -54 5 77 -47 -38 51 117 11 -34 48 89 -16 -7 33 58 -54 -44 38 38 -91 -62
1156 -62 -3 11 -59 -64 25 10 -28 23 65 39 -16 16 85 34 -37 -28 54 18 -46 -53 9 -30 -46 -14 15 -13 -21 36 66 -11 -3 63 71
1189 71 -13 14 39 30 -17 -11 38 -23 -59 -57 -10 -26 -85 -20 25 -41 -80 -3 26 13 -14 42 57 14 -29 28 36 -7 -35 24 62 -47
1221 -47 -61 8 51 -37 -10 23 26 -24 -32 66 49 0 -29 59 28 -24 -25 13 13 -52 -36 -12 -18 -70 -5 27 -14 -57 -29 24 10 -9 17
1254 17 60 33 26 16 49 4 -7 5 34 -44 -24 15 1 -36 -26 12 -5 -42 -5 16 16 14 5 23 18 -13 3 60 21 -51 -13 -11 -26
1287 -26 -45 -21 -14 -65 -35 1 7 -8 -31 29 58 -14 23 46 27 2 -4 37 38 6 -3 29 0 -36 -51 13 -5 -17 -3 23 -15 -12 6
1320 6 61 24 13 21 -8 26 -26 -19 29 -23 -19 -50 -10 -35 -34 -19 4 -24 -32 37 33 -6 9 52 36 24 19 21 20 4 -8 1 -17 -24 -11 -5 -31
1357 -31 -18 -28 -21 -5 -8 -8 -7 16 -1 2 -7 21 12 -8 13 -14 -46 -13 4 1 -15 -17 -27 -44 -16 4 3 -24 -4 36 26 5 9 44 11 35
$$ packed form
1126E7n9n8M2L6p3qP9k0o6J6N9P2j24RQ9O6j06m5Q2M1j05RM0K5j12J0Q2%j29K9
1156f2N9J4p0nQ9j5l8N1M2k6n5L2O9n1p1RQ2l6o4pO2l9j6L2K9k8qN7L0p7QO6Q
1189G1q4K7K5rm7OM9o1l6KM7j6n9O5M5o6l9P7K9j3k7N6J5m3m3N7Qm3k8N9L8j09
1221d7j4O9M3q8K7L3Ln0qR8j7m9k9Q8l1n2jL8%o5J6K4on2O5L2m1m3K8N3j4j9K6
1254A7M3k7pj0L3m5j1J2K9p8K0L9j4l7J0L8j7l7L7K1%krJ8nl1J6N7l9p2L8Kj5
1287b6j9K4Pn1L0L6Oj5k3O0K9p2L7K3j9k5oM1Jl2rL2k9l6j5O4j8j2J4K6l8LJ8
1320FN5l7j1Qk9L4n2PM8n2Ml1M0k5JJ5K3k8qO9ml9J5M3j6j2nKjj6j2Rj8pJ3Ok6
1357c1J3j0PJ6l%JK3j7LrK8rk0K1k7l2L3J7lj6kj0j7K8K0jk7K0M0j0k1ML5l3K4
$$ plain form
1393 35 -1 -17 41 -19 -10 -19 0 -42 -49 13 -16 -37 -18 -10 -13 4 -36 10 38 12 -21 20 20 13 -12 2 -39 -42 -44 -16 -10 -29 -27 -19 -2 18
1429 18 10 -9 32 30 58 -37 -27 39 60 18 -8 2 -11 -30 -11 5 -32 -17 -37 -27 2 -53 -28 -2 11 -3 -15 -5 28 29 -26 18
1461 18 1 19 0 -30 0 1 -16 -30 -26 23 -35 -47 -11 43 29 -15 22 57 33 -8 -5 49 13 -14 9 7 -20 -33 -37 10 22 -40 -57
1494 -57 7 18 11 -50 7 20 25 -20 -8 22 43 -1 -14 -23 8 -9 -24 12 -2 -5 -29 14 34 12 -42 -1 37 22 -9 13 37 16
1526 16 13 -21 22 7 -29 -30 30 -12 -51 -49 0 -2 -51 -41 1 18 11 19 40 45 21 -2 10 17 -28 2 7 29 7 13 -2 4 13 -27 6 0 16
1563 16 16 15 15 35 11 8 19 7 12 -12 -17 -10 -15 -7 -3 -2 5 -46 -42 -13 -3 -12 -16 13 1 -26 -13 19 3 12 6 9 15 -4 -7 14 46 -5 -34 19
1603 19 12 -31 -34 6 28 -40 -6 -8 34 28 12 8 45 1 -14 -16 19 -36 -37 -42 -33 -17 -42 0 -31 -32 -19 21 10 20 22 18 9 17 10 19 37 -5
1641 -5 52 17 -20 2 2 -19 -11 -25 8 7 6 -16 4 5 -4 15 22 8 -5 13 5 -16 -13 -2 -21 -11 -5 -26 -22 -13 -29 -38 6 0 -5 -28 -8 18
$$ packed form
1393C5l6j6N8o0RrJ9m2pO2k9k1J9QlJ7m0M6K8k6l3M1%pk5J4m1lkK8Oj9KQJ7K0
1429A8qj9M1kK8r5J0O6K1m2k6J0j3j9J9J6l7J5k0J0K9n5K5K6J3j4j2J0L3Jn5M4
1461A8j7J8j9l0L0Jj7j4MM9n8j2L6N4j4m4L7L5k4m1LN4l6k7K3kk7j3mM7J2o2j7
1494e7O4J1po1N7J3Nm5J2L0K1m4j3rL1j7j5L6j4lk4M3K0k2n4M1L8j5l1K2K4k1
1526A6ll4M3j5l6jO0m2l9KM9km9J0M2J7pQK1Nk4k3J2Pm5L0NK2k2Oj5ORm0L3oJ6
1563A6%j%K0k4lJ1j2Nk4nPnQMJPn1MK9J0rmK9j2k7J3L2j6RoLOj9lK1L2n1k9N3
1603A9pm3lM0K2o8L4kM2oj6mL7m4j5kL5n5jnRJ6k5M2l1jJ3M0j1J0KmrQpRJ8m2
1641eN7l5l7K2%k1Qj4L3jjk2K0JrJ9Pj4j3J8qk1LJ1j9J0Ok1MRj6rM4onk3K0K6
$$ plain form
1679 18 -7 27 54 12 -16 21 12 2 -4 4 -1 -32 -10 2 -21 -18 -36 -10 -14 11 -15 23 15 -9 15 14 42 13 -4 12 -10 -20 -4 -14
1713 -14 -2 -28 -9 2 -31 -32 13 7 -8 0 44 29 -1 21 49 45 -11 2 32 -18 -18 6 13 -2 -7 -28 22 -14 -30 10 12 -11 17 19 -38
1748 -38 1 0 13 20 3 -25 -5 20 -46 -20 -3 11 -27 -39 21 23 -23 -1 30 36 31 -18 36 14 -7 -4 13 22 16 -28 12 -8 -36 1
1782 1 -16 5 -3 -34 18 -13 -4 7 2 12 -9 7 8 14 28 34 -18 25 -2 1 -12 4 -50 5 6 -3 10 18 -3 12 -10 40 30 -23 -1 5
1818 5 13 5 18 13 -23 -23 -18 -2 -18 -34 -21 -4 -51 -25 -39 -4 4 -10 16 -12 -18 7 20 14 11 -17 -9 26 -7 12 26 -16 -16 -29 25 -13
1854 -13 27 -22 10 3 -16 8 15 12 -14 -9 16 -4 -41 -8 5 -50 -25 -29 -25 -35 -30 -24 -36 -40 11 -9 15 -1 5 -7 13 -20 -22 -10 -1 18
1890 18 12 10 6 -7 20 26 8 -30 8 21 4 -4 -5 10 -4 -11 11 -1 -12 -7 4 -9 -20 -31 -11 -2 -16 -20 -24 -1 -2 6 8 26 7 -9 33
1927 33 35 5 37 -16 23 30 -29 -19 12 -2 -14 3 -6 -29 -3 -18 2 -14 28 9 -15 9 15 5 9 -24 3 -38 -29 -11 -8 -13 -27 -20 -19
$$ packed form
1679A8k5L4K7m2k8L7rj0oQnl1K2J2k3Lj8K6mK5k6L8qk4K4jK8k9j7J6k2j0J6j0
1713a4J2k6J9J1l3jM5oj5QM4j5l0K2K8mn6J3L0n0%K4Pj5nk1N0l6j6M0Kk3K8Kn7
1748c8L9jJ3Pj7k8K0K5o6K6J7J4l8j2O0Km6K2L1Onm9N4k2k1LJ7Rom4M0k0k8L7
1782Aj7K1ql1N2l1RJ1nJ0k1J6JOJ4On2M3k7Lj3J6n4N5JrJ3Qk1J5k2N0j0n3K2O
1818EQqJ3nl6%NJ6j6j6J3J7m7K6j4L5Qj4K6k8oK5J3olk8QL5l3J9J4m2%j3N4l8
1854a3M0m9L2pj9K4Plk6NK5k0l7L3J3n5K5mMj0NOj2mN1k0K4j6Oj2K0l3kJ2RJ9
1890A8okmj3K7Oj8l8L8J3j7qjJ5j4pK2j2j1NJ1j3j1j1K0Rj4mmK3jQKJ8j9j6M2
1927C3Kl0L2n3L9Pn9J0L1j4j2J7rk3K6j5K0j6M2j9k4K4Oj0Ml3K7m1RJ8Lnj4PJ
$$ plain form
1962 -19 -1 -12 3 -3 1 -21 12 -12 13 -3 9 24 7 23 -10 -2 14 12 0 16 -13 5 -2 -30 -8 5 -3 9 -11 37 12 19 18 5
1996 5 -3 8 13 4 20 -3 -2 13 -26 -7 10 -9 -7 8 -15 2 3 -2 4 19 32 -20 18 4 13 -6 5 2 -7 -2 4 -21 16 38 -11 2 25
2033 25 -20 -13 35 8 22 -7 -20 -2 26 -5 -10 8 13 -22 -14 -2 -7 -14 -2 -31 17 6 25 17 9 29 20 -7 33 25 13 18 -3 -4 -2 22 -3
2070 -3 -5 10 16 -23 -11 -27 -1 26 -19 36 -6 -13 -3 14 10 5 1 -30 -12 -18 -2 -27 -3 5 -25 16 4 -19 -4 -21 15 -7 19 18 41
2105 41 26 26 7 13 -13 11 30 -4 -1 -3 10 8 -36 -24 18 -29 12 0 -2 -4 -1 -3 19 -15 10 17 22 12 -1 0 -12 2 -6 4 -18 -6 17
2142 17 -22 0 18 -9 -24 5 5 10 -1 -9 18 -7 -42 -6 13 13 -12 -7 -31 -20 -7 -5 -11 -10 21 -12 -24 3 -15 -23 -1 3 -34 4 7 11
2178 11 5 20 27 -10 -13 13 -2 -1 12 18 1 30 22 2 10 -18 -17 -1 0 12 -25 -6 -5 12 -31 -22 14 -10 18 -13 -11 13 -18 -17 1 54 -19
2215 -19 9 4 -12 -3 5 30 23 3 8 1 2 -8 17 -21 -29 4 -2 27 4 14 10 7 5 10 21 19 2 -3 7 4 4 -13 -5 14 -11 -18 -9 15 -16 5
$$ packed form
1962a9J8j1J5oMk2L3k4K5j6J2J5j7J6l3QJ6kj2J6k9J8pk8K2J3qJ2k0M8k5Pjj3
1996EqJ1NrJ6k3JJ5l9J9J7j9KJ5k3J7JnOJ5J3n2L8j4Rj9J1lrNOk5L7K2m9J3K3
2033B5m5PM8k7J4k9j3J8K8l1nJ8Nl5QJ2npJ2k9M8j1J9qqK0rk7M0qj2Nk1jKK4k5
2070ckJ5Ol9J2j6K6K7m5N5m2pJ0J7mnml1J8oJ6k5K4Ql0M1j2k3J5j7L6k2K6jK3
2105D1j5%j9Ok6K4J9l4LkJ3km4J2M2m7M1j2kkLkK2l4K5PNj0j3Jj2J4qJ0k2J2K3
2142A7l9K2J8k7j5K9%Nj1qK7k5l5L6J9%k5Nk4J1J3KoJL1l3j2K7j8qK2Ml7L8LM
2178A1oJ5Pl7lK6j5JJ3Oj7K9qk0Qk8JJ6JJ2l7J9JJ7m3RL6k4K8l1KK4l1JJ8N3p3
2215a9K8nj6RQK5pk0NpJj0K5l8qL3oK9k3J0mlkNJ1kj7nJ0l%j7QJ9k5pRK4l1K1
$$ plain form
2255 5 16 -12 16 28 -4 0 8 35 -3 17 15 6 -4 6 -1 20 22 13 -2 21 3 9 2 17 10 -2 14 -9 -21 -24 -19 -6 -17 -21 -15 -8 7 -20
2293 -20 -13 -12 14 -22 -29 -9 0 -7 -21 31 18 9 35 2 -3 11 1 -10 -6 2 32 1 8 20 -2 11 -36 -26 -7 4 -17 -7 -18 -2 2 -37
2329 -37 -1 22 2 27 14 7 -1 -4 -6 -5 -16 15 -3 -14 -1 -4 7 14 7 -2 -13 0 19 9 20 -9 10 -6 -4 14 8 5 -7 -19 -19 10 7
2366 7 -16 11 -14 45 -11 -5 -5 -26 2 -24 19 -4 15 18 9 8 31 8 -34 6 4 12 12 21 10 13 22 -9 14 16 -10 6 8 8 6 11 -15 1 19
2405 19 -7 -3 17 2 -23 -30 24 13 -40 -17 -20 -14 -12 -10 15 -33 4 -20 1 -25 -10 10 -3 -14 -22 24 -1 19 32 15 9 1 25 1 10
2440 10 -15 11 13 34 -15 13 -12 21 -20 -17 -11 -4 -11 11 -10 -23 7 -9 8 -23 -1 4 -1 8 12 -7 -17 18 7 -6 33 0 2 7 39 13
2476 13 5 1 -14 -10 1 5 10 0 25 16 0 21 -2 -1 6 28 -6 -8 18 -28 0 -32 0 -22 -25 8 -11 19 0 -1 -32 -4 -22 9 11 3 -6
2513 -6 -7 -11 42 8 1 16 1 26 26 21 17 15 -7 -6 20 -2 5 -2 11 -14 12 4 9 -9 -8 -7 -11 -15 -30 -13 -7 -14 0 0 -32 0 16 4 14 9 0
$$ packed form
2255EJ1k8K8J2l2MQK7l8K0krj0J0pK1Krj5K3j8OpJ5pj2J6k3j2lNJ3j1mOPJ5k7
2293b0PJK6l6pK0Rpj4N2j3rK6l3nJ4j0j1MQL0l1PJ2k2J3m7J0J9J1k1J0j1J6Ml9
2329c7L6K3k0K5j3pqlkJj1L1j8j1J3lJ1Pprj1J3J9j0J1k9J9j6KJ8olj2j2%K9l
2366Gk3K7k5N9n6O%k1K8k6M3k3J9LrjK3k3m2M0kQ%Rj1LRl1K3Kk6J6K%kNk6J6J8
2405A9k6MK0j5k5pN4j1n3K3lOKKK5m8L7k4K1k6J5K0j3j1qM6k5K0J3j7oqK4k4R
2440A0k5K6KK1m9K8k5L3m1LOPpK2k1j3L0j6J7l1K2NnRMj9j0L5j1j3L9l3KNL2k6
2476A3qmj5MJ1MNj0K5rj6K1k3JPK2l4kK6m6K8l2L2k2lL3j9L0j9jl1K8j8L1Kqr
2513fjmN3l4pJ5j5K5%nmkk2JK6k2PpJ3k5K6qNj8JJmmj5J7OpJ4%l2L2J6j2J0nr
$$ plain form
2554 0 11 21 26 11 13 -4 -22 -16 10 7 -2 12 -1 -8 0 6 28 34 11 5 21 -12 1 -12 4 5 -3 -13 -10 7 -3 -3 -28 -7 -3 -17 5 -36
2592 -36 19 12 -29 21 8 20 23 -2 8 6 5 20 1 17 15 -12 17 9 3 10 9 34 11 3 0 9 19 -22 -46 -14 -22 -4 7 15 -22 -2 7 25
2630 25 1 3 -26 -10 -22 -8 1 2 -8 34 5 -11 -1 21 46 18 11 22 15 -26 2 17 13 1 24 -12 -41 0 0 -14 -5 -9 -4 14 8 -3
2666 -3 -14 -9 -11 -40 -9 -10 6 -3 -8 -17 16 14 14 -21 -1 -14 11 -11 17 38 24 10 -8 22 5 0 10 14 -20 -2 -12 -12 2 10 33 -25 -16
2703 -16 20 -6 13 -39 2 -11 -13 -15 1 -6 4 -8 -6 -14 -11 19 -10 -14 -1 10 -35 -21 13 23 25 -8 -5 18 11 13 28 16 -2 4 -6 8
2739 8 4 6 3 -4 -17 -26 -15 8 14 -16 -1 3 19 1 -14 21 -7 32 -27 -4 25 2 7 32 -5 17 12 20 26 -12 3 -1 -7 11 0 9 19 -6
2777 -6 1 6 -3 9 20 10 -12 -3 -37 -6 13 -22 0 -13 26 -2 6 2 14 0 -19 -4 22 21 -12 -7 1 -6 -5 21 -22 12 2 2 -13 14 -8
2814 -8 6 21 2 7 39 2 8 10 -6 0 10 26 -11 3 21 2 -7 -6 10 7 -10 -19 14 -6 7 -9 6 -21 5 -11 26 10 14 15 -6 -14
$$ packed form
2554@J1J0Nj5Kj7j8OK6lrJ4j3pQOK2Ok3oJ6l3J3j3J6Jqj0LJ7j0%k5K1Mj4K2m1
2592c6N5pm1N0j3J2Lk5J0kjJ5j9J6kk7K9qoPjK5k3qlRJ0m1k4L2qJ8J1Ql7K0RJ8
2630B5k4Kk9J6j2J4RJj0M2k9j6J0K2K5k8pJ1pm1K8J5mj2K3l6k9M1%j4RmNJ8oj1
2666cj1Nkk9L1jJ6rnrL3k%l5K0j3K5k2K8K1j4j4j8L0j7nJ0Ml4J8j0%J4QK3n8R
2703a6L6k6J9n2M1j3kkJ6pJ0j2KqLL0k9mJ3J1m5J4L4J0Kl3LK3pKJ5j2j8Oj0J4
2739HmKlpj3rJ1K3Ol0J5MJ6j8j5L5k8L9n9K3K9k3NK5l7K2nQOl8J5moJ8j1RJ0k5
2777fPNrJ2J1j0k2Rl4L1J9l5K2j3L9k8QmJ2j4j9J5K6jl3NQpJK6m3L4j0%j5K7k2
2814hJ4J5j9NL2l7OKj6OJ0J6l7J4J8j9rJJ6lj7rL3k0J3j6J5k7K6j6L7j6MJk1q
$$ plain form
2850 -14 21 5 12 26 -7 23 6 15 -12 37 37 12 12 23 2 13 16 10 2 -25 -4 -9 -3 -34 19 -2 -4 -8 8 -28 6 -4 2 -8 18 27 -17
2887 -17 24 -13 4 11 6 15 34 13 -16 26 11 6 2 2 11 6 19 5 4 -14 21 -6 -9 -10 4 -22 -9 2 0 -28 0 -2 -11 33 -23 -30 16 25
2925 25 6 -2 8 8 11 -3 9 8 4 23 3 7 23 8 13 -14 26 20 7 8 1 -4 -17 -9 -10 0 1 1 10 -11 -21 11 1 -5 14 -2 -7 32 -2
2964 -2 5 17 21 19 17 11 39 1 -8 4 15 15 14 31 2 32 9 17 13 39 5 19 -25 20 -15 -20 12 10 0 5 -11 -4 -25 10 16 -14 -17 -8 -10 -3
3004 -3 -28 9 -9 -26 -22 -35 24 -16 3 19 21 11 15 13 -17 22 32 6 13 15 12 5 -5 19 22 32 -2 -2 0 -27 -4 -9 9 -18 -9 2 0 -32
3042 -32 11 -21 16 9 10 -11 6 38 -3 -8 -11 2 1 29 -2 6 11 30 -10 7 25 23 23 -1 1 17 -1 37 -4 31 18 -1 6 13 -13 -11 35
3079 35 -4 1 11 -25 -15 4 -13 -31 5 -8 10 -20 13 -51 13 2 21 21 -9 -18 -3 12 28 -2 -12 21 17 -14 8 2 -3 30 3
3112 3 13 21 1 7 5 1 -16 -1 -22 3 4 2 22 -4 -8 21 3 -12 -3 -7 -15 16 -1 -11 -10 -11 9 -3 -6 16 2 35 14 24 -6 -33 -4
$$ packed form
2850a4L5j6PJ4l3L0j7Rk7M9%k5%J1k1J1Loqk7K1nOl1N3k1kmJ6l6L4j0Oj0K6Rm4
2887a7M1l7J7PnRJ9k1k9M2j5nm%RnJ3j4jj8L5k7ljJ4k6J3J1kk8K8krM4n6pM6R
2925B5j9qJ0%Lj4J2jmJ9k0MJ6j5Nk7M0oj3Jpnj3QjJ0J%Rk1j0L2j0oJ9j6nL9l4
2964bPJ2MkkoK8l8rJ2J1%jJ7k9L0k3QmK6l4J4m4M5l5nL2kj0Nj6Pk1L5Ol0lRkP
3004ck5L7j8j7Mj3N9m0J9J6Kj0Mkl0L9J0k6PKlpj0K4LJ0l4%Kk7K3nJ8k7RJ1kl2
3042c2M3l2L7pJk1J7L2m1nlJ3jK8l1QNJ9m0J7J8k%k4KJ6j8L8m1L5j3j9PPk6KM6
3079C5l9NJ0l6J0J9j7j8L6j3J8l0L3o4O4j1J9%l0rJ5J5J6l0j0L3ml1K2onL3k7
3112CJ0Qk0Okmj7J5k1K5JkK0k6mK9j8j5RmqL1j7j0JjK0j2lK2j4L3k1J0l0k7K9
$$ plain form
3149 -4 13 38 5 11 -5 24 4 2 12 -11 -6 -2 -12 15 0 -6 2 -36 2 -32 -1 -10 -31 -5 6 -14 -5 31 -11 -4 2 2 -30 -11 -3 -16 19
3186 19 4 3 34 17 10 -29 -7 14 23 -3 -14 15 -15 35 10 -27 11 0 17 -11 -8 -23 -17 -3 -19 2 15 -41 -4 -1 -7 -1 -46 18
3220 18 -38 2 10 -8 -4 -12 -1 0 10 18 -21 39 -6 -6 14 0 0 3 -9 -8 4 -15 8 -24 2 1 -3 10 -30 -8 11 -25 11 6 -21 15
3256 15 -14 10 -11 11 -3 -21 26 16 1 14 -7 11 4 5 21 6 -7 30 5 13 -13 -9 -8 -11 -9 -9 10 26 -17 1 -2 2 10 28 -21 -1
3292 -1 -29 -46 10 -4 -13 -27 -12 6 1 -5 -7 5 8 -12 7 -22 8 -10 13 4 22 0 19 12 21 -4 25 -7 -8 25 -4 23 -9 -6 11 -27
3328 -27 -24 -20 -41 -17 5 -27 1 3 -1 -20 2 -31 -8 19 8 -9 -4 0 24 0 -30 -5 -10 10 -6 21 -1 6 4 40 4 32 12 0 12
3363 12 6 11 -3 11 12 -23 -42 -51 26 3 24 10 4 -7 -26 -2 -11 -16 -5 1 13 -13 -4 -21 3 -10 7 -2 40 11 -15 12 -5 -18 1
3398 1 -12 18 -15 1 -2 -40 34 -3 -10 -16 35 8 -18 8 -1 17 -7 -21 -22 -14 -3 -17 0 -22 -1 4 5 -25 -7 -19 -20 20 4 -38 12
$$ packed form
3149dJ7K5l3Oj6K9k0kJ0k3NMj0K7j5oQl8L8l4L1rk1K6J1k0RL6m2PO%l2J9Qj3L5
3186A9j5jL1j7pl9K2K1Rk6j1K9l0N0k5l7L8j1J7k8Lj5OJ4j6K1J3n6L7LoOm5O4
3220A8n6M0Qj8MqJ1JJ0Ql9O0m5%K0j4%Lj2JJ2j9K3l2K6jmJ3m0K2J9l6L6nk7L6
3256A5k9K4k1K2j4j8M7j0j5J3k1J8pJJ6j5j3L7k5Qk6MJlK%J9J6m3J8lMQJ8m9K0
3292ak8j7N6j4rj4J5J8nokJ2Lk0J9k9L0j8K3rJ8k2J9pRk5K9l2jL3k9K7l2LJ7l8
3328b7LMk1K4K2l2K8Kmj9K2l3K3K7j1j7NMK4k4l0K5nK0j6K7k2PkL6l6K8k0j2J2
3363A2oNj4J4Jl5j9rP7k3K1j4oj1j9K4rnJ1OJ2k6Rj7K4j3J7rM2k9k6K7j7j3J9
3398Aj3L0l3J6ll8P4l7poN1k7k6K6rJ8k4j4jQJ1j4J7k2K1NJl0J8j2jM0j6m2N0
$$ plain form
3433 12 19 2 2 17 6 1 7 -16 8 -2 38 16 16 11 3 -20 12 4 -2 -3 1 15 -14 -5 0 7 -24 4 -29 4 -5 2 -43 4 -18 4 0 8 33
3472 33 -5 12 3 26 19 -7 0 -15 -12 42 17 23 -14 15 13 7 1 -2 1 -20 -9 10 -8 17 -22 -18 -4 -19 6 -25 -28 3 -7 -33 12 2
3508 2 1 -14 3 -20 9 31 -21 -2 -3 6 13 2 -16 -2 29 33 -4 22 13 19 2 20 4 6 -13 -6 -9 9 4 -2 12 -26 -17 -16 15 3 10 -1
3546 -1 4 -15 -17 -20 4 -3 -5 -1 23 21 -32 -4 5 -9 -15 8 5 22 1 55 4 -6 -1 10 48 -1 -2 19 -7 6 -23 -15 9 -37 -5 -21 -1
3583 -1 -18 13 -6 -19 7 6 9 -23 6 -17 -8 -5 -2 9 14 -7 15 20 14 23 -14 16 -1 37 37 3 21 30 -12 4 20 4 6 -14 -2 -1 -17
3620 -17 -7 -13 -7 -28 1 -22 -33 4 -26 20 -20 11 -18 -3 -2 -2 3 -15 2 2 -6 -11 -17 4 2 25 18 12 28 22 11 -8 8 20 4 -12 13
3657 13 -6 -23 -9 10 -27 -22 -7 -1 -2 6 -12 3 -37 -15 -5 11 5 -4 23 -2 7 8 -21 8 -21 1 2 -25 -6 13 20 4 14 18 -10 9
3693 9 -4 -3 -14 -6 14 0 9 -5 -6 -5 13 -7 -1 6 -14 -12 5 -17 1 -13 -19 0 -10 7 8 7 -2 -6 4 4 7 17 2 23 -4 0 10 25 4
$$ packed form
3433A2Pj7%J5j1nOk3K4j0M0k2%nqk3L2qojMJ4k9RNPl1K8l3L3rPm5M7k2K2mQK5
3472C3l8J7rK3pk6Pj5LN4k5Ol7K9koolLk1J1J9j8K5l9MJ4j5K5l1lL1j0k6M5j0
3508Bjj5J7k3K9K2n2J9jRPj1j8J4L1Ml7K6rOj7J8j6Kj9PlJ8noJ4l8RJL1j2Pj1
3546aNj9klK4pkMK4kn3K8Rj4oK3lJ7k1N4n1j0NJ1L8m9jK1k6J3k9QK4m6L2j6K0
3583aj7L1j9j3K6jLl2K9k3RLLJ1Nk1K2NoRl7L0j7L8%l4J8Rm2J6J6j6Kk0J2Jj6
3620a7J0oOk1K9k3j1L7l0M6m0L1k9J5J%Nj8J7%qnoK1kK3poJ6oj1j9J6J2j6j6K5
3657A3j9j7J4J9l7NJ5OjQj8J5m0K2J0J6orK7k5RJk9K9k9K2Jk7J9J9Pj6J0Mk8J9
3693Ij3Jj1QK0j4Rj4jJJ8k0OPk0KJ7k2J8j4oJ9j0J7JjrmJ0%LJ0j5K1k7MJ0J5k1
$$ plain form
3732 4 -10 7 31 -13 17 24 21 -6 -25 6 -11 1 9 3 10 -5 -12 23 16 -3 20 16 -27 -7 -7 -16 -12 36 -24 14 15 -3 7 13 10 1 -9 21
3770 21 7 21 11 26 -3 1 24 21 -24 -26 11 21 11 13 20 -14 -12 -14 17 4 -11 6 -13 -31 -3 25 -11 -16 18 -3 2 -25 8 0 8 -18
3806 -18 15 23 0 21 4 -9 11 -20 0 20 -3 9 21 26 9 -8 -2 18 7 27 -6 36 19 -6 -38 -8 -3 -22 5 -10 -32 -19
3838 -19 -12 -9 1 4 -19 -19 19 -19 -9 12 21 0 9 4 2 -12 8 14 23 23 17 19 3 12 -4 7 15 -24 -14 -4 -2 -6 -21 4 -31 -23 1 -11 7
3877 7 18 14 -32 13 -24 -5 -8 -7 14 4 -26 3 14 0 10 1 14 22 4 -13 2 13 -18 8 8 9 22 15 10 0 29 4 11 -7 -4 -11 1
3914 1 -5 -22 -12 -23 -18 -6 -24 -4 10 -10 8 16 16 1 -13 4 13 -10 -2 28 -11 -2 8 12 11 19 -9 5 10 12 34 12 0 -23 -8 2 -6
3951 -6 26 9 -17 -18 4 -7 5 1 -43 -17 16 -15 -2 12 6 14 -2 -36 -21 -16 8 25 -16 -6 -10 6 19 -5 8 4 11 -4 -6 -5 18 -6
3987 -6 -23 13 46 13 -7 11 2 10 12 -25 -1 6 -8 -1 -22 -3 -24 11 -2 8 -7 12 6 12 14 -9 16 21 -26 14 5 11 41 -21 11 3 15
$$ packed form
3732Dj4J7K4m4L0Plk7j9L1j7J2QoPj5pL5pj9K3mm3K0%rMM8o0L8Jj8J0Olrj0L0
3770B1j4J4j0J5k9MK3lm5kL7J0j0KPl4KkL1j3j5J7j9j8K8K8l6nL4k1Nk7L3qQk6
3806a8L3Qk3K1j7j3K0l1K0K0k3J2J2Nj7j7OK0j1K0l3M2j7k5l2L0Nj9K7j5k2J3
3838a9PLJ0Lk3%L8l8J0K1Rk1Rnkj4K0OR%oKj6Rj6J1Ql9J0J0Kmj5K5l5QK4j2J8
3877GJ1mm6M5l7J9lJK1j0l0K9J1j4J0rJ3Qj8j7J5J1l1K6%JJ3pnj0K9k5Pj8LpJ2
3914Aoj7J0j1NJ2j8K0J4k0J8Q%j5j4J7Rk3QL0l9RJ0MjQk8J4NKK2k2j2k3J5J0q
3951fL2j7k6jK2j1J2mm4K6L3l1J3J4oQj6l4J5NK4J7m1J0mJ6J3k4J3mPj5kJK3k4
3987fj7L6L3l3k0J8rQKl7K4Pj4Pk1J9k1L5j3J0j5J9oOKk3K5Nm7M0rOL0o2L2qJ2
$$ plain form
4024 15 9 18 -22 10 -11 0 3 6 5 -25 -12 32 -6 18 -25 -33 54 3 -28 -29 -11 -3 -8 12 9 -26 -14 18 10 18 -4 9 3 20 8 11 19 1
4062 1 14 -15 42 -4 -15 28 10 17 -4 12 49 23 10 5 -5 -19 31 -22 6 23 3 0 -20 21 -32 14 -26 -18 -8 -15 19 -19 12
4095 12 -4 -34 -4 -14 -18 15 27 26 -8 2 42 4 -15 26 -7 -4 17 -4 21 -16 -14 15 8 5 -2 -6 4 32 -20 -19 21 -5 -4 -7 1 -29
4131 -29 -2 -30 4 -11 22 -25 11 -8 -30 30 -23 21 4 5 -7 10 36 -15 -7 0 28 34 15 15 6 18 11 -4 -5 -15 -1 11 -3 -34
4165 -34 -7 25 24 -22 9 -28 2 9 -13 -18 -35 13 29 -10 12 -1 -18 29 -1 -10 10 7 19 30 -1 -17 19 9 26 1 34 -16 6
4198 6 3 20 -1 6 -6 15 -31 -12 -17 12 -11 -23 -20 4 -9 -3 -17 2 -24 2 33 -20 12 6 -4 4 2 5 -7 -21 1 -28 -6 -11 -9 -14 -11
4235 -11 11 3 -13 6 15 -3 -16 -6 -1 -4 2 -19 -4 3 8 8 -17 16 -17 3 -21 12 -4 -27 -8 9 1 -3 -38 -8 14 -15 7 27 -7
4270 -7 18 -16 16 29 30 1 25 -11 -1 -5 1 3 8 22 -14 6 -10 -4 -4 3 -13 4 -9 -10 -3 -12 2 -27 -9 -40 11 -9 -14 -4 -3 -9 -16 -20 1
$$ packed form
4024A5oRm0L2k1J1LLjl0J3M4l8K4m3qQ7n1l1jJ8QnK0ll5J2L2qQk2J3oJ7j2LQj8
4062AJ3k9N7m6j1M3j8Pk1J6L7k6j3nj0j4N0n3K8J7k0lk0M1n3M6m0QJ0pL4l8L1
4095A2j6l0L0j0mL3J2jl4J0M0l8j9M1l3LK1k1K5l7KK9plpmJ0K8n2JM0k6JlQl0
4131b9K7k8L4j5L3m7L6j9k2O0n3M4j7Jj2J7K6n1QPK8Oj9%rJ2pj5jj0J4J2j4l1
4165c4K7L2jm6L1l7L0Pk2nj7M8J6l9K2j3j7M7l0rK0lJ2J1l1j6L6j0J7k5L3n0K2
4198FlJ7k1Pj2K1m6J9nK9k3j2LK4j3Oj4J9k6K6L1n3L2oj0QkLj2j4K2k9K2nKnL
4235a1K2qj6J9Rj8j3J0NlOk1J5PN%k5L3l3K0k4L3j6k3J9J7qml5L0K2k9K2K0l4
4270gK5l4L2J3Jk9K4l6J0mOKNJ4l6K0j6O%Pj6J7j3jPrJ4k9J8l1N1k0nJ0JopmK1
$$ plain form
4309 1 18 36 16 7 -35 10 19 -7 14 18 9 -14 0 19 2 23 -21 18 15 -19 -15 1 0 4 -14 13 -17 -15 -1 -7 4 1 -9 14 -31 20
4345 20 6 -8 1 16 6 5 22 13 18 -6 13 8 -9 19 9 -13 21 17 16 12 14 3 6 2 -9 -5 28 7 -6 14 5 -15 4 9 -26 5 -40
4382 -40 -5 -1 -32 -8 -10 2 -7 28 26 -26 -3 -21 11 33 26 25 -13 15 15 2 2 6 -5 7 -5 13 21 1 -14 7 16 -14 18 -5 -27 7
4418 7 11 -18 -4 9 14 7 -4 -3 12 -2 2 1 7 12 15 -14 -16 -1 11 11 7 22 26 21 44 37 16 21 22 16 12 -2 6 19 2 -14 -18 6 -12 -2 3 19
4460 19 0 30 0 3 -8 0 3 -7 9 -15 34 27 0 -3 -15 20 4 8 5 18 12 28 -12 2 17 10 44 53 11 4 27 4 -21 -6 39 -1
4496 -1 25 -4 41 30 -15 -19 11 -13 -12 9 4 -6 13 8 -5 6 -18 9 -1 14 9 -1 22 -17 11 43 11 4 12 -1 -4 19 45 14 3
4531 3 18 18 6 11 -18 15 3 16 9 29 10 -8 -9 -3 17 -34 19 0 -12 13 22 -35 20 3 -1 0 -8 33 10 -2 -10 46 0 25 -11 -4
4567 -4 19 -12 5 47 29 -15 11 -6 -9 3 25 2 13 -1 23 -2 5 -23 0 -20 0 -20 -7 -8 -7 -21 -36 -4 17 27 5 14 25
$$ packed form
4309AJ7J8k0rm2M5Rk6K1Mrk3J4J9j7K1m4L9ll4MJ6jMj8K7l0KJ4oJ1lj0K3m5N1
4345B0j4j4RJ5j0jJ7rNk4J9nj7K8j0k2L4mjmKj1Lmj1ML3k1j3K0rk0J9Nl5L1m5
4382d0L5Ml1K4kJ2rL5kn2K3j8L2K2pjl8K8%j3%Mj1J2j2J8Qk0j5K1Rl0L2k3k2L4
4418GMk9J4J3Npj1JJ5j4MjONLk9kJ5J2%mJ5MnK3pk1NJomj4QJ3j7j6mK4j8J0NJ6
4460A9j9L0l0Lj1QLj0J6k4M9pk7lj2L5j6MlJ3oJ6m0J4J5pL4Rm2pK3k3k5J5M5m0
4496aK6k9M5j1m5mL0k4JK1nj0J9nj3J1k4K7j0J5nj0K3l9K8L2l2pQj3lK3K6l1j1
4531CJ5%j2Nk9L3j2J3pK0j9j8jOK0n1N3j9j2K5Rn7N5j7mJqM1k3j2qN6m6K5l6P
4567dK3l1J7M2j8m4K6j7lJ2K2k3J1j4K4k5Pk8K3k0K0k0J3jJj4j5L2K1J0k2RJ1
$$ plain form
4600 25 12 0 -20 21 -4 -1 22 -15 -4 24 -17 -17 44 19 33 -12 -23 -9 17 -11 0 5 -25 6 34 6 -3 17 4 -13 17 -17
4632 -17 -15 3 -7 4 -3 7 18 14 10 35 -3 11 10 -21 18 12 5 40 34 13 11 -14 -3 -7 -2 22 1 10 -9 -9 28 23 8 4 8 4 14 6 12 -3
4672 -3 -5 -19 -8 -16 8 0 -25 -14 -3 31 29 19 5 -31 14 -7 11 11 24 18 29 12 -25 25 -1 18 0 24 32 5 19 17 25 8 -12
4707 -12 -2 -24 9 7 -15 10 9 -5 -8 10 -10 -5 -18 6 -6 7 2 17 -1 16 -12 -11 -11 1 12 -13 19 28 -11 22 -2 19 36 2
4741 2 -3 -11 22 10 0 8 -31 5 -33 -25 9 -3 -17 -3 9 -28 -7 -12 -15 -7 14 -9 -16 4 -17 2 34 13 22 11 15 -2 13 27 9 13
4777 13 7 15 48 6 -12 27 -5 9 5 -2 2 -13 -11 20 35 8 -9 -19 -14 -5 -22 -8 -4 -16 -14 8 -9 7 -11 5 2 21 12 1 35 8
4813 8 25 26 -4 18 13 -15 -9 -17 24 24 18 -9 5 -20 -9 26 12 2 6 6 -14 2 16 -16 13 -31 -15 1 -2 13 12 14 16 17 4 1 -2 -25
4851 -25 6 23 3 -26 17 -5 -3 -4 17 10 6 18 -1 -1 7 6 25 12 -24 2 20 -27 -11 -6 -14 -14 -10 -2 7 14 -8 12 -1 -36 -11 -16 12 0
$$ packed form
4600B5j3j2k0M1k5LK3l7J1K8m1%O1k5J4m5j1J4K6k8J1Nl0L1K8k8rK0j3j7L0l4
4632a7KJ8j0J1pJ0J1mmK5l8J4jl1L9opL5ok1kk5J1mNK4k1Rj9%L7nj5mMmJ0qOj5
4672ckj4J1qK4qk5J1J1L4kj0j4l6M5k1J8%J3oJ1j7l7N0k6J9j8K4Qk7J4kQj7k0
4707a2J0k2L3kk2K5jj4lJ8k0Nj3K4j2J3nJ5j8J7k8J%J2J1k5L2Rl9L3k4K1J7l4
4741BnqL3j2j0Ql9L6l8QL4j2j4J4J2l7K1nlQK1k3pK0k1J9L2k1Rj1Mj7J5J4j8M
4777A3oQL3m2j8L9l2J4mpMj5KL1J5k7j7j0NRj7J4Mj2KK2j7J6j8J6lJ9rj1L4k7
4813HJ7Jl0K2nk8OqM1%ok7J4k5J1L5j4j0M%k0J6J4l2K9m4J6J6lJ5jKKJj3llk3
4851b5L1J7k0k9M3k2KjK1pmJ2j9%QjJ9j3l6K6J8m7J6Nq%MQRPk2K0j3l5K5nK8j2
$$ plain form
4889 0 4 8 1 18 10 10 -1 -21 -2 -1 8 2 6 29 -25 26 -17 -6 36 -1 1 3 20 -8 16 -5 -32 -13 -6 -19 23 8 -1 3 -12 -20 2 5 -12
4928 -12 17 36 0 2 4 -15 18 20 23 -14 25 2 -6 9 9 25 1 4 -6 12 -19 12 24 0 9 -1 18 24 8 21 9 23 13 -4 -22
4963 -22 23 14 -24 -8 7 -8 -9 -21 7 -20 -4 28 31 2 33 23 12 31 -13 29 -11 -1 12 23 -17 4 5 4 -7 15 22 -20 14
4996 14 10 30 4 8 44 4 0 28 -9 -5 -16 -2 3 2 -6 -8 8 4 -15 -1 -30 -13 -27 -7 9 6 23 -14 9 15 11 14 -9 0 25 20 28 19 14
5035 14 1 26 -3 16 -13 20 13 -9 7 0 17 -4 2 0 -3 3 -11 -5 4 -10 -5 -16 -10 -9 -30 12 -1 22 -5 28 17 14 29 22 36 7 13
5072 13 -6 4 11 -26 28 0 35 21 -12 7 24 33 -5 5 -12 4 -8 -14 16 -19 -7 4 -5 4 -23 -22 -1 10 -20 -20 -16 29 25 -14 2
5107 2 3 16 18 5 58 -5 -2 6 -2 4 -10 -31 28 18 15 25 -3 -16 -20 9 -32 -6 -2 3 25 9 -12 7 -1 15 52 43 11 -5 -4 -8 24 -16
5145 -16 21 -4 11 -2 -6 -1 18 -2 4 13 19 8 25 25 9 -3 19 2 -9 9 -7 -11 2 12 -2 -5 9 22 4 -20 3 5 1 -3 -29 -5
$$ packed form
4889@MMpJ7q%j1k0J9JRoMK3n4N1m3J1M2l7KKJ7k8K4k1k7J9Pj3M2j5rMj5qK2Lj7
4928a2K9J9l6KKj9L3KLl7L9k3qJ5%J6k4Lj0J8l1L1J2k4Rj0J9Oj6J3j2J4j0j7j8
4963b2M5rl8J6J5j5jj2K8k7J6L2Lk9L1j0j1J9m4M2m0J0J3J1m0K1Jjj1K2Pm2L4
4996A4mK0k6ML6m0mK8l7Mj1J4NjqkJ6mj9J4k9J7j4K0J6lJ7l7K3OmLk3RK5nQrn
5035A4j3K5k9J9k9L3pk2J6pJ7k1OklOj4ORj4Nj1OJk1M2j3K3k7L3j1lJ5pJ4k9O
5072A3j9J0Pl7N4k8L5j4l3J9J7Rl8J0j7J6j2oL0l5J2J1rRk7JK1J1l0%MM5ml9J6
5107BJJ3Kj3N3o3LQqOj4k1N9j0lJ0k8j3mK9m1K6MNK2j6k1J9qJ6L7rl2j6JmL2m0
5145a6L7k5J5j3mNJ9k0OROj1J7%j6j2K2j7j1J8j6mJ3J0j4lJ4J3j8k4K3Kmmk6K4
$$ plain form
5181 -5 10 2 -4 7 20 -5 15 14 -13 -32 -1 22 36 17 21 6 20 39 4 13 27 9 -20 11 -5 -19 -3 4 0 -23 15 23 30 -7 -21
5216 -21 -24 4 -35 -4 -1 -10 20 2 12 -13 6 7 6 3 -4 -3 40 8 18 -1 1 -4 19 19 -12 4 9 7 -1 23 -7 36 20 3 -11 4 1 -5
5254 -5 7 0 23 -30 -25 -2 -21 -3 -13 -4 -18 3 39 2 -4 -2 34 21 7 -8 25 17 12 7 22 17 -8 2 25 -24 21 12 19 -11 20 4
5290 4 8 16 -12 6 31 0 -7 10 -37 -7 14 6 -18 -17 -26 -19 10 4 21 5 18 -12 8 -6 -6 10 8 25 7 -21 24 22 2 -11 15 1
5326 1 -1 -14 -2 27 -15 -20 7 7 16 -10 -14 2 -3 -15 10 1 -16 -11 -23 -21 -3 -6 -11 10 8 -9 13 15 1 33 1 7 -6 -4 1 -6 15 27 -2
5365 -2 -3 29 27 7 7 14 27 -12 -5 22 -20 13 5 7 6 -11 -8 -3 10 -32 28 2 -3 5 13 -26 -28 -18 7 1 -17 14 21 7 4 10 9 2 -21 32 21
5406 21 19 5 16 -4 0 9 12 39 29 23 -13 6 -16 4 17 8 13 -2 -6 -7 10 2 15 -11 -4 11 -20 23 -8 23 16 18 39 17 4 7 -4
5443 -4 5 16 15 -14 26 -11 -9 9 -6 3 -24 33 8 26 -9 -6 -7 7 -3 -7 11 -4 -18 -24 3 -16 4 -3 27 -22 -6 0 -13 -10 2 16
$$ packed form
5181eJ5qoJ1J3k5K0jk7j9L1K3J4j9Mj5J4J9l5RJ4j8k9L1j6j4J6Pmk3L8QPl7j4
5216b1lK8l9L1LrL0j8J0k5J9JjlpJM3l2J0j9KnK3%l1J6NkqK4l0M3j6j7j4J5lo
5254eJ2pK3n3NK3j9J8j0Rj4K1L6l7oKL6j3j4j5L3qnnJ5nk5J0K3m9M5rPl0L1j6
5290DMQk8J8K5l1pJ7m7L0K1qk4JrPK9oJ7j6J3l0K0j4%J6kJ7j8k8M5kk0j3K6j4
5326Akj3J2K9m2nK7%Rk6mJ6nj2K5rj7Nj2KJ8lnK1kj7K2Kj4L2l2Oj3KNpK1J2k9
5365bjL2kk0%PJ3l9PK7m2L3qKjj7LNJ3m2O0k6nQQl9kJ0K5oj8L1Pj4lOjpk3N3j1
5406B1kj4J1k0MRLK7j0ol6J9k2K0J3rNj5mjJ7qJ3k6PJ5l1M3l1L1pKK1k2j3Lj1
5443dRJ1jk9M0l7KJ8j5Rk7N7k5J8l5LjJ4j0mJ8j5j4oK7j9K0pL0m9J6Oj3LJ2J4
$$ plain form
5479 16 28 -5 -25 29 13 -4 30 5 18 -19 39 33 28 33 -10 -2 -10 -5 19 17 -19 -20 19 -15 -19 -17 6 -8 -3 6 5 19 -1 -1 9 -10 -5 6
5517 6 -24 11 6 13 1 6 20 27 2 -8 1 -3 18 23 8 17 27 31 -18 35 42 20 17 -6 7 -4 -14 6 26 -10 -8 -21 15 3 -8 -22 -7
5554 -7 -3 7 -32 11 -2 0 18 -20 7 13 -13 -19 1 3 -6 11 0 21 -8 7 27 32 24 0 -4 6 -5 -29 5 21 -2 1 -6 17 8 2 -16
5591 -16 -10 -17 11 -9 12 -9 -22 -11 10 -5 -40 -17 10 -5 9 -2 5 12 21 29 25 8 -7 -14 3 11 10 16 15 -6 4 21 2 6 4 4 9 -1
5629 -1 -8 -16 -18 -7 -6 -7 -3 16 6 -6 -19 -5 5 -9 -3 11 -3 -30 1 15 21 19 0 11 -4 27 23 4 9 11 -6 -5 9 -7 -12 -15 12 -1
5667 -1 -1 3 2 16 -13 -30 -17 -3 -25 18 1 -1 -14 -22 11 4 -23 3 2 -22 -4 -1 -8 14 -10 10 4 -17 24 4 9 10 19 34 31 -12 35 -12
5705 -12 -12 16 -2 14 22 -4 -19 -14 -14 31 26 -12 8 -23 -14 -3 7 -5 -19 -16 7 3 7 -25 28 -2 -7 8 -7 16 29 22 -4 14 -2 19
5741 19 11 8 18 -6 10 12 8 -7 -22 2 2 23 -12 -18 22 -7 -24 6 -8 -45 5 3 13 15 -17 -34 -20 37 -6 3 35 11 13 -10 -22
$$ packed form
5479A6J2l3k0N4j6j7L4k5J3l7N8onNm3QqNK4kl6jL9l4mKK3j4NRjJ4k0%J0j9NJ1
5517Fl0L5nPj2NJ4Pk5j0RmK1Nj5RJ0Mm9N3Pk2lk3J3j1j0K0K0l6Kj3L6j2j1j4J5
5554gMJ0l9M3j3KJ8l8K7Ok6oK0KrJ7j1K1k9J5K0Nqk4mJ0j1k4L4J6k3LpK3roj8
5591a6OpK8k0K1k1j3J1K1j5l5K3K7j5J4j1PPRQmj7j5pJ7QjOjk1J0J7j9Mk%Nj0
5629apqkJ1JjMJ9j0j2j3J4J0j4OJ4j4k7L1J4Okj9J1j5L1mj9NKj7JJ4j6nlK7j3
5667a%MjJ4k9j7J3J4k2M3j7kj3qL3pk7K6jk4J8LpK2k4K0ok1M1k0NJRJ5lm3M7m7
5705a2%K8j8J6Qk6j5N%M5nl8K0l1RJ1J0j2j4LK3mMl2N3l0nJ5j5K3J3pk6J8j6K1
5741A9qlJ0k4J6Kmj5j5K4%K1l5oM0k9j7L0j4l7N0kJ0Kl2j7J4N7m3RL2k4Kk3j2
$$ plain form
5776 -22 12 20 3 17 -19 20 28 12 27 6 1 -26 14 3 25 4 2 -18 -19 15 -35 -16 9 -8 12 26 8 12 -18 -10 23 10 8 -9
5810 -9 -39 10 -16 -21 0 -5 -15 23 -22 19 -28 11 11 40 4 15 1 17 -8 -23 11 6 1 -23 1 -2 7 -1 39 -7 -16 -19 12 -17 -18 -7
5846 -7 -27 -9 7 7 -14 42 20 -7 4 9 -5 7 -3 25 -2 -11 -6 23 19 10 9 22 21 37 18 -5 10 4 -32 22 1 -2 -19 -14 -9 -3 -21
5883 -21 10 -18 -17 3 -25 -1 -14 0 15 7 -9 15 10 -31 -10 16 -7 -4 -6 17 13 24 4 8 46 9 6 10 3 0 -9 -1 -8 17 6 2 10 12 5
5922 5 -7 6 3 -8 -5 7 -22 -3 20 -9 21 -12 -13 10 1 9 27 4 17 7 -10 38 24 27 21 28 24 -4 21 -7 25 16 18 -5 -20 16
5958 16 -13 14 -24 6 3 -2 -19 5 -26 -11 -20 8 -18 -42 12 9 -12 -28 14 -4 20 14 12 17 -1 -21 28 15 4 7 38 -16 26 -1
5992 -1 2 30 -14 32 6 17 2 -3 12 -7 31 6 3 -8 -5 11 14 -13 13 -6 -23 -30 -5 20 7 7 -19 4 -8 0 5 13 4 26 -6 1 1
6029 1 5 30 -11 25 10 -9 29 25 17 9 1 -7 -12 3 11 3 -13 -21 12 5 -1 14 10 7 9 -7 -22 -11 15 13 2 -8 -24 4 23 -8 28 14 24
$$ packed form
5776b2L4Qj7J4l6L9Qj6J5k1nk7M0j1K2k1kk0jL4n0J9K5j7K0J4j8Ml0QL3j3kj7
5810il0M9k6nK1nj0L8m5M1m7L9%K9l6J1j4J6k5j5L4nnk4K4lRqM0m6rlL1k9jJ1
5846gk0J8J6%k1N6k2k7J1Nj4J2j0K8k7rNK9mrjJ3jJ6j9k3J5ol6N4k1lj7NNOj8
5883b1L1k8JK0k8K4j3J4J5qj6K4nm1K1K6k3LkK3mJ1k0ML8l7lMplrQpK5j1mQKp
5922Ej2J3lj1LJ2k9J9K3k9L0l3jK3rQJ8k3J3j0j7M8j4LoPmk8K5k8L2rKk3j5L6
5958A6k9K7l8L0lnj7K4l1J5rK8k6k4N4lk1j6M2j8K4okNj8k0M9j3j1LL1n4M2k7
5992aLK8m4M6k6J1j5nJ5j9L8k5lj1LJ6Lk7K6j9j7pK5K5j3%k6K3j2QNQrK2l2P%
6029AMK5m1L6j5j9L8mqqqqnJ5Qqj6qL3poJ5mlKj6j5J1K6kj1j0j6K8J9l1L6j4J0
$$ plain form
6068 24 26 37 -5 38 18 4 -10 -9 -2 19 18 3 -13 21 23 8 11 -1 10 9 6 9 2 -2 12 20 27 -9 -34 -6 3 -8 0 -9 -6 -10 -16 30 20 6
6108 6 1 0 8 7 16 -22 21 12 10 -5 5 39 1 16 -1 0 19 7 25 -3 3 -1 9 -3 -3 -9 -1 19 5 -26 -5 0 -4 26 14 12 -8 10 11
6147 11 -11 25 -7 15 21 13 15 4 15 -19 -13 6 22 -13 -2 -3 13 -2 4 17 -6 12 -10 -16 -25 3 -2 -12 -9 -17 -15 1 -5 21 14 4 2 -13
6185 -13 17 -15 -24 1 -11 -12 -9 -5 35 7 -25 -18 17 19 27 0 30 -14 15 2 31 16 -2 8 1 -13 13 -2 -18 -2 -13 22 -2 -14
6219 -14 -24 -17 -2 -7 -25 -11 -10 15 -12 -11 25 11 -27 19 -19 -1 14 8 2 -17 -6 18 10 -8 -4 3 14 23 4 13 -15 12 10 -1 -8 2 -10
6256 -10 17 5 -9 -23 16 -4 5 3 -10 -1 0 6 21 -17 5 10 -1 11 24 13 1 8 18 25 -5 1 32 15 22 -6 18 -28 5 0 3 3 14
6293 14 7 1 10 -6 13 19 -19 -22 -8 13 -2 -13 -16 -23 2 1 28 10 -13 -14 10 -18 15 6 11 20 32 10 11 17 5 -9 -12 7 4 25 22 1 5
6332 5 18 22 -3 17 9 -1 2 -22 8 3 -17 -2 -14 22 -9 -18 -27 -5 -6 0 -6 -19 -10 -16 19 -6 -8 26 33 7 -8 1 32 10 11 -21 -1 4 4
$$ packed form
6068B4KJ1m2M3k0j4j4JPK1jj5j6L4Kj5Lj2J1jlLpmJ4QPl6k5K8Rj1QrLmoM6j0j4
6108FnjQjRl8M3rkj5J0L4l8J5j7JJ9j2J8k8OmJ0j2%oQK0j4l1K1NmL0j2kk0J8J
6147A1k2L6l2K2OqKj1J1l4OJ9J6l5J1jJ6j5OJ3k3J8k2orK8nj0LqKJ6oK6pj0kj5
6185a3L0l2rK5j2jLMM0k8l2PL5KQk7L0m4K9j3K9j5j8J0pj4K6j5j6J6j1L5k4j2
6219a4j0PJ5nj8J4JK5k7JL6j4l8M6l8J8J5ooj9J1K4qj8MPJ1Rj9Rk8K7kj1pJ0j2
6256a0K7j2j4j4L9k0Rkj3RJOJ5l8K2Nj1J2J3j1j2PJ0Pl0OL1j7Pk8K4m6L3nL%J1
6293A4poRj6J9Ol8lJ4K1j5j1lpK5jK7j8k3jK4k8L3rNRJ2k2JOj2j4lJ9lK1lk1M
6332EJ3Mk5K0qj0Lk4L0nk0J5j2L6l1rrK2jOoj3RoL5k5kL4Pk6j5RL1k2Jl2K0N%
$$ plain form
6371 4 -1 -1 -11 52 2 -10 8 0 -10 0 7 -14 -12 11 9 -5 -16 9 -15 22 -2 -11 -4 -18 22 -9 7 11 -5 9 33 14 2 19 -1
6406 -1 48 14 3 1 9 0 18 -7 5 3 29 25 19 13 4 0 -1 23 -7 -29 -21 -2 -3 -4 -30 -12 1 -19 7 -30 14 -4 31 0 17 -12 -16 15
6444 15 -22 5 6 31 17 -2 32 32 25 31 -4 16 2 -1 -5 -3 15 2 -19 13 16 24 6 13 1 -2 -14 28 0 -34 5 -29 19 1 -5 2 12
6481 12 -1 6 -9 21 16 13 36 9 49 8 22 17 -4 11 12 -7 9 -11 -14 0 25 8 0 3 4 17 -5 -5 3 -9 6 20 -12 3 6 15 7
6518 7 -5 17 0 -1 2 12 1 -9 -6 23 -24 -4 13 10 12 -27 40 -3 3 28 2 -17 19 -8 -15 -1 -12 23 -5 -6 -19 14 -40 -27 -18
6553 -18 -6 -9 -24 -31 -21 -15 1 -8 3 18 -6 -6 8 -21 1 31 8 34 21 20 3 20 4 17 10 16 8 -3 -8 -4 16 7 35 -9 10 -14
6589 -14 -7 -32 7 3 4 -5 -9 9 -1 -28 -26 22 -19 1 21 -2 6 -5 9 1 -7 7 2 32 12 11 6 8 -18 22 5 2 28 18 -1 -11 -15 0
6627 0 10 14 11 16 -20 4 -3 -5 -6 5 13 -10 2 -5 7 -19 38 -2 0 7 12 5 5 -2 11 32 -18 11 -3 -10 14 9 24 -15 -17 11 4 -3 12 -13
$$ packed form
6371Dn%j0O3n0j2J8qj0J0Pk1KK3kj4j1K5k4L7k4rPj4M0l1J6Mj6J4K4j9j2J7k0
6406aM9l4j1kQrJ8k5J2kK6moormjK4l0k2QJ9jjk6J8J3k0K6l7M4j8L5l1J7k9mL1
6444A5l7K7JK5j4j9L4%pOl5K0j4lmKJ8j3k1L2LQj8Pj2lj2M2k8l4L9l4M8j8oPJ0
6481A2j3Pj5L0nlK3k7M0m1J4nk1J5Jj9J6k0lJ4K5j7qLJJ3k2%Qj2J5J4l2J5LRq
6518Gj2K2j7jLJ0j1j0LK9m7K0J7lKl9O7m3OK5k6j9L6k7pJ4j1L5k8jj3L3n4J3R
6553a8J2lj5pJ0OJ6rJ1J5k4%J4k9K2L0k3K6j3jj7J7j6J3pOqj1nMK0rK8m4J9k4
6589a4Pk5L9mJrmJ8j0k7KM8m1K0K0k3Qj1J4qqJ4nL0k0jnKk6M0j7lK6j0j9j0mJ5
6627@J0MlNl6K4pkjJ1Qk3J2pJ2k6N7m0KPNp%pJ3K1n0K9j4pK4nJ5l9kK8ppJ5k5
$$ plain form
6667 -13 20 0 26 16 6 5 -5 -3 6 16 -5 -34 -17 13 -16 -16 -5 32 5 7 -7 16 26 -4 9 -17 19 6 7 13 -1 1 25 25 0
6702 0 -2 -16 29 -8 2 -14 16 25 5 2 13 9 17 3 7 -15 -11 -12 4 3 14 28 -2 -15 -2 4 15 -10 -7 6 3 -3 -10 2 37 -7 16 25
6740 25 4 16 10 21 1 0 24 8 21 -17 28 2 1 12 6 -8 6 10 24 -6 -10 -5 -21 8 16 3 -26 16 -23 -1 10 -9 -9 -2 2 24
6776 24 25 17 9 18 1 11 20 -5 -12 6 14 -7 30 -14 4 14 14 10 -10 -26 5 -4 19 -3 -4 19 -4 -14 3 24 -2 3 6 9 -30 2 8 -11
6814 -11 5 8 3 -17 0 15 -6 18 5 1 23 31 23 8 22 37 8 19 14 14 11 27 -9 23 -2 6 17 16 32 17 -9 -6 -29 -23 -1 -14
6850 -14 -20 11 8 -1 0 0 -4 -28 -8 -1 32 -1 -6 22 2 17 55 -1 15 21 12 14 10 -26 23 11 16 16 17 -28 2 6 8 3 -8 22 12 10 -30 3
6890 3 -4 14 -14 -6 8 -8 -14 31 17 17 34 -8 -8 6 8 61 7 -8 9 -2 8 25 29 24 15 11 21 3 -8 8 26 0 4 9 20 -12 -9
6927 -9 -8 0 -9 4 11 -19 -11 -6 11 17 -9 19 -5 -17 11 12 10 -8 27 2 24 -6 23 -19 10 6 32 -9 14 14 30 37 7 7 14 12 18 7 -18
$$ packed form
6667a3L3k0K6j0j0jj0KRJ0k1k9J7L0k9%J1L7k7Kj4K3J0l0J3k6L6j3JOj4KK4%k5
6702@kj4M5l7J0j6L0Rk0lJ1mQj4Mk2MjJ6jJ1J4l0j3J3OJ1k5LJ3lopJ2L5m4K3R
6740B5k1J2oJ1k0jK4j6J3l8M5k6jJ1oj4J4MJ4l0mNj6K9Qj3k9M2l9K2J1j9%PMK2
6776B4JqqRj7J0Rk5pJ8Qk1L7m4J8J0%mk0j6L1rK3k2jK3k3j0J7K1k6NLLl9L2Oj9
6814a1J6Lnk0J7J5k1K4j3mK2Qqj5J4J5k9J1n%lJ6l6L2k5QJ1jJ6j5k6Lk3OK2j3
6850a4oL1lrJ%mk4K0PL3l3nK8k0J5L8n6J6OrKml6M9j2N%Jm5L0MKnj1L0j0km0L3
6890CpJ8k8QJ4j6oM5j4%J7m2%J4KN3n4j5J7j1J0J7MnrmJ0j8j1J6J8k6MNJ1l2L
6927iJQrJ3Pl0QNJ7Ok6K8k4j2K8Jkj8L5k5K2l0K9m2K9mK6m1K3%J6Pl0%PkOj1k5
$$ plain form
6966 -18 -14 -3 5 16 -17 -2 -3 -15 8 -4 15 -4 -3 -27 -13 4 -9 -15 4 19 -2 10 48 5 11 28 11 40 -4 2 13 25 -3 -3
7000 -3 -9 27 -11 0 14 -19 -17 6 -20 -20 -4 4 -4 -11 -14 12 -18 -1 22 -1 -13 -26 -11 4 23 14 34 24 -5 28 9 20 3 7 -2 9
7036 9 4 13 -11 20 13 5 15 15 -2 -35 15 16 -22 4 8 -5 -6 -21 -3 -13 -2 11 14 0 -14 -22 7 9 11 26 37 19 -19 13 10 -20 20
7073 20 17 3 11 6 14 10 41 18 -5 12 -3 42 4 16 3 -1 -21 6 -19 -22 5 -23 8 -1 -28 -15 4 1 2 11 4 -15 1 29 -15 17
7109 17 -11 -17 9 15 23 29 -1 9 20 23 -3 -13 29 -4 8 4 -1 -4 4 13 2 7 26 28 9 -6 22 -14 5 -4 0 -5 13 25 12 24 8 3
7147 3 11 -14 22 4 0 2 8 -6 24 -4 16 2 24 13 32 2 0 9 45 7 16 7 23 16 2 18 8 5 5 18 22 -19 19 4 -11 22 13
7184 13 -8 -27 -8 2 13 -2 -15 5 11 8 24 -3 -7 -2 1 10 12 13 -14 12 28 2 26 21 39 20 28 -4 5 20 -16 5 -5 15 -42 -4
7220 -4 -14 5 19 -26 -13 7 -16 10 -1 20 12 2 -9 17 29 -20 -16 20 17 21 23 5 24 12 11 22 -15 20 26 18 -9 13 9 10 -10 -24
$$ packed form
6966a8MJ1QJ1l3J5jj2K3j2J9j9Jk4J4J7j3oJ9J5k1J2L8m3OJ7j7K9m4OJ1J2k8%
7000coL6l8J1J4l3KK3k6%J6QqplK6l0J7K3k3j2j3J5J5J9rK0j0k9L3j9J1j7MrJ1
7036InRk4L1pqJ0%j7l3N0Jl8K6Mj3jj5J8j0J1J3Lj4j4qK9KKJ5J1j8l8L2ll0M0
7073B0lj4QnQmL1k3k3J7j5M5l8J2j3mk0K7k5lK7k8L1rk7J3J9lJRpj9J6K8m4L2
7109A7k8oK6OQOl0J0J1Lk6j0M2l3J2mnlQRj1NJ9Kj9j5K8l6J9rMnJ8J2j3J2j6n
7147CQk5L6j8mKOj4L0k8K0j4K2j1J9l0kRL6l8RrJ6pj4J6j0l%J3Mm1L8j5j5L3r
7184A3k1j9J9J0J1j5j3K0OlJ6k7mNLRKJk7K6J6k6K4nJ8j9Ql2RJ5l6K1j0K0n7L8
7220dj0J9J4m5J3K0k3K6j1K1qj0j1K6J2m9ML6lMKj8J9j2jJ1l7L5Oqk7K2mJk0j4
$$ plain form
7256 -24 -2 12 -9 -6 19 -22 4 5 -14 -20 -13 2 -5 -18 -3 15 -12 11 -4 14 51 -2 -22 -7 20 17 23 17 0 12 9 1 21 41 11
7291 11 11 27 8 -30 13 9 10 -19 2 -10 10 11 -23 11 21 15 3 -1 -1 -28 -7 3 10 21 9 43 29 2 -26 14 14 19 6 0 5 10 14
7328 14 26 24 26 54 14 10 -12 25 9 20 -6 42 8 13 0 -7 -16 4 4 -8 9 10 1 -2 -26 -10 -6 8 -15 -28 -16 4 1 12 10 18 21 5
7366 5 25 3 -12 5 9 26 11 11 45 12 10 11 -3 32 13 9 30 -10 3 -28 14 2 -19 -25 8 -5 17 -3 -1 -6 -3 -17 -26 0 25 26
7402 26 2 -16 1 24 1 -2 -1 7 4 13 -1 3 17 10 10 31 12 32 1 20 -6 17 17 10 -13 -21 3 13 5 -13 -11 5 -2 -11 -24 -2 10 -9
7440 -9 27 -1 -10 -1 11 -13 -3 4 -17 16 26 36 18 -5 -3 5 -13 4 14 -7 -6 -6 -3 3 6 33 2 10 4 2 2 22 -1 25 13 -2 5 22
7478 22 -18 2 0 22 7 -9 38 1 -29 10 -18 30 16 26 -1 -4 23 2 -6 26 18 20 2 9 30 22 22 18 -7 -18 40 19 2 -9 -3
7513 -3 -4 -4 -20 0 -19 12 -30 2 4 22 19 5 13 20 15 21 11 13 -3 -2 8 22 -6 20 33 14 -7 10 18 23 -14 16 11 -4 -4 9 4 1 -3
$$ packed form
7256b4K2J4k1LK5m1K6Jj9oPJ5pj3J5J8k7K3j5J8L7n3k0J5K7lOoj7J2lqK0K0l0
7291A1%J6j9l8M3mJk9K1j2K0Jl4L4J0oj2m%k7K1J0PJ1j2L4j4k7k8M0%Nj3oNNM
7328A4J2kKK8m0mk2L7j6J1k6M8l4Nj3prK0%j2J7Jrlk4J6MJ4k3j3J2K0lJ1kQLj6
7366EK0k2j5J7MJ7j5%L4l3kJj4L5j9mK1m0J3l1M2j2k1oL3j3K2k0KnLj4rK6K5J
7402B6k4j8J7K3k3lJQlRj4MJ4p%K1j9K0l1J9k6K3%pk3qK4J0qj8KJ6prj3K2J2j9
7440iL6k8rRJ2k4J0Pk1L3J0J0j8k3KQj8J7J0k1J%LOLK7l1Qok%K0k3K6j2j5PJ7
7478B2m0K0kK2j5j6M7l7l0L9k8M8j4J0k7lK7k1qL2qKj8PK1q%mk5j1N8k1j7j1O
7513cj%j6K0j9L1m2L2KJ8lj4QPnOj0Kj6JJ0J4k8K6J3j9k1J7QNl7L0nj5%J3nlm
$$ plain form
7552 -3 34 -3 24 -11 20 -1 -8 0 9 15 0 -11 11 31 1 21 -13 -7 15 3 12 0 19 2 22 4 17 11 9 -5 29 16 33 2 11
7587 11 14 6 -1 18 8 1 -6 -2 -15 -11 -28 -22 4 25 -20 -7 -3 23 -25 -25 -21 1 14 14 -23 -3 21 10 1 -7 23 16 9 11 -12 4 37 7 6
7626 6 9 -11 6 19 -16 3 13 -1 19 14 -12 -11 -12 6 -14 0 12 -24 -2 -24 24 1 0 5 -1 25 27 -8 -5 9 12 20 28 -4 3 16 10 5
7664 5 27 -30 27 18 8 18 14 6 -18 -25 3 -22 4 -9 -14 -12 -13 9 12 -20 -11 -10 9 0 -19 -2 6 -14 0 2 -4 17 23 2 -23 -5 5 16
7702 16 -25 -12 -15 11 15 11 21 -30 10 -13 15 6 10 5 4 25 -2 -24 8 -4 1 10 12 3 -14 -3 13 -11 2 2 11 16 2 13 6 20 19 16 -36
7741 -36 8 6 -13 5 -6 -16 -21 26 -2 5 17 10 -9 12 7 21 6 6 1 -1 2 -20 -19 4 -18 -44 -2 -18 8 -1 -5 7 7 11 22 -28 2
7778 2 -4 2 16 4 22 25 53 8 -3 24 -6 18 3 13 9 -1 5 14 -26 21 14 -4 -8 -1 12 13 13 1 4 3 -27 -9 9 -12 8 -3 9
7815 9 -4 -26 -20 28 19 12 -4 -10 6 -18 -11 16 19 20 15 -12 13 15 -9 28 19 -10 29 17 11 -2 -17 14 -10 -6 -27 -22 19 16 -21 14 -7 -2
$$ packed form
7552cL7l7K7l5L1k1pQROj5j1K2K0l0K0l4OK2j2Rj2J9j7K0j8J3okj4L4j3J7l1R
7587A1LqpJ9j0ppMj3Mj7OK6K1m5J3MK6m8%MK2J3%l7K0K4j1rqL0ppKk3J6L3l0j
7626FLk0J7J3l5J9J0j4K0nk6JjJ8k0J4J2l6K2k2M8k3jNoK6Kl5LJ4LQQl2PJ3on
7664EK2n7N7rj0J0mqk4pK8k5K6j3nKjK2Ll2RJJ9rj9J7Qk0J4KoK1Ok1k5J8J0J1
7702A6m1J3lK6MmJ0n1M0k3K8rMnjK1k7k2L2j2NRKrj7J1J6k4J3%RNj4J1pJ4jln2
7741c6M4kj9J8j1j0nM7k8PJ2pj9K1nJ4j5%nkLk2JK3k2k6M2j6K6rmJ2%MJ1n0L0
7778BoOJ4j2J8LK8m5j1K7l0K4j5J0mj0ORm0M7pj8mPJ3J%j2Ljl0J8J8k1K0j1J2
7815Ij3k2OM8rpj6oJ6k4PK7LJnk7K5Kk4L7rk9L9j2oj3j5L1k4Mk1NM1ll7L5k1N
$$ plain form
7853 -2 2 -4 11 23 21 -1 3 -3 22 -6 41 29 -7 -5 0 20 -18 16 12 6 10 36 29 31 28 -15 10 11 16 8 32 -19 28 -10 -4 -2 13 16 13 24 14
7894 14 2 14 9 -10 -31 11 16 6 12 6 27 -7 24 33 32 36 13 -5 44 11 6 -20 9 -1 4 28 13 -12 -12 29 -23 22 4 30 -16
7929 -16 -1 -6 1 -1 0 -24 -16 22 -7 -8 1 0 12 -3 6 17 25 2 -11 10 -7 24 -3 30 11 29 22 22 9 8 14 2 23 19 36 19 5 12
7967 12 13 11 11 22 10 8 -12 3 27 -30 -19 12 -20 1 18 17 40 -11 -16 39 -23 -8 16 -16 6 13 8 -4 5 9 32 36 53 23 14 -11
8003 -11 22 6 0 -20 8 6 -24 -5 0 -5 -27 -6 10 20 -5 6 1 4 9 -9 -2 8 29 18 -12 11 16 -4 -9 -22 -4 -18 15 11 20 27 13
8040 13 -21 30 24 17 13 15 30 -16 20 8 1 -20 11 36 -21 9 16 -13 -23 -1 -5 -26 -4 20 1 12 -10 -16 -13 17 -4 22 -1 16 21
8075 21 -12 14 -4 -20 -2 9 -5 11 16 31 30 7 11 -2 22 20 11 -4 1 23 1 -15 -8 -26 -5 -17 -2 18 -9 -4 -2 11 8 -10 2
8110 2 5 -36 11 29 33 7 13 -10 15 15 -12 24 17 6 -9 -36 -29 16 5 16 -15 -12 -17 -10 -2 -3 -4 10 20 -8 -21 -8 10 -22 0 -17 -27
$$ packed form
7853bMoJ5J2kk2MoK5k8M7j2l6KNK0l8L4moMK6pKlm3K5JNqK4n1M7l8OKJ5LlJ1j0
7894A4j2J2nj9k1M2Nj0OoK1l4L1RjMk3j8M9l3nk6K9j0NK4j5k5%M1n2M5j8K6m6
7929a6J5nPkJk4QL8k9jRjJ2j5RJ1Qk3j3K1j7L1k7L3j9J8p%j3jOj2K1mJ7j7j4P
7967A2Jk%J1j2kk0J5K4n7J1L1l2K1J7jK3n1nN5o2J5K4l2K2Pnj2RMK3MJ7l0rk5
8003a1L3j6ok0K8kl0J9Nnk2K1J6J0k5J1nLNj8PJ0K1j1l0K3Nk0nj3J8j4L3mRPj4
8040A3l4N1opmKJ5m6L6j2pk1L1K5n7L0Pk9j0K2mk1K2K4j9J1k2oLL0k1K6k3J7N
8075B1l3K6j8j6J8J1j4J6NJ5jk3Mj3K4krj5NK2k2j6Pj8K1j2J5K0k7NKJ3lj8J2
8110BLm1M7J8Mk6Ok3K5%k7L6pj1j5k7PM5j1J1l1LnPQjjJ4J0k8j3J3J8l2K2j7j0
$$ plain form
8147 -27 -14 -5 -7 9 0 -7 1 6 9 0 32 -1 9 -18 34 34 1 15 -15 7 -18 8 7 -19 20 17 6 -8 -28 28 -4 -5 29 5 -4 -6 9
8184 9 0 0 -6 22 18 10 -8
$$ packed form
8147b7J3RkJ6rpQNLrL2l3J0k7N2%l3J4l0K2k5K6jk6L9lj1j4k0N6l2jL4k4rkJ5
8184Ir%oK8mqj8
8191h
$$ Imaginary data points
##PAGE= N=2
##DATA TABLE= (X++(I..I)), XYDATA
$$ plain form
0 0 0 0 0 0 0 0 0 0 0 0 0 0 0 0 0 0 0 0 0 0 0 0 0 0 0 0 0 0 0 0 1 -3 8 -8 8 -8 8 -8 8 -8 10 -16 16 -16 16 -18 24 -24
48 -24 25 -26 32 -34 40 -42 48 -50 58 -66 74 -82 92 -107 125 -150 185 -240 329 -517 1039 -5853 -18465
71 -18465 -1135 14353 5924 -8520 -6138 2746 4558 2335 1452 -2589 -5614 434 8269 2833 -8969
86 -8969 -7456 5541 8379 -2137 -7642 -1080 4648 2704 -750 -1854 -2302 -449 3800 3407 -3010
101 -3010 -4619 2110 5465 -74 -3767 -390 1719 -849 -1001 1525 -472 -4008 -638 4761 1944
116 1944 -4416 -2610 4026 3365 -2537 -2311 2240 1115 -2464 292 3816 -584 -5137 211 6221 809
132 809 -6691 -2832 4919 2961 -3760 -3328 1681 2179 -208 176 675 -1123 -751 2645 2368 -2449 -3475
149 -3475 1405 3659 -442 -3403 -687 2038 660 -981 -439 -412 -1051 496 1948 -422 -2602 244
$$ packed form
0@%%%%%%%%%%%%%%%%%%%%%%%%%%%%%%JmJ1j6J6j6J6j6J6j6J8k6L2l2L2l4M2m8
48b4M9n1N8o6P4q2R0r8J08j24J40j56J74j99K32k75L35m25N69q46J556o892j2612
71a8465J7330J5488q429j4444K382Q884J812k223q83m041l025O048P835n436j1802
86h969J513J2997K838j0516n505O562N728j944l454j104m48J853M249l93o417
101c010j609O729L355n539l693L377K109k568j52K526j997l536L370N399k817
116A944o360J806O636o61n902K26M551j125l579K756L524m400m553N348O010n412
132H09p500L859P751j958o721M32N009M98k387L84M99j798L72L396k77m817j026
149c475M880K254m101k961K716K725j378j641N42K7o39J547J452k370k180K846
$$ plain form
165 244 3256 885 -2247 -379 2267 553 -1768 -254 1325 -598 -1931 245 1604 -514 -1891
180 -1891 214 1525 -310 -1094 656 847 -1201 -742 2062 1580 -1957 -1801 2238 2772 -1273 -2836 163
197 163 1949 125 -1474 -957 -351 68 1028 784 -1307 -1685 1142 2694 107 -2544 -845 2197 1695
214 1695 -962 -1400 118 831 552 225 -666 -1539 -362 1698 699 -2127 -1772 1396 2139 -422 -1621
231 -1621 175 1472 568 -334 -116 -150 -176 462 673 -494 -1252 3 1229 114 -1451 -655 836 411
249 411 -869 -478 613 322 -315 307 803 -12 -398 466 739 -283 -726 132 415 -381 -620 121 179 -387
269 -387 -321 309 210 -485 -296 556 416 -369 -207 594 511 -149 -106 420 168 -385 -83 217 -358 -691 30 409
291 409 -301 -695 106 626 39 -414 63 464 166 -60 132 179 -39 78 416 64 -477 -236 408 175 -684
$$ packed form
165B44L012k371l132J868K646j714k321J514J579j923j333K176J359k118j377
180a891K105J311j835p84J750J91k048M59K804m82l537J56M039N34m045j563K999
197A63J786j824j599N17O06M19R60k44k091l78K827J552k587k651J699L042n02
214A695k657m38J518P13k79l27q91q73J177K060r99k826L55L168P43k561j199
231a621J796J297r04r02K18l4k6O38K11j167p58J255J226j115j565P96J491m25
249D11j280L91J091k91o37O22M96q15l86Q64K73j022m43Q58K83p96k39P41N8n66
269c87O6O30r9o95J89Q52j40p85J62Q01q3o60M3N26k52n53L02L00n75l33P21L79
291D09p10l94Q01N20n87m53M77M01k98k26J92M7k18J17L38l52n41K41O44k33q59
$$ plain form
312 -684 -638 214 355 -355 -437 180 310 57 119 255 84 -37 282 351 -130 -352 111 392 -71 -457 -201 207
334 207 27 -385 -241 1 -10 -82 43 121 36 72 328 323 -85 -50 331 209 -215 -278 7 74 -151 -245 -99 -52
358 -52 -50 15 -67 -143 -70 183 233 43 -99 125 360 255 -44 -72 72 87 -64 -112 -168 -304 -137 103 -19 -310
382 -310 -237 150 297 45 -114 -3 186 269 194 25 -123 1 286 221 -104 -378 -173 128 133 -238 -491 -224
404 -224 166 206 -28 -183 -109 244 498 229 -235 -194 289 468 36 -311 -253 34 232 93 -292 -469 -150 291
426 291 235 -273 -543 -100 554 463 -167 -407 95 636 420 -236 -366 -41 253 231 -80 -434 -419 58 392 79
448 79 -554 -488 163 629 220 -506 -483 354 769 211 -406 -272 245 439 104 -206 -394 -239 160 263 -77
469 -77 -564 -456 236 661 92 -672 -413 514 744 -17 -529 -74 429 365 55 -96 -233 -226 90 410 26 -732
$$ packed form
312f84M6Q52J41p10q2O17J30k53O2J36j71j21L19O9m81k22M63K81m63l86K56M08
334B07j80m12J44K42j1p2J25P8q5L6K56nm08L5L81j22m24o3K85O7k25r4J46M7
358e2KO5q2p6P3K53N0j90j42K24K35j05k99k8J44J5j51m8n6j36J67K40j22k91
382c10P3L87J47k52j59J11J89Q3p5j69j48J24K85o5l25k74K05L01Nl71k53K67
404b24L90M0k34j55P4L53K54k69m64M1M83J79m32l47N8K87J98j39l85j77L19M41
426B91n6n08k70M43O54r1o30k40N02N41k16o56j30L25K94k2l11l54J5M77L34l13
448G9o33O6O51M66m09p26K3Q37M15n58o17J34N17J94l35l10j88J55L99J03l40
469g7m87J08O92M25n69p64K59R27K30p61n12M55N03o4l10j51j37PL16L20l84p58
$$ plain form
491 -732 -632 334 770 -68 -862 -384 729 706 -194 -566 -11 446 397 100 -178 -315 -151 380 481 -163 -819
512 -819 -398 588 675 -390 -1053 -215 860 635 -420 -675 122 722 391 -154 -275 -110 141 317 179 -261
532 -261 -621 -203 611 457 -562 -913 26 930 267 -733 -501 430 597 9 -246 -28 87 64 239 245 -248
553 -248 -550 -50 576 206 -678 -671 275 696 -71 -666 -269 411 441 3 -210 -83 108 207 269 57 -259 -266 151
576 151 474 -2 -646 -481 325 559 -167 -743 -264 520 492 -162 -431 -30 398 303 37 -140 -126 10 263
597 263 274 -198 -586 -138 498 322 -488 -623 98 507 114 -385 -249 200 334 80 -41 -104 -20 119 203 94
619 94 -219 -299 41 282 2 -351 -289 116 245 -21 -226 -102 109 185 128 -30 -11 27 100 107 123 -50 -186 -68
643 -68 163 110 -203 -318 -45 179 58 -177 -210 41 204 102 -7 -46 12 129 225 92 -144 -166 93 224 -1
$$ packed form
491g32J00R66M36q38p94M78J113k3r00l72N55M57m9k97k78j37J64N31J01o44o56
512h19M21R86Q7j065o63Q38J075k25j055k55P97O00l31n45j21J65K51J76j38m40
532b61l60M18Q14j54j019l51R39R04o63j000K32R31J67n88k55K18J15k3J75Om93
553b48l02N00O26l70q84PR46M21p67n95L97O80L0m38k13J27J91R9O2k12l16pM17
576A51L23m76o44J65Q06K34p26n76M79P84k8o54k69M01M28r5k66j77J4J36K53
597B63J1m72l88M48O36j76q10j35P21M09l93m99J36M49J34k54j21o3Q4J39Q4j09
619I4l13q0L40K41k80l53O2M05J29k66k05J24K11P6n7j58J9L8P3PJ6j73j36J18
643f8K31n3l13j15K73K24j21k35l3K51J63j02j09l9N8J17R6j33k36k2K59J31k25
$$ plain form
666 -1 -278 -183 65 121 -54 -195 -116 45 133 45 -88 -53 95 169 126 -24 -57 3 140 97 -79 -145 -51 73 18 -112
692 -112 -166 -85 43 18 -78 -77 26 62 57 61 51 16 38 74 83 -37 -98 -62 16 1 -79 -111 -91 -17 -17 -43 -62 -38 28 108 54
723 54 26 -1 89 147 53 -44 -17 52 46 -24 -111 -72 -39 -11 -24 -100 -96 -11 54 41 -7 -11 45 95 64 9 -31 33 63 10 -56 -71
755 -71 4 -23 -41 -102 -94 2 -8 -31 -32 16 79 65 8 30 41 48 71 48 -10 -1 37 11 -44 -47 -73 6 -40 -67 -64 -28 13 -22 6 30
789 30 42 57 59 76 20 32 42 33 -21 -43 -10 9 -38 -62 -63 -45 10 -36 -8 24 17 50 40 79 46 11 31 59 3 -29 12 10 -54
822 -54 -66 -26 5 -39 -69 -26 -20 -4 -15 20 -5 7 33 59 74 29 6 5 41 23 -28 -7 -43 -40 -48 -19 -74 -37 32 36 -5 -29 26
855 26 17 58 26 -5 30 40 49 37 0 -29 -19 -15 17 -49 -80 -57 8 -21 -57 -48 12 43 7 22 2 2 77 126 12 -55 -3 55 25
888 25 -59 -82 -58 11 -13 -23 -42 -35 -55 44 71 -40 -53 51 158 29 -64 -18 60 42 -31 -32 -27 -30 -31 10 -31 -85 -102 -12 80
$$ packed form
666ak77R5K48N6j75j41P9J61Q8q8j33L5J48P4m3j50l3O0J37m3j76o6R4J24n5j30
692a12n4Q1J28k5r6JJ03L6nMj0l5K2L6Rj20o1L6P8j5q0l2K0P4%k6j9K4O6Q0n4
723E4k8k7R0N8r4r7K7O9op0q7L9L3K8j3p6MQ5O5j3m8mN6N0l1n5m0O4L0n3o6j5
755g1P5k7j8o1QR6j0k3jM8O3j4n7K2J1PK3k3n8RL8k6n5lk6P9m6k7LL6M1l5K8K4
789C0J2J5KJ7n6J2J0rn4k2L3J9m7k4jJ8N5m6K8L2pL3j0L9l3l5K0K8n6l2M1ko4
822e4j2M0L1m4l0M3OJ6j1L5k5J2K6K6J5m5k3jL6j8n1K1l6LqK9n5L7O9Mm1k4N5
855B6rM1l2l1L5J0Rj2l7k9J0ML2o6l1K3O5k9l6RO0L1l6J5k0%P5M9j14o7N2N8l0
888B5q4k3K4O9k4j0j9Pk0R9K7j11j3J04J07j29r3M6P8j8p3jNljM1m1n4j7R0R2
$$ plain form
919 80 4 -110 -42 62 94 25 -18 0 75 31 13 -20 -80 -16 32 29 -30 -97 -88 -3 44 -7 -84 -56 64 123 38 -119 2
948 2 156 73 -37 -62 18 9 -19 17 8 -87 -170 -2 121 -68 -204 -103 132 116 -113 -120 98 144 17 -41 32 73 -13
975 -13 3 38 -16 -115 -44 68 86 -120 -150 17 127 4 -120 -48 83 91 3 -25 -9 37 49 18 -22 -29 -16 -12 2 17 -75
1004 -75 -141 -42 113 54 -164 -138 86 167 -55 -140 56 132 30 -39 49 64 -49 -58 72 95 -114 -161 47 128 -87
1029 -87 -189 -31 155 57 -86 -52 85 59 -3 46 47 -42 -78 71 95 -28 -91 -40 63 3 -114 -99 -10 47 67 -19
1055 -19 -57 5 98 70 -28 -17 40 77 17 15 17 -10 -101 11 57 -22 -178 -81 94 32 -126 -82 81 107 -41 -48 68 56
1083 56 -37 -11 88 -2 -106 -45 105 -17 -113 -72 55 62 -86 -56 -10 25 -24 7 35 -6 -2 34 69 -5 -46 20 61 23 -12
1112 -12 -25 -9 -55 -10 14 -40 -91 -4 51 11 -61 24 94 46 -4 18 44 13 7 10 46 -33 -71 29 33 -86 -104 -20 53 -40 -80
$$ packed form
919H0p6j14O8J04L2o9m3J8P5m4j8l3o0O4M8ln9o7RQ5M7n1p7K8J20N9q5j57J21
948BJ54q3j10k5Q0rk8L6rr5q3J68J23j89j36J01K35j6k29pK18M6j27n8P3M1q6
975a3J6L5n4r9P1J12J8k06l0J67J10j23j24P2J31Qq8k8J6M6J2l1m0pJ3MJ4J5r2
1004g5o6R9J55n9k18K6K24Q1k22q5J96P6j02o9Q8J5j13rJ30K3k09m7K08Q1k15
1029h7j02J58J86r8j43L4J37k6o2M9Jq9l6J49K4j23o3N1J03o0j17J5Q9N7K0q6
1055a9l8O2R3k8r8J1N7L7o0kKk7r1J12M6p9j56R7J75o2j58M4J63K6j48pJ16j2
1083E6r3K6R9r0j04O1J50j22r6M1J27Pj48L0M6L5m9L1K8m1ML6L5p4m1O6M1l8l5
1112a2j3J6m6M5K4n4n1Q7N5m0p2Q5P0m8n0K2K6l1oLL6p9l8J00Mj19j8Q4P3r3m0
$$ plain form
1143 -80 23 52 -21 -34 60 74 -15 -2 68 84 -60 -67 21 7 -51 -65 23 -9 -40 -54 17 1 -47 -7 73 19 -49 -27 84
1172 84 44 -7 -7 44 16 -35 -1 17 -31 -40 11 6 -54 -65 32 9 -33 -26 37 59 13 13 62 25 -27 46 31 -10 -47 -21 7 -1 -75
1205 -75 -47 -6 -16 -31 -11 42 -19 -54 28 68 -16 -31 58 70 -12 -52 45 46 -40 -54 4 -4 -63 -65 -1 22 -43 -42 -7 43 -13 -2
1237 -2 65 72 7 4 58 33 -37 -27 -10 -12 -53 -11 -18 -57 -52 16 2 -4 -36 -15 58 -5 4 27 64 21 2 36 47 -41 -30 25 -11 -26
1271 -26 -32 -13 -1 -35 -38 13 4 -32 -3 40 10 -21 1 63 -7 -28 0 4 -21 -21 -21 -15 8 -80 -37 13 1 -68 -5 13 -21 12 41 32
1305 32 -21 5 32 25 2 8 -13 3 -49 -38 -17 -6 -32 1 15 -17 1 -13 -3 6 5 -1 53 33 -13 10 10 -2 -4 -8 -7 -37 -47 -9 14
1340 14 -32 -32 8 3 -16 -24 23 21 19 28 34 31 -10 5 18 2 -28 4 -4 -41 -33 -23 -9 -12 -25 -16 0 -9 -9 23 33 13 5 5 21 18 -36 -21 1
1379 1 -13 0 -24 -37 -47 -8 -18 17 -10 -6 -6 4 -23 -25 0 9 29 33 28 27 8 -2 -19 4 -16 2 2 -27 -34 -46 1 1 5 -13 -39 16
$$ packed form
1143h0J03K9p3j3R4J4q9J3P0J6j44pQ8j4n8j4Q8l2l1j4P1j6m8M0Q0n4o8K2J11
1172H4m0n1%N1k8n1L4J8m8rN1no0j1R7k3m2PO3K2m6%M9l7n2P3j5m1l7K6K8qp4
1205g5K8M1j0j5K0N3o1l5Q2M0q4j5Q9J2q2m0R7Jq6j4N8qn9kO4K3o5JL5N0n6J1
1237bO7Po5lN4k5p0J0J7km1M2pl9NO8j4ol2K1P3o3RK3L7m3j9L4J1q8J1N5l6j5
1271b6oJ9J2l4lN1rl6K9M3l0l1K2O2p0k1K8Mk5%%OK3q8M3N0j2o9O3J8l4L3K9r
1305C2n3K6K7pk3Ok1J6n2J1K1J1k6L3J4l2J8j4J0RjoN4k0m6K3%j2kmJl0j0L8K3
1340A4m6%M0nj9qM7kkROlm1J5J3j6l0L2ql7QJ0J4lj3RJ6r%L2J0k0q%J6ln4J5K2
1379Aj4J3k4j3j0L9j0L5k7M%J0k7kK5RK0Mnjj9j0j7K3k0J8%k9pj2M7%Mj8k6N5
$$ plain form
1415 16 45 39 15 17 39 16 -46 11 -21 -7 -12 -9 -12 -32 -35 -32 -2 -18 -26 -28 12 -3 -10 7 17 5 9 13 27 5 -15 -21 -4 -2 -37 -37 -21 6
1453 6 -8 -59 -30 12 -1 -9 8 38 18 23 7 31 12 -5 -32 -1 5 -22 -19 11 21 5 -45 -31 10 37 -21 -5 47 30 30 16 33
1486 33 21 12 23 16 -21 -28 -21 26 -7 -29 -53 -12 4 2 -17 3 31 21 -5 -8 9 42 31 12 40 25 -3 -16 5 22 -15 -53 -8
1519 -8 11 -43 -43 -40 19 38 -14 3 24 56 -14 27 45 -2 11 -20 13 0 -31 -50 7 1 -18 -32 -8 -13 2 -43 3 -6 33 -10 20
1552 20 36 -33 -21 22 28 3 -11 -27 9 9 -30 -39 -24 -4 -2 -11 -7 17 15 -10 16 3 28 -11 -11 -11 28 -10 -14 -12 15 -29 -44 -28 6 -12
1588 -12 -24 2 7 14 -7 4 -10 17 -7 47 15 18 -17 23 23 -21 -37 14 7 5 -45 -21 -25 -16 0 -19 16 21 -20 29 1 -6 -22 -1 15
1623 15 -15 18 3 -14 -24 -13 6 -24 -9 -16 -18 -28 -8 16 7 33 4 21 29 5 19 16 2 -17 -10 28 12 -13 -5 -9 -18 -5 -32 -19 -3
1658 -3 -27 -7 5 28 -29 2 23 21 3 -10 28 -2 -32 -3 -9 -13 -5 -11 -6 -57 -12 39 0 7 10 7 42 19 21 23 11 8 -15 48 -4 -27 -40
$$ packed form
1415A6K9ok4KK2k3o2N7l2J4nLlk0lLL0j6qkM0j5pJ7J0j2MMJ4k2k0oJ7Kl5%J6K7
1453Fj4n1K9M2j3qJ7L0k0Nj6K4j9j7k7L1Ok7LL0J0j6n0J4M1K7n8J6N2j7%j4J7
1486C3j2rJ1pl7pPM7l3k2k4M1J6kj9K0K8j0k6lJ7L3j1j9K8j5k8j3K1J7l7l8M5
1519hJ9n4%LN9J9n2J7K1L2p0M1J8m7J3l1L3j3l1j9N7oj9j4K4nJ5m5M6rL9m3L0
1552B0J6o9J2M3Ok5j4j6L6%l9rJ5K0KrMK4kk5K6j3K5l9%%L9l8mKK7m4j5J6L4j8
1588a2j2K6NPk1J1j4K7k4N4l2Ll5M0%m4j6N1pkn0K4mRJ6j9L5Nm1M9k8pj6K1J6
1623A5l0L3j5j7j0J1J9l0J5pkj0K0K4rK6k9J7Qk4J4lj4j9PL8j6k5QmrJ3k7J3J6
1658ck4K0J2K3n7L1K1kj8j3L8l0l0K9omQoNn1M5N1l9PLlL5k3KKj2lk3O3n2k3j3
$$ plain form
1695 -40 0 3 -14 17 -12 4 -13 1 26 -13 -7 5 10 -22 22 -1 4 -16 -12 -6 -24 -8 2 -12 -24 -1 -19 7 20 -26 -19 11 29 15
1729 15 -24 42 24 24 16 1 11 6 -11 4 -16 -13 -3 -37 -32 -28 -18 12 -12 -23 -5 6 -1 5 31 -3 -3 28 27 -4 3 -25 7 6 -30 8
1765 8 -10 15 -35 11 24 6 -13 20 7 -2 8 25 5 4 12 9 3 -18 -36 -14 3 -56 -25 -1 6 -12 -3 0 18 -19 -4 17 35 -18 22
1800 22 18 7 -7 -2 31 8 31 -25 10 1 1 32 6 -3 -1 6 30 33 16 -3 44 11 -19 -12 -6 -12 -16 -22 8 3 -13 -40 2 9 9 2 -24 -13 22
1839 22 8 3 -10 -1 22 1 7 5 27 -12 -16 18 -9 -7 -14 -16 0 -41 -20 22 1 -12 2 3 20 -20 15 36 5 -5 6 -2 16 -18 -14 15
1875 15 -17 -21 -41 0 -42 -23 4 -5 -6 0 -18 27 -20 23 -8 21 14 21 22 -7 0 -21 3 8 -8 -26 -10 5 26 -7 22 8 -23 18 15
1910 15 19 1 15 36 -13 -25 0 10 17 5 -7 -26 -6 -20 13 6 1 -7 17 17 4 13 16 3 10 -11 13 14 -16 10 25 -2 9 -8 -12 14
1946 14 -37 -8 -25 -14 -19 1 -25 8 -2 -17 0 23 -51 23 31 -1 -17 -22 18 25 -22 -40 9 -50 -15 -25 -2 13 12 3 -6 26 28 1
$$ packed form
1695d0M0Lj7L1k9J6j7J4K5l9OJ2Nl2M4k3Nk0MOj8J6J0j4j2K3j8K6J3m6PL0J8j4
1729A5l9O6j8%qj5J0nj7J5k0LJ0l4NMJ0L0k4j1J8J1pOK6l4%L1jl1Pk8L2jl6L8
1765Hj8K5n0M6J3j8j9L3j3rJ0J7k0jQlok1j8K2J7n9L1K4Pj8RLJ8l7J5K1J8n3M0
1800B2mj1j4NL3k3K3n6L5r%L1k6rKPK4Lj7j9M7l3l0POomoL0nj6k7M2P%pk6J1L5
1839B2j4nj3RK3k1OkK2l9mL4k7KpkJ6m1K1M2k1j3J4JJ7m0L5K1l1j0J1qJ8l4MK9
1875A5l2mk0M1m2J9K7rjOj8M5m7M3l1K9pPJk9Pk1K4Nj6j8J6J5K1l3K9j4l1M1l
1910A5Mj8J4K1m9j2K5J0Pj2j2j9K0j4L3pnqK4%j3RLj3Pk1K4Jl0K6J5k7J1j7mK6
1946A4n1K9j7J1nK0k6L3j0j5J7K3p4P4Ql2j6nM0Pm7j8M9n9L5j0K3J5jrrL2Kk7
$$ plain form
1980 1 32 9 27 -21 -1 -19 -2 -29 -24 -21 23 -11 -10 -1 22 6 -21 -10 14 13 5 10 -4 -15 8 -24 -4 11 -12 3 -37 2 -22 -4
2014 -4 -12 7 -11 -11 21 -19 12 27 -5 10 6 8 -12 7 -19 -2 -33 7 14 8 -7 -18 2 -1 9 8 -4 -31 -2 -4 13 -11 -12 -3 -2 9 -7
2051 -7 -2 -4 -21 -12 31 19 -29 -19 -34 29 5 -7 11 37 -10 -2 10 1 17 3 -4 32 16 0 -4 -19 -29 -33 8 -11 -39 -14 -6 -24 40
2086 40 -4 9 -28 6 15 -7 -18 28 15 14 26 2 -26 -11 6 1 -32 12 -9 9 -1 -7 12 -4 37 5 1 -9 -2 11 -32 11 18 5
2120 5 -13 -25 3 8 -15 -53 -3 -10 -8 32 -4 -14 -10 12 14 -4 3 3 -2 0 -10 -22 -20 -24 -28 -31 0 -8 1 22 10 12 13 15 -5 -4 2 -11 -14 -22 12 17
2162 17 -14 -8 -18 -18 -21 -23 -22 9 12 10 19 40 -16 -17 -11 -4 -28 4 30 -10 8 -2 6 8 1 -9 -8 14 -26 -18 -26 12 -39 6 -5 -13 -5 -12 12 -42
2202 -42 19 8 -2 -43 4 6 10 -12 -7 -13 -9 -34 8 3 22 -6 -35 -1 18 6 8 21 -9 17 20 5 16 -21 3 -20 -2 -29 19 16 -12
2237 -12 16 -8 -21 -14 29 -42 3 -25 -7 6 1 0 16 4 18 -13 0 -2 -30 -14 -2 -1 -38 -8 -29 26 -6 -20 -3 -4 -11 -22 -17 14
$$ packed form
1980AL1k3J8m8K0j8J7k7NLM4l4JRK3j6k7J1K4jqNj4j1K3l2K0J5k3J5m0L9k4J8
2014dqJ9j8%L2m0L1J5l2J5mKk0J9k6J7l1M0Poj5j1K0lJ0jj2k7K9kJ7k4jRJJ1j6
2051gNkj7RM3j2m8J0j5O3k4j2J8K6m7QJ2rJ6j4pL6j6j6mj5j0mM1j9k8K5Qj8O4
2086D0m4J3l7L4Rk2j1M6j3jJ2k4k8J5J7nl3M4k1J8j0oJ9j6M1l2mj0PJ3m3M3Pj3
2120Ej8j2K8Nk3l8N0pKM0l6j0MK2Kj8P%nKj0j2KmmlL1qRK1j2KJKk0JOj3lqL4N
2162A7l1Oj0%lkJL1LkRK1n6jOPk4L2K6m0J8j0QKpj0JK2m0QqL8n1M5j1qQpK4n4
2202d2O1j1j0m1M7KMk2NoMk5M2nJ9k8k9L4J9j2KJ3l0K6Lj5J1l7K4k3J8k7M8lk8
2237a2K8k4j3PM3p1M5k8J8J3njJ6j2J4l1J3kk8J6J2Jl7L0k1N5l2j4J7jpj1NL1
$$ plain form
2271 14 -21 5 -5 6 -25 -19 21 8 -15 -24 -19 -4 -13 -21 18 -4 -38 7 4 -7 -33 9 3 -3 5 -15 -17 -32 -40 -50 -1 12 -19 -25 -5 -3 -15
2308 -15 -3 0 -13 15 -24 -21 26 1 5 21 -13 -15 5 11 -24 -40 -30 -19 -4 15 -18 -1 -21 -25 -2 5 33 6 0 -7 27 4 -5 -5 11 -13
2344 -13 -11 -20 14 2 -2 7 -21 4 5 -4 12 24 -11 -16 6 -1 21 -32 -9 17 5 -11 -11 -11 12 -35 -21 -7 -24 1 6 0 -25 -21 -6 -18 -7
2381 -7 -10 -3 -26 0 -16 -4 -21 -1 -25 -11 -10 14 7 2 -22 -37 -19 6 -18 -8 6 13 21 4 -8 0 -9 -5 12 5 13 -14 -29 5 -6 -7 -21
2418 -21 33 -39 -5 -13 -23 8 -10 -7 13 -9 -10 -15 4 12 -20 4 -34 -18 -23 1 -33 -6 -29 -18 -14 -6 -13 -11 17 -6 25 -18 3 22 -17
2453 -17 4 -20 3 -21 -19 0 -12 -2 -4 9 -12 -30 -13 -14 -13 -20 0 0 9 -3 -20 2 -8 14 8 -10 7 31 -14 15 25 -12 -11 1 12
2488 12 21 -7 -24 -6 2 -12 -13 -15 0 -25 -10 14 -19 -1 -8 -8 15 14 -32 -13 -11 3 -27 6 13 -24 5 5 -1 -8 13 0 2 -3 23 -19 -12 -26
2526 -26 3 3 -1 1 -5 -8 15 -25 9 -12 7 13 -4 7 -20 -6 -24 -5 -22 -38 20 -25 -22 -15 -25 -36 -32 17 15 46 -9 4 -20 -21 2 7
$$ packed form
2271A4l5K6j0J1l1OM0j3k3rNJ5rqL9k2l4M5lj1k6M2ooQk0kj5qj0M9J3l1oK0Kj2
2308a5J2Lj3K8l9LM7k5MJ6l4kK0Ol5j6J0J1J5J9l3J7k0mK3PK8k7opL4k3r%J6k4
2344a3KrL4j2mRk8K5JrJ6J2l5nK2pK2n3K3K6j2j6%%K3m7J4J4j7K5Nok5MJ5j2J1
2381glPk3K6j6J2j7K0k4J4JK4pnk4j5J8K5k4J0J4PQj7j2QrMJ7pQk7j5L4j1jj4
2418b1N4p2L4qj0L1j8LK0k2jnJ9Ql2K4l8J6nK4l4K7k3J1MQpKK8k3L1m3K1J9l9
2453a7K1k4K3k4KJ9j2J0kJ3k1j8J7jJpK0%Rj2j7K2j0K2oj8J7K4m5K9J0l7JJ2J1
2488A2Rk8j7J8Qj4jkJ5k5J5K4l3J8p%K3jm6J9KJ4l0L3Pl7K9%opK1j3KnK6m2Pj4
2526b6K9%mKolK3m0L4k1J9Oj7J1k7J4j8J9j7j6N8m5LPj0j1MM9kL1n5J3k4jK3N
$$ plain form
2562 7 9 3 -25 16 12 -7 -10 10 -12 -3 26 -25 0 -3 3 15 -6 -9 -13 10 5 -11 -7 15 -11 12 2 15 -11 -27 -15 -2 -7 12 20 -26 -1
2599 -1 -14 15 13 7 13 -15 15 -9 -3 -8 -11 33 1 3 -8 18 7 -18 -19 -7 -6 0 -26 7 11 -7 10 6 3 -26 -9 -2 -3 -12 -13 -8 9 -17 -5 8
2639 8 -15 -12 3 -10 -14 32 -3 2 -1 1 -15 -2 -16 18 20 27 -7 -10 2 36 10 -27 9 -19 11 -17 -7 -18 -28 2 -1 -16 -8 12 -19 -14
2675 -14 24 -2 26 -15 -32 -1 23 11 -24 -12 3 17 8 14 8 -12 2 -6 -10 -12 -18 -6 -5 -33 28 21 8 14 25 -4 -14 32 -3 -8 -7 -6 22
2712 22 25 -15 22 0 15 -8 -27 7 17 -9 3 -8 9 -26 -20 -14 -17 25 2 1 -18 7 -8 -32 5 5 -7 -14 -5 23 -1 -11 -8 15 0
2747 0 -18 -38 -34 -20 -13 -13 -3 -21 -12 8 3 -25 -6 5 2 24 19 -11 -19 -13 -7 10 -1 -15 -10 11 -18 7 22 5 5 6 3 -12 3 19 -1 -8
2785 -8 -11 -9 -9 1 -4 -5 21 -28 -12 -6 -17 -3 -10 -12 -8 -4 -20 11 -7 32 0 0 -8 6 41 -2 -2 8 12 -13 12 -38 22 18 -27 -15 25 16 -22
2824 -22 17 6 8 -17 2 -24 2 -12 24 -21 9 4 -41 20 -5 3 -12 7 26 9 -13 -8 -8 18 24 -3 -7 -5 -16 0 22 6 6 -6 18
$$ packed form
2562GKok8M1mj9lK0k2RK9n1K5lOJ2k1lmK3nj6MK2k6K3j0J3k6j6J2J3nJ9Qm6K5
2599aj3K9koOk8L0k4OnlM4l2Kj1K6j1k5jJ2JOk6L3Mj8J7mlk9J7PjrjNJ7k6J2J3
2639Hk3LJ5j3mM6l5NlKj6J3j4L4KPl4lJ2L4k6l7L6k8L0k8J0j1j0L0lj5QK0l1N
2675a4L8k6K8m1j7L1K4j2l5J2J5J4rOok0J4qmkoJ2Jk8O1pj3OJ1k9j0M6l5nJJK8
2712B2Lm0L7k2J5k3j9L4J0k6J2j1J7l5OOlM2k3jj9K5j5k4L7%j2pRK8k4j0LK3j5
2747@j8k0MJ4P%J0j8RK0nk8J9J1lK2nl0qOOJ7j1j4NK1k9K5J5j7%Jlj5J5J6k0p
2785hlK%J0njK6m9J6Oj1J4pkMMj6L1j8L9l2%qJ4L5m3%J0Mk5K5n0O0mm5J2M0rl8
2824b2L9j1Kk5J9k6K6j4L6m5L0nm5O1k5Qj5J9J9j7k2N%K6Ok7mKj1J6K2j6%j2K4
$$ plain form
2859 18 -6 -3 -29 -12 1 0 -16 -40 11 -5 8 4 10 12 7 -15 -13 20 -17 -11 -12 11 -18 5 -2 -9 -6 0 -7 0 -46 -5 -11 6 -7 4 8 17 -26
2898 -26 10 5 18 1 -1 -23 7 -13 -2 -4 2 15 -4 -8 20 -16 -38 -5 -20 -32 5 13 -7 14 2 9 -24 -9 -11 -1 -31 -26 -4 7 -30
2933 -30 -10 13 11 -15 0 3 10 15 7 21 -22 4 3 -5 -10 -31 -9 -11 0 -3 -10 -34 6 30 -46 -21 -40 -15 6 7 19 -16 -20 13 7 -26 -8
2970 -8 -9 -33 -4 -13 -16 17 -6 1 12 -6 22 -5 17 -24 4 -8 17 8 11 16 4 -11 34 -11 -21 -8 -16 -10 -17 27 -13 -7 -10 -5 11 39 7
3007 7 1 5 -12 -22 1 -1 -31 -33 1 11 -2 10 2 1 -16 -8 17 1 -21 15 13 19 -3 1 6 10 -11 7 10 -2 0 -14 -31 -3 -7 6 8 15 -4
3046 -4 11 6 3 21 3 11 15 -5 -5 9 27 14 24 6 9 -32 1 -5 -26 8 18 1 12 9 6 13 23 -1 6 -4 26 32 -1 7 -8 4 -4 -15
3084 -15 23 -6 -18 -4 -17 -30 -1 -3 9 8 6 -7 13 2 8 0 -20 -12 32 18 23 2 8 13 14 -1 4 27 28 -10 -8 14 -11 8 -33 -21 3
3121 3 -31 -20 7 -4 2 -11 -15 5 4 20 15 -9 -14 13 -13 20 3 6 -3 -8 2 -22 11 -17 1 4 -6 -23 4 9 3 -13 10 8 16 2 -6 19
$$ packed form
2859A8k4Lk6J7J3jj6k4N1j6J3mOKnk2KL3l7OjK3k9K3ppLOpPm6M1oJ7j3J1MRm3
2898b6L6nJ3j7kk2L0k0J1kOJ3j9mK8l6k2L3j5j2L7Qk0K1j2Pl3J5kJ0l0NK2J1l7
2933c0K0K3kk6J5LPNqJ4m3K6jqnk1K2kJ1lpk4M0K4p6K5j9K5K1JJ2l5mL3ol3J8
2970hjk4K9rlL3k3PJ1j8K8k7K2m1K8j2K5rLNj2j5M5m5j0J3qOpM4m0OlNJ6K8l2
3007GoMj7j0K3kl0kL4J0j3J2qjj7QK5j6k2L6kOk2MNMk1J8Lj2Kj4j7K8mJ3KPj9
3046dJ5nlJ8j8QMk0%J4J8j3J0j8Lm1L3ok1L4J0j7J1llPJ0k4Pj0L0Ol3Qj5J2qj1
3084a5L8k9j2J4j3j3K9kJ2jkj3K0j1Oqk0QM4j4Nk1ONJj5NK3Jl8KK2k5J9m1J2K4
3121Cl4J1K7j1Oj3mK0jJ6nk4nK7k6L3j7LrnJ0k4L3k8J8Lj0j7K7Noj6K3kQj4qK5
$$ plain form
3159 19 -6 4 -1 25 27 4 3 -37 -19 -19 4 9 -15 -20 -6 11 -11 24 0 -11 -16 13 -17 -6 -3 26 2 -10 8 -17 1 6 -10 19 6
3194 6 -3 -22 19 6 -16 -6 7 -1 -11 21 8 15 -20 -7 -12 17 -14 -4 14 24 27 2 12 13 -1 -12 -2 -28 -10 20 11 2 8 -42 0
3229 0 -22 -3 -11 -1 6 15 12 -11 2 0 -18 7 15 -12 -26 -34 -3 -3 -19 0 19 -2 -29 -12 11 4 13 -15 -1 -6 18 8 -10 9 -16 -21 8
3266 8 29 6 -22 17 6 -6 -19 29 -3 -7 1 8 -15 -20 -14 -23 -14 -5 -10 -7 26 19 -6 -11 -5 -12 19 -20 -4 -28 -8 14 -21 -18 9 -17 -17 -16 -1
3305 -1 2 1 5 -5 18 -14 -5 12 21 19 4 -4 15 -7 2 14 7 -17 -14 -36 6 -8 -17 7 -10 3 -12 -20 -8 -16 -9 -30 -12 4 -18 -1 -15 1
3343 1 6 -14 -9 -33 -6 12 27 -2 -6 10 1 5 20 -3 14 4 21 8 -4 -28 22 -13 1 9 -10 -3 2 -17 -2 -14 -13 -21 -16 -15 -1 3 8 -8
3381 -8 3 -22 -3 2 -18 -18 15 -2 25 17 -5 -3 -30 40 9 16 23 -20 0 10 3 1 -4 12 -1 14 -16 -11 -47 3 -8 -1 9 -3 -5 -1 15
3418 15 0 6 -13 -3 -10 -1 -17 -1 7 -28 23 17 -25 -7 -7 -6 -6 6 2 -12 8 17 11 -3 0 14 -19 17 -3 -10 10 5 -12 -22 -1 6 20 -1
$$ packed form
3159A9k5J0nK6Kk3jm0J8%K3Nk4nJ4J7k2L5k4j1nK9l0J1LK9k4j2J8k5J8Nj6K9j3
3194Frj9M1j3k2J0J3qj0L2j3Pl5J3nK9l1J0J8J0Lk5J0Jj4j1J0k6J8L0rrOn0M2
3229@k2J9qJ0PRlk3J3kj8K5Qk7j4qL1%j6J9J9k1k7J7K3pRk8J4nK4j0j8J9k5nK9
3266HK1k3k8L9j1j2j3M8l2mQPk3nOrRRnLL3pk5nOpL1l9J6k4K0K2l5LK7k6%JJ5
3305aLjMj0K3l2RJ7Rkj5qJ9k2RJ2pk4Lk2M2j4rK4j7J3j5qJ2qPk1J8J6k2J7j4J6
3343ANk0Nk4K7J8J5k9mJ6rMJ5k3J7j0J7j3j2k4N0l5J4Qj9PNj9J5j2JqNJJ4MNj6
3381hJ1k5J9Nk0%L3j7K7qk2Kk7P0l1PPm3K0J0pknJ6j3J5l0Nl6N0j1PJ0j2kMJ6
3418A5j5Oj9J0pRj6J6Ql5N1om2J8%J%J2mj4K0Roj4LJ4l3L6k0pK0nj7j0K1PJ4k1
$$ plain form
3456 -1 8 8 -4 -21 7 4 -10 5 -24 -21 -8 -21 -6 17 -10 16 -3 26 0 -12 5 -1 9 12 4 0 10 14 14 -21 6 3 -5 -4 2 4 4 -21 10
3495 10 0 4 -3 12 -14 -20 -9 -28 18 0 -9 0 14 -4 25 -15 23 21 17 -2 15 8 -5 23 14 20 5 -11 9 -3 -15 -13 -7 -12 12 -3 8
3532 8 13 6 -5 10 34 -18 -2 -11 -4 1 13 -12 -8 1 20 -3 -2 -9 -9 -40 16 1 -7 23 -21 -11 -3 -4 17 -14 12 -20 -47 12 -11 -41 -7
3569 -7 30 7 -1 4 17 -10 9 -5 0 21 -13 5 -8 -4 0 -1 -15 -13 -10 -16 15 2 16 21 0 -21 22 16 -11 -28 -2 -21 5 5 -10 -4 -3 -9
3607 -9 9 7 17 -6 -9 26 22 19 14 30 22 -25 -29 -19 -11 -6 -20 -21 -24 -21 -2 -1 2 2 -7 5 3 -24 21 -13 35 10 -22 -6 -9 9 6 1 48 -3 -24
3648 -24 25 -10 17 -1 -4 -4 0 12 -17 -7 36 16 30 12 22 -3 -2 -18 3 -19 5 10 6 -20 -20 1 -15 29 -27 4 10 5 -17 -12 -16 -8
3684 -8 29 9 15 -13 20 -24 1 8 28 9 8 14 -12 -2 13 5 5 -6 -14 22 5 2 22 1 -5 26 -17 -11 -6 4 1 2 4 -3 -4 6 -1 -25 7
3723 7 9 -27 3 -12 -24 -15 35 -16 -32 -25 -13 10 29 -9 7 32 19 -17 2 3 -17 25 -15 7 -5 -11 14 -10 -15 -12 21 -26 1 6 -10
$$ packed form
3456aR%j2j7K8lj4J5k9LJ3j3J5K3k7K6j9K9k6j2J7oJ0LqmJ0M%l5K7lqJOK%k5L1
3495A0j0MpJ5k6oJ1j9M6j8rRJ4j8K9m0L8kmj9J7pj3K8rOj5j6K0j2j2KOnK4j5J1
3532HNpj1J5K4n2J6rPNJ2k5MRJ9k3Jp%l1N6j5qL0m4J0QjK1l1K6l2k7N9k3l0L4
3569gL7k3qNJ3k7J9j4NK1l4J8j3MMjj4KLoL1j3J4Nk1k1M3ok7j7K6j9K6%j5OJo
3607iJ8kJ0k3lL5mlnJ6qm7mJ0QNj4jlLJ9JL%rJ2kk7M5l4M8k5l2J6lJ8lnM7n1k1
3648b4M9l5K7j8l%MJ2k9J0M3k0J4j8J0k5Jj6K1k2K4Nmk6%K1j6M4n6L1Onk2NmQ
3684hL7k0Ok8L3m4K5PK0j9jOk6J0J5q%j1qL6j7lK0k1oL1m3ONJ0lJKpjJ0pk4L2
3723GKl6L0j5j2RN0n1j6PJ2K3J9l8J6K5j3l6J9Jk0M2m0K2j2oK5k4nLL3m7K7Nj6
$$ plain form
3758 -10 -7 8 -3 23 9 -28 -30 -28 -14 24 6 -28 11 5 -8 1 35 -4 18 18 -17 -30 -5 -16 2 -27 -20 2 11 -10 -7 -11 -15 5 4 15
3794 15 -3 2 -4 1 5 -7 -2 -25 -1 16 7 -23 -13 -14 19 -33 -3 -9 -41 -2 -10 0 -6 13 -5 -8 7 37 13 -9 -11 38 -13 8 -19 1
3830 1 -10 -13 -17 -23 0 -10 15 -11 7 -15 -11 7 -18 -24 20 -12 -12 -1 16 -31 15 -24 -11 9 17 -2 -12 7 28 22 26 -9 -11 7 21 15
3866 15 -14 37 -9 -8 -16 7 -13 -2 24 8 -33 -14 -38 17 0 -5 -1 -25 -2 -2 14 -27 -13 7 -5 24 -7 -17 1 8 -8 32 -2
3899 -2 1 8 40 0 -5 1 -9 -8 -10 -17 -25 -25 -8 20 -12 2 -12 10 -3 -23 -12 -38 -6 -20 5 -6 -25 -25 -9 -4 15 33 -7 3 -3 -5 -30
3936 -30 -4 5 13 -16 9 -1 6 -5 -2 24 13 -3 -14 2 -16 8 -12 3 7 -17 -23 -19 9 -7 -18 15 3 27 -10 8 -18 -10 -31 -7
3970 -7 -16 -12 -15 2 -14 9 -1 -5 16 -8 -10 24 -1 3 15 10 -20 -45 11 -14 -24 17 5 -11 16 2 2 -16 4 -6 15 -19 -6 -6 21
4005 21 -22 -7 -1 -8 -22 -20 7 12 19 -23 9 10 -15 5 -3 8 12 -44 27 11 29 -30 -6 -5 -26 10 -33 -15 -22 -5 -6 -7 7 0 -13 -4 11
$$ packed form
3758a0LJ5j1K6j4l7kKJ4L8j8l4L9oj3RL4l9K2%l5j3K5j1J8k9PK2Rk1LmmK0jJ1
3794A5j8NoNMj2Nk3K4J7rl0J0jL3n2L0ol2L9qJ0oJ9j8lJ5L0k4k2kM9n1K1k7K0
3830Aj1lmoK3j0K5k6J8k2MJ8k5oM4l2%J1J7m7M6l9J3K0Qj9j0J9K1oMl5kJ8J4o
3866A5k9N1m6JqK3k0J1K6j6m1J9k4N5j7nMk4K3%J6m1J4K0j2K9l1j0J8Pj6M0l4
3899bLPL2m0nOj0Jkpq%J7K8l2J4j4K2j3k0J1k6L2j4K5j1j9%J6NJ9J8m0J0okk5
3936c0K6RQk9K5j0Pj1LK6j1j6j1J6j8K4k0J5Mk4oMK8j6j1L3j2K4l7J8k6Qk1K4
3970grMlJ7j6K3j0mK1k4kL4k5MJ2nl0k5N6k5j0M1j2j6K7j4%j8K0j0K1l4J3%K7
4005B1m3J5Opj4KK7NPm2L2Jk5K0qJ1Mn6P1j6J8n9K4Jk1L6m3J8pJ7jjJ4pj3RJ5
$$ plain form
4042 11 -15 -2 -2 0 9 -13 -7 2 -43 0 2 -33 -17 -24 -16 -9 -2 -31 -16 -10 -13 -21 -2 -16 14 -31 -7 4 -8 -2 -1 1 0 26 -11 -23 21 -12 1
4081 1 -6 -4 -1 -16 -35 -25 10 2 19 -14 15 -19 -1 -24 -5 1 -7 13 -19 -25 -11 5 -24 -21 -21 10 18 -25 -7 -3 27 -3 -7 -26 -6 20 -5
4118 -5 -23 -1 -13 9 -35 3 10 -8 -26 10 8 -6 3 0 -23 -2 18 -4 26 -26 -2 -12 2 19 -16 4 -11 2 7 11 18 19 12 2 -8
4153 -8 30 -11 -14 -4 17 14 30 14 -5 12 27 -37 -11 -19 28 -12 -33 -20 -11 0 5 -11 -5 10 -16 -30 10 -25 11 8 -9 18 -13 -16 -26
4188 -26 8 -33 19 -10 6 3 -4 11 1 -2 -4 1 5 15 -6 18 -18 -2 -15 -9 -10 -5 7 -14 -1 6 -20 -12 -11 14 -20 15 -21 -30 -4 5 20
4225 20 17 47 -2 15 -3 5 -21 4 2 17 12 -28 -42 1 28 -5 -11 0 -23 -9 2 -4 -2 -5 3 -2 18 -23 -6 15 -3 -6 13 22 -18 -23 -20
4262 -20 -31 -11 -14 -16 9 20 -29 15 -8 9 28 10 19 25 14 8 6 11 22 3 -15 -33 -7 -9 -13 6 11 23 0 -8 27 7 21 -25 5 -5
4298 -5 -10 -20 -9 -5 -6 -7 -25 -12 -2 -3 2 -34 8 -13 3 8 7 4 -3 -19 -37 2 19 -9 -18 5 13 -11 -15 25 -10 6 0 26 0 -9 13 4 -10
$$ packed form
4042A1k6J3%KRk2ORm5M3Kl5J6pQPPk9J5OlqJ9j4L0m5K4J1j2OJKjK6l7j2M4l3J3
4081ApKLj5j9J0L5qJ7l3K9l4J8k3J9OqK0l2oJ4J6k9L%L1Qm3J8ML0l0mj9K0K6k5
4118ej8K2j2K2m4L8Pj8j8L6kj4Rlk3K1K0k2L0n2K4j0J4J7l5K0j5J3NMPJpj0j0
4153hL8m1lJ0K1lJ6j6j9J7J5o4K6qM7m0k1J3RJ1Nj6OJ5k6j4M0l5L6lj7K7l1lj0
4188b6L4m1N2k9J6lpJ5j0lkNMJ0k1K4l6J6j3OjNJ2k1J3Pk6QJK5l4L5l6rK6RJ5
4225B0lL0m9J7j8Qk6K5kJ5nm0j4M3K7l3oJ1k3J4J1oKlQnK0m1J7K1j8lJ9Rm0nL
4262b0j1K0lkK5J1m9M4k3J7J9j8ROj1okNJ1j9j8j8K6kmJ9NJ2k3qL5k0J4m6L0j0
4298enj0J1Mjjj8J3J0jNl6M2k1J6Njlpj6j8L9J7k8rK3Qk4mM0l5J6oK6k6rK2rj4
$$ plain form
4337 -10 17 -2 6 -7 -17 -24 0 -28 -8 10 -10 30 -4 0 5 16 -1 -3 14 -4 10 11 18 20 23 23 0 21 9 28 26 5 17 10 4 -18 -15
4374 -15 1 18 -3 1 -5 -1 8 10 -2 -13 11 -3 5 -3 -10 -9 -4 -5 24 8 2 -3 3 20 4 -21 -7 13 1 10 27 -14 24 5 -11 4 -5 -12 18
4413 18 -34 7 -7 6 -7 -2 8 0 -18 -17 -27 -12 -2 -19 -4 -8 -7 21 21 -12 4 9 -14 12 7 -25 8 4 -17 15 -6 20 10 11 14 1
4449 1 -1 8 13 -13 -16 -14 -9 3 4 -14 6 12 -11 -28 -7 21 -2 6 -2 23 -2 -19 -1 -10 9 -7 7 0 3 -15 -6 13 -5 -16 1 -10 -8 2
4487 2 25 -24 17 10 -13 -27 13 1 13 11 -14 -4 2 -15 -19 -16 -13 -22 14 7 -5 11 8 -12 -13 23 17 -20 -2 -12 -7 -2 -17 13 12 -7 30 26
4525 26 39 15 12 1 -2 24 5 36 -5 9 6 1 22 19 16 15 10 0 -7 -9 -19 -2 18 -17 0 17 -7 7 15 -10 20 -5 27 -18 -1 -9
4561 -9 17 -1 15 15 9 14 25 10 -17 17 -4 -10 5 -3 8 8 -4 15 -22 0 -18 -16 4 8 -2 3 -20 2 7 -9 -13 1 25 -14 -2 17
4597 17 -1 12 -1 16 -12 37 14 -2 -12 -11 24 11 26 -14 8 -1 20 3 -2 -9 19 -17 4 18 -13 27 -1 8 12 37 3 -3 6 -26
$$ packed form
4337a0K7j9Qj3j0pK4k8K0J8k0M0l4MNJ1j7kJ7j8J4JPKL%k3K1j2J9kk1J2pok2L
4374a5J6J7k1MoMRKj2j1K4j4QqpJNjK9j6onOJ7j6k5J4K0j2RJ7m1L8j9j6J5rpL0
4413A8n2M1j4J3j3NJ0qj8Jj0J5J0j7J5mJK8%l3J6Nk3K6nl2L3mk1L2k1K6j0JLj3
4449AkRNk6lKNJ2Jj8K0Ok3j7K1K8k3QqK5k5j7J8rJ9j6J4pLj8RJ9j8j1J7j1KJ0
4487BK3m9M1pk3j4M0j2J2kk5J0Oj7mLLrL6pj2J6lk0jL6ol7J8j0NNj5L0jj9L7m
4525B6J3k4lj1lK6j9L1m1J4lnK1lljnj0pkj0J7K0l5J7J7k4J4Qk5L0k5L2m5J7q
4561iK6j8J6%oNJ1j5k7L4k1oJ5qJ1%j2J9l7K2j8KK0Mj0Nk3K2Nj6mJ4K4l9J2J9
4597A7j8J3j3J7k8M9k3j6j0JL5j3J5m0K2rK1j7npK8l6K1J4l1M0k8RMK5l4oRl2
$$ plain form
4631 -26 -4 -10 29 7 -18 -30 -12 12 -9 2 -18 -19 15 6 -10 -4 1 22 -15 5 12 27 17 -10 -8 2 10 -23 -8 26 -3 13 14 9 28
4666 28 4 21 8 15 0 -30 -32 -18 -8 21 -5 6 -6 1 31 -12 -14 37 -35 -22 30 -21 -3 -12 9 1 -9 21 36 -12 27 2 18
4699 18 25 -1 4 15 11 -25 -21 29 10 -17 10 5 5 -15 -19 5 -18 2 -29 -27 5 -12 15 -9 -28 -4 6 18 -22 -3 -1 -4 -4 -26 3 -17
4735 -17 -31 -19 20 -7 -30 8 -2 -20 5 -17 -9 -20 12 9 -21 25 -6 -8 -14 -5 -8 -6 -3 -2 23 6 0 2 7 -3 -19 8 -29 -26 2 -26 2
4772 2 2 -2 1 9 -20 -16 5 22 -9 20 -18 -3 9 -5 -9 -10 -18 -11 6 0 -3 -14 15 0 5 -6 2 19 2 -2 -16 11 -3 33 -8 17 12 -7
4810 -7 -1 19 -10 -3 15 -6 -2 8 -12 -20 2 9 12 35 -11 -9 0 18 4 12 -12 1 25 -36 -5 -9 24 4 4 8 -5 -35 -18 -3 -10 -2 -3 3 -8
4849 -8 -31 -20 10 -1 -6 2 4 -8 10 1 10 8 -5 -30 -4 -7 14 11 -14 5 2 33 17 -3 19 -10 13 -16 23 -6 0 5 -37 -35 -7 -15 -12 -3
4887 -3 -53 -13 -25 3 -4 8 21 -9 10 8 16 18 9 9 10 -4 13 2 13 1 11 19 12 12 -4 -12 9 14 -8 -4 12 13 15 10 23 14 2 -24 -40
$$ packed form
4631b6K2oL9k2k5j2J8K4k1J1k0jL4rj6ONK1l7K0PJ5j0k7KJ0Ql3J5L4k9J6JnJ9
4666B8k4J7j3Pj5l0kJ4J0K9k6J1j2PL0m3kN1p2J3N2n1J8rK1qj0L0J5m8L9k5J6
4699A8Pk6NJ1ml6MN0j9k7K7n%k0mK4k3K0l1KL2j7K7k4j9K4J0J2m0J9Kl%k2K9k0
4735a7j4J2L9k7k3L8j0j8K5k2Qj1L2ll0M6l1koRlKLJK5j7oKNj0j6K7l7LK8k8K8
4772B%mLQk9MK1J7l1K9l8J5J2j4mjqPJ7olj1K9j5Nj1QJ7j7mj4K7j4L6m1K5nj9
4810gOK0k9PJ8k1MJ0k0qK2PLK3m6KRJ8j4Qk4J3K4o1L1mL3k0%Mj3l0J7J5pQjOj1
4849hk3J1L0j1nQKj2J8rRkj3k5K6lK1lk5J9lL1j6k0K2k9K3k9L9k9ONm2KK8qLR
4887cn0M0j2K8pJ2J3l0J9kQKr%Jj4J7j1J1j2J0Qp%j6qK1Nk2MJ6JKnJ3rj2k6j6
$$ plain form
4926 -40 6 -11 -11 22 16 7 -22 38 -5 -5 21 7 2 -6 -16 0 0 -13 22 21 -2 5 -10 18 -10 31 -4 -3 18 -10 -5 -13 24 8 -1 19 11
4963 11 3 9 -25 -15 -9 -25 14 -13 6 9 -10 -13 -2 -11 7 27 7 14 -8 6 0 -8 10 -4 9 -4 -7 33 3 5 -8 -6 -3 6 -22 28 -21
5000 -21 -22 16 -2 9 -8 -10 2 -16 -13 19 9 24 -11 -14 -7 -20 0 2 17 0 -42 1 10 -10 6 -18 -7 1 27 8 -37 12 4 -9 2
5035 2 -3 13 -41 -5 5 2 -14 10 4 -20 8 -4 1 0 30 -15 5 12 -13 -14 -10 -12 -5 10 -18 -14 -26 11 17 -17 8 -27 -3 15 2 12 6
5072 6 7 18 -2 -2 -12 -1 -33 1 -20 14 -14 -1 14 -6 15 17 -11 -27 10 10 12 1 0 -22 -32 -35 -15 29 -9 -15 -13 -5 5 -19 4 3
5108 3 3 4 -13 11 -4 51 18 -17 -5 18 41 -2 18 24 8 -8 3 -10 2 -12 6 -15 -16 -35 26 3 -23 10 -19 -3 5 12 19 26 2
5143 2 11 3 5 -5 -8 -7 -1 11 9 -1 14 -11 16 39 -13 20 28 2 11 -19 11 3 19 -10 17 -21 -11 0 14 23 -5 3 -19 2 17 4 47
5180 47 19 -25 9 12 14 -1 4 -10 23 -2 9 10 18 17 -23 -3 -17 36 2 27 -27 -5 22 -8 16 -3 18 7 -2 -29 -24 27 1 1 -16
$$ packed form
4926d0M6j7%L3ork9O0m3%K6j4nqj0J6%j3L5jk3Pj5K8k8M1l5JK1k8NqL7j6rK0q
4963A1qOl4J0Oj6L9k7J9Lj9lJ1rJ8K0k0Pk2J4oqJ8j4J3j3lM0l0Kj3KLRk8N0m9
5000b1jL8j8J1j7kJ2j8LL2j0J5l5lPj3K0KJ5j7m2M3Rk0J6k4J1QK6j9m5M9qj3J1
5035BnJ6n4L6J0lj6K4ok4K8j2NjL0m5K0Pk5jMkPJ5k8Mj2L7Ol4K5l5K4J8j3J0o
5072FJJ1k0%j0J1l2L4k1L4k8J3J5k0K1Kk8j6L7%Kj1jk2j0lK0M4l8oKQJ0k4K3j
5108C%Jj7K4j5N5l3l5J2K3K3m3K0Oj6j6J1j3J2j4J8k1jj9O1k3k6L3k9J6QPPPk4
5143BRqKj0lJOJ2kj0J5k5K7K3n2L3Qk6Rl0L0qJ6k9K7l8J0J1J4Rk8Qk2K1J5j3M3
5180D7k8m4L4LKj5Nj4L3k5J1JQjm0K0j4N3l4K5n4K2K7l0K4j9K1j1rk7NN1k6%j7
$$ plain form
5215 -16 22 -8 12 18 11 -21 -17 -14 -23 -4 15 8 -19 5 8 -13 22 19 -17 16 10 -12 -20 -13 7 24 18 -11 33 22 21 6 2 26 12 -16 14
5252 14 7 21 -15 18 -12 -34 13 2 -18 17 -19 3 8 38 2 -5 23 16 -6 -8 36 -10 -19 -7 -11 39 10 -9 -23 17 -12 -16 -15 9 7
5287 7 31 -12 16 -3 -5 13 6 -7 -24 9 8 4 19 -18 -19 10 8 -23 -1 -1 -20 9 -7 9 14 25 5 3 26 21 -2 -10 4 -4 -4 33 24 1
5325 1 27 -22 31 11 -2 7 10 18 -35 -14 10 11 -26 -5 20 15 -8 -10 17 -1 0 -2 13 1 -33 -4 8 -34 10 -1 -33 2 -5 16 8 -25
5361 -25 -3 -6 29 22 24 -5 4 1 20 -4 -4 -2 5 13 11 6 13 21 -15 32 -14 23 15 8 11 4 -12 10 -10 -7 4 -17 -23 9 -19 -12 19 -9 -9 13 22
5402 22 -16 -25 -8 3 1 6 25 -15 9 -8 5 4 -1 3 -18 6 -20 -25 -7 -6 -4 -5 5 24 -2 16 19 12 4 -1 -6 10 -12 -5 -1 -32 17 7 -19
5441 -19 -4 5 7 5 13 8 14 -3 -1 15 0 -10 15 4 -6 20 7 24 -25 8 9 -37 3 -20 -10 -15 8 16 22 22 19 -7 0 10 -7 -10 9 -5
5479 -5 -9 -2 8 34 16 8 29 -2 -20 20 0 12 1 26 -1 -4 19 5 3 20 10 18 31 -3 -5 -5 22 15 -11 29 -22 -13 -1 14 -11 0
$$ packed form
5215a6L8l0K0Opl2MLrJ9J9pk7K4Lk1L5ll6L3ok2qPK0J7ok9M4j1jj5mK4j4k8L0
5252A4pJ4l6L3l0k2M7j1k0L5l6K2NL0l6pK8pk2kM4m6rJ2mN0k9j9j4M0k9mJK4k
5287GK4m3K8j9kJ8pj3j7L3jmJ5l7jK9kl1K2%j9K9j6J6NJ1k0kK3nk3qJ4q%L7rk3
5325AK6m9N3k0j3RLQn3K1K4Jl7K1K5nk3kK7j8JkJ5j2l4K9J2m2M4j1l2L5pK1ql3
5361b5K2lL5pKk9RlJ9k4%KPQknPQl6M7m6L7qpLpj6K2k0LJ1k1oL2k8PL1k8%K2R
5402B2l8rJ7J1kNJ9m0K4j7J3jnMk1K4k6nJ8JKjJ0J9k6J8LpqnnJ6k2PMl1M9j0k6
5441a9J5RKkQnOj7KJ6j5j0K5j1j0K6j3J7m9L3Jm6M0k3J0nK3QO%lk6PJ0j7lJ9j4
5479emPJ0K6j8qK1l1j8M0k0J2j1K5k7lK3j4kJ7j0QJ3l4k%K7pk6M0n1RJ2J5k5J1
$$ plain form
5515 0 22 -13 13 -3 5 18 11 22 11 -18 5 11 -19 -12 -1 14 5 -7 -4 16 -9 -11 14 20 -4 -2 11 -15 -2 12 26 10 11 -28 8 -21
5551 -21 -19 -8 -34 -9 -4 -10 -5 17 -6 20 19 35 11 25 16 15 -10 31 9 21 -42 0 11 -14 27 25 -6 -30 -22 -3 21 -14 -26 13 24
5586 24 11 12 23 -7 -32 16 12 -8 9 -17 -14 -4 1 -18 8 -29 -11 8 18 -7 20 16 1 21 -2 -7 26 33 4 2 -6 18 -17 22 17
5621 17 18 -9 -17 -10 -22 -9 11 8 35 -8 0 17 17 -40 7 3 31 -5 41 17 4 25 18 -21 5 -7 9 -6 3 30 -15 20 7 1 10 24
5657 24 12 12 10 35 28 -20 12 -1 20 -7 10 5 15 37 2 20 -23 -23 14 14 -1 -8 2 -20 4 4 -5 23 -25 21 20 13 -8 -5 -9 15 -13
5694 -13 16 -3 -12 10 9 15 5 18 -14 10 -1 -11 -16 8 -3 14 10 40 2 11 -9 10 26 -24 1 -1 20 2 -9 7 19 21 7 -6
5728 -6 17 -9 -4 14 -4 39 5 -13 -3 5 20 -2 4 8 14 12 -2 11 15 -3 -9 11 13 -9 -2 -14 24 34 -16 -31 19 33 -10 -16 14 11 10
5765 10 27 -4 -13 -2 4 15 29 -8 -36 16 -15 -9 19 6 -9 5 -8 3 12 9 25 33 -9 -1 1 14 34 18 18 -28 -7 -3 -16 -13 12 3
$$ packed form
5515@K2l5K6j6QJ3pJ1j1k9K3Ol0PJ1J5rj2LK0k5kK5Ok4KJ3k6J3J4J4j6Jl9L6k9
5551b1KJ1k6K5NoNK2k3K6jJ6k4J4rjk5M1k2J2o3M2J1k5M1kl1k4QJ9K4l5j2L9J1
5586B4j3JJ1l0k5M8mk0J7k6LJ0Nj9K6l7J8J9J0k5K7mj5K0k3nL3Pk9kqK4l5L9n
5621A7Jk7qPj2J3K0lK7m3QJ7%n7M7mK8l6M6k4j3K1pl9K6j2J6j5RK7m5L5j3oRJ4
5657B4j2%kK5pm8L2j3K1k7J7nJ0K2l5J8m3%L7%j5pJ0k2K4%rK8m8M6jpk1LmK4k8
5694a3K9j9rK2jOj0J3l2K4j1j0nK4j1J7mL0l8Rk0J9J6n0K5kK1j8j1J6J2Kj4j3
5728fK3k6NJ8j8M3l4j8J0QJ5k2OMOkj4J3Mj8oK0Kk2Pj2L8J0n0j5N0J4m3oL0lj
5765A0J7l1rJ1OJ1J4l7k8N2l1OK8j3j5J4j3J1RlJ6Qm2QKJ3K0j6%m6K1Mj3LK5r
$$ plain form
5801 3 4 -17 -9 -18 -26 22 9 -24 12 -1 4 12 7 2 14 7 5 -31 -16 -14 13 29 -23 3 3 24 4 21 0 -25 22 11 10 7 15 26 26 31 -6
5840 -6 -4 16 16 -11 -2 -13 6 30 2 18 0 -3 10 22 1 -11 24 -16 -14 13 -18 -5 16 -22 -2 18 15 3 -1 -23 15 7 4 6 20 1
5876 1 12 -19 21 20 -8 20 10 12 9 -7 0 14 9 -8 6 23 -23 3 -13 -15 1 9 9 -6 17 32 2 2 21 -6 12 -4 -11 4 6 -1 3
5913 3 1 7 -12 20 17 -7 13 -9 3 6 -17 25 -1 -8 -9 -9 17 13 6 -1 -5 -8 -33 14 -14 -16 29 -7 2 34 11 -19 19 6 1 0 -4 -27 14
5952 14 -17 18 -3 -12 12 -8 -8 41 -2 -25 -1 -8 19 11 -11 -16 1 -11 -30 28 -10 -43 30 -11 -1 3 0 21 7 15 36 -7 -15 -29 -4
5987 -4 23 26 -3 9 -10 5 22 -8 -6 6 12 -4 6 -11 9 -13 28 15 -22 -12 -3 18 -24 -10 -12 -2 -21 4 -19 -24 -17 -25 8 9 14 7
6023 7 13 -36 -6 19 -19 0 62 10 -5 15 -10 -4 7 -8 -3 13 15 -2 1 9 16 -12 -26 13 0 -5 -6 -11 -30 -20 20 8 -11 -1 -15 22
6059 22 -26 6 34 3 -13 -20 27 5 -16 -6 21 7 21 -15 4 -13 -24 -5 -36 6 1 0 5 -9 -2 12 -8 33 -19 -15 13 -12 -6 15
$$ packed form
5801CJk1QrqM8j3l3L6j3NQnnJ2pkl6J5KK7J6n2K6%K1k0J7k1k5M7j1jlQJ1%Nl7
5840fKK0%k7Rj1J9K4k8J6j8lJ3J2k1j2L5m0KK7l1J3K1l8K0K0lj2mk2L8qlKJ4j9
5876AJ1l1M0jk8K8j0Klj6PJ4nj7J4J7m6K6j6kJ6Q%j5K3J5l0%J9k7J8j6pJ5KpM
5913CkOj9L2lk4K0k2J2Lk3M2k6pj%K6mppmlk5M7k8kM5l6RL2k3l0L8j3njmk3M1
5952A4l1L5k1rK4k0%M9m3k3K4pK7qk2nJ7j2j9N8l8l3P3m1J0MlK1j4QK1m3qj4K5
5987dK7Lk9J2j9J5J7l0KJ2Oj6J0j7K0k2M1j3l7J0RK1m2J4kJ0j9K5k3nPqL3JNp
6023GOm9L0K5l8J9O2n2j5K0k5OJ1j5NJ6Kj7LQPk8j4L9j3njnj9J0M0j2j9J0j4L7
6059B2m8L2K8l1j6pM7k2k1J0K7j4J4l6J9j7j1J9l1M2njNj4PJ4k0M1n2MK8k5OK1
$$ plain form
6093 15 6 -7 2 1 -19 -15 5 -4 -9 -24 30 -16 10 23 -11 -7 3 -14 15 0 -11 4 30 -6 13 2 32 12 -1 -36 36 -12 -17 -5
6127 -5 8 -3 -5 -10 -14 -16 1 -8 -13 13 -6 7 12 22 -16 20 4 30 -14 11 -17 12 -2 -7 -23 2 -10 -30 -16 13 15 1 21 2 -9
6162 -9 10 -10 22 -21 27 30 -8 -12 0 21 27 10 -17 12 13 -7 3 4 10 21 -23 -1 -13 17 7 -9 10 3 18 -2 38 -10 -9 13 -10
6197 -10 -1 -20 -35 9 -4 3 26 0 13 4 -16 16 2 -18 4 -31 9 -18 -23 -8 -6 -1 7 -7 -11 -3 14 -26 0 -1 -8 -23 -27 8 0 4 -3 13
6235 13 6 1 4 17 -23 27 -1 17 -3 40 -1 -13 25 -25 10 0 12 9 18 12 15 5 16 8 -1 19 9 -16 25 12 -25 1 1 -13 -5 1
6271 1 8 22 -5 -6 12 23 -11 19 7 15 -18 14 -12 7 -21 -20 -6 -5 28 17 -9 -2 -15 5 12 7 -20 17 -11 -6 -13 -9 18 15 -16 10 -5
6308 -5 5 -16 25 -8 -34 11 -22 -3 -4 -7 18 2 32 9 37 35 -18 13 -18 -5 -10 5 16 8 -17 4 -3 12 -18 5 6 29 -6 -33
6342 -33 -24 -7 32 -19 -10 4 -10 -3 -2 13 1 8 18 7 16 2 -18 0 12 13 -7 29 -13 14 -16 -30 -19 4 12 5 30 10 7 -8 17
$$ packed form
6093A5rj3Rjk0MK0rnj5N4m6K6J3l4MJ0j7K9j5j1J5K6l6J9j1L0k0j3l5P2m8nJ2
6127eJ3j1knmkJ7rnK6j9J3NJ0l8L6j6K6m4K5k8K9j4nj6K5j2k0J4K9Kj4K0j9j1
6162iJ9k0L2m3M8Ll8mJ2K1Oj7k7K9Jk0J0JOJ1m4K2j2L0j0j6J9pJ5k0M0m8JK2k3
6197a0Rj9j5M4j3PK3k6J3rk0L2j4k0K2l5M0k7nJ5KNQj4mQJ7m0K6jpj5mL5qMpJ6
6235A3pnLJ3m0N0k8J8k0M3m1j2L8n0L5j0J2lRoLj0J1qrK0j0k5M1j3l7K6%j4QO
6271APJ4k7jJ8J1l4L0j2Ql3L2k6J9k8JJ4JL3j1k6Pj3K0Pnk7L7k8NpMK7ll1K6j5
6308eJ0k1M1l3k6M5l3J9jlK5j6L0k3K8kn3L1l1J3nJ5J1qk5K1pJ5l0K3JK3l5k7
6342c3RJ7L9n1RJ4j4PJJ5j2PJ0j1Rj4k0J8J2Jk0L6m2K7l0j4J1K3QpK5k0lj5K5
$$ plain form
6377 17 17 -15 8 -16 7 -16 1 15 -13 25 -20 -20 11 20 -14 -18 34 11 41 -32 -1 7 4 -11 22 -9 6 18 10 16 -4 4 -10 11 11
6412 11 7 -2 40 11 29 20 -7 -21 -1 2 -43 12 7 -3 2 -1 -3 4 9 -1 3 6 3 22 17 -15 -17 -15 -21 -15 14 19 -15 -13 5 6 -23 14 -6 3 -15
6453 -15 13 -2 -9 11 -6 23 7 -27 10 4 -20 12 -3 -4 -16 20 -27 3 3 28 6 19 -9 14 16 6 -1 20 -7 -1 -10 -17 2 -17 3
6488 3 3 6 -32 18 -12 22 -11 23 1 -5 30 -23 9 15 32 12 12 15 9 -10 14 -25 -10 -2 -11 13 11 25 -12 17 11 -12 -11 23 0 -19 3
6525 3 10 3 -9 -7 -41 13 -7 10 19 19 4 -2 -13 12 11 -9 -17 20 8 21 8 20 37 8 -8 -2 -42 -3 17 9 -3 -3 -17 26 2 -20
6561 -20 20 -6 -28 -16 -6 2 9 -5 11 23 -5 -1 -12 11 5 15 10 -2 -5 -15 -7 1 -4 10 -1 1 5 0 -24 1 10 13 -1 12 16 -23 27 20
6599 20 3 2 4 3 17 -17 7 0 2 -16 -11 12 21 16 -12 2 -4 -22 -21 3 -10 -11 -9 7 19 16 0 -11 17 16 13 8 5 0 -22 0 -16 -11 -10 2
6639 2 2 -16 -13 -1 9 -3 -3 -20 1 3 14 5 4 -8 18 17 11 42 -1 22 0 27 7 17 6 -1 16 2 -25 -1 -6 -12 15 19 4 21 -20
$$ packed form
6377A7%l2K3k4K3k3J7J4k8L8m5%L1Rl4mN2k3L0p3L1Qlj5L3l1J5J2qOk0Qj4K1%
6412A1mrM2k9J8rk7j4K0Lm5N5nj0NlkPNj0MLlJ9nl2kKoOK9Nl4KJ8Jk9L7k0Rj8
6453a5K8j5pK0j7K9j6l4L7ok4L2j5jj2L6m7L0%K5k2J3k8K3Kj0pK1k7OrpJ9j9K0
6488C%Ll8N0l0L4l3L4k2oL5n3L2OJ7k0%Loj9K4l9J5QrK4kJ4l7K9ok3JL4k3j9K2
6525CPpj2Kl4N4k0J7R%j5oj1K5jk0qL7j2J3j3J2J7k9j6Om0L9K0qj2%j4M3k4k2
6561b0M0k6k2J2J0QPj4J6J2k8Mj1K3oJ0nj2lj0QQnJ4j1KMnk4K5RLj4J3Ml9N0p
6599B0j7jKjJ4l4K4pKj8NK3Rnk8J4oj8JK4j3jKJ6J2lj6j1K8jlnlnk2K2j6NJJ2
6639B%j8LJ2J0j2%j7K1KJ1rjj2K6joL1m3K3k2K7k0J0j1pJ7j4k7K4noK7Mj5J7m1
$$ plain form
6676 -20 21 -18 9 6 21 6 15 14 6 1 -9 0 10 -2 -7 3 -8 -18 1 2 -28 -4 -3 -1 5 -26 0 7 -2 5 11 -11 -8 -12 17 8 19 -7 -10 11
6716 11 1 4 3 12 -34 7 -10 15 4 27 0 -19 29 -2 1 20 5 27 4 -15 6 -18 -10 27 26 20 12 -9 0 18 9 24 -29 -1 1 -6
6752 -6 4 -13 -9 24 7 17 -12 5 -14 1 15 3 10 -7 10 11 10 20 -30 -4 10 -7 8 16 5 -6 -6 -1 -8 -12 6 -24 16 -15 4
6787 4 -5 5 -32 1 7 29 -3 18 4 -4 1 -6 2 12 10 -18 1 -5 -8 -4 -3 4 -3 -9 -1 20 0 17 7 10 24 -12 3 10 -15 2 -2 -15 28 11
6827 11 6 6 -2 11 6 12 16 8 9 -12 4 2 -4 4 -20 8 6 -1 -16 26 3 0 -13 6 3 -24 1 -14 -1 -17 2 -14 -7 12 -19 -24 1 5 -9
6866 -9 -10 19 10 26 -9 -3 6 -6 -17 6 -13 37 -6 12 27 -4 23 -7 -12 7 -20 3 15 -9 4 -16 -8 18 -19 2 7 20 -12 19
6900 19 27 19 2 38 0 -10 10 -6 -6 2 43 36 6 19 33 -2 -3 13 7 0 12 -8 3 -35 10 5 23 -7 -16 -17 8 -1 15 -9 -11 4 -18
6937 -18 -4 -13 -25 -6 1 -4 28 -7 34 8 23 18 29 3 -15 19 6 7 -12 23 11 24 23 -6 13 -7 16 13 17 29 7 10 -1 -2 -3 0
$$ packed form
6676b0M1l9K7lJ5j5Rjqnj0RJ0j2nJ0j1j0J9Jl0K4JKOl1K6PrPOk2LmK9rJ1k6lK1
6716A1j0LjRm6M1j7K5j1K3k7j9M8l1LJ9j5K2k3j9K1k4QL7joqk1RJ8rJ5n3K8Kp
6752fJ0j7ML3j7J0k9J7j9J5J4j2Pj7J7JjJ0n0K6J4j7J5Qj1j1%NpmJ8l0M0l1J9
6787DrJ0l7L3OK2l2K1j4qNpQJ0kk8J9olMJPpoQK1k0J7j0LJ4l6J5Pk5J7mj3M3j7
6827A1n%qJ3nOMqJk1J6koQk4K8kpj5M2k3lj3J9lk7K5j5J3j6J9j6PJ9l1nK5Mj4
6866ijK9rJ6l5ORj2j1K3j9N0m3J8J5l1K7l0nJ9k7K3J2k4J3k0QK6l7K1NJ3l2L1
6900A9Qqj7L6l8j0K0j6%QM1pl0J3J4l5jJ6opJ2k0J1l8M5nJ8l0rjK5rJ6k4kJ5k2
6937a8J4rj2J9PnL2l5M1k6J5nJ1k6j8L4j3Jj9L5j2J3jk9J9k0K3lMJ2k2Lj1jjL
$$ plain form
6973 0 -4 22 -22 13 -4 -14 19 -17 7 20 1 -1 3 -4 9 -3 -18 -14 -21 8 7 12 -15 0 -10 9 34 0 -1 -12 -5 -4 -10 16 18 -6 9
7010 9 -5 18 10 14 -10 -18 -22 14 22 19 -3 8 -10 -4 -12 15 -4 13 22 0 4 7 14 -15 4 16 23 -7 5 22 24 19 -12 -18 13 40 0 2 -28
7049 -28 10 5 -5 -6 -15 12 0 -26 24 5 10 -1 -25 -5 -6 3 -3 5 -13 -33 -16 2 -10 13 28 18 6 8 10 2 -15 -1 16 30 6 9
7085 9 14 5 -4 17 -13 19 10 19 22 20 -37 -10 -38 6 9 2 21 -30 -14 -17 5 12 16 1 17 -6 -8 -9 -11 9 13 24 5 -13 5 -10 27 -4 31
7124 31 22 14 8 -1 23 8 10 17 -5 -17 -2 1 13 -6 17 -14 14 13 -6 20 -6 12 1 -17 -9 20 -9 2 -6 -16 -6 18 -9 -16 -11 -10 11
7161 11 16 13 1 5 7 19 0 7 10 1 13 16 17 -42 -3 8 15 22 11 24 2 5 -37 -12 -45 17 14 15 0 23 -3 12 9 -6 1 9 8 17 8 -14
7201 -14 -5 6 6 -10 -1 -16 0 -12 -13 1 -9 2 -11 -4 -3 -6 9 -8 -11 -10 -8 -10 -27 40 22 16 -9 -11 -12 9 -6 -14 -13 -13 4 -3 24 8 3 -9
7241 -9 -7 11 -6 -8 26 5 23 1 13 8 -7 -7 1 -26 10 7 -3 18 -23 10 -8 -15 -29 19 5 1 15 -14 13 5 11 8 0 -5 -20 -2 -26
$$ packed form
6973@mK6m4L5j7j0L3l6K4J3j9kMpJ3j2j5MpK9jNk7J5j0J9K5l4jj1PJoK6Kk4J5
7010Ij4K3qMk4qmL6Qlk2J1j8OqK7j9J7Rk2MLPk9J9J2Pl0J2J7Knl1oL1K7m0Kl0
7049b8L8nj0jrK7j2k6N0j9Nj1k4K0jRoQj8k0J7J8j2K3J5j0j2KKqj7J4J7J4k4L
7085INrrK1l0L2rRLkn7K7k8M4LpJ9n1J6lK2PMj5J6k3kjkK0MJ1j9j8J8j5L7l1L5
7124C1rqorK4j5KPk2j2J5LJ2j9K3l1K8jj9K6k6J8j1j8QK9k9J1qj0J0K4k7pNJK1
7161A1Nlj2MKJ2j9PLrJ2LJn9L9J1PPj1J3k2Lm2K5l3O2lJj5K3k6J5lj5PQjRrk2
7201a4RJ1%j6Rj5J6j2jJ4j0J1j3PJlJ5j7lJKkj7O7j8ok5kjK1j5qJ%J7pK7j6nj2
7241iKJ8j7kL4k1J8k2J2nj5%Qk7L6lj0K1m1L3j8pj4M8j4mJ4k9K7qOlqnj5J8k4
$$ plain form
7278 -26 -14 -16 16 -12 33 11 -4 -2 14 -25 11 19 -19 10 -29 6 18 -3 -14 16 4 23 -5 16 -17 -24 7 -11 15 30 -8 13
7310 13 24 7 14 -23 -15 4 -8 30 -10 -11 -11 -33 -13 1 -2 9 9 14 -8 -9 23 13 5 -4 -2 -2 -5 4 14 -4 -1 -25 13 3 -11 -4 22 9
7348 9 -13 5 2 0 -3 -8 -5 -4 -6 8 -5 -7 -24 9 8 6 -19 25 24 -9 22 -15 35 2 14 37 -5 18 -10 16 2 16 11 28 -4 12 14
7385 14 15 9 23 2 -12 12 24 -3 0 3 13 -3 -4 16 -10 3 -14 -11 -15 -19 -3 9 14 35 19 -1 29 14 -1 1 11 -7 21 8 19
7420 19 20 1 -6 7 -7 -8 34 19 26 15 11 4 -18 -6 -31 25 8 25 -1 -4 -5 -2 -1 -35 -16 7 -12 20 -16 -6 -13 26 18 1 19 13 -6
7457 -6 -9 29 3 3 26 3 -17 -19 21 -24 15 -3 16 22 0 3 0 16 -22 -1 -16 16 3 -21 32 0 12 4 -8 -6 10 3 -21 -16 22 -11
7493 -11 -2 12 -5 7 -2 -16 -11 7 11 7 15 3 -18 29 4 6 15 -15 12 7 -10 -16 0 -5 -10 -33 8 5 14 17 -10 3 -17 -2 34 21 -7 -7
7531 -7 13 8 -18 30 -3 -18 2 9 23 -7 12 -19 -3 1 -6 -23 5 8 1 19 -14 -15 -5 -4 24 -22 23 -3 17 -7 -16 9 16 -19 5 -6
$$ packed form
7278b6J2kL2k8M5k2j5KJ6l9L6Ql8K9l9L5J2k1j1L0j2J9k8K1l3pL1j8K6J5l8K1
7310A3J1j7Pl7QJ9j2L8m0j%k2K0J4lJ1%Nk2jL2j0qrK%lRJ0j8Lk4L8j0j4PK6j3
7348Ik2J8lklnLJkJ4j3kj7L3jkk5M4jl3L1l7N0l3J2K3m2K3k8K6j4J4nJ7l2J6K
7385A4JoJ4k1j4K4J2k7LLJ0j6jK0k6J3j7LmmJ6J2NK1j6k0L0j5j5KJ0j8K8j3J1
7420A9Jj9pJ3j4jM2j5Pj1mpk2J2k5N6j7J7k6ljLJl4J9K3j9L2l6J0pL9qj7J8oj9
7457flL8k6%K3k3k0kM0m5L9j8J9Ok2LlJ6l8K1j5L2j3k4N3l2J2qj2KJ6pk4NL8l3
7493a1RJ4j7J2rj4NJ8MmQj2k1M7k5KRl0K7nj7oJ6nnk3M1lRLk7J3k0J5L6j3k8%
7531gK0nk6M8l3j5K0PJ4l0J9l1J6Mpj7K8LpJ8l3jJ0JK8m6M5k6K0k4rK5Pl5K4j1
$$ plain form
7567 -6 -19 13 -6 10 3 8 -10 -9 -23 8 -19 -21 -33 6 -7 -2 5 18 -5 -32 14 21 11 3 -3 16 -14 21 -11 -6 -2 25 4 12 1 9 7 -11
7605 -11 5 -11 -37 5 -21 9 9 -5 25 -2 26 20 17 -9 -24 9 -2 2 14 -21 -7 -8 21 10 19 3 12 4 -3 0 -9 -32 -2 -3 -31 -8
7641 -8 -10 0 -3 0 16 8 24 -18 -5 8 -3 8 -6 16 16 20 -18 23 -5 -30 0 7 1 -6 -21 6 1 17 5 13 14 7 14 2 3 3 20 5 -13
7680 -13 1 -1 -5 15 8 -10 2 -2 10 -16 18 -14 -26 -9 -3 9 -17 -36 -15 5 4 -14 25 36 -11 -1 30 -10 -3 25 9 10 18 14 -10
7715 -10 -11 -1 2 1 -23 19 -4 -44 1 21 39 -17 20 -5 9 32 -9 1 25 -5 -20 -8 15 4 -11 4 16 17 -13 -5 -16 12 8
7748 8 6 -7 6 36 9 6 -10 33 -10 11 -11 9 -8 -16 -6 -27 26 11 11 -8 4 7 33 1 16 5 -27 -18 -7 -15 22 1 1 -7 -5 18
7784 18 4 1 15 12 23 24 -2 -24 -2 -5 13 -8 33 26 9 -7 11 16 7 12 8 17 2 20 2 -10 10 10 12 0 -21 27 3 -3 -18 20 -5
7821 -5 26 -26 14 18 13 32 -17 9 20 10 2 13 -12 -14 -8 -14 1 0 32 10 -7 -5 -14 1 12 9 -4 18 18 12 -3 4 6 -8 5 8 0 -1 15
$$ packed form
7567fj3L2j9J6pNj8Jj4L1k7kj2L9j3NPJ3k3k7M6Pj0qoJ9l0L5l2NMK7k1Qj1Qkj8
7605a1J6j6k6M2k6L0%j4L0k7K8olk6j5L3j1MJ2l5J4jK9j1Rj6RqpLrk3L0jk8K3
7641hkJ0lLJ6qJ6m2J3J3j1J1j4K2%Ml8M1k8k5L0Popj5K7nJ6j2QJpPj2J%J7j5j8
7680a3J4kmK0pj8J2mJ2k6L4l2j2J7OJ2k6j9K1K0jj8L9J1m7J0L1m0PK8j6JQmk4
7715a0jJ0Ljk4M2k3m0M5K0J8n6L7k5J4K3m1J0K4l0j5J2K3j1j5J5J2Jl0Qj1K8m
7748Hkj3J3L0k7lj6M3m3K1k2K0j7qJ0k1N3j5%j9J2LK6l2J5j1l2RJ1qL7k1%qKK3
7784A8j4lJ4lJ1Jk6k2K2lJ8k1M1pj7j6J8NrNmRj5J8j8j2K0%Kj2k1M8k4oj5L8k5
7821eL1n2M0MnJ9m9K6J1j0qJ1k5kOoJ5jL2k2j7KrJ5J1lj3K2%oj5PKj4J3LqjJ6
$$ plain form
7860 15 -20 13 -13 -4 -1 12 19 -15 -17 2 6 1 11 14 13 21 12 28 -14 6 1 -1 11 -21 -30 27 -23 1 -3 10 14 -15 15 -7 24 12 11 -7
7898 -7 -25 -16 -8 -10 4 14 15 8 5 6 15 -10 0 45 -6 14 -1 -3 9 -5 5 3 -6 -5 10 -21 13 32 8 23 16 -15 -33 -8 12 39 -2
7935 -2 -35 13 -9 6 -4 10 13 14 -1 1 34 6 7 44 10 6 21 27 22 -27 8 10 -16 -5 -3 21 3 -10 -7 -9 -2 5 3 -5 -4 0 1 -9 3 2
7975 2 10 4 -4 -2 -8 1 -1 10 14 -13 -5 -25 -19 -1 10 -5 -6 0 10 12 -32 -5 -22 0 6 -15 17 -3 13 -2 4 27 12 -7 4 11 -10 16 15
8014 15 16 -2 -1 8 11 22 -23 23 -7 5 -5 -24 13 -13 -16 7 -8 7 -3 30 23 -3 -16 6 -27 -4 -1 -40 -34 -14 -12 -13 2 13 -4
8049 -4 8 -10 0 22 13 -20 -17 3 -32 -1 -12 -14 -7 12 8 7 -7 -41 -17 12 3 28 11 19 -4 -10 8 8 -3 3 -24 9 5 19 1 -10 32
8086 32 -7 4 18 5 15 -26 22 -14 16 -1 -5 12 -5 -17 16 -14 -14 -6 -13 -20 1 4 -11 3 -14 8 19 -22 -7 8 -2 -7 -10 4
8120 4 -10 -5 -5 1 10 5 -3 -16 27 11 -4 3 -23 7 -4 8 -4 19 -15 21 3 8 -8 1 8 -7 -2 10 -5 12 -23 -8 1 23 -10 -24 -12
$$ packed form
7860A5l5L3k6RLJ3Pl4kJ9MnJ0LjQrJ6m2K0nkJ2l2rN7n0K4mJ3Mk9L0k2L1j2jj8
7898gj8RQkJ4J0JplJRk5J0M5n1K0j5kJ2j4J0krJJ5l1L4J9k4J5pl1j8K5K0K7m1
7935bl3M8k2J5j0J4LJj5KL3k8JL7l4mJ5Onm9L5Kk6J1KK4j8j3LkPPkqJMJj0J2j
7975BQoqKoRkJ1Mk7Qk0OJ8J1j5jOJ0Km4K7j7K2Ok1L2k0J6j5OK3j5j9J1Pk1K6j
8014A5Jj8JRLJ1m5M6l0J2j0j9L7k6lK3j5J5j0L3pk6j3K2l3K3Ll9OK0KjJ5J1j7
8049dJ2j8J0K2rl3LK0l5L1j1kPJ9mjj4l4K4K9rK5j7Qk3oJ8%j1Ok7L3mJ4j8j1M2
8086C2l9J1J4j3J0m1M8l6L0j7mJ7j7j2L3l0%QppK1Lj5J4j7K2J1m1J5J5j0nlJ4
8120Dj4N%ORnqj3M3j6j5Pk6L0j1J2j2K3l4L6j8Nj6RPj5NJ2j5J7l5J5RK2l3j4J2
$$ plain form
8157 -12 4 7 9 30 -13 -12 -17 -4 -2 6 18 20 12 15 2 22 24 0 -7 4 4 -10 3 27 -14 10 12 -11 -3 11 2 7 3 -1
$$ packed form
8157a2J6LKK1m3JnJ3KQJ2KqLj3K0Kk4pJ1%j4J3K4m1K4Kk3QJ4rNmm
8191a
##END NTUPLES=NMR FID
##END=
