##TITLE=1H_Pr NCS-2
 200.13MHz, CDCl3,
 8 sc
 
 12.8.2025
##JCAMPDX= 6.0         $$ Bruker NMR JCAMP-DX V2.0
##DATA TYPE= NMR FID
##DATA CLASS= NTUPLES
##ORIGIN= UXNMR, Bruker Analytische Messtechnik GmbH
##OWNER= pz
$$ XWIN-NMR		Version 3.5
$$ Tue Aug 12 14:50:58 2025 Russian Standard Time (UT+4h)  she@DPX200
##.OBSERVE FREQUENCY= 200.1313
##.OBSERVE NUCLEUS= ^1H
##.DELAY= (6, 6)
##.ACQUISITION MODE= SIMULTANEOUS
##.ACQUISITION SCHEME= undefined
##.AVERAGES= 8
##.DIGITISER RES= 18
##SPECTROMETER/DATA SYSTEM= spect
##.PULSE SEQUENCE= zg30
##.SOLVENT NAME= CDCl3
##.SHIFT REFERENCE= (INTERNAL, CDCl3, 0, 14.3821)
##AUDIT TRAIL= $$ (NUMBER, WHEN, WHO, WHERE, WHAT)
$$ ##TITLE= Audit trail, XWIN-NMR		Version 3.5
$$ ##JCAMPDX= 5.01
$$ ##ORIGIN= Bruker BioSpin GmbH
$$ ##OWNER= she
$$ F:/spectra/data/she/nmr/H-C/1/audita.txt
$$ ##AUDIT TRAIL=  $$ (NUMBER, WHEN, WHO, WHERE, WHAT)
(   1,<2025-08-12 14:49:52.79 +0400>,<she>,<DPX200>,
      <created by zg, POWCHK disabled, PULCHK disabled
       configuration hash MD5:
       00 E9 B6 7A A2 85 ED C7 34 08 36 98 17 FE 4E 26
       data hash MD5: 16K
       7B 8F 3E E8 8C AA AA C8 A7 B6 98 09 71 23 59 FA>)
$$ ##END=
$$ 
$$ hash MD5
$$ 37 11 2D 5A 58 CD EE B7 04 26 99 DE B2 EE 57 8E
##$RELAX= 
##$RELAX= 
##$RELAX= 
##$RELAX= 
##$RELAX= 
##$RELAX= 
$$ Bruker specific parameters
$$ --------------------------
##$DU= <F:/spectra>
##$EXPNO= 1
##$NAME= <H-C>
##$PROCNO= 1
##$TYPE= <nmr>
##$USER= <she>
##$AMP= (0..31)
100 100 100 100 100 100 100 100 100 100 100 100 100 100 100 100 100 100 
100 100 100 100 100 100 100 100 100 100 100 100 100 100 
##$AQSEQ= 0
##$AQ_mod= 1
##$AUNM= <au_zg>
##$AUTOPOS= <>
##$BF1= 200.13
##$BF2= 200.13
##$BF3= 200.13
##$BF4= 200.13
##$BF5= 200.13
##$BF6= 200.13
##$BF7= 200.13
##$BF8= 200.13
##$BYTORDA= 1
##$CFDGTYP= 0
##$CFRGTYP= 5
##$CHEMSTR= <none>
##$CNST= (0..31)
1 1 145 1 1 1 1 1 1 1 1 1 1 1 1 1 1 1 1 1 1 1 1 1 1 1 1 1 1 1 1 1 
##$CPDPRG= <>
##$CPDPRG1= <>
##$CPDPRG2= <>
##$CPDPRG3= <>
##$CPDPRG4= <mlev>
##$CPDPRG5= <mlev>
##$CPDPRG6= <mlev>
##$CPDPRG7= <mlev>
##$CPDPRG8= <mlev>
##$CPDPRGB= <>
##$CPDPRGT= <>
##$D= (0..31)
0 0.7 0 0 0 0 0 0 0 0 0 0.03 0 0 0 0 0 0 0 0 0 0 0 0 0 0 0 0 0 0 0 0 
##$DATE= 1754995792
##$DBL= (0..7)
120 120 120 120 120 120 120 120 
##$DBP= (0..7)
150 150 150 150 150 150 150 150 
##$DBP07= 0
##$DBPNAM0= <>
##$DBPNAM1= <>
##$DBPNAM2= <>
##$DBPNAM3= <>
##$DBPNAM4= <>
##$DBPNAM5= <>
##$DBPNAM6= <>
##$DBPNAM7= <>
##$DBPOAL= (0..7)
0.5 0.5 0.5 0.5 0.5 0.5 0.5 0.5 
##$DBPOFFS= (0..7)
0 0 0 0 0 0 0 0 
##$DE= 6
##$DECBNUC= <off>
##$DECIM= 32
##$DECNUC= <off>
##$DECSTAT= 4
##$DIGMOD= 1
##$DIGTYP= 9
##$DL= (0..7)
0 120 120 120 120 120 120 120 
##$DP= (0..7)
150 150 150 150 150 150 150 150 
##$DP07= 0
##$DPNAME0= <>
##$DPNAME1= <>
##$DPNAME2= <>
##$DPNAME3= <>
##$DPNAME4= <>
##$DPNAME5= <>
##$DPNAME6= <>
##$DPNAME7= <>
##$DPOAL= (0..7)
0.5 0.5 0.5 0.5 0.5 0.5 0.5 0.5 
##$DPOFFS= (0..7)
0 0 0 0 0 0 0 0 
##$DQDMODE= 0
##$DR= 18
##$DS= 0
##$DSLIST= <SSSSSSSSSSSSSSS>
$$ [...]
##$SUBNAM0= <"">
##$SUBNAM1= <"">
##$SUBNAM2= <"">
##$SUBNAM3= <"">
##$SUBNAM4= <"">
##$SUBNAM5= <"">
##$SUBNAM6= <"">
##$SUBNAM7= <"">
##$SUBNAM8= <"">
##$SUBNAM9= <"">
##$SW= 18.0517328524113
##$SWIBOX= (0..15)
0 0 2 0 0 0 0 0 0 0 0 0 0 0 0 0 
##$SW_h= 3612.71676300578
##$TD= 16384
##$TD0= 1
##$TE= 0
##$TE2= 300
##$TE3= 300
##$TEG= 300
##$TL= (0..7)
0 120 120 120 120 120 120 120 
##$TP= (0..7)
150 150 150 150 150 150 150 150 
##$TP07= 0
##$TPNAME0= <>
##$TPNAME1= <>
##$TPNAME2= <>
##$TPNAME3= <>
##$TPNAME4= <>
##$TPNAME5= <>
##$TPNAME6= <>
##$TPNAME7= <>
##$TPOAL= (0..7)
0.5 0.5 0.5 0.5 0.5 0.5 0.5 0.5 
##$TPOFFS= (0..7)
0 0 0 0 0 0 0 0 
##$TUNHIN= 0
##$TUNHOUT= 0
##$TUNXOUT= 0
##$USERA1= <user>
##$USERA2= <user>
##$USERA3= <user>
##$USERA4= <user>
##$USERA5= <user>
##$V9= 5
##$VALIST= <valist>
##$VCLIST= <CCCCCCCCCCCCCCC>
##$VD= 0
##$VDLIST= <DDDDDDDDDDDDDDD>
##$VPLIST= <PPPPPPPPPPPPPPP>
##$VTLIST= <TTTTTTTTTTTTTTT>
##$WBST= 1024
##$WBSW= 4
##$XGAIN= (0..3)
0 0 0 0 
##$XL= 0
##$YL= 0
##$YMAX_a= 600754
##$YMIN_a= -639385
##$ZGOPTNS= <>
##$ZL1= 120
##$ZL2= 120
##$ZL3= 120
##$ZL4= 120
##$ABSF1= 10
##$ABSF2= 0
##$ABSG= 5
##$ABSL= 3
##$ALPHA= 0
##$AQORDER= 0
##$ASSFAC= 0
##$ASSFACI= 0
##$ASSFACX= 0
##$ASSWID= 0
##$AUNMP= <proc_1d>
##$AZFE= 0.1
##$AZFW= 0.1
##$BCFW= 1
##$BC_mod= 2
##$BYTORDP= 1
##$COROFFS= 0
##$CY= -3
##$DATMOD= 1
##$DC= 2
##$DFILT= <>
##$DTYPP= 0
##$F1P= 0
##$F2P= 0
##$FCOR= 0.5
##$FTSIZE= 0
##$FT_mod= 4
##$GAMMA= 1
##$GB= 0.15
##$INTBC= 1
##$INTSCL= 1
##$ISEN= 128
##$LB= 0.25
##$LEV0= 0
##$LPBIN= 0
##$MAXI= 10000
##$MC2= 0
##$MEAN= 0
##$ME_mod= 0
##$MI= 1.114404
##$NCOEF= 0
##$NC_proc= 0
##$NLEV= 6
##$NOISF1= 3.799351
##$NOISF2= 2.8
##$NSP= 1
##$NTH_PI= 0
##$NZP= 0
##$OFFSET= 14.38212
##$PC= 1
##$PHC0= -1568.631
##$PHC1= 22.59228
##$PH_mod= 1
##$PKNL= yes
##$PPARMOD= 0
##$PSCAL= 0
##$PSIGN= 0
##$REVERSE= no
##$SF= 200.129724274929
##$SI= 16384
##$SIGF1= 3
##$SIGF2= 2
##$SINO= 400
##$SIOLD= 16384
##$SREGLST= <1H.CDCl3>
##$SSB= 0
##$STSI= 0
##$STSR= 0
##$SW_p= 3205.1282051282
##$SYMM= 0
##$S_DEV= 0
##$TDeff= 0
##$TDoff= 0
##$TI= <>
##$TILT= no
##$TM1= 0
##$TM2= 0
##$TOPLEV= 0
##$USERP1= <user>
##$USERP2= <user>
##$USERP3= <user>
##$USERP4= <user>
##$USERP5= <user>
##$WDW= 1
##$XDIM= 8192
##$YMAX_p= 0
##$YMIN_p= 0
$$ End of Bruker specific parameters
$$ ---------------------------------
##NTUPLES= NMR FID
##VAR_NAME=  TIME,          FID/REAL,        FID/IMAG
##SYMBOL=    X,             R,               I
##VAR_TYPE=  INDEPENDENT,   DEPENDENT,       DEPENDENT
##VAR_FORM=  AFFN,          ASDF,            ASDF
##VAR_DIM=   8192,          8192,            8192
##UNITS=     SECONDS,       ARBITRARY UNITS, ARBITRARY UNITS
##FACTOR=    0.0002768,     1,               1
##FIRST=     0,             0,               0
##LAST=      2.2672688,     0,               0
##MIN=       0,             -639385,         0
##MAX=       2.2672688,     600754,          0
$$ Real data points
##PAGE= N=1
##DATA TABLE= (X++(R..R)), XYDATA
0@%%%%%%%%%%LlQj6J6j6K4l2L6m4N2o0P2q8J03j19J40j61J82k08K37k72L11l51
$$ 0 0 0 0 0 0 0 0 0 0 0 3 0 8 -8 8 -8 16 -16 20 -24 28 -32 40 -48 55 -64 76 -85 97 -111 126 -146 165 -186
34a86L96m45N00n61O24o95P74q59R52j054J166j288J421j565J726j903K093k305
$$ -186 210 -235 265 -296 328 -367 407 -452 500 -554 612 -676 745 -820 906 -997 1096 -1209
52a209K543k807L103l438L820m260M772n378O112p020Q172r689J1788j4891J9936
$$ -1209 1334 -1473 1630 -1808 2012 -2248 2524 -2854 3258 -3762 4410 -5279 6509 -8382 11554
67A1554k9513N3841k29044m46223O14442N42322l45618n20934J07025L32453M8932
$$ 11554 -17959 35882 -193162 -639385 -24943 517379 171761 -349173 -242148 90305 139237
78A39237j05759n373j60977j04623K61324K90428k39223m43386J21257M75004
$$ 139237 33478 28105 -132872 -237495 23829 314257 75034 -368352 -247095 227909
88B27909L7603l97516j37859K42678J41704m8096p7083n0614n9982Q7442J99713
$$ 227909 265512 -132004 -269863 -27185 114519 66423 -10660 -61274 -121256 -33814 165899
99A65899n9762k62068j2199K62772N9972k04739o0819J24775J3520r3004R0479
$$ 165899 106137 -155931 -168130 94642 154614 -50125 -110944 13831 27351 -65653 24826
110B4826Q8301j81707j22771K24841J98563k24703k46157J88236K61421j36018
$$ 24826 113127 -68580 -191351 33490 232053 7350 -238807 -50571 210850 74832
120G4832k22760J14627J45112j16544q0911J64753N0281k47255n3440L00239R6745
$$ 74832 -147928 -33301 111811 -4733 -85644 79109 129390 -117865 -171305 128934 225679
131B25679l13325j56672K73458J97348j91486j97185J14449J39858m8721m1023
$$ 225679 -87646 -244318 29140 226488 35002 -162183 -47734 92124 43403 2380
141B380K1509m2483m6435J05641J01645j29623j55623J10273J79406p6371j64200
$$ 2380 23889 -18594 -65029 40612 142257 12634 -142989 -32716 146690 70319 -93881
152i3881L1106J20373j1708p4025K8406K4781o0103R881R1572k0251j09416K3769
$$ -93881 -62775 57598 45890 -28135 271 25052 -35051 -25170 66402 46151 -63265 -39496
164c9496J16006k3896j20667L8918J24086o5313j29860P2982J38799o8600j55894
$$ -39496 76510 52614 -68053 -29135 94951 29638 -100222 -27240 111559 42959 -112935
175a12935M9425J51574l2419j26181K4138Q0846l1077l5826N9519J8975j04868
$$ -112935 -63510 88064 55645 -70536 -46398 34448 3371 -32455 27064 46039 -58829
186e8829k1747J47957M4231j61131p8009J39511J02919r7978j09067N0123P6701
$$ -58829 -80576 67381 111612 -49519 -127528 11983 114902 16924 -92143 -42020 34681
197C4681j9148k1376L466l5236j4745P1932N2210q4386q9352P8674J15198n3687
$$ 34681 15533 -5843 -2377 -37613 -52358 19574 71784 -12602 -101954 -23280 91918 38231
209C8231j11316K5354Q9629k156o1522P98K9582k0917m084M3265j1043o3660Q741
$$ 38231 -73085 -47731 41898 39742 -21780 -20982 8600 -12317 -16401 26864 15821 -47839 -39098
222c9098P4662L030p8469q793P7654P125o4180M258N4350j0109n0327J8633N6625
$$ -39098 35564 38594 -39875 -48668 28986 36111 -28069 -23811 30539 20430 -29897 -11264 45361
235D5361k5479o1760K7057N6989k3394m8339J3784L6009j4312k4627K6410J1453
$$ 45361 19882 -41878 -14821 42168 18774 -29565 -15781 20228 5916 -18711 7699 19152
247A9152m1378m41N4760M683n9127j4631O2578K6427n6557k6999M1590J7885k3680
$$ 19152 -22226 -22667 32093 36776 -22351 -36982 25596 52023 -4534 -31533 10057 27942 4262
260D262p721J0773q465j5285K5422K3417m1021l3992M4169M2045l2914m7728K0743
$$ 4262 -3459 7314 -1151 -16436 8986 32403 -8618 -42610 1559 43604 10690 -37038 -16295
273a6295N0158j0367l8434P410J9523n954k050Q728q764k2074J0171L5630j2427
$$ -16295 33863 23496 -14938 -7528 11995 6041 3991 12719 3955 -18119 -7948 27682 15255
286A5255m8320Q757M6923j085m1346q458L6224J1202k6967m261J8068l343p139
$$ 15255 -33065 -24308 22615 21530 -19816 -28274 7950 19152 -7815 -12076 5992 2649 -4490
299d490R987M710j5089r806K1296J2889k8800j4237K6224J1626k2152j3463J7795
$$ -4490 5497 10207 -4882 -14688 6608 19497 -9303 -23540 2684 14310 -7842 -21305 -3510
312c510J4113j8706q869K0165L145j5634K388J4211j291j3647K624J6792o975
$$ -3510 10603 -8103 -16972 3193 6338 -9296 -6908 7303 6012 -7635 -5011 11781 4806
325D806j7089R973J2750j1230j1841P072J3143r050j4309J1756J2062j1818o679
$$ 4806 -12283 -2310 10440 -790 -12631 -5559 7584 -1466 -15775 -4019 8043 -3775 -10454
338a0454R944P097o573n926J0086M783j1712P79J2131n032j0764K586J1034j859
$$ -10454 -510 6587 14 -5912 4174 8957 -2755 -1976 10155 5123 -5641 -3055 7979 6120
352F120j5426R93J5283l013j1139J635O474K533l912J26M403m266n26J0757j187
$$ 6120 -9306 -8313 6970 3957 -7182 -5547 927 3460 -452 -326 4077 -189 -715 10042 8855
367H855j1547o65J0684N875j1564j1405R542Q767o235n683j271K037L553P11J364
$$ 8855 -2692 -3357 7327 13202 1638 -9767 -225 8542 2307 -3376 -4647 -2610 943 1654 3018
382C018n163n048R103R270o291p661r5P769M930n367n268j307n99O175M123q786
$$ 3018 -2145 -7193 1910 11180 4889 -2772 -2867 4902 9832 4465 -803 -2110 -2709 3466 7589 -1197
398a197q429J594J0426N844j0922q028N950O585L481n96o847m088L474J0931O440
$$ -1197 -9626 -8032 2394 8238 -2684 -10712 -4762 1823 5304 4708 -2139 -6227 -2753 8178 14618
413A4618j5224j4901J0813J7319j004j7638j1636J1752J3743k897r384o713J217
$$ 14618 -606 -15507 -4694 12625 11621 -6017 -17653 -5901 7842 4945 -4439 -11152 -9935
426i935J0871O710k380j0955q701J2184J8821m031j9748r710J4961K0545o634
$$ -9935 936 7646 5266 -5689 -14390 -2206 16615 12584 -7164 -16874 -1913 18632 11998
439A1998k3722n718J4703J5169m922j8515l160J0248P714L263o003r761j881J0289
$$ 11998 -11724 -17442 -2739 12430 7508 -11007 -14167 -3919 3795 7058 1055 -8706 -10587 -298
453b98J6499k015k5030q150K4037J9946j3844k9258o16K8489R235j9210j3663
$$ -298 16201 14186 -10844 -18994 5043 24989 11145 -18113 -18729 9760 18995 -215 -13878
466a3878M274J0419M439n68k011j2380o787K2019K0543j6435l2015J485L9130
$$ -13878 -9604 815 5254 4686 2675 -9705 -16492 5527 26070 9635 -22380 -20895 18235
479A8235J7415l4829l0285J7151L3328K982k7865j7898J2261J6145N404l689j6223
$$ 18235 35650 821 -29464 -12313 21015 23997 -3868 -21766 -9505 6640 12044 8355 -7868
492g868j2817J1401K7198R609l1501l1181K2174M6611K189m7060k9626L3681M5846
$$ -7868 -20685 -9284 17914 27523 -3978 -35159 -12985 33626 35815 -11245 -40871 -7190 38656
505C8656j1859m5042j2904K7341K5555o762k0997j0174k04J5345K3716l924l5650
$$ 38656 26797 -18245 -31149 -3808 21747 14985 -6012 -16186 -16390 -1045 22671 18747 -16903
518a6903j8992L3682M5223j7340n6950o343N1992K7616l3561l8897J1835L2248
$$ -16903 -35895 -2213 43010 25670 -31280 -37623 14369 41985 8424 -30473 -18638 13610
530A3610J902j4849o800m554j509J2413J8357o684l3964o705L9287K4532k8253
$$ 13610 15512 663 -6137 -10691 -12200 213 18570 11886 -22078 -28783 10504 35036 6783
543F783l7508R816M2586Q521l4166j9443J5667K0402j26j4238o833J071J348R887
$$ 6783 -30725 -20909 21677 30198 -3968 -23411 -7744 12658 12532 -1706 -8539 -7468 -6120 3767
557C767Q818j1506k0076J297K9120J6551k8135l0287J7708L8561N74l6920j6129
$$ 3767 12585 1079 -18997 -17700 11420 27971 -164 -30451 -12743 25818 26392 -10528 -26657
570b6657K7194K2333j3740j8496j13P837K704L010L960j0964j8005J1993L0547
$$ -26657 537 22870 9130 -9366 -9479 -1642 1062 4072 8032 -2932 -20937 -8944 21603
583B1603k560l4593j2416L2439K7282k2565l1409R002K6966L635j7316r580O594
$$ 21603 19043 -15550 -27966 4473 31755 9190 -22219 -13217 13749 17384 68 -9512 -2918
596b918M284m14N072k690j2456l417J3592J3565q442k1023J182K1296Q826j2484
$$ -2918 1366 952 6024 3334 -9122 -12539 1053 14618 6176 -14847 -13665 7631 16457 3973
610C973j5929M212J6543L291j0091p221J218N502J910q60l08o646n701R097J1405
$$ 3973 -11956 -7744 8799 12090 1999 -5222 -4004 1498 3408 2548 2240 -4406 -10107 -1010 10395
625A0395n014j6472l142J8866J1519j4612j4069P157J3659J021r582m056L991
$$ 10395 5381 -11091 -14233 4633 16152 1540 -12529 -5372 8287 9308 -274 -4330 -339
638c39K63J317N078n104r685O17J2261O286j3885j1793J0722J4244m170j1802
$$ -339 -76 1241 6319 1215 -8470 -7853 4408 10694 -3191 -14984 -4262 9982 5812 -5990
652e990k296R603O351n121m433J07J714L421M45l739k805J47L367K041l889k874
$$ -5990 -8286 1317 7668 2547 -1886 -1779 -65 3356 3801 62 -2743 -2596 771 2812 -1077 -3951
668c951Q51K052K896j238l988M58L122K483p9m125j87M163Lo13j215j273L03l77
$$ -3951 -3100 -1048 1848 610 -3378 -2920 202 2685 2606 -1519 -1706 2457 2460 1847 632 -641 -338 -715
686g15J946R74m853k626M674L604k246m458m85N818J889l589j139N26J704K581
$$ -715 1231 2205 -2648 -5274 -600 3004 758 -3700 -4185 1633 3522 -67 -1206 -680 1024 3605
702C605p70k028k185K22M903M39o451k603L623M201q42n726j007M578K121n34
$$ 3605 2835 807 -1378 -1156 3747 4186 -2265 -4868 -1245 2956 2114 -3612 -4619 -41 2080 1546
718A546k734k063L367L993r34l260k443L410M304l036m227j00K784K351k792l587
$$ 1546 -1188 -3251 116 4109 3175 -85 -2528 882 5186 2150 -2077 -2177 607 2958 166 -3421
734c421J340J980O61m64k602K43K871Q01j85j870m55L051R30k460n79M25O30J86
$$ -3421 -2081 -101 560 96 -2506 -2263 608 1409 1224 -646 -1101 1950 2880 420 -159 266 896 1082
752A082k027j75N47m13M04j98r82L95O54O88o4j128J015J735q75n68O90K85N95
$$ 1082 -945 -1120 -573 -986 -582 -780 -1762 -1367 -713 -25 -89 -1217 -202 1533 658 90 780 1065 1660
771A660r04j000J120o05q13K57q42l26Q66o14J02J00R0J494n73r73J359Q63j92
$$ 1660 756 -244 876 271 -542 -285 -1127 -1453 -587 -1201 -1099 -999 -909 585 12 -961 398 1261 1069
790A069Oj263J324N61j626K09k76l84P21j277j12J65l63N98L20j333J314R60m92
$$ 1069 1075 -188 1136 1697 71 280 4 -380 341 -936 -1048 -883 -1246 -648 -328 -1661 -347 613 121
809A21j70n67J643J178j678o26J453n92M28q23j494Q59K91n29L48j981K33K218
$$ 121 -49 -616 1027 2205 527 -99 1354 762 1190 367 -1127 -268 23 -506 -158 -2139 -1906 312
827C12l98o81n42Q76J654l49r26R88k24l00J310o37p70p55p4J573o55k396P32
$$ 312 -86 -767 -1309 -433 1221 872 -54 934 710 410 1720 1083 313 -442 -516 1057 402 -1994 -1262
846a262J131o78K28l6M1K83n70J580O63j464j60J520K05k10j067M44J44j553P99
$$ -1262 -131 -809 -581 -617 -576 -293 -863 717 1380 -84 -244 1276 1481 1271 204 648 792 -761 38
865C8J338k299j655J179J918J51k965m93L340L21r01Q0L6l4O11R14L84k430j371
$$ 38 1376 -923 -2578 -1399 519 670 -2295 -2788 552 873 -28 52 88 54 665 1579 1963 -467 -1838
884a838L169J086k481j937%K442N51k208n27O86k7J850K62j835o47J301K728o44
$$ -1838 1331 2417 -64 -2001 -2001 441 992 -1216 -1743 -1057 -1084 766 1028 -807 -1454 -153 2575 1931
902A931k592L76J387m09P25k87k439j074J875L129j500n821R29O157M46m622j787
$$ 1931 -661 -285 1102 693 1418 1131 -1308 -2382 -507 2622 1122 -4699 -3770 2387 2833 -1789 -3576
919c576L475L141k673r94K631j643k024L116K977l054n796J503Q114j077q419
$$ -3576 -101 3040 367 -627 2004 361 -1663 1453 4430 1376 -4420 -2917 5197 4120 -4299
934d299j089N775L457l458m163J724K539k14P81N87k357j105K503L540j039n339
$$ -4299 -5388 387 3844 386 -3777 -2053 486 272 1053 1640 -717 -1822 681 4221 3182 -2157
950b157j187M461K547j280m566k919M818M264k629n087p06N346K773m337j785
$$ -2157 -3344 1117 3664 2384 -2182 -5101 -283 3981 1352 -3735 -4441 905 3678 -659 -2444
965b444K840J62j040J762K522k632o375L639Q882k751j0603l08J0026L023r203
$$ -2444 396 558 -482 1280 3802 1170 -5205 -1566 7316 4565 -6038 -6346 3680 6703 -2500
980b500m721P225L913n248j659M277J62m580J064P260m21r240m81R516K275p668
$$ -2500 -7221 4 3917 -1331 -2990 1287 1449 -3131 -2067 5193 4772 -4468 -4949 4567 6842 -826
996h26n512N309O349l442n031M34K546J010p36j003J63o59L15K566L22j608j904
$$ -826 -6338 -1029 5320 1878 -3153 -2719 -173 837 101 -902 -739 -1398 -1083 1483 1805 197 -1707
1013a707J67L939K707m687n107K457O961r4q798k234Q338K876o597l236M875L161
$$ -1707 -1540 2399 5106 419 -4688 -2231 4730 4636 -4162 -6396 1942 4818 -1779 -5015 -140 3021
1029C021m550j633O352kp649J003Q941J125j0116l575J0477M884r493n707O721
$$ 3021 -1529 -3162 3190 3188 -4461 -3458 5483 6608 -3508 -7083 3394 8278 -1215 -6922 -201
1044b01M545l913m565L563K926m847o22N771J65n656j282O023L381n176l927L576
$$ -201 4344 431 -4134 -571 2355 -2492 -3114 2657 2822 -2834 -4116 1907 5288 112 -3815 -239
1060b39L576j091k398j899R69K157L49j765k050O69L223j466j894J746Q58j790
$$ -239 3337 2246 -152 -2051 -1082 1075 1424 -341 -2391 -1722 1501 35 -1859 -113 745 -1045
1076a045K6K643J457m407k159O076K418n757l577M947M312m501n170M229L953
$$ -1045 -1019 1624 3081 -1326 -3485 2591 5009 -748 -4325 622 4934 433 -4737 -508 3445
1091C445m875k807M693K448m524k510N258L191n945k207N824K355m830k328L919
$$ 3445 -1430 -4237 456 2904 -1620 -4130 1128 4319 -1626 -3833 1991 4346 -484 -2812 1107
1106A107K202l879j624L843j16l422L0K788J63l190O6L455n93k890J749J673j108
$$ 1107 3309 -570 -2194 1649 1533 -1889 -1859 929 1092 -2098 -2032 1423 830 -2060 -311 1362 254
1123B54q07J571O63k204n81K980J38l840M08K941l31l132j32L256o59l235J622
$$ 254 -553 1018 1681 -523 -1104 1876 2014 -1826 -1418 1523 1192 -1940 -2072 1184 525 -2710 -1088
1140a088L190k162k448K445K752j609l570K731L388k796k877K548K093k708k094
$$ -1088 2102 -60 -2508 -63 2689 1080 -2490 241 3629 833 -2044 504 2597 -111 -2205
1155b205K383K066l667j536L902O58l421m50L348Q97l535l59L856P1l673R95K940
$$ -2205 178 2244 -1423 -2959 943 1601 -1820 -2270 1078 1975 -1560 -1919 1937 2008 -1665 -670 2270
1172B270q43k598M56L107j656l136J896K293k334j955K045J985j936j862K418
$$ 2270 1427 -1171 -715 2392 736 -2400 -504 1789 -545 -2500 -455 1530 -406 -2268 150
1187A50J912k691j141K981P00k423k10K092L91k794k71L130j152k626Q44J974
$$ 150 2062 -629 -1770 1211 1911 -512 -722 1370 1761 -1033 -1304 1826 674 -1952 -1108 866
1203H66n61k453R92K683j588k202K463J764j793j479J979J704k316j618K788J195
$$ 866 305 -2148 -1156 1527 -61 -2263 200 1964 171 -1308 671 2375 59 -1559 1229 2424
1219B424l503k44K187O33k568j138K706L68k710J43K953n04k109L80K649o42k758
$$ 2424 -1079 -1323 864 1497 -1071 -2209 497 865 -1845 -1702 1251 747 -1362 -982 1667 1025 -1733
1236a733J287K714j512k152J607J358j214k007J437J705k215j438K505N02j893
$$ -1733 -446 2268 756 -1396 211 1569 355 -1652 -215 1490 -725 -2163 342 844 -1049
1251a049m03J556Q97j827m65K793J3k353L82K012l85j764R5K029j228j792J240
$$ -1049 -1452 104 1001 -826 -1291 1502 1515 -838 -456 1556 1171 -593 -498 1531 303 -1489 -249
1268b49J286j457j241J095J330r72j420J629J397k021j67J761L76j581n12J963
$$ -249 1037 -420 -1661 -566 764 -208 -1628 1 1398 -623 -790 971 1347 -234 -746 1217
1284A217M61k200j11J944q06j430p2J331j1j830L89J969p92j548J589J119r62
$$ 1217 1678 -522 -633 1311 505 -925 -997 334 323 -1507 -1118 851 59 -1489 100 1219 257
1301B57o70J96K086j211j505J479O72j558l31N85M86p13q71J322K38j555o7J029
$$ 257 -413 -217 1869 658 -847 632 1304 -254 -585 0 486 -227 -1098 224 462 -1093 -1160 -131
1319a31K91o14j61J096K39j260N24J210r38o02O84M12n32r13O56Q23j681p2J087
$$ -131 160 -454 -615 481 720 -540 -16 1194 256 -346 338 750 218 -695 -39 784 -897 -969 118
1338A18k18l81n08R00J020j103k30J207j72o15k0P57R9j061l38J260q1j233J92
$$ 118 -100 -481 -989 -89 931 -172 -402 805 633 18 -2 755 854 -207 -545 715 634 -599 -407
1357d07N20K1q00K02K54j5m95M72O44n17lM01J09L74q87L42N08o37j1K48n88M9
$$ -407 113 134 -666 -464 -210 -225 -720 -248 396 -121 -124 277 386 760 -127 215 723 86 75 323 -265 -216
1379b16J08j56J09q74K37J125o61l39N14O1L69l01n40J077q0m85P85l28k46j28
$$ -216 -108 -264 -155 -1029 -792 333 -328 -667 -153 -92 277 -24 -564 513 433 -52 733 405 159 31
1399C1l30P82k04j069k1O39L65n00n85K37J058k86j87J09k33R50l40l67M85l55
$$ 31 -299 483 279 -790 -811 -172 193 -307 -892 -655 403 117 -70 39 -194 756 416 49 534 179
1419A79o60J56N84L52j013n07J073K86r71m28P87L54m3p58K68J041j22n20J60
$$ 179 -481 -325 259 611 -402 -909 164 450 -521 -949 -162 192 149 -609 -341 700 578 58 218
1438B18L27K35p12m26R42N5j123j06N53N50p10j361J393J180j279p29R57O53L01
$$ 218 545 780 68 -358 584 639 -484 -590 -37 513 -197 -1558 -165 1015 -264 -993 -36 617 918
1457I18j667N18J357m64j089L54J333n63j346n8J641m2k167J23J383N93j577r72
$$ 918 -749 -231 1126 662 -427 -73 1260 697 -649 -707 934 892 -1275 -1152 231 824 -753 -1725
1475a725J729J039j332m67J014Q72o92j111R33J119j231q00P62J058p47j323J98
$$ -1725 4 1043 -289 -756 258 1130 438 -673 260 1379 148 -652 110 1168 421 -902 -704
1492g04J368m57j130K02N73R18q69j221J506Q65q48p31Q11Q59m69j355N72J384
$$ -704 664 207 -923 -721 -148 770 -99 -1320 186 1051 203 -528 283 1142 673 -682 -110 1274
1510A274r27j507L45J530K3j802l56K041j42j452N8J158Q62j650m20J860M34j714
$$ 1274 347 -1160 -815 715 738 -1064 -1420 621 479 -973 -915 243 1105 -545 -965 895 1329 -385
1528c85l89J512K65r34j279J253J115j493o48O39J051r41p04M07J304q03p26P32
$$ -385 -774 738 1003 69 -1210 43 1158 -335 -983 -344 707 -234 -938 -531 773 -30 -756 -24
1546b4O86j77k91n00R38L9p21j54M06M14m33o30K24Q44p17p11K26Q04j77n83j45
$$ -24 662 485 194 -306 632 671 -50 -204 202 616 183 -447 -223 621 -96 -807 -581 223 46 -537 -682
1567f82J263j7j207R4J209M84j164n46J343K02j185n19Q40M98p97r27J248N59
$$ -682 581 564 -643 -549 660 1144 -20 -566 777 979 -206 -725 115 613 -184 -1111 137 696
1585F96j160l37R18M49p74n55J150N15j037n9Q48L45j007j77J98K69l90l77M60
$$ 696 -464 -801 117 566 -208 -763 387 902 -135 -194 654 999 -8 -185 13 282 -108 -485 -25
1604b5K87p23K66M4j10p4R3L21j56K87J99j21k70K10M57l57k13k30O94n50m21
$$ -25 262 -461 -195 -151 -261 -335 -242 79 -77 210 409 288 18 228 685 328 115 -115 579 29 -392
1625c92N19K67q65k17P08L41n31n13P30K59n37j25N83N12n75m52O82M36r26k68
$$ -392 127 394 -471 -688 20 361 -170 -683 47 306 -231 -356 227 739 164 -288 394 830 -96 -364
1645c64O99K65j084J14L73J93o75l23R26j16m58L09N89K13p50j01P40J03r77M89
$$ -364 335 600 -484 -370 3 196 -479 -802 124 8 -450 -141 448 661 -89 -190 550 653 -324 165
1665A65R2o7k96K93nj40o18L83K97o91K16O65j42l59P0M75O9p14M78L70n23j27
$$ 165 257 190 -106 187 182 42 -576 -193 104 -587 -371 294 152 -207 -137 338 407 -307 171 541 18 -109
1687a09N44l4J9j296P61M73q18j71M73O5j18l74N76L40o12m8P03O2p29L27L55
$$ -109 435 401 420 -876 -115 358 -460 -631 -158 -93 -211 -585 -9 331 -281 -329 374 436 -293 34 389
1708C89Q8m56j08O88k78o66n9O87k82l77O4K70k58l25N35N81p03j01O20J35q3
$$ 389 477 21 -87 601 323 -343 -402 285 3 -374 -310 -40 -298 -623 -88 493 -210 -311 309 444 361
1729C61l39L02J74o68Q5L92j9n03j7J81L06o79j42O97l54n6J42K80j02k35K17
$$ 361 22 324 498 -170 -85 307 288 -215 -232 -51 255 -424 -566 131 -223 -279 -137 143 41 -194 23
1750B3O66l95n50N08k62L83n44R8J47l86k18N58j9n60K02L81L2l02J74L89Q6o34
$$ 23 689 294 -256 252 -10 373 -171 -73 74 -312 -530 28 9 -551 -349 32 64 -238 -64 325 411 -223
1772b23J87L29j14j02J89K05l25n23L21M32o02k69L36J63j80j86J82N70l47n69
$$ -223 -36 293 179 77 266 471 146 -377 -56 376 -226 -495 -159 4 -176 -362 -180 390 43 -526
1792e26P20K60l40l7o0N91j38m72L57k43j15J74k44Pm6l31K93k80k5L50K92k92
$$ -526 194 454 114 77 17 608 470 -2 355 112 -3 171 -73 -66 -112 -443 -150 -430 -455 -105 187 -105
1814a05L18m0J20l1k59L88n6j44j30L06j53p71J96L79J10n64j00O79l28j28K8
$$ -105 213 173 293 262 3 391 335 191 61 367 214 -557 -361 18 128 -436 -536 143 -185 -313 -285
1835b85M51K30k04k61L98j63k85K98J22k0n86J49K93j56m53J67L31k56j67L11
$$ -285 166 396 192 -69 329 166 -119 179 301 281 -305 -156 137 -19 -472 -305 26 -230 -397 -86
1855h6j63k3J36K69j6k46K04M15l52J05j17M02k03n80L54J9k87l87K56K53r3k92
$$ -86 -249 -272 -136 133 117 -129 75 490 138 243 126 528 325 -255 99 118 -169 -556 -300 -47 -140 -432
1877d32K77L52l41j58M65Q6k50j92N61J73l90k85L23K20k48j21J28k08k17l17
$$ -432 -155 197 -144 -302 163 249 -1 -193 368 541 151 -134 189 409 161 40 168 -40 -257 -574
1897e74M84p5J86k01k9j94M53J29p7k38K38K01J16m21Q0p0j21O3j02J71J22n47
$$ -574 -90 -165 21 -180 -209 -403 50 179 102 -136 102 303 419 -2 78 8 -113 -50 -152 19 141 -406
1919d06K89K72l00o59N22L95M5l71K19M56j67j82j5K87L4o67K38N60p46k64M3
$$ -406 -117 155 -145 -804 -282 113 158 -213 6 462 295 113 98 385 419 -248 -10 550 -196 -460 -417
1940d17K79O4l16j77Q10n1j44j73J03J30o1l47L27L87k85k23K26O4K7p65L51O03
$$ -417 -138 -74 -390 -567 243 192 48 -125 -22 108 47 -300 27 414 129 -94 132 196 223 -542 -191 412
1962D12k09p48K02M59J65m47p43J047M3l17J43L98J60J21p21J4M62j83n83K75
$$ 412 203 -545 -343 116 281 -166 -909 138 181 -136 7 405 565 686 -35 -21 441 258 -325 -50
1982e0N53m02m92j32Q58n01j11J4K41K96m41k71R38j68k35n21Q81o3k42o55N78
$$ -50 503 101 -391 -523 335 -166 -277 -263 -22 274 -167 -438 500 332 97 -424 457 394 152 -503 75
2003G5N32m97n24J03M88l50k17p9N37j64n22L96N56L0q76J81O90K82q68J05L46
$$ 75 607 110 -414 -311 177 -173 -390 -469 68 -96 -618 -222 334 364 -512 -331 359 641 -227 -122 224
2024B24Q0m56q5L39J52o49k30O85k09j1k5J94k5K63n42M92r1j39NL26J68m03k15
$$ 224 304 -152 -237 102 254 -395 -625 60 -149 -160 -185 9 -16 247 -295 197 106 -33 -28 298 466 63 -152
2047a52L5J29K45k74l13oN58m69p4j59M51L34p10M6O93l00k20k6R18l22o98pO60
$$ -152 -117 12 257 -17 -330 -336 222 -247 -321 -480 -29 305 -405 -359 334 34 -186 -212 706 384 -314 -321 339
2070C39Q3r14K04K30J54m52r7N27k20l72j5Q29k42l25j68O66L0q8j2L60n09q3
$$ 339 422 -492 -288 -58 96 -356 -453 74 -146 -518 -533 296 54 -271 -439 227 257 169 157 517 8 -75
2092g5J39J31n64k8J92J84l94K29J28m9q3L61j80k6j76M77J09m51J70K61r1m44
$$ -75 64 195 -369 -397 -205 -21 -415 -186 -58 -107 -190 171 -9 -35 -211 266 375 -76 94 355 264 -180
2114a80M8L29K90p35q7N48n9p44L44K82k6k58J0L64K57q31K95N81j78l42l0M70
$$ -180 -132 197 487 -248 -335 213 154 -590 -246 36 10 -248 -238 126 383 -448 -153 428 250 -92 -122 348
2136C48j35o04J41M69k04n19M1O49j42l33K25J90k00j65L82Q3k57J48M8J23m57
$$ 348 213 -391 -250 219 15 -504 -463 186 44 -289 -64 126 -74 -239 143 226 -31 117 165 288 -169
2157a69P7O46k24n20j06M97k44p1J6K28l60r6L01N00m06k50L48N40n20m54M66
$$ -169 -92 554 330 -190 -296 201 -43 -114 -98 130 -230 -326 -25 475 69 -181 167 707 187 -267 199
2178A99L39m19k91N09R8o24j77L09K74m55j09L53J06l57R8K10P6qj00P15l98o36
$$ 199 538 119 -172 337 435 -189 -366 -57 217 -238 -347 6 112 -245 -147 63 139 131 31 746 348 -288
2200b88M64K56l01r2J30K76o92j38M99J23n00j92K50J55n1k65P18q4l69K31M86
$$ -288 176 432 131 39 169 445 -247 -385 114 237 -263 -455 -205 -50 -101 -366 352 268 -101 130 616
2221F16n63q7l1M81j49o03K55K22r8l76L27J19j72j3j53O13n51O3K76R9l89lJ57
$$ 616 53 -34 -65 416 267 -336 -81 141 43 -333 -6 113 -59 -72 -225 388 -163 -100 176 275 -114 -117 40
2244D0O05o89J22R3r7l12L25J7l72J04QN34n63j12J98K51k72m7K10K17j11m45
$$ 40 645 -44 78 171 74 -238 87 104 -268 -164 -156 378 -185 -297 -99 152 -120 -167 43 260 149 -296
2266b96M56J32m10j67L50J00n65Q1K45M96o89k67O22j61l10K21K55J96m07J46
$$ -296 160 292 -118 -285 65 165 -400 -319 -74 422 -267 -534 88 -73 -383 -162 93 289 -118 28
2286B8Q2j92j33L30K04j52j51J64j10j27k39J33N24n94j08M67r6j21l04N65r8
$$ 28 110 -82 -215 115 319 167 16 180 70 -57 -296 -163 361 -233 -341 126 30 -91 -395 170 72
2307G2l76J86M57j84l23J2M78k71k15Q5M44m44l65L14L43l19l27L38L61m29O9
$$ 72 -304 -118 339 155 -168 -156 322 51 -164 -79 365 -79 -444 -130 213 -106 -433 -95 266 -163 -94
2328i4L80l63J85k18M81J45n90J29J59p9k30J6L93l37l47J52J10N9l29K15K07
$$ -94 286 -77 108 -110 371 516 -74 55 214 135 -95 -79 314 -23 -370 -218 -108 -49 -378 -163 44
2349D4j82J29K68K13m47j42L55J95o41J99J82j46l89j85P00O1n70J92K22o7k64
$$ 44 -138 -9 259 472 25 -117 238 433 -208 -9 173 27 -362 -547 153 214 -356 -164 58 -9 -273
2370b73qN68j77k72J51J26o6k59j47L61R2k15J41K1L7j87L10k71j26K04p9j24
$$ -273 -281 287 110 -162 -11 115 49 -210 -357 4 96 -119 22 43 80 -107 203 -68 -194 10 -69 -193
2392a93O1j79J76K6J74J66J0j24q5K5K07j33j7k39M14n28P1J85o4p6l05J47L82
$$ -193 -132 -311 -135 -109 65 231 241 117 32 57 264 131 114 -125 289 -239 -168 17 -47 -123 -428 -281 101
2415A01l71n4L97K90q5l42J35K12k19q8J91k03J78m14J44K53k32j12K28k2K7l57
$$ 101 -270 -324 73 363 278 -64 71 283 64 -24 167 -36 142 -272 -128 125 -107 -219 9 -13 14 -343
2437c43N3K72jR1k20Q5J72J09j60j46L43o6j45j16J18R3l24K09M6j94k12P1K50
$$ -343 -290 -18 -19 72 -148 -63 109 218 58 -88 255 189 44 -72 46 139 -185 24 70 -124 -336 -265 -15
2460a5J31j00k10K69J87o0k43J23N3Rl20J19L71n42RJ15Q1K09l29N3K62j90k18
$$ -15 116 16 -194 75 262 202 -41 82 135 144 -176 -57 314 -228 -219 -104 -23 186 -143 -90 172 -18 -236
2483b36l2K27K59r2nq6L15l60K67q5j13R0l15N1J50k73j74N03R1j53k84J22L97
$$ -236 -268 -41 218 126 121 35 350 -10 257 172 59 149 -166 -115 35 -238 -412 91 182 29 -255 -133 264
2506B64l5m32L29%J04j83j73K65J80l91k3L42p2j42k62J21N22m42j71m6J07K93
$$ 264 229 -203 126 126 230 47 -126 139 319 -72 -95 247 175 33 -229 -108 414 -28 -199 -245 -138 155
2528A55j80m9K9M97p35N56m67N41r9k63K40l3l46NrJ29J82l03j60L42m05K06j5
$$ 155 -25 -74 -45 452 -283 273 -194 347 248 -15 225 192 -154 -149 -158 -29 153 -150 -310 32 -373 -167 -182
2551a82K28J38n80L89K34Q8l15K79k05j29P1l08J61L62l75K37K7j90J10j6k50
$$ -182 46 184 -396 -7 227 315 0 279 74 -55 16 -292 -131 231 -144 93 120 -70 40 24 -226
2572b26K48l09M55N4l17M44m08Q5J72r7l8Q0k24L10k13r4P7K68j38n00K28L29
$$ -226 22 -287 168 222 -95 349 -59 26 198 101 63 143 -81 229 16 -78 -1 267 129 -371 -143 186
2594A86j25L6l72N70L8m90J27L37J16n05j47O54k56j91J51k81K67k96k42N62k20
$$ 186 61 97 -275 295 333 -157 -30 307 423 -82 -229 425 169 -22 129 -152 115 -181 -423 139 -81
2615h1k61J79J35R0J84k49K86l37j3K71J86k41J1k78K43l15N9k2K9j59K05Q6j73
$$ -81 -342 -163 -28 62 246 -3 283 -54 -67 204 390 149 160 -118 125 -190 -131 -153 -124 -283 -78 8 -165
2638a65j04K01M10m97J89j14K85j84j32L53r4j34L5M26l38k80o2L72l89M1j56
$$ -165 -269 -68 342 -155 34 -80 205 21 -111 242 148 14 49 475 137 -143 -205 167 -222 -181 -337
2659c37K55J33n52M01L03k12k60J70L11L5l23K35p3K05l32q9K48n5j90K3K5J31
$$ -337 -82 51 -501 -100 203 -9 -269 -99 212 247 -76 159 86 291 -41 -130 118 63 -127 -104 -79 52
2681E2l80NO6O7k63M92K10m72J64R7R1k94K2L27nm18K52O3M4l34J19L05k56l01
$$ 52 -328 -323 -257 -190 -453 39 249 -223 -59 38 129 -165 -143 184 179 -239 13 76 120 -214 -95 210 -46 -347
2705c47K96K14o8p8K03o6j01l22M33J21k94p5J89%j79K6Q9j45q5K56k96qM09l84
$$ -347 -51 163 95 17 220 154 53 -269 164 285 -9 -84 105 105 -74 -48 41 -104 -189 67 -229 -237 172 -212
2729b12j12N27l30K88q9J25l97K44k24M73m48L67K02n54K03k31R7k30j09M25Q2
$$ -212 -324 203 -127 161 72 197 -200 44 -180 293 -155 212 414 -140 63 -168 -71 -301 -410 15 97
2750I7k24j3J64j9k36R6Q5L50n88L94J59L24o20n00M92J32m63J17N00j88k30j44
$$ 97 -127 -140 24 5 -231 -135 -50 300 -288 106 265 589 -31 -531 -39 93 -370 -253 247 59 -171 -315
2772c15M23j30l13L20M4K08l31M09%k74j55J47K00m79J70L13k25j61R3o2j4k99
$$ -315 108 -22 -335 -15 29 237 -94 315 315 41 -114 33 233 -246 -76 237 12 -149 -56 -118 -132 -431
2794d31K79N7L07o49L10M31k87k05L78N5k18J32J03k66K59l21K71rn00J7M77k14
$$ -431 -152 -95 212 -437 -127 304 17 -188 190 245 27 159 262 -4 255 -66 205 196 -304 -287 190 -24
2816b4mj60K18J71m40K97p6N35o41K61j14Q7N7J40k58R6n50N46j61j28R4j43J67
$$ -24 -28 -188 30 201 -239 58 -18 517 -124 137 23 110 167 307 49 145 -405 141 -20 -148 -54 -197 -30
2839c0r1M1L15N9l69n5N05j40k30j64NM59m22K15o3o1O6N2P8m90J16K50j23P9
$$ -30 -121 -80 235 294 -75 -130 375 235 5 -159 -154 305 -117 98 35 -26 40 92 170 -320 -204 46 -77 2
2863Bj5r3L31l73j92M49R9l09K37k41J2K18k39j3J71k13J13J36j43J4j07J12j72
$$ 2 -13 -106 225 -148 -340 109 208 -101 136 -105 -93 125 -114 -127 44 -169 -56 80 -63 -49 -156 -44 -216
2886b16J85R9Q5m91J29L37r6j4l0K84j1k39k26K15k5k92M5J88K52j21l53J17K79
$$ -216 -31 68 153 -338 -209 128 32 18 -12 272 261 22 -204 11 -14 -306 -261 -73 179 58 -295 -178 101
2909A01j69R4J3K66j24j20J02J63k83k57J39K60l3k17j08L00m72J55M2o4J44K15
$$ 101 -68 26 39 305 181 61 163 326 43 -214 -75 185 152 -65 -173 127 -345 -190 -148 -212 -68 147
2931A47k9k15J15k9K89k60O2J63o6k39M20j42m63O5M57j94j29l10L44l9j27K53
$$ 147 118 -97 18 -11 278 18 80 243 177 -62 358 216 -247 -182 275 81 -48 -358 -14 -53 -180 73
2953G3J17l3k2m04J10M00m37N04j28p6k61k5J73R2m4o7K69o19M01l35K51j59K76
$$ 73 190 157 135 -269 -159 241 -196 308 180 104 -157 -182 -9 83 39 -28 241 -378 23 -312 -61 -220 56
2976E6j29K78j13m04L60j37k1K1J51L25o09K71j87L7J0K0K84n51k22N62j9k57
$$ 56 -73 205 92 -312 48 -89 -110 -89 62 387 -222 49 -138 -101 -91 -71 213 -338 -560 2 -17 -274
2998b74K10J95j04K48l60r5M47J9p7n59L49J66K3r6J15n57K64j96J93N9J2k75
$$ -274 -64 131 27 275 -85 -180 267 286 209 -350 -1 165 188 92 207 -350 -86 -282 -89 -30 -18 -293
3020b93K18J98K22n30M67L7l40L3Q0m2o1k19N4K22N4j75k15Q2l62N00n1l2p0L
$$ -293 -75 123 345 -185 282 319 -21 12 92 50 -11 -230 -176 46 100 -75 -290 -208 -570 -70 -121 -153 -223 -220
3044b20K92j63L39m6k66R0J59j37k54J46Q6k2n1K50N5l42R7p4j3J60j06j25K47
$$ -220 72 -91 248 202 -64 26 185 48 -206 -60 26 4 -47 203 258 -84 13 -61 -74 86 -20 -145 102
3067A02k5k57L00j67K90m1j57j76K21J16n20K07l6J56j62R4K58m46K47j20j85
$$ 102 77 -180 120 -47 243 202 45 -131 90 206 -314 -107 -143 13 -149 -55 203 -243 4 -116 -301
3088c01M38r7J84K4k29J61j11j97j45K77J22K33l17j4j11k17N01j85rJ02k19n2
$$ -301 137 40 224 248 19 180 69 -128 -273 4 126 359 42 28 -83 -300 201 16 7 109 -110 -162
3110a62n8J65J84j16J89n7K0j1j84L54o73K75O7l30L18J16j01O7k29L45k83Q0
$$ -162 -220 -55 129 13 202 145 165 154 -30 324 -349 -74 -7 -337 -19 97 -4 63 -166 179 -104 -24
3132b4J08J55k39%j39J51J12R5l05J78J99l67P7kk6J1l98L66J96l25J29J00r3
$$ -24 84 239 0 0 -139 12 124 219 -86 92 291 -76 1 -1 -27 -16 -414 -48 148 -177 -48 52 -41
3155d1j32K15Lj1L6m6K50k81M9J13j13jk38K91r5J07j10L8k54J82k8L57k06p6
$$ -41 -173 42 45 34 70 24 274 -7 42 155 42 41 -197 94 -1 106 -4 34 -220 -38 -66 291 85 9
3179IL7L98n56J55P3J50k23q8j32K93k08o6J13J15J49l82L0M63l89o2K98p3k69
$$ 9 46 444 -112 43 116 266 43 -45 -177 116 -92 -158 -45 70 219 -163 -133 330 -59 -121 177 104 -165
3202a65p2J89L20m34J77r5K01J79l41j8J45j34j61L50k96J13J73J31l45l7O2J95
$$ -165 -237 -48 272 -162 15 -80 121 300 -41 -59 86 -48 -209 141 -155 -42 131 262 -83 -120 -58 137
3224A37m7R2l63L47j72r6K02j01n0p5p9J51J66k72K12m65K85J90k15L60m60J33
$$ 137 90 182 -181 166 -6 -102 100 -1 -51 -126 -205 -54 112 -160 52 -413 -128 62 -153 207 -253 -120
3246a20M83l50k0j41L36j31j22l00M32q4k07M33j19p3j84K04k5O9k7j15J17K0
$$ -120 363 13 -7 -148 188 57 -65 -365 67 -17 -224 209 90 17 -167 37 12 81 54 -61 56 76
3268G6Qq1j50j79K99J39J59m46K42q8mj89J09J79k70L12j51p4J38m0j21J16p2
$$ 76 84 3 -147 -326 -27 112 271 -175 67 -21 -25 -214 -105 74 -196 116 -35 -109 29 -11 -132 -16 -88
3291h8O7lJ13J18r1K28j61j46%Q5J9l78J14j2J11J69k30j13N7M6L1nJ92m66L26
$$ -88 -21 -24 89 207 116 344 183 37 37 122 141 -237 -123 -135 -24 145 -85 -198 -141 -95 -64 -69 123 -343 -17
3316a7J28j74J62K78n29K36m48K13J78l12K71k53K49q8K53k52J3J1J96N5k16M3
$$ -17 111 -63 99 377 -152 84 -364 -151 27 -285 -14 -267 -18 -106 147 -105 -92 -81 115 170 -46 -3
3338cQ6jl6K34l21K66m55J56m0Q3J25k22r7J17K00j21K79j83j0j32R9MQ8J7m4
$$ -3 83 82 46 280 -41 225 -230 -74 -114 -31 94 -128 -225 -108 92 -29 250 67 57 -75 24 28 116 133 89
3363H9k38j98J33K91k69L02j44l3O8P8M3K25m78R0J77Q5n59L72J0q9j41K46K64
$$ 89 -149 -347 -214 77 -192 110 -34 -67 1 79 122 347 -131 -41 136 221 -338 34 44 -45 -186 60 324
3386C24n29K45K20k22J45l87J65n2J06k77K00j26J75J86k59K76j29m30M36j58
$$ 324 -205 40 260 38 183 -204 -39 -91 15 -262 -62 -188 -13 173 -86 190 61 -369 67 -91
3406i1K37k35j21M9L30k46J21j53P3j14M1L17k27J57k36K46r2k07K67l4pO4k3
$$ -91 146 -89 -210 -161 169 -77 44 -109 -36 -150 -109 208 -19 138 -98 148 56 -151 116 82 75 139 116
3429A16r9q5J76J24j37l1r9K78l58p1k03M55J6l59J80p5m2J59J04R7J60l94j9
$$ 116 17 -68 108 232 95 64 -35 243 -115 -186 -389 66 82 -277 -97 -172 -214 -55 49 146 306 -88 -107
3452a07Q2J4K3M7Jr0J92l43q4K7J27j24l1J91j3K94J38j84k56K61P6q5j31J68
$$ -107 -25 -11 12 59 60 -30 162 -181 -265 -238 -111 -235 -266 -75 -88 206 344 160 -96 165 241 156 25 193
3476A93m97L42j06j71N0M91k54l85J9K55j67K25j70K36j78L9r0J22K9p2J81k93
$$ 193 -304 38 -68 -239 -189 302 48 -337 -318 -63 -230 -5 -175 61 -117 -78 -168 -46 -17 -89 92 -201
3498b01K42l03L37j89Q0Q0R9k48J25J12l5K6j45k1PJ43j47j72J94Pj81K31J3l41
$$ -201 41 -262 75 -114 -34 46 145 -103 22 134 99 125 -20 -41 -34 109 -38 -210 -16 -9 -190 41 54 -287
3522b87J22K34N5M1k71jl6P8J20k8qj93J3J56M4K42j77j07K80j33K6j90N3QJ53
$$ -287 -165 69 124 165 -106 -107 -143 -65 55 27 19 -174 -161 -5 39 281 104 -3 277 144 170 -20 33 41 194
3547A94m42L94j71j98K01j64K87l38O2R6J86K67m22k53K12%J94j10R3l2j63m0
$$ 194 -248 146 -25 -223 -22 -186 101 -237 -175 -79 107 374 -48 -301 -89 -89 105 -5 88 56 -107 -147
3569a47L45j80m9L9j30K1j18J16J56r7J12N8k39M8L7N6O8j10j31Kq1J24M4Q0L97
$$ -147 198 18 -31 8 -122 -101 -219 -103 53 -44 68 126 -113 -65 -28 28 96 -14 -145 -143 -224 -100 -56 24 421
3594D21j79k88P6j70J83m0l1k35K88k2j06L10m54N25q6j17m5j0j36k4J51%O5j46
$$ 421 242 -46 30 -140 43 3 -28 -263 25 3 -103 207 -247 278 192 75 30 20 -116 -140 11 11 76 -70
3618g0N0J79K3k37j27K38k32K67j10l0J55Q7j29J14j26o8K24l13P4K98k18j86
$$ -70 -20 159 182 -55 -182 56 -176 91 -19 -49 106 193 64 178 52 -16 208 -105 -31 267 49 -137
3640a37o2M37m71J90J40j18J6k0J91n2l07J96r8m3J23L16k58O7l34J12J48rj34
$$ -137 -199 238 -233 -43 97 -21 -5 -25 166 114 -193 3 -95 -138 -15 301 43 110 -224 -112 36 27 -107
3663a07K21l79M46L1j26j49M9k18L06j00r4K87M7k39J7j2M2p5K29l35L3J12j69
$$ -107 114 -265 181 212 86 -63 -14 -232 74 -26 -120 167 214 -25 -8 -20 22 -53 176 -159 -126 -14 -183
3686a83Q3n1q2M19k42J18m0P3m1k14N4L4%J03j30K55n6k46L47k64m7J19K9qJ20
$$ -183 -100 -151 -233 186 -56 62 22 95 54 -160 -106 -72 -72 31 -99 156 100 -146 201 -63 -110 9 38 30 150
3711A50j20j78K53%o6N4k73%M64j08k39M7J86O6q3K2l45K87j53l0L0m6J13k2j79
$$ 150 30 -148 105 105 39 93 -180 -180 284 176 -63 -16 170 236 153 175 -170 117 -36 -66 -36 -82 31 9 -170
3736a70J42R5k19j2K20j41Q8P0J3r5J72k35R9j96J91Jj46J38j87J85k43L03k04
$$ -170 -28 67 -152 -164 56 -85 3 73 86 -9 163 -72 27 -169 22 23 -123 15 -172 13 -230 73 -131
3759a31J67k06L5K27J08j35j70K32l15K41l29K76r8j49K29O2J57l86J23mJ77J08
$$ -131 36 -170 -135 92 200 65 -105 127 -188 53 -276 0 -98 -247 -18 44 201 -185 -62 -66 111 219
3781B19j1k41K0O4j85J54k76K01N1K54k54k93M69p3m5K9m07M54n2k00O1l9J09
$$ 219 208 -33 -13 51 -134 20 -256 -55 -4 250 -4 -297 172 99 54 83 -324 130 78 -122 -61 -100 9
3804IK49j43k63J20P5kj45J8O7K83k26l82K81M8J0l2J09pq1k00K10K22k22J62
$$ 9 258 115 -148 -28 47 45 -100 -82 -15 268 42 -340 -59 -11 -1 -33 76 69 -12 -212 -2 220 -2 160
3828A60l66O6L80k82K52k21K63k17j81L63m56J97j0L1rj82K17j42K2K35Nl40m3
$$ 160 -206 -140 240 -42 210 -11 252 35 -146 217 -239 -42 -52 -21 -30 -212 5 -137 -115 120 125 -215 -258
3851b58K95p0j00J59J5Q5j74R4J12j81j2O7J27j47j21k15K80j74J96J02j33R3
$$ -258 37 -33 -133 26 41 126 -48 46 158 -23 -35 32 159 12 -109 -324 -44 -218 -22 80 -53 40
3873D0J49k14p7q9K15N7K12k07j11j66M06l46J79n4Q6O1Ln31M67R5l52K10J31
$$ 40 189 -25 -102 -191 24 81 293 86 -25 -191 215 -131 48 -6 80 141 144 -387 80 175 -177 33 164
3896A64k30q2r0J92R1P9j3J1j66N8K13m75L22j55J36l43K37r9R3k73L70n0j61
$$ 164 -66 -148 -238 -46 45 124 111 122 -44 14 227 -248 74 -81 55 -288 -51 -150 -57 -330 40 -10 -171
3919a71n2L85j88J07Q4q9m2j1M0k51J63M9j31P9l12L55m6k17K99j62J94k61n5
$$ -171 -223 162 -26 81 165 76 34 23 63 -188 -25 24 -107 -28 -340 15 -31 -248 51 -111 83 -178 -233
3942b33L13k07o1K25k06L06L9rJ34l83J65j51J8J18j30n1K30l77M87l36K68k69
$$ -233 80 -127 -188 37 -169 137 176 167 301 -82 83 -68 -50 68 -62 -113 117 -260 227 -109 159 -110
3964a10L8K91j35o9J43q5k4J01l02K66J37m12K32k08J25k20K05L36k53l1r1j11
$$ -110 -72 219 84 15 158 73 49 150 -152 114 251 -161 71 -137 -12 -232 -27 309 56 25 -66 -177
3986a77J00J29k05K05J5M7l08K39L3j42K39l64n9K43j0q1J2j02L71j67J6n7k41
$$ -177 -77 52 -153 52 67 114 -194 45 78 -64 175 -189 -248 -5 -15 -96 -84 -186 185 18 34 -23 -264
4009b64J99j78K81k38K1J6o6L47k5j64p0L24k06j10PJ63j61J8J16m6q3K72j59
$$ -264 -65 -243 38 -200 -179 -163 -229 118 93 -71 -141 183 -23 -133 -126 37 -124 -106 10 -36 -119 153 -6
4032fl4J29j17J12n8k7K6k79M16l45N6r9J56o7R8o5j75QJ31J11K54j83j3K1m3
$$ -6 -40 89 -28 84 26 -1 25 -254 162 -183 -127 -226 -70 -137 -39 -104 -279 -271 -140 -29 225 42 29 50 7
4057Gj00M2J30k64nL51o3J23k5j66p5qJ72j52m1K37k75K17j38p2J36j09K74j84
$$ 7 -93 -51 79 -185 -190 161 98 221 196 30 -45 -53 119 -33 -74 163 -112 105 -33 -105 31 -78 196 12
4081A2j26J67lr4j58J19J01l06M75m80L24M9p5J64j82p1P6p8j2Jk58J28L17r4
$$ 12 -114 53 50 -44 -202 -83 18 -288 187 -293 31 80 5 169 -13 -84 -8 -86 -98 -97 -355 -227 90 -4
4105dJ04j23j88O7n6J56j2J44m9q7J75j09j09O7kK01k67r4J88j00L03k10Q3l19
$$ -4 100 -23 -211 -144 -200 -44 -56 88 39 -48 127 18 -91 -24 -26 175 -92 -186 2 -98 205 -5 78 -241
4129b41K05k6r5k68J73L47j06J54m33K98q3j02K05j1j41Q8p9j7L5j9K51l4n6J56
$$ -241 -36 -62 -157 -425 -252 95 -11 143 -290 8 -75 -177 28 17 -124 -36 -115 -132 -97 -116 135 101 45 201
4153B01p8j50j73K06J56j63M09m89l4L9J76K48l61j1L47k39P3j18J93k60l7J46
$$ 201 123 -27 -200 6 162 -1 408 -81 -115 -76 100 348 -13 -24 323 84 157 39 232 -28 -65 81
4175H1r4LR7m3Q2j79rP8k37J09o4K5K35JJ10j19k7l9Q8K06k39M2P5l0j55J56p6
$$ 81 -13 -10 87 44 126 -53 -62 16 -221 -112 -176 -151 84 85 195 76 49 10 98 304 65 107 182 152 -3 153 77
4202G7K7m6j39J7kJ37j99OK83O6l69J87j03j05L07Nm0m33L40k18o9K68K8q5p1
$$ 77 104 58 -81 -64 -66 71 -128 -122 161 227 -142 45 -58 -163 144 149 109 -324 16 -202 -271 -3 25 -60 -131
4227a31q8N2P9L4k9K76j1k73K32k33J61k57O6O9k21K22J57M3j16J0k66M00j89
$$ -131 -219 -167 -88 -54 -83 193 182 -91 141 -92 69 -188 -122 -53 -274 -52 105 148 32 42 -224 176 -13
4250a3R7m9L7j16L6J38K6q2k1M2k60J16j15L05j28j21J50L7q1r2K52o7m08K03
$$ -13 84 35 72 -44 -8 130 156 74 53 95 -165 -49 -164 141 13 -108 42 79 -2 -94 158 91 -317 -114
4274a14r8L70k69OO4j7K2J23m0O9j90j8L40r0kj69j3J90j63K00k71J25n8J2o1
$$ -114 -212 158 -111 -105 -41 -58 -36 87 47 116 -74 -92 248 158 156 -13 -26 164 1 201 -70 55 -3 9 -52
4299e2M5j34J17L6j28o2L33Jj50j08K20j36J16j71M7j52L16l79M39k01K6P8J24
$$ -52 -7 -141 -24 12 -116 -178 155 156 6 -102 118 -18 98 -73 -26 -178 138 -241 198 -3 23 101 225
4322B25o1n2j2k3N5l12N7K28O0k57J73j48J14p6j90R4K47j06P9o8k32L61p0j43
$$ 225 164 112 100 77 132 -180 -123 105 165 -92 81 -67 47 -29 -219 -125 122 16 95 27 -205 156 86 -57
4346e7J24O6n96L96LL22l02K06k09j87J92j1j3J46j19p3K65J9M9k07j03j4O0O6
$$ -57 67 133 -463 -67 -64 258 -44 162 -47 -234 -42 -53 -66 80 -39 -112 153 172 221 14 -89 -103 -43 23
4370B3m2j7P6kj2O9n7p7J97J6j62L4n5Q0j39J00l5O6k73M7K05rP0j15k35L05k96
$$ 23 -19 -36 40 38 26 95 38 -39 158 174 12 46 -9 71 -68 32 -3 63 -210 -163 42 33 103 -12 -247 58 -238
4397b38K87j07J92K7r4j24J17k12R3p5J42J17k32O0N5j19O3K32m80K68J01j7j49
$$ -238 49 -58 134 161 67 -57 60 -152 -59 -134 8 125 -107 -47 8 -111 -48 184 -296 -28 73 56 -93
4420i3K23k40P4m9q7r9K17J27j77rJ09m0N3J79k24J96k86j81M94J26k98K55k41
$$ -93 130 -110 -36 -85 -172 -271 -54 73 -104 -113 -4 -44 9 188 -36 160 -126 -307 187 313 15 270 29
4443B9jk0k55L50j37j60J45J83k35o8P6Q9n9K93j23j67r9m2J42j3K79k94K63m66
$$ 29 28 8 -247 103 -34 -194 -49 134 -101 -169 -93 -4 -63 230 107 -60 -159 -201 -59 -72 207 -87 176 -290
4467b90O15o04pM17m5j05j05j40K24p7O4J99k40K38l35lK80k08J69L5J2p6k76
$$ -290 325 -279 -286 131 86 -19 -124 -264 -40 -117 -53 146 -94 144 -191 -194 86 -122 47 82 94 18 -258
4490b58K85l8k20q9M81J87o28J17n5L67k20j71K48l6J88P2j87kj99K5J44j24L30
$$ -258 27 -11 -231 -320 161 348 -280 -163 -218 149 -71 -242 6 -30 158 230 43 41 -158 -133 11 -113 217
4513B17l85M37k06l33L33j82P1K68j14k00J75l16lK87j37L40j47m4J57J0p2N0
$$ 217 -168 269 63 -270 63 -119 -48 220 106 -94 81 -235 -238 49 -88 252 105 61 218 228 156 206
4535B06j23Mn0J34l26K43M0j66J6n8rp4J0L30P7j92k48J40m4J4K19m0j17J0j05
$$ 206 83 87 37 171 -155 88 128 -38 -22 -80 -89 -163 -153 177 254 62 -186 -46 -90 -76 143 103 -14 -4 -109
4560a09N2J32j34Nk48M88l76J63p5N5j13K18j99L40m73L11j62J34R0p1LO3k54
$$ -109 -57 75 -59 -54 -302 186 -190 -27 -102 -47 -160 58 -141 199 -274 37 -125 9 99 28 31 94 -160
4583a60Q9J08m87O18k33j6p4K04j24J98k22o3L1J77j06r4K37j32r0K82o9j57n2
$$ -160 -71 37 -450 168 -65 -81 -155 49 -75 123 -99 -162 -131 46 -60 -154 83 -49 -139 143 74 -83 -135
4606a35L98L5j96k66R9J22j54J90k47K55m3k79K02O7j32M3N4o8Q5J21m21R0J06
$$ -135 263 298 102 -164 -65 57 -97 93 -154 101 58 -221 -19 48 -84 -41 13 -55 30 151 -270 -180 -74
4629g4K3O9m8K1J50k98n6M21M3l16J41j39k7K5J73m56J82J24J03j83n9K71j45
$$ -74 -51 18 -30 -9 141 -157 -213 208 251 -65 76 -63 -90 -65 108 -348 -166 -42 61 -122 -181 90 -55
4652e5J75j69J33j70J5J06j27j21J91j37J63J13o1j67J1r0K05k9K81j57j47mJ90
$$ -55 120 -49 84 -86 -71 35 -92 -213 -22 -159 4 117 56 -111 -100 -190 15 -14 267 110 -37 -41 149
4675A49j42j41L73k31L8j60Q2N9Q2r0K05n4l00M09j86J7k42P0J72L2k78J53Q3
$$ 149 7 -134 239 8 46 -114 -32 27 109 19 224 170 -130 279 93 110 -132 -62 110 142 -136 17 100
4698A00N8l26J42J37k27J20j9J87k84j21J68k21N23m71J31pO4r4k0K41k43j72
$$ 100 158 -168 -26 111 -116 4 -15 172 -112 -233 -65 -286 237 -234 -103 -110 -46 -140 -160 81 -162 -334
4720c34J73L05m9L0m06J60k75P4L80RP3J05l77k9J28J13R9J19m04R9R7l30O8J88
$$ -334 -161 144 95 125 -281 -121 -396 -322 58 67 140 245 -132 -161 -33 80 179 298 -106 -7 90 -240 -172 16
4744A6j87J78J42j13m8J50l93M01l53K06j03r5J53J0L0r9L07k64J43J71k34k83
$$ 16 -171 7 149 36 -12 138 -255 146 -207 -1 -104 -199 -46 -36 -6 -105 202 -62 81 252 18 -265
4766b65L56k82J52j46J77K7j3R4J63j67j11k7P6J21j31J53l45J54Q5r9L5m7Q6
$$ -265 91 -191 -39 -185 -8 19 6 100 263 96 -15 -42 34 155 24 177 -168 -14 71 -28 7 -40 46
4789D6j4j79J39J69j33m1q7J29K7m3P5j2j6Q3p9k20K23j77J30j50oJ96j25J00
$$ 46 32 -147 -8 161 28 -13 -100 29 56 13 88 76 60 143 64 -156 67 -110 20 -130 -136 60 -65 35
4813C5J6Mj04rK57k62N2K23k49J19n8j93J99l6J03M5l14L09k63j02J44Qo0L37
$$ 35 51 55 -49 -58 199 -63 -11 212 -37 82 24 -169 30 -6 97 142 -172 137 -126 -228 -84 -76 -136 201
4837B01k66L1J08j85J2J85j13l3O9K59q2l92K61n6j20j01J40j73J37L54r7K06
$$ 201 -65 -34 74 -111 -99 86 -27 -60 9 268 186 -206 55 -1 -121 -222 -82 -255 -118 236 139 345
4859C45n35M86l55l9K89k73k3j35K45j5r6J17k24M17k87J12j85M6L84l29J6k17
$$ 345 -190 296 -59 -98 191 -82 -105 -240 5 -10 -106 11 -213 204 -83 29 -156 -110 274 -55 -39 -256
4881b56K90Q5j77J72K55k03l49K50l58K50J54j99k8K38k70j16L01j50J31K41k80
$$ -256 34 119 -58 114 369 166 -183 67 -291 -41 113 -86 -114 124 -146 -262 39 -111 20 261 -19
4902a9j61K69l2L3j51J32j61K90l28J88J50l93L19k62K7k7J46J33Jk38K35l74
$$ -19 -180 89 57 90 -61 71 -90 200 -128 60 210 -183 136 -126 -99 -126 20 153 154 -84 151 -223
4924b23J46j17L31j88J21j04j82J39r4K42q7q6K86k79L15l78J21P0k63k5p9K89
$$ -223 -77 -194 137 -51 70 -34 -216 -77 -171 71 -16 -102 184 -95 220 -158 -37 33 -230 -255 -334 -45
4946d5m5K81l98K38j31P1pJ64Nj4K7J4k07j47J60J05j4K29m00r2L76l38m2L98
$$ -45 -90 191 -207 31 -100 -29 -36 128 133 119 146 160 -47 -194 -34 71 57 286 -114 -206 170 -168 -210 188
4970A88k96K78r4j60K72n2Mn6r9m7K66k53j38J17l7KK29j89O8lK02l00k7J5J01
$$ 188 -108 170 76 -84 188 136 140 84 -15 -62 204 -49 -187 -70 -107 -105 124 -65 3 0 202 -98 -125 -110 -9
4995iqn8Mp2l3K75J2j0o9r5m4j37L95l96J32M14k18N1k14K34k95QJ37j77K50n
$$ -9 -17 -75 -71 -143 -176 99 111 101 32 -63 -107 -244 151 -245 -113 301 83 134 -80 154 -141 -133 4 -173 77 72
5021G2J64k01Nk21K21m1J37l96L91k34j7R6k6k5K52j72l%K33j54k15Q6J00L7r1
$$ 72 236 35 40 -181 40 -1 136 -260 131 -103 -120 -24 -50 -75 177 5 2 2 235 81 -134 -48 52 89 -2
5046bK74m99L35j55j87J63q4k50M57j22k6K33m10L63j73J56q6M4J45k43K87k85
$$ -2 272 -227 108 -47 -234 -71 -155 -405 52 -70 -96 137 -273 90 -83 73 -13 31 176 -67 220 -65
5068f5J74q0j42m3l0K69o9K42m68N3J29j45L5J55q6O1m4J15jj43J09K68k36J9
$$ -65 109 29 -113 -156 -186 83 14 256 -212 -159 -30 -175 -140 15 -71 -10 -54 61 60 -83 26 294 58 77
5092G7j72J18R0k76M06l74L6K44k02o4N1K8j33J69j48Q9L90j70J19j6o2n5k03
$$ 77 -95 23 113 -163 243 -131 -95 149 -53 -117 -66 -38 -171 -2 -150 -61 329 159 278 262 200 145 -58
5115e8l0J65l0Q7j84pK90o0Jk72L21k95k4J2J33q7l9L5J21m99M98J6l3J25l97
$$ -58 -88 77 47 134 -50 -57 233 173 174 -98 223 -72 -96 -84 49 -38 -77 -42 79 -420 78 94 61 186 -211
5140b11K34n6J3J20k83ON1mo6N13m30J54J87l49K01J67j51m3Q5P8l54K78J35k93
$$ -211 23 -33 -20 100 -183 -177 -126 -130 -196 317 -113 41 228 -121 80 247 96 53 138 216 -138 140 275 -18
5164a8K74n08K41p5j88M76k33O4J24k06R9K9l9j5K6m5L5J32k15j1j92M11r9l64
$$ -18 256 -252 -11 -86 -274 202 -31 33 157 -49 50 79 40 25 51 6 41 173 -42 -53 -245 166 67 -297
5188b97M86k54J63j51K54l65J40J12k18J15J78m45M45nk59J58O0P6j66j06k9L5
$$ -297 189 -65 98 -53 201 -164 -24 88 -130 -15 163 -282 163 158 -101 57 117 193 27 -79 -108 -73
5210g3M3l18j3J90K27R3K6j67L2J76j09j89K44Q0j26j30O9k24J32j1k0o6j3K13
$$ -73 -30 -348 -361 -171 56 149 175 8 40 216 107 -82 162 242 116 -14 55 -169 -37 -48 -68 -134 -147 66
5234F6N7j74K60k58K19p5pJ37k28j22L13p5k18M15j72j65L6j24K62L8l54k8P6
$$ 66 123 -51 209 -49 170 95 88 225 -3 -125 188 113 -105 310 138 -27 9 -115 147 185 -169 -197 -121
5257a21K56M0k35J7p7o8J98q5M0P1k99K37P9m2J9K90l09j39K70k39o6J2k0K36
$$ -121 135 175 -60 -43 -120 -188 10 -75 -35 36 -263 -26 53 11 30 320 11 -128 142 -97 -163 -151 -171 65
5281F5K9j2K0m15M75O2l45J73k22J83K26o5J27l00q6R6m24L71n1j9M16n53J64
$$ 65 94 82 102 -313 162 224 -121 52 -170 13 239 174 301 1 -85 11 -413 -42 -93 -112 304 -249 -85
5304h5l3K6O8N2j00j84K83O7p6j85J12O2j25J20j63J27m6o7J94r2O1k57M03p6
$$ -85 -118 -92 -24 28 -72 -256 27 94 18 -167 -55 7 -118 2 -161 -34 -80 -147 47 -45 16 -241 162 86
5328H6k02J71r5O3P8j70J03K71j53r0o2k2P4r8pL1k35J50J06j94J51qj27K74l2
$$ 86 -116 55 -40 23 101 -69 34 305 152 62 0 -22 52 -46 -53 -22 -257 -107 -1 -195 -44 -52 -179 95 63
5353F3J8j69J7O1k2Q6k03l3J33J23K18j97k07K43k03K94j87p8n7j65L65l41K12
$$ 63 81 -88 -71 -10 -32 54 -149 -182 -49 74 292 95 -112 131 -72 222 35 -43 -100 -265 100 -241 -29
5376b9j3LJ11k12k9L90m42L74m31K05J07M6j29l28L07n2K64j9l6j62J29k34K0
$$ -29 -42 -39 72 -140 -169 221 -221 153 -278 -73 34 80 -49 -377 -70 -122 142 123 87 -75 54 -180 -160
5399a60PK84k6J94L5l78L9l41L14j11M26n36L23l6j04J38k98J90J71l28J95J05
$$ -160 -153 131 105 299 334 -44 -5 -346 -32 -143 283 -253 70 34 -70 68 -230 -40 131 -197 -2 103
5421A03j28J85k26O2J47R7l75K21O2J29l51J58j63O5J34j86L9O2n8K90m10o5J68
$$ 103 -25 160 -66 -4 143 240 -135 86 148 277 -74 84 -79 -14 120 -66 -27 35 -23 267 -143 -208 -40
5444d0J31j06j22J07R4n6r1J02j9O6L36m00J59j59J09l21j11K22J65qj60K09j04
$$ -40 91 -15 -137 -30 64 8 -83 19 0 66 402 2 161 2 111 -210 -321 -99 66 58 -102 107 3
5467CK11l14J57j44J11J10j11K04k54P2n8L5L3k67L80m0j38Q6j97O7J03k03J96
$$ 3 214 -100 57 -87 24 134 23 227 -27 45 -13 22 55 -212 168 128 -10 76 -121 -54 49 -154 42
5490D2P0m7j59Q7J74k7P1m54J60J50K06n64K42j57Q6q2K18j00N5N9l1r2L72k77
$$ 42 112 65 -94 -7 167 140 211 -243 -83 67 273 -291 -49 -206 -120 -202 16 -84 -29 30 -1 -93 279 2
5514BJ64k07N2J70k07J02J14l50J93M22p28LO0L67j92Q3L4K6o1j87K32J47j43
$$ 2 166 -41 11 181 -26 76 190 -160 33 455 -273 -270 -210 157 -35 48 82 108 47 -140 92 239 96
5537I6K3J06k55K23Q4l26j01J17L6K17m09R8L1J4j55J59J83j93N7L05l16O2j44
$$ 96 119 225 -30 193 277 -49 -150 -33 3 220 -189 -91 -60 -46 -201 -42 141 -52 5 310 -6 56 -88
5560h8J72k64O2J12n8J61K7N2k59J26j80Q4K8O7l7J20k27J22k78J19k30J70K57
$$ -88 84 -180 -118 -6 -64 97 124 176 -83 43 -137 -53 -25 42 5 125 -102 20 -258 -139 -369 -199 58
5583E8j37J93P9j98n5J23j24K3j28Q7k6jP8m1k08L55l0Q3k83QL40J00k09J10O3
$$ 58 -79 114 193 -5 -60 63 -61 -38 -166 -79 -105 -106 -28 -69 -277 78 48 131 -152 -144 196 296 87 197 260
5608B60k28j44L34m19J18K2J31q6J00j46l6J83J58k97K81l59M46l94J87m11J45
$$ 260 32 -112 222 -197 -79 -57 74 -12 88 -58 -94 89 247 -50 231 -128 318 -76 111 -300 -155
5629a55K77j8n8l71N08k91P4p6K65o0o0j62J08K46j08K06l76Q4O1J28L7k69Kj29
$$ -155 122 104 46 -325 183 -108 -34 -110 155 95 35 -127 -19 227 119 325 -51 33 94 222 259 -10 -8 -137
5653a37J80k0n5J8K3J65k68m0K64J2r6j90K54k8R8k4J2k27j4J26l19N27K2m28
$$ -137 43 23 -32 -14 9 174 -94 -134 130 142 46 -144 110 82 180 156 168 -59 -73 53 -266 261 283 -145
5677a45J4j17L30j60O0j05N4Q7k05K50n0P7j9j32J03j1r6K10j53J06k73J02N8
$$ -145 -131 -248 82 -78 -18 -123 -69 18 -187 63 13 90 71 -61 42 31 -65 145 -8 98 -175 -73 -15
5700a5N0%l49M6K62j11j75ML97j34J98j32j36O1M46l93pJ68k63J34l4L19k75j28
$$ -15 35 35 -314 -268 -6 -117 -292 -288 109 -25 173 41 -95 -34 412 19 12 180 -83 51 17 336 61 -67
5724f7j7O6J58k58L4kJ83j17o6r3k4J25P4j43L52j55j65q2R9pK26j10k0m2J00
$$ -67 -84 -18 140 -118 -84 -86 97 -20 -86 -179 -203 -78 -4 -147 205 50 -115 -197 -98 -105 121 11 -9 -51 49
5749D9j93L82k42m3j60L11J4k04p0O1J49j1r9L6kk17L19J41n4k20k27J71L5p3
$$ 49 -144 238 -4 -47 -207 104 118 -86 -156 -95 54 43 -56 -20 -22 -239 80 221 167 -53 -280 -109 -74 -147
5773a47K52j51N0q5K13l5l59K71j42L3J53r6n5J4M1m6Qj9p9Q8J07l45K93j11n
$$ -147 105 -46 4 -81 132 97 -262 9 -133 -100 53 -43 -98 -84 -43 -89 -81 -100 -179 -91 16 -329 -36 -147 -152
5798a52K52%j84J33K0J3j2j33J81l55L96k44m3n4J82j31J4p0J36M3n2K38m9j13
$$ -152 100 100 -84 49 69 82 70 -63 118 -237 159 -85 -128 -182 0 -131 -117 -187 -51 -8 -60 178 129 16
5822A6Q1l06J95m2P1N3k22K63j46R0L0Mk26J49n6Q4Q7l59L36ml8o1o6l2R5n0q0
$$ 16 97 -209 -14 -56 15 68 -154 109 -37 53 83 87 -139 10 -46 38 125 -234 102 98 60 -1 -67 -99 -4 -54 -134
5849a34J84k37K45q2J97k63K32j79J60j35j59K63j95K52k06Kj01L61l94N9J37
$$ -134 50 -187 58 -24 173 -90 142 -37 123 -12 -171 92 -103 149 -57 -55 -156 205 -189 -130 7
5870Gnj84p1J88J2K55j85K18L0m69J53J48n2l10L86J42l04N0R4j61K92k28K86
$$ 7 2 -182 -253 -65 -53 202 17 235 265 -204 -51 97 45 -265 121 263 -41 9 103 -58 234 6 292
5893B92k23j25j56M43r7k40J58K3o0r5J60j58L1Q1L26l90j64K80q3O1j83N7L48
$$ 292 69 -56 -212 231 134 -106 52 75 15 -80 80 -78 -47 34 360 -30 -194 86 3 64 -119 -62 286
5916B86l62J68Jk38L91j60P3q3Lj22k02K45K11j59M3j9j44r4l9K40n8j57J30J53
$$ 286 -76 92 93 -145 246 86 159 76 79 -43 -245 0 211 52 95 76 -68 -162 -201 39 -19 -176 -46 107
5940A07J99k19l72K90j5R5K3m4R9%j32j30J71L9q3j56j79J74L93j93j03J91j82
$$ 107 306 87 -285 5 -10 85 108 64 163 163 31 -99 72 111 28 -128 -307 -133 260 67 -36 155 -27
5963b7K27k88K31Jm55K74LN8k14K22M7l59L32m1o7Q9j24J64l65N3J97O9J56l21
$$ -27 200 -88 143 144 -311 -37 -34 24 -190 32 79 -280 52 11 -56 33 -91 73 -292 -239 -42 27 183 -138
5987a38J61J09k44L78j28j11lr1J93k70m2K42Q5O2l75J26J30j86J82m3j18m3J04
$$ -138 23 132 -112 266 138 27 24 -67 126 -144 -186 56 141 203 -172 -46 84 -102 80 37 -81 -124 -20
6010b0j00J70k42q7N32l26RL37k12J22k92n0L46l13M8K08q8m03J68L32K4j69%
$$ -20 -120 50 -192 -279 253 -73 -64 273 61 183 -109 -159 187 -126 -78 130 42 -361 -193 139 163 -6 -6
6033fJ72n4j07j12K09j01L42j23j92m1j26O9j6j2L18n03N58k94qR3N7j15K93k99
$$ -6 166 112 5 -107 102 1 343 220 28 -13 -139 -70 -86 -98 220 -283 275 -19 -27 66 123 8 301 2
6057BJ13j70j58K62k38L84j31k00K96k62J17P2k58J50j03K23k91J21K6J1pJ73
$$ 2 115 -55 -213 49 -189 195 64 -136 160 -102 15 87 -171 -21 -124 99 -192 -71 -45 -34 -41 132
6079A32J92m27L25k1m04j83M34o7JL20n42J0L33j92l3K6J6J08k36L92j69j25K11
$$ 132 324 -103 222 201 -203 -386 48 -19 -18 302 -240 -230 103 -89 -122 -96 -80 28 -208 184 15 -110 101
6102A01r3j17K98k16j07J18Q0r0O5K8j46oK08J59l82N3K07j73k7jK52k87J02k80
$$ 101 8 -109 189 -27 -134 -16 64 -26 39 67 -79 -85 123 282 -100 -47 160 -13 -40 -41 211 -76 26 -254
6126b54o1K92K11k30Q4j07k82M33k40K76m25N07j25K4Q0j84k37J99J41k11R1K80
$$ -254 -315 -23 188 -42 42 -65 -347 86 -154 122 -303 204 79 103 183 -1 -238 -39 102 -109 -18 262
6148B62k39n3J04j18jJ66k50l0M3L01l14R3Q5j90j8J17j41K91j17l70K35M20j78
$$ 262 23 -30 74 -44 -45 121 -129 -159 -116 185 -129 -36 49 -141 -159 -42 -183 108 -9 -379 -144 276 98
6171I8J4j98K95n7l07L81j70q0p8K26l18M83l81Q1Q9J68j98m7k23J12l34M37j93
$$ 98 112 -86 209 152 -155 226 56 -24 -102 124 -194 289 -92 -11 78 246 48 1 -222 -110 -444 -7 -200
6194b00K74j5l7k19J71m0mJ16K8R1j34O3P8k11K4R3q1J57j56k34K95J60k09l37
$$ -200 74 59 22 -197 -26 -66 -70 46 74 165 31 94 172 -39 -15 78 -3 154 -2 -236 59 219 10 -327
6218c27L29L7O8ql65P5j59L11mJ60RQ4j17m4k0q6L6J94l41K64Oj65L16r3l45L37
$$ -327 2 39 107 99 -266 -191 -350 -39 -43 117 126 210 93 49 29 -57 -21 173 -168 96 102 -63 253 160 -185 152
6244A52r3k5k5J48j06Mk36K24m7kO2j33k5j70N16j08J1j35K6m8Q7k64L60l1j91
$$ 152 59 34 9 157 51 55 -181 43 -4 -6 56 -77 -102 -272 244 136 147 12 38 -10 77 -187 173 142 -49
6269d9j86j9J4R3J81o6j88K01j09K00m9R7j06k28L7K95k18O04l49k49KJ24K7r2
$$ -49 -235 -254 -240 -147 34 -32 -220 -19 -128 72 23 120 14 -214 -177 118 -100 504 155 -94 -92 32 59 -33
6293c3k1Q2R4N8m5J17j80J2j82l14L99j4pJ6j27J69j52K49l28N9L43j23j81J39
$$ -33 -54 28 122 180 135 252 72 84 -98 -412 -13 -27 -34 -18 -145 24 -128 121 -207 -148 195 72 -109 30
6317C0K5KR0K8j78K6j73K65j70K36m00L92rq0k15J46J15l50L48k22L39k34m4L1
$$ 30 55 57 147 175 -3 23 -150 115 -55 181 -219 173 164 84 -131 15 130 -220 128 -94 245 11 -33 -2
6341bP4j25N4j91m3K70j35Q1q5K2J73P7k61j21K27J76j20l91J65J91j66K07P6
$$ -2 72 -53 1 -190 -233 37 -98 -17 -102 -80 93 170 -91 -212 15 191 71 -320 -155 36 -130 77 153
6364A53j13K30k43J62k56J88J56k28J9J7K23l90J31j16J7L1j4q1j20J84J09P6
$$ 153 40 270 27 189 -67 121 277 49 68 85 308 -82 49 -67 -50 -19 -33 -114 -234 -50 59 135
6386A35J5q4N8K7k58%L59j45j81J41q0nJ9j24L7Rk06K07R5J40J39j21j14j45K47
$$ 135 150 66 124 151 -107 -107 252 107 -74 67 -13 -18 1 -123 -86 -77 -283 -76 19 159 298 177 63 -82 165
6411A65j31j3p9K00j37k37J90k30L55J8k80K62j44M3k38L80j50Mq1K32M7J16l18
$$ 165 34 21 -58 142 5 -232 -42 -272 83 101 -179 83 -61 -18 -256 124 -26 -22 -103 129 176 292 -26
6434b6OL1J38j54r1L13k97J18J48j61k91K27N3k0J75j61r6j1J02J63k64R9k8J85
$$ -26 -20 11 149 -5 -96 217 -80 38 186 25 -266 -39 14 -6 169 8 -88 -99 3 166 -98 1 -27 158
6458A58kL5n29P27k22n01K25k12M35j0r8m20O77k2j95j33K5L8K51l78J43J14j48
$$ 158 156 191 -338 389 167 -334 -109 -321 114 104 6 -414 263 241 46 -87 -62 -24 227 -151 -8 106 -42
6481d2K25j87j12K65m58K69M1q3K85K2J58l93J7j24j43M06j00O4o0J97Jl05K98
$$ -42 183 -4 -116 149 -309 -40 1 -82 203 225 383 -10 7 -117 -260 146 46 110 50 247 248 -57 241
6504B41Rl51J08k6j90L85j88K40k20j87n1L84j33P5M6m67M38J3j16j63K71k04
$$ 241 250 -101 7 -19 -209 176 -12 228 8 -179 -230 154 21 96 142 -325 113 126 10 -153 118 -86
6526h6k3M5l9L18l96L78k92o4J73p8J07k8J69j87L2mk3Q0O6r0k79J69Q4j11K31
$$ -86 -109 -64 -103 215 -181 197 -95 -159 14 -64 43 15 184 -3 29 25 2 82 148 58 -221 -52 32 -79 152
6551A52k79J50l6J80k14K72k17j97K99k24J89j34J94n10N06Kl12K29m4n4N0J2
$$ 152 -127 23 -13 167 -47 225 8 -189 110 -114 75 -59 135 -375 131 133 -179 50 6 -48 2 14
6573A4j21J64k29L57j90j26M06k05j34r3K95j45rM0K35j21k45k57L75J01j40K35
$$ 14 -107 57 -172 185 -5 -131 275 70 -64 -157 138 -7 -16 24 259 138 -107 -364 11 112 -28 207
6595B07k26j28N8O1J20j01L18j50j19k56L63Jp9r8j45K32L6o2M3j50q5k0L05l5
$$ 207 -19 -147 -89 -28 92 -9 309 159 40 -216 147 148 69 -29 -174 58 94 32 75 -75 -160 -180 125 90
6619I0l3k35O4r9J42M5l9J27j68J10p6M8K79j63j22J76L0q3n9k07K83j37K8o3
$$ 90 57 -178 -114 -213 -71 -26 -65 62 -106 4 -72 -24 255 92 -30 146 176 93 34 -173 110 -27 1 -62
6643f2J17k15N0J78j72q3J47p7P1J60k5N1j95j42K06j98R1K56j32N9P3j53J99
$$ -62 55 -160 -110 68 -104 -187 -40 -117 -46 114 89 140 -55 -197 9 -189 -98 158 26 85 158 5 204
6666B04P0k84k08J13L15k95L02o0k47J21J15N4k03j72O1L45j28n4p9k6N8j60j05
$$ 204 274 -10 -218 -105 210 -85 217 157 -90 31 146 200 -3 -175 -114 231 103 49 -30 -56 2 -158 -263
6689b63K11m5K6J60j48J80k38K47k78l03M81l22J9J35K17p0k12P7L57l68J23J57
$$ -263 -52 -97 -71 89 -59 121 -117 130 -148 -451 30 -292 -273 -138 79 9 -203 -126 231 -137 -14 143
6711A43l1o8l68J94K0K9L23m71O5Q1L07j12J21l02M7P9kk8Op8P3j31J47k72L27
$$ 143 112 44 -324 -130 -110 -81 242 -229 -164 -83 224 112 233 -69 -22 57 55 27 33 -45 28 -103 44 -228 99
6736I9QK07l86K44l14K08k29O2J38jj14K01nk54J76j9M0k37p0L04J49l66k02N38
$$ 99 107 314 -72 172 -142 66 -163 -101 37 36 -78 123 118 -136 40 21 61 -176 -246 58 207 -159 -361 177
6760A77j29m8k03Q6L7Q8PJ39j97M6j17L05l51K72rj32J23k24P5Q9k33Q1J39J40
$$ 177 48 0 -203 -117 -80 8 15 154 -43 3 -114 191 -160 112 103 -29 94 -130 -55 34 -199 -118 21 161
6784A61K2k00j27M20J2j9j98O3j46Q3K53j77k59q0K88j38K95o1m6k37j11R3K27
$$ 161 183 -17 -144 276 288 269 71 134 -12 71 324 147 -112 -192 96 -42 253 192 146 -91 -202 -109 118
6807A18j99L57j47k50j19L96o4J59k68K78k45j34M06l73q3j4L87j76k8j62K03
$$ 118 -81 276 129 -121 -240 156 92 251 -17 261 16 -118 288 -85 -168 -182 205 29 1 -161 42
6828D2o2Rj9K65l34Q1o5p6K27k88K95L2k22J64k9Q1k5Oj00j19K95j21K06k42m
$$ 42 -20 -11 -30 235 -99 -18 -83 -159 68 -220 75 107 -115 49 20 101 76 82 -18 -137 158 37 243 1 -3
6853cJ79M2l39K93j51J43l02L68l08N9J1q3Q4J24O7l32J19K15j25j16J82l23L66
$$ -3 176 218 -121 172 21 164 -138 230 -78 -19 -8 -91 -7 117 184 -148 -29 186 61 -55 127 -196 170
6876A70nk25O7N3L9k08J6m4K16R2m54K01J27j84J37j52j37L31m1K9q5k48M65l29
$$ 170 165 -60 7 60 99 -109 -93 -137 79 171 -283 -82 45 -139 -2 -154 -291 40 -1 28 -57 -305 160 -169
6900a69J0J13r5L47k61K98k73q8J72p1L00m44K36K25m65L47l18k5J47J86l72O3
$$ -169 -159 -46 -141 206 -55 243 -30 -118 54 -17 283 -161 75 300 -165 182 -136 -161 -14 172 -200 -137
6922a37K08k62J72k78L80k00j39J65r7K86j78k32M01j42J61j69L19m19K03q3L66
$$ -137 71 -191 -19 -297 83 -117 -256 -91 -188 98 -80 -312 89 -53 108 -61 258 -161 42 -41 325
6943C25o11M0J94K2P1n6R3J83p6l39K36k9k6j7O9O9l78K55m7j18K33l9k28L1K30
$$ 325 -286 -246 -52 -30 41 -15 78 261 185 -154 82 53 27 10 79 148 -230 25 -22 -140 93 54 -174 -143 87
6968H7k3K09l70J54m0l3k7R9J7k33J45K21j55M9k09J26j57J43l08J57P4L25j12
$$ 87 64 273 -97 57 17 -16 -43 56 73 -160 -15 206 51 100 -109 17 -140 3 -305 -148 -74 251 139
6991A39r3R0N7j20r0L31j59j75k5l0k93M94k03J45J22r4j02Q6P6l63K92q2j80
$$ 139 46 136 193 73 -17 314 155 -20 -45 -75 -368 126 -77 68 190 96 -6 80 156 -207 85 3 -177
7014a77L58l02K76l23L24k95j84M50O8j81k9j04l7P6N0j64M81o30L48R2j93K88
$$ -177 181 -121 155 -168 156 -139 -323 127 195 14 -15 -119 -156 -80 -30 -194 287 -343 5 97 -96 192
7036A92n1p7O7k59R9R1j16J18k7J89l95K89l9P0k22J07j08L23j81K58l00J58l29
$$ 192 141 64 131 -128 -29 62 -54 64 37 226 -169 120 81 151 -71 36 -72 251 70 328 28 186 -143
7059a43k8pM0j36M21j18M3%j12J02j79K16l36J50M39l23j04O7j41O0J8J80o5j03
$$ -143 -171 -178 -138 -274 147 29 72 72 -40 62 -117 99 -237 -87 352 29 -75 -8 -149 -89 -71 109 44 -59
7083e9J45k74J97q4J92J01j93o4K0J59j23k80J32J30J2j3J03J3j68K02k97jL4
$$ -59 86 -188 9 -75 117 218 25 -39 -19 140 17 -263 -131 -1 11 -2 101 114 -54 148 -149 -150 -116
7106a16N8K58m05L31j32m7j56J96J68N2k37j33K47l04J69K52k98J68k67M23l54
$$ -116 -58 200 -205 126 -6 -53 -209 -13 155 207 -30 -163 84 -220 -51 201 -97 71 -196 227 -127
7127a27L38j62p2m0K4j29N2K89k16J28m11L73m1m5R5j9J24j14pj26P7Q2j6j56
$$ -127 211 49 -23 -63 -39 -168 -116 173 -43 85 -326 47 6 -39 56 37 161 47 40 -86 -9 73 57 -99
7151i9L8j18J49J52j80j95J94P7j98L51q0q3k30J21L30l46jL22l38K44K9l18J22
$$ -99 -61 -179 -30 122 -58 -253 -59 18 -180 171 91 8 -222 -101 229 -117 -118 204 -134 110 139 -179 -57
7174e7J18m7p5M6J16k42K3J01L2J37n6J51k91M5J48j56p4l5K81j51j68L4L4J93
$$ -57 61 14 -61 -15 101 -141 -118 -17 15 152 96 247 -44 1 149 -7 -81 -116 165 14 -154 -120 -86 107
7198A07m44K07k00J6L87m0m2p0R1J74j35R1l3k24Q2J08k61j01J71L55n13K17j64
$$ 107 -337 -130 -330 -314 73 33 -9 -79 12 186 51 142 109 -115 -33 75 -186 -287 -116 239 -274 -57 -221
7221b21L46j4q1m8j20K35k05j05L47M5k88l5L29j67q3K94k13k27L40r4ok67k7
$$ -221 125 111 30 -18 -138 97 -108 -213 134 179 -109 -144 185 18 -65 229 16 -211 129 35 29 -238 -265
7244b65M03k92J09R8J22k19l9Q6J75l75J65J09j46k42J00Q4j5k6k30K61O2J52
$$ -265 138 -154 -45 53 175 -44 -83 3 178 -197 -32 77 -69 -311 -211 -127 -142 -168 -398 -137 -75 77
7266G7J19m18K23j60K67j82R5n1P6j19K0j8J36j6N1K21k56j15O5M1J47J56k45
$$ 77 196 -222 1 -159 108 -74 21 -30 46 -73 -53 -71 65 49 100 321 65 -50 15 56 203 359 114
7289A14k71K36J37m54k0M40n2j38j45J47Q4l0j52r3L47j76M0m1R1K7j36J30K6
$$ 114 -157 79 216 -238 -258 182 130 -8 -153 -6 78 48 -104 -197 150 -26 14 -27 64 91 -45 85 111
7312A11k21ro0n2oK81j69l2P4j13L57K9Nr6q2O8j8Mj63J72k49K18q2J3k3J26j49
$$ 111 -110 -119 -179 -231 -237 44 -125 -157 -83 -196 161 190 195 99 17 85 67 71 -92 80 -169 49 -33 -20 -43 83 -66
7339f6p7J99R3Qk47L3K41mk60l8J73L1j88L16l85KJ42P0j60L05n0r3R1k05R5r8
$$ -66 -143 56 149 157 -90 -57 184 180 -80 -118 55 86 -102 214 -171 -169 -27 43 -117 188 138 45 136 -69 26 -72
7365g2Kj42R2K56j63Q7J43m21J47k06J70J06j82%P0M6K5j35j51K48j14K45Q3r3
$$ -72 -70 -212 -120 136 -27 60 203 -218 -71 -277 -107 -1 -183 -183 -113 -67 -42 -177 -328 -80 -194 51 134 41
7389D1r6J92q9n3j04J04K71k21P6j76J03k80L22j38J84j29P9k98nL56j18P7p5
$$ 41 -55 137 48 -5 -109 -5 266 45 121 -55 48 -232 90 -48 136 7 86 -212 -217 139 21 98 23
7412B3J48q9J39j55j46k4K9K18l62N4K60j03k10L09o4K46j43q2p3k78J62O5L7
$$ 23 171 82 221 66 -80 -104 -75 143 -219 -165 95 -8 -218 91 27 273 130 48 -25 -303 -141 -76 -39
7435c9O8r3K7J19J46n9k62K25k66J96Q1k92K12R4k48M37m76L7K3j2K1m0K14j45
$$ -39 29 -64 -37 82 228 169 -93 132 -134 62 143 -149 63 157 -91 346 -130 -93 -70 -82 -61 -101 113 -32
7459c2J06j28J81j60J82j22k53p8M76q0j28L1J16r9K09k84k6J81k10J71j53N5
$$ -32 74 -54 127 -33 149 27 -226 -304 172 92 -36 -5 111 12 221 -63 -89 92 -118 53 -100 -45
7481d5J24m5J59l08N0J81k43K58n1j92K20k42O4N6p5lM03l35K15M8j97k55J53
$$ -45 79 34 193 -115 -65 116 -127 131 80 -112 108 -134 -70 -14 -89 -92 311 -24 191 239 42 -213 -60
7504f0L6J71o4K3j88l83M08O6R0k12J05P1j2n3oj44j09K98N6l08J73l4K60j72
$$ -60 -24 147 83 106 -82 -465 -57 9 99 -113 -8 63 51 -2 -8 -152 -261 37 93 -215 -42 -76 184 12
7528A2kO0j37j33L31k77M2P5J4Mj3mp3L9N6J94l03r2N3n6J97m2rK33K7k10J77
$$ 12 10 70 -67 -200 131 -146 -104 -29 -15 -11 -24 -28 -101 -62 -6 188 -115 -207 -154 -210 -13 -55 -64 169 196 -14 163
7555A63l33K61j25J49j28J67j91p4k4L32k49L7J22k14K52j78J02j4K49k25l6K62
$$ 163 -170 91 -34 115 -13 154 -37 -111 -135 197 -52 -15 107 -107 145 -33 69 55 304 79 43 305
7577C05l80K03l11j34J36q6J74N4L6J53L2p3N7l22L05jk12O3J28p3P4k2k46M18
$$ 305 -75 128 -183 -317 -181 -267 -93 -39 -3 150 182 109 166 -156 149 148 -64 -1 127 54 128 106 -140 278
7601B78k67r9L3L10p3k90J06J07j12j7J29N9k45O4L68m19J84R5j67J70o5j28k0
$$ 278 11 -88 -55 255 182 -108 -2 105 -7 -24 105 164 -81 -17 351 -68 116 211 44 214 149 21 1
7624AN3l12J68O8KJ48m47K37kj46K92j25J51j41q4n6j30M38r9O7L5j27Qm2J4k06
$$ 1 54 -258 -90 -22 -20 128 -319 -82 -84 -230 62 -63 88 -53 -137 -193 -323 115 16 83 118 -9 -1 -43 -29 -235
7650b35N25l54J31k02O2l1J83k09kK62k87L9j14L70n6j58L2j07K20l2r2J97j71
$$ -235 290 -64 67 -135 -73 -104 79 -130 -132 130 -157 -118 -232 138 82 -76 -44 -151 69 37 -55 142 -29
7673b9K71l80J49j11l0J92j35q4M33j95MK21P9l69J76k12j96K26L2k09J44o7K4
$$ -29 242 -138 11 -100 -130 62 -73 -157 276 81 85 306 385 16 192 -20 -216 10 42 -167 -23 -90 -66
7696f6J32k79J43o8J19j11M66k19k14L7K9M8J00k00J40R8l44J07J6K7lj4K07n02
$$ -66 66 -213 -70 -138 -19 -130 336 117 -97 -60 -31 17 117 -83 57 155 -189 -82 -66 -39 -42 -56 151 -351
7720c51N14q8o7j66l8qK72J06q3q4j06M8K0j1j5o9J04J18l42J78O8J54l35P0j1
$$ -351 163 75 8 -158 -196 -204 68 174 91 7 -99 -51 -31 -42 -57 -126 -22 96 -246 -68 0 154 -181 -111 -122
7745a22J20R8J4J45j69k09J38J2l2J38L9l68J76K9K06j2m71M35k80R1o7J61K23
$$ -122 -2 96 110 255 86 -123 15 27 -5 133 172 -196 -20 9 215 203 -268 167 -113 -22 -89 72 295
7768B95k34o9j27L9j97L45k19k1J86J79q1q9l15K26K03l06J08l0n3k27O50m94
$$ 295 61 -8 -135 -96 -293 52 -167 -188 -2 177 96 7 -308 -82 121 -185 -77 -107 -160 -387 263 -231
7790b31N7K15m10K65K37p4l2J13P5k30j23J79p6p1J67Nkn5j00j13J25p8O9J78
$$ -231 -174 41 -369 -104 133 59 27 140 215 -15 -138 41 -35 -106 61 66 64 9 -91 -204 -79 -157 -88 90
7814I0j34j37k2K75N3j14K29j56p4J5lj2j60O8L0K48k18j5j81K93k99K67r4k22
$$ 90 -44 -181 -203 72 125 11 240 84 10 25 22 10 -150 -82 -52 196 -22 -37 -218 75 -224 43 -51 -273
7838b73J69M1K93n37K05J99j53J0J18j54J30j44J57o3J71j53L3j53J9L1J88l37
$$ -273 -104 -63 230 -307 -102 97 -56 -46 72 -82 48 -96 61 -2 169 16 49 -104 -85 -54 134 -203
7860b03N70l90k66L65J50n05J23J34p9L9k28N35k33j04J00j21K26q2q0J10j80
$$ -203 367 -23 -289 76 226 -279 -156 -22 -101 -62 -290 245 12 -92 8 -113 113 31 -49 61 -119
7881a19o0P7J23R1J10k57J29k64K51j80q5K69j57J11N8l64K98K63j43j43J53n6
$$ -119 -179 -102 21 112 222 -35 94 -170 81 -99 -184 85 -72 39 97 -267 31 294 151 8 161 105
7903A05m8j8j59J19l9N10o56N75k29J38l02Nj11KJ70J25k77M4J9K9j6KP0l9j71
$$ 105 57 39 -120 -1 -40 470 -186 389 160 298 -4 1 -110 -108 62 187 -90 -46 -27 2 -14 -12 58 19 -152
7928a52K26p8R1o1m7J57J67m44j50K77J64j77p7J35J3j76Mj4L78k09k0k6j82R7
$$ -152 74 -4 87 26 -21 136 303 -141 -291 -14 150 -27 -104 31 44 -132 -128 -142 236 27 7 -19 -201 -104
7952a04j65J50J00L05n65M60m7j71k5J59j54J5J97l3q2k59K35O5L8R9j16R3k45
$$ -104 -269 -119 -19 286 -279 181 134 -37 -62 97 -57 -42 155 122 40 -219 16 81 119 218 102 195 -50
7975e0J59J65l90J50O4k31k28K21N6J6k5K0J52j48K52m8k88L54k14OQ8p5R2jj80
$$ -50 109 274 -116 34 98 -133 -361 -140 -84 -68 -93 -73 79 -69 183 135 -153 201 -13 -7 81 6 98 97 -83
8000h3J31j71M85p7l87K9J36p4L5k28K34N1l56R7K58l84M83l6k0j74J85j98N2
$$ -83 48 -123 362 285 -102 -73 63 -11 24 -204 30 81 -275 -178 80 -304 179 143 123 -51 134 -64 -12
8023a2j96P2J00k38K53k49K97n2j03J2J35M6j08J08j78n6j6L11m4oo6k41J69j24
$$ -12 -208 -136 -36 -274 -21 -270 27 -25 -128 -116 19 65 -43 65 -113 -169 -185 126 82 76 10 -231 -62 -186
8047a86L14k50K95P3j25q6j25J40R7j79k73K16O8p2j61J14j21M43J03j52k5J12
$$ -186 128 -122 173 246 121 35 -90 50 147 -32 -305 -89 -21 -93 -254 -140 -261 182 285 133 108 220
8069B20j24l36L47j02m5l1L94l01J5K27m1k51n2K34j76J76k50K80j30j59K44K13
$$ 220 96 -240 107 5 -40 -71 323 22 37 264 223 -28 -80 154 -22 154 -96 184 54 -105 139 352
8091C52l78j96K9K95j08l0J05R2k42Q4j52Lm7J24l8J9N4J14l36K65p1K26K5Q0
$$ 352 -26 -222 -193 102 -6 -36 69 161 -81 3 -149 -146 -193 -69 -107 -88 -34 80 -256 9 -62 164 189 269
8115B69l09L8J80o7j99J57k26J96p9j08L28m24J55k1j87L33K8J1n0j18K40k35
$$ 269 -40 -2 178 111 -88 69 -157 39 -40 -148 180 -244 -89 -110 -297 36 64 75 25 -93 147 -88
8137h8N9j23Q4K9N1M2K1j44K5l0J33n7J43K1j52P1j30K0J0K33j28o7k77L0J85
$$ -88 -29 -152 -68 -39 12 54 75 -69 -44 -74 59 2 145 166 14 85 -45 -25 -15 218 90 23 -254 -224 -39
8162c9j43K13K76n18L0K85k88K42p2n3K90j57l6j52J91J2K7m3j80K22o2j56Q6
$$ -39 -182 31 307 -211 -181 104 -184 58 -14 -67 223 66 30 -122 69 81 108 65 -115 107 45 -111 -25
8185b5j24Q3j80J08Q6l27
$$ -25 -149 -66 -246 -138 -52 -379
8191c79
$$ Imaginary data points
##PAGE= N=2
##DATA TABLE= (X++(I..I)), XYDATA
0@%%%%%%%oOqJ6j6J6k4M0m8N6p2Q8j04J28j52J76k15K55k96L44m00M64n30O06
$$ 0 0 0 0 0 0 0 0 -6 0 -8 8 -8 8 -16 24 -24 32 -40 48 -56 72 -80 96 -119 136 -160 184 -216 248 -282 324
31C24o93P87q93J012j141J283j440J610j798K004k229K475k743L037l358L707
$$ 324 -369 418 -475 537 -604 679 -761 849 -949 1055 -1174 1301 -1442 1595 -1763 1944
47A944m088M506m966N472o026O642p327Q087q942R913j1020J2296j3791J5568
$$ 1944 -2144 2362 -2604 2868 -3158 3484 -3843 4244 -4698 5215 -5805 6491 -7300 8268
61H268j7721K0396k3818K8379l4801M4576o1427R8397l24919K57829O05595n47711
$$ 8268 -9453 10943 -12875 15504 -19297 25279 -36148 62249 -262670 -4841 600754 53043
73E3043m94962J71107M91416m5884j88717o4264k0506m1130K30154K01913k69157
$$ 53043 -441919 -270812 220604 174720 -13997 -78261 -98767 -139897 90257 292170 23013
84B3013l75849J92273M64166k5715m68772q0507L09622J62840j47646j17818p902
$$ 23013 -352836 -160563 303603 277888 -190884 -271391 38231 201071 53425 -64393 -72295
95g2295P498Q8792J29799p4261k38410K2822K81455L1495k27194p5001J68257
$$ -72295 -64797 23995 153794 79533 -158877 -136055 145400 176895 -50299 -125300 42957
106D2957M1928j07239L9264P7577j35272j08070K11468J58120k33870k22041K03031
$$ 42957 84885 -22354 16910 94487 -40785 -148855 62613 220733 -13137 -235178 -32147
117c2147K67491j65636k44157J22843J85034j04414j13666J40922N8107k02980
$$ -32147 235344 69708 -174449 -51606 133428 29014 -84652 56270 114377 -88603
127h8603m7405K75559P3834l19294j24310K94239J80384k36639k07298J53225
$$ -88603 -136008 139551 213385 -105909 -230219 64020 244404 7765 -199533 -46308
137d6308J70467p5111r4742L0998k417k8332Q2278O9844j18820j32181J25917
$$ -46308 124159 49048 -45694 -14696 -17113 -45445 36833 106677 -12143 -144324 -18407
148a8407J72996r7268j74645M9212J45100k0920r8439J4956M5353m3227q451P8499
$$ -18407 154589 57321 -117324 -68112 76988 56068 -42371 -27415 17938 -25289 -33740 44759
160D4759j9544j01978K3571J13559j9411j19420L2463J22727n0382j25241P0720
$$ 44759 25215 -76763 -53192 60367 40956 -78464 -46001 76726 26344 -98897 -28177
171b8177J35237p3748j47805N7807J56125m1321j44421K6170J01986k4538n7409
$$ -28177 107060 33312 -114493 -56686 99439 58118 -86303 -60133 41853 17315 -40094
182d0094M1888K4679q0962j5592J29435L3165j58060n8959J56355R2542j18084
$$ -40094 1794 26473 -54489 -70081 59354 92519 -65541 -124500 31855 124397 6313
193F313j10437P4382R6787l3480n0836O456q664p254N6224L0051q1248p1868Q2978
$$ 6313 -104124 -29742 67045 33565 -17271 -10815 -19479 -26733 29491 59542 -21706 -93574 -10596
206a0596J07528o8042j14818M1034J03397r518p5080K13M5812p773j5946L1805
$$ -10596 96932 28890 -85928 -44894 58503 48985 -26095 -25882 19930 12157 -3789 28016
218B8016n265n5804J1476O7988l562p8847q570P8784Q526p1385j788N9180o668
$$ 28016 22751 -33053 -21577 46411 42849 -35998 -44568 34216 42742 -28643 -30431 28749 22081
231B2081m9765J5379N4035k0955n8834K8130O0442k6070n2770J7597M1274j3740
$$ 22081 -27684 -12305 41730 20775 -38059 -9929 50513 24443 -28327 -10730 30544 16804
243A6804l1948J7747J6601l4777o111M8180M40n7707q622O1460K2616n9700k7687
$$ 16804 -15144 2603 19204 -15573 -21684 26496 26936 -30771 -39393 22067 44683 -15017 -42704
256d2704N1447K4297l2004j2713J6022l25j1861J6147J7750l5207l0301M3410
$$ -42704 8743 33040 1036 -11677 4345 4020 -7841 8306 26056 -9151 -39452 3958
268C958L6750m0526m6533K6527M9875j4655m5290Q842L0644n120q887P237l820
$$ 3958 40708 182 -46351 -19824 30051 15396 -29894 -21052 9592 4472 -4415 2822 -998
281i98j3629J0294K9211j1763m3690J0619M7487o102m5852m837L7938R996l1861
$$ -998 -14627 -4333 24878 13115 -30575 -19956 27531 21429 -24423 -29260 8678 18674 -13187
294a3187q756K3045M67j1248Q000O096j1261o035J9419J2595k4758j4113K8460
$$ -13187 -21943 1102 1569 -9679 -1679 4417 -6844 -12879 6540 19135 -5623 -19736 8724
307H724J2641k4728j3229J8351J3372j8323j3362J9173N542j8330M37J4791j065
$$ 8724 21365 -3363 -16592 1759 15131 -3192 -16554 2619 8161 -10169 -9732 5059 3994
320C994j2898K664J6707l826j6020R610J5390j0775j1885R159J1737p766j5344
$$ 3994 -8904 -6240 10467 6641 -9379 231 15621 4846 -7039 2120 13857 6091 -9253
333i253R018J3130j3071r640J0546N679p723o261Q398O349j0109j510J3309k330
$$ -9253 -235 12895 -176 -9816 730 6409 -1314 -7575 823 7172 -2937 -4447 8862 6532
347F532j0591M535J1172k113j3555L99J5645l060j4570J519P939j53n611k487
$$ 6532 -4059 476 11648 9535 -4020 -3621 12024 8964 -5606 -4087 3852 3699 -1912 -4399
361d399L676r95k681Q044M30j0587J068J1991L961j0330r260J1151J0392q475
$$ -4399 -723 -1718 -4399 3645 4075 -6512 -5444 6547 10508 178 -9082 2069 12461 3986
375C986p738J175L060K130j513k737l653l477P689P073q681p964M410Q307L861
$$ 3986 -3752 -2577 483 2613 1100 -1637 -5290 -8767 -1078 5995 -2686 -10650 -6240 2067 5928
390E928o126n073L468K409M097K865q477p120N308Q927J689j2117q582Q724P188
$$ 5928 -198 -5271 -1803 606 4703 7568 -909 -8029 -2721 6206 7895 -4222 -12804 -4080 3108
405C108j714l629n993j275O892Q453K136j3373r819J4494J7389o057j7772o027
$$ 3108 1394 -2235 -8228 -9503 -2611 5842 7978 -5395 -15214 -720 16669 10612 -7160 -13187
419a3187J4811J3615q542j3456k719M883R224K711q329r178k758J3063J4820q668
$$ -13187 1624 15239 6697 -6759 -9478 -4595 4629 7340 -989 -10167 -12925 138 14958 6290
433F290j9198j710J8516J6531j0144k3086M99K0048J0726j0258j8605k30J4527
$$ 6290 -12908 -14618 3898 20429 10285 -12801 -12302 7746 18472 8214 -10391 -10621 3906
446C906N412m088p948q121K565J1438R037o275k0834k271K6661J4958j9243k4688
$$ 3906 9318 5230 -2718 -10839 -8274 3164 12201 5926 -14908 -17179 9482 24440 5197 -19491
460a9491O917L0363N548k5275j2673J0968J2453P51p183n439o349j845J8104J3349
$$ -19491 -12574 17789 23337 -1938 -14611 -3643 8810 9561 2378 -3061 -9410 -11255 6849 20198
474B0198k0835k6249J0419L7126Q423l7725k4298K8072L3549o840l1646j2251
$$ 20198 -637 -26886 -16467 20659 29082 -8643 -32941 -4869 28680 21840 -9806 -22057
486b2057K0728J7669l054j1981j3471m542J5303K0254k587l1090k0684K9085M0841
$$ -22057 -1329 16340 13286 1305 -12166 -16708 -1405 18849 16262 -14828 -35512 -6427 34414
499C4414j0714m8154j5629M2286M0569k3223m7206j447L7470K1284j7457k6203
$$ 34414 23700 -24454 -40083 2203 42772 19549 -27657 -29104 8366 29650 12193 -14010
511a4010l324J0931J3803J2313j2278l1902o609L6692L2915k6459n2628O688N7323
$$ -14010 -17334 -6403 7400 19713 7435 -24467 -31076 5616 38531 12072 -40556 -33868 23455
524B3455J8247m3222l4958K2773L8237l949k4550o299L930L608R528Q889j1538
$$ 23455 41702 -1520 -36478 -13705 24532 20583 -3967 -10266 -6336 -2728 6800 15689 4151
537D151k7563L73L8298J5857l5404l1691K0005M2124N77l9517j3851K5583K1335
$$ 4151 -23412 -23039 15259 31116 -4288 -35979 -15974 26150 26727 -12790 -26641 -1058 20277
550B0277o560j8473m858Q091M638M991K466j2712j5231P036K5069P081k9665k4252
$$ 20277 13717 -4756 -9614 -1523 3115 8106 10572 -2140 -17371 -10335 14734 21815 -7850 -32102
564c2102K4395L5820q564l7913q916L3436K1591k0997k1015O489J3090K786k189
$$ -32102 -7707 28113 19549 -18364 -27280 6156 27747 6750 -14265 -7776 5314 8100 5911
577E911j301q450j1216J2221K4444q941l3598n195L4730K1137k8425l0258J6430
$$ 5911 4610 -3840 -15056 -2835 21609 12668 -20930 -26125 8605 29742 1317 -28941 -12511
590a2511L0712j331k1857p971J2473Q116k854j42k074r792j21J2929Q337j2413
$$ -12511 18201 16870 -4987 -12958 -485 7631 4777 4635 2561 -7231 -7352 5577 13914 1501
604A501j8512M973K1943L848j7346j2718Q714J7651N46j3860m594N724O751J409
$$ 1501 -17011 -12038 9905 13753 -3593 -16311 -7597 10054 10600 -3260 -7854 -2130 4621 6030
618F030l505j959l360k569Q324P979q614j4595N31J8101P591j7308j3365J1386
$$ 6030 2525 566 -2794 -5363 2961 10940 2326 -12269 -11738 6363 13954 -3354 -16719 -5333
632e333J4621k469j1574k506P202L225n92K225l784p453L071J1290K119j3618
$$ -5333 9288 6819 -4755 -7261 -59 3166 2574 4799 1015 -6438 -3367 7923 10042 -3576
646c576r647J1849J2940p971j3477Q69J1020N123p695n284K865L873K429r2l864
$$ -3576 -13223 -1374 11566 3595 -9882 -9013 2007 7130 -565 -5849 -2984 889 3318 3226 -638
661f38j302K083L034J576m192l283K491J910P69j867m543Q87L494J176j204l857
$$ -638 -1940 143 3177 4753 561 -2722 -231 1679 2448 581 -3962 -3075 419 1595 391 -3466
677c466K49N048P18k274m85j0J131R39N68P95l792k168M850K570m373m198L15
$$ -3466 -3217 1831 2549 275 -210 -220 911 1850 2418 3213 -579 -2747 2103 4673 300 -3898 -3583
694c583N252J413n229j561K223J370J679o14k339j91J673L746O69n846j657M934
$$ -3583 1669 3082 -2147 -3708 -1485 -115 1564 950 -1389 -1580 93 3839 4508 -1338 -2995 1939
710A939K953k124n778m82M993J351l299k550j057L064L294k027l232j73L401L955
$$ 1939 4892 2768 -3010 -3492 1501 2852 -447 -2997 -4054 -990 2304 277 -2955 -3128 273 4228
726D228k719m278J862L564J286k799l414J836K865j343j526k132K19K904j89j677
$$ 4228 1509 -2769 -907 2657 3943 1144 -2270 -434 2431 1088 -438 -2570 -2351 553 364 -1313
742a313j145N3K924Q87k483m97J755J058M40j272m41J336l30j19k5j711L66P47
$$ -1313 -2458 -2405 519 1406 -1077 -1574 181 1239 1679 407 -34 1302 972 853 828 -883 -517 230
760B30p49k9r62k18J868q75r44J446L59L23j90l95J454j4q33R51m58o97J011p14
$$ 230 -519 -548 -1510 -1728 140 -735 -1679 -233 126 449 259 -136 1318 1304 471 1422 964 267 1278 564
780E64r28J3n17J107q60j525J177P61k23k11l54J065J487j547m2J465l88Pj48
$$ 564 -364 -351 -868 239 -621 -2146 -969 -208 -431 -642 -996 69 1556 9 -33 1432 1044 1051 903
799I03n41R14r70m65N91j423J30R18j110l17N92J90Q99p52q64K087J96k29M92
$$ 903 362 1276 306 -159 432 -991 -861 57 -1053 -1370 -778 -588 311 -441 -1305 782 978 749 1241
818A241j000L48J018o93k27j246m01J921r4k411l8O06O90J02j456P77O72m21J167
$$ 1241 241 589 1607 914 687 -559 -960 961 867 -1544 -1582 -976 -286 -184 -1640 -863 -191 -612 555
837E55M85j176L19M23J264K9k218K90J359j108m5m32l54P2o58M77N66j389j73
$$ 555 1040 -136 183 606 1870 1899 -319 -29 1330 222 177 -255 -609 -537 -1195 -718 -152 -1541 -1714
856a714J850L12k43n49L93J194q92J02J724j820j454J526J637j063k582o02K653
$$ -1714 136 448 205 -344 49 1243 351 453 2177 357 -1097 429 2066 1003 -1579 -2181 472
873D72N45k650M07L13j84J331J48K7r75j077L583J004k718j473J290K194r3k851
$$ 472 1017 -1633 -1226 -913 -1097 234 382 409 -566 -1643 1940 2944 226 -1247 43 2237 2144 -707
891g07n50J372l07P22k36k379k01J995J346m43k830P60K642k00r2J51j834K82
$$ -707 -1257 115 -192 530 294 -2085 -2286 -291 1055 612 -2218 -1458 1184 984 892 1043 -791 -509
909e09K031J884j991m703J097N802n70o048j214M256K226k778k284L003k53j971
$$ -509 1522 3406 1415 -3288 -2191 3611 3041 -3007 -4221 35 2261 -517 -2801 202 -51 -2022
925b022K858K787l348l973K488P183j336q510m92O921K346m752l976J888L099
$$ -2022 836 3623 275 -3698 -1210 5973 4637 -3873 -4365 2556 4902 150 -3826 -1938 1161
940A161q06r49M05j965m53K980K715j674m559N13N018J976k706l950n90M799L384
$$ 1161 355 -594 -189 -2154 -2607 373 3088 1414 -3145 -2632 2386 4362 1656 -2294 -2884 1915 5299
957E299m180n116M50N687J591m995k809L586Q88j741J330J652k033l880L202P995
$$ 5299 1119 -3997 -3547 2140 3731 -1264 -4073 -487 401 -1340 -10 1642 -391 -4271 -1069 6926
973F926k931j0182J516J0359J618r691m345Q118M094o507k747M201R62m867R94
$$ 6926 3995 -6187 -4671 5688 7306 -2385 -6730 1388 5482 -1025 -3772 429 1391 -3476 -2482
988b482O087q53q365L26J0061J855q782m298O798O483m455o035J944L595L51j714
$$ -2482 3605 2752 -5613 -5287 4774 6629 -2153 -6451 347 6830 2375 -3660 -1716 1879 2230 516
1004E16j593K17J5n6J835K3k502p86Q43L199J941m317l562L942N892j340q268
$$ 516 -1077 -860 -845 -901 934 957 -1545 -2331 -1488 1711 3652 -665 -4227 -285 5607 4267 -4001
1021d001q77Q343K711p576l422N203K917m353k686N277R07p058Q80Q324j31q901
$$ -4001 -4878 3465 6176 -1400 -4822 381 3298 -1055 -3741 1536 2443 -4615 -3735 4589 4458 -4443
1037d443k100J0148N022j0249n401Q251N332n384m925L131L783m239j774M853
$$ -4443 -6543 3605 8627 -1622 -7023 1228 6560 1176 -3749 -618 3165 -1074 -2848 2005
1051B005j99n205o60N998J951n367l578M697M128j892l021m86J780K293o70j619
$$ 2005 1806 -3399 -4059 1939 3890 -1477 -5055 -358 3770 1878 -1143 -1629 151 2444 1774 155
1067A55j528R18K577j046k766R54J515k118k77K142N84l343j579N695K346n759
$$ 155 -1373 -455 2122 1076 -1690 -736 779 -1339 -1616 526 1110 -2233 -3812 1883 4229 -1530
1083a530l036N820M004m772m608M394M712m969l663M411K583m938k357M838K738
$$ -1530 -4566 1254 5258 486 -4122 272 4984 15 -3648 763 3346 -1592 -3949 889 3627
1098C627n855k940O594K178n038k119M433K631l631k325M214P71l434J30K649
$$ 3627 -2228 -5168 1426 3604 -1434 -3553 880 3511 -120 -2445 1769 2540 -894 -764 1885
1113A885l19l057o4K794k68l247J016J948j067j084J219R12j392o38K638R73l614
$$ 1885 1566 -1491 -1555 1239 971 -2276 -1260 688 -379 -1463 -244 668 -724 -1362 1276 2249 -1365
1130a365M83L291q10k613N9K883m63l545R72L326k330k889K658K465k271l291
$$ -1365 -882 2409 1599 -1014 -955 1928 1465 -2080 -1108 2218 -112 -3001 -343 2122 -149 -3440
1146c440K789L680k818l062L675J957k745j751K492K033l306j715L675Q19l993
$$ -3440 -651 3029 211 -2851 824 2781 36 -1715 777 2810 -496 -2211 1464 2283 -1710
1161a710n64L452L45l402r73L964M01l701N98L334p25k728P55L226r14l185J717
$$ -1710 -2274 1178 1523 -1879 -2852 1112 1513 -2188 -1590 1744 1019 -1709 -954 2272 1358 -1827 -110
1178a10K845k467k099J988J725k223k058J882K303k591j924L201P31k336j27K159
$$ -110 2735 268 -1831 157 1882 -341 -2399 -517 1786 -805 -2729 472 1203 -1133 -1260 899
1194H99R06k725j80L329n66k931Q85K129j066j980O36K401j612k472J737J813
$$ 899 1805 -920 -1100 2229 1663 -1268 -383 1746 680 -1300 -664 1737 125 -2347 -610 1203
1210A203j944j384J620K094j858j488K384J676k724q79K715K76k273m97K547L92
$$ 1203 -741 -2125 -505 1589 -269 -1757 627 2303 -421 -1300 1415 1691 -582 -1079 1468 1860
1226A860l247k02L154r56k320N34K036k63k688R77K892j381k234J878J932j446
$$ 1860 -1387 -1589 1565 609 -1711 -1177 859 596 -2092 -1115 1777 396 -1838 40 1972 526
1242E26j592J165J917j832j534K069O58j988p67J721O17k078q38K457M16k523
$$ 526 -1066 99 2016 184 -1350 719 1377 -611 -1378 343 960 -1118 -1956 501 917 -1606
1258a606O21K022m98j262N10J787o12k098J295J825j740j261J199J005j051j823
$$ -1606 -985 1037 539 -723 -213 1574 962 -1136 159 1984 244 -1017 182 1187 136 -1687
1274a687J376J455k028o33J734M47j592l92K221L20j833l32K492k11j874J79J786
$$ -1687 -311 1144 -884 -1517 217 664 -928 -1320 901 1221 -612 -944 1548 1337 -537 -358 1428
1291A428k90k091J44J895q34j761J097J140p84j557Q80J803j077j228J444J138
$$ 1428 1138 -953 -809 1086 252 -1509 -412 728 -56 -1613 -733 1070 -7 -1235 209 1347
1307A347j274n49J028K81m36r13J149M75j667k32J220k12j013l75J016N41j370
$$ 1347 73 -476 552 833 397 -516 633 1108 -559 -791 429 217 -796 -1171 -155 386 -984
1324i84L29J181q57l07P97O76l13j035J032P15r94r23J260n2q28j66J90O31r24
$$ -984 -655 526 -331 -638 159 835 522 -513 519 1234 240 -683 577 525 -303 -469 -279 352 -572
1343e72m65J225qj087L49P88K80p76l32J503J91j537P62M93M7r08j2L41m2o94
$$ -572 -1037 188 180 -907 -558 230 510 -266 -598 905 1096 -441 321 814 861 -47 -59 282 240 -454
1363d54J75K66o49r2K78K83Rl59K57P14m21q4L82m0k03M35k04J2l86m2O34o32
$$ -454 -279 -13 -662 -754 -476 -193 -184 -543 -286 428 7 -77 305 265 62 497 293 305 -81 -123 511 -121
1385a21q96P03J37K23n43l15Q63J30n20K75M25m45K73J11J16M53j237J22N05k54
$$ -121 -1017 -314 -177 46 -497 -812 51 181 -339 -64 361 -84 189 300 416 869 -368 -246 259 5
1405EJ65p81J11Q79l01p79L23L21j08k31k2P12L46q80K02Q14j24p17k96Q87M31
$$ 5 170 -611 -500 379 78 -701 -378 -57 -165 -396 -418 294 640 -240 -38 776 652 -65 -361 526 957
1426I57j139n26Q19J47j44j143J11J468m93p75J93N01M13n51k51J173K88j397
$$ 957 -182 -708 111 258 114 -1029 -918 550 57 -718 -525 -24 389 -162 -413 760 1048 -349
1444c49Q9J040K94r51r35Q65J363j499j128P59P92k45j155J66J650m68j139O28
$$ -349 -260 780 1074 123 -812 53 1416 -83 -1211 -452 340 95 -1060 -894 756 288 -851 -223
1462b23J372k86j356J79J814k16j868K12J365o8j300j035J514J120j552j069R81
$$ -223 1149 863 -493 -314 1500 1284 -584 -372 993 925 -375 -1410 104 1224 -328 -1397 -416
1479d16Q74o75p26P52J157o55j240J385O73o30r37L78Q62J33j781o2J166L43q32
$$ -416 458 -217 -943 -191 966 311 -929 456 1129 499 -438 -60 802 935 -846 -908 258 601 -231
1498b31j086J206N57q50p35P40J051n25j166J025J419j019j271Q19J417k31j669
$$ -231 -1317 -111 446 -404 -1139 -399 652 127 -1039 -14 1405 386 -885 -66 1351 1120 -549
1515e49m68K314k42j811l05J448J89j230o92J502P05j590l98J611N97r09q56J127
$$ -549 -1017 1297 1055 -756 -1061 387 576 -654 -1346 156 861 -729 -1127 484 1081 172 -684 443
1533D43J226j764r51J469P11j008r06N25Q59o93j016N96J021q73L3k73R31L56
$$ 443 1669 -95 -1046 423 1134 126 -780 -255 604 -89 -1105 -509 512 -361 -328 -601 330 686
1551F86j107O6N76N73k84q11N02R64p87o66M83K27k01q02j74J220l49j275P21
$$ 686 -421 -355 221 794 510 -301 201 1165 378 -288 195 422 221 -581 -755 465 116 -1159 -438
1570d38O34K00p18n30J302P00j336j95J282j48p56o82R91M98j290k56J141Q0j044
$$ -438 196 396 -322 -852 450 1150 -186 -381 901 753 -3 -685 306 804 -486 -742 399 479 -565
1589e65m08P37O68q49l29Q75N6l47RK10P20n55k61K96L09o37rJ03m6k13k02J89
$$ -565 -973 -236 432 -417 -746 129 185 -162 -153 57 777 222 -39 257 566 -71 -80 23 -23 -236 -438 -249
1611b49r3k2J91k31j95O32K45r8l62L73L77l40n75O05N10m85n86P14l1n37o74
$$ -249 -342 -364 -173 -404 -599 33 278 180 -182 191 568 228 -347 258 768 283 -303 411 380 -157 -831
1632h31O68N72r79k47R68L57r71j40P71N44p68m41J207N6o89k55P24j22o71l88
$$ -831 -163 409 -570 -817 151 508 -463 -603 168 712 -56 -497 710 766 77 -178 546 424 -247 -635
1652f35Q88pq21K33M20Nl65q7O27j12m10L55M27n02J89r2L81m9k64k94P22r32
$$ -635 253 246 -575 -342 78 83 -282 -369 258 146 -264 91 518 16 205 113 494 445 181 -113 609 -323
1674c23k4L23j42k21p9M29m4m96L91O59l19l69K32M63k29l71K39N41n10n39Q19
$$ -323 -347 -24 -166 -387 -466 -37 -81 -577 -186 473 154 -215 17 480 251 -120 119 660 150 -389 430
1695D30j65n36N7J94R6k21m84O82k28l25L60K20L03n68k19J017j48o08L25L15
$$ 430 265 -271 -214 -20 76 -145 -629 53 -175 -500 -140 80 383 -185 -404 613 465 -143 182 497
1715D97k95l61j2N83m69o47N68K73m80k70O51kk70q0M12M94o26j34N90q4j87k86
$$ 497 202 -159 -171 412 -57 -704 -136 137 -343 -613 38 36 -234 -314 98 592 -34 -168 422 338 151 -135
1737a35J87L24k96n27P29n48j85K38L41k29k11J13L81R3o54O68K39p32K8O22Q1
$$ -135 52 376 80 -447 282 -266 -451 -213 128 -101 -312 -199 182 275 -379 289 528 -204 -176 446 527
1758E27m05l98P73k22m57n5K48J55m79j42M32L16j004M69M48j76m54K83L50k9
$$ 527 122 -276 497 275 -182 -237 11 166 -313 -455 -23 293 -711 -242 206 30 -424 -141 209 180
1778A80j87n2O57l82o66L72K74l5l31j05K06j71k40N46j94l50L6M2M97r5k12K97
$$ 180 -7 -59 598 216 -450 -78 196 161 -170 -275 -69 -240 -480 66 -128 -478 -442 -400 97 2 -210 87
1800H7K85j99j43Q5J45l70L84k24jj75l87N90l43J5K5j15n1J87L88j29m47N39
$$ 87 372 173 30 115 260 -110 274 50 49 -126 -513 77 -266 -251 -226 -341 -392 -205 183 54 -393 146
1822A46K92n11p1J67J99l2m37J9N27j09l89N1J84l62j46j4P04J2n64J95M94j66
$$ 146 438 -73 -144 23 222 190 -247 -228 299 190 -199 -148 36 -326 -472 -486 218 230 -334 -139 355 189
1844A89l72K52J37O7l90M50O5k7m20j87J66q6r8J27J10m18L76K70k93j7L8K61
$$ 189 -183 69 206 273 -117 333 398 371 -49 -236 -70 -156 -254 -127 -17 -435 -59 211 -82 -99 -61 200
1866B00M2m89N68J13o60K08J12J13p0l83L19L23p22l9M80j75j12q9K0M00j28j14
$$ 200 242 -247 321 434 -226 -18 94 207 137 -246 73 396 -326 -365 115 -60 -172 -261 -241 159 31 -83
1888h3M19J3j68k31L93j67O7k91J74j39j46k05L22j58J40j40j41N0J9M46j48j63
$$ -83 336 349 181 -50 343 176 243 -48 126 -13 -159 -364 -42 -200 -60 -200 -341 -291 -272 174 26 -137
1910a37L53j79j85L24j20L09k04l61K37J43l96k46N16j17m6m06J48N92l05m18
$$ -137 216 37 -148 176 56 365 161 -200 37 180 -216 -462 54 -63 -109 -515 -367 225 -80 -498
1930d98M60J95k87l7M9O46m74k51L59J25K66o86k68O36M56j279J68L84L2k13k80
$$ -498 -38 157 -130 -167 -118 528 54 -197 162 287 553 -133 -401 235 691 -588 -420 -36 -4 -217 -497
1951d97L08N02k43k92J07N26k17l25k88P92k00n29N17R4k11k59l20N85J43p33
$$ -497 -189 313 70 -222 -115 411 194 -131 -419 373 173 -356 161 255 44 -215 -535 50 193 -540
1971e40J30L66J47M5m08J58L97k30m9J04M24j53m46J60L27m31m64L90K24L6n47
$$ -540 -410 -44 103 148 -260 -102 295 65 16 120 544 391 -55 105 432 1 -463 -73 151 187 -360
1992c60j56Q69n07j39k94O53J34k24p2J01P80m85o03K66M22j30m77l47Q66o91
$$ -360 -516 353 -154 -293 -587 66 200 -24 -96 5 785 300 -303 -37 385 255 -222 -569 297 -394
2012c94k45O9P54l25l91o2P82r7m23K53L95j86l83L08J96L11o05l01O76o8k54
$$ -394 -639 -570 184 -141 -532 -594 188 91 -332 -79 316 130 -253 55 251 562 -43 -344 332 264 10
2033A0k66J07K63l23k41L01J0q9J4K35K18l03J81k23M65J81l22l15P6M69l85n1
$$ 10 -256 -149 114 -209 -450 -149 -139 -228 -214 21 239 -64 117 -106 359 540 218 -97 -21 448 63 12
2055A2K0m9J97o23K3P34k70m84PL95K36o82K31O58K5o50K77L76l63m04J38M24
$$ 12 32 -17 180 -443 -420 314 44 -440 -433 -38 198 -484 -253 405 430 -220 57 433 70 -334 -196 228
2077B28j31o73K3O72P4o06R9K65N05o34j14O71l88m31P84k11J0j28O5J77m34J15
$$ 228 97 -576 -553 119 193 -413 -314 -49 456 -178 -292 379 -9 -440 344 133 143 15 80 257 -177 -62
2099f2L8j33k63K02K6j82j9K39J70j52q7M73K98q26M7M57K47l66n12Q57p1o96
$$ -62 -24 -157 -420 -218 -192 -374 -393 -154 16 -136 -223 250 548 -278 -231 226 473 107 -405 452 381 -315
2121c15m8N24P6m89k89Q15j32l95m4N02L5k59k28N96n9m34p0P94m05l99M60N2
$$ -315 -363 161 237 -252 -541 274 142 -253 -297 205 240 -19 -247 349 290 -144 -214 580 175 -224 236 288
2143B88j72k30j00K39j41l65M19r9r6rK86M3j24M0K93R6o36K97M19l27n00L98
$$ 288 116 -114 -214 25 -116 -481 -62 -161 -257 -266 20 63 -61 -21 272 368 -268 29 448 121 -379 19
2165A9M22l92l95L51N91r72oL97O9j11k58M24J01k12k81M65J10m06K3L53J40o63
$$ 19 441 49 -346 5 596 -376 -382 15 84 -27 -285 139 240 28 -253 212 322 -84 -61 292 432 -231
2187b31L43Q9k62k48k07O07j6k33l15N85l20k66P44L8l52r0J87K63k82J5K54j51
$$ -231 112 201 -61 -309 -516 91 75 -158 -473 112 -208 -474 270 308 -44 -134 53 316 34 49 303 152
2209A52l24r6P51m94j07j98N28q6o93N37J49j02l08L63M1K90p75M78O62n39k31
$$ 152 -172 -268 483 -11 -118 -316 212 126 -567 -30 119 17 -291 72 113 403 -372 106 768 229 -2
2230bJ3K72l34l63N61n6j73n23N65L06m91j48L49L10l57k11M04P9m09L47N6k00
$$ -2 11 283 -51 -414 147 91 -82 -605 -40 266 -225 -373 -24 286 -71 -282 122 201 -208 139 195 -5
2252ej30r6O04l31n72N72j45J45k95J28K76k98m28R87j12m12j89M41L5J1o0J84
$$ -5 -135 -231 373 42 -530 42 -103 42 -253 -125 151 -147 -575 412 300 -112 -301 140 175 186 126 310
2274C10J36m53k28N29j94m66K70P0j57m99L64K86P2l95k7M58l53K51K23k2m82
$$ 310 446 -7 -235 294 100 -366 -96 -26 -183 -682 -318 -32 40 -355 -382 76 -277 -26 197 175 -307
2295c07L08p4K96m49Q9L36n9j96l73L99M9l18l7M54o0m77J62P51l3q52L18L70
$$ -307 1 -73 223 -226 -137 199 140 -56 -429 -30 19 -299 -336 118 58 -419 -257 494 461 -391 -73 297
2317B97j08l43M36j25l39j16K14M88m51l79L63K56k48m74M18J12k41p4N43j01
$$ 297 189 -154 282 157 -182 -298 -84 404 -47 -426 -63 193 -55 -529 -111 1 -240 -314 229 128
2337A28j45L50r6j00m15M42q8k4m57M43n1j91j21L52N2k79k07N37J84l20R4p6
$$ 128 -17 333 237 137 -278 164 76 52 -405 38 -13 -204 -325 27 79 -200 -407 130 314 -6 88 12
2359A2Q3Q5m81N41l29Q5j1J10k60m8J63J45J3n77J06L25k58P0K08n2K19k60R6
$$ 12 95 180 -301 240 -89 -4 -15 95 -165 -213 -50 95 108 -469 -363 -38 -296 -226 -18 -70 149 -111 -15
2382a5J82J66m33J80J03j74K21l02m8Q8J61q7l63K7K01j32Q0l5J47K16l16j65
$$ -15 167 333 -100 80 183 9 230 -72 -120 -32 129 42 -321 -294 -93 -225 -145 -180 -33 183 -133 -298
2404b98K92K39l79K59J93k03k41qj1N92n63m00L22Qj41J55J32K25l73R1R1K40
$$ -298 -6 233 -146 113 306 103 -138 -146 -157 435 -128 -528 -206 -198 -339 -184 -52 173 -200 -109 -18 222
2426B22k72k1K39k2rl09L19m0O4j23j46K37k38O8k64J32q8L58l71k5M58K94n01
$$ 222 -50 -71 168 146 137 -172 147 107 171 48 -98 139 -99 -31 -295 -163 -251 107 -264 -289 169 463 -38
2449c8J84j98O05o89kM27j0m54O1J65j35R2l38J6M07l20R6k5J48N4k27J73L17
$$ -38 146 -52 553 -136 -138 289 279 -175 -114 51 -84 8 -330 -314 93 -227 -131 -156 -8 46 -181 -8 309
2472C09k0m42L00N6k41J11j65J28q2k29K43J46O8j78l71M56k8j15l11O26l47K79
$$ 309 289 -153 147 203 -38 73 -92 36 -46 -275 -32 114 182 4 -367 89 61 -54 -365 261 -86 193
2494A93k34Q2P0j6j63k2N48l48l38M97N9l08j25r9M36k98j64m1J88M94l24j11
$$ 193 -41 41 111 95 -68 -90 458 110 -228 269 328 20 -105 -204 232 -66 -230 -271 -83 411 87 -24
2516b4J60O2j3l43K46N6j00k11K05P2O3k44j61L50o3j00j57J3L83L4k79R0J60
$$ -24 136 198 185 -158 88 144 44 -167 38 110 173 -71 -232 118 55 -45 -202 -189 194 228 -51 39 199
2539A99k20j54K95J48k34r7J10J16j21n16K70K90j18j67J32J93j52k13K24J36
$$ 199 -21 -175 120 268 34 -63 47 163 42 -474 -204 86 -32 -199 -67 126 -26 -239 -15 121
2559A21N0k71q4M53k4m0l62K05j4J51k87jK57j74qk24j39K95J06q1K01q9J27k0
$$ 121 171 -100 -184 269 245 205 -157 48 34 185 -102 -103 154 -20 -28 -252 -391 -96 10 -71 130 41 168 148
2583A48J76l39J62j74J79O7l45j81J82j27R6q1j23L52q2k49L40J15k19J69K1J28
$$ 148 324 -15 147 -27 152 219 -126 -307 -125 -252 -156 -237 -360 -8 -90 -339 1 116 -103 66 87 215
2605B15Kq7j98K02q4q7RP8M2j68k23R8N1l0J44j22J34l91K80L23n0m2q3K53p4
$$ 215 217 130 -68 134 50 -37 -28 50 92 -76 -299 -201 -150 -180 -36 -158 -24 -415 -135 188 138 96 13 266 192
2630A92k50J47J38k04lK33l22k3M81m47R4k87Q8R1J05l25K83j27K69j30p4M97
$$ 192 -58 89 227 23 20 253 -69 -92 389 -58 36 -251 -163 -72 33 -292 -9 -136 133 3 -71 426
2652D26n18K62L76k01k93j58P6K73k09k96J22K3j83J22lM42o63M91L29l90q9M4
$$ 426 -92 170 546 345 52 -106 -30 243 34 -262 -140 -117 -300 -178 -181 261 -402 89 418 28 -61 -17
2674a7J78j52oJ70o8J3J02k59J87k64j36O41k73j25j38J85l6M4j93N47jl47j8
$$ -17 161 9 3 173 105 118 220 -39 148 -116 -252 389 116 -9 -147 38 2 46 -147 400 399 52 34
2697C4j6P3P5j52L06l76k99J32K83k18m3p8J53K31m55M61o6j52K34NJ87j68n9
$$ 34 18 91 166 14 320 -56 -355 -223 60 -158 -201 -279 -126 105 -350 111 45 -107 127 132 319 151 92
2720I2J10K06m61j65O36l07l83K11J38p3l42J04J08P3l18M22p2OJ57j42L46k59
$$ 92 202 408 -53 -218 418 111 -272 -61 77 4 -338 -234 -126 -53 -371 51 -21 -15 142 0 346 87
2742H7k59L20O6k55k90M78j32j32n4M4P0Nk40L02N2l47M12l66K06l09K89j5K48
$$ 87 -172 148 214 -41 -331 147 15 -117 -171 -127 -57 -52 -292 10 62 -285 127 -239 -33 -342 -53 -68 180
2765A80k47kQ0j49j38N7M00j05j82L87j88j94O5m3K19j37p9J27j64J39n0L07r1
$$ 180 -67 -69 11 -138 -276 -219 181 76 -106 281 93 -101 -36 -79 140 3 -76 51 -113 26 -24 283 192
2788A92l29R6J26l2l70J5K92k49RK38k87M6j27M24J47j62j77oK30Kj88K03N7k45
$$ 192 -137 -41 85 53 -317 -302 -10 -259 -250 -12 -299 -253 -380 44 191 29 -148 -154 76 78 -110 93 150 -95
2812i5L61k42j1j43J15k48K06l1j53K87J42k25j46o8J17J26J69j22jJ31l53L81
$$ -95 266 24 13 -130 -15 -263 -57 -88 -241 46 188 -37 -183 -251 -134 -8 161 39 38 169 -184 197
2834A97M2l93j30N04l73k02M09M5k81L5o8K89j25k68L58k9m99J90P60l08l04J12
$$ 197 239 -154 -284 220 -153 -355 54 99 -182 -147 -215 74 -51 -319 39 10 -489 -299 461 153 -151 -39
2856c9Q6pk25K34J34n53L86j17l1Qo6Q2L62l17p3J32J11N1k08K1K32j26NM38m83
$$ -39 47 40 -185 49 183 -370 16 -101 -132 -124 -190 -108 254 -63 -136 -4 107 158 -50 -29 203 77 82 520 37
2881C7l55N17j37l08J31J18j2j2m00L34r8J35K24j65o4L34q9q3J53k55l63N11
$$ 37 -318 199 62 -246 -115 3 -9 -21 -421 -87 -185 -50 174 9 -55 279 190 107 260 5 -358 153
2903A53J16o41J84J67J8N7n31L51J74k16r5K57R9m66J95M76j58k25rK66M27o11
$$ 153 269 -372 -188 -21 -3 54 -477 -126 48 -168 -263 -6 93 -373 -178 298 140 -85 -94 172 599 -12
2925a2r4K35m50M85k44P5k68N1r1J35J99K4J42k72j70M63Rl23J77L67j30k0m06
$$ -12 -106 129 -321 164 -80 -5 -273 -222 -313 -178 21 45 187 -85 -255 208 217 -106 71 438 308 288 -118
2948a18K2Q7j2k16L03N2K00m83q5P20n88j10J3L96j80R6l4j00J92m07L97r9J56
$$ -118 -96 -9 -21 -237 66 118 318 -165 -250 470 -118 -228 -215 181 1 97 63 -37 155 -252 145 46 202
2971B02m44M44l43K21q5p8Ll2J73k3k79K63J07k34J57r7K59j74O6J31k56J78l79
$$ 202 -242 202 -141 80 -5 -83 -80 -112 61 38 -241 22 129 -105 52 -45 214 40 106 237 -19 159 -220
2994b20N39k14j27k4J60q1m38N11R6N6l04J2p4J41J36l71J86L3J41k81R9J12j28
$$ -220 319 105 -22 -46 114 33 -405 106 202 258 -46 -34 -108 33 169 -202 -16 17 158 -123 -24 88 -40
3017d0k60K41n0J17l60L94j89J73j43K32k6r5J83j39n7L06k09o7K22j20r6R9j56
$$ -40 -300 -59 -109 8 -352 42 -147 26 -117 115 89 -6 177 38 -19 287 78 11 233 113 17 116 -40
3040d0J32j55k9J6O6Q2j42j03P8L26k55l1P7J2j61n8J11J85J77l63k8K8Q3j02
$$ -40 92 -63 -92 -76 -10 72 -70 -173 -95 231 -24 -55 22 34 -127 -185 -74 111 288 -75 -103 -75 8 -94
3064i4o1m4L95j35r7j23L11k07k02M45o4P1k3j42m9K07l94J88K8J07l19R3J09
$$ -94 -155 -199 196 61 -36 -159 152 -55 -257 188 124 195 172 30 -19 188 -206 -18 10 117 -202 -109 0
3087@J73l46L9J66K45k87K96l76M8K10j0j6K50l95j57L13j85n2K72k82pL7L0K42
$$ 0 173 -173 -134 32 277 -10 286 -90 -42 168 158 142 392 -3 -160 153 -32 -84 188 -94 -101 -64 -34 208
3111B08mm9k11N7m3J01l87M36l54K29R8m5o1K5P9j05n5J33j06q5k04L70J2j16
$$ 208 204 155 -56 1 -42 59 -328 108 -246 -17 81 36 -25 0 79 -26 -81 52 -54 -139 -343 27 39 -77
3135g7p1N5J91l2l11M06j09m12M38o5j8K39m17M9J50j54N8M3l1O9k47L16rj33
$$ -77 -148 -93 98 66 -245 161 52 -360 78 13 -5 234 -183 -134 16 -138 -80 -37 -68 1 -246 70 61 -72
3159g2Q2P0PJ78j56p4R3j71K32L6k63J83j32lP9q4J15N4j43j53M8J64k25J09L01
$$ -72 10 80 87 265 109 35 128 -43 189 225 -38 145 13 10 89 5 120 174 31 -122 -74 90 -135 -26 275
3184B75j80Q7j55Q4J62k70P1j00L13m49nJ0L06k21l4o6j16L38J73k60P4q8n3K43
$$ 275 95 182 27 111 273 3 74 -26 287 -162 -167 -157 149 -72 -106 -172 -288 50 223 -37 37 -51 -104 139
$$ [...]
8191B06
##END NTUPLES=NMR FID
##END=
