##TITLE=1H_Pr NCS-2-3
 200.13MHz,CDCl3,
 8 sc
 
 8.7.2025
##JCAMPDX= 6.0         $$ Bruker NMR JCAMP-DX V2.0
##DATA TYPE= NMR FID
##DATA CLASS= NTUPLES
##ORIGIN= UXNMR, Bruker Analytische Messtechnik GmbH
##OWNER= pz
$$ XWIN-NMR		Version 3.5
$$ Tue Jul  8 13:57:42 2025 Russian Standard Time (UT+4h)  she@DPX200
##.OBSERVE FREQUENCY= 200.1313
##.OBSERVE NUCLEUS= ^1H
##.DELAY= (6, 6)
##.ACQUISITION MODE= SIMULTANEOUS
##.ACQUISITION SCHEME= undefined
##.AVERAGES= 8
##.DIGITISER RES= 18
##SPECTROMETER/DATA SYSTEM= spect
##.PULSE SEQUENCE= zg30
##.SOLVENT NAME= CDCl3
##.SHIFT REFERENCE= (INTERNAL, CDCl3, 0, 14.3821)
##AUDIT TRAIL= $$ (NUMBER, WHEN, WHO, WHERE, WHAT)
$$ ##TITLE= Audit trail, XWIN-NMR		Version 3.5
$$ ##JCAMPDX= 5.01
$$ ##ORIGIN= Bruker BioSpin GmbH
$$ ##OWNER= she
$$ F:/spectra/data/she/nmr/H-C/1/audita.txt
$$ ##AUDIT TRAIL=  $$ (NUMBER, WHEN, WHO, WHERE, WHAT)
(   1,<2025-07-08 13:56:20.15 +0400>,<she>,<DPX200>,
      <created by zg, POWCHK disabled, PULCHK disabled
       configuration hash MD5:
       00 E9 B6 7A A2 85 ED C7 34 08 36 98 17 FE 4E 26
       data hash MD5: 16K
       77 C8 21 46 CA 6D A2 3B 48 09 76 CC F1 2C 89 29>)
$$ ##END=
$$ 
$$ hash MD5
$$ 94 C4 50 DE ED EF 86 B2 D8 FE F2 C6 92 20 82 20
##$RELAX= 
##$RELAX= 
##$RELAX= 
##$RELAX= 
##$RELAX= 
##$RELAX= 
$$ Bruker specific parameters
$$ --------------------------
##$DU= <F:/spectra>
##$EXPNO= 1
##$NAME= <H-C>
##$PROCNO= 1
##$TYPE= <nmr>
##$USER= <she>
##$AMP= (0..31)
100 100 100 100 100 100 100 100 100 100 100 100 100 100 100 100 100 100 
100 100 100 100 100 100 100 100 100 100 100 100 100 100 
##$AQSEQ= 0
##$AQ_mod= 1
##$AUNM= <au_zg>
##$AUTOPOS= <>
##$BF1= 200.13
##$BF2= 200.13
##$BF3= 200.13
##$BF4= 200.13
##$BF5= 200.13
##$BF6= 200.13
##$BF7= 200.13
##$BF8= 200.13
##$BYTORDA= 1
##$CFDGTYP= 0
##$CFRGTYP= 5
##$CHEMSTR= <none>
##$CNST= (0..31)
1 1 145 1 1 1 1 1 1 1 1 1 1 1 1 1 1 1 1 1 1 1 1 1 1 1 1 1 1 1 1 1 
##$CPDPRG= <>
##$CPDPRG1= <>
##$CPDPRG2= <>
##$CPDPRG3= <>
##$CPDPRG4= <mlev>
##$CPDPRG5= <mlev>
##$CPDPRG6= <mlev>
##$CPDPRG7= <mlev>
##$CPDPRG8= <mlev>
##$CPDPRGB= <>
##$CPDPRGT= <>
##$D= (0..31)
0 0.7 0 0 0 0 0 0 0 0 0 0.03 0 0 0 0 0 0 0 0 0 0 0 0 0 0 0 0 0 0 0 0 
##$DATE= 1751968579
##$DBL= (0..7)
120 120 120 120 120 120 120 120 
##$DBP= (0..7)
150 150 150 150 150 150 150 150 
##$DBP07= 0
##$DBPNAM0= <>
##$DBPNAM1= <>
##$DBPNAM2= <>
##$DBPNAM3= <>
##$DBPNAM4= <>
##$DBPNAM5= <>
##$DBPNAM6= <>
##$DBPNAM7= <>
##$DBPOAL= (0..7)
0.5 0.5 0.5 0.5 0.5 0.5 0.5 0.5 
##$DBPOFFS= (0..7)
0 0 0 0 0 0 0 0 
##$DE= 6
##$DECBNUC= <off>
##$DECIM= 32
##$DECNUC= <off>
##$DECSTAT= 4
##$DIGMOD= 1
##$DIGTYP= 9
##$DL= (0..7)
0 120 120 120 120 120 120 120 
##$DP= (0..7)
150 150 150 150 150 150 150 150 
##$DP07= 0
##$DPNAME0= <>
##$DPNAME1= <>
##$DPNAME2= <>
##$DPNAME3= <>
##$DPNAME4= <>
##$DPNAME5= <>
##$DPNAME6= <>
##$DPNAME7= <>
##$DPOAL= (0..7)
0.5 0.5 0.5 0.5 0.5 0.5 0.5 0.5 
##$DPOFFS= (0..7)
0 0 0 0 0 0 0 0 
##$DQDMODE= 0
##$DR= 18
##$DS= 0
##$DSLIST= <SSSSSSSSSSSSSSS>
$$ [...]
##$SUBNAM0= <"">
##$SUBNAM1= <"">
##$SUBNAM2= <"">
##$SUBNAM3= <"">
##$SUBNAM4= <"">
##$SUBNAM5= <"">
##$SUBNAM6= <"">
##$SUBNAM7= <"">
##$SUBNAM8= <"">
##$SUBNAM9= <"">
##$SW= 18.0517328524113
##$SWIBOX= (0..15)
0 0 2 0 0 0 0 0 0 0 0 0 0 0 0 0 
##$SW_h= 3612.71676300578
##$TD= 16384
##$TD0= 1
##$TE= 0
##$TE2= 300
##$TE3= 300
##$TEG= 300
##$TL= (0..7)
0 120 120 120 120 120 120 120 
##$TP= (0..7)
150 150 150 150 150 150 150 150 
##$TP07= 0
##$TPNAME0= <>
##$TPNAME1= <>
##$TPNAME2= <>
##$TPNAME3= <>
##$TPNAME4= <>
##$TPNAME5= <>
##$TPNAME6= <>
##$TPNAME7= <>
##$TPOAL= (0..7)
0.5 0.5 0.5 0.5 0.5 0.5 0.5 0.5 
##$TPOFFS= (0..7)
0 0 0 0 0 0 0 0 
##$TUNHIN= 0
##$TUNHOUT= 0
##$TUNXOUT= 0
##$USERA1= <user>
##$USERA2= <user>
##$USERA3= <user>
##$USERA4= <user>
##$USERA5= <user>
##$V9= 5
##$VALIST= <valist>
##$VCLIST= <CCCCCCCCCCCCCCC>
##$VD= 0
##$VDLIST= <DDDDDDDDDDDDDDD>
##$VPLIST= <PPPPPPPPPPPPPPP>
##$VTLIST= <TTTTTTTTTTTTTTT>
##$WBST= 1024
##$WBSW= 4
##$XGAIN= (0..3)
0 0 0 0 
##$XL= 0
##$YL= 0
##$YMAX_a= 376269
##$YMIN_a= -399990
##$ZGOPTNS= <>
##$ZL1= 120
##$ZL2= 120
##$ZL3= 120
##$ZL4= 120
##$ABSF1= 10
##$ABSF2= 0
##$ABSG= 5
##$ABSL= 3
##$ALPHA= 0
##$AQORDER= 0
##$ASSFAC= 0
##$ASSFACI= 0
##$ASSFACX= 0
##$ASSWID= 0
##$AUNMP= <proc_1d>
##$AZFE= 0.1
##$AZFW= 0.1
##$BCFW= 1
##$BC_mod= 2
##$BYTORDP= 1
##$COROFFS= 0
##$CY= -3
##$DATMOD= 1
##$DC= 2
##$DFILT= <>
##$DTYPP= 0
##$F1P= 0
##$F2P= 0
##$FCOR= 0.5
##$FTSIZE= 0
##$FT_mod= 4
##$GAMMA= 1
##$GB= 0.15
##$INTBC= 1
##$INTSCL= 1
##$ISEN= 128
##$LB= 0.25
##$LEV0= 0
##$LPBIN= 0
##$MAXI= 10000
##$MC2= 0
##$MEAN= 0
##$ME_mod= 0
##$MI= 1.114404
##$NCOEF= 0
##$NC_proc= 0
##$NLEV= 6
##$NOISF1= 3.799351
##$NOISF2= 2.8
##$NSP= 1
##$NTH_PI= 0
##$NZP= 0
##$OFFSET= 14.38212
##$PC= 1
##$PHC0= -1205.043
##$PHC1= 14.59238
##$PH_mod= 1
##$PKNL= yes
##$PPARMOD= 0
##$PSCAL= 0
##$PSIGN= 0
##$REVERSE= no
##$SF= 200.129724274929
##$SI= 16384
##$SIGF1= 3
##$SIGF2= 2
##$SINO= 400
##$SIOLD= 16384
##$SREGLST= <1H.CDCl3>
##$SSB= 0
##$STSI= 0
##$STSR= 0
##$SW_p= 3205.1282051282
##$SYMM= 0
##$S_DEV= 0
##$TDeff= 0
##$TDoff= 0
##$TI= <>
##$TILT= no
##$TM1= 0
##$TM2= 0
##$TOPLEV= 0
##$USERP1= <user>
##$USERP2= <user>
##$USERP3= <user>
##$USERP4= <user>
##$USERP5= <user>
##$WDW= 1
##$XDIM= 8192
##$YMAX_p= 0
##$YMIN_p= 0
$$ End of Bruker specific parameters
$$ ---------------------------------
##NTUPLES= NMR FID
##VAR_NAME=  TIME,          FID/REAL,        FID/IMAG
##SYMBOL=    X,             R,               I
##VAR_TYPE=  INDEPENDENT,   DEPENDENT,       DEPENDENT
##VAR_FORM=  AFFN,          ASDF,            ASDF
##VAR_DIM=   8192,          8192,            8192
##UNITS=     SECONDS,       ARBITRARY UNITS, ARBITRARY UNITS
##FACTOR=    0.0002768,     1,               1
##FIRST=     0,             0,               0
##LAST=      2.2672688,     0,               0
##MIN=       0,             -399990,         0
##MAX=       2.2672688,     376269,          0
$$ Real data points
##PAGE= N=1
##DATA TABLE= (X++(R..R)), XYDATA
0 0 0 0 0 0 0 0 0 0 0 0 0 0 0 -8 8 -8 8 -8 16 -16 16 -24 29 -32 37 -42 50 -57 65 -77 86 -98 111 -125 142
35 142 -160 181 -199 223 -247 276 -307 340 -376 414 -459 507 -556 615 -674 743 -822 904 -998
54 -998 1107 -1228 1364 -1528 1714 -1942 2218 -2559 3004 -3602 4447 -5733 7913 -12290 24432
69 24432 -129849 -399990 23776 318561 103081 -188880 -125292 79627 106467 36662 25832
80 25832 -73505 -125425 46033 186463 34003 -209420 -159453 151130 188820 -94076 -185412
91 -185412 -5789 114037 70318 -28520 -51711 -25356 13849 97359 72663 -94587 -98008 69869
103 69869 103583 -27502 -99603 -13779 46430 -23560 -17847 47117 -29926 -89428 25079 114268
115 114268 24498 -108911 -46208 120994 74017 -77998 -43187 51936 17647 -46856 1599
126 1599 63721 -42313 -125379 38143 140291 -32195 -151070 -14614 137528 59376 -98649
137 -98649 -51266 69627 38000 -11163 9833 -2980 -37975 -13231 57286 40161 -80431 -78964
149 -78964 57192 72979 -33759 -72500 -4076 57143 17483 -24717 6370 2446 -16664 31806
161 31806 41203 -25498 -48437 12433 54979 -11198 -63571 8519 40978 -26796 -33971 23274
173 23274 29185 -24045 -38651 33005 53113 -26862 -37916 26364 31234 -9070 -16727 12812 7555
186 7555 -38345 -5280 56124 -4083 -75569 -17384 67462 39797 -59306 -54651 47016 54117
198 54117 -13548 -22726 -6097 3571 20105 23472 -1363 -45358 -32355 49243 47820 -44736 -64299
211 -64299 6224 57736 19545 -48856 -27937 28192 24107 11486 1421 -23994 -13134 27296
223 27296 39603 -6618 -60732 -14635 57023 16200 -47154 -30990 13028 26070 -3160 -18028
235 -18028 2994 122 1522 28005 9650 -21747 -8526 20146 28842 -10556 -38923 5366 25965
248 25965 -11948 -22033 -4925 5143 -2126 -13456 8840 14135 -17585 -1075 28274 6708
260 6708 -9421 -537 13822 12935 -13438 -8565 13472 -8795 -17693 2879 1150 -8117 -15201 -5332
274 -5332 19263 1310 -18273 8986 18574 3587 -268 1403 12251 5414 -10181 7967 5105
287 5105 -21002 -5153 9924 -5258 -16537 -14081 8392 12453 -16363 -7690 15860 6276 3371
300 3371 3959 1536 10089 3101 1709 9880 -10057 -12639 8976 2792 -11022 -16583 -8587 13734
314 13734 -986 -20460 2635 10573 776 5235 2828 3975 6448 2518 12303 3770 -15444 2322
328 2322 10660 -6229 -10305 -10994 -1587 6016 -11299 -9895 5099 254 1694 4057 80 7462 4200
343 4200 3603 12830 -2013 -6937 9725 3700 -6945 -7422 -5964 3757 -4117 -14224 86 827 -4487
358 -4487 4770 440 -1468 6305 4074 8422 6172 -5574 3620 8382 -708 -1703 -7199 -4726 4651
373 4651 -6645 -8373 -212 -6678 -1818 5639 -110 -818 -1781 4044 14855 2706 -5534 4032 3186
388 3186 4218 3839 -8474 -6162 -537 -1197 1830 -6981 -12272 907 4613 4116 986 -9875 573
403 573 14954 7568 211 -5882 -4608 10919 9805 -4687 -11545 -10619 6304 11799 -9399 -14488
417 -14488 -3054 3997 10497 1957 -9907 -3624 5004 14076 11548 -11055 -12545 6587 13671 7661
431 7661 -13072 -20756 4652 15223 -458 -12322 -13607 2138 14083 3135 -3194 -5883 -5350
444 -5350 13596 16296 -2917 -11658 -8047 8962 18827 -4829 -20863 -9204 7884 15221 -3824
457 -3824 -21735 -3962 11567 8471 3133 -7557 -5881 7071 9360 9305 -809 -16078 -3348 13771
471 13771 10312 -5406 -23327 -10702 20000 11655 -14424 -16667 -1386 16453 10346 -7679 -3099
484 -3099 903 1695 13593 8830 -7689 -12690 -5287 16991 15542 -20169 -26616 2555 20423 9117
498 9117 -20776 -20480 12574 17564 2626 -2905 -7499 369 12118 10295 4911 -10698 -17099 8581
512 8581 19909 -597 -21615 -22715 8793 26394 -5017 -26448 -8885 13998 20972 -216 -15879
525 -15879 268 10870 9191 8328 -4511 -10399 -2971 4558 13546 -1431 -28703 -13180 18026
538 18026 16437 -9921 -28455 -3352 28442 10868 -12746 -6797 4384 12353 8751 -619 101
551 101 -7919 -7774 13627 11166 -14051 -23302 -6344 21538 13353 -24113 -20788 10417 19502 7848
565 7848 -10679 -9878 9734 12520 6955 1997 -10721 -6903 7750 9456 1969 -16426 -20955 7341
579 7341 19028 -2142 -20427 -15471 13355 25051 -2610 -16767 -2110 13249 17068 488 -11738
592 -11738 -1535 3899 4004 5410 -6736 -14667 -5952 6857 12015 -7517 -23972 15 21264
605 21264 8311 -9653 -11366 7107 18814 2668 -6846 -1243 627 3926 2981 -2987 -4209 -8768
619 -8768 -4334 9094 1117 -12075 -6955 3500 10747 3288 -8524 -479 7482 5402 4395 -1550
633 -1550 -3868 2506 1228 281 542 -6671 -5840 -443 1521 2498 -5780 -9095 4319 8392 1823 -2597
649 -2597 -4581 4627 10351 694 -3355 -1669 -379 3788 288 -3911 -3123 -5741 -147 6592 -2922
664 -2922 -8109 -1382 4976 7919 -1165 -6584 3033 6491 3045 884 -4440 -1384 3764 -167 -1089
679 -1089 -2709 -5882 553 2274 -1411 -1336 -3624 1010 6303 66 -1138 1979 -42 3615 3273 -2421
695 -2421 -665 -1375 -1020 2017 -2823 -3506 -544 -2892 693 2379 -3531 -88 1944 1645 4624 303
711 303 -1821 3140 2006 1696 735 -5271 -815 2215 -2366 -1131 -3241 -4249 2704 1360 -1818 -58
727 -58 -1384 3782 5864 -1734 230 2256 835 4242 -468 -5185 -14 -194 -842 -1126 -6087 -1694
743 -1694 2346 -1473 168 -605 -1844 5519 3508 -1365 2154 1152 2705 3883 -2934 -1604 856
758 856 -2298 229 -2927 -6009 579 -480 -2617 668 -1934 739 4611 185 1349 2591 819
773 819 4962 2136 -2842 1709 4 -1948 330 -4301 -3453 323 -3273 -1257 -909 -2919 2887 1568
789 1568 -1131 3658 1674 1523 5194 198 258 2300 -1490 420 -890 -4361 -412 -2041 -4221 -393
805 -393 -3243 -1748 2524 -1057 487 2985 728 3428 3161 92 3498 858 -676 2504 -2279 -2941
821 -2941 322 -3493 -2500 -1653 -4282 -151 -144 -1830 2101 370 118 4557 1729 2009 3399 -494 1804
838 1804 2466 -2212 -409 -1318 -2845 -209 -3165 -3216 -262 -2626 -26 2475 -2240 302 3205 2170
854 2170 3991 665 -612 3657 1268 -7 788 -3259 -1395 581 -2892 -1681 -2988 -3638 2143 1028
870 1028 -2218 -161 415 3617 4290 -923 1054 2584 346 2782 628 -3791 -926 -321 -87 -1055
886 -1055 -5499 -1869 2042 -1097 -147 -76 -1342 2775 2785 1637 2310 -1882 7 5116 1339 -2420 -2850
903 -2850 -1284 3082 -1173 -5644 -497 -171 -1473 1400 144 -436 -185 -37 5678 3495 -3894 -504
919 -504 3372 2676 871 -4540 -2716 2827 -579 -1653 -1523 -3654 680 1792 -380 648 -1607 -201
935 -201 5112 1851 -565 179 -1672 2355 3982 -2052 -3745 -3020 1099 4539 -4065 -6746 1956 2787
951 2787 456 -792 -1457 2781 1974 -875 4355 1855 -4415 -601 3530 3446 -2745 -8937 615 7269
967 7269 -2868 -6624 -1503 2704 3390 -2464 -1522 4759 -285 -841 5263 2425 -1611 -2741 -109 5922
983 5922 9 -8360 -2316 2088 1141 -1170 -5666 -1363 4417 382 310 514 -1159 3606 3055 -62
999 -62 2122 -701 -2004 2006 704 -236 -3752 -7204 2709 5344 -5073 -5987 187 5268 3853 -4974
1015 -4974 -1403 7431 1987 -1137 2315 2055 319 -3245 -784 6172 -2405 -10190 -408 5263 99
1030 99 -6652 -5803 5225 5406 -4445 -876 4437 1633 1465 1342 2438 2310 -3689 -226 4663 -1830
1046 -1830 -5014 -2772 -847 2386 -2093 -5685 229 1554 1623 2240 -1982 167 5070 2257 1121 437
1062 437 -254 2351 -670 -2285 1988 -2562 -5647 -346 1692 -445 -5077 -4222 5656 4647 -4750 -1194
1078 -1194 4723 4029 1138 -1488 2492 3671 -3549 -1217 3757 -1787 -5165 -3067 1707 2242 -6127
1093 -6127 -4989 4525 2531 -2032 -97 1650 3285 1507 220 3557 717 -2853 2350 1725 -2045
1108 -2045 -2462 -2449 675 -92 -4462 -1149 509 -1411 1384 1625 -573 770 987 3645 2947 -2664 394
1125 394 3918 -584 -1892 -717 -550 -695 -3426 -1046 1869 -3377 -2953 2894 1949 -520 -1065 1169
1141 1169 4964 593 -2214 2860 1969 -1571 -616 199 687 -2389 -3729 2045 899 -4737 -1201 2290
1157 2290 1060 -346 -1399 2701 3257 -1924 1189 3627 -1200 -1228 547 890 157 -3921 -1508 2688
1173 2688 -1938 -2935 763 415 246 -409 237 3216 -333 -1368 3806 1708 -1876 -17 442 1209 -1477
1190 -1477 -3121 1477 201 -3730 160 1194 -1412 -301 72 1972 1801 -2218 1573 3546 -1097
1205 -1097 -791 992 304 -4 -2622 -707 1904 -2945 -2784 1893 -367 -1351 -544 661 3143 -709
1221 -709 -1428 4305 1728 -1507 1213 962 423 -1102 -2634 1262 59 -4260 -125 845 -1347 -401
1237 -401 -732 1356 1851 -1743 1536 3907 -746 2 1900 592 479 -1848 -505 1739 -2895 -2833 1083
1254 1083 -1409 -1719 -230 -334 1547 -301 -707 3649 1354 -732 2516 1492 499 328 -1464 1059
1270 1059 -160 -3748 -324 182 -2769 -1327 -858 259 815 -2131 1232 3337 -933 889 2977 805
1286 805 1000 -145 287 1783 -2221 -2180 1117 -1859 -2513 -874 -1258 363 -953 -1530 2299 1012 -841
1303 -841 2460 1885 905 1199 -77 1974 853 -2271 227 315 -2554 -1167 -1594 -1351 -222 -1797 -10
1320 -10 1237 -1095 785 2742 671 1456 1068 647 2386 -76 -705 1062 -1287 -1383 -194 -1782 -1313
1337 -1313 -1272 -1565 1113 -732 -1671 1892 1253 621 1334 482 1981 1823 -524 1488 597 -1782 15
1354 15 -665 -1635 -802 -2227 -714 553 -1738 -413 557 -179 1861 1048 196 2063 571 544 2096 -619
1372 -619 -774 317 -1371 -407 -854 -2263 -374 -1093 -1362 925 -840 -481 1597 473 1147 1215 -213
1389 -213 1891 1369 -803 419 -548 -571 393 -1930 -1402 -126 -1712 -347 94 -1121 300 113 17 2182
1407 2182 122 -384 1582 528 1126 246 -1864 229 673 -1438 -535 -881 -1059 251 -1393 -229 1180
1424 1180 -1029 280 1726 155 963 10 -293 2362 237 -1506 196 -409 56 -158 -2575 -218
1440 -218 465 -1444 320 16 -157 1247 -1 816 2149 -463 -307 1340 366 640 -1031 -2192 1207
1457 1207 469 -2000 -806 -560 173 581 -1572 557 1993 -754 759 1751 699 823 -959 50
1473 50 2560 -1297 -2610 139 -54 -25 -1661 -2559 1424 685 -1570 666 1023 508 1017 -41 1532
1490 1532 1760 -1477 245 1656 -349 -475 -1966 -951 1571 -1237 -2585 105 -259 139 201 -897
1506 -897 1801 1634 -492 1598 1283 319 838 -910 250 1333 -2230 -2085 421 -534 -660 -1976 -1622
1523 -1622 2010 14 -1513 1231 1241 1137 1030 -43 2177 1587 -1714 426 1424 -939 -1379 -1769 -70
1540 -70 711 -2816 -1891 1085 -252 -414 -205 106 2080 582 -70 2322 945 -214 943 -64 217
1557 217 -279 -2190 -461 -90 -1909 -826 -1123 -671 1050 -497 -196 1291 357 1393 1371 -193 1495
1574 1495 1072 -565 693 158 -588 -611 -1824 -166 188 -2779 -1236 808 -38 -37 -258 542 2284 77
1592 77 241 2238 727 -32 370 176 471 -1141 -2162 534 -387 -2320 -945 -376 165 -127 -1089 1344
1610 1344 1424 -468 1345 1877 263 602 160 637 660 -1430 -608 422 -1378 -866 -587 -1042 -166 -568
1628 -568 -300 1066 -314 165 1964 531 212 867 406 838 -172 -942 757 -905 -1659 308 -447
1645 -447 -993 -334 -499 788 114 -1238 1149 1276 -111 856 956 584 614 -889 371 968 -1739 -920
1663 -920 470 -617 -573 -894 -236 1267 -1077 -467 1626 201 139 978 442 1201 -121 -526 1309 -250
1681 -250 -1552 134 -489 -782 -162 -1034 394 104 -997 824 904 -505 742 750 353 766 -707 558
1699 558 1001 -1375 -281 355 -1227 -675 -588 -407 456 -1131 -196 1587 -273 -248 1407 571 679 134
1717 134 -249 1467 -153 -1271 618 -103 -974 -590 -1059 272 -144 -1553 833 1015 -760 781 884
1734 884 681 991 -274 654 1038 -1135 -90 697 -1197 -678 -684 -812 155 -1200 -773 1048 -382 -200
1752 -200 1304 564 1040 585 181 1482 291 -1020 908 184 -1325 -416 -842 -494 -533 -1561 174 293
1770 293 -1263 394 735 159 934 351 1190 1439 -614 481 991 -957 -410 -462 -824 -438 -1542 -878
1788 -878 617 -1323 -973 921 427 475 441 527 1821 501 -364 1654 493 -798 -176 -240 -194 -912 -1776
1807 -1776 49 -63 -1826 -402 309 -107 458 -51 906 1714 -482 671 1608 9 -14 290 -255 206
1825 206 -1220 -1079 98 -1195 -1286 286 -727 -308 221 143 914 168 37 1898 913 -299 668 89
1843 89 186 -243 -1019 141 -476 -1954 -151 -70 -1016 -450 -404 758 721 -699 563 1524 71 592 911
1862 911 556 627 -579 -277 725 -1190 -1232 168 -845 -635 -668 -652 659 214 -285 1165 454 24 1146
1881 1146 667 396 164 -393 684 -206 -1465 2 -49 -1068 -284 -634 -240 243 -679 696 1175 -581
1899 -581 350 856 426 664 -350 23 984 -788 -685 140 -556 -712 -596 -575 386 -425 -872 1171 427
1918 427 24 798 84 628 759 -271 273 252 -537 289 -672 -841 101 -636 -734 282 -491 229 490 -338
1938 -338 871 579 -480 679 763 57 575 -859 -175 871 -1192 -580 69 -673 44 -521 -506 970
1956 970 -191 -425 1092 374 288 523 -288 1069 571 -1207 -87 103 -401 -9 -1192 -796 565 -1033
1974 -1033 -492 569 -86 526 316 13 1433 304 -511 1184 421 -49 -105 -1041 310 26 -1703 -657
1992 -657 157 -563 -99 -430 188 1255 -282 290 1589 329 408 591 42 745 -438 -1196 423 -312
2010 -312 -1081 -514 -922 -285 95 -1016 75 535 -145 778 561 293 1292 356 -211 894 -200 -163 -133
2029 -133 -819 387 -537 -1614 -493 -36 -616 70 -373 321 1273 -459 698 1688 266 443 378 257
2047 257 886 -976 -921 641 -757 -1272 -735 -677 9 -663 -814 903 428 -179 862 1058 734 748 -160
2066 -160 548 820 -749 -166 -284 -516 -186 -849 -827 -77 -897 -542 294 -541 275 1147 140 941 842 504
2086 504 831 -56 13 778 -802 -685 370 -739 -803 -586 -649 206 -631 -953 878 345 -123 758 454 993
2106 993 648 -371 969 570 -928 -289 -95 -528 -248 -1270 -298 424 -1178 -437 568 -177 207 373
2124 373 382 1346 208 273 1347 145 -398 254 -389 -141 -204 -963 107 -367 -953 291 -441 -343 877 82
2144 82 528 359 -141 774 562 -741 635 341 -496 -140 -342 11 -208 -1489 -110 641 -877 -102 298
2163 298 157 562 -59 248 1388 -42 -66 500 41 -57 -346 -667 519 -426 -926 627 -181 -692 211
2182 211 -43 366 618 -165 619 806 -503 543 460 -266 309 -450 -267 224 -932 -215 308 -889 -136
2201 -136 520 -341 337 75 192 1285 -157 13 897 99 -16 16 -411 166 -615 -1087 576 -217 -1085
2220 -1085 231 42 194 317 -278 846 831 -640 612 723 -325 431 -163 -305 15 -1117 -390 448
2238 448 -1036 -246 294 -394 244 14 111 991 21 298 1251 186 -113 428 -247 215 -509 -859 289
2257 289 -561 -1284 153 -184 -338 86 -293 732 526 -198 1111 892 -27 498 260 -30 272 -733 -303
2276 -303 45 -1072 -600 -157 -704 -287 -153 -147 703 -180 143 1034 173 452 751 157 289 -184 -355 312
2296 312 -324 -1064 71 -432 -750 -453 -508 201 -24 -323 746 637 -57 797 401 451 433 -383 224 556
2316 556 -858 -554 28 -686 -476 -415 -716 211 -366 -282 722 -34 365 880 517 749 285 -112 595 -54
2336 -54 -565 195 -571 -671 -248 -879 -276 -238 -704 535 77 -526 738 487 233 777 109 376 771 -622
2356 -622 9 491 -500 -130 -604 -555 77 -918 -695 604 -293 43 533 61 633 361 271 670 76 -275
2376 -275 604 -263 -71 101 -727 -254 -135 -616 287 -124 -576 449 36 -51 580 304 535 594 -224 683
2396 683 250 -638 92 -118 -542 -32 -721 -388 202 -896 -297 430 -256 145 303 33 913 42 -414 665
2416 665 216 -203 108 -440 -18 106 -989 -173 -43 -736 173 -209 -239 802 -216 181 594 -35 464
2435 464 472 -308 226 19 -680 215 -293 -460 70 -549 -85 553 -518 -2 229 -75 603 178 77 670
2455 670 -109 -257 571 -223 -137 -100 -420 245 -184 -954 224 76 -201 223 -85 217 662 -124 400 394 128
2476 128 340 183 -341 412 -402 -850 53 -560 -665 -137 -438 218 330 -506 497 762 104 585 171 188
2496 188 744 -258 -69 158 -466 -178 -381 -717 126 -459 -845 59 -50 -313 371 180 564 518 91 537
2516 537 440 -209 365 -43 -318 163 -823 -512 232 -586 -205 -186 -358 364 80 -118 689 389 45 839 150
2537 150 474 778 -424 -121 70 -619 -284 -425 -484 192 -644 -563 316 -26 49 136 160 842 414 36 642
2558 642 367 -149 141 -207 -80 -86 -884 -372 -204 -919 -286 -132 -344 421 -65 109 774 137 317 638 54
2579 54 344 245 -341 236 -313 -631 -258 -609 -519 -20 -479 -280 252 -117 318 -33 82 839 239 -25 553
2600 553 197 -8 -70 -264 254 -154 -1097 -208 -115 -722 -254 -158 64 501 -242 247 822 81 108 424 129
2621 129 587 39 -409 303 -260 -508 14 -383 -194 -76 -465 178 45 -142 518 58 241 823 190 67
2641 67 397 -158 250 -27 -470 189 -143 -736 -169 -267 -457 116 -455 213 406 -365 166 502 278 210 -53
2662 -53 -47 477 -454 -345 366 -333 -408 -169 -322 86 -109 -382 514 299 -202 398 110 171 293 -179 414 355
2684 355 -604 43 -76 -631 -8 -331 -446 168 -287 -139 476 -187 247 422 140 195 145 412 409 -83 -295
2705 -295 356 -286 -444 109 -351 -268 -65 -215 454 -145 -149 536 283 53 286 258 622 1 -678 260 107
2726 107 -643 27 -146 -570 -66 -452 102 492 -375 87 538 153 576 390 64 626 -63 -118 576 -478
2746 -478 -330 -20 -474 -368 -355 -489 264 -226 -410 721 260 -235 476 366 388 296 -238 630 325 -547 2
2767 2 11 -318 -428 -589 -55 -9 -554 -33 279 -108 166 337 276 519 38 185 800 14 -16 253 -233 -351
2789 -351 -204 -280 98 -455 -568 230 -71 -75 310 48 490 447 208 493 713 -240 515 214 -154 -181 -287 -98
2811 -98 -53 -689 -205 252 -377 62 137 21 557 133 175 879 -17 16 375 -48 -144 -16 -444 -37 -330 -628
2833 -628 80 -480 -719 68 39 125 353 -109 684 494 -14 317 364 23 37 -206 73 -74 -791 -70 37
2854 37 -809 -445 -148 -294 147 -101 68 605 -34 122 782 30 227 258 107 287 -195 -636 28 -428 -582
2875 -582 -55 -324 39 156 -231 383 424 -20 648 575 161 418 152 135 192 -328 -138 99 -602 -108 18
2896 18 -410 17 -12 45 206 -113 116 625 34 116 183 -74 232 -37 -114 282 -353 -268 321 -335 -272 -261 -406
2919 -406 105 91 -563 382 452 -78 332 125 90 281 -224 14 164 -358 -281 -43 -301 -22 -610 -404 310
2940 310 -293 54 420 36 151 516 8 429 99 -247 237 -234 -297 72 -436 -214 -58 -227 -18 -116 -209
2961 -209 341 258 -41 462 410 126 416 -82 190 200 -744 -236 133 -179 -156 -209 -279 111 -357 -105 603 26
2983 26 113 299 40 294 76 -73 517 20 -117 -72 -370 -380 -216 -641 -187 123 -98 -30 252 -255 587 225
3005 225 231 643 137 270 186 -165 226 100 -513 -205 -223 -350 -253 -242 -135 167 -420 -57 390 263 309 363 185
3028 185 417 178 -20 333 -145 -222 -212 -535 -71 -306 -680 -299 -103 -272 376 71 194 400 -69 336 454
3049 454 -79 262 71 -160 140 9 -299 -209 -332 -350 -161 -424 0 61 -339 362 316 -86 313 262 280 550
3071 550 -183 -197 290 -61 -100 -151 -313 -65 -225 -283 54 -56 -34 346 16 361 410 -240 323 386 145 301
3093 301 -158 -344 324 -447 -242 67 -405 -179 -210 -457 -3 237 -196 174 -88 169 180 24 393 473 -258
3114 -258 56 106 -443 -11 -115 -234 42 -314 -327 144 -213 -155 260 115 264 360 -60 631 320 37 346
3135 346 -87 -60 -23 -108 -242 5 -383 -97 -8 -328 134 -59 25 246 38 82 538 -231 343 290 -274 209
3157 209 -59 -163 79 -403 -241 174 -321 -274 181 -26 69 33 -90 440 76 -208 334 -54 -255 96 -103
3178 -103 -47 -67 -513 -179 -39 -224 -27 -100 -1 287 -176 -20 524 -87 334 347 -85 177 186 -211 9 -53 -234
3201 -234 139 -412 -226 53 -271 -24 298 -29 209 -41 -157 863 208 -83 254 -47 -3 16 -308 12
3221 12 -37 -581 158 107 -247 190 -94 184 365 -178 309 519 -100 -34 -87 -141 4 -319 -338 -50 -327 -219
3243 -219 172 -80 32 125 -177 128 4 -60 395 156 35 391 -73 34 214 -374 -32 -196 -486 -66 -173
3264 -173 -361 83 -61 -6 286 29 154 458 112 234 360 121 165 56 -328 210 -292 -242 10 -388 -510
3285 -510 30 -225 149 -126 -6 352 171 321 423 180 177 427 -171 209 199 -344 -106 -78 -264 -6 -216
3306 -216 -363 131 -274 63 286 24 423 201 272 371 170 124 173 -202 -130 146 -471 -196 -257 -432 -171 73
3328 73 -336 -111 72 -5 426 102 119 455 94 374 237 -112 112 145 -483 -130 -170 -356 -79 -213 -21 184
3350 184 -335 317 298 -87 265 252 310 395 101 21 225 -330 -237 -79 -190 -200 -268 -266 -180 -273 -284 309 -74 24 214
3375 214 -55 291 310 21 306 266 -286 83 -183 -173 35 -338 -227 146 -383 -63 -8 -84 188 90 4 393
3397 393 -161 45 540 -198 104 135 -310 -33 -59 -297 -109 -189 -252 82 -85 -69 -61 -314 262 110 -89 323
3419 323 93 -48 204 -69 -321 74 -177 -98 -44 -519 -110 30 -209 35 25 -188 392 106 -109 226 -90
3440 -90 -50 350 -204 -11 -36 -478 -80 -150 -363 60 -83 -172 491 -274 110 424 61 443 203 -157 143 -121
3462 -121 -216 21 -351 -149 -22 -531 -64 -100 -350 3 42 -64 238 71 -96 447 -90 -161 352 -48 310
3483 310 -21 -358 75 -123 -147 32 -222 -117 137 -463 96 133 72 268 222 94 408 0 94 533 -75 -225
3505 -225 111 -366 -157 97 -441 38 -81 -230 388 61 111 306 -38 494 183 7 -18 181 162 35 129
3526 129 -269 75 -356 -331 -62 -478 -306 -57 -303 262 271 -70 352 331 137 381 -61 162 5 -319 -118
3547 -118 245 -340 58 -236 -584 -54 -190 -228 -23 158 153 302 55 194 529 -61 262 150 -178 -79 -38 -373
3569 -373 -80 -233 -266 -147 -347 -40 -96 -260 281 211 -131 309 122 141 296 -177 139 79 -336 83 -225 -303
3591 -303 -111 -147 -190 113 -274 -62 242 7 75 107 7 408 126 -190 178 62 -87 15 -280 -294 -59 -530
3613 -530 105 -205 -273 18 -7 72 320 87 164 313 61 -18 122 48 79 -5 -230 77 -155 -392 105 -193 -127
3636 -127 205 -147 25 489 -11 479 104 -145 170 -139 -256 129 50 -150 19 -367 4 -112 -626 16
3656 16 145 -223 123 -22 9 305 -137 111 379 -13 226 139 -216 182 -135 -279 -104 -163 -155 -263 -173 206
3678 206 -52 -278 205 247 158 215 246 58 361 -228 142 112 -38 -134 -132 -234 118 -178 -157 87 -194 -128 143
3701 143 -134 63 163 -166 -32 -156 32 240 5 -174 56 -231 -235 -1 -375 -73 -92 -328 265 107 -17
3722 -17 215 161 46 44 -27 30 250 -193 -30 89 -221 -130 -193 -243 54 -254 79 269 -208 146 381 176 74
3745 74 -71 -19 -14 27 -65 -7 -265 -134 -70 -40 -180 -59 -221 44 12 -45 -50 -19 21 283 128 178 244 39 71 -26
3771 -26 -270 -69 -146 -247 56 -23 106 208 28 -21 61 50 237 273 291 302 141 145 270 23 -157 -72 -346 -364
3795 -364 -47 -331 -37 -19 -252 358 130 -208 331 148 -4 221 -154 206 258 0 -92 -103 -357 -62 -369
3816 -369 -304 9 -379 -119 64 -148 50 -14 113 270 111 16 142 151 -101 249 0 -154 -32 -49 12 -241
3838 -241 -388 -100 -211 -189 178 -43 62 364 -79 70 294 -130 60 95 52 113 -32 -80 -7 -364 -250 -108
3860 -108 -223 57 0 -8 213 191 94 412 -68 60 329 -11 -38 182 -81 66 -147 -396 108 102 -251 -188 139
3883 139 -53 208 -39 209 356 -72 136 67 123 187 -55 -171 211 -264 -168 16 -143 57 -57 -115 145 86
3905 86 76 89 84 -125 167 159 -126 46 -45 316 -124 1 -121 -266 -140 95 -116 -101 135 -144 195 2 13
3928 13 225 192 -4 61 46 49 -16 -92 15 227 -167 -120 66 -66 250 115 30 87 -47 19 219 -47 10 23 38
3953 38 -76 18 -181 148 -10 -199 138 -245 -157 -220 -83 151 62 -161 114 154 -103 12 265 34 269 -152
3975 -152 52 193 -297 -179 -79 -319 42 -185 -199 137 -121 156 154 -50 176 477 168 183 90 -190 -92 -87 -54
3998 -54 -9 101 -181 -200 -319 -4 -84 -256 -101 213 121 216 241 -4 276 31 59 303 -285 -115 -142 10 -63
4021 -63 40 -145 8 -232 -190 252 158 84 282 121 221 251 238 208 93 -241 228 -194 -254 -60 -309 -251 71
4044 71 -351 19 -90 -170 185 -45 19 281 -73 -30 360 -35 161 39 -24 -10 -79 -107 -61 -162 -272 155 -241
4067 -241 -123 83 68 393 153 4 279 120 62 256 37 -155 38 -215 54 -31 -400 -28 -136 -88 -129 -213
4089 -213 131 99 98 244 319 98 83 421 -55 131 0 -243 -31 -77 -207 -62 -231 -34 -159 -95 -57 321 -132
4112 -132 208 273 66 58 83 106 143 -206 -179 -28 -280 -137 -191 -144 -109 -93 -208 10 -70 161 155 147 14 131 200 156
4138 156 179 -311 29 -57 -185 93 -175 -57 180 -132 -80 -15 -67 52 -4 -47 271 -66 -27 203 122 -62 173
4161 173 -166 -64 -87 -349 -95 65 -279 189 -338 -304 425 -119 193 216 -35 157 162 -220 154 -6 65 33
4183 33 -5 -18 -107 -205 -161 51 83 -109 -131 12 -168 50 72 104 -4 -69 219 -203 84 28 17 -41 -139 -140 -74 -103
4209 -103 -66 40 -162 69 155 -115 128 244 -74 54 28 -105 60 -217 -138 -105 -352 -204 62 -180 -32 56
4231 56 -210 195 264 -176 145 -74 -7 89 -124 68 200 -86 22 8 -150 15 6 -197 -13 -18 -33 161 -81
4254 -81 108 324 7 234 361 -119 255 -152 57 74 -79 -73 158 -379 20 -65 -154 179 -24 -64 213 85
4276 85 -33 205 248 94 123 -66 40 -143 -73 139 -88 -167 -154 -156 -272 28 -204 -130 88 1 140 55 97 185
4300 185 -88 -90 -79 -180 46 23 -239 174 -200 -254 -226 -164 51 394 -183 13 142 -126 194 91 -93 104
4322 104 148 -308 147 -107 -187 42 -137 -145 67 -302 96 82 -124 102 221 40 -32 362 42 154 -86 -48
4344 -48 213 -252 -11 15 -221 -36 -110 -115 92 -40 -142 -1 -310 -60 330 -234 72 100 181 -33 -80 -10 243
4367 243 -266 -84 132 -49 -124 -32 -147 88 -34 -207 94 21 350 318 40 170 129 -31 5 143 -245 18
4389 18 -113 -61 -109 -109 -185 351 -92 13 254 -83 288 324 207 54 220 -177 203 -125 -206 -173 -276 -74 -26
4412 -26 -82 161 -7 -166 58 302 46 -204 -70 -128 93 -258 43 100 -106 70 38 -133 -191 -59 -184 153
4434 153 -180 -4 116 54 58 302 -165 129 168 204 -92 -5 123 48 71 -238 -61 -168 -110 -231 -181 -70 9 -26
4458 -26 44 189 -164 62 38 199 -2 -81 36 68 -84 39 -33 -185 35 -168 -131 274 -217 50 148 169 118
4481 118 -95 47 227 -24 -47 -28 -151 62 -25 -280 -205 88 -1 -21 -62 -171 120 128 -145 80 138 139 56 81 150
4506 150 -73 47 82 -107 -337 -92 -250 -228 -203 -355 -24 44 -262 124 103 -4 208 94 137 97 -92 66
4528 66 84 -217 -22 -33 -73 63 -33 -285 5 -195 -163 -1 97 145 107 44 124 252 -123 -46 -52 -165 -9 -251 -137
4553 -137 -255 -233 -77 -28 -116 -62 -43 32 171 120 -71 144 302 220 60 -179 -129 74 -101 23 -121 -12 -3 -106
4577 -106 -151 162 -133 -202 48 -43 284 132 208 128 210 33 94 -173 -126 181 -214 11 -120 -243 -77 -215 35
4600 35 4 -96 -115 91 166 79 149 -199 33 37 -197 -3 3 -181 91 -75 -213 -117 -188 -91 9 -112 99 8 -26
4625 -26 12 -72 69 191 63 50 196 -77 -60 -38 -262 -186 -266 17 103 -26 -55 55 36 -164 92 -7 28 -6 -61
4650 -61 72 79 -220 264 -60 -24 -71 -157 -123 -52 -293 62 105 -20 276 118 -17 212 -53 101 -152 169 -45
4673 -45 133 -125 185 -22 -79 188 -447 -279 236 95 -179 54 -83 18 176 -68 179 216 23 177 37
4694 37 -48 109 4 -123 -151 -31 -128 6 221 142 124 -25 119 69 116 123 -169 32 64 -390 106 48 -248 49
4718 49 -206 -126 -83 -142 -18 28 45 36 84 66 -10 83 -189 128 -30 -231 107 -200 -10 -113 -193 -15 86 -139
4742 -139 9 63 84 194 187 -31 216 9 282 15 -90 49 -128 -198 98 -184 -286 48 -69 33 -80 -83
4764 -83 79 123 -159 -7 139 -13 176 -4 -31 76 -160 26 -69 -64 -58 -174 -219 38 -208 -338 3 2 64 0
4788 0 39 27 63 63 113 236 -94 181 -12 -229 133 -384 -22 27 -115 -185 12 -27 -25 103 -213 139 130 -102 61
4813 61 127 -177 -198 -164 -53 10 -46 -243 -68 -145 190 -229 205 5 15 18 164 96 -107 116 69 163 65 -185 161
4838 161 -134 -238 52 -198 -106 27 164 -115 -85 -324 375 -31 -278 71 292 109 134 -184 95 -49 -178
4859 -178 12 43 -35 17 -127 -31 98 -26 -31 22 45 -16 130 107 150 82 141 112 -15 -96 62 44 -165 74 26 48
4885 48 74 -181 -32 -66 -109 -21 62 -177 113 -164 -4 56 -129 93 37 -285 20 -1 -51 144 -1 -255 42
4908 42 -159 48 72 -78 4 7 -91 -42 43 120 -18 -182 35 -69 66 -38 75 -11 82 -34 11 98 78 56 -56
4933 -56 17 21 96 -76 170 -129 -172 79 -282 -179 -176 -247 63 -192 -58 -139 40 -142 -66 76 -14 49 -1 50 48 -96
4959 -96 242 -55 -171 -198 -166 68 30 15 -93 71 161 -38 165 167 29 -120 3 56 -61 -310 51 23 -2 -59
4983 -59 -93 31 56 57 -107 -95 32 229 -168 210 235 264 78 132 135 68 9 -277 20 -121 9 -133 -97 47 -34
5008 -34 150 1 -31 -210 42 59 -102 303 249 -66 239 -136 -43 105 -129 -14 71 -106 51 -111 -9 261
5030 261 90 19 94 121 17 149 155 24 15 -57 -228 -62 -40 -59 228 -91 0 155 -20 33 79 -17 11 -105 -112 77
5056 77 -2 -146 156 102 -25 -50 -111 32 31 -3 12 -189 -45 110 -138 249 -116 -5 309 44 -75 -259 27
5079 27 -167 215 110 51 -112 -115 -116 193 -11 24 -141 131 -93 -97 -114 77 117 -59 58 118 -52 -241 -46 129
5103 129 146 37 32 -139 -133 -118 -72 -14 9 -43 61 -24 44 136 -107 28 29 -125 -53 182 -147 -218 -72 -277 -21 -231
5129 -231 -199 -85 123 3 -94 136 -25 129 -142 164 13 161 58 -107 -123 93 -126 -170 -49 -140 71 -135
5151 -135 -170 56 -21 77 70 73 -110 -83 -40 -77 -30 20 -33 -115 -214 -45 -177 76 97 -241 81 73 127 27 6 -47 62
5178 62 83 -120 -60 -75 99 244 -63 203 116 -65 -99 29 -212 -189 213 -109 -5 66 180 -92 -136 32 -129
5201 -129 -130 175 245 -86 13 -42 -99 -70 32 -47 -117 18 23 227 55 134 94 132 159 25 189 57 -169 5 -41
5226 -41 -154 9 -100 -65 178 -147 -40 141 113 -18 50 84 18 -105 74 133 245 -64 -102 -189 -53 55 -164
5249 -164 -38 -27 162 84 102 -75 133 -326 -42 8 -73 -144 -107 -121 148 242 16 21 133 15 -39 112 -165 -75
5273 -75 -76 0 61 -108 -30 -60 -122 70 -153 -30 131 -79 97 43 -147 -128 124 69 -42 8 57 -35 145 -131 107
5298 107 -94 108 143 -145 -109 35 -132 -24 90 44 164 -99 -4 146 -120 -104 -19 11 -69 100 -61 95 103
5321 103 -53 -187 -198 17 43 43 -106 -34 -20 -77 -87 -48 -59 -162 37 -47 44 112 -5 -218 291 43 -59 112
5345 112 -20 -58 45 56 -200 -18 34 -190 -124 -11 51 -91 -118 -164 -172 -138 131 -3 12 -53 142 -39 28 46 -87
5370 -87 -57 -55 -11 -187 44 168 -32 -40 -1 -135 -148 -103 -188 190 -142 193 87 61 105 53 -126 -116 -19 99 41 -17
5396 -17 130 -80 59 201 -10 -52 -28 -3 133 75 192 132 12 -129 259 277 14 -17 -127 -231 -22 80 -51
5419 -51 -108 -63 -121 146 98 -16 -40 -8 -81 -5 -198 44 28 19 47 192 -94 -34 32 -52 62 -74 -120 156 114 20
5445 20 138 201 229 16 -34 -105 -87 -81 121 -117 97 33 -203 -44 115 116 100 -2 -108 52 3 -153 160 -148
5469 -148 -34 -8 -39 -173 150 -101 23 131 -163 -54 74 128 5 -139 -46 157 -18 104 -202 -135 -16 10
5491 10 -23 92 -189 146 -82 -148 -253 -64 -281 -210 116 134 177 -111 54 -7 -228 25 -128 -19 105 -17
5513 -17 16 -78 -71 118 40 -8 118 -133 -117 22 56 -22 -59 41 -35 168 -310 21 207 -39 7 150 -123 -93 72
5538 72 -17 -149 -97 -32 34 57 -20 252 -73 -155 243 222 -27 -35 -40 39 40 -241 -38 130 -125 5 -148 -15 93
5563 93 37 35 -54 -18 86 3 78 95 7 81 -54 -200 -90 -28 -73 75 14 -53 -80 82 -224 -173 173 110 103 78 -15
5590 -15 -87 28 31 160 -30 153 -13 -31 -34 150 -100 -177 119 -68 -36 -94 -130 -46 115 267 20 0 54 -68 81
5615 81 -113 -98 37 -134 -115 -102 -25 29 -152 -104 -129 -55 -9 29 51 97 -68 19 -21 -27 99 -223 42 102 -96 -10
5641 -10 -123 -113 -183 89 -18 270 -90 6 -68 60 237 39 298 144 -61 -56 160 9 -74 45 -246 100 -63
5664 -63 -118 -20 -112 12 -172 114 -31 34 -3 130 76 153 -137 -8 156 -102 126 83 -268 -226 159 -143 -34
5687 -34 71 1 -123 264 -424 -6 85 -91 21 56 -171 -157 -88 -135 107 31 9 117 -50 -126 -153 -120 -179 17
5711 17 -108 133 -9 25 -57 28 -39 -125 -126 70 -62 -204 -43 -96 -66 -46 11 24 48 -198 59 3 73 67 5 -151
5737 -151 -29 -1 -125 -79 -60 96 72 -131 -44 52 -62 -18 -131 -193 -68 87 157 -16 153 44 233 -48 -25
5760 -25 19 176 151 -202 -49 119 44 -32 62 -112 -108 100 -270 247 -184 151 101 57 17 35 235 -104 -10 -151
5784 -151 8 -174 -98 18 -205 64 -87 36 -2 2 -8 24 -124 -173 13 12 125 130 36 -116 78 -92 -17 10 -159
5809 -159 -32 206 -114 65 118 -119 -118 -38 119 150 -52 -52 158 112 78 34 7 223 -36 -245 -7 -36 -139 43
5833 43 -172 79 259 0 -63 -44 -68 105 -1 -75 49 -153 178 -178 -173 -47 -2 -172 -126 77 -195 -92 -83 191
5857 191 -14 47 -75 -93 251 -72 36 -4 -88 161 31 137 -80 -99 -154 79 65 -103 149 -57 117 81 118
5880 118 -105 52 72 1 5 -219 -149 6 -178 -153 -107 -226 -155 113 -18 116 -48 62 116 85 99 71 55 -65
5904 -65 -126 91 11 81 26 38 -176 97 218 79 -188 -110 -65 16 -32 -25 -126 113 89 -123 -103 13 84 7 -109
5929 -109 163 20 -72 69 -83 -16 92 -111 12 -2 4 -8 -156 -161 -114 -221 275 -63 133 90 -234 21 -31 47
5953 47 -25 -103 -8 71 59 134 -12 170 12 -45 180 -3 -111 -21 -109 -162 -142 -116 -194 27 112 -70 -134 -5 77 80
5979 80 -55 -148 81 -127 -32 94 261 -90 -63 -34 13 -6 30 69 203 -84 -99 304 -146 162 51 6 161 67
6003 67 39 -26 -50 -161 -90 137 -80 -117 -179 -57 -131 -47 -29 152 217 13 81 -118 -46 -53 -24 99 59 37 71 -49
6029 -49 52 72 23 -147 42 10 32 -334 2 36 -120 48 -175 -90 241 101 215 306 -133 -162 85 9 16 100
6053 100 -216 8 -163 64 -124 -50 155 91 33 46 79 -34 70 16 148 -10 -60 143 -171 -44 78 -58
6075 -58 -62 9 -88 17 -56 -23 146 -204 -82 -60 -7 75 31 76 124 -2 -84 -44 2 143 33 -15 17 -89 -85 79 2
6102 2 34 -5 135 -49 65 195 -57 -14 92 20 52 -162 50 -271 3 -53 0 -125 -183 199 74 54 -78 297
6126 297 103 -99 -212 75 -119 -94 -27 -68 2 -127 -14 -171 53 40 82 13 -201 -136 141 147 -10 23 -69 134
6150 134 105 -89 116 67 14 -73 60 70 129 14 14 28 63 87 149 93 181 -38 -38 -77 -15 76 -73 -98 -101 110 151 73
6178 73 -277 -220 195 124 48 -115 -84 -4 87 -82 -121 18 13 107 -82 126 122 33 95 24 65 78 -105 3 18 -70 -74
6205 -74 18 28 -72 88 -79 -125 -80 174 -24 28 76 281 148 -105 48 112 -70 -18 90 172 179 123 -155 29
6229 29 -192 185 -75 73 180 -41 -22 54 -218 71 79 1 19 -14 41 52 88 -31 102 234 -72 -123 2 -47
6253 -47 230 29 -11 -40 -179 52 -197 9 38 16 -89 -100 58 23 74 59 -28 14 -73 20 228 -184 -55 -45 -243
6278 -243 32 75 66 92 88 -167 -27 -101 14 -48 -18 133 85 -203 -18 170 -105 -77 75 -114 -16 132 70 143 63
6303 63 -181 -210 51 47 -135 87 79 47 120 -36 -140 170 -34 -12 39 27 81 -59 -207 -139 -193 -43 86 48 -85
6328 -85 152 175 78 67 -20 41 -145 147 1 93 22 -53 -86 -72 60 18 57 44 -64 -14 -95 120 -104 263 -104
6353 -104 39 -28 73 -118 122 131 -38 -53 -58 -99 58 -202 25 -186 102 -97 198 49 20 136 22 95 -198
6376 -198 13 137 -57 -96 86 -142 -109 108 -117 -25 46 -169 -108 34 -120 35 -9 -129 82 -15 67 19 -145
6399 -145 -164 -109 37 158 -58 29 -133 -126 8 -135 34 -186 -87 -14 8 135 -66 8 110 73 64 -176 -205 33
6423 33 53 -65 35 4 68 -20 103 64 10 115 -105 -79 -39 64 16 55 125 -154 -66 -123 8 -36 30 76 -39 159
6449 159 122 -138 -46 88 287 -107 -38 98 -21 4 74 163 -40 -127 -235 -36 75 88 3 38 117 78 -131 -18
6473 -18 -56 -92 132 3 -12 -188 -7 62 -114 -143 67 -9 -17 80 248 144 51 -146 157 -122 -180 -66 -35 -128 -119
6498 -119 -99 -1 37 37 -118 27 73 -196 -111 12 -62 -73 60 34 -301 -126 129 149 78 -28 112 -14 204 188
6522 188 -141 -111 -10 -118 29 -5 -155 111 -188 90 24 186 159 -99 -26 86 -258 -113 120 24 82 -168
6544 -168 -92 135 32 -38 -159 10 -87 -8 -16 -180 86 -186 20 -116 -83 -26 74 -77 -116 -75 127 184 -141 5
6568 5 2 -62 -154 59 -106 76 -41 -76 118 133 -73 85 -196 -15 39 -199 -72 -223 76 -147 -77 30 -37 4
6592 4 -95 -43 116 -126 -116 96 5 67 -74 -68 46 2 -50 5 -62 -105 -60 101 -3 -5 11 35 -325 15 -29 -143 21
6619 21 106 -20 61 119 -4 -123 34 241 -101 97 100 159 -100 -18 -10 179 92 -14 240 116 -184 -79 -31 -52
6643 -52 -81 -118 -112 -193 62 -103 42 111 106 -1 49 73 -21 -36 -20 287 -63 50 -50 -97 -156 -179 41 -327 -3 105
6669 105 62 -89 -3 -219 -40 -151 -162 43 69 162 111 -10 43 118 139 214 76 63 -1 -42 -22 -56 51 -273 -30
6694 -30 155 -1 182 -16 160 56 -180 92 -199 171 182 -15 -153 -30 -96 -48 2 31 -143 32 105 31 -143
6717 -143 17 -51 106 -133 12 -12 -231 -121 -263 147 -26 56 99 -145 -224 -41 -64 -8 -23 34 -173 -175 -204 -199 116
6742 116 158 -213 64 218 59 1 27 -27 -190 -35 -159 -26 72 140 -20 117 107 -60 65 -37 115 -65
6764 -65 56 -49 -13 -63 -243 40 -77 -110 -129 -51 -124 -46 -29 93 -31 3 -87 -125 90 111 -91 -57 -36 -135 112
6789 112 -79 -73 -263 69 171 45 -130 -116 -12 -88 -105 -178 -41 -116 -54 -54 -118 -210 98 10 -222 -53 45 -98 -232
6814 -232 90 133 -111 21 -64 21 -49 117 86 89 53 4 -160 117 -91 120 -98 39 -251 -77 -87 -157 7 -89
6838 -89 -12 -1 96 -21 123 -28 76 -196 122 -112 177 -67 -138 195 157 36 61 188 77 41 -26 44 107 69
6862 69 -231 147 216 36 1 -119 68 -165 -244 164 -132 -24 -1 -12 -133 99 76 146 -31 -213 -58 45 81
6885 81 -209 145 93 -137 -86 -27 -50 16 61 139 -116 122 164 -20 -31 2 -58 117 88 -148 -20 -34 289 -44 24
6910 24 54 -55 -73 159 -15 -51 140 -102 -32 -131 -214 60 -49 -112 28 52 -9 118 31 45 -173 89 118 -132
6934 -132 28 9 -33 -238 -24 -38 -69 77 114 40 -114 -142 -91 48 14 44 55 -218 101 -110 -107 -62 150 -132 -286
6959 -286 181 10 12 -163 -37 -79 -108 -54 -211 -69 40 -141 -71 -141 102 -33 89 -90 -125 -114 -117 19 87 105
6983 105 -134 -47 153 13 -45 -145 101 151 27 11 -99 51 -138 126 -103 -101 -153 7 132 15 6 4 129 200
7007 200 13 -224 54 74 86 -20 52 161 -57 22 -203 -96 101 -256 -44 288 -95 -256 54 -47 15 151
7029 151 9 168 69 -350 -37 0 143 34 -30 51 -57 -23 -164 293 -1 246 90 81 50 -140 -16 -53 -43
7052 -43 48 -13 108 31 -283 -175 29 -132 -16 -38 -30 72 105 222 -164 -139 -83 -155 -22 72 229 -142 -8 60
7076 60 54 -190 -105 -30 255 138 -10 126 -118 30 -55 92 -18 -194 42 146 61 -109 10 45 -149 -14 15
7099 15 -193 -79 -192 -26 90 -174 -20 118 -266 82 311 -168 30 7 -21 -180 1 -52 19 5 -80 7 84
7122 84 38 83 -104 -6 37 -38 1 73 -49 -184 44 85 -185 -61 38 191 35 22 2 -27 -179 -14 -94 -7 -116
7147 -116 47 -6 91 -117 34 -286 189 57 -209 72 179 101 -120 -167 -138 118 -35 -47 141 -108 101 -6
7169 -6 28 100 49 -72 -48 124 -127 -173 87 20 -102 -24 100 -82 113 53 -58 34 -93 -181 16 218 -259 40
7193 40 57 153 -36 106 7 -88 128 80 8 -51 36 49 -17 12 104 82 -221 -81 14 -53 -76 54 190 24 35 -39
7219 -39 21 66 60 -67 8 -107 -26 -8 16 1 -72 50 72 185 -100 -55 -20 -177 16 144 39 79 -123 177 94
7244 94 -122 -19 38 -8 -184 -37 -81 4 -14 -31 -205 -1 -232 -169 -176 -120 84 106 90 -169 105 4 -76 11 -83
7269 -83 -29 -3 -152 77 -12 -12 38 20 -147 -240 -30 41 -30 1 79 146 -19 50 42 81 -2 20 19 172 70 -152 100
7296 100 -38 -3 -43 95 174 29 82 20 -34 27 -67 -102 146 63 -102 124 70 -129 -194 -78 -183 -35 39 5 43
7321 43 53 -222 137 -24 5 -158 119 114 63 -123 317 -28 108 0 -26 -141 -48 185 167 -95 -65 -11 236 -26
7345 -26 -55 -56 -52 -83 -131 80 -195 43 -46 8 -158 180 -51 -308 -80 44 -32 47 14 79 -109 20 40 -37 -124 80
7371 80 139 -283 31 14 -40 -87 2 14 -107 -82 -11 69 -208 20 -34 13 42 185 138 72 -43 -85 145 28 44 47
7397 47 1 -29 123 -60 -16 -43 1 21 8 -203 -39 143 8 127 28 30 -19 -90 115 -24 22 102 24 -54 -12 -189
7423 -189 -4 19 -73 -73 79 -13 99 179 175 319 -43 51 181 198 115 32 32 -6 115 -79 -68 155 -44 -119 -74 163
7449 163 30 48 -237 57 -82 102 101 -80 41 -50 114 168 -135 -56 39 -94 130 -9 164 99 -91 36 196
7472 196 -11 35 -5 97 193 35 154 27 -59 -132 -129 -57 30 -14 -38 -200 163 83 -36 104 230 269 -288 82
7496 82 15 -55 153 -182 80 40 -129 5 -1 -39 60 -63 -15 143 -110 -35 33 21 1 -102 -3 -162 162 14 -62
7521 -62 -191 50 283 211 34 -75 59 -72 152 -94 -92 130 203 -78 100 -172 -174 -247 38 79 61 -117 -47 143
7545 143 -12 -50 23 -22 40 107 114 23 124 -20 -117 40 -191 8 177 154 -145 -67 9 236 -218 196 26 151
7569 151 -4 -105 265 -9 -65 167 64 126 -158 23 -25 25 -133 341 -6 -222 -192 -266 -87 82 -124 -157
7591 -157 162 119 65 -129 -21 -36 -93 40 43 -57 -12 19 63 14 -76 -251 -3 159 -64 40 123 -37 60 -54
7615 -54 114 102 115 -113 -57 -13 -125 -239 -78 -4 29 70 -27 12 -211 -78 120 -102 260 113 28 -211 -95 -14
7639 -14 -73 -1 35 -96 141 -72 -92 -139 -37 39 -181 70 17 -36 -5 72 -40 69 153 189 91 -62 0 -50 60
7664 60 -96 -51 -71 15 -66 -32 23 -9 -122 49 25 -273 135 47 -71 218 58 -71 -25 102 -112 2 -151 -94
7688 -94 -94 46 -150 71 19 -25 -227 -10 252 20 -7 -14 16 -10 -27 -159 -34 -92 159 -75 1 93 42 -288 -20
7713 -20 165 -7 245 202 45 71 39 89 -169 -3 108 -41 -8 -8 -22 73 -118 52 -17 108 194 77 -49 -13
7737 -13 32 60 26 -123 29 17 83 94 -46 -98 -105 89 -104 14 -42 95 231 112 -128 -25 172 206 45 -67
7761 -67 -15 -13 -187 127 56 80 130 -183 0 -282 -23 157 -77 -22 50 24 -123 109 -27 -187 -102 -140 42 137
7785 137 -143 -53 72 -38 -154 -10 54 -64 97 -66 182 -1 -61 -186 1 -160 -7 68 -174 107 40 126
7807 126 194 58 -86 -50 -125 -90 -150 116 101 172 -35 66 -35 -14 -177 -138 4 -145 96 -260 107 161 -58
7830 -58 -82 -58 -197 -137 82 -45 -115 149 -77 72 -169 -87 7 76 101 -108 -123 12 130 67 -30 229 -36 -88
7854 -88 94 -90 -81 -184 23 -63 -57 43 -102 65 15 -19 175 -68 78 -53 262 212 -105 162 -120 -49 -36 -179
7878 -179 44 -37 174 117 -34 -41 147 182 -24 -62 51 54 103 -33 -34 -146 60 -230 103 -90 -97 -9 -75 74 -54
7903 -54 61 230 40 -126 -14 158 -5 -34 -234 65 -53 -41 -13 -96 66 -152 62 152 -109 -211 198 -110
7925 -110 38 73 -252 226 133 54 -21 47 49 -72 120 13 -1 -50 145 -93 190 1 236 -63 -155 134 79 118
7949 118 81 -105 -84 -127 -102 -68 -260 -185 -253 -89 -66 63 -13 43 12 -172 -50 175 172 41 -44 -18 136 -30 -3
7974 -3 -9 -72 185 -67 -120 -57 -42 -4 -24 -170 -123 -46 22 122 93 77 -113 -231 -1 170 -43 -116 -14 95 77 -53
8000 -53 78 -63 147 -149 -5 -73 -93 246 9 81 81 85 -51 -36 -66 -41 47 -130 74 10 20 146 -10 -275 105
8025 105 132 -171 -20 -6 -32 73 104 -36 -101 -71 -84 72 -56 1 -108 -115 1 -95 109 74 -60 -91 59 67 205
8050 205 120 -80 47 -49 85 54 216 -69 -66 -100 -84 47 -18 7 48 106 8 -7 24 -166 -100 179 120 105 -141 182
8076 182 -15 -54 -17 87 74 -122 22 -8 23 -101 -75 17 74 -148 286 -79 -96 39 111 208 72 37 -77 -77 3
8101 3 -65 -36 145 150 120 160 -30 23 128 -17 126 -106 -32 -61 -26 65 49 9 -148 -11 10 64 102 110 -73 155 77
8128 77 -104 -136 89 27 -34 -71 -84 54 304 188 27 16 38 -50 -40 79 -129 111 -23 -126 34 -41 1 30
8152 30 56 -113 138 185 -92 -124 -25 43 -64 -95 -15 -195 -35 -32 90 184 -107 -210 71 -27 46 -131 -21 47 18
8177 18 -128 -80 -57 -69 -23 53 -38 -198 0 -224 48 52 153 163
8191A63
$$ Imaginary data points
##PAGE= N=2
##DATA TABLE= (X++(I..I)), XYDATA
0 0 0 0 0 0 0 0 0 0 0 0 8 -8 8 -8 16 -16 18 -24 32 -35 41 -48 61 -72 85 -96 113 -133 152 -176 201 -229 261
33 261 -295 333 -374 422 -473 527 -590 656 -731 811 -898 994 -1096 1211 -1334 1472 -1620
50 -1620 1786 -1967 2169 -2392 2643 -2925 3246 -3614 4041 -4544 5145 -5882 6806 -8005 9634
65 9634 -11981 15673 -22365 38339 -160600 21066 376269 13947 -255446 -141609 138266
76 138266 122799 -4089 -38619 -45054 -68703 88144 173522 2282 -199197 -93788 183250
87 183250 181034 -136350 -204443 29242 140635 30729 -81271 -79465 -4411 34694 67732
98 67732 36596 -92274 -79534 99587 115697 -36640 -94803 8564 78392 -17 -36536
109 -36536 27799 -19276 -80578 21634 92361 -12581 -120135 -42278 116337 66502 -96590
120 -96590 -53375 73656 41269 -34428 1476 58815 -17505 -92484 42334 132374 -45562
131 -45562 -156491 1259 136616 30728 -127769 -65891 82151 47104 -36572 -8881 7067
142 7067 -16557 7922 57106 33908 -65297 -58471 73212 76820 -51536 -80068 5454 57563
154 57563 6461 -49391 -13486 9987 -13333 18231 33333 -25781 -37858 26983 59981 -3363
166 -3363 -55426 12273 54817 -19363 -39667 20763 23048 -30311 -40365 21669 42648 -34236
178 -34236 -48262 28777 37852 -11929 -17164 15051 18401 -17999 -1970 51213 -137 -69254 -7478
191 -7478 67714 22575 -70171 -55986 48794 53425 -33701 -40026 3908 15941 21166 16051 -7498
204 -7498 -29047 -9942 53393 44064 -49772 -59253 23613 57528 2621 -61179 -32804 35134 23701
217 23701 -10709 -11867 -18861 -3419 33403 31907 -11363 -45069 275 65649 18670 -53501 -25257
230 -25257 26188 24518 -12035 -30283 -3983 4219 -5464 12968 2918 -25663 -4674 26298 24106
243 24106 -7961 -28805 13488 39421 -5842 -22789 2837 9429 -1643 -14769 -2196 7835
255 7835 -20316 -13400 20785 905 -19315 -627 14603 12986 -6247 -4991 21073 6215 -11683
268 -11683 10021 9417 -8115 -10426 -4679 10749 -2791 -27749 -2308 13546 -7499 -9961 -644
281 -644 8097 8302 -5645 7821 16527 -8674 1180 20745 740 -12694 -5883 7439 8823 -19878
295 -19878 -18446 9974 -108 -11497 -3274 -3322 4608 5146 -21 10555 1759 -4418 18010 13314
309 13314 -6680 -6764 376 12731 461 -24354 -5304 8839 -8950 -8167 -3625 -4933 2414 733
323 733 6046 6955 -8541 6572 21398 1448 -4897 1386 4615 8830 -7416 -13387 3240 -2516
337 -2516 -9108 -3744 -7582 -2343 817 -2833 6661 1329 -5862 13185 12029 -2599 996 4651 8179
352 8179 2908 -11308 -970 3992 -8770 -3481 -3471 -9918 -711 -209 -1051 2290 -5773 2178 13005
367 13005 2428 807 2234 2364 10377 1027 -7546 2462 -2098 -5108 2116 -5482 -8684 -4696 -1890
382 -1890 6745 -1253 -10726 3595 8238 4030 5858 -2229 -1184 8700 4617 2203 -3173 -10145 1634
397 1634 5138 -3332 -6014 -11890 -3798 11303 1970 -7951 -5143 -739 12712 11809 -5060 -6750 387
412 387 11143 13489 -8627 -15352 1669 6388 3893 -4263 -14972 -5552 6311 7633 3352 -12462
426 -12462 -10965 12857 16828 3686 -10226 -12614 11420 20386 -2807 -15227 -8963 4340 12054
439 12054 -2879 -12752 -7129 -3206 9369 11649 -8407 -12657 167 13699 17962 -4335 -18634
452 -18634 70 15840 12833 -6545 -21922 -3349 14436 2987 -7141 -11259 -7647 7552 8614
465 8614 1780 -3099 -10931 2164 19792 9860 -7212 -15214 -2334 23101 10688 -20735 -17390
478 -17390 2824 13288 3864 -15961 -9854 3383 2221 8622 5841 -9574 -7124 5836 18913
491 18913 14404 -17252 -20514 12728 23092 1620 -23881 -20082 13437 16482 -9129 -13245 -7846
504 -7846 636 12163 6865 -1590 -7260 -7620 15108 23828 -2674 -19068 -9786 15264 24869 -9762
518 -9762 -31687 -5751 16199 11224 -10100 -22825 -1876 14013 5690 1556 -4379 -6789 6332
531 6332 12760 12381 58 -20403 -5074 24741 12748 -17646 -26826 -1606 25379 3577 -25490
544 -25490 -11707 6673 9900 5044 -4704 -1915 990 759 16437 13557 -12511 -15319 5101 22142
558 22142 8726 -27274 -22061 14006 15881 -5287 -18847 -12737 9518 12476 228 -2885 -6458
571 -6458 -746 15245 12876 318 -10347 -10576 13289 20434 -7685 -23483 -10912 12568 17323
584 17323 -12351 -25405 -1748 14544 10693 -4189 -13135 2232 12800 7021 4878 -2527 -8718
597 -8718 2786 11703 7745 -9312 -22095 166 19646 -9 -19113 -12917 6027 15531 -1239
610 -1239 -11897 634 6573 6652 6061 -750 -1331 -678 938 9699 1362 -13663 -6756 4592 5511 -2924
626 -2924 -13274 -4777 7363 2762 -416 -1529 -2407 5214 6115 1972 2721 -1913 -2137 4536 2976 -70
642 -70 -5767 -9243 2716 6389 -4378 -7650 -4929 2780 8695 -1133 -5606 1278 3769 5873 3244
657 3244 -2226 -375 -176 1278 5950 -3336 -10085 -995 4319 2421 -4759 -9624 1636 7278 595
672 595 -1120 -2255 670 7050 2944 -763 114 -2356 1598 3902 -2742 -3417 -3252 -1498 3498 -2330
688 -2330 -5428 824 355 1505 3600 -1727 -14 3193 1303 3874 281 -2868 1549 -381 -947 1469
704 1469 -4620 -3461 1135 -1129 279 -714 -3698 2737 3607 688 1811 -1396 1045 5824 212 -1289
720 -1289 -406 -3029 2016 881 -5083 -2568 -2329 -443 2913 -3617 -3137 3159 1507 3218 2062 -2909
736 -2909 2984 4933 686 774 -2819 -1743 3505 -2411 -3837 -1737 -4354 805 1139 -4991 -792 1944
752 1944 1246 3933 -388 -382 5286 2049 1695 1430 -3158 1456 1929 -4244 -1625 -2328 -3394 1209 -2760
769 -2760 -3631 648 -855 2060 2895 -1970 2694 4698 957 3153 862 -1194 3113 -647 -2346 -687
785 -687 -3973 -967 -324 -5331 -1045 -297 -2351 2600 325 -1013 3953 2168 2258 3529 -201 2393
801 2393 2721 -2216 410 -1014 -3769 450 -3050 -4726 -221 -2545 -1568 1210 -1939 1533 2589 -34
817 -34 4268 2373 -267 4121 1329 -420 1449 -2143 -1221 -262 -4408 -2069 -1703 -3894 371 -699
833 -699 -2120 1706 -32 1130 4545 733 1376 3535 739 2321 644 -2145 634 -1326 -2466 193
849 193 -4348 -4048 712 -1526 -815 -795 -1826 3310 3035 475 2723 806 1200 4197 547 -628 -103
866 -103 -2564 796 139 -5176 -2856 -1151 -412 996 -3055 -1732 2983 951 2438 2766 -1317 1718
882 1718 3896 1858 800 -2831 -1358 3021 -1471 -3451 -1578 -3059 -446 890 -1950 -428 -1559
897 -1559 -552 5622 2382 -1981 240 1946 4523 1371 -4542 34 2124 -2034 -678 -1287 -3199
912 -3199 -1200 -1178 1989 1606 -5104 -1029 5078 2707 594 -2046 -528 5387 2049 -1988 -641 -1916
928 -1916 174 1842 -2551 -2204 -2296 -1833 3075 898 -3081 35 315 2701 5044 -1321 -2622 1068
944 1068 3175 4410 -2467 -6738 2254 3490 -2365 -3443 -2886 374 1473 -2482 1473 2022 -3540 627
960 627 5540 2968 -1490 -5021 2357 9240 -1978 -7618 -267 2923 951 -4074 -4227 2315 -463
975 -463 -3392 3538 1910 -2626 -288 2416 6235 2057 -6100 -67 6079 1627 -2045 -4981 -2182
990 -2182 3650 -1292 -4136 -1238 -2293 898 2313 -1600 704 1245 -507 4101 3633 316 -479 -2584
1006 -2584 3524 6263 -5315 -7891 858 3404 10 -7122 -4825 5245 1153 -4326 1445 2897
1020 2897 594 -44 1579 7083 1147 -7087 2257 7982 -744 -6999 -4867 3461 3650 -7572 -5335
1035 -5335 2889 -305 -1702 501 1038 2159 -923 1115 7029 1077 -3039 1254 2615 2954 -1089
1050 -1089 -5962 -726 1679 -1885 -1541 -3957 -2963 3089 702 -1619 508 566 3340 2492 -614 3570
1066 3570 1905 -2865 2108 3480 -1348 -4593 -3873 3233 2415 -7902 -4977 3385 1486 -1729 -2106
1081 -2106 1599 4540 -1157 -340 6177 1488 -3117 849 3708 2312 -4741 -5463 3806 1687 -5800
1096 -5800 -3296 -169 219 -373 -1795 1857 1629 -2141 3045 4505 -597 95 1259 2251 1884 -3196
1112 -3196 -1555 1344 -2027 -1293 -379 -3135 -1664 -154 826 1620 -2585 -309 5153 1317 -980 1982
1128 1982 2035 1254 -782 -385 2212 -2229 -4313 1833 496 -3739 -2716 -437 2396 -383 -3385 2382
1144 2382 3195 -1342 642 2509 1549 43 -1588 2438 2443 -4470 -2003 2294 -871 -2576 -2560 130 1632
1161 1632 -2588 -1151 3749 -234 -1240 2345 1996 1046 -1087 -540 3759 -450 -3594 983 363 -1438
1177 -1438 -1449 -1779 996 -606 -2759 2579 2150 -2471 381 2680 1577 587 -1402 1985 2378 -2779
1193 -2779 -566 1600 -2254 -1617 -748 -187 310 -2780 -282 3455 -1149 -1347 2456 1298 990 96 220
1210 220 2994 -1187 -2643 2227 244 -2878 -1188 -609 750 -1442 -3305 2295 1836 -2795 1048 2421
1226 2421 905 760 -528 2124 2315 -2694 -223 2298 -1796 -1653 -899 -889 210 -2832 -1410 2740
1242 2740 -1363 -1276 2305 955 926 729 449 3245 -30 -1904 2334 422 -2324 -247 -881 -873 -1315 -2886
1260 -2886 961 587 -2832 849 1983 -183 1137 595 2251 2604 -1280 871 2667 -1489 -937 -22
1276 -22 -1058 -492 -3214 -1829 1472 -2397 -2155 2114 53 -245 884 1185 2872 625 -683 3212
1292 3212 982 -1572 591 -512 -411 -1072 -3229 -349 -545 -3211 -231 553 -1132 403 326 1509
1308 1509 2666 -501 1404 3324 -244 123 957 -666 195 -1491 -1660 -95 -2670 -2094 622 -1492
1324 -1492 -959 386 -250 1691 1089 11 2647 1540 406 2094 156 -281 235 -1420 -74 -773
1340 -773 -3353 -240 -140 -2199 -607 -740 33 1245 -461 1355 2568 -261 1511 1833 75 704
1356 704 -322 -498 929 -1633 -2109 -262 -1486 -625 -475 -2057 267 519 -359 1798 768 -36 2073
1373 2073 1053 758 1180 -735 445 264 -1636 -163 -926 -2137 246 -672 -1157 18 -887 669 1648
1390 1648 -428 927 1189 553 2005 197 -502 1521 -533 -771 260 -1787 -1020 -454 -1530 415
1406 415 -493 -1750 1057 1008 348 1015 -633 794 2343 -224 152 530 -464 624 -789 -1492 423
1423 423 -1738 -1463 849 -660 -584 215 -410 2023 1254 -1311 1044 1512 747 842 -1338 -341 1208 -1450
1441 -1450 -869 235 -1589 -470 -447 -1146 1168 -547 -904 1780 1066 338 470 -920 2014 1982 -1920
1458 -1920 -420 328 -248 241 -2146 -1123 993 -1782 -1173 905 -282 123 41 390 2764 475 -1814
1475 -1814 1567 1783 194 -681 -1994 780 889 -2999 -1189 419 -1057 -298 -691 97 1536 -1018
1491 -1018 110 2904 936 129 485 269 2219 311 -2495 518 267 -1295 -725 -2038 -342 529
1507 529 -1783 -241 1429 -117 728 492 767 2504 -112 -1016 2163 1000 -552 -1110 -1581 1204 -334
1524 -334 -3410 -716 252 -1198 -479 -636 1028 1701 -1035 795 2890 279 13 576 1221 1660 -1667
1541 -1667 -2126 1375 -166 -2053 -1405 -1271 30 -514 -1692 953 965 -902 1174 1265 928 1241 -21
1558 -21 1180 1866 -709 -697 -266 -982 -175 -1227 -2160 -406 -844 -684 44 -777 485 1540 -102 1224
1576 1224 1811 333 950 323 796 1135 -1388 -1469 976 -836 -1810 -1452 -1006 123 -856 -1705 1134 635
1594 635 -711 942 1169 1343 760 -391 1711 1241 -1595 -434 397 -718 -973 -1831 -901 331 -1748
1611 -1748 -429 1280 -394 92 871 673 1496 -182 407 2191 160 -575 578 -514 -443 -479 -1408 -199
1629 -199 -895 -1421 439 -119 -931 560 288 712 604 -66 1639 819 -590 938 878 -1065 -323 -343 -318
1648 -318 -547 -1958 -246 920 -1366 -391 506 95 592 -277 647 1979 -554 -311 1733 178 -645
1665 -645 -533 -491 592 -1240 -1642 1016 -181 -1361 247 154 340 221 -110 1628 1096 -853 636 726
1683 726 -361 132 -555 -235 489 -1431 -432 446 -1608 -217 647 -274 401 36 304 1788 -268 -89
1701 -89 1655 -180 -144 529 -301 257 -987 -1348 637 -697 -1511 506 10 -132 158 -382 1429 927
1719 927 -744 1029 1185 -583 289 112 148 -154 -1929 -377 397 -1695 -888 240 -582 -72 -272 43
1737 43 1255 -108 360 1812 87 13 545 -179 117 -447 -1112 298 -648 -1779 -9 -363 -501 -11
1755 -11 -258 1015 913 -627 1401 1432 -222 694 765 142 149 -824 -184 165 -1954 -965 80 -1100 -509
1774 -509 -685 6 943 -141 256 1887 310 417 1151 251 645 -115 -549 952 -728 -1840 88 -512
1792 -512 -1483 -791 -729 334 -76 -841 1263 1289 -470 874 1291 721 850 -424 799 769 -1539 -882 21
1811 21 -1089 -962 -851 -823 233 -848 -577 1366 172 -109 1277 996 1232 541 -145 1340 -43 -785
1829 -785 431 -430 -1075 -523 -958 -470 -694 -1270 720 504 -572 868 995 489 1194 344 1056 1080 -566
1848 -566 219 925 -1027 -1047 -421 -449 -426 -1799 -1011 692 -660 -316 865 478 586 480 481 1541 436
1867 436 -413 1047 360 -533 -201 -762 -144 -394 -1497 25 -246 -1021 354 280 -96 590 468 949 1189
1886 1189 -254 775 1109 -609 56 56 -495 -269 -1144 -569 449 -1007 -735 783 -40 321 74 7 1525
1905 1525 459 -272 1177 290 -343 244 -539 68 -271 -1202 102 -64 -1362 -45 -66 2 673 -529
1923 -529 308 996 79 514 545 -349 765 200 -938 147 -506 -658 31 -1005 -121 261 -1081 320
1941 320 556 -47 286 0 123 1487 -185 -616 1014 -209 -218 -146 -1006 321 -164 -1398 408 213 -412
1960 -412 204 -150 617 1107 -757 578 1165 162 239 -194 -308 732 -857 -1159 647 -571 -824 -63
1978 -63 -681 345 260 -816 719 995 -159 432 500 615 1130 -675 -124 841 -464 -697 -287 -781 85
1997 85 -801 -1176 594 -252 -674 577 271 712 686 -407 1057 1046 -228 270 -9 -408 150 -1133 -841
2016 -841 -72 -1149 -519 7 -597 450 89 -264 1062 725 214 888 414 701 870 -734 66 590 -1146
2035 -1146 -590 -885 -812 -55 -1148 -687 956 -274 -264 515 379 960 282 -82 1622 692 -498 444 270
2054 270 -126 -376 -1365 -220 -314 -1739 -513 74 -669 47 -11 258 1219 -46 324 1433 358 503 195
2073 195 -573 191 -392 -833 -68 -881 -1023 27 -682 -519 226 -180 434 419 193 1248 341 -11 1148
2092 1148 454 -458 322 -134 48 -504 -1493 -85 -101 -1303 -243 -92 -153 116 -396 533 1292 -296 264
2111 264 1115 406 269 -100 65 716 -748 -1118 231 -658 -653 -233 -465 24 -193 -502 754 357 -119 967
2131 967 461 393 663 -165 303 50 -716 185 -126 -1277 -62 -389 -617 -110 -480 235 659 -632 515
2150 515 1086 -221 160 325 426 532 -496 -274 715 -697 -925 137 -430 -203 -424 -640 834 142
2168 142 -461 975 645 -57 335 9 683 439 -716 366 181 -842 -134 -262 -676 -69 -455 212 521
2187 521 -628 228 843 -106 383 430 230 709 -252 -170 524 -769 -459 166 -538 -387 -328 -277 462 -431 -610
2208 -610 1010 425 -147 691 381 666 171 -593 701 157 -1109 46 80 -698 -241 -909 61 284 -827
2227 -827 84 1068 -283 459 648 287 742 -34 -19 1122 -553 -485 404 -793 -560 -458 -798 88 -436
2246 -436 -517 596 -35 -132 957 402 447 677 -196 733 348 -747 71 27 -667 -190 -788 -412 -33 -1123
2266 -1123 37 635 -529 192 450 320 648 122 293 1084 52 -305 566 -566 -500 -376 -625 -205 -468
2285 -468 -893 256 -203 -593 516 181 491 747 152 674 788 -322 682 310 -625 -49 -355 -380 -359
2304 -359 -1244 -138 128 -874 -180 165 17 451 71 367 943 42 143 881 -64 137 -3 -554 -151
2323 -151 -576 -996 76 -553 -1093 148 -416 74 360 -105 777 725 105 1056 587 -179 535 -17 -12 -39 -787
2344 -787 -158 -134 -1305 -650 141 -426 97 -168 95 952 -237 254 1016 18 44 707 -61 110 -446 -597
2364 -597 288 -531 -1017 -109 -540 -326 49 -383 471 248 -206 713 418 -3 630 -130 52 475 -365 -78
2384 -78 196 -880 -158 -55 -891 -31 -297 -418 394 -273 182 825 -345 83 708 56 231 294 -164 703
2404 703 -501 -769 304 -443 -474 -36 -636 303 200 -589 613 466 -133 396 275 243 499 -639 240
2423 240 357 -554 -57 60 -458 -79 -309 -666 553 -218 -56 451 -44 297 576 -204 388 307 -186 223
2443 223 -213 -258 417 -644 -426 314 -507 -421 142 -163 589 272 -387 609 174 75 245 -113 359 325 -765
2464 -765 113 48 -866 -111 -378 -359 212 -350 -429 835 -68 -11 603 -179 627 473 -327 583 -37 -496 231
2485 231 -400 -236 31 -992 -134 157 -562 106 -67 -144 693 103 159 1024 304 -33 502 -139 193 -84
2505 -84 -822 236 -25 -878 -90 -136 -389 126 -448 34 721 -74 369 696 48 641 203 -236 547 -72
2525 -72 -219 -92 -547 -249 -159 -982 -219 107 -436 157 50 312 916 23 228 828 317 342 390 -159 336
2546 336 -273 -786 260 -373 -718 -275 -445 -17 80 -544 379 742 156 593 547 558 542 20 170 477 -330
2567 -330 -427 -42 -590 -351 -449 -393 66 -421 -357 339 -137 108 459 101 586 605 231 597 265 -119 229 -382
2589 -382 -621 -45 -294 -544 -338 -524 -192 -17 -446 463 651 -109 579 401 476 628 -368 345 531 -842
2609 -842 -399 -70 -372 -131 -574 -424 304 -8 -331 294 -149 463 294 -84 855 210 -113 246 -69 -382
2629 -382 34 -397 -117 -162 -442 -270 -318 -618 239 187 -169 509 211 66 692 22 412 634 -454 16 288
2650 288 -432 -189 -512 -323 156 -674 -362 560 -66 -251 373 79 552 133 -125 648 163 -399 258 221
2670 221 170 -149 -552 303 30 -705 -47 393 -119 229 41 36 615 -192 220 505 -120 76 162 -250 12
2691 12 -247 -267 58 -602 -323 370 -347 -320 192 26 299 86 -58 792 219 -310 577 -33 -128 -261 -252 242
2713 242 -63 -581 -22 301 -480 66 63 245 332 -502 279 589 -219 3 338 -152 -103 -364 -291 101 -556 -375
2735 -375 221 -300 -391 115 -220 201 120 -51 650 367 -231 908 200 -83 148 -276 -176 43 -651 -236
2755 -236 184 -640 -376 -91 -126 5 -243 222 715 -230 235 576 -119 203 -155 -159 175 -473 -300 5 -758
2776 -758 -627 -88 -279 61 -181 -287 420 290 -131 649 457 212 311 146 370 200 -256 114 11 -631
2796 -631 -347 -100 -312 -41 -283 20 190 -233 489 698 28 247 187 285 591 -152 -188 282 -500 -502 -138 -369
2818 -369 -226 -338 -220 272 -276 -234 219 464 184 426 175 584 190 -155 320 29 -486 52 -45 -364 -285
2839 -285 -752 31 251 -506 140 516 54 399 391 212 509 188 341 518 -356 -221 19 -335 -362 -347 -472
2860 -472 105 -304 -606 422 -18 -107 308 275 496 65 -78 453 228 -336 314 88 -371 -204 -485 -323
2880 -323 160 -467 15 242 -273 -17 308 3 549 151 210 537 -114 138 139 -448 -3 -117 -328 51 -454
2901 -454 -363 244 -115 -383 130 -21 209 154 -90 706 125 -273 381 190 -172 -30 -122 225 58 -862 -94
2922 -94 294 -392 -130 208 -60 290 -19 -1 798 -179 -25 274 -44 -9 -54 -404 68 -85 -434 310 -130
2943 -130 -278 164 -157 53 353 44 276 272 -287 260 129 -167 199 -31 -298 -74 -448 -20 -38 -574 -154
2964 -154 181 -89 132 -45 226 628 -263 84 529 -160 -67 57 -278 -78 -443 -459 88 -263 -437 -137 -280
2985 -280 180 88 -319 121 461 -269 439 217 67 250 -242 92 75 -538 -355 -170 -396 -4 45 -627 92
3006 92 242 36 565 99 385 509 95 253 437 -71 21 -198 -232 -161 -480 -503 4 -306 -542 80 -122 253
3028 253 188 -67 375 276 37 503 132 94 336 -245 -317 102 -543 -114 -301 -410 23 -384 -236 188 22
3049 22 -50 405 268 236 397 -163 707 400 61 259 -8 -203 -22 -663 -478 -92 -331 -54 -4 -318 236
3070 236 210 -260 817 314 122 211 -27 20 227 -260 -161 43 -472 -127 -318 -398 13 -319 -75 124 -230
3091 -230 16 278 282 385 432 -97 337 205 56 195 -333 -94 119 -674 -306 -31 -121 -163 -78 -114 479 22
3113 22 -1 617 164 236 250 -185 289 -5 -484 -2 -228 -434 -27 -173 -205 71 -88 16 152 -29 499 407
3135 407 -91 477 340 -197 339 140 -81 -31 -215 -134 -56 -477 -115 16 -463 100 -211 -3 292 -308 34
3156 34 364 -41 105 109 -64 195 -260 -199 60 -150 -452 42 -260 263 -3 -288 120 201 -122 503 228 142
3178 142 325 -137 107 474 -211 -103 73 -459 44 -246 -253 119 -217 -5 424 -64 126 493 -132 165 539
3199 539 -75 36 93 -451 139 -101 -373 -32 -196 -108 -171 -317 222 257 -454 72 205 129 377 13 122 -102
3221 -102 -341 -17 182 -254 -159 -40 -311 103 -295 -159 498 -40 104 378 11 381 354 44 187 -88 -142
3242 -142 -4 38 -134 56 -436 -259 102 -577 -128 171 -36 240 -26 103 236 94 230 397 13 221
3262 221 -45 -256 -139 -51 -569 -104 -474 -196 89 -298 -127 297 66 145 449 239 473 168 105 422 -68
3283 -68 -224 230 33 -414 -36 -613 -55 120 -258 58 130 -83 511 218 147 510 29 246 312 -88 41
3304 41 -105 -174 -34 -400 -374 -7 -582 -39 119 -68 -179 280 12 317 83 126 529 49 -71 312 -283
3325 -283 -85 -36 -261 -89 -264 -493 -37 -325 -442 -110 -258 61 237 -47 311 651 -36 226 227 5 73
3346 73 -94 -181 55 -400 -244 129 -355 -59 -160 -169 270 22 -14 281 -40 141 536 -73 272 263 -136 -152 -64
3369 -64 -516 119 -99 -651 -141 -212 17 134 -168 201 125 -229 142 421 112 285 -18 16 270 -312 -157
3390 -157 52 -532 -257 -114 -422 187 -101 -327 219 81 95 298 -132 114 176 -146 58 173 -19 11 -145
3411 -145 -387 -265 -104 -171 180 -143 41 337 -116 419 308 -228 132 -46 7 240 -301 -150 178 -246 -123
3432 -123 207 -336 80 24 -20 148 30 -34 374 57 224 368 85 -22 307 70 53 20 -337 72 -202 -452
3454 -452 -68 -141 -85 -127 -235 272 249 -98 379 276 110 224 -18 -29 -60 -351 -219 8 -293 -286 -144 -132 106
3477 106 -24 -51 204 27 129 455 -190 133 42 -31 126 49 -121 -34 -170 -232 222 -306 -340 -101 -285 -162
3499 -162 109 103 244 94 129 198 -51 212 113 -166 -14 -76 -290 -173 -131 -430 -69 -79 -87 135 -64 14 213 93
3523 93 74 396 34 337 -116 -78 229 -155 -129 89 -145 -221 -83 -374 -133 -51 -302 -25 235 7 403 49
3545 49 159 310 47 40 36 46 37 5 -302 71 -78 -267 -109 -246 -21 202 -218 118 402 99 386 228 -9
3568 -9 342 113 -190 138 -194 -199 -91 -419 -291 -47 -545 2 54 -107 138 8 63 394 -74 87 245 -125
3590 -125 288 129 -12 161 -278 39 12 -347 -200 -99 -101 19 148 -58 182 320 1 372 -111 186 324
3611 324 -86 -138 178 -301 -42 -133 -366 -44 -140 -272 118 41 -49 148 179 88 456 -150 259 401 -135 273
3633 273 -62 72 48 -184 -242 100 -207 -230 -79 -83 245 103 -127 264 184 62 217 -46 124 157 41 -7 -26
3656 -26 -392 -55 -151 -350 246 -170 -478 75 -39 60 171 39 70 113 -133 173 106 -152 -131 -293 -86 -3 -438
3679 -438 -37 128 -289 -87 -83 15 -14 34 68 357 38 12 306 -102 175 173 -264 155 -100 -229 -45 -192 -16
3702 -16 -62 -188 192 352 25 158 -19 -242 106 35 -190 289 -169 -202 -304 -480 -246 -255 -328 14 29 -313 23
3725 23 215 134 155 246 262 223 32 -102 52 -33 71 -234 -69 68 -233 -422 -143 -194 -193 56 -102 171 285
3748 285 -154 270 226 -176 192 34 75 -81 -197 -142 -94 -294 -173 -135 -4 38 -36 -111 229 61 152 365 53
3771 53 312 319 92 112 0 -271 185 -81 -262 152 -74 -270 35 -171 262 96 -40 222 -94 -283 411
3792 411 188 149 76 -79 156 38 -218 -125 -122 -197 -79 -151 -12 139 -105 158 418 -111 -37 432 178 -18 235
3815 235 2 384 -109 -201 132 59 -211 -284 -402 -118 -41 -331 221 74 -96 50 113 158 227 28 142 331
3837 331 -77 -159 -41 -172 -95 98 -167 -69 -146 -26 -153 161 90 345 -2 40 293 86 279 51 110 246
3859 246 36 -320 -129 -198 -222 -4 -191 19 -81 -84 178 199 -74 296 19 163 47 -191 91 219 -135 -97
3881 -97 91 -123 -237 -103 -229 109 -29 -209 292 184 -23 192 52 276 -103 25 206 -129 0 6 -106
3902 -106 -40 -106 -301 42 -111 -319 125 -41 -90 0 -135 86 197 101 306 -27 -297 132 260 -157 58 -75
3924 -75 -119 125 -86 -100 181 -126 150 35 49 281 131 136 280 0 -8 54 68 -109 -111 -194 -135 2 -337 49 -262
3949 -262 -26 106 64 148 206 85 -89 127 100 -16 162 -213 55 -276 -183 31 -243 -103 94 138 138 211 48
3972 48 232 133 211 158 206 7 356 4 -192 98 -319 -5 -100 -263 18 -170 -35 63 -40 167 47 92 417
3995 417 270 -24 110 84 -101 152 -94 -319 54 -237 -133 -148 -196 -20 -11 -367 84 74 92 291 94 96 320
4018 320 93 101 264 178 23 -93 -76 -143 -79 -521 62 -34 -69 -1 -59 210 173 66 301 167 -102 118 -172 -86
4042 -86 175 -266 -13 -113 -268 -210 -111 -302 24 21 -174 91 63 41 199 73 13 156 57 -11 57 -158 -174 -186
4066 -186 -344 63 -30 -79 75 -232 -35 -192 -30 419 428 -77 61 236 4 191 -72 -86 -18 -206 224 -187
4088 -187 -325 -267 -346 -378 -24 -249 -87 343 76 144 115 -93 101 26 -78 2 -19 -166 -219 -90 -48 109 -407
4111 -407 -159 25 -166 93 109 1 255 89 -378 139 1 37 115 -327 -81 -40 -285 -264 -34 -258 -40 -185
4133 -185 -363 182 -90 283 238 208 249 171 -12 171 100 120 171 113 -32 44 -213 -17 193 -184 -10 -283 124
4156 124 147 140 34 296 -44 -92 342 -1 -18 30 -299 24 -153 -13 -52 76 -139 46 -206 75 125 -7 111
4179 111 48 -280 260 291 -70 196 -207 -280 57 -173 -46 57 -101 31 -64 -189 215 15 -40 269 -18 184
4201 184 137 157 -106 54 -302 -135 153 -260 -106 -64 -294 167 -183 -142 364 -148 62 -56 -112 265 110 115
4223 115 71 -18 -49 -148 -49 -124 -142 -537 -215 58 -306 -43 -72 -132 97 39 108 469 154 186 240 -109 -17 204 -218
4248 -218 46 -24 -240 -163 -248 -8 173 -306 -6 260 131 336 141 66 8 205 173 133 -131 -306 107 -336
4270 -336 -33 -115 -151 -92 -236 -63 -20 -87 -46 123 57 156 178 104 145 -87 130 96 -161 -34 108 -118 -134 3
4294 3 -294 -168 237 2 107 123 -16 259 64 163 328 161 -112 105 -62 86 105 -209 -18 -221 3 -180
4316 -180 -92 -67 67 -95 122 168 -74 206 461 -12 344 100 -310 37 -161 -79 -90 -299 -293 -54 -363 -84
4338 -84 -121 -27 163 4 -108 195 238 51 155 -111 63 150 -16 340 72 -180 -175 -36 -307 168 -131 -45 -19
4361 -19 -22 238 203 95 155 192 -7 34 -74 -316 123 -278 -20 -127 -225 -202 64 -167 -64 64 -43 283 -18
4384 -18 10 182 -17 -154 85 -39 73 -19 -64 345 -36 -319 -56 -101 -108 -51 -116 -130 -71 -9 170 88 -113 -131 -265
4409 -265 -173 95 72 -112 59 -262 -23 -13 -307 220 -81 -7 61 38 -111 288 -133 -144 66 -85 122 203 -345
4432 -345 122 -150 -327 -7 -77 -143 -22 -220 19 -12 130 182 83 -43 35 169 65 118 211 43 22 -263 149
4455 149 -49 -193 138 -35 -129 42 83 -140 235 73 136 164 80 213 306 -65 -87 -88 -443 56 -96 14 -63
4478 -63 -124 -92 69 49 34 190 65 238 61 -64 256 -63 249 223 -36 -18 77 -30 -176 60 -292 -155 100
4501 100 152 175 -99 -109 180 19 117 385 204 120 -10 -6 108 -118 -135 -35 -48 -135 -69 26 95 30 -205 47 58
4526 58 189 196 -220 58 203 101 94 68 -281 -52 132 -13 -2 -79 10 -11 47 115 183 37 113 213 -58 164 31
4551 31 -51 180 33 -249 -7 119 -157 -159 -202 -129 56 -230 85 -61 -146 90 78 36 -3 -79 88 142 81 269
4575 269 -108 -18 -9 -49 -130 -3 31 -320 54 -61 144 -59 -131 8 -67 215 168 193 201 335 -100 15 -2 -69 140
4600 140 -212 -293 88 -114 -147 111 0 26 114 87 173 311 -35 124 -34 -46 236 38 -66 54 -9 -177 100
4623 100 -75 -12 -114 -177 102 289 87 166 -17 155 132 254 92 125 95 -90 225 -273 -141 44 -77 146
4645 146 -180 -108 225 -39 -135 105 19 187 -17 -121 -38 -35 1 -12 -173 111 -121 -79 -18 13 -11 -89 123 65 129
4670 129 -42 283 82 134 76 -40 -268 104 -76 43 12 -229 -245 -60 -44 -206 107 30 -34 -104 107 107 25 187
4694 187 11 -28 -34 63 -144 54 49 -94 62 24 -62 5 209 -38 62 83 71 152 -31 245 29 -21 -174 63
4718 63 -75 -107 -180 -284 -11 -250 -100 241 -53 -60 200 -70 131 -223 41 28 -67 39 44 -157 162 -50 -233
4741 -233 -44 34 -184 -59 50 -56 -127 123 13 59 -93 -40 315 220 41 11 26 -48 -123 -164 43 -98 -9 16
4765 16 -205 -51 -142 -41 111 142 199 -47 -94 -19 31 4 204 94 123 193 -16 -296 -142 -125 -74 36 0 -116
4789 -116 132 -40 114 146 -46 20 245 -35 95 7 -167 191 209 -200 114 -79 57 7 -42 -139 -41 -58 115
4812 115 107 -80 34 58 -2 28 -44 63 74 35 59 120 -83 -89 2 64 -3 -194 -118 -28 -190 196 150 97 -12 125
4838 125 -112 245 120 97 36 -20 51 -8 -225 -90 -42 -240 -13 200 -93 125 166 -27 34 17 108 -130 -25
4861 -25 -119 18 -233 24 -12 -107 48 -115 -125 250 147 -17 179 -46 210 348 -6 -41 -78 -105 75 -28 6
4884 6 167 -151 -136 -205 -135 -123 39 -42 167 81 19 88 -86 -90 356 -5 64 212 322 207 80 219 -116 -94 63
4909 63 97 -45 312 64 -59 174 74 -73 282 27 60 172 -21 -135 -18 25 -183 -146 -177 -211 -154 -13 -284
4932 -284 -24 -185 203 -120 140 106 -12 232 100 -16 -174 49 -167 13 -46 -218 -96 -1 40 147 -4
4953 -4 16 2 -195 216 -61 9 120 153 60 185 -103 110 66 126 151 216 -192 -33 11 -56 239 -211 -143 135 113
4978 113 -51 16 54 23 52 -33 84 31 94 -65 -70 -68 -38 -93 -72 38 195 -38 -78 106 255 61 104 47 149 5
5004 5 -36 48 -77 -53 -254 177 -54 -86 -54 -47 -170 33 -59 139 181 -117 298 197 102 62 5 10 33 -24 -147 1
5030 1 -185 -55 -280 -198 145 -103 -220 183 -88 -101 244 -115 127 344 -8 -51 147 52 105 75 -372 -6 40
5053 40 -38 125 103 19 64 -61 48 36 -116 -56 16 -133 148 -55 92 146 106 -113 -48 -373 -87 31 6 67
5077 67 -127 152 201 118 40 110 -152 110 200 1 -24 -125 -66 104 -89 -58 -19 -250 -16 62 -237 44 31 -53
5101 -53 -144 26 -57 -21 65 -108 89 -127 -19 -29 5 13 -60 32 12 -194 70 45 59 32 84 -42 127 95 -37 83
5127 83 36 37 -54 -146 -8 244 253 -4 1 13 32 -31 -13 154 -151 80 32 183 65 125 -10 161 209 3 79 -88
5153 -88 -2 -111 268 27 99 -41 -218 88 73 39 184 105 -191 -14 108 -1 -32 83 125 -54 102 -172 -80
5176 -80 -78 -93 -73 -55 7 59 247 -75 -128 131 -71 -205 45 69 227 82 129 -134 66 -17 -69 -64 -65 -19 23 275
5202 275 185 -107 -25 -56 -64 146 -259 -82 -59 -50 -31 38 -97 -237 0 40 -54 129 88 0 54 25 276 36 28 -48
5228 -48 -159 14 -60 -262 -114 -29 95 -52 30 -67 -70 -44 -37 38 109 248 128 62 24 119 -26 131 88 -3 64 -168
5254 -168 25 3 -13 -179 130 5 43 -19 35 -56 246 43 -66 -53 -191 -23 -253 10 -68 -77 -64 -229 -182 -57
5278 -57 -127 -5 167 28 55 42 43 18 2 194 225 2 -14 27 -111 74 -43 -43 -10 144 -83 -68 129 -90 209
5303 209 65 -43 43 -13 173 -35 -276 -19 119 146 19 -198 -56 -204 -125 109 53 1 -111 -290 114 235
5325 235 126 -267 156 188 176 176 -185 -60 184 -30 -91 -36 64 -146 -141 43 1 -135 125 -63 -171 27 -80
5348 -80 -141 -6 83 -10 77 -23 0 33 -97 -116 -65 1 22 -21 -106 22 60 35 -91 92 165 -28 42 160 169 -99
5374 -99 191 -107 41 -62 -215 -29 139 149 85 -105 -65 5 121 -68 86 131 -63 -33 -111 -28 278 143 -7
5397 -7 90 -28 29 -112 -202 -60 -35 -40 68 -180 -62 -31 37 121 46 -145 304 166 -94 41 -133 -117 211 218 7
5422 7 -124 -135 -89 16 -79 173 -17 -1 -107 3 73 -37 27 143 -25 -80 -109 -66 -28 -26 195 3 75 4 16 -128
5448 -128 208 38 -21 27 61 -6 -150 85 227 -78 92 -80 -113 -32 -71 -162 -38 49 87 148 -79 142 -172 -3
5472 -3 -9 55 37 161 -164 -1 88 -90 -23 -112 -63 162 97 10 2 -49 -26 75 33 21 -63 268 -30 121 -26 49 70
5499 70 12 -56 39 -144 -131 -9 -56 -57 -16 153 1 -176 -106 178 87 132 -26 -12 -48 88 121 -96 -28 102 -13
5524 -13 -68 131 63 -120 -18 44 121 -27 56 -111 -8 40 67 96 -49 -8 -207 106 110 77 -2 -82 28 6 149
5549 149 96 -116 -172 87 97 -49 117 -65 133 -99 -187 -77 -150 -237 94 -158 -286 -136 114 -234 -16 -81
5571 -81 -109 33 20 31 -33 -65 185 131 160 242 249 -103 -162 -62 -72 -30 -132 69 -45 -200 -111 11 110 -55 8 -107
5597 -107 -95 -37 45 92 58 209 68 -45 62 -25 159 -65 -70 -455 72 89 -210 255 -294 129 -32 -168 -30
5620 -30 167 -82 19 134 63 -16 -24 -176 -57 81 39 109 32 194 -31 -43 78 132 11 56 -42 186 100 102 94 -54
5646 -54 -114 60 150 -36 -45 -111 -28 49 -112 -44 7 133 -108 -11 -55 72 -51 -133 -256 70 -149 -124 -154 6 -26
5671 -26 -92 101 -135 -29 -10 -16 -27 225 -24 37 26 -154 60 81 -99 201 3 56 -61 152 -55 -90 90 -126
5695 -126 -34 67 154 3 210 34 30 -130 77 -146 -145 -60 -76 110 -224 -5 25 25 -50 112 169 -167 63 87 150
5720 150 -17 149 139 -109 -51 145 -106 -50 6 83 2 35 -87 180 33 42 13 129 36 51 38 -43 -67 -30 -117 -199
5746 -199 -23 -101 -121 -89 -122 156 28 -108 -177 -38 38 202 420 -20 -163 86 160 -120 102 -134 -43 222 22
5769 22 118 104 52 -198 102 -292 -36 -106 -46 -76 -57 -168 8 -290 -36 226 -123 -22 -46 11 -49 -83 71 97
5793 97 -133 -41 -16 -127 -10 123 27 179 -113 4 -12 -38 -225 -127 -52 -33 -48 88 151 45 242 157 -13 -70
5817 -70 -259 13 265 214 23 -58 30 -39 177 89 1 193 147 -153 -7 14 -82 7 -210 29 -47 -146 54 46 -60
5842 -60 -16 29 97 116 -12 -98 -74 -85 60 130 28 130 62 -15 -26 -19 -39 52 -232 -116 19 -62 -67 79 -125 120
5868 120 -149 -170 -35 -160 -170 142 48 -80 21 -93 125 17 -217 -76 35 -30 92 -279 134 118 154 -140
5890 -140 -39 -282 14 12 -250 250 110 62 -90 35 -153 -8 -48 -169 49 68 102 37 63 170 71 18 30 -72
5914 -72 -91 33 -91 -131 -132 108 64 39 102 127 -152 -68 -87 30 18 -38 -290 27 -7 76 222 -16 71 70 -134 1
5940 1 -78 -72 -40 -104 -68 195 -56 -163 3 89 -14 -60 -272 -257 139 -4 -147 229 -67 -79 89 110 36 -107 160
5965 160 72 9 52 133 4 -34 94 -171 -121 195 -1 60 43 159 -95 -171 107 -73 126 -167 102 -35 24
5988 24 179 -70 -73 -160 -188 94 -126 -54 -35 -156 -170 89 34 148 -17 122 -30 56 99 177 18 3 -72 20 -84
6013 -84 -45 -15 -84 -83 -11 -204 -35 -59 26 8 -170 246 24 115 -185 -58 144 106 -42 72 90 -98 -280 -265 -111
6038 -111 -105 149 -130 -74 33 39 -105 95 -92 62 193 -107 70 -118 19 73 122 69 -324 -61 3 340 191
6061 191 -107 67 -78 -89 -65 -44 73 90 144 -65 184 -56 142 -25 -91 -265 -71 -175 -155 -180 9 162 -41
6084 -41 55 119 -4 -43 150 -330 2 12 -34 -26 -52 -158 64 54 118 5 34 -175 94 91 192 -175 49 -116 -99
6109 -99 76 218 122 -57 -298 61 1 -111 -73 34 55 44 -65 52 71 -92 14 -85 -160 107 93 -95 -87 -34
6133 -34 77 -58 -146 225 -7 -55 -17 43 -29 -84 15 120 -147 -32 -62 -1 73 -80 56 68 19 -122 -133 -108 -70
6158 -70 118 193 -4 -213 -70 99 -80 13 120 33 91 168 99 99 39 -38 -209 -91 -117 69 130 -7 -92 110 50
6183 50 142 -80 267 119 -21 127 -70 42 162 -95 42 172 -137 25 -145 -98 90 -51 -94 2 85 -145
6205 -145 -3 -90 -43 138 5 163 14 195 -43 -170 -100 -276 125 92 -225 -31 -24 -56 12 27 24 214 206 -37
6229 -37 187 -97 75 147 100 -130 -47 114 -96 95 -1 -270 -67 145 -4 -93 119 91 128 105 83 166 -5 -97
6253 -97 229 -2 -31 45 6 119 13 -181 50 -145 -139 -86 -34 190 -140 237 325 215 59 291 53 -51 -49 -19
6277 -19 -1 -226 -196 -111 -115 183 146 61 -33 96 -20 278 131 -152 180 -56 70 158 193 48 58 -62 151 -95
6301 -95 -83 7 -70 102 55 37 -141 187 -94 -76 155 45 56 152 -20 119 131 -71 -65 -29 -98 31 41 97 119 -10
6327 -10 -105 17 107 -143 -123 28 111 137 45 77 53 -11 -165 31 -47 -130 -72 -9 -24 -212 64 35 -49 139 33 15
6353 15 -23 25 -4 80 -109 78 225 47 241 61 -29 47 -63 -77 -38 -49 58 2 -92 -132 -261 -31 296 66
6377 66 -106 49 -144 165 268 -21 117 2 6 -89 -31 -27 -26 17 -67 184 -133 194 44 -143 -3 -14 58 -71
6401 -71 -20 79 103 -96 173 -114 -29 87 -112 68 -33 109 -19 -104 -36 22 293 47 89 -33 -242 -61 -42
6424 -42 52 -147 33 -196 -58 -36 -108 -18 174 88 -109 59 25 -218 -2 44 110 11 -38 -14 -78 -160 93 112 -136
6449 -136 -3 -27 -36 78 -105 -21 -31 -58 -238 60 102 -74 -58 -68 102 62 158 33 50 -21 -82 -97 -132 -47 -19 -24 -80
6476 -80 74 44 39 -33 130 -56 32 173 230 -42 -93 58 -142 107 205 243 -269 73 10 -125 140 -8 -101 -11
6500 -11 -153 -108 142 -68 2 -2 -243 -133 -40 271 222 -39 180 -30 -11 24 -77 140 -55 -123 -49 -12 15 95 28
6525 28 80 92 32 -42 -118 66 116 -64 149 84 35 30 -26 114 103 145 -90 -79 44 -97 34 159 -17 -57 -27 -48
6551 -48 108 16 -52 -52 24 4 -149 -120 102 -16 50 175 -130 4 -25 -233 103 -95 -93 -48 -94 -43 52 22 39 161
6577 161 -117 -84 121 7 -47 -49 166 100 -213 -95 25 -13 39 -101 -106 -90 -29 -166 -132 -99 -99 -4 21 -107 67 178
6603 178 93 84 -90 -130 8 -16 -36 29 175 -40 -157 -116 -174 -11 51 66 -79 49 30 245 210 49 -165 -157 -37
6628 -37 -183 46 -13 134 114 -61 -81 178 -267 97 -8 -4 -179 -15 -153 63 91 121 7 -136 112 -7 119
6651 119 83 -131 -200 -192 77 114 -71 273 -23 124 -77 56 -88 56 -63 28 -23 179 -278 -74 -48 -125 122
6674 122 111 -91 -169 91 -72 -143 -34 -15 128 -51 76 142 82 63 -37 47 4 -44 -113 46 -235 4 36 -63
6698 -63 121 202 -35 -28 -8 46 51 -127 94 15 -128 -15 -371 -65 48 -46 -32 -148 -105 -75 -24 189 3 103 -98
6723 -98 173 -20 -59 156 -154 -33 -34 61 -90 -54 -97 144 19 -212 45 -125 -99 50 -23 -133 20 -30 203
6746 203 231 -125 -72 -79 -227 -3 -117 -137 -45 -25 29 -95 -136 44 -63 -130 67 12 -1 -18 157 -4 192 -76
6770 -76 59 107 98 4 109 7 -6 142 -154 253 21 6 124 -105 -14 17 10 11 -135 -97 122 -76 39 -124 -212
6795 -212 226 53 215 -78 -31 -86 -67 52 -36 140 -31 40 -40 -98 -75 261 39 12 -53 -139 52 -137 52 65
6819 65 41 -59 -5 167 -112 -23 -134 -141 199 -202 -84 85 91 -74 -184 -72 -93 -85 -63 -220 30 -69 -184 7
6843 7 50 112 59 61 39 128 -18 29 161 -26 10 39 -387 -231 -155 158 130 275 -148 -97 280 -19 64 47 254 193
6869 193 -62 48 93 -89 71 -77 127 32 -160 -31 27 159 -62 193 75 85 -3 -37 202 92 -8 17
6891 17 6 164 64 -22 39 -73 50 193 -13 5 -42 -214 187 61 18 148 -68 -62 76 109 -245 -123 20
6914 20 41 64 -89 -32 -123 -225 54 -99 175 -163 -13 74 124 -51 175 17 -62 -86 53 63 -118 95 -2 -32
6938 -32 84 -141 -1 97 -77 -25 -16 5 72 -119 11 -20 15 -125 -113 30 71 -167 -218 -269 -165 -95 -128 -39 -185
6963 -185 207 149 -107 295 36 211 -16 -56 -86 21 -115 133 98 -56 167 -45 -72 -296 -79 93 78 -51
6985 -51 -2 -28 69 117 -70 -18 1 61 62 -25 -49 208 29 -134 -10 -12 85 118 -259 -115 31 -71 10 195 -38 -103
7011 -103 181 -12 -87 -223 67 114 -66 -24 72 -299 28 86 -42 -52 48 -116 182 196 8 -47 90 67 197
7034 197 94 -73 40 -166 34 -279 -112 -124 -90 60 79 -146 -35 62 102 39 133 -24 32 -59 -32 164 -104
7057 -104 -88 47 60 -149 -122 -114 125 -113 138 49 3 54 137 -48 43 124 -14 -122 38 -76 242 -33 -146 1
7081 1 167 57 53 161 -53 99 201 -104 123 53 110 -55 -58 33 23 89 174 68 -186 177 -275 259 -47 -47 127
7106 127 -139 35 -46 139 3 10 93 111 218 -20 161 85 -2 -99 54 -74 -42 -175 3 33 107 -163 -23 -80
7130 -80 49 125 -173 -18 99 158 27 158 -27 92 48 165 94 24 173 2 139 5 -39 -6 -18 16 -31 114
7154 114 137 171 114 109 13 -178 96 9 -125 84 18 165 90 3 -7 -129 19 -126 123 102 7 -29 108 113 186 -35
7180 -35 -142 -142 81 -221 -29 -42 -87 -23 -134 -33 -154 -121 30 -25 203 -58 50 6 -24 -18 155 136 39 -16 6
7205 6 171 -223 76 -6 121 -96 -94 137 -20 67 -153 -25 136 -201 -129 -29 39 -105 -138 -41 -72 -244 -86 9
7229 9 24 60 51 128 7 -66 -199 40 -31 -17 -63 43 -80 38 62 69 -56 -19 151 -44 -56 41 108 262 37 38 130
7256 130 304 59 118 -68 43 -93 26 -79 -105 128 67 -199 -175 33 93 30 164 -24 -25 -101 -221 66 90
7279 90 139 136 53 58 -129 -173 -72 -52 74 65 62 6 216 -74 -74 -40 85 -61 113 263 35 81 56 -84 -153 35 -4
7306 -4 119 -206 -69 -76 20 253 30 179 69 53 250 -216 143 -59 -58 -169 -179 39 -232 -15 56 68 182 -3
7330 -3 95 106 184 145 94 272 253 51 30 -26 -33 -30 126 -16 9 36 193 51 138 -22 -75 -112 -231 -132 -161 -150 -50
7357 -50 138 19 -32 -160 226 129 -52 -73 -18 98 38 54 4 152 -74 113 -87 -52 67 152 23 154 -142
7380 -142 83 -195 109 -126 -49 139 -15 28 58 -77 -127 51 -21 0 -39 178 116 -13 -35 126 -91 84 -61
7403 -61 4 179 0 66 63 144 4 43 -75 95 -45 -132 48 -7 51 -202 26 219 -32 159 38 -318 113
7426 113 -58 -26 -79 -40 -88 86 34 -47 -239 -70 12 -37 84 97 220 -116 16 -157 -78 85 245 -51 -166
7449 -166 91 30 -146 108 43 -144 -201 130 196 -20 -107 -82 54 -41 29 63 38 99 -11 26 60 16 62 20 8 46
7475 46 75 83 289 -50 237 -34 136 -195 -8 -116 -55 100 233 148 -155 19 -172 -128 17 144 66 -80 -1
7498 -1 -84 97 -47 195 -44 -98 76 -63 -2 64 -81 -27 -18 132 -184 -125 34 76 -54 42 -265 -31 -12 64 90
7523 90 29 -154 -114 -4 -162 53 -31 169 -11 -114 -221 132 -71 -38 -48 68 81 69 19 2 5 37 -24 -91 -18
7548 -18 59 -72 -24 -17 55 25 60 -33 -114 -190 -4 -72 -140 81 247 141 -181 -139 174 -50 -106 -74 89 86 -18 1
7574 1 -154 -189 -46 -12 -99 235 -85 -174 14 132 31 45 6 52 -81 42 34 26 63 195 103 -87 -3 20 -108 131
7600 131 15 -57 -47 -138 110 -22 20 12 14 170 -83 192 -55 -38 148 -17 159 149 -140 -172 33 4 -141 -25
7624 -25 -105 90 -173 16 194 -88 8 83 60 31 93 -50 -23 -65 -120 -98 -74 -92 -110 79 49 -64 -68 161 23 -101
7650 -101 18 94 84 134 128 -1 -230 -66 41 -195 18 -231 -37 -290 39 -6 -145 65 0 -195 180 -65
7672 -65 -53 101 -77 -57 -147 160 5 -33 -102 10 87 62 -15 144 228 268 -70 -174 39 -64 -47 130 -243 -56
7696 -56 -68 -26 -13 -26 26 -9 93 -49 25 -180 64 313 -59 -157 228 -78 35 254 115 20 -29 -75 -84 48 -145
7721 -145 -55 28 -40 44 61 115 -59 27 207 -12 -100 -158 159 90 95 -75 38 140 -19 135 -62 -118 18 -102
7745 -102 -36 -82 -23 63 56 75 40 -83 10 -104 -48 55 23 -44 119 66 98 -206 -108 -84 5 -10 188 97 -155 -54
7771 -54 25 -49 37 -278 60 -90 46 -86 -215 83 -11 15 -67 -16 -71 -66 -90 -36 84 19 -71 -138 65 54 76 23
7797 23 12 -310 79 61 60 -151 42 -77 -150 182 -100 163 33 -208 -80 -99 77 -159 -145 14 -121 36 -23
7820 -23 -255 63 -22 -8 -100 74 -159 -230 74 -45 18 11 -306 141 -162 56 23 125 -106 43 117 65 -62 -84
7844 -84 68 -74 -15 48 281 72 157 -184 53 -91 103 94 -54 -79 -112 109 23 75 22 149 123 81 50 -53 230
7869 230 -196 253 51 35 -54 68 127 152 -120 85 -94 122 209 -101 20 -60 65 -39 62 -87 27 -36
7891 -36 140 -105 -78 65 -77 158 -17 -38 30 103 43 -113 140 37 -129 36 17 5 -15 98 -109 266 163
7914 163 -8 62 269 -73 92 120 31 93 91 -15 -28 6 107 43 -15 -100 104 -165 33 109 -56 53 -28 -192
7938 -192 11 86 -116 141 210 18 -223 33 -137 44 -88 85 -85 -52 97 78 37 6 17 36 70 27 -75
7961 -75 -30 175 14 -149 142 -57 -96 28 -26 -74 89 188 277 2 8 103 57 35 -18 -44 28 -132 -44 73 18 154
7987 154 -119 6 84 -11 -61 -12 -161 -106 120 -56 -113 -32 34 -263 -175 106 -172 170 -72 -123 160 -34 -76 114
8011 114 -179 -75 21 160 125 198 -85 -174 -192 -215 -100 -33 -119 123 -138 -8 94 -53 159 -138 69 72 -19 -7
8035 -7 -14 -237 6 -69 -22 -27 -177 58 20 -192 -115 -121 57 45 -29 57 20 -152 143 32 51 -194 -128 -137 67 -120 -249
8062 -249 51 -91 -150 -29 -63 224 56 -248 -84 -55 -160 -110 -76 97 260 7 79 168 -95 -140 106 47 25
8085 25 -16 -195 -82 -117 74 -183 -89 -141 46 75 74 -30 -139 -69 -92 131 -151 146 265 -183 -154 -153 38 3 299
8110 299 -138 11 -200 -107 288 -97 -29 5 -97 7 115 49 118 -141 262 44 300 -12 -10 -6 180 92 61 78
8134 78 158 -27 131 35 126 115 -68 -48 60 10 -121 -33 -208 2 105 -95 -72 47 96 -317 108 -38 200
8157 200 -170 -129 -29 -2 -217 -204 3 -115 -53 184 126 32 27 -82 13 15 -69 -284 152 -5 -45 -21 22 -17 253
8182 253 47 -16 42 -84 120 180 -21 -142 -22
8191b2
##END NTUPLES=NMR FID
##END=
