##TITLE=1H_Pr NCS-1N
 200.13MHz, CDCl3,
 8 sc
 
 7.8.2025
##JCAMPDX= 6.0         $$ Bruker NMR JCAMP-DX V2.0
##DATA TYPE= NMR FID
##DATA CLASS= NTUPLES
##ORIGIN= UXNMR, Bruker Analytische Messtechnik GmbH
##OWNER= pz
$$ XWIN-NMR		Version 3.5
$$ Thu Aug  7 14:01:46 2025 Russian Standard Time (UT+4h)  she@DPX200
##.OBSERVE FREQUENCY= 200.1313
##.OBSERVE NUCLEUS= ^1H
##.DELAY= (6, 6)
##.ACQUISITION MODE= SIMULTANEOUS
##.ACQUISITION SCHEME= undefined
##.AVERAGES= 8
##.DIGITISER RES= 18
##SPECTROMETER/DATA SYSTEM= spect
##.PULSE SEQUENCE= zg30
##.SOLVENT NAME= CDCl3
##.SHIFT REFERENCE= (INTERNAL, CDCl3, 0, 14.3821)
##AUDIT TRAIL= $$ (NUMBER, WHEN, WHO, WHERE, WHAT)
$$ ##TITLE= Audit trail, XWIN-NMR		Version 3.5
$$ ##JCAMPDX= 5.01
$$ ##ORIGIN= Bruker BioSpin GmbH
$$ ##OWNER= she
$$ F:/spectra/data/she/nmr/H-C/1/audita.txt
$$ ##AUDIT TRAIL=  $$ (NUMBER, WHEN, WHO, WHERE, WHAT)
(   1,<2025-08-07 14:00:19.29 +0400>,<she>,<DPX200>,
      <created by zg, POWCHK disabled, PULCHK disabled
       configuration hash MD5:
       00 E9 B6 7A A2 85 ED C7 34 08 36 98 17 FE 4E 26
       data hash MD5: 16K
       B6 63 74 AC A9 3E B2 B5 41 FA 96 24 1A 83 4F A5>)
$$ ##END=
$$ 
$$ hash MD5
$$ F2 4B 35 08 EF A2 77 94 6A 01 52 D7 BC 08 BE BF
##$RELAX= 
##$RELAX= 
##$RELAX= 
##$RELAX= 
##$RELAX= 
##$RELAX= 
$$ Bruker specific parameters
$$ --------------------------
##$DU= <F:/spectra>
##$EXPNO= 1
##$NAME= <H-C>
##$PROCNO= 1
##$TYPE= <nmr>
##$USER= <she>
##$AMP= (0..31)
100 100 100 100 100 100 100 100 100 100 100 100 100 100 100 100 100 100 
100 100 100 100 100 100 100 100 100 100 100 100 100 100 
##$AQSEQ= 0
##$AQ_mod= 1
##$AUNM= <au_zg>
##$AUTOPOS= <>
##$BF1= 200.13
##$BF2= 200.13
##$BF3= 200.13
##$BF4= 200.13
##$BF5= 200.13
##$BF6= 200.13
##$BF7= 200.13
##$BF8= 200.13
##$BYTORDA= 1
##$CFDGTYP= 0
##$CFRGTYP= 5
##$CHEMSTR= <none>
##$CNST= (0..31)
1 1 145 1 1 1 1 1 1 1 1 1 1 1 1 1 1 1 1 1 1 1 1 1 1 1 1 1 1 1 1 1 
##$CPDPRG= <>
##$CPDPRG1= <>
##$CPDPRG2= <>
##$CPDPRG3= <>
##$CPDPRG4= <mlev>
##$CPDPRG5= <mlev>
##$CPDPRG6= <mlev>
##$CPDPRG7= <mlev>
##$CPDPRG8= <mlev>
##$CPDPRGB= <>
##$CPDPRGT= <>
##$D= (0..31)
0 0.7 0 0 0 0 0 0 0 0 0 0.03 0 0 0 0 0 0 0 0 0 0 0 0 0 0 0 0 0 0 0 0 
##$DATE= 1754560818
##$DBL= (0..7)
120 120 120 120 120 120 120 120 
##$DBP= (0..7)
150 150 150 150 150 150 150 150 
##$DBP07= 0
##$DBPNAM0= <>
##$DBPNAM1= <>
##$DBPNAM2= <>
##$DBPNAM3= <>
##$DBPNAM4= <>
##$DBPNAM5= <>
##$DBPNAM6= <>
##$DBPNAM7= <>
##$DBPOAL= (0..7)
0.5 0.5 0.5 0.5 0.5 0.5 0.5 0.5 
##$DBPOFFS= (0..7)
0 0 0 0 0 0 0 0 
##$DE= 6
##$DECBNUC= <off>
##$DECIM= 32
##$DECNUC= <off>
##$DECSTAT= 4
##$DIGMOD= 1
##$DIGTYP= 9
##$DL= (0..7)
0 120 120 120 120 120 120 120 
##$DP= (0..7)
150 150 150 150 150 150 150 150 
##$DP07= 0
##$DPNAME0= <>
##$DPNAME1= <>
##$DPNAME2= <>
##$DPNAME3= <>
##$DPNAME4= <>
##$DPNAME5= <>
##$DPNAME6= <>
##$DPNAME7= <>
##$DPOAL= (0..7)
0.5 0.5 0.5 0.5 0.5 0.5 0.5 0.5 
##$DPOFFS= (0..7)
0 0 0 0 0 0 0 0 
##$DQDMODE= 0
##$DR= 18
##$DS= 0
##$DSLIST= <SSSSSSSSSSSSSSS>
$$ [...]
##$SUBNAM0= <"">
##$SUBNAM1= <"">
##$SUBNAM2= <"">
##$SUBNAM3= <"">
##$SUBNAM4= <"">
##$SUBNAM5= <"">
##$SUBNAM6= <"">
##$SUBNAM7= <"">
##$SUBNAM8= <"">
##$SUBNAM9= <"">
##$SW= 18.0517328524113
##$SWIBOX= (0..15)
0 0 2 0 0 0 0 0 0 0 0 0 0 0 0 0 
##$SW_h= 3612.71676300578
##$TD= 16384
##$TD0= 1
##$TE= 0
##$TE2= 300
##$TE3= 300
##$TEG= 300
##$TL= (0..7)
0 120 120 120 120 120 120 120 
##$TP= (0..7)
150 150 150 150 150 150 150 150 
##$TP07= 0
##$TPNAME0= <>
##$TPNAME1= <>
##$TPNAME2= <>
##$TPNAME3= <>
##$TPNAME4= <>
##$TPNAME5= <>
##$TPNAME6= <>
##$TPNAME7= <>
##$TPOAL= (0..7)
0.5 0.5 0.5 0.5 0.5 0.5 0.5 0.5 
##$TPOFFS= (0..7)
0 0 0 0 0 0 0 0 
##$TUNHIN= 0
##$TUNHOUT= 0
##$TUNXOUT= 0
##$USERA1= <user>
##$USERA2= <user>
##$USERA3= <user>
##$USERA4= <user>
##$USERA5= <user>
##$V9= 5
##$VALIST= <valist>
##$VCLIST= <CCCCCCCCCCCCCCC>
##$VD= 0
##$VDLIST= <DDDDDDDDDDDDDDD>
##$VPLIST= <PPPPPPPPPPPPPPP>
##$VTLIST= <TTTTTTTTTTTTTTT>
##$WBST= 1024
##$WBSW= 4
##$XGAIN= (0..3)
0 0 0 0 
##$XL= 0
##$YL= 0
##$YMAX_a= 112882
##$YMIN_a= -134574
##$ZGOPTNS= <>
##$ZL1= 120
##$ZL2= 120
##$ZL3= 120
##$ZL4= 120
##$ABSF1= 10
##$ABSF2= 0
##$ABSG= 5
##$ABSL= 3
##$ALPHA= 0
##$AQORDER= 0
##$ASSFAC= 0
##$ASSFACI= 0
##$ASSFACX= 0
##$ASSWID= 0
##$AUNMP= <proc_1d>
##$AZFE= 0.1
##$AZFW= 0.1
##$BCFW= 1
##$BC_mod= 2
##$BYTORDP= 1
##$COROFFS= 0
##$CY= -3
##$DATMOD= 1
##$DC= 2
##$DFILT= <>
##$DTYPP= 0
##$F1P= 0
##$F2P= 0
##$FCOR= 0.5
##$FTSIZE= 0
##$FT_mod= 4
##$GAMMA= 1
##$GB= 0.15
##$INTBC= 1
##$INTSCL= 1
##$ISEN= 128
##$LB= 0.25
##$LEV0= 0
##$LPBIN= 0
##$MAXI= 10000
##$MC2= 0
##$MEAN= 0
##$ME_mod= 0
##$MI= 1.114404
##$NCOEF= 0
##$NC_proc= 0
##$NLEV= 6
##$NOISF1= 3.799351
##$NOISF2= 2.8
##$NSP= 1
##$NTH_PI= 0
##$NZP= 0
##$OFFSET= 14.38212
##$PC= 1
##$PHC0= -1168.416
##$PHC1= -26.2077
##$PH_mod= 1
##$PKNL= yes
##$PPARMOD= 0
##$PSCAL= 0
##$PSIGN= 0
##$REVERSE= no
##$SF= 200.129724274929
##$SI= 16384
##$SIGF1= 3
##$SIGF2= 2
##$SINO= 400
##$SIOLD= 16384
##$SREGLST= <1H.CDCl3>
##$SSB= 0
##$STSI= 0
##$STSR= 0
##$SW_p= 3205.1282051282
##$SYMM= 0
##$S_DEV= 0
##$TDeff= 0
##$TDoff= 0
##$TI= <>
##$TILT= no
##$TM1= 0
##$TM2= 0
##$TOPLEV= 0
##$USERP1= <user>
##$USERP2= <user>
##$USERP3= <user>
##$USERP4= <user>
##$USERP5= <user>
##$WDW= 1
##$XDIM= 8192
##$YMAX_p= 0
##$YMIN_p= 0
$$ End of Bruker specific parameters
$$ ---------------------------------
##NTUPLES= NMR FID
##VAR_NAME=  TIME,          FID/REAL,        FID/IMAG
##SYMBOL=    X,             R,               I
##VAR_TYPE=  INDEPENDENT,   DEPENDENT,       DEPENDENT
##VAR_FORM=  AFFN,          ASDF,            ASDF
##VAR_DIM=   8192,          8192,            8192
##UNITS=     SECONDS,       ARBITRARY UNITS, ARBITRARY UNITS
##FACTOR=    0.0002768,     1,               1
##FIRST=     0,             0,               0
##LAST=      2.2672688,     0,               0
##MIN=       0,             -134574,         0
##MAX=       2.2672688,     112882,          0
$$ Real data points
##PAGE= N=1
##DATA TABLE= (X++(R..R)), XYDATA
0@%%%%%%%%%%%%%%%%%%Mj2J6j6J6j6J6k3L1l2L5m3M8n4O2p0P9q8J00j13J27j41
$$ 0 0 0 0 0 0 0 0 0 0 0 0 0 0 0 0 0 0 0 4 -8 8 -8 8 -8 8 -15 16 -16 19 -24 24 -30 32 -38 41 -47 53 -60 67 -74
40g4J56j74J93k12K34k58K84l13L45l81M21m63N08n62O22o90P69q56R56j078J227
$$ -74 82 -92 101 -111 123 -135 149 -164 181 -200 221 -242 266 -296 326 -364 405 -451 505 -573 654
61F54j409J641j945K367k992M010n949J0906m9901r1956R7331J12488j2215p4385
$$ 654 -755 886 -1059 1308 -1684 2326 -3623 7283 -42618 -134574 -37243 75245 63030 -11355
75a1355k3137K9719J2130n375J4715j0503l0623l089L6985J3709k5696k3364J5946
$$ -11355 -34492 -4773 7357 1982 16697 6194 -24429 -27518 9467 23176 -2520 -25884 -9938
88i938J8273p853k309L454n548m429Q883J2165q067j3661O589J3366q743o052
$$ -9938 8335 482 -1827 1627 -3921 -8350 533 12698 4631 -9030 -2441 10925 2182 -3870
102c870R660J047j2640m659J8127O814k1133r592J9897J0686j5257r843J0017
$$ -3870 5790 6837 -5803 -10462 7665 14479 -6654 -16246 3651 14337 -920 -10763 -746
115g46J1317r611o776J0266J672r112J067R749k719j2391N88J6008k97j8626j749
$$ -746 10571 960 -5816 4450 6122 -2990 -1923 7826 5107 -7284 -6696 9312 9015 -9611 -11360
130a1360J3913N509r479p190M703N437j376O03K32n237O58P172K452o655n397
$$ -11360 2553 8062 -1417 -8607 -3904 1533 157 760 992 -4245 -3587 3585 6037 -618 -6015
145f015O049N425n632l991M698K117m528k075M115L385n529k297N862O62m226
$$ -6015 34 5459 -173 -4164 534 2651 -1877 -3952 163 3548 -1981 -4278 1584 2246 -1980
160a980J73M986J48n571p26P312J383o781j967L944K083j757k079P90o7k062K491
$$ -1980 -1807 3179 3327 -2244 -2970 4342 5725 -1056 -3023 921 3004 1247 -832 -42 -109 -2171 320
177C20K124k943k565J523L180k48k455N47K241j950j388L203J084k220l546J894
$$ 320 2444 -499 -3064 -1541 1639 1391 -1064 -517 1724 -226 -1614 1589 2673 453 -3093 -1199
193a199L851j564k706j41P96L61Q45L62j108j946M30M203L08l339j306K318J945
$$ -1199 2652 1088 -1618 -1759 -963 -602 243 605 -503 -2449 -2019 2184 2492 -847 -2153 165 2110
210B110n66k230N46P54p12N34P74j211j489P43J850k14k157PJ687K47r39K4O85
$$ 2110 1544 -686 -140 614 -98 436 1210 -1 -1490 -747 1103 889 -1268 -1261 426 673 -266 -242 443
229D43L04n28j4Q39m09j259J003O58j024k27k26Q84p34r25J118M86j031m39Q74
$$ 443 747 219 205 1044 635 -624 379 1037 13 -214 -440 444 -290 -1215 -97 389 -642 -1081 -207
248b07R12l22j174M97R93j2j012L44r7L33l12M6j3p52K18J242p05n79m39P65Q92
$$ -207 705 383 -791 -294 699 687 -325 19 -78 255 -57 -11 -24 -776 -558 684 -21 -600 -1039 -274 618
269F18o82k01N50P3p43O29J64Q6k31k38L33K14j118L92N58j57n87L70j8L00r67
$$ 618 -64 -265 285 358 -385 244 408 494 263 25 358 572 -546 -154 404 247 -340 30 12 312 -655
290f55K72Q25j34l35M6k37O00j04K01N8p10NO09P6n79m65K1P77m36l25n2K45R6
$$ -655 -383 442 308 -27 19 -218 382 278 479 537 -173 -168 441 517 -62 -527 -506 271 -165 -490 -542 -297 -201
313b01l3Kj5K76k17O00J34q43L44K17M6Nm06k12K76l90K94L24m73j40K24k55M90
$$ -201 -234 -232 -247 29 -188 412 546 -297 47 264 310 315 -91 -303 -27 -417 -123 201 -272 -412 -188 -443 47
336D7k60J50L02j05K8M22n03oL49p24R04k47n49K54K24j24l09j20K83k12j34K78
$$ 47 -213 -63 239 134 162 584 81 75 424 -300 604 357 -192 62 286 162 -147 -267 16 -196 -330 -52
358e2j72R4K54N3k6k50n0K26M04m34J17r3j05J49K6k88j29r7k27M70l2K8j77L41
$$ -52 -224 -130 124 177 151 -99 -149 77 481 47 164 71 -34 115 141 -147 -276 -373 -600 -130 -162 -134 -311 30
382C0N6K00j37K6k7k13M00m79K43l93L36j85L40l52J88j15m4j59M50j62J48j19
$$ 30 86 286 149 175 148 -65 335 -144 99 -294 42 -143 197 -155 33 -82 -126 -285 165 3 151 32
404C2k98L78Q4J91n44K87j8j42L60l96l7q7Km6j58L58p3J89l25J57R7K76l56K3
$$ 32 -266 112 196 387 -157 130 112 -30 330 -66 -103 -190 -188 -234 -392 -34 -107 82 -243 -86 11 287 -69 -46
428d6pK44K9m21P7K13j8k4j66L7n4j06J82J19k93QK87k61J84N6J82j35J65j52
$$ -46 -53 191 220 -201 -124 89 71 47 -119 -82 -136 -242 -60 59 -234 -226 61 -200 -16 40 222 87 252 100
452A00j66n1j59N02k9j76k41J79Q2j65J80j02k33J55J64J09j78l4PN57l55q0o36
$$ 100 -66 -117 -276 226 197 21 -220 -41 41 -124 56 -46 -279 -124 40 149 -29 -63 -56 501 146 66 -570
475e70P40L83k70n36L8J52M87k60l31k32n0K58K09L9K15m96m4O03J11P6o96l5
$$ -570 170 553 283 -253 -215 -63 424 164 -167 -399 -449 -191 18 57 272 -224 -268 335 446 522 -174 -209
497b09P49M5n61j11k6m3N13m93Qk7m18L79N6O92m59m17J98M27K25m05j75j35N11
$$ -209 540 585 24 -87 -113 -156 357 -136 -128 -155 -573 -194 -138 554 95 -322 -124 303 528 123 -52 -187 324
520C24j31j61K48k40j10j88J24M57l38m43J30M59q6j04k01J91J43m13K11M94K
$$ 324 193 32 280 40 -70 -258 -134 323 -15 -458 -328 131 45 -59 -260 -69 74 -339 -128 366 368
541C68l86k65n2O54J16o40j20L0J52M32j67k81O7k44L90J50L07k64o27K94K89
$$ 368 -18 -283 -335 319 435 -205 -325 -295 -143 289 122 -159 -92 -336 54 204 511 247 -380 -86 203
562B03K32m14k34K07K85m4l94m4J80J98r5k39k4k5j93J74N48k18n08J14K12L89
$$ 203 435 21 -213 -6 279 235 -159 -203 -23 175 80 -159 -183 -208 -401 -227 321 103 -405 -291 -79 310
584C10l58j45K31K5q6K14j11o1q8Jk72K72j44N03k28k37l1l1J54J47J49j71j00
$$ 310 -48 -193 38 63 -23 191 80 19 -69 -68 -340 -68 -212 291 63 -174 -205 -236 -82 65 214 43 -57
607e7j08L63o1j81m15L81J18k2j01mK17k75O8J97P8n22O9J19N65L2m41k47rN82
$$ -57 -165 198 137 -44 -459 -78 40 18 -83 -87 130 -145 -77 120 198 -324 -255 -136 429 461 20 -227 -236 346
631C46j42k80J22j55j20O3M25n68L53o2m7O0J58n4l51M47j92J64n6J75k42L73
$$ 346 204 -76 46 -109 -229 -166 259 -309 44 -18 -65 -5 153 99 -252 195 3 167 111 286 44 417
653D17m41q2L5PK3j65j7K45j39J02P9j21p2K81l76L18p4m0k94L66M8q0n3K42k82
$$ 417 -24 -106 -71 -64 -41 -206 -223 22 -117 -15 64 -57 -129 152 -224 94 20 -20 -314 52 100 20 -33 209 -73
678g3J11Kl42K79r9M4O7j38K22p5m29L38L64J6j79m21L66l93M67n0k24K27j7k83
$$ -73 38 40 -302 -23 -122 -78 -11 -149 73 -2 -431 -93 271 287 108 -313 53 -340 127 77 -147 80 63 -220
702b20R7J53k65M53l0n2q3l44J23L41M9q6l16K54p2N7j37L75n8m20L43j47J05
$$ -220 -123 30 -235 218 188 136 53 -291 -168 173 222 136 -180 74 2 59 -78 297 239 -181 162 15 120
725A20j77R7K4j91Ll44O00n27L67O1J01P1k46J63l96L9K58o6J5K66Ll33J5j12
$$ 120 -57 40 64 -127 -124 -468 132 -395 -28 33 134 205 -41 122 -274 -235 23 -43 -28 238 241 -92 -77 -189
749a89q7L59k35J69J91k81j65L22k01K65j10M5J26j83j65J2K02m2N0k71Q4J24
$$ -189 -276 83 -152 17 208 -73 -238 84 -117 148 38 83 209 26 -139 -127 75 33 83 -188 -104 20
771B0p3j49J94Q0m6o9N0j25J91r7j26K21O6K1l02L73l28j56K23J45j36K17j71
$$ 20 -53 -202 -8 72 26 -43 7 -118 73 -24 -150 71 137 158 -144 229 -99 -255 -32 113 -23 194 23
794B3q9j81L39K42k31k87K31n2j56L5J24OP5k50P2J16m2k9J27o4L71m48J49m2
$$ 23 -66 -247 92 334 103 -184 47 -5 -161 -126 -2 4 79 -171 -99 17 -25 -54 73 9 380 -68 81 39
818C9k10J60J35P8j79J30l24K44j64M1O9p1LK08l11O3J96N0k76l8J51k23K30n2
$$ 39 -171 -11 124 202 23 153 -171 73 -91 -50 19 -52 -49 159 -152 -89 107 157 -119 -157 -6 -229 1 -51
842e1J56l19L93r3j7j16R9n1M16k73k27m5J7J31j47m4j44K02n1J59J40o2j28L95
$$ -51 105 -214 179 86 69 -47 52 1 417 144 -83 -128 -111 20 -127 -171 -315 -113 -164 -5 135 73 -55 340
866C40m77Q8K47m8l24P4J06J06o1k19J35M6j39L37j26Q4j62k0Q4m2K10Om25J46
$$ 340 -137 -49 198 150 -174 -100 6 112 51 -168 -33 13 -126 211 85 169 7 -13 71 29 239 245 -180 -34
890c4J65j57J61J08r0l7J05O6n25L89k08O0l8j00K9j25J42K46j23n8Mo3K22O0
$$ -34 131 -26 135 243 153 116 221 287 -238 151 -57 3 -35 -135 -106 -231 -89 157 34 -24 -20 -83 139 199
914A99J07m69J29K68Jk58M42m10P4l75K82o8l6L5J07L06k18l12K08J27j59K89
$$ 199 306 -163 -34 234 235 -23 419 9 83 -292 -10 -78 -114 -79 28 334 116 -196 12 139 -20 269
936B69j09K76l96K24k39m8R8K06j63j45J5j45j37M55k62M7J50K0K35n33M26l99
$$ 269 160 436 40 264 25 -23 75 281 118 -27 -12 -157 -294 161 -101 -54 96 116 351 -182 244 -155
958a55K51j5j41K22k40L29n62M79l5P9j73j28K34j58j06L24r1j02J70k53j3l3
$$ -155 96 81 -60 162 -78 251 -311 168 133 212 39 -89 145 -13 -119 205 114 12 182 -71 -84 -117
980a17p6L56J85j71m50M64O1j55l7M0K8k67K27P0j18j62K14nr1m0J27K86n15K17
$$ -117 -193 163 348 177 -273 191 252 97 60 100 128 -139 88 158 40 -122 92 87 -4 -44 83 369 -146 71
1004G1O5j79K1J81j56J9k76K01N61n37JQ3j86J50k02J47J36m5j31J07Q2l01K71
$$ 71 136 -43 -22 159 3 22 -254 -53 508 -29 -28 55 -131 19 -183 -36 100 55 -76 31 113 -188 83
1027H3O8jkp5k51K34J69k91J1K26j88J1k56P7Q9L34l63J06n5L5J98j51m2J80n
$$ 83 151 150 148 73 -178 56 225 -66 -55 171 -17 -6 -262 -185 -96 238 -125 -19 -74 -39 159 8 -34 146 141
1052A41k81O5J34K8r2N8L8j25j47L41k29R6j72L40k82rP2k35J67K43l93J93P7
$$ 141 -140 -75 59 87 -5 53 91 -34 -181 160 -69 27 -145 195 -87 -96 -24 -259 -92 151 -242 -49 28
1075B8K18p3q8j30J20J64j98k9lj09J46k62K62k6r8J41j50J77J6K31m22L3m8J9
$$ 28 246 173 85 -45 75 239 41 12 9 -100 46 -216 46 20 -78 63 -87 90 106 337 -85 -52 -100 -81
1099h1N3m18L58J50k22K99r9j21K05J6J3m2j20J64j27J01p5j17J62K29j14k87
$$ -81 -28 -446 -88 62 -160 139 40 -81 124 140 153 111 -9 155 28 129 54 -63 99 328 214 -73
1121g3k40K13P9r4Q4N5O5j25K7J52r5k87J41L4Q0R1k68k9J64n0J45p3J89j5j96
$$ -73 -313 -100 -21 -115 -31 24 89 -36 -9 143 48 -239 -98 -64 16 107 -161 -190 -26 -76 69 -4 185 170 -26
1146b6j8j48J07K90j41P3o1J71k36q4K50m0l13K21K6M6k4J2j58k0O2l8o9j24J93
$$ -26 -44 -192 -85 205 64 137 76 247 11 -73 177 137 -176 45 71 117 93 105 -53 -73 -11 -49 -118 -242 -49
1171d9J64j86J20j51j7J91o6q4J0M8j47K6L2J37P3J68k00j57K6j41K89o6k72L74
$$ -49 115 -71 49 -102 -119 72 6 -78 -68 -20 -167 -141 -109 28 101 269 69 -88 -62 -203 86 20 -252 122
1195A22q7L1K2j69K74j77j71P9O5K20j67p1K4L9m4k1K45j16n3k8R2L6k10O8r8
$$ 122 35 66 88 -81 193 16 -155 -76 -11 209 42 -29 -5 34 -10 -31 214 98 45 17 109 145 -65 3 -95
1220i5K6J50j12N4R9K62l00K07q2r2m7JK4k23J16r9p1JK94P0l98M99l08M16m66
$$ -95 -69 81 -31 23 122 384 84 291 209 117 70 71 95 -128 -12 -111 -182 -181 113 183 -215 284 -24 392 -74
1245g4r2J23M2M48n27k45N69j68k94K10L1j50j36K48m2Rj93R3J08M39m8j26j35
$$ -74 -166 -43 -1 447 -80 -325 244 76 -218 -8 23 -127 -263 -15 -57 -48 -241 -148 -40 399 351 225 90
1268I0J5k81K93l49K40m8K49l41J21J91j45J10l42K60J51l34J65l53K97l54K66
$$ 90 105 -176 117 -232 8 -40 209 -132 -11 180 35 145 -197 63 214 -120 45 -308 -11 -365 -99
1289i9J66n8J86l00J93j08M9n6l7L6Q2%k28K42L55m05P5K81k77P5k24m4L22l17
$$ -99 67 9 195 -105 88 -20 29 -27 -64 -28 54 54 -174 68 423 18 93 374 97 172 -52 -96 226 -91
1313i1m7o5J80K25k60j92L3K47o5J23k21N1O8K22j27k09K16J87p5m44L66j96O4
$$ -91 -138 -203 -23 202 -58 -250 -217 30 -35 88 -133 -82 -14 208 81 -128 88 275 200 -244 122 -74 -10
1336a0oO7Q6n9K7K32l38j07p4K52j51J21k83L11j27J71J05k5m43L29K1j15J84
$$ -10 -16 51 137 78 105 337 -1 -108 -182 70 -81 40 -243 68 -59 112 217 192 -251 78 99 -16 168
1359A68m8K15k89k32k9J88J80j08j81l8M6L54l68K24JQ9k21N0j47K32O5m95L94
$$ 168 120 335 46 -186 -215 -27 153 45 -136 -174 -128 226 -142 82 83 172 -49 1 -146 86 151 -344 50
1382E0j13J0j9K30l19M7M15l19p4K59J1k07j5M7j5N2Q0j17J71M7l07P9r1O5Q7
$$ 50 -63 -53 -72 158 -161 -114 301 -18 -92 167 178 -29 -44 3 -12 40 120 3 174 221 -86 -7 -98 -33 54
1407E4Q1q7n9k33O2K38j05J26m8n8J97k70j9J81o0Q3q7R6J00k06M0k34L69k59
$$ 54 135 48 -11 -244 -182 56 -49 77 29 -29 168 -102 -121 60 0 83 -4 92 192 -14 26 -208 161 -98
1431i8M71o64K2M78j90J22O6j82j23K06k14j42J70k06J99m2J73J27n2k40%L20
$$ -98 373 -291 -269 209 19 141 207 25 -98 108 -106 -248 -78 -284 -85 -127 46 173 121 -119 -119 201
1453B01k43mJ67k32j02L58r4j69J89L9j32M03k92j37j0n6K08j19J55N0o4l36M12
$$ 201 -42 -46 121 -111 -213 145 51 -118 71 110 -22 381 89 -48 -58 -114 94 -25 130 180 116 -220 192
1476A92mr7l29L16l00L80j22j82L85l03L58j95k99K50J16j44L9p6j05M3J77p4
$$ 192 188 91 -238 78 -222 158 36 -146 239 -64 294 99 -200 50 166 22 61 -15 -120 -77 100 26
1498B6p8J13p0R5K65m10R4r6k4J37m0q3N8ln7l5M67m09J29nJ1n7L1J08k10m8P7
$$ 26 -52 61 -9 86 351 -59 35 -61 -85 52 12 -71 -13 -16 -73 -108 359 -50 79 74 85 28 59 167 -43 -91 -14
1525a4J63j58L03l23j81L28j62o2L32j35r4L0J26l41oL16M1m89K01K38J9j10j0
$$ -14 149 -9 294 -29 -210 118 -44 -106 226 91 -3 27 153 -188 -194 122 163 -326 -125 113 132 22 12
1548A2j21J00k01J33p5M99l13k65K93J2q7Q7j14j63J36J62O2j03j85L26m23L68
$$ 12 -109 -9 -210 -77 -152 347 34 -231 62 74 -13 74 -40 -203 -67 95 157 54 -131 195 -228 140
1570A40k27J04K51l27J3L9J88j27J97k61q8j28M46l15L5j30R4J08Q4j27K22m00
$$ 140 -87 17 268 -59 -46 -7 181 54 251 -10 -98 -226 220 -95 -60 -190 -96 12 96 -31 191 -209
1592b09N4N3l7K22k7j57K08n2Q5k2Jj4k1j01L9M3J50j66l0k8Kj21L06k64J8m2
$$ -209 -155 -102 -139 83 56 -101 107 55 140 118 119 105 84 -17 22 65 215 49 19 -9 -7 -128 178 -86 -68 -110
1618a10n8L66l79K15k96L97k97L72k39j96L49j72J13k10Q7j93K99O1M4j60L61
$$ -110 -168 198 -181 34 -262 135 -162 210 -29 -225 124 -48 65 -145 -58 -251 48 109 153 -7 354
1639C54k49j77R8j0j01L5K38n3l44M92r4j00m4n9lLl4oJ69K0j65m1K10m45M36
$$ 354 105 -72 26 16 -85 -50 188 135 -209 283 189 89 45 -14 -17 -14 -48 -54 115 135 -30 -71 139 -306 130
1664A30l04m5j41L16qQ9o0R4l10M4J73K39N9l14j0J55j22N5k68K08L7j15n9J93
$$ 130 -174 -219 -360 -44 -52 37 -23 71 -239 -195 -22 217 276 -38 -48 107 -15 40 -228 -20 17 -98 -157 36
1688C6J99l69K68k27K34k08N0P3j00P0j01N9j01K94mj6j03m1K50j18N2k46j4J03
$$ 36 235 -134 134 -93 141 -67 -17 56 -44 26 -75 -16 -117 177 173 157 54 13 263 145 197 -49 -63 40
1712D0K7J32k57k1K21m9L1k73r0M00l07J44k49J54R2k33J28M7j26J75K08p9j88
$$ 40 67 199 -58 -79 142 93 124 -149 -239 161 -146 -2 -251 -97 -5 -238 -110 -63 -189 -14 194 115 -73
1735g3r9J61L1kj18o6P2j02M31m82M05l56M98l97l2J46K6n1K5O1k23L19k31P1
$$ -73 -172 -11 20 18 -100 -166 -94 -196 235 -247 158 -198 300 -97 -129 17 43 -8 17 78 -145 174 -57 14
1759A4J09j74J48R5m01J50J92K16l57K05j48kn4j89K65n5l15L96m95L57J52j81
$$ 14 123 -51 97 192 -209 -59 133 349 -8 197 49 47 -7 -196 69 14 -301 95 -400 -43 109 -72
1781g2M9L0J13j06M3J33j52l2p6J02K23j63l7l9M9k26K30O9k26J65l5k18J21R0
$$ -72 -23 7 120 14 57 190 38 6 -70 32 255 92 55 16 65 -161 69 138 -88 77 42 -176 -55 35
1805C5j37J33j2r4J00K02l65L44j09O3J58l63K09j18j5J31q5j31N1nJ39j57o0
$$ 35 -102 31 19 -75 25 227 -138 206 97 160 318 -45 164 46 31 162 77 -54 -3 -8 131 -26 -86
1828h6P3Jm1Q1J69k73k3K58k28M5K02k01j09M09l81L02j19J35m19K95Jk5j65J80
$$ -86 -13 -12 -53 28 197 -76 -99 159 -69 -24 178 -23 -132 277 -104 198 79 214 -205 90 91 66 -99 81
1852H1j33o7O8k27K76j62K27j60R1r2J45nj94J64q0p5K4R%L16m94L34P8Nn6j75
$$ 81 -52 -119 -51 -278 -2 -164 63 -97 -6 -98 47 42 -152 12 -68 -143 -119 -110 -110 206 -288 46 124 129 73 -102
1878a02J67k68j39N08k92j3K43j33J38l7K8q0J23j75M9k78K5M4J87L9R8k57NQ7
$$ -102 65 -203 -342 166 -126 -139 104 -29 109 72 100 20 143 -32 17 -261 -236 -192 -5 34 132 -125 -120 -33
1902c3L6j74j0J27nj02L04N3j29l0o1q7J96m1%K5j23J38j33K0N9j34M2J4J5P0
$$ -33 3 -171 -181 -54 -59 -161 143 196 67 37 -24 -111 85 44 44 69 -54 84 -49 -29 30 -104 -62 -48 -33 37
1928C7J92m15Q3%k5L35j19l91N80j84k03L6j0M3J78k64K81r7N8l49J59L5K36k17
$$ 37 229 -186 -103 -103 -128 207 88 -303 277 93 -110 -74 -84 -41 137 -127 154 57 115 -234 -75 -40 196 -21
1952b1j46K9K47k28J96L3M5l61J58m9J04J92l44K23j85pK89k08L22m28k2P5r7
$$ -21 -167 -138 109 -119 77 110 155 -206 -48 -97 7 199 -145 78 -107 -114 175 -33 289 -139 -161 -86 -183
1975a83M4L7j41L96l12Q2M6m7J96m2j91J41j83J6L60j95M7k08M4J06L6R6m50M25
$$ -183 -139 -102 -243 153 -159 -77 -31 -78 118 76 -115 26 -157 -141 219 24 71 -137 -93 13 49 145 -305 120
1999A20k26J52j61K38j44J61j95J69j32O5j55J73j39K22K0j87J99k43r1K72l2
$$ 120 -106 46 -115 123 -21 140 -55 114 -18 47 -108 65 -74 148 168 -19 180 -63 -154 118 86
2020H6k63J90j29M6N4k30K40K48m75L33j20R3k24J20j57l7K25Q8j99n1K47m39
$$ 86 -177 13 -116 -70 -16 -246 -6 242 -233 100 -20 73 -151 -31 -188 -225 0 88 -111 -162 85 -354
2042c54L39j56R6L63j35k87M13j70j80K84j12j00j56K02O8j20k46L05n5N4p1J51
$$ -354 -15 -171 -75 288 153 -134 279 109 -71 213 101 1 -155 47 115 -5 -251 54 -1 53 -18 133
2064A33o6j31K2J30j05M95n93j13K00j56L44j70J4j45R0J67K31l71k40L54r8J37
$$ 133 67 -64 -42 88 -17 478 -115 -228 -28 -184 160 -10 4 -141 -51 116 347 -24 -264 90 -8 129
2086A29j04m8R8l33L80L5J47j05l7j51J54k86J06k34J27Q3R3K09l06Kj94M34k04
$$ 129 25 -23 75 -258 122 157 304 199 162 11 165 -121 -15 -249 -122 -39 54 263 -43 -41 -235 199 -5
2109eJ78k38j37J06R1J35q5m2K48N7l35J36j17J2Q9j01j65R6L6K2N2j70K50k49
$$ -5 173 -65 -202 -96 -5 130 45 3 251 308 -27 109 -8 4 93 -8 -173 -77 -41 -19 33 -137 113 -136
2133a36P2j20K99J11o4j13J73k68j01L15L3l73L80j34k66K68p2M1q2P6lo7J05
$$ -136 -64 -184 115 226 162 49 222 -46 -147 168 201 -172 208 74 -192 76 4 45 -37 39 36 -31 74
2156G4k6J88j68Mj91P9J24k49J6J39J90Q8l20j92L62O2k38j05L21k79O7k57N44
$$ 74 48 236 68 72 -119 -40 84 -165 -149 -10 180 268 -52 -244 118 180 -58 -163 158 -121 -54 -311 233
2179B33k82J97k6m72M64j79R4J64j88m3j08J72J02k05q8K68j7Lj87j38L04n0J16
$$ 233 -49 148 122 -350 114 -65 29 193 5 -38 -146 26 128 -77 -165 103 86 89 -98 -236 68 18 134
2202A34k22L6O0M04j90j6k09M4Qj02N5J16l6n7q1J60J13j50j83J30M2j84J03k85
$$ 134 -88 -52 8 412 222 206 -3 41 49 -53 2 118 82 25 -56 104 217 67 -116 14 56 -128 -25 -310
2226c10L75O7j03j57k46K65K35rj19J45l47R7J83n8m3J53q6R0P3j99R5J10k78
$$ -310 65 132 29 -128 -374 -109 126 117 -2 143 -204 -107 76 18 -25 128 42 132 205 6 101 211 -67
2249f7L03k70oM2P0l41M61j51m68M37j82K05N7J49l35j15j2j27M03m2m1j41N7
$$ -67 236 -34 -40 2 72 -269 192 41 -427 10 -172 33 90 239 -96 -211 -223 -350 53 11 -30 -171 -114
2272a14K99l38n3L52k77p7L52m24L45j54L93k22M0j61j37K55j03M9M1J61k23M6
$$ -114 185 -153 -206 146 -131 -208 144 -280 65 -89 304 82 122 -39 -176 79 -24 25 66 227 4 50
2294E0Qo3m2q4P3K5K5j59J19P9K1j09j10J78M3j38J29ro7J94q4j51J66j1l5M0
$$ 50 58 -5 -47 -131 -58 -33 -8 -167 -48 31 52 -57 -167 11 54 -84 45 36 -31 163 79 -72 94 83 48 88
2320H8j48P6p5n8k6O0J5l0p0J66P1m21N73j13l0j3m84M21mj21J86r6m3K65l43
$$ 88 -60 16 -59 -117 -143 -83 -68 -98 -168 -2 69 -352 221 108 78 65 -419 2 -2 -123 63 -33 -76 189 -154
2345a54K22N1j53J70j11l0Nj57J94J32j99J09j26K69j52j6j04QK31j89q6k18K58
$$ -154 68 119 -34 136 25 -5 0 -157 37 169 -30 79 -47 222 70 54 -50 -42 189 0 -86 -304 -46
2368d6Q6j26j38K20j33L02k84Q7R7J47j87L8j19K30j16l95M47r8J25j00j50K21
$$ -46 40 -86 -224 -4 -137 165 -119 -32 65 212 25 63 -56 174 58 -337 110 12 137 37 -113 108
2390A08l14L12q9J34k21j1K3J8J83R1j36j29L46j88k13k58M88k65J57o4j23J04
$$ 108 -206 106 17 151 -70 -81 -58 -40 143 234 98 -31 315 127 -86 -344 144 -121 36 -28 -151 -47
2412d7J52k44K27k94K54o8J36M1L4k28J87p6j28L1j18KK07R6j8j58J00k9K35k69
$$ -47 105 -139 88 -206 48 -20 116 157 191 -37 150 74 -54 -23 -141 -139 68 164 146 -12 88 59 294 25
2436B5o2Q6n2j26J69J7j86K82k31R4m4J75l68M44p9k86K45j13K68l45Q9J1j8r8
$$ 25 -37 49 -3 -129 40 57 -129 153 -78 16 -28 147 -221 223 144 -142 103 -10 258 -87 2 13 -5 -103
2460a03q8J33j71K14j44L55k09L03l10j8R4k54J27J99l3j4j19J83k41R8oP1P2
$$ -103 -191 -58 -229 -15 -159 196 -13 290 -20 -38 56 -198 -71 128 95 81 -38 145 -96 2 -4 67 139
2483A39j13p9M3k14L55o2k93PP0M5j39O6J63J00K3k5k50L70j94rJ3j16MJ69p1
$$ 139 26 -53 -10 -224 131 69 -224 -217 -147 -102 -241 -175 -12 88 111 86 -164 206 12 3 16 -100 -96 73 2
2508BP9j52J61m8o6r1J98L0L1j19p2L15m19J13N7J87k08Mk43L04J22k05k32K25
$$ 2 81 -71 90 42 -24 -115 83 113 144 25 -47 268 -151 -38 19 206 -2 2 -241 63 185 -20 -252 -27
2532b7k13L63l51K97j30N5q8K68j20j85K76j44j46N4j31K21j81J46j77L26o7l06
$$ -27 -240 123 -228 69 -61 -6 -94 174 54 -131 145 1 -145 -91 -222 -1 -182 -36 -213 113 46 -260
2554b60M31j12j66J86J7o5K30n40L49o2K87j20k61k33J89mO2J72l11M16j63j67
$$ -260 171 59 -107 79 96 31 261 -279 70 8 295 175 -86 -319 -130 -134 -72 100 -211 205 42 -125
2576a25K20j04M5q9N3J65l7k49J11j62Q8rJ74l25K24j93pK97M6J78K6M0m77L71
$$ -125 95 -9 36 -53 0 165 128 -121 -10 -172 -84 -93 81 -244 -20 -213 -220 77 123 301 327 367 -110 261
2600B61p6j09j84J16j23jJ89o3L5q5l0O1K04k51J79j35Ll5J35l99M37m7j98O0
$$ 261 185 76 -108 8 -115 -116 73 10 45 -40 -70 -9 195 -56 123 -12 -9 -44 91 -308 129 82 -116 -56
2624e6K27k45J03LJ0Nj08J74J9mm47L30j53O0j25M31m08K03N1J73j60l7j78K21
$$ -56 171 -74 29 32 42 47 -61 113 132 128 -319 11 -142 -82 -207 224 -184 19 70 243 83 46 -132 89
2648H9j45J43j85j04K79j14P6M4j66J36J56m09K11P2n4m4l7K13j28jk21K07P7
$$ 89 -56 87 -98 -202 77 -37 39 83 -83 53 209 -200 11 83 29 -15 -52 161 33 32 -189 18 95
2671I5jj19K4n6J28L6l48K15k17M28l44Q8L1R1l39K94J36j3k69O1J70k07N0J36
$$ 95 94 -25 -1 -57 71 107 -241 -26 -243 185 -159 -71 -40 51 -288 6 142 129 -140 -79 91 -116 -66 70
2695G0j44k44K32M8N1l8K32m31K26l0J34j21q0K59k27L5P9rJ01j45r4r1K17J51
$$ 70 -74 -318 -86 -38 13 -25 207 -224 2 -28 106 -15 -95 164 -63 -28 51 42 143 -2 -96 -187 30 181
2719A81j36j53K67k2jJ46k32k21M2J03j00K24j51n2P7j89J23J29N3Q8j48J24k64
$$ 181 45 -108 159 137 136 282 50 -171 -129 -26 -126 98 -53 -105 -28 -217 -94 35 88 176 28 152 -112
2742a12R9k3M1k16J57KJ33Q2n0j97KJ77j62j22J59q3P3R2j12J48j52J54j69j40
$$ -112 -13 -36 5 -211 -54 -52 81 163 113 -84 -82 95 -67 -189 -30 -113 -40 52 -60 88 -64 90 -79 -219
2766b19L32r8k54J36L62k86j4j35K41k41L11p9l9N3Q2l9j7o2m7m5P8Pj98K39j1
$$ -219 113 15 -239 -103 259 -27 -41 -176 65 -176 135 56 17 70 152 113 96 34 -13 -58 20 27 -171 68 57
2791E7j57J75j48K71k85J0Q5M1J16j66l54M31j43l0j70K20J45N2J08j89Rl33J81
$$ 57 -100 75 -73 198 -87 -77 8 49 165 -1 -355 76 -67 -97 -267 -47 98 150 258 69 78 -255 -74
2814g4K77j47p2l1K33l25P6k9J68j6J75k19q8J77p7K52o1j99o0K5L12k87J87j36
$$ -74 203 56 -16 -47 186 -139 -63 -92 76 60 235 16 -72 105 28 280 219 20 -40 -15 297 10 197 61
2838F1R4k26o8M52j36k20J59m6j3k28K62r8l2o2L55m33K59J12m74K27M1k56J61
$$ 61 155 -71 -139 313 177 -43 116 70 57 -171 91 -7 -39 -101 254 -179 80 192 -282 -55 -14 -270 -109
2861a09J81n5m1k59J89J51P0o4o4j12J10Q1L5j29J06O0j78j39n4L14L3k37K79
$$ -109 72 17 -24 -283 -94 57 127 63 -1 -113 -3 78 113 -16 90 150 -28 -167 -221 93 126 -111 168
2884A68r6j5k00J67j56J00K47k78K7p7J17kJ53P3j88J27k69K1K15q4j7r0L02l04
$$ 168 72 57 -143 24 -132 -32 215 -63 -36 -113 4 2 155 228 40 167 -102 -81 134 50 33 -57 245 -59
2908e9L0q8K1N5J31j61j2J76k2q9K00L3k47P3J2q3p1J50N7r4j14j8O7j83K57J77
$$ -59 -29 -117 -96 -41 90 -71 -83 93 71 -18 182 215 -32 41 53 -30 -101 49 106 12 -102 -120 -53 -236 21 198
2934A98k16M0k45K23l96N67k49K7K03m74K98R0o7k67J82J57k08M43k80j31L2R0
$$ 198 -18 22 -223 0 -396 171 -78 -51 152 -322 -24 66 -1 -268 -86 71 -137 306 26 -105 -73 17
2956A7m9J57J47l54j41K71J94l22k7N42m43l7p5J41r7k06K16j7J7J14q0J79m94
$$ 17 -32 125 272 -82 -223 48 242 -80 -107 435 -8 -45 -120 21 -76 -282 -66 -83 -66 48 -32 147 -347
2979c47J61L31m68L98n5j1J83l67J24m4p5M9k7K44k09K34L8k37J25J89l65L29
$$ -347 -186 145 -323 75 20 9 192 -175 -51 -95 -170 -121 -148 96 -113 121 159 -78 47 236 -129 200
3001B00j04j70j7K98n0o7n7l17P1K63j06MJ95l15o2L05K3k34K24j5k59M19r0j94
$$ 200 96 -74 -91 207 157 90 33 -284 -213 50 -56 -52 143 -172 -234 71 94 -140 84 69 -190 229 139 -55
3025e5M1l34K70J86L8J15l89J90k45J3K61q0j25J23j0K24l37R0j77K13J62r7k43
$$ -55 -14 -348 -78 108 146 261 -128 62 -183 -170 91 11 -114 9 -1 223 -114 -24 -201 12 174 77 -166
3048a66J63N3j69K89j29l8j68K86J4j61J00l76L07J38M7k45LP3j17N8J63M9k52
$$ -166 -3 50 -119 170 41 3 -165 121 135 -26 74 -302 5 143 190 -55 -52 21 -96 -38 125 174 -78
3071g8j44L53j67k4K36l19J07J12j54R9o7k52J83K19k6j46l7J39j92K71k01J99
$$ -78 -222 131 -36 -60 176 -143 -36 76 -78 21 -46 -298 -115 104 78 -68 -105 34 -158 113 -88 111
3093A11J34j42p1J28m15K22r7J46k89P5K16M10l74k32J62K3M0m12M32K12k49J04
$$ 111 245 103 32 160 -255 -33 -130 16 -273 -198 18 428 54 -178 -16 7 47 -365 67 279 30 134
3115A34P9l78L28m8j57K47j36Q7r0k28J87K7R1m10J83L10l45J25K57k05l38K89
$$ 134 213 -165 163 115 -42 205 69 156 66 -162 25 52 143 -267 -84 226 -119 6 263 58 -280 9
3137Ij17q6L69k37J02m8K3O4k38J36L6q4K94k57P2J5j1k38p8K98o9j12K82P4m40
$$ 9 -108 -194 175 -62 40 -8 15 79 -159 -23 13 -71 223 -34 38 53 42 -196 -274 24 -45 -157 125 199 -241
3162b41K47l1L76m29n5K06n1Or7j38R7J13j41K34r1m4J15m24K06m3J59n2p1L93
$$ -241 6 -25 351 -78 -133 73 22 28 -69 -207 -110 3 -138 96 5 -39 76 -348 -142 -185 -26 -78 -149 244
3186B44l10J87j60j36R2LK07j40J77J9m84M07O8k07K73n27J71J12q0M00j68l8
$$ 244 -66 121 -39 -175 -83 -80 127 -13 164 183 -301 106 174 -33 240 -287 -116 -4 -84 316 148 110
3208A10j63q3J29L4K7j21m9O1O9j55K52l69J59J03J50n9M4j20J5K56j21j72Q1
$$ 110 -53 -136 -7 27 54 -67 -116 -55 14 -141 111 -258 -99 4 154 95 139 19 34 290 169 -3 78
3231G8j0M0j67J7k43M4R4J31J24j05J2j11J53K3j07NK1j70j1K71m5j37J58j97
$$ 78 68 108 -59 -42 -285 -241 -147 -16 108 3 15 -96 57 80 -27 -22 -1 -171 -182 89 44 -93 65 -132
3255a32J58k45K31K12j61k84J74k49K15J1l3J42j60L14j03n78N05P3po0pk88J81
$$ -132 26 -219 12 224 63 -221 -47 -296 -81 -70 -103 39 -121 193 90 -488 17 90 83 23 16 -272 -91
3278i1J55j74K12j73K36R3j8l23j18J56n1J45k17K12j4l30L35q4o0K96k93n2K64
$$ -91 64 -110 102 -71 165 258 240 -83 -201 -45 -96 49 -168 44 30 -300 35 -49 -109 187 -106 -158 106
3301A06l21QL63j86Q6r7m3J12k42L38J4k83K65p8j87J61n0p4J53j05j54K07m0
$$ 106 -215 -207 156 -30 56 -41 -84 28 -214 124 138 -145 120 42 -145 16 -34 -108 45 -60 -214 -7 -47
3324d7K6j16L17j81r7L74k98J29j54rq5L21l65J18k84j18O60k25L46l41N5j22
$$ -47 -21 -137 180 -1 -98 276 -22 107 -47 -56 -141 180 -185 -67 -351 -469 191 -34 312 -29 26 -96
3346i6J06J40l21L85j64k18R2P4J34k51n2L61m73K61M3j26K35j66l1J3k31L26
$$ -96 10 150 -171 214 50 -168 -76 -2 132 -119 -171 190 -283 -22 21 -105 130 -36 -67 -54 -285 41
3368D1J15P4k44J87k17j50K7J75q1K35m8j69Q5k9R3k50M5M4L5j61K25M8r6J31
$$ 41 156 230 -14 173 -44 -194 -167 8 -73 162 114 -55 30 1 94 -156 -111 -67 -32 -193 32 80 -16 115
3392A15p4lL4m3j22j34k0L93q4j62L2NO7P3J02p4l25J15N45m07l80M47j25M8J05
$$ 115 41 38 72 29 -93 -227 -247 146 62 -100 -68 -63 4 77 179 105 -220 -105 440 33 -347 100 -25 23 128
3417A28lj70J6j63L95pK4k49N2J61j82j68L02n5j53j34J78J68p9R9k68K71k40
$$ 128 125 -45 -29 -192 203 196 220 -29 23 184 2 -166 136 81 -72 -206 -28 140 61 160 -108 163 -77
3440g7j00J30n3Q7Q9J05j07k55L7P1J88j32%j24qJ27K13j54K56o09K39K15l37
$$ -77 -177 -47 -100 -13 76 181 74 -181 -144 -73 115 -17 -17 -141 -149 -22 191 37 293 -316 -77 138 -199
3463a99J72Q9j59l2R6J79o6k56J86q7J32j54J99KJ18k55k96QJ11K53o9q8Qp4K16
$$ -199 -27 62 -97 -129 -33 146 80 -176 10 -77 55 -99 100 102 220 -35 -331 -323 -212 41 -28 -116 -108 -182 34
3488C4n8m0M6q7j0Q2n4J33k3J52O8k93K03N8j77M3m9k3K1L7k52Q8K29j78J15r3
$$ 34 -24 -64 -18 -105 -115 -33 -87 46 23 175 243 -50 153 211 34 77 28 5 26 63 -189 -101 128 -50 65 -28
3514b8n8pK81J07m39K50J13k26J17j79RJ72k89K68j81k2j29K94j74J68p3K0r9
$$ -28 -86 -93 188 295 -144 106 219 -7 110 -69 -60 112 -177 91 -90 -112 -241 53 -121 47 -26 -6 -105
3537a05J25m7K6j6m4L7K02j67n4j7J04Or1J06j80q5K67j06R4r9m4J77n6m8j42
$$ -105 20 -27 -1 -17 -61 -24 178 11 -43 -60 44 50 -41 65 -115 -200 67 -39 55 -44 -88 89 33 -15 -157
3562a57J90j60J17J45j16l3n8R9K14l76K2J92l62K84K49m71J24R5K9jl27M13J11
$$ -157 33 -127 -10 135 19 -14 -72 27 241 -135 -113 79 -283 1 250 -221 -97 -2 27 26 -301 112 223
3585B23k54Q2m7J66j44J43k93L07m10J74R1mL0J5J35k39k5J18M4K14m14K96j14
$$ 223 -31 51 4 170 26 169 -124 183 -227 -53 38 34 64 79 214 -25 -50 68 112 326 -88 208 94
3608I4J36j5m20M08m11o9J01L28j10J90m79K73K72l99j78K34l1M7j3k30J64lK25
$$ 94 230 215 -205 203 -208 -277 -176 152 42 232 -247 26 298 -101 -279 -45 -76 -29 -42 -272 -108 -111 114
3631A14l02J98J99r2R3j44K3j6j91K77nL4k73K71k62M6J04j56J02m0p4K34O6k92
$$ 114 -188 10 209 117 210 66 89 73 -118 159 154 188 -85 186 -76 -30 74 -82 20 -20 -94 140 206 -86
3655h6P7r7L09j53j59K25j67k8K11j78L65m65L19l06K70j01Pj27R4N1l65J72O7
$$ -86 -9 -106 203 50 -109 116 -51 -79 132 -46 319 -146 173 -133 137 36 43 -84 10 61 -304 -132 -65
3678f5N9j4R7j62j87K94j36L26m17J39Q5L0j03P9j05j41K93o16J87L72K54L4l03
$$ -65 -6 -20 77 -85 -272 22 -114 212 -205 -66 19 49 -54 25 -80 -221 72 -544 -357 15 269 303 0
3701@l9j69J67L99n13K33j65K80m33L09k0J57k55K84j67L8k24p7K78r1J49j60
$$ 0 -39 -208 -41 358 -155 78 -87 193 -240 69 49 206 -49 235 68 106 -118 -195 83 -8 141 -19
3723a9J75J13k24k38J61J65P9r3j33m4K28Mj55n09K44J53J97l11K3J9J12J15j25
$$ -19 156 269 45 -193 -32 133 212 119 -14 -58 170 174 19 -490 -246 -93 104 -207 -184 -165 -53 62 -63
3746f3K24q0j56N9J81r8j46j72L31j38R5J18l12K35l32N57k11M2k65K6J98j9l
$$ -63 161 81 -75 -16 165 67 -79 -251 80 -58 37 155 -157 78 -254 303 92 134 -131 -105 93 74 71
3769G1j3m72M50L9j96N7J49j45n3P5q0J97k67M67l97Q6K3K83l49J91j26K58n29
$$ 71 58 -414 36 75 -121 -64 85 -60 -113 -38 -118 79 -188 279 -118 -32 -9 274 -75 116 -10 248 -281
3792b81K40O8k97K92J17P1l80N37k12j32k32L56j14j00m0M24n39K94j72o3j22
$$ -281 -41 27 -270 22 139 210 -170 367 155 23 -209 147 33 -67 -107 317 -222 72 -100 -163 -285
3813b85N52k56J65j52j00K16RJ17k49J00m9p4K05k29K1j01J49o5K1o0J79j95K49
$$ -285 267 11 176 24 -76 140 149 266 17 117 68 -6 199 -30 -9 -110 39 -26 -5 -65 114 -81 168
3836A68l04K35k38O0L6J91j80M6j03K73j73K18K0l88J75K04r7l89J1J25K13j61
$$ 168 -136 99 -139 -79 -43 148 -32 14 -89 184 11 229 249 -139 36 240 143 -246 -235 -110 103 -58
3858e8j84L29J5p6l5qJ30r0o8oO0K9P2j11QN0J0o1P7n2J22j55j15K72p7q8n2J34
$$ -58 -242 87 102 26 -9 -17 113 23 -45 -51 9 38 110 -1 7 57 67 6 83 31 153 -2 -117 155 78 -10 -62 72
3886G2l1J70n20M40j9q5n3j34J79m1j08M1N1j2J27j56J40K9j98J37k12J43k19
$$ 72 41 211 -309 131 112 27 -26 -160 19 -22 -130 -89 -38 -50 77 -79 61 90 -108 29 -183 -40 -259
3909b59K59J83l53K80k9P5k66n2j1K22j70R6N8j15l0R2k46L43j64K07mj82j90
$$ -259 0 183 -170 110 81 156 -110 -162 -173 49 -121 -25 33 -82 -112 -20 -266 77 -87 120 116 -66 -256
3932b56J26J23J32j04k8QRO3J82j22j22n6J79n3k5N1l18K46J60j90J26k77nJ34
$$ -256 -130 -7 125 21 -7 1 10 73 255 133 11 -45 134 81 56 107 -211 35 195 5 131 -146 -151 -17
3956a7m6j19J39L9P9k47L19k00q0nnL3K51m20K77J38m04Q5K90j0r2J60j26j49
$$ -17 -63 -182 -43 -4 75 -172 147 -53 -133 -138 -143 -110 141 -279 -2 136 -268 -183 107 97 5 165 39 -110
3980a10J91j61q9J95o0j06j18L01J2L1p6j06J11O9j42j48P8O6j07J70o9J91J40
$$ -110 81 -80 -169 26 -34 -140 -258 43 55 86 10 -96 15 84 -58 -206 -128 -62 -169 1 -68 123 263
4003B63j87J04K2j95r9L3M6r7L3K59l34K21n4J37J40l18R0K9n2j50J32K05j57
$$ 263 76 180 202 7 -92 -59 -13 -110 -77 182 -152 69 15 152 292 -26 64 93 41 -109 23 228 71
4026G1o0j64L22j23K1m4l1J61l26J29k51L59P2M4n3m4Q8P0l01K7J10m0P9l65J72
$$ 71 11 -153 169 46 67 23 -8 153 -173 -44 -295 64 136 180 127 83 171 241 -60 -33 77 37 116 -249 -77
4051g7Nk15k7N31j02P5k59L20l28L6o5J84q1K7K16l12n1Q6N5N1R5m41L9J71k5
$$ -77 -72 -287 -314 217 115 190 -69 251 -77 -41 -106 78 -3 24 240 -72 -123 -37 18 69 164 -277 -238 -67 -92
4076i2O6J99l81K05p1M8j7j2K01l25J73o4q9QpK39p8j57J07Q5K05j09j88J8K62
$$ -92 -26 173 -208 -3 -74 -26 -43 -55 146 -179 -6 -70 -159 -151 -158 81 3 -154 -47 38 243 134 -54 -36 226
4101B26k86M2o2J74j83K21p6N0k89K46p1j36K00k32l9K87j63j21L95k34L8K01
$$ 226 -60 -18 -80 94 -89 132 56 106 -183 63 -8 -144 56 -176 -215 72 -91 -212 183 -51 -13 188
4123A88l24J64J05p0j00k5J36k87L04n2j54J98K1k27o1K76J5l35N21n26K37P6
$$ 188 -136 28 133 63 -37 -62 74 -213 91 39 -115 83 104 -123 -184 92 107 -228 293 -233 4 80
4145H0m6j47K22k3J8Q1j7n6rr6j73J48J49k80J54m9j9K48k73J79j77J9p1K87j15
$$ 80 34 -113 109 86 104 185 168 112 103 7 -166 -18 131 -149 5 -44 -63 185 -88 91 -86 -67 -138 149 34
4170C4L8%j46k0k11N03j89K04J59l85J65k95K04r9K20m43L54j71J60j73J47J1
$$ 34 72 72 -74 -94 -305 198 9 213 372 -13 152 -143 61 -38 182 -261 93 -78 82 -91 56 67
4192F7j43K37r6m9J4j8K33o5l28K64j41L5k00K96L0P8j16Q5k66k90K35Q4m3J5
$$ 67 -76 161 65 16 30 12 245 180 -148 116 -25 10 -190 106 136 214 98 183 -83 -373 -138 -54 -97 -82
4216h2m9L8J59qn3O9j50j12R8J45O5m3k29J94j73J50o4j0J40k77M43M2l94j02
$$ -82 -131 -93 66 58 5 74 -76 -188 -90 55 120 77 -152 42 -131 19 -45 -55 85 -192 251 293 -101 -203
4240b03J69R2R0k22Q9L5M8k55K81l00J33M0n2R7o3K48j22k49k08K73k6M8K16k10
$$ -203 -34 58 148 -74 15 50 98 -157 124 -176 -43 -3 -55 42 -21 227 105 -144 -352 -79 -105 -57 159 -51
4264e1K02j03N8k85K27j69M3L68J5n72J97j34J92k39L33M4j19K59j62j70K22j79
$$ -51 151 48 106 -179 48 -121 -78 290 305 -267 -70 -204 -12 -251 82 126 7 266 104 -66 156 -23
4286b3L5j89K40j76K20p3j63N93m82oK93j6j50j25rk01J99K10k27K26k06j24K60
$$ -23 12 -177 63 -113 107 34 -129 464 -18 -24 269 253 103 -22 -31 -232 -33 177 -50 176 -30 -154 106
4309A06m08J38Q7k7M66l02k42J60K19J36m95O0K42j71Rl33J68K36k30L07n2l40
$$ 106 -302 -164 -77 -104 362 60 -182 -22 197 333 -162 -102 140 -31 -22 -355 -187 49 -181 126 74 -266
4331b66K19j68K39J08k76K70j04j81L83l29J42Q0k90J98K46k65J26j71r9R1K16
$$ -266 -47 -215 24 132 -144 126 22 -159 224 -105 37 117 -173 25 271 6 132 -39 -138 -47 169
4352A69q4R5l17L43j19o0k06K05K27l62J19j92j76L51l2j55LJ15j02M86l30P8
$$ 169 85 180 -137 206 87 27 -179 26 253 -109 10 -182 -358 -7 -39 -194 -191 -76 -178 308 -22 56
4374E6J14J51l03K0j1k88M74k20n9J37O0j79J35k3J7q3o6J30k54M07k66L97l65
$$ 56 170 321 18 38 27 -261 213 -7 -66 71 131 -48 87 64 81 -2 -68 62 -192 215 -51 346 -19
4397a9j14Q6J46q7m6j57K39J82k24j97Q3K06j7Q8o1l0j72OJ65r5r6K93l32K47
$$ -19 -133 -47 99 12 -34 -191 48 230 6 -191 -108 98 81 169 108 78 -94 -88 77 -18 -114 179 -153 94
4421I4k36k2l6J75K1j14L7M3K29o4k35L00j6o8R4N7l07j3j17J35J96j50P7k52
$$ 94 -142 -164 -200 -25 -4 -118 -81 -38 191 127 -108 192 176 108 202 259 -48 -61 -178 -43 153 3 80 -172
4445a72K34j31K79l17J85M7j32k83L78k05J9P0n6J84Pj69M1K10r1k32K40P7k49
$$ -172 62 -69 210 -107 78 125 -7 -290 88 -117 -98 -28 -84 100 107 -62 -21 189 98 -134 106 183 -66
4468f6K35j39q2n5J33M1k9L0L8k16L06L0l02L68l47k21L33R6j63L2j12Rm9Q9j13
$$ -66 169 30 -52 -107 26 67 38 68 106 -110 196 226 -76 292 -55 -276 57 153 -10 22 -90 -81 -130 -41 -154
4493a54J13J93Qm73L96o8%L5j74J44j15q2J17J39k32m8J00R0J99l51J0K9L94j48
$$ -154 -41 152 160 -313 83 15 15 50 -124 20 -95 -177 -60 79 -153 -201 -101 -11 188 -163 -153 -124 270 122
4517A22j62J42rN4j53j50J84n9P6p6O7KJ00N5l50J74k0p9k7J30j55K14Kj45J10
$$ 122 -40 102 93 147 -6 -156 28 -31 45 -31 36 38 138 193 -157 17 -3 -82 -109 21 -134 80 82 -63 47
4542D7K07j39l11K28N8p8J88n36K11K44l48J03R5m5m6L28q9n4j2K09m50M17k24
$$ 47 254 115 -196 32 90 12 200 -336 -125 119 -229 -126 -31 -76 -122 206 117 63 51 260 -190 227 3
4565CM8j81J97l28K72O3R1p7k53L11j18j2J01K2j05j20M6K14l0ok0l01pK0N4J57
$$ 3 51 -130 67 -261 11 74 165 88 -165 146 28 16 117 139 34 -86 -40 174 144 138 118 -183 -190 -170 -116 41
4591D1K8j34n2J38J42j43K6p1L17j16j67K23Rn63M35j4j07j45l6j6K59j60J80
$$ 41 69 -65 -117 21 163 20 46 -25 292 176 9 232 241 -322 113 99 -8 -153 -189 -205 54 -106 74
4614G4M4P7l99K32k14K39N3q4J13j25oJ57L4Rj87J20o4o9P0j30J41j17k42K98
$$ 74 118 195 -204 28 -186 53 106 22 135 10 4 161 195 204 17 137 73 4 74 -56 85 -32 -274 24
4638B4j45O8K55k41J05p1J44l05K39O5p4j59L32k70L0q4pQ9k76J39K96j27N7j12
$$ 24 -121 -53 202 -39 66 -5 139 -166 73 138 64 -95 237 -33 -3 -87 -94 -5 -281 -142 154 27 84 -28
4662b8J3j7m0K01j83o7K8J50k38K09K17j59n9J15o5j18K46l47p3K54j72j80M72
$$ -28 -15 -32 -72 129 -54 -121 -93 57 -181 28 245 86 27 142 77 -41 205 -142 -215 39 -133 -313 159
4685A59j63P2J2p9O7k58N23k94J59o21M12j86L81j77r6K47l36M7M5R0M2k32J32
$$ 159 -4 68 80 1 68 -190 333 39 198 -423 -11 -197 184 7 -89 158 -178 -131 -86 4 46 -186 -54
4708e4n7J15k8j37k1J72q4J26k18P6L15R5l22J24j97N9N0K0J41n4j33J33k95j67
$$ -54 -111 4 -24 -161 -182 -10 -94 32 -186 -110 205 300 -22 102 -95 -36 14 34 175 121 -12 121 -174 -341
4732c41K84J19n2j21J89j89P4j09J4K70m74M05n3j08j35L20j45P1j03j69K14J93
$$ -341 -57 62 10 -111 78 -111 -37 -146 -132 138 -336 69 16 -92 -227 93 -52 19 -84 -253 -39 154
4754A54j49k3p1Q1j18o1K37n2J30j92J95k90j10J55J27O1l94J48K70k57O4J04
$$ 154 5 -18 -89 -8 -126 -187 50 -2 128 -64 131 -159 -269 -114 13 74 -320 -172 98 -159 -95 9
4776Ik5P3j62K31o3l96L52m4J51k19J2o5R0L04k47k10j31N01j69j2J80j78N8j16
$$ 9 -16 57 -105 126 63 -333 19 -25 126 -93 -81 -146 -56 248 1 -209 -340 161 -8 -20 160 -18 40 -76
4800g6o6K34N4Q9k32J24N8n4k11K96l13M31l71n1K47n6j0m16K42K5qJ12j6O5L13
$$ -76 -142 92 146 235 3 127 185 131 -80 216 -97 334 -37 -88 159 103 93 -323 -81 -56 -64 48 32 97 410
4825D10n05J91p3m0P8o6j46J35p3K17k33K82j75j8K72k49J3p4J83O9j98K85j92
$$ 410 -95 96 23 -17 61 -5 -151 -16 -89 128 -105 177 2 -16 256 7 20 -54 129 198 0 285 93
4848I3N7j00k07N17k93l65M16n5Jj66M11k77k46Q6j89N39k19J47O0l51j6J11k
$$ 93 150 50 -157 360 67 -298 118 63 64 -102 309 32 -214 -128 -317 222 3 150 210 -141 -157 -46 -48
4871d8K92j89k13K16k13Lj09j41N89j34j19l7J32r6Q5K21k58r7L7P3J0K6l14K92
$$ -48 244 55 -158 58 -155 -152 -261 -402 187 53 -66 -103 29 -67 18 239 -19 -116 -79 -6 4 30 -284 8
4895Hk66M14k11J4J03J17j96j80J63n0j4K58k23k29L31O7m3j67K1K17j42j43J97
$$ 8 -258 156 -55 -41 62 179 -17 -197 -34 -84 -98 160 -63 -292 39 106 63 -104 -83 134 -8 -151 46
4918D6p9K80ml70J97O3k2R7m59N48n26R8%J21j22O3j25L10j74q6J15m4J1MJ91
$$ 46 -33 247 243 -127 70 133 111 208 -251 297 -229 -131 -131 -10 -132 -69 -194 116 -58 -144 -29 -73 -62 -58 133
4943A33n0m1k27n9R1Q4R5k2L14O2k34j49o5K26l60K65j01M3j1j2n6l6L3J08m6
$$ 133 83 42 -185 -244 -153 -69 26 4 318 380 146 -3 -68 158 -202 63 -38 5 -6 -18 -74 -110 -77 31 -15
4968a5j07K87l55R1K48j52N2M0Mr8l5p8J32M8p6J87m03K48j38p9J29M3Q9m14M59
$$ -15 -122 165 -190 -99 149 -3 49 89 93 -5 -40 -118 14 62 -14 173 -230 18 -120 -199 -70 -27 62 -352 107
4993A07l56kK07O9J26J0k67N8k6L23q1K5Lm55K25J4K40m43K22l10M14k75J71L5
$$ 107 -249 -251 -44 25 151 161 -106 -48 -74 249 168 193 196 -259 -34 -20 220 -223 -1 -311 103 -172 -1 34
5017C4j05M3K8K49k61r3K5Q7o6n0J10j45J70m7q5L51k13J31m04J92R9j70R5Q5
$$ 34 -71 -28 0 249 -12 -105 -80 7 -59 -109 1 -144 26 -21 -106 245 32 163 -241 -49 50 -120 -25 60
5041F0j48K09l68K89J49k63jo8l8K72k71J48J92m22L13J41r1j66N3N2K60l66k4
$$ 60 -88 121 -247 42 191 -72 -73 -141 -179 93 -178 -30 162 -260 53 194 103 -63 -10 42 302 -64 -88
5064h8O3P5K63m84J42Jj87%n7L58J14k91R2n1L6j97K96m0k2J1k4j25k3K56kj70
$$ -88 -25 50 313 -171 -29 -28 -215 -215 -272 86 200 -91 1 -50 -14 -211 85 45 23 34 10 -115 -138 118 116 -54
5090e4J11K02l51L88k96j83K77j3J81k30L26l28j94O06m38J18k7J17o5j93R6R3
$$ -54 57 259 -92 296 0 -183 94 81 262 32 358 30 -164 442 4 122 95 212 147 -46 50 143
5112A43M6k46J18J17l01L8L80k47J78k41K7Q9K43k35k52k95M35J11j90Q2p8j12
$$ 143 189 -57 61 178 -123 -85 295 48 226 -15 12 101 344 109 -143 -438 -3 108 -82 0 -78 -190
5134a90L83m19o3J40L38m41K45Q3J11l49j3L69k50P8l8J81j75o8J10o1O4o7j44
$$ -190 193 -226 -289 -149 189 -252 -7 76 187 -162 -175 194 -56 22 -16 165 -10 -78 32 -29 35 -32 -176
5157a76J59n2J10n3l6J22R0K7n21L79J45j33k56L16k3j71J33J33j42j55L4K24
$$ -176 -17 -69 41 -12 -48 74 164 191 -330 49 194 61 -195 121 98 -73 60 193 51 -104 -70 154
5179A54m9l47K51L6k77L01n3j81K73j06J46n35O38k04k9P7N2J7j56q5J57O4n8
$$ 154 105 -242 9 45 -232 69 16 -165 108 2 148 -387 251 47 18 95 147 164 8 -77 80 144 86
5202H6j80L07k72j0O3j07L3R4k32M34k25l3m3j28L17j13J51p2j14j50K4O5O4R6
$$ 86 -94 213 -59 -69 -6 -113 -80 14 -218 216 -9 -42 -85 -213 104 -9 142 70 -44 -194 -170 -105 -41 55
5226E5J3j94j36L98m4k16Q5J21R3j73J10j48J39k55l6K04P1M8j49K46N8m00L34
$$ 55 68 -126 -262 136 92 -124 -39 82 175 2 112 -36 103 -152 -188 16 87 135 -14 232 290 -110 224
5249B24l01j96J1K25M8K46l04K84k87J05j44L86k72j17J25Jk4j88N81n55J42K50
$$ 224 -77 -273 -262 -37 11 257 -47 237 -50 55 -89 297 25 -92 33 34 10 -178 403 -152 -10 240
5271B40J6l73K82j84K23l26K60p2O5k26K79k93m0LJ0k8L56j13N0j00j97N4J24
$$ 240 256 -117 165 -19 204 -122 138 66 131 -95 184 -109 -149 -146 -136 -164 192 79 129 29 -168 -114 10
5294A0j08j13L08k46R9K46j12q5l4P5r2j97K08J75k35P9K90k98j19K44k85L37
$$ 10 -98 -211 97 -149 -50 196 84 -1 -35 40 -52 -249 -41 134 -101 -22 268 -30 -149 95 -190 147
5316A47n6j2j01r1J11j1J31j28K15l76LK62K7r2R2j14j93J11J91r4l4l9K85n00
$$ 147 91 79 -22 -113 -2 -13 118 -10 205 -171 -168 94 121 29 121 7 -186 -75 116 22 -12 -51 234 -266
5340b66M65j3l58K25n7O1L0k35M1pJ59j6k33K02N8r1P5j22K97j43Nk26J48m6j6
$$ -266 199 186 -172 53 -4 57 87 -148 -107 -114 45 29 -204 -2 56 -35 40 -82 215 72 77 -149 -1 -47 -63
5365f3l1K38j25j63j16N5K82j7P7l20L01n0oJ09k14J14l6p2K8j6j17k1J89M4J92
$$ -63 -94 144 19 -144 -260 -205 77 60 137 -183 118 68 62 171 -43 71 35 -37 -9 -25 -142 -163 26 70 262
5390B62l22j50K73j3l19N5K71m67P34m86J69j16J43j3j91J92J33r0J5l98O40j62
$$ 262 -60 -210 63 50 -269 -214 57 -410 324 -162 7 -109 34 21 -170 22 155 65 80 -318 322 160
5412A60j94J24j65J49m22N65qm55M40k98p4rJ52Q3r5J73k55J06Rq7K79m47L91
$$ 160 -34 90 -75 74 -348 217 209 -246 194 -104 -178 -187 -35 48 -47 126 -129 -23 -14 -101 178 -269 122
5435A22m2j81K86l69K45l4L80k44n7J34m44l9K92k5J57k97J57j0L20o05L21k29
$$ 122 80 -101 185 -184 61 27 407 163 106 240 -204 -243 49 24 181 -116 41 31 351 -254 67 -162
5457a62K22lj91K01n0j8p7RR5L3j2l64j20Q05l49P7J05k05N5l3r7J77j69O7q5
$$ -162 60 57 -134 67 17 -1 -78 -69 26 59 47 -317 -437 368 19 96 201 -4 51 18 -79 98 -71 -4 -89
5482h9L77o07L45J8J51l05J04K45j64K54l29QJ32j81L04k35j45K89l97L9J32l5
$$ -89 288 -319 26 44 195 -110 -6 239 75 329 0 8 140 -41 263 28 -117 172 -225 -186 -54 -89
5504h9k4J70k04J92n5o5J15j99J23K4o7M3k56M16P2k91n0J33M23l70mj36R6J04
$$ -89 -113 57 -147 45 -10 -75 40 -159 -36 -12 -79 -36 -292 124 196 -95 -145 -12 411 41 37 -99 -3 101
5528A01n0k09K75l25J90l49M00j23r4K4M25J15q14J96K40l5O8j44L0L2p8M1qj11
$$ 101 51 -158 117 -208 -18 -367 33 -90 -184 -160 265 380 -434 -238 2 -33 35 -109 -79 -47 -125 -84 -92 -203
5552b03L30O7j57k35K84o6k25M38m79j6J68K30pj83j33L7L3J20L37k23j50P2j13
$$ -203 127 194 37 -198 86 20 -205 233 -246 -262 -94 136 129 -54 -187 -150 -117 3 340 117 -33 39 -74
5575g4j32k7J15L35l83J1M42m56K60j4M6j8Lj09j10L2O0K15m2k28J69l0j82J39
$$ -74 -206 -233 -118 217 -166 -155 287 -169 91 77 123 105 108 -1 -111 -79 -19 196 154 -74 95 65 -117 22
5599B2N3k6l8k02L39j56Q7M7j79K27k9k30j74K96K6j15R0L7P5j47j31P0J24J45
$$ 22 75 49 11 -191 148 -8 79 126 -53 174 145 -85 -259 37 63 -52 38 75 150 3 -128 -58 66 211
5623B11k7l52K28pp7n3k6K09p0j91K73L3q6l4j47J5K58l78M55m1m20K20j8J57
$$ 211 184 -168 60 53 -24 -77 -103 106 36 -155 118 151 65 31 -116 -101 157 -221 234 193 -227 -7 -25 132
5647A32p0Q5k86j07R7J72M3o9k26J27O1O8j21K79k2j16J74l05J27k45l7K52j08
$$ 132 62 147 -139 -246 -149 23 66 -3 -229 -102 -41 27 -94 185 163 47 221 -84 43 -202 -239 13 -95
5670i5N2J86j71Q8j84J57Q8m08M67k40k00J54K9P4k2J1R4j13j16J01M08m46r0
$$ -95 -43 143 -28 60 -124 33 121 -287 180 -60 -260 -106 -77 -3 -25 -14 80 -33 -149 -48 360 -86 -176
5693a76J46j09N9r3MJ07J44P1NQ1o63L92j81J35j85K75j56oK9P9j42J36k55K91
$$ -176 -30 -139 -80 -173 -169 -62 82 153 158 239 -424 -32 -213 -78 -263 12 -144 -150 -121 -42 -184 -48 -303 -12
5717a2J83k2k55N3M9Q3m4N7o4O8J47j47K7J37k47J61k28J99k14J71J04l34q0J52
$$ -12 171 149 -106 -53 -4 79 35 92 28 96 243 96 123 260 13 174 -54 145 -69 102 206 -128 -208 -56
5741e6K8n4J06J9l7r8l0J15j95K51M3o7M72l26j13l08R1L06q5rj23j43K25k85
$$ -56 -28 -82 24 43 6 -92 -122 -7 -202 49 92 25 497 171 58 -250 -159 147 62 53 -70 -213 12 -273
5765b73K07r3J52J27j46M2K06l54Q8k08L14k21L89k42j39M7K67q0P7k68k0M86
$$ -273 -66 -159 -7 120 -26 16 222 -132 -44 -252 62 -159 230 -12 -151 -104 163 83 160 -108 -128 358
5787C58m53K36k16J70j76K8Q1j18J12j57J21J6k06L28l06J06Q4J98J09m72m4L20
$$ 358 -95 141 -75 95 -81 -53 28 -90 22 -135 -14 2 -204 124 -182 -76 8 206 315 -157 -201 119
5809A19J71j88j67P7k04O2J22K79k75J99k52R4O0q4j17K35R3J4k39O2J07m4l4
$$ 119 290 102 -65 12 -192 -130 -8 271 -4 195 -57 37 97 13 -104 131 224 238 -1 61 168 124 90
5832I0j15q0J32j55K0J82q1K82l71L8l43J95N21m69p1J73J49K9k01Q7K03k21o3
$$ 90 -25 -105 27 -128 -108 74 -7 275 -96 -58 -401 -206 315 -154 -225 -52 97 126 -75 12 215 -6 -69
5855f9P8k21L98O4l19L48j55Mj30N9j2l4o6j65J43Q8l6J36k12R9j63m1L37j58
$$ -69 9 -212 186 250 -69 279 124 128 -2 57 45 11 -55 -220 -77 11 -25 111 -101 -2 -165 -206 131 -27
5879b7j19o0J12j4K99j06R2n3p6k60M89k06p7J70l77M69P2n15m0R2K08K7j41N8
$$ -27 -146 -206 -94 -108 191 85 177 124 48 -212 277 71 -6 164 -213 256 328 -187 -227 -135 73 100 -41 17
5903A7l7O9k08J45N2J41Rj26L31l78lr4L7J90l06K18L4L07k74k15j0j64N05l54
$$ 17 -20 49 -159 -14 38 179 188 62 393 15 12 -82 -45 145 -161 57 91 398 124 -91 -101 -265 240 -114
5927a14j06K73q8M5m8P4j58M30l80n0j42N36L8k96P6R7K20l84j22jJ80N8j8n1
$$ -114 -220 53 -35 10 -38 36 -122 308 -72 -122 -264 272 310 14 90 187 407 23 -99 -100 80 138 120 69
5951F9o0r7L79m23K17n1K25l70J42l99M78K02l82P3L7j95J37q0K34j75L3K3J67
$$ 69 9 -88 291 -132 85 34 259 -111 31 -368 110 312 -70 3 40 -155 -18 -98 136 -39 -6 17 184
5974A84j74k0j20K1K7J16j61o7j0N6P1J52Rl54N80l57J35n8O6m6j13R8j1m7K07
$$ 184 10 -10 -130 -109 -82 34 -127 -194 -204 -148 -77 75 84 -270 310 -47 88 30 96 50 -63 35 24 -23 184
5999A84l21K13j04Jj4K38k23K07j41j83L84j31k61J72n3J84j28J25j26J2j77J00
$$ 184 -137 76 -28 -27 -41 197 -26 181 40 -143 241 110 -151 21 -32 152 24 149 23 35 -142 -42
6021d2J42J66P9m19K90r0P2j73k76K91p7K51l62J39j32jK4L02l5k62R4J3m3o2
$$ -42 100 266 345 -74 216 126 198 25 -251 40 -37 214 -148 -9 -141 -142 -118 184 149 -113 -19 -6 -49 -111
6045a11J38k47J95P2N2j53L36m88K15k30N43l02J44l20J14m5K11j4j94l8J56l9
$$ -111 27 -220 -25 47 99 -54 282 -206 9 -221 322 20 164 -156 -42 -87 124 110 -84 -122 34 -5
6067ek1j17j7M13k43J75R9l02M1J8m0n7J37k3P8j12Q2pk02K34k28n7K38k46l7
$$ -5 -26 -143 -160 253 10 185 284 -18 23 41 1 -56 81 58 136 24 106 99 -103 131 -97 -154 84 -162 -199
6092a99M06nl76N09l52k10K68J93M5l55L6JJ57l02K15j08J98N8j47Q9m4j21O6
$$ -199 207 202 -174 335 -17 -227 41 234 279 -76 -40 -39 118 -184 31 -77 121 179 32 121 77 -44 22
6115B2N3p1o2O5Q2j4l71K63j02R6n5M8K5J2k1L01p1l59K06j08R6J81k91n8J24
$$ 22 75 4 -58 7 89 75 -296 -33 -135 -39 -94 -46 -21 -9 -30 271 200 -159 47 -61 35 216 -75 -133 -9
6140ij15R1J9j53J58J37k14J33k49K75k3L9J09l57N10l45J07j97J27P8j41k46
$$ -9 -124 -33 -14 -167 -9 128 -86 47 -202 73 50 89 198 -159 351 6 113 -84 43 121 -20 -266
6162b66L24J90r5k41O8NJ66l74K57N1k47J52kj30Q9j7p5L10j88j18K13L9k44K12
$$ -266 58 248 153 -88 -20 -15 151 -223 34 85 -162 -10 -12 -142 -53 -70 -145 165 -23 -141 72 111 -133 79
6186G9o5J29j59N5Lj30l4J78j7N2K04k84p5K98l55K43J80l71K07k22L6R7J02l91
$$ 79 14 143 -16 39 42 -88 -122 56 39 91 295 11 -64 234 -121 122 302 -69 138 -84 -48 49 151 -240
6210b40L20j01J64nj24n9L1k58K49j30M63k32K7mj30PM67l20O7k56n9L89k15O8
$$ -240 80 -21 143 138 14 -45 -14 -272 -23 -153 310 78 105 101 -29 -22 445 125 192 -64 -123 266 51 119
6234A19j27P3j02J98j05K04k44m3K33k55o9K66j95q3J12J46j47n5RJ61k13p6J39
$$ 119 -8 65 -37 161 56 260 16 -27 206 -49 -118 148 -47 -130 -18 128 -19 -74 -65 96 -117 -193 -54
6257e4Q7j18j33R4R8K8mQ8P2J32k13k32K36lp7mJ7L9m0j45k3K85k04m2K08n1j18
$$ -54 33 -85 -218 -124 -26 2 -2 86 158 290 77 -155 81 78 1 -3 14 53 13 -132 -155 130 -74 -116 92 41 -77
6284g7J61k12j00J97R6k57j7K03k4k7j00J85k8P9J6l24NP1J11J37k61j04M10l7
$$ -77 84 -128 -228 -31 65 -192 -209 -6 -30 -57 -157 28 0 79 95 -229 -224 -153 -42 95 -166 -270 140 103
6308A03m52L83o5K18l00j06L26j39o1K20O9m7m77M7N19l75K10l45K57N0J20j60
$$ 103 -349 34 -31 187 -113 -219 107 -32 -93 127 196 149 -328 -281 238 -137 73 -272 -15 35 155 -5
6330eL0j38M45j82j0j12R5j23K35j49jL9k30Q5j50K63R5p9l15M03j14l63K46r5
$$ -5 25 -113 332 150 140 28 123 0 235 86 85 124 -106 -21 -171 92 187 108 -207 196 82 -281 -35 -130
6354a30J72K33l56J36j94L28k74K28j72J07K77k00k31J35j13k0K03k25J49K0J50
$$ -130 42 275 -81 55 -139 189 -85 143 -29 78 355 155 -76 59 -54 -74 129 -96 53 73 223
6375B23k00L5R2k03M1k87K11L6J27J3O5l96n5M18L9j41k15J40J09k79J80r0J28
$$ 223 23 58 150 -53 -12 -299 -88 -52 75 88 153 -243 -298 120 159 18 -197 -57 52 -227 -47 -137 -9
6398iM2l8r1J5LJ60j16P5J28n1j84Q6k19K63P1o2l9q9K31m28L84m9l07J06Q6O5
$$ -9 33 -5 -96 -81 -78 82 -34 41 169 118 -66 20 -199 64 135 73 34 -55 176 -252 132 83 -224 -118 -32 33
6424C3j08J75l3j2m2J06p8J83l35J8J8O7j34J55J96k28K2o3J03j30K23j61j76
$$ 33 -75 100 67 55 13 119 41 224 -111 -93 -75 -8 -142 13 209 -19 3 -60 43 -87 136 -25 -201
6447b01J37K04j40o8J10j5Q1N8k27K50m99K61P8l5J4j00J39j57J6J7J37l21K65
$$ -201 -64 140 0 -68 42 27 108 166 -61 189 -310 -49 29 -6 8 -92 47 -110 -94 -77 60 -261 4
6470Dj93L43l4m5O9m55L10k4m7J43k37j38r6O26j82k8n8o7L08j38j12K73j53K7
$$ 4 -189 154 120 75 144 -311 -1 -25 -72 71 -166 -304 -400 226 44 16 -42 -109 199 61 -51 222 69 96
6494I6m1J26m13K64Q0m4J56k50J53j22K09j32p4mj3Pp2j0l8Q5K2j31N48m23J43
$$ 96 55 181 -232 32 112 68 224 -26 127 5 214 82 8 4 -9 -2 -74 -84 -122 -37 -15 -146 402 -21 122
6519A22j59LJ33q1k26J06J76N5k36p5M42k68j01L61j64k92L14l06K37qj95J8J97
$$ 122 -37 -34 99 18 -208 -102 74 129 -107 -182 260 -8 -109 252 88 -204 110 -196 41 33 -162 -144 53
6542E3M4l23L48j95K77k48K56k02J11R1j68J5l36L26%j68QK03k73J25K66k57K6
$$ 53 97 -226 122 -73 204 -44 212 10 121 212 44 59 -277 49 49 -119 -111 92 -181 -56 210 -47 -21
6565b1J48m97J7K01N53m97Q1j92K49j97J24j47K60n8j71P8k5j1J10k59J22K07
$$ -21 127 -370 -353 -152 401 -96 -15 -207 42 -155 -31 -178 82 24 -147 -69 -94 -105 5 -254 -132 75
6587G5j1o6L7k62L02n4p2Q9M7r9l4K62k46J79k52M7J88l25L28k66J6J40n8M6N9
$$ 75 64 -2 35 -227 75 21 -51 38 85 -14 -48 214 -32 147 -105 -58 130 -195 133 -133 -117 23 -35 11 70
6612G0J57m21K24k74K53J29l54J91j66L25l81K23J52l6R3k8k71N3j28j9O1L6K85
$$ 70 227 -194 30 -244 9 138 -216 -25 -191 134 -247 -24 128 92 185 157 -114 -61 -189 -208 -147 -111 174
6635A74k5j4K4j43k04L64l48M15l88M1K56j49o0K43j08q1K2j1J96k23j14l78L81
$$ 174 149 135 159 16 -188 176 -172 243 -145 -104 152 3 -57 186 78 -3 19 8 204 -19 -133 -511 -130
6658a30j45K72M0J9l4M7R8J96j89p2r6p5Q2o8N1j55J71L2K28j26j02m1k26J32
$$ -130 -275 -3 37 56 22 69 167 363 174 102 6 -69 13 -55 -4 -159 12 44 272 146 44 3 -223 -91
6682i1R2k03J81j01R8j2P8k07QK99n7j96L3r1M99l04M6n6J59k20J81k44J59j81
$$ -91 1 -202 -21 -122 -24 -36 42 -165 -157 142 85 -111 -78 -169 330 26 72 16 175 -45 136 -108 51 -130
6706a30k4J27j30L9J29l2N0q1R6j07L8K60k73j17J82J16l5j11q0J27Q6j08J73
$$ -130 -154 -27 -157 -118 11 -21 29 -52 44 -63 -25 235 -38 -155 27 143 108 -3 -83 44 130 22 195
6729A95l19r4J11M31l07m5J25m90N10Pk37rK22j30K31L9k49j00o1L71j98OR5q6
$$ 195 -124 -218 -107 324 17 -28 97 -393 117 124 -113 -122 100 -30 201 240 -9 -109 -170 201 3 9 104 18
6753A8k77L82j94k5O9J06j37J84m9k22J62P1j33K14l10K92p8l04K92j3j46Q9R8
$$ 18 -259 123 -71 -96 -27 79 -58 126 77 -145 17 88 -45 169 -141 151 73 -231 61 48 -98 -9 89
6776H9P2j12P6q1L0j88J02q8Q4J42k30J79j30j17M42m51J96J19om12M26k00J00
$$ 89 161 49 125 44 74 -114 -12 -100 -16 126 -104 75 -55 -172 270 -181 15 134 128 -284 142 -58 42
6799D2j82N2J36oJ47O4k56J14O5k55L8K64K8q9j48j06P8n0j5N0O6n3K77l13J43
$$ 42 -140 -88 48 42 189 253 -3 111 176 -79 -41 223 251 162 14 -92 -14 -64 -79 -29 37 -16 261 -52 91
6824I1J57l63K09J3p0j1k30L72k08M4l36L41j16j89K95Q5q6l8r1K41o3j53N5p0
$$ 91 248 -115 94 107 37 26 -204 168 -40 4 -332 9 -107 -296 -1 84 -2 -40 -131 110 47 -106 -51 -121
6848a21j56J14k6K74j14m0J62l07P3Q8o6nJ94k11K78r4j34l4K60k13j15JJ63L6
$$ -121 -277 -163 -189 85 -29 -69 93 -214 -141 -53 -119 -124 70 -141 137 43 -91 -125 135 -78 -193 -192 -29 7
6872Gk68K69M6j8M0k61q0J02n9j89M65o8N6j57k3P7J78q2k30Q3J9Q1P2o3M3j25
$$ 7 -261 8 54 36 76 -185 -265 -163 -222 -411 54 -14 42 -115 -138 -61 117 35 -195 -112 -93 -12 60 -3 40 -85
6898h5J05o1J41k00M3J03j99J29O4J04Rn81K30L1J97j64R5j40J45K0k09K9K5j32
$$ -85 20 -41 100 -100 -57 46 -153 -24 40 144 153 -428 -198 -167 30 -134 -39 -179 -34 -14 -223 -194 -169 -301
6922c01K61kj80K81L1k80R6M49l39Q0l33K69j54k9O5K76j38j61Q7j43L45k97K40
$$ -301 -40 -42 -222 59 90 -190 -94 355 16 96 -237 32 -122 -151 -86 190 52 -109 -22 -165 180 -117 123
6945A23J19n61R3M9J01J83k47K46k0m7l86L62R5n10L30R6R8O2m58M62j69j96P1
$$ 123 242 -319 -226 -177 -76 107 -140 106 86 39 -347 15 110 -400 -70 26 124 186 -272 190 21 -175 -104
6968a04L6R8j01M3P0P1p3J35mj50n8J07n9l6K7m9J78mj25k02O2J82o2n6J68j7
$$ -104 -68 30 -71 -28 42 113 40 175 171 21 -37 70 11 -25 2 -47 131 127 2 -200 -138 44 -18 -74 94 77
6994G7J6k18Q9K48k94K1j78L96j08j89K10j06j5O2l3Q7j99L6K74k42m9R3J73k21
$$ 77 93 -125 -36 212 -82 -61 -239 157 49 -140 70 -36 -51 11 -22 65 -134 -98 176 -66 -115 -22 151 -70
7018g0J35O0r7lJ03p1n3j35J98k71L19K98l29ql3Kp9L66n75m8M21j82j22K51o0
$$ -70 65 125 28 25 128 57 4 -131 67 -204 115 413 84 76 43 45 -34 332 -243 -291 130 -52 -174 77 17
7043A7J32o4k18J71o8K5o6k3J37K51l64J19O5j98L76j55k19Q2J75p0l01K23j41
$$ 17 149 85 -133 38 -30 -5 -71 -94 43 294 -70 49 114 -84 292 137 -82 0 175 105 -196 27 -114
7066a14L80N3j76p5J06k40K59l43o4K07k25M93j99K4j09M6J04Ml04J28J14l6J59
$$ -114 266 319 143 68 174 -66 193 -150 -214 -7 -232 261 62 86 -23 23 127 131 -173 -45 69 33 192
7089A92m24M10k95l8O8M7k3j91L33O1J46j91l50J44k9J46j9M4O2M5j13J45j20
$$ 192 -232 178 -117 -155 -87 -40 -63 -254 79 140 286 95 -255 -111 -140 6 -13 31 93 138 25 170 50
7112E0k00J38R2k52K07k18J66K15j95R5P7k11J81j53r4L8J52k15R6Q2L4j31r8
$$ 50 -150 -12 80 -172 35 -183 -17 198 3 98 175 -36 145 -8 -102 -64 88 -127 -31 51 85 -46 -144
7135a44p1L1J97j91J71jm3L68m69M64l75O5M7j42J73k42n3p5K07J50K9j19Q3q4
$$ -144 -215 -184 13 -178 -7 -8 -51 317 -152 312 -63 2 49 -93 80 -162 -215 -290 -83 67 96 -23 60 -24
7159b4On5L11j15J15Mj40Q4j50j83J37O2M4p5Qr0L24l81J38l3j15J36J05k13K31
$$ -24 -18 -73 238 123 238 242 102 186 36 -147 -10 52 96 21 29 -61 263 -118 20 -13 -128 8 113 -100 131
7184A31o4j86J76R0p6j68K12m5j63J01mM6mN2p1Q2k17K82j12j4j96K97r2M3n5
$$ 131 67 -119 57 147 71 -97 115 70 -93 8 4 50 46 98 27 109 -108 174 62 48 -148 149 57 100 45
7209D5j78n7O7J86J8m2k74K93r9J59r1j40K11l10M39n9j76K07j54j42P8r7J34
$$ 45 -133 -190 -123 63 81 39 -235 58 -41 118 27 -113 98 -212 227 168 -8 199 45 -97 -19 -116 18
7232A8K36l26R9o4L78l27M6j67K80l43L31j09n1mj85J99l4j10P7j16M6J99q5L26
$$ 18 254 -72 27 -37 341 14 60 -107 173 -170 161 52 1 -3 -188 11 -23 -133 -56 -172 -126 73 -12 314
7256C14k13l3k72M1J23J13j63L98l16n8K51k56M3L07l30K25j66P1J34k73L2k7
$$ 314 101 68 -204 -163 -40 73 -90 308 -8 -66 185 -71 -28 279 -51 174 8 79 213 -60 -28 -55
7278e5j30K1k34N13j10J06J87m49K21L95n68M6K52J3j36J02j08K84k21J43j14
$$ -55 -185 -164 -398 115 5 111 298 -151 70 465 -103 -57 195 208 72 174 66 350 129 272 158
7299A58j35J2lN8j1Qj4K3j95M42k97r4N5o6R3J24k07L52j38J08l28J30n5Q3j81
$$ 158 23 35 32 90 79 87 73 96 -99 343 46 -48 7 -59 34 158 -49 303 165 273 -55 75 20 103 -78
7324g8L3j06L83p5j27NJ49j20k16K19j99L07j79o1J95O2m17L08j90j1P8k56K94
$$ -78 -45 -151 232 157 30 35 184 64 -152 67 -132 175 -4 -65 130 192 -225 83 -107 -118 -40 -296 -2
7347bJ47J66l70N9J96m04K42N8j43J9j70K32k34K14nJ08j46J49J4k09K5MJ99l47
$$ -2 145 311 -59 0 196 -208 34 92 -51 -32 -202 30 -204 10 5 113 -33 116 130 -79 -54 -50 149 -198
7371a98J15R4K7J52k81K02K08l32k1j54J62J49K3k29Q9J52l35K04k3j63K62q2
$$ -198 -83 11 38 190 -91 111 319 -13 -34 -188 -26 123 146 -83 6 158 -177 27 4 -159 103 21
7393B1P2pK52n89L28l11L56N6j41J19l0k71p6M18l58J91j70J4K50Oj83oK1j3L88
$$ 21 93 86 338 -251 77 -234 122 178 37 156 126 -145 -221 197 -161 30 -140 -126 124 130 -53 -59 -38 -51 337
7418C37m84J75K14m95L10lm9m8J14j89L39k62J81k06L53m17J19n5M4L32l91K75
$$ 337 -147 28 242 -253 57 54 5 -43 71 -118 221 -41 140 -66 287 -130 -11 -66 -22 310 -81 194
7440A94j29j74k3L03k26K32r9l2r8J63mJo0M6k16m7O9J61q4k6J87K1j46l8o4N
$$ 194 65 -109 -132 171 -55 177 78 46 -52 111 107 108 48 94 -122 -169 -100 61 -23 -49 138 159 13 -25 -89 -84
7466h4l0M5j03N6R5%o1K07j51M0M9J9k06J05j87K00J88j75P1n3j77L2l3K98j35
$$ -84 -114 -69 -172 -116 -21 -21 -82 125 -26 14 63 82 -124 -19 -206 -6 182 7 78 25 -152 -120 -153 145 10
7491A0j03KM4K83n34J08K84lO1q6k79J81Q1K50l86P4J71N4l68J50k15J96K10l91
$$ 10 -93 -91 -47 236 -298 -190 94 91 152 66 -213 -32 49 299 -87 -13 158 212 -156 -6 -221 -25 185 -206
7515b06J64o2J32J37J9M3n4k86L09k50kK11m4l4j1p6l2K61k06N8l2J70k01P6O0
$$ -206 -42 -104 28 165 184 227 173 -113 196 -54 -56 155 111 77 66 -10 -42 219 13 71 39 209 8 84 144
7540A44j18J81m52M47k19O7O2k11q9K64j37r3K40jq3K35k13p1L5J64j58j00J65
$$ 144 26 207 -245 202 -17 50 112 -99 -188 76 -61 -154 86 85 2 237 24 -47 -12 152 -6 -106 59
7563E9R9p9M2j49OJ4k2M8K34l21Q2k58L85m03N26j12j67Q2j18J19k33j10J73j7
$$ 59 158 79 121 -28 -22 -8 -30 18 252 -69 13 -245 140 -263 263 151 -16 66 -52 67 -166 -276 -103 -120
7587a20k15M33j66O5M4m4K1NK1J98m3l52N6J87n5Q1n7j18J63j54L4OL4N9O3j35
$$ -120 -335 98 -68 -3 41 -3 18 23 44 242 199 -153 -97 90 35 116 59 -59 104 -50 -16 -10 24 83 146 11
7613A1j71L25j22J7j73J33k14M69k66R1k18L60l41J08R2O6l84K60k04n8K30j10
$$ 11 -160 165 43 60 -113 20 -194 275 9 100 -118 242 -99 9 101 167 -217 43 -161 -219 11 -99
7635i9L7L63r1k24Q2L4k59K42J08l41J50Rk14J34M3j13J71k13J05J66n9J16k60
$$ -99 -62 301 210 -14 68 102 -157 85 193 -148 2 11 -203 -69 -26 -139 32 -181 -76 90 31 147 -113
7658a13q4J59l2j09J83j59O1J13j42K09ok34J31j03M7Q1P6R2J20m24J87p3J02
$$ -113 -197 -38 -70 -179 4 -155 -94 19 -123 86 80 -154 -23 -126 -79 2 78 170 290 -134 53 -20 82
7681H2pq9K46l63Q9q7L7L39j90j92J53j87K25k2o8nj34L02Nj55J04l5q1M11l54
$$ 82 75 -14 232 -131 -42 -129 -92 247 57 -135 18 -169 56 34 -34 -39 -173 129 134 -21 83 48 -33 378 24
7706B4K6l42K72J99r6k19J50j62J05K4j41M49l29p5K60J42j79k25L19l13j25m5
$$ 24 50 -292 -20 179 83 -136 14 -148 -43 -19 -160 289 -40 -115 145 287 108 -117 202 -111 -236 -281
7728b81l2M12m8Jn8K0k32p3J49J57J76j58K94n6l19J54l13L03j10k36K26K56q2
$$ -281 -313 99 51 52 -6 14 -218 -291 -142 15 191 33 327 271 -48 106 -207 96 -14 -250 -24 232 150
7751A50j58K03k17J30k31J30kO6k01J35k04j21L22J6j77J34R5j53J81l34J62k18
$$ 150 -8 195 -22 108 -123 7 5 71 -130 5 -199 -320 2 18 -159 -25 70 -83 98 -236 -74 -292
7773b92J25k0K21j42J40j82K94k8k19L8J57j72o3K04j52L53k52n8j86K38N3n0
$$ -292 -167 -187 34 -108 32 -150 144 116 -103 -65 92 -80 -143 61 -91 262 10 -48 -234 4 57 7
7795GNj9J34j39n8Q4K85l93L01o6j81Q9o8P1k74K78k6l38J34J58j55L89k76M8
$$ 7 12 -7 127 -12 -70 14 299 -94 207 141 -40 49 -19 52 -222 56 30 -308 -174 -16 -171 218 -58 -10
7819a0K25j65j22N1J56J6p4L6m72M25o2L2J57m18L2K17j9l00M09j04J60l23L25
$$ -10 215 50 -72 -21 135 151 77 113 -359 66 4 36 193 -225 -193 24 5 -295 114 10 170 -153 172
7842A72k66L30k34l1L16m30N6J76k33Op2K76k18K63nl46j63M93j90J27p0K22l47
$$ 172 -94 236 2 -29 287 -143 -87 89 -144 -138 -210 66 -152 111 106 -240 -403 90 -100 27 -43 179 -168
7865a68L99j40j96J41k4J02p6J55j00o1J22k28K15k19r9J5K78J3j90R6j00K02
$$ -168 231 91 -105 36 12 114 38 193 93 32 154 -74 141 -78 -177 -162 116 129 -61 35 -65 137
7887A37J28k20Lj53Q1K20m35L5j98N58l98N07l49L3MJ47j48O4k51Q7L21J99j13
$$ 137 265 45 48 -105 -24 196 -239 -204 -402 156 -242 265 -84 -51 -47 100 -48 16 -235 -148 173 372 259
7910B59R2k94l23K94Q8j48K59l50o0L88m09Q9L4m6q0N28m09N4J21j03J76k86K8
$$ 259 351 57 -266 28 116 -32 227 -123 -183 205 -204 -115 -81 -127 -207 321 -88 -34 87 -16 160 -126 -98
7933i8K1J91k0or7j6M1j06k3j29K75l6j17K04n4j67K37J76n62K61k46K19N5l46
$$ -98 -77 114 94 88 -9 -25 16 -90 -113 -242 33 -3 -120 84 30 -137 100 276 -286 -25 -271 -52 3 -343
7957c43J67P5j11J82j90K50o8j00J38J81R9l26O6k93n0J82L30mk41J00k04J82
$$ -343 -176 -101 -212 -30 -220 30 -38 -138 0 181 280 -46 20 -273 -323 -141 189 185 -56 44 -160 22
7979B2j91J26L3P2k02J8K29j67J51ln5P0j93j5K20l70L48J31q5j68J1J06o3j12
$$ 22 -169 -43 -10 62 -140 -122 107 -60 91 88 33 103 -90 -105 115 -255 93 224 139 -29 -18 88 25 -87
8003h7L75m90J48o4M8J48k0j78Q9r3J35N9q0P3N6J21l32r2N6L9J09O3k37K37q8
$$ -87 288 -202 -54 -118 -70 78 58 -120 -31 -124 11 70 -10 63 119 240 -92 -184 -128 -89 20 83 -154 83 -5
8028el0K44j18J00l06R4j8j69J72J25R5l17K55l60J44mk7K95m5K1k50J55R3kk68
$$ -5 -35 209 91 191 -115 -21 -39 -208 -36 89 184 -133 122 -238 -94 -98 -125 170 125 146 -104 51 144 142 -126
8053a26J88j2P4j70pk7J46O4l38n4K53Q4j5k48o3K41n7K20k87Q3P8Np1K07L3k61
$$ -126 62 50 124 -46 -53 -80 66 130 -208 -262 -9 75 60 -188 -251 -10 -67 153 -134 -51 27 32 -39 168 201 -60
8079f0K23j12o3J2J06p7o9J5J18j24Pk06K13Q2l3o2J07J64o3k40K93m33L25K8
$$ -60 163 51 -12 0 106 29 -40 -25 93 -31 -24 -230 -17 65 32 -30 77 241 178 -62 231 -202 123 151
8103A51l3m6k13P5J5J72j76M4k4l0p3J22k64L55n6j84J38J92j04o9j00J25J56
$$ 151 118 72 -141 -66 -51 121 -55 -11 -35 -65 -138 -16 -280 75 19 -165 -27 165 61 -8 -108 17 173
8126A73m41j17K25K57Lr4Nj45J49j38J86J2j16O9k13J12L0K39L9j27m0j7oj18
$$ 173 -268 -385 -160 97 100 6 11 -134 15 -123 63 75 -41 28 -185 -73 -43 196 235 108 68 51 45 -73
8150g3j17J54J33l71J7M93m25K81p5K2j63J55l4J2O6j01J30p2p6p9J07N4J36m40
$$ -73 -190 -36 97 -274 -257 236 -189 92 17 39 -124 31 -3 9 75 -26 104 32 -44 -123 -16 38 174 -266
8174b66M21k62Q4J40l7J09l54j10K00J63K18m65L16n5k44J81j54
$$ -266 155 -107 -23 117 80 189 -165 -275 -75 88 306 -159 157 102 -142 39 -115
8191a15
$$ Imaginary data points
##PAGE= N=2
##DATA TABLE= (X++(I..I)), XYDATA
0@%%%%%%%%%%%%%qJ6j6J6j6K4l2L2m0M8n6P2q2R0j04J23j47J68j90K16k43K76
$$ 0 0 0 0 0 0 0 0 0 0 0 0 0 0 -8 8 -8 8 -8 16 -16 16 -24 24 -32 40 -42 48 -56 67 -80 88 -102 114 -129 147
35A47l13L52l95M43m95N52o14O82p57Q38r25J021j125J240j369J508j660J829
$$ 147 -166 186 -209 234 -261 291 -323 359 -398 440 -485 536 -589 651 -718 790 -870 959
53I59k017K225k461K730l034L384l796M286m879N616o558P817r597J2321j7062
$$ 959 -1058 1167 -1294 1436 -1598 1786 -2010 2276 -2603 3013 -3545 4272 -5325 6996 -10066
68a0066K7708j02573M1215J56598o0362q6945k4489O0350J2632m981m733L289
$$ -10066 17642 -84931 -43716 112882 52520 -34425 -58914 1436 14068 9087 4354 7643
80G643k9706R266L2314R161l2897k0270J9883K2591j2874r865K821m12n348J0730
$$ 7643 -22063 -12797 19517 28678 -4219 -24489 -4606 17985 5111 -4754 -1933 -2345 -7693 3037
94C037O368o215j4744Q496J4661p383q625Q866L844j1801k170J4979M972k0128
$$ 3037 9405 3190 -11554 -3058 11603 4220 -4405 4461 8305 -3496 -5666 9313 14285 -5843
108e843r745K1877Q232j7331j1587J2592J0611j0224q628R409N460r942K32R545
$$ -5843 -15588 6289 14521 -2810 -14397 -1805 8806 -1418 -10046 -637 4823 -5119 -4887 4658
122D658j621j0351J446J5328q79j7343j232J6739L255j2250p129O256P426l657
$$ 4658 3037 -7314 -5868 9460 8581 -8762 -9994 6745 10000 -2250 -9379 -3123 4303 646
136F46k167L98l399J278O892Q62p045l070O220O441n749n203N861K830m280k601
$$ 646 -1521 -1123 -4522 -3244 3648 4510 -2535 -5605 615 7056 1307 -3896 1965 4795 515 -2086
152b086M363K236n249l209N511J627n782Q3M477l41m962m37O722J455o837j828
$$ -2086 2277 4513 -736 -3945 1566 3193 -2589 -2506 1971 1630 -3332 -3769 2953 4408 -2429 -4257
168d257N546K582k383k931J124J090j348R50J946l317k367K128K587j077k446
$$ -4257 1289 3871 1488 -1443 -319 771 -577 373 2319 -998 -3365 -1237 1350 273 -2173
183b173p2K842j481j185K750J088k620j981K568L721j569l653O76J854J42j05
$$ -2173 -2245 597 -884 -2069 681 1769 -851 -2832 -264 3457 1888 -1765 -1089 765 907 802
199H02l82r69j187N75L312j03l954j082L506J666j138k625Q45J732l32K6O41j016
$$ 802 420 -549 -1736 -1161 2151 2048 -1906 -2988 518 2184 1046 -1579 -734 998 666 692 1333 317
217C17j212J123J493o33j820o20K007J14j488R8L96kl86m15J610l16j026Q49O38
$$ 317 -895 228 1721 1088 -732 -1352 655 769 -719 -621 -225 -227 -613 -1028 582 266 -760 89 727
236G27o40k78q9Q84m35n80P04O8q98o27J180K72l41j288M77J460l03p91n6M29
$$ 727 87 -191 -280 604 169 -411 293 361 -537 -1164 16 288 -53 -1341 -864 596 293 -498 -554 -125
256a25N85RR6j37o53O5J405l65j226R5K55N80q41o54P42L58n91N42m3l00L06k97
$$ -125 460 469 565 428 -225 -160 1245 880 -346 -251 4 584 -257 -911 -169 189 -402 140 97 -203 103 -194
278a94O25J54m38P0J86L6l84L29j32q1o06L0O95l52o45L78m0n7K24Q1k5o8P0N06
$$ -194 431 585 147 217 403 439 55 384 252 171 -435 -405 290 -62 -707 -329 -369 -426 -202 -121 -146 -214 -144 362
302C62K33o77k7K97L83k44p06J08M28l22J12k42k7K05j33K2M35n33K57M82k11
$$ 362 595 -82 -109 188 571 327 -379 -271 157 -165 -53 -295 -322 -117 -250 -228 207 -326 -69 413 202
323B02l1n6j3L89j81n0J35j72l12K67P0jl58j38K38r0j71M72p1k77m4J61K11J49
$$ 202 171 115 102 491 310 260 395 223 -89 178 248 247 -111 -249 -11 -101 -272 200 129 -148 -192 -31 180 329
347C29n76L67J41k12J15k79J5J86o09M06j02j52K53k83J61Q8k5K53M01l83l37
$$ 329 -247 120 261 49 164 -115 -100 86 -523 -117 -219 -371 -118 -401 -240 -152 -177 76 477 94 -243
368b43J54L56l44L03j77m0Q1O8J95k61j89R5J3k8j92J22N7K2j75K03L29j98j25
$$ -243 -89 267 -77 226 49 9 90 158 353 92 -97 -2 11 -17 -209 -87 -30 -8 -183 20 349 151 26
391B6r8l0M66r7j55k43L6j02K5K56k6m00j41N23J41j94j12q8O2M02l51K17j83
$$ 26 -72 -102 364 267 112 -131 -95 -197 -172 84 58 -342 -483 40 181 -13 -125 -213 -151 251 -100 117 -66
414f6r9L68M3o6l9l81J54J52L4k21m5l09L05J59j05K29R5m2k07J63K22k07j91
$$ -66 -165 203 246 180 141 -240 -86 66 100 -121 -166 -475 -170 -11 -116 113 208 166 -41 122 344 137 -54
437e4m8MK25j61o8k7LJ35j22k86J48K02J97q4j28p3N5j2J43j41J3J99j53o0J40
$$ -54 -102 -98 127 -34 -102 -129 -126 9 -113 -399 -251 -49 148 64 -64 -137 -82 -94 49 -92 -79 120 -33 -93 47
462D7QK7o8r9J50k20j94L55K62j81k34lO85n49K40k92k77M66L08j59n03L90l23
$$ 47 55 82 14 -85 65 -155 -349 6 268 87 -147 -150 535 -14 226 -66 -343 123 431 272 -231 159 -164
485a64j28J65q2R5j82k54O99Km4l60k0N38K04n30k71P3K35N59o46J68n0k38l6
$$ -164 -292 -127 -209 -114 -296 -550 149 151 107 -253 -273 265 469 -61 -332 -259 -24 535 -111 57 7 -231 -267
508b67M08P6k5o81n0O76L07n63k42pO71j15l40L26j95m2m7K08J81q7k99J19q9
$$ -267 141 217 192 -489 -539 137 444 -119 -361 -368 303 188 -152 174 -21 -63 -110 98 279 192 -107 12 -77
531g7j13J36j77K3N0j24j7K23J28k4l51J2O27K22l96m39M14l04L30K5l76J02k
$$ -77 -190 -54 -231 -208 -158 -282 -299 -76 52 28 -323 -311 316 538 142 -297 117 -187 143 168 -208 -106 -108
554a08L05K70k97n49k28M45M61o0l09m93M66P59k42o17M0J48K73j49j21k50N42
$$ -108 197 467 170 -379 -607 -162 299 239 -70 -563 -97 662 420 -197 -157 -9 264 115 -6 -256 286
575B86o08J17R6J26k75j43N82J24j14k82N9k7J58k42L00n1N0j54j9M8R4k18P2
$$ 286 -322 -205 -109 17 -258 -401 181 305 191 -91 -32 -59 99 -143 157 106 156 2 -17 31 125 -93 -21
598b1k25k0J06J71O9k40J33n7jL48K8l33O7P2P6j65J66m07Q9r4K32P8%m86K29
$$ -21 -246 -266 -160 11 80 -160 -27 -84 -85 263 291 -42 25 97 173 8 174 -233 -144 -238 -6 72 72 -414 -185
623a85K06k15M50q16L57K92m7L5J72m20K59J30j0r5j76j21K41k2j97K9N6J14k0
$$ -185 21 -194 256 -560 -203 89 42 77 249 -171 88 218 208 113 -63 -184 57 35 -162 -133 -77 37 17
646A7J2Krj14K10J48k90Q7n2q8L34l68K52K38n04n6j00L15p3J10j34j32O8M3l2
$$ 17 29 31 22 -92 118 266 -24 63 11 -77 257 -111 141 379 -125 -181 -281 34 -39 71 -63 -195 -127 -84 -116
671a16J72j97J42k6p0N3K45J07k25j9L8m0M5k43K93q2k04l7P1j44N70j10j57K4
$$ -116 56 -141 1 -25 -95 -42 203 310 85 66 104 64 109 -134 159 77 -127 -164 -93 -237 333 223 66 90
695I0J95l1l37K76j43n1m0J97j57j04J76j48m4J77j00J73J05l50K91l7M2j56O4
$$ 90 285 254 -83 193 50 -1 -41 156 -1 -105 71 -77 -121 56 -44 129 234 -116 175 138 180 24 88
718H8k19L6K00j8j25j23L10q0J1Q9l21J2J99J6l96M15J88m74J63k01J64K1Q7o5
$$ 88 -131 -95 105 87 -38 -161 149 69 80 169 -152 -140 59 75 -321 94 282 -192 -29 -230 -66 -45 42 -23
742b3M9r5m1M70j61l09N6j2j15K89k5j70J9L0LK0mJ76j18j99K21K1J28k30n7N
$$ -23 26 -69 -110 360 199 -110 -54 -66 -181 108 83 -87 -68 -38 -35 -15 -19 157 39 -160 61 82 210 -20 -77 -72
768g2K06N5N7l13n9J21q9j2K75j68r7Q2J57m22K27J56j56j97J37L79k34k5p3J7
$$ -72 134 189 246 -67 -126 -5 -94 -106 169 1 -96 -14 143 -279 -52 104 -52 -249 -112 267 33 8 -65 -48
792d8l7N9k2k2o2O6J60k34Q3l8L1O9Ok06J97np4p8O5j63N68l13K10j31l21L36
$$ -48 -85 -26 -48 -70 -132 -66 94 -140 -57 -95 -64 5 11 -195 2 -3 -77 -155 -90 -253 315 2 212 81 -240 96
818I6j06K25k98j7o3J13j88K16k21n2M28J30j92J24j45k44K47m6q0j40J14J30
$$ 96 -10 215 -83 -100 -163 -50 -238 -22 -243 -295 133 263 71 195 50 -194 53 7 -73 -213 -99 31
840C1O3J49m79R2J23n0K36K9j90j46K42j72K81j99Q9k9j32J12j29r0J79N6J33
$$ 31 94 243 -236 -144 -21 -71 165 194 4 -142 100 -72 209 10 99 70 -62 50 -79 -169 10 66 199
863A99r9J07m04K99RJ23r4l34L85l8j16K08l15j72K19r3k1K20p7K5K00m51J33
$$ 199 100 207 -197 102 111 234 140 -194 191 153 37 245 -70 -242 -23 -116 -137 83 6 31 231 -220 -87
886h7J60J24k86K11l16P3j64L23J88j10K80l32K02l07K76k41J55l23R4j97M19
$$ -87 73 197 -89 122 -194 -121 -285 38 226 116 396 64 266 -41 235 -6 149 -174 -80 -277 142
907A42l6R1k26Lj6p7K99m28M6K18j49L88m89J71L1k63L04k33J69J40N6j41N9j68
$$ 142 106 197 -29 -26 -42 -119 180 -248 -202 16 -133 255 -234 -63 -32 -295 9 -224 -55 85 141 0 59 -109
931a09L64l96r7K42O5k17K49j19J21j36L2n1O6J42q4J11l51P7K40j89P2M0q2O3
$$ -109 255 -141 -238 4 69 -148 101 -18 103 -33 -1 -52 14 156 72 183 -168 -91 149 -40 32 72 -10 53
955E3k73K87j63LK94%l63R8J30M2j40n2nk4N18k5m65j20M18p1k02J23L00l16j10
$$ 53 -220 67 -96 -93 201 201 -162 -64 66 108 -32 -84 -89 -113 405 380 -85 -205 213 142 -60 63 363 47 -63
980f3J10q4j85K74j43J75j18J92j44k24K93r1K94j96j26j39J19N6K17l32j35J33
$$ -63 47 -37 -222 52 -91 84 -34 158 14 -210 83 -8 286 90 -36 -175 -56 0 217 -115 -250 -117
1002a17J18N4q7K07j03j7j40J19J30J13k52J69l40K16p5R9J3l24J27K53m26N73
$$ -117 1 55 -32 175 72 55 -85 34 164 277 25 194 -146 70 -5 94 107 -217 -90 163 -263 310
1024C10m28J26k02K63J00l7k24j42L63M3j00Q2k01j79L88l62J63j85J64K15j40
$$ 310 -118 8 -194 69 169 132 -92 -234 129 172 72 154 -47 -226 162 -200 -37 -222 -58 157 17
1045A7k37J05K32L7j48j5j04J20j96K91j14J26k32j02J37L0Q4k04L65j88jK40
$$ 17 -220 -115 117 154 6 -9 -113 7 -189 102 -12 114 -118 -220 -83 -53 31 -173 192 4 3 243
1067B43l28N3m3J64J43l48K85k91K0J44j36O8J82k47L31l81K24k57j7J26j01J89
$$ 243 -85 -32 -75 89 232 -116 169 -122 -102 42 -94 -26 156 -91 240 -141 83 -174 -191 -65 -166 23
1089B3r3j38J26J60o7K84l84R3j13n8P7p7K45O0K5k40K44j79K0J40k20K33j15
$$ 23 -70 -208 -82 78 11 295 -89 4 -109 -167 -90 -167 78 138 163 -77 167 -12 8 148 -72 161 46
1112D6J77k74r6j75L11l3K47o0O0r5lj59J0J62m5j92P6J75O3l64J58J85j24J43
$$ 46 223 -51 -147 -322 -11 -44 203 143 203 108 105 -54 -44 118 73 -119 -43 132 195 -169 -11 174 50 193
1136A93k11q0O5J19m68M92k31L40j69pM2k93J11Q7m50L42M10k94Q3m3J18k24J80
$$ 193 -18 -98 -33 86 -382 110 -121 219 50 43 85 -208 -97 -10 -460 -118 292 -2 81 38 156 -68 112
1159A12k80Q3M76k85l04K64J05n2J59l18J29pj18L8j98J31pn6K52l70L75j87j6
$$ 112 -168 -85 391 106 -198 66 171 119 278 -40 89 82 -36 2 -196 -65 -72 -128 124 -246 129 -58 -74
1182g4n3O2K47l00L4J11J15j17m9K80j10j47J1J27n6j9j23J35l24J33J1k2K61
$$ -74 -127 -65 182 -118 -84 27 142 25 -24 256 146 -1 10 137 81 62 -61 74 -250 -117 -106 -128 133
1205A33k12J62P9k02J88Nr6j68J90j5k34J60J03j25N8j54J61o2K04l87K89L4m33
$$ 133 -79 83 162 -40 148 153 57 -111 79 64 -170 -10 93 -32 26 -128 33 -29 175 -212 77 111 -322
1228c22N75k04n2nQ2k47K17k6k10K73k98J70L96o60J67L79l50L20j83j05K0J38
$$ -322 253 49 -3 -8 74 -173 44 18 -192 81 -217 -47 349 -311 -144 235 -115 205 22 -83 -63 75
1250G5J6j79J85K18m86Q0J78k46L64l52K22R1m30L0J9J74K07l08J90l0j08j90
$$ 75 91 -88 97 315 -171 -91 87 -159 205 -147 75 166 -264 -234 -215 -41 166 -142 48 18 -90 -280
1272b80M01K0j83J36k7oM5L0rk12L4j73N8Q0K58q6l56N02l48j09L88k32M57m32
$$ -280 121 141 -42 94 67 61 106 136 127 -85 -51 -224 -166 -86 172 86 -270 232 -116 -225 163 -69 388 -44
1296d4J15J39n03M83p3k05J7m8K58r0J9J1j21j3N2q3J17n4J3J78k42K04j24n2
$$ -44 71 210 -293 190 117 -88 -71 -119 139 49 68 79 -42 -55 -3 -86 31 -23 -10 168 -74 130 6 -46
1320d6m0j43K22J03j82N6K3j53K08j53q4O8J27J96k89K53k6k81O9m8R5J25k3k73
$$ -46 -86 -229 -7 96 -86 -30 -7 -160 48 -105 -189 -121 6 202 -87 166 140 -141 -72 -120 -25 100 77 -196
1344a96K69q3j96K37Q7r3k4J23p5j95K80n0R2L2l34J78RJ4Rj28J20J63l51N5l6
$$ -196 73 -10 -206 31 118 25 1 124 49 -146 134 84 176 208 -126 52 61 75 84 -44 76 239 -112 -57 -93
1369i3%O1k3J44Jkq8k82J98J03k40M02k84K25j38K01J01j5k84K8J92j34k66L53
$$ -93 -93 -32 -55 89 90 88 0 -282 -84 19 -221 181 -103 122 -16 185 286 271 -13 15 207 73 -193 160
1393A60p3pp1j49J93P3k01p8N7m4N1J65k7j0q4K3L7kJ33K2L8j85k3J27k00RK86
$$ 160 87 80 9 -140 53 126 -75 -153 -96 -140 -89 76 49 39 -45 -22 15 13 146 168 206 21 -2 125 -75 -66 220
1420B20l50J99p0K4K14k67j30K32l3M22p37K40n6Q7J56n45M36k1K58l60RO6q0
$$ 220 -130 69 -1 23 237 -30 -160 72 39 461 -276 -36 -92 -5 151 -394 42 21 279 -81 -72 -6 -86
1443h6n8K60J39m77J13L46l76mL2j11R3L75j22k66Q3P9o9P9J11k14k3m4P4L32
$$ -86 -144 116 255 -222 -109 237 -139 -143 -111 -222 -129 246 124 -142 -59 20 -49 30 141 -73 -96 -140 -66 266
1467B66j90j76K30r6l15K38Q0k62J24J28l05K44Q8K48j84j12j04q1J47J79J88
$$ 266 76 -100 130 34 -281 -43 37 -225 -101 27 -278 -34 54 302 118 6 -98 -179 -32 147 335
1488C35m58J31kk10K05r3J12L5k38J55J14o0L7o5K49k45k03M3o8L48j00j8k10
$$ 335 -123 8 6 -204 1 -92 20 55 -183 -28 86 26 63 -2 247 2 -201 -158 -226 122 22 4 -206
1511b06J02R1K0p5L78j42j01r8J53r9p7K98k92r3J07J6j71L16j58L19Kn15K22
$$ -206 -104 -13 7 -68 310 168 67 -31 122 23 -54 244 -48 -141 -34 -18 -189 127 -31 288 290 -225 -3
1534cj32J87J87m92J08J26K4r9J23k26K64p8k10M02l53J43j46r7L00j04Q8J78
$$ -3 -135 52 239 -253 -145 -19 5 -94 29 -197 67 -11 -221 181 -172 -29 -175 -272 28 -76 12 190
1556A90r6O5l11K77J48k88j48N5K6k4J21k1K65m43L53L8l40M27k17m5j63j67K62
$$ 190 94 159 -152 125 273 -15 -163 -108 -82 -106 15 -6 259 -184 169 207 -133 294 77 32 -131 -298 -36
1579c6J19l31L06J44j33K05m34K89j52m7M9J86Q8j3m67K3J72M4j85J86l57M93
$$ -36 83 -248 58 202 69 274 -160 129 -23 -70 -21 165 253 240 -227 -204 -32 12 -173 13 -344 149
1601A49p8k37K43J20l5J77n75q9q6M39m5j34p0L45k03j74K07J81m5l29L22m26
$$ 149 71 -166 77 197 162 339 -236 -325 -411 28 -17 -151 -221 124 -79 -253 -46 135 90 -239 83 -343
1623c43L16j11K91k68J10j56L58k36O4M1k1L4j34k4q6L66k68o7K50k50K12J78
$$ -343 -27 -138 153 -115 -5 -161 197 -39 25 66 45 79 -55 -79 -165 201 -67 -134 116 -134 78 256
1645B56l85J85k65K30J32q1j52J83j61J43l37L44l1J7J39l61O0j1K08k07J70J4
$$ 256 -129 56 -209 21 153 72 -80 103 -58 85 -252 92 61 78 217 -144 -84 -95 113 -94 76 90
1667I0k08M7K20O8l01J86M7j23J48r6K12m40K91j90J29k51K29j19J41N5k47J77
$$ 90 -118 -71 149 217 -84 102 149 26 174 78 290 -150 141 -49 80 -171 58 -61 80 135 -112 65
1689F5p3o8O7J08l21L29j1k3K5p4K22m04k4Q6J26o2M9K16l81o8K66l62K36J71
$$ 65 -8 -76 -9 99 -222 107 96 73 98 24 246 -158 -182 -96 30 -32 17 233 -148 -216 50 -312 -76 95
1713I5j16q7J53k7J00L9L4k78J06L6m2N9l37J78J1K48k23j86M05j0J07j76j61
$$ 95 -21 -108 45 18 118 157 191 -87 19 55 13 72 -265 -87 -76 172 -51 -237 168 158 265 89 -72
1736g2J54j78J10M1M5l34kJ93L1rQ6O3l33j41K51J02n7k2J94o5J51r5n4k72L21
$$ -72 82 -96 14 55 100 -234 -236 -43 -12 -21 65 128 -205 -346 -95 7 -50 -72 122 57 208 113 59 -213 108
1761A08j09Q2Q4j28J18p3n9j8k90L08j02m4Q6l8J87J3j05m8k2j2J90l08k7L35
$$ 108 -1 81 165 37 155 82 23 5 -285 23 -79 -123 -37 -75 112 125 20 -28 -50 -62 128 -180 -207 128
1785A28k0j64k22N04j51j69K82l53J98J70j02j32K69n20M97j18O2k92J40j3l8
$$ 128 108 -56 -278 226 75 -94 188 -165 33 203 101 -31 238 -282 215 97 159 -133 7 -6 -44
1806d4j2j3j4J47K7K34j95j0L3m45M45k58K79k99J22J76q1j50J09l4k23J30J17
$$ -44 -56 -69 -83 64 91 325 130 120 153 -292 153 -105 174 -125 -3 173 92 -58 51 17 -206 -76 41
1829D1l40K75J61K4r3J12k92L35j80k4P1N6k15J3K8p6K8K78l00J61J01l87R3L3
$$ 41 -299 -24 137 161 68 180 -112 223 43 19 90 146 -69 -56 -28 -104 -76 202 -98 63 164 -223 -130 -97
1853i7K11m3k03n6K22r0rO1Q1j17J32k41J48J78j04j19J1O8j45J30k14J20K15
$$ -97 114 71 -132 -188 34 -56 -65 -4 77 -40 92 -149 -1 177 73 -46 -35 33 -112 18 -196 -76 139
1876A39j87J79l36J43J25j31K93j35l5MJ16K1j45L9J6j89K61j88J97j29k41K57
$$ 139 -48 131 -205 -62 63 -68 225 90 55 59 175 196 51 90 106 -83 178 -10 187 58 -183 74
1898G4K21m36n5J08lj25M49l20m0n5K00K85j90o9j77L47q9q6j75K62l1O7k40K03
$$ 74 295 -141 -196 -88 -91 -216 233 -87 -127 -182 18 303 113 44 -133 214 125 39 -136 126 95 162 -78 125
1922A25J59r7k68O3n3j84L37k1q4L66k21k56J15q1N2J7J83k57j28R9j00O9K40
$$ 125 284 187 -81 -18 -71 -255 82 61 -23 343 122 -134 -19 -100 -48 -31 152 -105 -233 -134 -234 -165 75
1945G5L0k63M99k87j56J11Jl9j79J82r0m9K56J32j23oo1l99K20m4L01j37J5J44
$$ 75 105 -158 341 54 -102 9 10 -29 -208 -26 -116 -165 91 223 100 94 33 -366 -146 -190 111 -26 -11 133
1969A33J54l64J53k10P4K63j67o1O0jJ19j46j2J63j18k68J23M9K55R5m18J91k63
$$ 133 287 -77 76 -134 -60 203 36 -25 35 34 153 7 -5 158 40 -228 -105 -56 199 294 -124 67 -196
1992a96K12k13J2r3M97j93J87k62p1Q5J87Pl53P3J41j11K22O1p7k08K28K9l0j19
$$ -196 16 -197 -185 -278 219 26 213 -49 -120 -35 152 159 -194 -121 20 -91 131 192 115 -93 135 164 134 15
2016A5n9Q3O7k39J94k05J97j76K71k78J82n8M39m55K49L9l56K86k18O4k09J01
$$ 15 -44 39 106 -133 61 -144 53 -123 148 -130 52 -6 433 -22 227 266 -90 196 -22 42 -167 -66
2038f6o5J47n3K44r0k14j11L41l8l5p8O5qJ16J43k69j0J28N9j4j02L6q3j15R6
$$ -66 -131 16 -37 207 117 -97 -208 133 95 60 -18 47 39 155 298 29 19 147 206 192 90 126 43 -72 24
2063B4p6P6k09K36J20k83K3K09Q0l51M26l53j2K70K1k72J69j58J97j57j41J43
$$ 24 -52 24 -185 51 171 -112 -89 120 200 -151 275 -78 -90 180 201 -71 98 -60 137 -20 -161 -18
2085a8Q9j63m9J90K63k33O8k84K84o3j27J38l16K29Oj4O1Q1n5O2o6j18j83J5P8
$$ -18 71 -92 -141 49 312 79 147 -137 147 84 -43 95 -221 8 14 0 61 142 87 149 83 -35 -218 -203 -125
2110a25J85P0j94m1l0J7K55j90LL37m34K75k28j16NJ80P9q6J59p6l9n8K79Ok64
$$ -125 60 130 -64 -105 -135 -118 137 -53 -50 287 -147 128 -100 -216 -211 -31 48 -38 121 45 6 -52 227 233 -31
2135c1J16L4j10J04j56J86p9j48K66k05K8j18j8K62r2q1j4J38L3k81J07M1k85
$$ -31 85 119 9 113 -43 143 64 -84 182 -23 5 -113 -131 131 39 -42 -56 82 115 -166 -59 -18 -303
2158c03K92J18k7LQ7j43J5n0j30L13j36R3j50jk54K78M1J5j70P0r3J26K29k9P7
$$ -303 -11 107 80 83 170 27 42 -8 -138 175 39 132 -18 -19 -273 5 46 61 -109 -39 -132 -6 223 194 271
2183B71k13j84K7L75l73J56j53J84q9O5j51K42l01J77k0K63k44r9J21r2K9j32
$$ 271 58 -126 -99 276 -97 59 -94 90 1 66 -85 157 -144 33 13 276 32 -67 54 -38 -9 -141
2205a41K64l20L66l07M6m0K12j63R0j39j31R5J02j84N0L34l2j93J9K4Q5j08R8
$$ -141 123 -197 169 -138 -92 -132 80 -83 7 -132 -263 -168 -66 -250 -200 134 102 -91 -72 -48 37 -71 27
2228B7j23K13l65L33J28j49j23j7J49J56k09j57K44rJ9l06J13J69K10m88J00L11
$$ 27 -96 117 -248 85 213 64 -59 -76 73 229 20 -137 107 98 117 -189 -76 93 303 -185 -85 226
2250B26k35j56K22q4N8J70j69k50J11mM7J78l33K34j69J84j98K93q1Q8k8J22l53
$$ 226 -9 -165 57 -27 31 201 32 -218 -107 -111 -64 114 -219 15 -154 30 -168 125 44 132 104 226 -127
2273a27O1k9K2K2k65K27N4K20l0k04j9L34k01p8m0K2K07j93q7K27j47Q3R4j2K42
$$ -127 -66 -95 -73 -51 -316 -89 -35 185 155 -49 -68 266 65 -13 -53 -31 176 -17 -104 123 -24 59 153 141 383
2298C83k53k22P4K3O6pQ1k51K55k07K26j20J38j46J3J61l8p8k10L9J7K3P2k51
$$ 383 130 -92 -18 5 71 64 145 -106 149 -58 168 48 186 40 53 214 176 98 -112 -73 -56 -33 39 -212
2322b12L99m7o5j13L13j48j10M4j53K82k12N0j69Q9l5r8L21l17j19M68m16K30
$$ -212 187 140 75 -38 275 127 17 61 -92 190 -22 28 -141 -52 -87 -185 136 -181 -300 168 -248 -18
2344a8Q4l2K15l76J3M33k92k38J65J07k36J64O7L1j38K04k79j2N3K9L15l88O7
$$ -18 66 34 249 -127 -114 319 27 -211 -46 61 -175 -11 56 87 -51 153 -126 -138 -85 -56 259 -129 -62
2367f2r5J43K6q5K47k75P3L54l82j64J10K15j18n9o7K67j4k22Q1J71K6r8J4J58
$$ -62 -157 -14 12 -73 174 -101 -28 326 -56 -220 -110 105 -13 -72 -139 128 114 -108 -27 144 170 72 86 244
2391B44l99J66p0q9L68l7k53Q2j50K64Ok70M19l12N8M6J0l09n6J16J72K29L8k52
$$ 244 -155 11 -59 -148 220 183 -70 12 -138 126 132 -138 281 -31 27 73 83 -226 -282 -166 6 235 273 21
2415B1J09k3n2j09j85K96J46l19J14J4L1J79m31K27J06j75J63k18k27J95J31K3
$$ 21 130 107 55 -54 -239 57 203 -116 -2 12 43 222 -209 18 124 -51 112 -106 -333 -138 -7 16
2437A6m8j96J79N0O8L20l85J17l7j39K14k41J7J38Nj14j51L78l18J45L9l4k07
$$ 16 -32 -228 -49 1 69 389 4 121 84 -55 159 -82 -65 73 78 -36 -187 191 -127 18 57 23 -184
2460a84L43l89q8L46k2J98j34j17Q7K2k32L42l64K79J01k06p7Q9K16k52j49K94
$$ -184 159 -230 -318 28 6 204 70 -47 40 62 -170 172 -192 87 188 -18 -95 -6 210 -42 -191 103
2482A03o7m8j54nK98n3K7r6k50L59j19j10r4M2K01P3k66K61K1Kl78J44J55J0j76
$$ 103 36 -12 -166 -171 127 74 101 5 -245 114 -5 -115 -209 -167 34 107 -159 102 123 125 -253 -109 46 56 -120
2507a20Q9J60m35N31m06K16n5R2qJ12ok84J0J0K44k96J13j02O0k54M01O0k85K47
$$ -120 -31 129 -306 225 -181 35 -20 72 64 176 170 -114 -104 -94 150 -146 -33 -135 -75 -329 72 132 -153 94
2531I4j56j39L73k48N9p4N7L4J60K5k19J38j67Q4j4j4J44M8j50o5J86M8j75j92
$$ 94 -62 -201 172 -76 -17 -91 -34 0 160 185 -34 104 -63 21 7 -7 137 185 35 -30 156 204 29 -163
2555a63lj27K46J86K6M8k64L6J89k5j25j7j03Q5j84K02k15K60R2P0l28L5J5P5
$$ -163 -166 -293 -47 139 165 213 -51 -15 174 149 24 7 -96 -11 -195 7 -208 52 144 214 -114 -79 -64 11
2579A1K05j96J86k31r3R5mJ35j85K44k29M0n0Q6J07j85P9m6l4Q4Q2l4k14L53j92
$$ 11 216 20 206 -25 -118 -23 -27 108 -77 167 -62 -22 -72 14 121 -64 15 -31 -65 19 101 67 -147 206 14
2604A4K2J36n9k94K68j82M48m68Q2J02q5m3Q6J1K32l67j2M4j4q1r2J99J20K49
$$ 14 36 172 113 -181 87 -95 353 -115 -33 69 -16 -59 27 38 270 -97 -109 -65 -79 -160 -252 -53 67 316
2628C16k87J17k5O3n06L87j20m5o5L92k72l59L07j59J30OJ44m7j52K67l02J93
$$ 316 29 146 121 184 -322 65 -55 -100 -165 227 -45 -404 -97 -256 -126 -120 24 -23 -175 92 -210 -17
2650a7J65o3m41L60j0Qj2L9p1j69J34J98j52j31J91k1r4j85L20J2j06J17n6K2
$$ -17 148 85 -356 4 -6 2 -10 29 -42 -211 -77 121 -31 -162 29 8 -86 -271 49 61 -45 72 16 38
2674C8J49k50J63j29R6j48O0K79j32j08k8p5J77j18j71J36R5k91J88P6O5j75K61
$$ 38 187 -63 100 -29 67 -81 -21 258 126 18 -10 -85 92 -26 -197 -61 34 -257 -69 7 72 -103 158
2697A58k95j08K43J12p5k05K60k98K89K2j13J64k07J22N9K0l07j5L72q5o9j91
$$ 158 -137 -245 -2 110 35 -170 90 -208 81 103 -10 154 -53 69 128 148 -159 -174 198 113 44 -147
2719a47o5Q0J45K1o6j3k35K48m8o7p2K64k03K74j00k18O0l5o4r7N4K01K09j04
$$ -147 -212 -132 13 34 -32 -45 -280 -32 -80 -147 -219 45 -158 116 16 -202 -142 -177 -241 -338 -284 -83 126 22
2743B2k20K94K6l42q8L67k01J09j47L94k20m6L06j83k71J75J70k05Q9P9m4J88
$$ 22 -198 96 122 -220 -308 59 -142 -33 -180 214 -6 -52 254 71 -200 -25 145 -60 29 108 64 252
2765B52j51j85L1M5o9J66n9m69N73J00l9q8K80l21J06r1j13J53l88K97L54n27
$$ 252 101 -84 -53 -8 -77 89 30 -439 134 234 195 107 387 66 172 81 -32 121 -267 30 384 -143
2787a43L31m17L53j08J42j65K00l76j35L47j77P4J16n1k2j09L80l77J36kn7K19
$$ -143 188 -229 124 16 158 -7 193 -183 -318 29 -148 -74 42 -9 -31 -140 240 -137 -1 -3 -60 159
2809A59N6j15k46K18q4Q7k24K65om03K81J89k37K89J7j61j59J82k09J90j32J56
$$ 159 215 100 -146 72 -12 75 -149 116 110 -293 -12 177 -60 229 246 85 -74 108 -101 89 -43 113
2831A13j62J44q0P6JKq0j07K17j49J12J36k15J15o5k84J71K5r2J69J01p1j88K07
$$ 113 -49 95 15 91 92 94 14 -93 124 -25 87 223 8 123 58 -226 -55 -30 -122 47 148 77 -111 96
2855I6j54m3k4J3P5j25K37l48L69k18K25O1k26K46k26Q3Q1q9k24J19J5J2l9J28
$$ 96 -58 -101 -125 -112 -37 -162 75 -273 96 -122 103 164 -62 184 -42 41 122 33 -191 -72 -57 -45 -84 44
2879D4o7k42L45l0k79L34m1n9L0k48j01L30J92k90r1J97j33M8N8PP7j50M4R7p5
$$ 44 -23 -265 80 50 -229 105 64 5 35 -213 -314 16 208 -82 -173 24 -109 -61 -3 4 81 -69 -25 72 -3
2904cl21N31m05J84p8K66k21J78j44L26m60jJ28j29J59J83o2j33j96K6N5n5J42
$$ -3 -324 207 -198 -14 -92 174 -47 131 -13 313 -147 -148 -20 -149 10 193 131 -2 -198 -172 -117 -172 -30
2927c0j6L8j23J30P4j31K37k59J33q8K4j84K98l63M27k18j82L84j09P3o9J3j14
$$ -30 -46 -8 -131 -1 73 -58 179 -80 53 -35 -11 -195 103 -260 167 -51 -233 151 42 115 46 59 -55
2950e5J54k20J48p1J13m7k47M70k71R5o8P0k88K10K3K07p7k1k27J6R9J26k80J69
$$ -55 99 -121 27 -44 69 22 -225 245 -26 69 1 71 -217 -7 16 223 146 125 -102 -86 13 139 -141 28
2974B8R6j59O2J61j99j56L67j14l15K15oQ8j63j14K97nj30l8K16k32r7L38k09
$$ 28 124 -35 27 188 -11 -167 200 86 -229 -14 -20 68 -95 -209 88 83 -47 -85 131 -101 -198 140 -69
2997f9j23L06k55lR4L4q5J30j45j41J50J14j88J53j25K2L80p7k61K60k13J95K4
$$ -69 -192 114 -141 -144 -50 -16 -101 29 -116 -257 -107 7 -181 -28 -153 -131 249 172 -89 171 -42 153 177
3020A77J14l25p5N9l9j6J59o5Q8k2n3l1j71K11q7m7nk8K4k2K92j39M8n3K33j38
$$ 177 291 -34 -109 -50 -89 -105 54 -11 77 55 2 -29 -200 11 -76 -123 -128 -156 -132 -154 138 -1 47 -6 227 89
3046H9k58L75k00kj22K57j21j0m4J01k67j9J60K56l64O1K79k76R6M9N7j59m4J40
$$ 89 -169 206 6 4 -118 139 18 8 -36 65 -202 -221 -61 195 -169 -108 171 -105 -9 40 97 -62 -106 34
3070C4O4J5o4J38j92M4j84L78j52n7J9j50R2p2j29J53o9J6R6J91K5r3j41N4K47
$$ 34 98 113 49 187 -5 39 -145 233 81 24 43 -107 -15 -87 -216 -63 -132 -116 -20 171 196 103 -38 16 263
3095B63q4k18J15j9nJ64k30J25M8M9m06K52j4Q9j2m00J05J26P2rO7O7k04m6j28
$$ 263 179 -39 76 57 52 216 -14 111 159 208 -198 54 40 129 117 -283 -178 -52 20 11 78 145 -59 -105 -233
3120b33L32j3j8J06k58N6on8o5k7K29N7p3r4J19k03K52l35L23N3j72K19j46m0
$$ -233 99 86 68 174 -84 -28 -34 -92 -157 -184 45 102 29 -65 54 -149 103 -232 91 144 -28 191 45 5
3144EK78k62j32J52K4k1m8k66J93O2j31K66k09K49k24L23r8l88L91n9j80R5K37
$$ 5 283 21 -111 41 65 44 -4 -270 -77 -15 -146 120 -89 160 -64 259 161 -227 164 105 -75 20 257
3167B57j80j62J25kj26L9J77j16K31k91k09M32j50j34J04K33k59K89k03J08j27
$$ 257 77 -85 40 38 -88 -49 128 12 243 -48 -257 175 25 -109 -5 228 -31 258 55 163 36
3188C6J15j03J43J2j47k16Q5J69L9l10J38j62j37K06J92Kj65R1O2R1j59J83k75
$$ 36 151 48 191 203 56 -160 -75 94 133 -177 -39 -201 -338 -132 60 62 -103 -12 50 141 -18 165 -110
3211a10j05J43qOQ7M2J50k72M3K19j70N1j71L32m70Q3J38l6R2k09J05J69l45J5
$$ -110 -215 -72 -80 -74 13 55 205 -67 -24 195 25 76 -95 237 -233 -150 -12 -48 44 -165 -60 109 -236 -221
3235b21N3j5L06N3j76Q7j42j56N60k4l10P4K88k46R2j39m3j18lJ5K21K27n95K43
$$ -221 -168 -183 123 176 0 87 -55 -211 349 325 15 89 377 131 223 84 41 -77 -80 -65 156 383 -212 31
3259C1j17J33k35K62k84Q4M7L4j29M4mK80n4k75K40k25J54k34Q7N1n6L32k17j06
$$ 31 -86 47 -188 74 -210 -126 -79 -45 -174 -130 -134 146 92 -183 57 -168 -14 -248 -161 -110 -166 166 -51 -157
3283a57J02L5K29m07J61J65k8j97N9r6K17j98L04l90K41J83k77J63JP1q6Q1m25
$$ -157 -55 -20 209 -198 -37 128 100 -97 -38 -134 83 -115 189 -201 40 223 -54 109 110 181 95 176 -249
3306b49J29Q9L04j39l25K90Mj94K16k86J88l4Jj60%K7K32QJ5j30p3R7j19J26J25
$$ -249 -120 -31 273 134 -191 99 103 -91 125 -161 27 -7 -6 -166 -166 -139 93 101 116 -14 -87 10 -109 17 142
3331A42p2j5J74l87L88j78o2J29l24K85J50k78K50k34J94k5l1K44k92pJ6j50J63
$$ 142 70 55 229 -158 230 52 -10 119 -205 80 230 -48 202 -32 162 137 106 350 58 51 67 -83 80
3354H0q6L4l2j78j44K05J87j44O5j16N5j53J60Q2L2K14m05M7J39k2j61K21r4l32
$$ 80 -6 28 -4 -182 -326 -121 66 -78 -13 -129 -74 -227 -67 15 47 261 -144 -97 42 20 -141 80 -14 -346
3378c46R0O5K54K78n91K16j97K24N8m2l8L22j18j58o3o3J95r4L9K2qJ8K34n11
$$ -346 -256 -191 63 341 -250 -34 -231 -7 51 9 -29 293 175 17 -46 -109 86 -8 31 53 45 63 297 -214
3402b14l5K72o1K18l23n5L96k88J31J27r3k18M25l35M8k00K88qr5K33o22M07Q1
$$ -214 -249 23 -38 180 -143 -198 198 -90 41 168 75 -143 282 -53 -5 -205 83 75 -20 213 -409 -2 79
3425G9r8Lo5K09j43J1n5%j73L63k08K77j66o5J6J79n3m9K0j2r1M5J64J10j17q4
$$ 79 -19 -16 -81 128 -15 -4 -59 -59 -232 131 -77 200 34 -31 -15 164 111 62 82 70 -21 24 188 298 181 97
3451I7m46M76j20j52J31J00j28M6o8o9K26j45l60N79k36M8L2J92k48M7ml0K72
$$ 97 -349 127 7 -145 -14 86 -42 4 -64 -133 93 -52 -412 167 -69 -21 11 203 -45 2 -2 -32 240
3474B40j40k76Q1n7J11N7QN0k73J49J60o6K8j35m0J53q6M6N4j98L1K60k11N3O6
$$ 240 100 -176 -95 -152 -41 16 24 74 -199 -50 110 44 72 -63 -103 50 -36 10 64 -134 -103 157 -54 -1 65
3499F5Kjk19J31K18j25j51J59Pk8j17R9J44m16K10K53n69L70n4K84j63r5j38j15
$$ 65 67 66 -153 -22 196 71 -80 79 86 58 -59 40 184 -232 -22 231 -338 32 -22 262 99 4 -134 -249
3523b49l3K20K94j80oJ17j3k06j75M8J70j41L10l96J39M8o8k1K43j93J49r5l3
$$ -249 -282 -62 232 52 46 163 150 -56 -231 -183 -13 -154 156 -240 -101 -53 -121 -142 101 -92 57 -38 -71
3546g1j95O34p0m39Q2Kj68K79J09j38J7l71J61K12J02r6j76j8J14l56L66j48M00
$$ -71 -266 368 298 -141 -59 -57 -225 54 163 25 42 -329 -168 44 146 50 -126 -144 -30 -386 -20 -168 232
3569B32k57K27l08J95k79J84k4j3r9J84k63K64O6j16N3m6J24j68M1J0J55l86J37
$$ 232 -25 202 -106 89 -190 -6 -30 -43 -142 42 -221 43 109 -7 46 0 124 -44 -3 7 162 -224 -87
3592h7J85j93L35l62m2K11k44K35N4j39m7j63J5L00l6J28J12k54j22K69k41K09
$$ -87 98 -95 240 -122 -164 47 -197 38 92 -47 -94 -257 -242 58 22 150 262 8 -114 155 -86 123
3614A23n0p6r2k53L0L45K5k6L71k76q6K12m76J71J50j68J08P5O0J00j58j3l3p1
$$ 123 73 -3 -95 -348 -318 27 52 26 397 121 35 247 -229 -58 92 -76 32 107 167 267 109 96 63 -8
3638hq8K76l8k80O9k93M12k6QK85l87J74k2K55j96Pj76K19n0j62k04J74p9p8K41
$$ -8 -96 180 142 -138 -69 -362 50 24 32 317 -70 104 82 337 141 148 -28 191 141 -21 -225 -51 -130 -208 33
3663C3J72R8k43l9J77l43N9r4R8J02L0J04k12Q1l75M55k85J71k2l5L5M5K53m4
$$ 33 205 303 60 21 198 -145 -86 -180 -82 20 50 154 -58 23 -352 103 -182 -11 -33 -68 -33 12 265 221
3687B21m39J37j00L43q2j68K88p2j56k5K22O1k27j14M32k71k57M10l98q9L44l2
$$ 221 -218 -81 -181 162 80 -88 200 128 -28 -53 169 230 3 -111 321 50 -207 203 -195 -284 60 28
3709B8J64k27J19j42L44l67J34L2k87M94l57J78j51l08K90j17K23j31M6K75p2
$$ 28 192 -35 84 -58 286 -81 53 85 -202 292 -65 113 -38 -346 -56 -173 50 -81 -35 240 168
3730A68k20K16k49L4J62k63J25l32O49j09N5k89J04k24K51J01l39K22l2J31r0
$$ 168 -52 164 -85 -51 111 -152 -27 -359 290 181 236 -53 51 -173 78 179 -160 62 30 161 71
3751G1K8J40k95OM34m40L7k05L04l3Q1k56P9K55j5m90K11J06Mj89K53J21k71O0
$$ 71 99 239 -56 -50 384 -56 -19 -224 80 47 128 -128 -49 206 191 -299 -88 18 22 -167 86 207 -64 -4
3775dJ71k73O6j69K27o1o2P6j75J35L18j47M5j35M3k09L55k47J61j15n3J98l14
$$ -4 167 -106 -40 -209 18 -43 -105 -29 -204 -69 249 102 147 12 55 -154 201 -46 115 0 -53 145 -169
3798a69L21L9q9k73J12k00M93j61q7Q9K6k7Q2j73j07K39k71J85Q5Kl42m5J80K99
$$ -169 152 191 102 -171 -59 -259 234 73 -14 75 101 74 156 -17 -124 115 -156 29 114 116 -226 -271 -91 208
3822B08p9p0j9j22J95j22k33L29m03J73m4R0l9L12n6o9J04j80l9k4L9j76J53L50
$$ 208 129 59 40 -82 113 -9 -242 87 -316 -143 -187 -97 -136 176 120 51 155 -25 -64 -88 -49 -225 -72 278
3846B78j63l50L23k73J08J1J29j33j01K62j23M4J14J4j09n4J13l12L02pj91J45
$$ 278 115 -235 88 -185 -77 -66 63 -70 -171 91 -32 12 126 140 31 -23 90 -222 80 73 -118 27
3868B7j06J05K11m71J41J50L5oq5J61N8l71K9R2Q9M6l2J07k58K63l5j76o9R5Q8
$$ 27 -79 26 237 -234 -93 57 92 86 1 162 220 -151 -122 -30 59 105 73 180 -78 185 150 -26 -95 0 88
3893H8m35J57L72l17M1j36M46o2l07J44O2Q6N0l45K74j03L7p4J67N7Qj19j30J31
$$ 88 -347 -190 182 -135 -94 -230 216 154 -153 -9 53 139 189 -156 118 15 52 -22 145 202 210 91 -39 92
3917I2P0j78m9J86k58J12K65k68K72n37M11R6J31l72J6L23k37p8l4J82k41J29
$$ 92 162 -16 -65 121 -137 -25 240 -28 244 -293 118 214 345 -27 -11 312 75 -3 -37 145 -96 33
3939C3J25L4j46k67M27m66qL05k2j65J79P1k32K20o6N9M1p7l07p3J26L72Jl9k72
$$ 33 158 192 46 -221 206 -260 -268 37 15 -150 29 100 -132 88 22 81 122 45 -262 -335 -209 163 164 125 -147
3964a47k6J89Jk55K23n8L35j59J2m3J32k19K81l39J63j15j17J19k3J9q4K43o0
$$ -147 -173 16 17 -238 -15 -73 262 103 115 72 204 -15 266 -73 90 -25 -142 -23 -46 -27 -111 132 72
3987G2m7J38k15j6N4l5K62k55K90l88J35l9J60n3R6l19K0K14p2K9k70J41K7J65
$$ 72 25 163 -52 -68 -14 -49 213 -42 248 -140 -5 -44 116 63 159 -160 -140 74 2 31 -239 -98 -71 94
4011I4Q1P4k77o3K44j25K9j99K22k40N9j9j17J99K53k66k03P0J62o5J46L2J00
$$ 94 175 249 -28 -91 153 28 57 -142 80 -160 -101 -120 -237 -38 215 -51 -254 -184 -22 -87 59 91 191
4034A91k37k7k16M14J02j39j21J46k67K67k88M5j8J53j99J50k6L4J42m07K18J37
$$ 191 -46 -73 -289 125 227 88 -33 113 -154 113 -175 -130 -148 5 -194 -44 -70 -36 106 -301 -83 54
4056E4j41J38k22Q8K48k95J75j51J18k88M8J62Q5O9K6O8l35K92k99K15j0j07j96
$$ 54 -87 51 -171 -83 165 -130 45 -106 12 -276 -228 -66 19 88 114 182 -153 139 -160 55 45 -62 -258
4079b58J59J31j01J0J19k8J27j69n0R9jq9j17J64o1P3pL6Q3M7m1r4j03K34k6l4
$$ -258 -99 32 -69 -59 60 32 159 -10 -60 39 38 -51 -168 -4 -65 8 1 37 120 167 126 32 -71 163 137 103
4105A03k54j27L20m7k51J97k5j86q3M22k57J17L4k7K25j25j17J57r9LK01q8j89
$$ 103 -151 -278 42 -5 -256 -59 -84 -270 -353 69 -188 -71 -37 -64 161 36 -81 76 -23 -20 181 93 -96
4128i6K16k18K20j05J40l81K35k86M26j45j71J45p6L38k70K16k71O7q6N9Q3o3
$$ -96 120 -98 122 17 157 -224 11 -275 151 6 -165 -20 -96 242 -28 188 -83 -16 -102 -43 40 -23
4150b3M8j05K11j87o7J72l6P5p4J91k04q2l06L52J72j20Q7l7j96R6rJ21j4o6j16
$$ -23 25 -80 131 -56 -123 49 13 88 14 205 1 -81 -387 -35 137 17 104 67 -129 -33 -42 79 65 -1 -117
4175a17J86pm4Q3j58J89j27LJ31%o8p9R4M4j67L6j87K18K78m59J41K78j06j60
$$ -117 69 62 18 101 -57 132 5 8 139 139 71 -8 86 130 -37 -1 -188 30 308 -151 -10 268 162 2
4199Bj4K3ql0j34j42J48K43K52l46J09R4o1j87j04J15p7J00m27P64l42J2L2P3
$$ 2 -12 11 3 -27 -161 -303 -155 88 340 -6 103 197 136 -51 -155 -40 -117 -17 -444 320 -22 -10 22 95
4223I5j62n6K65j75O8P6k73L51k48m1N5l6J55j95J09L8j24k2j7K55j16JJ14j91
$$ 95 -67 -123 142 -33 35 111 -162 189 -59 -100 -45 -81 74 -121 -12 26 -98 -120 -137 118 2 3 117 -74
4247g4K04k91J57P6k41q3N77j06j68J29P9k82l9R9P6j70J87j86M0NK3M0j36K02
$$ -74 130 -161 -4 72 -169 -252 325 219 51 180 259 -23 -62 37 113 -57 130 -56 -16 -11 12 52 -84 118
4271A18J21k12j53q5L39j95L3%n8P0MkK0l1j7K45k34r3K69L1k43J83%k00J11J22
$$ 118 239 27 -126 -211 128 -67 -34 -34 -92 -22 -18 -20 0 -31 -48 197 -37 -130 139 170 -73 110 110 -90 21 143
4297A43k89L43m04L33m74L65J03j31o2j2j35K31K3K05k13J48k91J41N2m07M94
$$ 143 -146 197 -207 126 -348 17 120 -11 -73 -85 -220 11 34 239 26 174 -117 24 76 -331 163
4318A63j80j68J14P5j44N4L68q8n62L22r1L05K9j62J6Q1o1J9m15K56K28l52K03
$$ 163 -17 -185 -71 4 -140 -86 282 194 -368 -46 -137 168 197 35 51 132 71 90 -325 -69 159 -193 10
4341A0Q6j60K64mj75J48k71R4K52l62K82n8L4n8r1j25l2K81L1k6K9j07j29J30
$$ 10 96 -64 200 196 21 169 -102 -8 244 -118 164 106 140 82 -9 -134 -166 115 146 120 149 42 -87 43
4365D3K0k19j18J40J36J83k45L5j83M82j61k16J99j04k32K08K00J5n6k01L43k42
$$ 43 63 -156 -274 -134 2 185 -60 -25 -208 274 113 -103 96 -8 -240 -32 168 183 127 -74 269 27
4387B7j14L78k52j54L1J54l5ol7L2K6j58K05j25k1l5j33K94J05%j03J72k70J16
$$ 27 -87 291 39 -115 -84 70 35 29 -8 24 50 -108 97 -28 -49 -84 -217 77 182 182 79 251 -19 97
4411I7j10o2N1o2K89l56K63J3j35o5k3NL74l70J10k19L43r0J0j76k2L90l23J26
$$ 97 -13 -75 -24 -86 203 -153 110 123 -12 -77 -100 -95 279 -91 19 -200 143 53 63 -113 -135 255 -68 58
4435E8m5k49R5J91J91nj59j34rk1k3m0k25K96K0J46o8k4J05jkm8k12K43j79j97
$$ 58 13 -236 -141 50 241 236 77 -57 -66 -87 -110 -150 -375 -79 -59 87 19 -5 100 99 97 49 -163 80 -99 -296
4461b96M47l12K94j07J75K16n51J51pK8k43J36Q9q9L46j78m77L96J00l00M58m03
$$ -296 151 -161 133 26 201 417 -134 17 10 38 -205 -69 20 -69 277 99 -378 18 118 -182 276 -127
4483a27j79M10R6j52k40L57k84P0kr8K72K4l31R3L51j03k82J20j80j17L93r5J16
$$ -127 -306 104 200 48 -192 165 -119 -49 -51 -149 123 147 -184 -91 260 157 -125 -5 -185 -302 91 -4 112
4506A12k42J07R7n8N7M2l21N19l49o9M6J33m0j33L10j28j50q9J53J11j38J83k06
$$ 112 -130 -23 74 16 73 115 -206 313 -36 -105 -59 74 34 -99 211 83 -67 -156 -3 108 -30 153 -53
4529e3j03M9R9J48j52n7K2J90k13Q2j68K37l8J28qr7j28J2J91l27L06k14K68j0
$$ -53 -156 -107 -8 140 -12 -69 -47 143 -70 12 -156 81 43 171 163 66 -62 -50 141 -186 120 -94 174 164
4553A64l23P9J12P1j23K32j31q8k03L53n3k84M50o70N44l23l1M3j61J67L2L04
$$ 164 -159 -80 32 103 -20 212 81 -7 -210 143 90 -194 256 -414 130 -193 -224 -181 -342 -175 -143 161
4575A61j01M9o8p0j02P5j59K39L2N9j40r9K68P7k25O3q0J61J53l32QK63j48k60
$$ 161 60 109 41 -29 -131 -56 -215 24 56 115 -25 -124 144 221 -4 59 -21 140 293 -39 -31 232 84 -176
4599a76K59j79K3k9r7K72l1q7o0J5L31j57j63q8k5J21r6M18l65L06j57J4j71K56
$$ -176 83 -96 -73 -102 -199 73 42 -45 -105 -90 241 84 -79 -167 -192 -71 -167 251 -114 192 35 49 -122 134
4623A34k30O2j24K26N2m0k43l6R2J01M6j71k6O5J55O5k40J50j99j54L69R9k57
$$ 134 -96 -34 -158 68 120 80 -163 -199 -107 -6 40 -131 -157 -92 63 128 -112 38 -161 -315 54 153 -104
4646a04N0L98k55m8k1l09L89j67j5J99j60N2J53n56L97R4l22J23J19k73K03J60
$$ -104 -54 344 89 41 20 -289 100 -67 -82 117 -43 9 162 -394 3 97 -225 -102 17 -256 -53 107
4668A07l3J8j59J80j65K25j49j91J77R4j32J00j61Q6j63j70N73j48j89J6K43l6
$$ 107 74 92 -67 113 -52 173 24 -167 10 104 -28 72 -89 -3 -166 -336 237 89 -100 -84 159 123
$$ [...]
8191B79
##END NTUPLES=NMR FID
##END=
