##TITLE=1H_Pr NCS-1H
 200.13Hz, CDCl3.
 8 sc
 
 10.4.2026
##JCAMPDX= 6.0         $$ Bruker NMR JCAMP-DX V2.0
##DATA TYPE= NMR FID
##DATA CLASS= NTUPLES
##ORIGIN= UXNMR, Bruker Analytische Messtechnik GmbH
##OWNER= pz
$$ XWIN-NMR		Version 3.5
$$ Fri Apr 10 14:24:37 2026 Russian Standard Time (UT+4h)  she@DPX200
##.OBSERVE FREQUENCY= 200.131
##.OBSERVE NUCLEUS= ^1H
##.DELAY= (6, 6)
##.ACQUISITION MODE= SIMULTANEOUS
##.ACQUISITION SCHEME= undefined
##.AVERAGES= 8
##.DIGITISER RES= 18
##SPECTROMETER/DATA SYSTEM= spect
##.PULSE SEQUENCE= zg30
##.SOLVENT NAME= CDCl3
##.SHIFT REFERENCE= (INTERNAL, CDCl3, 0, 14.3821)
##AUDIT TRAIL= $$ (NUMBER, WHEN, WHO, WHERE, WHAT)
$$ ##TITLE= Audit trail, XWIN-NMR		Version 3.5
$$ ##JCAMPDX= 5.01
$$ ##ORIGIN= Bruker BioSpin GmbH
$$ ##OWNER= she
$$ F:/spectra/data/she/nmr/H-C/1/audita.txt
$$ ##AUDIT TRAIL=  $$ (NUMBER, WHEN, WHO, WHERE, WHAT)
(   1,<2026-04-10 14:23:44.95 +0400>,<she>,<DPX200>,
      <created by zg, POWCHK disabled, PULCHK disabled
       configuration hash MD5:
       00 E9 B6 7A A2 85 ED C7 34 08 36 98 17 FE 4E 26
       data hash MD5: 16K
       E6 AC 09 99 BD 40 38 5F 90 B6 AC AF 55 C3 3F 1A>)
$$ ##END=
$$ 
$$ hash MD5
$$ A0 3E B0 42 44 A1 52 73 CD AF 81 35 99 13 1D 41
##$RELAX= 
##$RELAX= 
##$RELAX= 
##$RELAX= 
##$RELAX= 
##$RELAX= 
$$ Bruker specific parameters
$$ --------------------------
##$DU= <F:/spectra>
##$EXPNO= 1
##$NAME= <H-C>
##$PROCNO= 1
##$TYPE= <nmr>
##$USER= <she>
##$AMP= (0..31)
100 100 100 100 100 100 100 100 100 100 100 100 100 100 100 100 100 100 
100 100 100 100 100 100 100 100 100 100 100 100 100 100 
##$AQSEQ= 0
##$AQ_mod= 1
##$AUNM= <au_zg>
##$AUTOPOS= <>
##$BF1= 200.13
##$BF2= 200.13
##$BF3= 200.13
##$BF4= 200.13
##$BF5= 200.13
##$BF6= 200.13
##$BF7= 200.13
##$BF8= 200.13
##$BYTORDA= 1
##$CFDGTYP= 0
##$CFRGTYP= 5
##$CHEMSTR= <none>
##$CNST= (0..31)
1 1 145 1 1 1 1 1 1 1 1 1 1 1 1 1 1 1 1 1 1 1 1 1 1 1 1 1 1 1 1 1 
##$CPDPRG= <>
##$CPDPRG1= <>
##$CPDPRG2= <>
##$CPDPRG3= <>
##$CPDPRG4= <mlev>
##$CPDPRG5= <mlev>
##$CPDPRG6= <mlev>
##$CPDPRG7= <mlev>
##$CPDPRG8= <mlev>
##$CPDPRGB= <>
##$CPDPRGT= <>
##$D= (0..31)
0 0.7 0 0 0 0 0 0 0 0 0 0.03 0 0 0 0 0 0 0 0 0 0 0 0 0 0 0 0 0 0 0 0 
##$DATE= 1775816624
##$DBL= (0..7)
120 120 120 120 120 120 120 120 
##$DBP= (0..7)
150 150 150 150 150 150 150 150 
##$DBP07= 0
##$DBPNAM0= <>
##$DBPNAM1= <>
##$DBPNAM2= <>
##$DBPNAM3= <>
##$DBPNAM4= <>
##$DBPNAM5= <>
##$DBPNAM6= <>
##$DBPNAM7= <>
##$DBPOAL= (0..7)
0.5 0.5 0.5 0.5 0.5 0.5 0.5 0.5 
##$DBPOFFS= (0..7)
0 0 0 0 0 0 0 0 
##$DE= 6
##$DECBNUC= <off>
##$DECIM= 32
##$DECNUC= <off>
##$DECSTAT= 4
##$DIGMOD= 1
##$DIGTYP= 9
##$DL= (0..7)
0 120 120 120 120 120 120 120 
##$DP= (0..7)
150 150 150 150 150 150 150 150 
##$DP07= 0
##$DPNAME0= <>
##$DPNAME1= <>
##$DPNAME2= <>
##$DPNAME3= <>
##$DPNAME4= <>
##$DPNAME5= <>
##$DPNAME6= <>
##$DPNAME7= <>
##$DPOAL= (0..7)
0.5 0.5 0.5 0.5 0.5 0.5 0.5 0.5 
##$DPOFFS= (0..7)
0 0 0 0 0 0 0 0 
##$DQDMODE= 0
##$DR= 18
##$DS= 0
##$DSLIST= <SSSSSSSSSSSSSSS>
$$ [...]
##$SUBNAM0= <"">
##$SUBNAM1= <"">
##$SUBNAM2= <"">
##$SUBNAM3= <"">
##$SUBNAM4= <"">
##$SUBNAM5= <"">
##$SUBNAM6= <"">
##$SUBNAM7= <"">
##$SUBNAM8= <"">
##$SUBNAM9= <"">
##$SW= 18.0517599122864
##$SWIBOX= (0..15)
0 0 2 0 0 0 0 0 0 0 0 0 0 0 0 0 
##$SW_h= 3612.71676300578
##$TD= 16384
##$TD0= 1
##$TE= 0
##$TE2= 300
##$TE3= 300
##$TEG= 300
##$TL= (0..7)
0 120 120 120 120 120 120 120 
##$TP= (0..7)
150 150 150 150 150 150 150 150 
##$TP07= 0
##$TPNAME0= <>
##$TPNAME1= <>
##$TPNAME2= <>
##$TPNAME3= <>
##$TPNAME4= <>
##$TPNAME5= <>
##$TPNAME6= <>
##$TPNAME7= <>
##$TPOAL= (0..7)
0.5 0.5 0.5 0.5 0.5 0.5 0.5 0.5 
##$TPOFFS= (0..7)
0 0 0 0 0 0 0 0 
##$TUNHIN= 0
##$TUNHOUT= 0
##$TUNXOUT= 0
##$USERA1= <user>
##$USERA2= <user>
##$USERA3= <user>
##$USERA4= <user>
##$USERA5= <user>
##$V9= 5
##$VALIST= <valist>
##$VCLIST= <CCCCCCCCCCCCCCC>
##$VD= 0
##$VDLIST= <DDDDDDDDDDDDDDD>
##$VPLIST= <PPPPPPPPPPPPPPP>
##$VTLIST= <TTTTTTTTTTTTTTT>
##$WBST= 1024
##$WBSW= 4
##$XGAIN= (0..3)
0 0 0 0 
##$XL= 0
##$YL= 0
##$YMAX_a= 794890
##$YMIN_a= -967528
##$ZGOPTNS= <>
##$ZL1= 120
##$ZL2= 120
##$ZL3= 120
##$ZL4= 120
##$ABSF1= 10
##$ABSF2= 0
##$ABSG= 5
##$ABSL= 3
##$ALPHA= 0
##$AQORDER= 0
##$ASSFAC= 0
##$ASSFACI= 0
##$ASSFACX= 0
##$ASSWID= 0
##$AUNMP= <proc_1d>
##$AZFE= 0.1
##$AZFW= 0.1
##$BCFW= 1
##$BC_mod= 2
##$BYTORDP= 1
##$COROFFS= 0
##$CY= -3
##$DATMOD= 1
##$DC= 2
##$DFILT= <>
##$DTYPP= 0
##$F1P= 0
##$F2P= 0
##$FCOR= 0.5
##$FTSIZE= 0
##$FT_mod= 4
##$GAMMA= 1
##$GB= 0.15
##$INTBC= 1
##$INTSCL= 1
##$ISEN= 128
##$LB= 0.25
##$LEV0= 0
##$LPBIN= 0
##$MAXI= 10000
##$MC2= 0
##$MEAN= 0
##$ME_mod= 0
##$MI= 1.114404
##$NCOEF= 0
##$NC_proc= 0
##$NLEV= 6
##$NOISF1= 3.799351
##$NOISF2= 2.8
##$NSP= 1
##$NTH_PI= 0
##$NZP= 0
##$OFFSET= 14.38212
##$PC= 1
##$PHC0= -3704.564
##$PHC1= 12.39231
##$PH_mod= 1
##$PKNL= yes
##$PPARMOD= 0
##$PSCAL= 0
##$PSIGN= 0
##$REVERSE= no
##$SF= 200.129724274929
##$SI= 16384
##$SIGF1= 3
##$SIGF2= 2
##$SINO= 400
##$SIOLD= 16384
##$SREGLST= <1H.CDCl3>
##$SSB= 0
##$STSI= 0
##$STSR= 0
##$SW_p= 3205.1282051282
##$SYMM= 0
##$S_DEV= 0
##$TDeff= 0
##$TDoff= 0
##$TI= <>
##$TILT= no
##$TM1= 0
##$TM2= 0
##$TOPLEV= 0
##$USERP1= <user>
##$USERP2= <user>
##$USERP3= <user>
##$USERP4= <user>
##$USERP5= <user>
##$WDW= 1
##$XDIM= 8192
##$YMAX_p= 0
##$YMIN_p= 0
$$ End of Bruker specific parameters
$$ ---------------------------------
##NTUPLES= NMR FID
##VAR_NAME=  TIME,          FID/REAL,        FID/IMAG
##SYMBOL=    X,             R,               I
##VAR_TYPE=  INDEPENDENT,   DEPENDENT,       DEPENDENT
##VAR_FORM=  AFFN,          ASDF,            ASDF
##VAR_DIM=   8192,          8192,            8192
##UNITS=     SECONDS,       ARBITRARY UNITS, ARBITRARY UNITS
##FACTOR=    0.0002768,     1,               1
##FIRST=     0,             0,               0
##LAST=      2.2672688,     0,               0
##MIN=       0,             -967528,         0
##MAX=       2.2672688,     794890,          0
$$ Real data points
##PAGE= N=1
##DATA TABLE= (X++(R..R)), XYDATA
$$ [...]
1967B19k37R6K84l29K79l86j7R0j35J47j50k2J03J63m3R3Mk19J16J92m21M26j53
$$ 219 -18 78 362 33 312 -74 -91 -1 -136 11 -139 -161 -58 105 62 155 159 -60 56 248 -173 253 100
1990A00l12L08%J89j88j65K44j90k43K70j2M9N8j68J40J18j23k92L6L99k82J7
$$ 100 -212 96 96 285 97 -68 176 -14 -257 13 1 50 108 -60 80 198 75 -217 -181 218 -64 -47
2012d7ro3J26NL47l21O6k91n0p0M72j19J49k1k21q1K64k03j1J7%O4Q5L3Ql7q1
$$ -47 -56 -119 7 12 359 38 104 -187 -237 -307 165 46 195 174 -47 -128 136 -67 -78 -61 -61 3 88 121 129 92 11
2039A1J32k33Q7J07q5l8J12J88l06r1r6M14l24k19K94J78q6O2J45l12O1J72j49
$$ 11 143 -90 -3 104 19 -19 93 281 -25 -116 -212 202 -122 -341 -47 131 45 107 252 -60 1 173 24
2062B4K7k23J50pq1J12J42l77M20m21J30J00J62j87L1R7k05M56l12M6K73m91K16
$$ 24 51 -172 -22 -29 -110 2 144 -233 187 -234 -104 -4 158 -29 2 99 -106 350 38 84 357 -134 82
2085H2j18P0K32l82P5J41j31N0j41L97k66K88j29m3r9j62J75K4k55J46J45l55
$$ 82 -36 34 266 -116 -41 100 -31 19 -122 275 9 297 168 125 26 -136 39 63 -192 -46 99 -256
2107b56K47N1p3qJ90k1j7J5J40l97N9J53J7K3l28R3O1J33k53K48M6l78N5P5P5
$$ -256 -9 42 -31 -39 151 130 113 128 268 -129 -70 83 100 123 -205 -112 -51 82 -171 77 123 -255 -200 -125 -50
2132e0k29K60m34L51J58N4j43M6l2q8L11Mn9l01L14Mj25J9j45j3L01j84K49k61
$$ -50 -279 -19 -453 -102 56 110 -33 13 -19 -107 204 208 149 -152 162 166 41 60 -85 -98 203 19 268 7
2156Gn8j63J41J29J97l21J03k46K09J09l53J28J75j16O8j32J74q9Q2J61k53K72
$$ 7 -51 -214 -73 56 253 -68 35 -211 -2 107 -246 -118 57 -59 9 -123 51 -38 44 205 -48 224
2178B24k46J71pl23L16l03K37Kj29J21M7RrK9o6M4PO7l12R3K16k10Q1mk25L07
$$ 224 -22 149 142 -181 135 -168 69 71 -58 63 110 119 110 139 73 117 124 191 -121 -28 188 -22 59 55 -170 137
2204A37Q5k78L33l12J06j42J70n8J05j27o0K68l75J62K2j27N9J24K9l07J28R9
$$ 137 222 -56 277 -35 71 -71 99 41 146 19 -41 227 -148 14 36 -91 -32 92 121 -186 -58 41
2226D1q0J15K33m04M1P5J88j27K4j77N6M5j16J59k00L19j42J03j56q6n0L96k84
$$ 41 -39 76 309 -95 -54 21 209 82 106 -71 -15 30 -86 73 -127 192 50 153 -3 -89 -139 257 -27
2249b7n5K72m7jk33K38O3n06L22j95L66l85L11k7O2l17J58j26NL33l14K02k0J13
$$ -27 -82 190 143 142 -91 147 210 -296 26 -169 197 -188 123 96 158 -159 -1 -127 -122 211 -103 99 79 192
2273A92k90J03J12J52l58J88Nj12J2J15k05R9J13k80K49K76k97O9k79J38J53k49
$$ 192 -98 5 117 269 -89 99 104 -8 4 119 -86 13 126 -154 95 371 74 143 -136 2 155 -94
2295i4R0K14q9j28J63l8j34J49R4m54K81m7j32K40j51K2m5j15J37L04m57J48O6
$$ -94 -4 210 121 -7 156 118 -16 133 227 -227 54 7 -125 115 -36 -14 -59 -174 -37 267 -190 -42 24
2318B4q9J03j45L9k45L71J17l1l25L07j24O6k58M02k93K8Q6J24j50j77M96l76
$$ 24 -65 38 -107 -68 -313 58 175 144 -181 126 2 68 -190 212 -81 -53 33 157 7 -170 326 -50
2340e0J08M5l04J70K54k84J00k44Q1j10J46K02l5J34l29J64K05o5k83J33Ml4m5
$$ -50 58 103 -201 -31 223 -61 39 -205 -124 -234 -88 114 79 213 -116 48 253 188 -95 38 42 8 -37
2363c7J27K10m08K23J06m40R0K75J46k04R6j82N8m4k1K7j48L06p4j4J9k00K09
$$ -37 90 300 -108 115 221 -219 -129 146 292 88 184 2 60 16 -5 22 -126 180 106 92 111 -89 120
2386A20j68J93j94J81n1J41j96k98J92J61N9J38m21K09O0j69k06K67J4k02K5K72
$$ 120 -48 145 -49 132 81 222 26 -272 -80 81 140 278 -143 66 126 -43 -249 18 32 -170 -145 127
2408A27j52l62K26K35Q0k28N6L5j32j92K08J56m2O1p7K17l33O8j43J30Q2p5J11
$$ 127 -25 -387 -161 74 154 -74 -18 17 -115 -307 -99 57 15 76 -1 216 -117 -49 -192 -62 20 -55 56
2431E6l15J07J62P3l1p9J18l78M70k60O1k5K46Jk84J97l79L62k79K34j12N9N7
$$ 56 -259 -152 10 83 52 -27 91 -287 183 -77 -16 -41 205 206 -78 119 -260 102 -177 57 -55 4 61
2454F1j79l2Q5kO6K8j25K87k04j60L66k45lL03m14L30k30K68r0k86J95j61K38
$$ 61 -118 -150 -65 -67 -1 27 -98 189 -15 -175 191 -54 -57 246 -168 162 -68 200 110 -176 19 -142 96
2477I6o6J50r6l22j32P08p82M95j02J09k12J18K18M8j13L1K2j65j05K6R7q6L0
$$ 96 30 180 84 -238 -370 338 -444 51 -51 58 -154 -36 182 230 117 148 170 5 -100 -74 23 -63 -33
2500c3lj12J6O4k68K59J39j12K96k90PLJ81k04k36L6K97p9N3j64J28L40m53L21
$$ -33 -36 -148 -132 -68 -336 -77 62 -50 246 -44 -37 -34 147 -57 -293 -257 40 -39 14 -150 -22 318 -135 186
2524A86k45o9l1J76R0p9m9j89M08j80m7J14k47J56J87j45m9j3l8l0p9J24j68J45
$$ 186 -59 -128 -159 17 107 28 -21 -210 198 18 -29 85 -162 -6 181 36 -13 -26 -64 -94 -173 -49 -217 -72
2548g2j74L96N2j9l1J18m08j39L28J04l51M4J92J36j76R9O2k71l4k5J67j0o9L8
$$ -72 -246 150 202 183 152 270 -138 -277 51 155 -196 -152 40 176 0 99 161 -110 -144 -169 -2 -12 -81 -43
2572d3L06Q4m09L2p7K80j67j8J55J31j0k16J4p0l00N04k83j16P3K14K3k41R3J00
$$ -43 263 347 -62 -30 -107 173 6 -12 143 274 264 48 62 -8 -308 196 -87 -203 -130 84 107 -134 -41 59
2596E9j65Pj16K72j02Q3K16j93j51J01P3j63N0J64Om11K12J66m3k41R3J7J19o7
$$ 59 -106 -99 -215 57 -45 38 254 61 -90 11 84 -79 -29 135 141 -270 -58 108 65 -176 -83 -66 53 -14
2620a4N2j32N5j97%L13k29L58J6k07k98K75J93k53J69m01M2J62j19l6K15n3m5
$$ -14 38 -94 -39 -236 -236 77 -152 206 222 15 -283 -8 185 -68 101 -300 -258 -96 -215 -251 -36 -89 -134
2643a34M38l73K98l22L97l58O9J83j66k1L59n59J62J10l9M2k26K26P1K8j54L60
$$ -134 304 -69 229 -93 304 -54 15 198 32 11 370 -189 -27 83 44 86 -140 86 157 185 31 391
2665C91l98j9J2J6K87q8k28Q2k99J31K13r2p2LR4J11J70l13L2J11O5l06O5j1j
$$ 391 -7 -26 -14 2 289 201 -27 55 -244 -113 100 8 -64 -61 33 144 314 1 33 144 209 -97 -32 -43 -44
2690d4j72q3J46J82j59J47J29j58j26L00l04kJ51j3Q9j68K27K2k41j42J8L60k00
$$ -44 -216 -299 -153 29 -130 17 146 -12 -138 162 -142 -144 7 -6 83 -85 142 164 -77 -219 -201 159 -41
2713d1K27j01Kl5j38J13j65J25J30n3o6o1q9J07l0K06j80J43J28m0k92J5PJ57
$$ -41 186 85 87 52 -86 27 -138 -13 117 64 -2 -63 -152 -45 -75 131 -49 94 222 182 -110 -95 -88 69
2737F9j9j19K7J44nk73L86m98J77M4L62m72j41J69K04l9J09k02q0O0K15k12J49
$$ 69 50 -69 -42 102 97 -176 210 -288 -111 -67 295 -177 -318 -149 55 16 125 -77 -157 -97 118 -94 55
2760E5k0k86J41K4J09k59K05j12J99p4jJ9J61k88K88n01J84N0K45m36K92J73l13
$$ 55 35 -251 -110 -86 23 -236 -31 -143 56 -18 -19 0 161 -127 161 -340 -156 -106 139 -297 -5 168 -145
2783a45M06m03K96j13j42k6K48j68J24o9J67k26J0j15J39N4N9P8r4k88K49k15
$$ -145 261 -142 154 41 -101 -127 121 -47 77 8 175 -51 -41 -156 -17 37 96 174 80 -208 41 -174
2805a74k5L2L54j57n5n7K20j91j6K07m5m08L35J92j67J11J7l28L96l10L19j07
$$ -174 -199 -167 187 30 -25 -82 138 -53 -69 138 93 -315 20 212 45 156 173 -155 241 -69 250 143
2827A43Rj39k60J04J01Q5j01J67M9Nn1k33K24L4j87M3J48k60o7K80K96l44j31
$$ 143 152 13 -247 -143 -42 43 -58 109 158 163 112 -121 103 137 -50 -7 141 -119 -186 94 390 46 -85
2850h5L13k25r7o7M71l1l51o6l1M19k84R7j47L5q4K88O1k52K35j96P0r7J55m5
$$ -85 228 3 -94 -161 310 279 -72 -138 -169 250 -34 63 -84 -49 -133 155 216 -36 199 3 73 -24 131 86
2874H6P8j46l17K03K51O8k56r4P9K17K1o4m7q8j03L67m69N08n80M94k33J70j61
$$ 86 164 18 -299 -96 155 223 -33 -127 -48 169 190 126 79 -9 -112 255 -214 294 -286 208 -25 145 -16
2897a6K93k74n24O25o3l2k91L75l35J63J45n3nj24L23m31K82o8N4K5j13n8L05
$$ -16 277 3 -521 104 41 9 -282 93 -242 -79 66 13 8 -116 207 -224 58 -10 44 69 -44 -102 203
2920B03J36l11J36l14M43j83P0j48j92J13L0jk62L93j63L2j54o6M35k67p7L10
$$ 203 339 28 164 -150 293 110 180 32 -160 -47 -17 -18 -280 113 -50 -18 -172 -238 197 -70 -147 163
2942A63j59qn5QL37k31j09j04Q5L19j56j22J63n78M44J44l19J09K33j47j20K57
$$ 163 4 -4 -59 -51 286 55 -54 -158 -73 246 90 -32 131 -447 -3 141 -178 -69 164 17 -103 154
2964A54K4m09K44m0M3k92K81j87M58n09L27k62KL24k31K27l40L04j87j18J53K93
$$ 154 178 -231 13 -27 16 -276 5 -182 276 -233 94 -168 -166 158 -73 154 -186 118 -69 -187 -34 259
2986B59q8m09J68m8q4K80k59Kk19L66J23k25J22J58n9j6l20J71m8J20J74p9j50
$$ 259 171 -238 -70 -118 -202 78 -181 -179 -398 -32 91 -134 -12 146 87 71 -249 -78 -126 -6 168 89 -61
3009f1nJ81j98J68J62m40M1L33r8j0j69m1L78l3mm96J84j36R8j82J64K34j9j32
$$ -61 -66 115 -83 85 247 -193 -152 181 83 73 -96 -137 241 208 204 -292 -108 -244 -146 -328 -164 70 51 -81
3033h1M2O8%m4m5J3n2N3K45j46j38K42j07k37M08l04M7j73L07k04L29l25J61j9
$$ -81 -39 29 29 -15 -60 -47 -99 -46 199 53 -85 157 50 -187 221 -83 -36 -209 98 -106 223 -102 59 40
3057D0m0K93k63K6j28J99n7J33k41j99L88j22K54m02q3K09o5q4J03j48RJ10L0
$$ 40 0 293 30 56 -72 127 70 203 -38 -237 151 29 283 -119 -202 7 -58 -142 -39 -187 -178 -68 -38
3080c8Q1K5R2j42L7Q1m3J27k52j48J12L1J6K06q0o6j14J84m02J58L59o4l69Q2
$$ -38 43 68 160 18 55 136 93 220 -32 -180 -68 -37 -21 185 105 39 -75 109 -293 -135 224 160 -209 -127
3104a27P4j73K46r6Q8P0n3J27j68N7j58K16k96L35m08J18K61m3p1k7K05j10j04
$$ -127 -53 -226 20 -76 12 82 29 156 -12 45 -113 103 -193 142 -266 -148 113 70 -1 -28 177 67 -37
3127c7j37J92j1j4j07K39q6n4K70l10J25j12J56j41k77N87l09o6K62j50k79R8
$$ -37 -174 18 7 -7 -114 125 39 -15 255 -55 70 -42 114 -27 -304 283 -26 -92 170 20 -259 -161
3149a61M1O8Q7k26N3J16M3j83pK60k97O0K52l69J86j11P5K09m49M38L0l22L86
$$ -161 -120 -52 35 -191 -138 -22 21 -162 -169 91 -206 -146 106 -263 -77 -188 -113 96 -353 85 115 -207 179
3172A79j40K23l15K03k66J49K0r3K84j45q1M7p8p4R7J78l04K06j88J68j58J18
$$ 179 39 262 -53 150 -116 33 53 -40 244 99 18 65 -13 -87 10 188 -116 90 -98 70 -88 30
3194C0P0l07M7K62M6m83R4K71P8j77N6K26k37K0j27K35k5O2k32K17j6r5j3K0o1
$$ 30 100 -207 -160 102 148 -335 -241 30 108 -69 -13 213 -24 -4 -131 104 79 141 -91 126 110 15 2 22 -39
3219c9Q0j14K63K2k63Q1j28M8p0J76j56K27p9j07j9K26j77q7J88J79p1m52J06
$$ -39 41 -73 190 212 -51 30 -98 -50 -120 56 -100 127 48 -59 -78 148 -29 -116 72 251 180 -272 -166
3242a66K56R9k72j18rL15r5J61j83K6L8lj37l4J43k47K17k69M64J35l17J31j62
$$ -166 90 189 -83 -201 -210 105 10 171 -12 14 52 49 -88 -122 21 -226 -9 -278 186 321 4 135 -27
3265b7K1K2J05J24k13J22lm76J98p2L03J54l45J64k71J21K4o2K46N3K8j98K45
$$ -27 -6 16 121 245 32 154 151 -325 -127 -199 104 258 -87 77 -194 -73 -49 -111 135 188 216 18 263
3288B63j81j90m6J94j40J17o8K84k40l04K45L93q9l46j18M99k42p1j4R1k3P1J24
$$ 263 82 -108 -154 40 -100 17 -51 233 -7 -311 -66 327 238 -108 -226 273 31 -40 -54 37 14 85 209
3311B09k11k63M31n3j69K82l4n2p5j14j05K20l00n1L39k48J6K64N5k40J46M1n2
$$ 209 -2 -265 166 113 -56 226 192 140 65 -49 -154 66 -234 -285 54 -194 -178 86 141 -99 47 88 36
3334C6q5J9P9L4r8J10M6K6k71K6K48k80J54o4J69k31m4L11k14L11k77P5j65k9
$$ 36 -49 -30 49 83 -15 95 141 167 -104 -78 170 -110 44 -20 149 -82 -126 185 -29 282 5 80 -85 -114
3358a14k05M22q8K11l92PM01k80q3l1K41j59l48L86k9l37M11M47o30J79K71j83
$$ -114 -319 103 15 226 -166 -159 242 -38 -121 -152 89 -70 -418 -32 -61 -398 13 460 -170 9 280 97
3380I7O6k57K42q7j24n7P1J05K13k09Q8j3J26j35j40j37L87k58J39q3j98J80j85
$$ 97 163 -94 148 61 -63 -120 -49 56 269 60 148 135 261 126 -14 -151 236 -22 117 34 -164 16 -169
3403a69O1J24J5Nj71K13J5k4o1k3j58M8N9J31Pq2k16Q8K42j19N1L23k84O8L6j0
$$ -169 -108 16 31 36 -135 78 93 69 8 -15 -173 -125 -66 65 72 -10 -226 -138 104 -15 36 359 75 143 179 169
3429A69p0m30K84P2J41j99k6N2K51j77j44J62l19J79J31r9N3J33j34N9k45K96
$$ 169 99 -331 -47 25 166 -33 -59 -7 244 67 -77 85 -234 -55 76 -23 30 163 29 88 -157 139
3451A39k60n7L36j08j76j9J35R8o9r4j6j09L9K27L2Rj9j32J17j67L30k64K72q7
$$ 139 -121 -178 158 50 -126 -145 -10 88 19 -75 -91 -200 -161 66 98 107 88 -44 73 -94 236 -28 244 157
3475A57J0l72K48r7OJ59o3J51oj15j52M53l94LJ81n5p0M4j1J52j59l7OM7k46J68
$$ 157 167 -205 43 -54 -48 111 48 199 193 78 -74 379 -15 -12 169 114 44 88 77 229 70 33 39 86 -160 8
3501Hr0j04J25k2n4K96j43p7J5J7K94k68PQJ07J72m80L25r0Q2k52P0J61j36k71
$$ 8 -82 -186 -61 -83 -137 159 16 -61 -46 -29 265 -3 4 12 119 291 -189 136 46 128 -124 -54 107 -29 -300
3526c00K33j82N19l59J59J02j49n7RLk74M38J33Pl26J51k08J76j91M2j91M00R9
$$ -300 -67 -249 270 -89 70 172 23 -34 -25 -22 -296 142 275 282 -44 107 -101 75 -116 -74 -265 135 234
3549B34m65L13q5j94J66j21j80J01M10O6j57J9j4m1p5J48o3l7J86K43n27Q7n0
$$ 234 -231 82 -3 -197 -31 -152 -332 -231 179 245 88 107 93 52 -23 125 62 25 211 454 -73 14 -36
3572c6j49L81q4K7m35M74k05J2j10M00j76k46J09j07L4M7J15m7j32K20j42P8k13
$$ -36 -185 196 112 139 -296 178 -27 -15 -125 275 99 -147 -38 -145 -111 -64 51 4 -128 92 -50 28 -185
3595a85K76r2K61k91O2Kk15J5J73K15o5l21J99p6R0Rj77R3J58kk59J01j79K67
$$ -185 91 -1 260 -31 31 33 -182 -167 6 221 156 -165 34 -42 48 57 -120 -27 131 129 -130 -29 -208 59
3619E9J9j84K90M8m26K02N1j7L06k17m35K33j96M55m8k08K84j42q9j66J1K74j20
$$ 59 78 -106 184 232 -194 8 59 42 348 131 -304 -71 -267 188 140 -68 216 74 -15 -181 -170 104 -16
3642a6O5j93P1K77J3m44M04j15O5j83j0K95j86n5J03o5l1O1j67O2j05K17j50J60
$$ -16 49 -144 -73 204 217 -227 177 62 127 -56 -66 229 43 -12 91 26 -5 56 -111 -49 -154 63 -87 73
3666G3j6M5m3o5k01K56L7j8j80L40l96J38J60j7j82J98k72PK46j52j1K2L32l54
$$ 73 57 102 59 -6 -207 49 86 68 -112 228 -168 -30 130 113 -69 129 -143 -136 110 -42 -53 -31 301 -53
3690e3n1L22k11p3j81R1J06J65j33j9K3L0k00K54r0k4K33o0j48J13k9K9N4r2j16
$$ -53 -104 218 7 -66 -247 -156 -50 115 -18 -37 -14 16 -184 70 -20 -44 189 129 -19 94 65 94 148 56 -60
3715f0lk0r6K39M3P1l29K11K4n1nn2l8n8R1J81j34J05k45J74j0j01K25j93J42
$$ -60 -63 -83 -179 60 103 174 -155 56 80 29 24 -28 -66 -124 -33 148 14 119 -126 48 38 -63 162 -31 111
3740A11n6j80M3L0K21J25l18k3m7O9J60k67O8J73l3l26K76n2r5M34l96j04L05
$$ 111 55 -125 -82 -52 169 294 -24 -47 -94 -25 135 -132 -64 109 76 -250 26 -26 -121 313 -83 -187 118
3763A18J04n12L14J45m5j14j21K54k37Nj18K66Nk77OQ4J74j46k0j03L37o4J25
$$ 118 222 -290 24 169 124 10 -111 143 -94 -89 -207 59 64 -213 -207 -123 51 -95 -115 -218 119 55 180
3786A80k74L08j46lj69j28K31M0J69j96q9J19j29l2R7QJ65j6J2k54K06j88J55
$$ 180 -94 214 68 65 -104 -232 -1 39 208 12 -77 42 -87 -119 -22 -14 151 135 147 -107 99 -89 66
3809F6J73k29j35j42K85m8k1j3N0N9n6j25J68J65k70N1J59k27N8O2j2N1j98O5
$$ 66 239 10 -125 -267 18 -30 -51 -64 -14 45 -11 -136 32 197 -73 -22 137 -90 -32 30 18 69 -129 -64
3833f4N1J13KO7m06J28J92j70p9P6J48o6j85J29J65m24L23j59n3K50k38L67j80
$$ -64 -13 100 102 169 -237 -109 83 -87 -166 -90 58 -8 -193 -64 101 -323 0 -159 -212 38 -200 167 -13
3856a3n2P5J96j60J08l32o7K67j92J91q4L22l27K67m03L03k34O1k63O93m42J31
$$ -13 -65 10 206 46 154 -178 -245 22 -170 21 -63 259 -68 199 -204 99 -135 -74 -337 356 -86 45
3878D5j36J3J38j12L36J2m05p5K14j41K43j33j38J19Q7K19k00L17m26K61L17n08
$$ 45 -91 -78 60 -52 284 296 -109 -184 30 -111 132 -1 -139 -20 67 286 86 403 -23 238 555 47
3900D7J54%k29j0Rm4K09Nj12q5J06n7m5p3k1J0K05k76L08l38J49n0J64M8n9M2
$$ 47 201 201 -28 -38 -29 -73 136 141 29 -56 50 -7 -52 -125 -146 -136 69 -207 101 -237 -88 -138 26 74 15 57
3926E7k22K51j18j6J28l39L05J23p8k71L91k62J77Ok84K62j68kJ51k29J12o1M33
$$ 57 -165 86 -32 -48 80 -259 46 169 91 -180 211 -51 126 132 -152 110 -58 -60 91 -138 -26 -87 346
3949C46j98k85Q6j37N9J60O5J2o4k09J62J40k25J03J76k03M5K1j1k44l7J20k93
$$ 346 148 -137 -51 -188 -129 31 96 108 44 -165 -3 137 -88 15 191 -12 33 54 43 -201 -238 -118 -411
3972d11L39J58mk05K81k86J76o8o0N8L09l21j7k11j4K69L5r5J42Oj84m7Q9O5K77
$$ -411 -72 86 82 -123 158 -128 48 -20 -80 -22 287 -34 -51 -262 -276 -7 28 -67 75 81 -103 -150 -61 4 281
3997B81j08j81K15k48k35L27j22K6k2J64o1j59N89o52L39j84K23o1k6q5o0J85
$$ 281 173 -8 207 -41 -276 51 -71 -45 -67 97 36 -123 466 -186 153 -31 192 131 105 20 -40 145
4019A45j40j12O8qK88n09L71j23j85N6k7K97o2O9k72L67l40K6J98k59J47J65l51
$$ 145 5 -107 -39 -47 241 -268 103 -20 -205 -149 -176 121 59 128 -144 223 -117 -91 107 -152 -5 160 -191
4042a91J88l7J16K93m66K00j95R6k2N9Q9j48k6M1k63O8J50O2p7K11K07l86K05
$$ -191 -3 -40 76 369 -97 103 -92 4 -18 41 130 -18 -44 -3 -266 -198 -48 14 -63 148 355 -31 174
4065A74k29J45K91m63K78l38m7L10K29j73k77J60L86m61k04K11O7j89MK27j54
$$ 174 -55 90 381 -82 196 -142 -189 121 350 177 -100 60 446 -15 -219 -8 59 -130 -126 101 -53
4086e3j34P5L08j70J16k04J74Q4l23J15J32j11n1jJ84k88J25P9k27K46l6j48j15
$$ -53 -187 -112 196 26 142 -62 112 196 -127 -12 120 9 -42 -43 141 -147 -22 57 -170 76 40 -108 -223
4109b23K41J83L8q4l7R1pm27L31J35k09j08J13N2j9P9k81k07K05M7J10J58j09
$$ -223 18 201 239 155 118 209 202 -225 106 241 32 -76 37 89 70 149 -132 -339 -134 -87 23 181 72
4132G2J63j44k15q5L25l47J66j17K99n9%%J47m1Or7k7K69m57j05K45l8qP6J36
$$ 72 235 91 -124 -209 116 -231 -65 -182 117 58 58 58 205 164 170 73 46 315 -142 -247 -2 -40 -48 28 164
4157A64J05j25n3j55K70j42Q0l12K25j95O4L08O9m55M3J54l1k31N2J13l5K54l37
$$ 164 269 144 91 -64 206 64 144 -168 57 -138 -74 234 303 -152 -109 45 14 -217 -165 -52 -87 167 -170
4180a70R6K86k41L8k4j01K33j24J25j19j27J55P5k11Lj0m5J09j71K58j34J05k01
$$ -170 -74 212 -29 9 -15 -116 117 -7 118 -1 -128 27 102 -109 -106 -116 -161 -52 -223 35 -99 6 -195
4203a95K38j48j44M51j1j75J4J69j26K05m43J78K56m36J24m1K43l01J69r2J08
$$ -195 43 -105 -249 202 191 16 30 199 73 278 -165 13 269 -167 -43 -84 159 -142 27 -65 43
4224D3j71J42j0j00K19j70J47j12k06J87l33L13j07K08J17k40J32p8qj02L52k73
$$ 43 -128 14 4 -96 123 -47 100 -12 -218 -31 -364 -51 -158 50 167 -73 59 -19 -27 -129 223 -50
4246e0j97J42J45j62P3J40j70K38l70K19j01L54j55j7J94l09J98l97L17P7N8n30
$$ -50 -247 -105 40 -122 -49 91 -79 159 -211 8 -93 261 106 89 283 -26 172 -225 92 169 227 -303
4268c03J53k52M69K04k99R0k86J94M8r1k9J18j06J45J30j33J78k55P2K39k22J63
$$ -303 -150 -402 67 271 -28 62 -224 -30 18 -73 -102 16 -90 55 185 52 230 -25 47 286 64 227
4290B27l00L17n37K51J53j2j71j04Q5K97k98Q2l5j20J57lK01k50q7L48J2R7j90
$$ 227 -73 244 -293 -42 111 99 -72 -176 -91 206 -92 -10 -45 -165 -8 -11 190 -60 -147 201 213 310 120
4313A20j06r9K28k44Q1R8l27K90r9K45j53k4R4r3J21j02k4r3o1J64J01K5m94K65
$$ 120 14 -85 143 -101 -20 78 -249 41 -58 187 34 10 104 11 132 30 6 -87 -148 16 117 142 -352 -87
4337h7J03o8J92k31L20k05k60J16j03J29P0l0J39M6j55J71l37L96k58J02L06m38
$$ -87 16 -52 140 -91 229 24 -236 -120 -223 -94 -24 -54 85 131 -24 147 -190 206 -52 50 356 -82
4359h2Jl7Q1J98l63P5N74l46J31k14P2mk62j66L42J42J13l63L05k58j59J59J41
$$ -82 -81 -118 -37 161 -202 -127 447 101 232 18 90 86 -176 -342 0 142 255 -108 197 -61 -220 -61 80
4382H0j29O6j08O3l4j56M75m03R6p8J94rom63M98R7k57J89k67KJ47M7l2m6O1j86
$$ 80 -49 17 -91 -28 -62 -218 257 -146 -50 -128 66 57 51 -412 86 183 -74 115 -152 -150 -3 44 12 -34 27 -159
4408a59j53M14k6k05L31n02M27j47m0k23M23k46k8J94L9R3Q3o04K71K80j82L6
$$ -159 -312 102 76 -129 202 -300 127 -20 -60 -283 140 -106 -134 60 99 192 275 -329 -58 222 40 76
4430G6R5n86O18r0p4O1j87K07o8m0P0r5j10J58LJ93j45J00m18K06r2K34j86k4
$$ 76 171 -415 203 113 39 100 -87 120 52 12 82 -13 -123 35 38 231 86 186 -232 -26 -118 116 -70 -94
4454i4K70j84k6K8k52L45Q2ok98J03J88l27K90j57J55l15J40J30R5k85L44k40
$$ -94 176 -8 -34 -6 -258 87 169 163 -135 -32 156 -171 119 -38 117 -198 -58 72 167 -118 226 -14
4476a4k04K48M7J29j54lo6jj53J64j25Rj1K59k36K29n4l07N49o3K3l29M9l2J53
$$ -14 -218 30 77 206 52 49 -17 -18 -171 -7 -132 -123 -134 125 -111 118 64 -243 306 243 266 -63 -14 -46 107
4501A07k58L27k40K0k43M75j20k09J36J10o8m5k29L69m3L8k36K75k61J71nl01
$$ 107 -151 176 -64 -44 -287 188 68 -141 -5 105 37 -8 -237 132 89 127 -109 166 -95 76 71 -230
4523b30J14L72j08j87Nk37K05K1N9Pj9K27k63M3j25J26Pp1l5QM7L28j83j92N2
$$ -230 -116 256 148 -39 -34 -271 -66 -45 14 21 2 229 -34 9 -116 10 17 -54 -89 -81 -34 294 111 -81 -29
4548b9qJ19j1j80J9m0k9K39k65M12r2l9m5l41M19k88J42P7k46Q9L10J35m99J93
$$ -29 -37 82 71 -109 -90 -130 -159 80 -185 227 135 96 51 -290 129 -159 -17 60 -186 -97 213 348 -151 42
4572D2qJ46l18P3J10p3J58k82L31J30j91J79k45n3o3m3lN0J20L44j02n01j01M27
$$ 42 34 180 -138 -65 45 -28 130 -152 179 309 118 297 52 -1 -64 -107 -110 -60 60 404 302 -199 -300 127
4596A27j24r5L7k06L81k48J84n9k85K96nM2k04K0J21j98P9L29k77K78k12J59j94
$$ 127 3 -92 -55 -261 120 -128 56 -3 -288 8 3 45 -159 -139 -18 -216 -137 192 -85 193 -19 140 -54
4619e4r1J6J46J6j39l3J12j4J18j61K46j60O9j26J83J82l34k4P7JN4p0O7k42K36
$$ -54 -145 -129 17 33 -106 -139 -27 -41 77 -84 162 2 71 -55 128 310 -24 -48 29 30 84 14 81 -161 75
4644G5j28J17j27j29N39m41Q6k55P2L30l22K47N0j65Q2J04j13j20K78m9k10J83
$$ 75 -53 64 -63 -192 347 -94 -8 -263 -191 139 -183 64 114 -51 31 135 22 -98 180 131 -79 104
4666A04R6N6k40n5q4j57O50o08J97j24K37J59m20K46q6k0P1Q4j35M0j0K33m44
$$ 104 200 256 16 -39 -123 -280 370 -238 -41 -165 72 231 -189 57 -29 -49 22 106 -29 11 1 234 -210
4689b10K25j25J34L1P6j40J99j69K38j34l49k1K88J08l04M57l95n7M1K50n02O40
$$ -210 15 -110 24 55 131 -9 190 21 259 125 -224 -245 43 151 -153 304 -91 -148 -107 143 -359 281
4711B81l26K9M0k63J01P6J1J15l42L34j1j84N6N3kk04L68Oj46J08l36K35j26K01
$$ 281 -45 -16 24 -239 -138 -62 -51 64 -278 56 45 -139 -83 -30 -32 -236 132 138 -8 100 -236 -1 -127 74
4735G4K9k42m9J97n8j97M85k45j09JK65k30J6j29M40M5l32q7L17J13k22n5k93
$$ 74 103 -139 -188 9 -49 -246 239 -6 -115 -114 151 -79 -63 -192 248 293 -39 -126 191 304 82 27 -266
4758b66M04k27M3J2J4K16j91j8K17q5k36K38r4K0o3J49qP5k33J4J86j73P6j43
$$ -266 138 -89 -46 -34 -20 196 5 -13 204 119 -117 121 27 47 -16 133 125 200 -33 -19 167 -6 70 -73
4782g3J00J30J69l17k90M82k01j37M22k85N0j8l03K88J32r3j14K35n25M94j16
$$ -73 27 157 326 9 -281 201 0 -137 285 0 50 32 -271 17 149 56 -58 177 -348 146 30
4803C0L23k54j48k24L95j16N0p9r9j03K70n8n7J42j76J83j14J25n5K67j30k96
$$ 30 353 99 -49 -273 122 6 56 -23 -122 -225 45 -13 -70 72 -104 79 -35 90 35 302 172 -124
4825a24J90o1K90k67j54K39j45K53l38NK28q6O0n6l02J25M0p2OJ71k1L38o01J74
$$ -124 66 5 295 28 -126 113 -32 221 -117 -112 116 30 90 34 -268 -143 -103 -175 -169 2 -19 319 -282 -108
4849a08J76j83M57m30J89m9M8M8l77L89l43J51J38k25J98l25L64l3r9o5L71l95
$$ -108 68 -115 342 -88 101 52 100 148 -229 160 -183 -32 106 -119 79 -246 118 85 -14 -79 292 -103
4871a03K25J1r3j3O0L5j04O4j27m8K36j91O3j94L07l07j57K39Q5J07j95Q5L91
$$ -103 122 133 40 27 87 122 18 82 -45 -93 143 -48 15 -179 128 -179 -336 -97 -12 95 -100 -15 376
4894C76k66p3M5j59q3m5K05Q8J85j56J46n00L62m34M4M30lk68J5K42K7j72J51
$$ 376 110 37 82 -77 -160 -205 0 88 273 117 263 -237 125 -309 -265 165 162 -106 -91 151 178 6 157
4917A57k77P2j66L93j52J03N0l87kJ05j16J34l8Q9J23n8K56k29k82M38N0j65K22
$$ 157 -120 -48 -214 179 27 130 180 -207 -209 -104 -220 -86 -124 -35 88 30 286 57 -225 213 263 98 320
4940C20n38L39k02K07r6O5j65K36k93L14J1K0p3pk30K05R9j09p7J00p7K45k24
$$ 320 -218 121 -81 126 30 95 -70 166 -127 187 198 218 145 138 -92 113 212 103 26 126 49 294 70
4963G0k1J54l32L9K56l5j92J58p9j32m9p6L3J65p1M09m55k0K57j30j03L89k95
$$ 70 49 203 -129 -90 166 131 -61 97 18 -114 -163 -239 -206 -41 -112 297 -158 -178 79 -51 -154 235 -60
4986f0L4R5k35J39p2K52j41j48K33j05oK19k85J67j57P1N7OO1O3M3l85M0NK33
$$ -60 -26 69 -166 -27 -99 153 12 -136 97 -8 -14 205 -80 87 -70 1 58 64 125 188 231 -154 -114 -109 124
5011A24J0j79J19j04k79M23J18l39M6l15K47M7r5J08p5K19m3R1j78KJ5n3K53k04
$$ 124 134 -45 74 -30 -309 114 232 -107 -61 -376 -129 -82 -177 -69 -144 75 32 123 -55 -53 -38 -91 162 -42
5035d2j9K35k82l5J09K06j52Q0p5j16j66K52j6j91J82j85L91p1Kj88J52k99N51
$$ -42 -61 174 -108 -143 -34 172 20 100 25 -91 -257 -5 -21 -212 -30 -215 176 105 107 -81 71 -228 323
5058C23l64n9j52M90k4l35P7J60Q4k68K4o8M5R1o0j0K56l54K77l28N9M3j64J68
$$ 323 -41 -100 -252 238 214 -121 -44 116 200 -68 -44 -112 -67 24 -36 -46 210 -144 133 -195 -136 -93 -257 -89
5082h9j05L26l62J56L89l94J18j44L05k13j20K52q7j24K42j92J35j57K13l58K15
$$ -89 -194 132 -230 -74 315 -79 39 -105 200 -13 -133 119 32 -92 150 -42 93 -64 149 -209 6
5103FJ66R7j39O8o1j07j23J4M9K31k01M5j59j31L56M0j68J35m7l81M80j89j84
$$ 6 172 269 130 198 137 30 -93 -79 -30 201 0 45 -114 -245 111 151 -17 118 71 -310 170 -19 -203
5126b03L85j93K40l76K92l3k2k68P7L01m96L18m2k51J91j10K65j50O8j96K17R
$$ -203 182 -11 229 -147 145 112 90 -178 -101 200 -296 22 -20 -271 -80 -190 75 -75 -7 -203 14 23
5148B3J10k1K58l14k47K03L5k2l5J6r3K08j61J63j20k1K40j92k07K33k77K10r5
$$ 23 133 112 370 56 -191 12 47 25 -10 6 -87 121 -40 123 3 -18 222 30 -177 56 -221 -11 -106
5171a06J52qj45M02l97K22q6P0j44J70P6k55K37k56Rq0L6p3J71q8O7j32J06N6
$$ -106 46 38 -107 295 -102 120 34 104 -40 130 206 -49 188 -68 -59 -139 -103 -176 -5 -93 -26 -158 -52 4
5195DK87j74j88k56K36k3J86j45K72j05o3k63L73k17L3K5j78L07n7M4j70J99k2
$$ 4 291 117 -71 -327 -91 -114 72 -73 199 94 31 -232 141 -76 -43 -18 -196 111 54 98 -72 127 105
5218A05m9j8l02K77J18k43K21M0l27Q7J89k24Q0R7p7K17k23j0JJ65J72m45J17
$$ 105 56 38 -264 13 131 -112 109 149 -178 -91 98 -126 -46 51 -26 191 -32 -42 -41 124 296 -149 -32
5241c2K5O5n6J33k70J95k50M58l01k1J08J02k35M2M0P7J70n17L56j50M0j9J24
$$ -32 -7 58 2 135 -135 60 -190 268 -33 -54 54 156 -79 -37 3 80 250 -267 89 -61 -21 -40 84
5264H4K2O9O2k69j84L52m26K57j04J21j8J24j8j26J01K2j88o6J68j99J88m2K70
$$ 84 106 175 237 -32 -216 136 -290 -33 -137 -16 -34 90 72 -54 47 69 -119 -185 -17 -216 -28 -70 200
5287B00k12J51L1j77k62N00m24L92k33J33l69J38K29l63J98J30j75j32K13K4o2
$$ 200 -12 139 170 -7 -269 231 -193 199 -34 99 -270 -132 97 -266 -68 62 -113 -245 -32 -8 -70
5308g0J0j43J82N6K0l67M57k41p7j52L95j55nK95m42N13k67J95j66n0p0j76K70
$$ -70 -60 -203 -21 35 55 -312 145 -96 -173 -325 70 -85 -90 205 -237 276 9 204 38 -12 -82 -258 12
5331A2j28N7J62j29j4J07n0L4m5l6o6J5L75j53rj31j16J27N6k67J47L33n43J80
$$ 12 -116 -59 103 -26 -40 67 17 51 6 -30 -96 -81 294 141 132 1 -115 12 68 -199 -52 281 -262 -82
5355h2J04ORJ16j90J3n3L1N80o40J07j03l4M5K08m63L05k1n0J55j22J00m8K14
$$ -82 22 28 37 153 -37 -24 -77 -46 534 -106 1 -102 -136 -91 117 -346 -41 -62 -112 43 -79 21 -27 187
5379A87k54L18k20j45K67Q5l05M0Nj13L2L27l06J27k16J10j10K70J37k85K02p7
$$ 187 -67 251 31 -114 153 238 -67 -27 -22 -135 -103 224 -82 45 -171 -61 -171 99 236 -49 153 76
5401G6N2k41L16k83J53lj7J6j29l7J51J04k26l4K63K0n6l04K20Q8j26J2m6j41
$$ 76 128 -113 203 -80 73 70 53 69 -60 -97 54 158 -68 -102 161 181 125 -179 41 129 3 15 -31 -172
5425a72Q0J90J58j53N7M7k48l1N7J52k88L36p0j32N2k54J26J15L3j76j6K3J9K72
$$ -172 -92 98 256 103 160 207 -41 -72 -15 137 -151 185 115 -17 35 -219 -93 22 55 -121 -137 -114 -95 177
5449A77l30Q0R9J6j71o5N2K77k88J76n8L8j7O4n3l0Q6k8j32J57l44J36J53l9L14
$$ 177 -153 -73 26 42 -129 -194 -142 135 -153 23 -35 3 -14 50 -3 -33 53 25 -107 50 -294 -158 -5 -44 270
5474B70k66J54K12k87m30K48K1R1j02M6j20p7L81j46l17K61J81l10K74j6K4j94
$$ 270 4 158 370 83 -347 -99 -78 13 -89 -43 -163 -240 141 -5 -322 -61 120 -190 84 68 92 -102
5496a02J9R2j20k58K12K91l08N74m77O1M2J20j59K29k31m7K73r5j40N2j27N8K49
$$ -102 -83 9 -111 -369 -157 134 -174 400 -77 -16 26 146 -13 216 -15 -62 211 116 -24 28 -99 -41 208
5519B08oj01k8l8n2O6j45J91m8N2R0q3J37r8j40J57k09K9p5J22J58m45P14J44
$$ 208 202 101 73 35 -17 49 -96 95 47 99 189 106 243 145 5 162 -47 -18 -93 29 187 -258 456 600
5543F00L12r66j64O6k87O03q5J53n58l10J13J60M40m1p4K97n6N33r55j32K11o2
$$ 600 912 -54 -218 -152 -439 164 79 232 -326 -636 -523 -363 77 36 -38 259 203 736 -219 -351 -140 -202
5565b02O86o57P08n21J46J59k51Q5J95j59j38J90l07j51L88p2J32j34m38O51k02
$$ -202 484 -173 535 14 160 319 68 153 348 189 51 241 -66 -217 171 99 231 97 -341 310 108
5586A08R0k08k09K67L41q40Q11m84M37m51L63k43L15j93l77K62R3n33M27j10k00
$$ 108 198 -10 -219 48 389 -451 360 -124 313 -138 225 -18 297 104 -273 -11 82 -451 -24 -134 -334
5607c34N09p75N05J35m50M59K22k5n09k80J58N07k1r7J04J18n52N96O3r42N10
$$ -334 175 -600 -95 40 -410 49 271 246 -263 -543 -385 122 101 4 108 226 -326 270 333 -609 -99
5628i9L97K57q17K91j5K00J00L02m41m16N32n72M70m99KJ013o74K37l3K68o01
$$ -99 298 555 -262 29 14 214 314 616 175 -241 291 -281 189 -310 -308 705 31 268 235 503 -98
5649i8P30l29k75o29O19J46R9J91n29L66l70J84k70K40K6j46P9k96N69m19J27
$$ -98 632 303 28 -601 18 164 263 454 -75 291 -79 105 -165 75 101 -45 34 -262 307 -112 15
5670A5m67K26M04j79j68M00l52n2J24K58m64K64m00k94R46k19l25J86L53o39Q92
$$ 15 -452 -226 178 -1 -169 231 -121 -173 -49 209 -255 9 -391 -685 261 42 -283 -97 256 -383 509
5691E09j274J326m03k51R46l61J2l01n2j96m54L27j9K56P9j06M21n18k9N44r3
$$ 509 -765 561 158 -93 853 492 504 203 151 -45 -499 -172 -191 65 144 38 459 -59 -88 456 363
5712C63o32N25n95N92m69J42K49l55L2M90l46k41K5N5K86K7K38k20o6j58q2M75
$$ 363 -269 256 -339 253 -216 -74 175 -180 -148 342 -4 -245 -220 -165 121 148 386 166 100 -58 -140 335
5734C35n37O5J39k0J55n76M42l37L63j21j37J85m18Q0P9L85l02J59L4Pq0K04n03
$$ 335 -202 -137 2 -18 137 -439 3 -334 29 -92 -229 -44 -462 -382 -303 82 -220 -61 -27 -20 -100 104 -399
5757c99N02J82m35L28n04R70m22q2K95O2j55p3j15j00J88K39J58q82L68l34O63
$$ -399 103 285 -150 178 -326 644 222 140 435 497 342 269 154 54 242 481 639 -243 125 -209 454
5778D54n3l06q55P55k0m2m25O73P2k88R46n92L54q51M59o35L63k62J02L25l01
$$ 454 401 95 -760 -5 -25 -67 -492 181 253 -35 911 319 673 -178 281 -354 9 -253 -151 174 -127
5799a27j59K71K03j55O0n79L27L26j31O9m83R04J40n35j82K37n04n0O53m58l89
$$ -127 -286 -15 188 33 93 -486 -159 167 36 105 -378 526 666 131 -51 186 -318 -368 285 -173 -562
5820e62N25j58q8L08n65R92j89k65J17m80N99n14J132r17J28k83l32L92M88l08
$$ -562 -37 -195 -283 25 -540 452 263 -2 115 -365 234 -280 852 -65 63 -220 -552 -160 328 20
5840B0J03l37m22K80L46j62J9M6M41j0j34J00o71L61Q8k75O43o06l7N7J30l31
$$ 20 123 -214 -636 -356 -10 -172 -153 -107 334 324 190 290 -381 -20 68 -207 436 -170 -207 -150 -20 -351
5862c51M19K55k40R9n86O78j17K77q37M59J55n10L39L17n43K04R4j57m19M87n3
$$ -351 68 323 83 182 -404 274 157 434 -403 56 211 -299 40 357 -186 18 112 -45 -464 23 -30
5883c0l0j05L07j29K38l28J37l60j0K48K30l66J30m18J90N87j90j07m03K59j04
$$ -30 -60 -165 142 13 251 -77 60 -300 -310 -62 168 -198 -68 -486 -296 291 101 -6 -409 -150 -254
5904b54L01r4l3N7j52J87O0j04k03N44o26p5O54l56k62J68L98k52L7J54l13M69
$$ -254 47 -47 -80 -23 -175 12 72 -32 -235 309 -317 -392 262 -94 -356 -188 210 -42 -5 149 -164 305
5926C05l86L06l64M08m34k18L97N3J6Ol26m7j48L65K52J2j31l93N12k18M76n40
$$ 305 -81 225 -139 269 -165 -383 14 67 83 89 -237 -284 -432 -67 185 197 66 -327 185 -33 443 -97
5948i7M26k92o8L44m88K84L0J29l98K69m34J03L64m19K4L58K64j55m43J36M7J59
$$ -97 329 37 -31 313 -175 109 139 268 -130 139 -295 -192 172 -247 -223 135 399 244 -199 -63 -16 143
5970A43j1o08M89Q5M58l41J34k91LM34o69j37R5O59p95P47q10P46M6l96p6K74
$$ 143 132 -476 13 98 556 215 349 58 61 495 -174 -311 -216 443 -352 395 -415 331 377 -19 -95 179
5992A79k44O3J49J16n57J4K80k54m16M35P05R2q26o72O96K14J74J80J79o72N4
$$ 179 -65 -2 147 263 -294 -280 0 -254 -670 -235 470 562 -264 -936 -240 -26 148 328 507 -165 -111
6013a11L44L63p17N17p12P12L23k69K3p12Q18j406Q22P17o43M42n9l63q3j1k76
$$ -111 233 596 -121 396 -316 396 719 450 473 -239 579 -827 -5 712 69 511 452 89 6 -5 -281
6034b81N11n62o7n32R11K15M90m61J57j46m52k0N01l03n83M92o5k73Q41j63l63
$$ -281 230 -332 -399 -931 -20 195 685 224 381 235 -217 -237 264 -39 -622 -130 -195 -468 373 210 -153
6055a53m5q0J51M92o06L74J14p14Q70O3M85j480K66j81R78m33l42O91o51J270
$$ -153 -198 -278 -127 365 -241 133 247 -467 403 466 951 -529 -263 -444 534 101 -241 450 -201 1069
6075A069j044k21J92l86K51P79r14R1K06l00N25o50j41O09o1n69R43l95J54k18
$$ 1069 25 -196 -4 -390 -139 640 -274 -183 23 -277 248 -402 -543 66 5 -564 379 -16 138 -80
6095h0m4K7p1mL18K10o92L42j90O3O82j026P16j92L24K5q19k29J296j278P07N12
$$ -80 -124 -97 -168 -172 146 356 -336 6 -184 -121 561 -465 251 59 383 408 -411 -640 656 -622 85 597
6117E97m68j68O9N58o48R58k73j120O15J63l08m64J21M92J68P7n31L20J68K7n43
$$ 597 129 -39 30 588 -60 898 625 -495 120 283 -25 -489 -368 124 292 369 -162 158 326 353 -190
6138a90P91n77k26M42N74q62N5m53O83j72k38O9j54N69m14K5M51n55L76l31J87
$$ -190 601 24 -202 240 814 -48 7 -446 237 65 -173 -104 -258 311 -103 -78 373 -182 194 -137 50
6159E0J058q37j16j81L92l07J13K25n64J58R3k08M09k76l6K4J12oo5P57j471k94
$$ 50 1108 271 155 -26 366 59 172 397 -167 -9 84 -124 285 9 -27 -3 109 103 38 795 -676 -970
6181i70R36m7j2p46J347r33k64M31L61Q9k23l44M4O84m78k6j14K17m95J075K57
$$ -970 -34 -81 -93 -839 508 -425 -689 -258 103 192 -31 -375 -331 353 -125 -151 -265 -48 -543 532 789
6202G89r58N18j63k25L07o63Q10q40O9J188l95P81j085Q68r94K48J44m03L05k27
$$ 789 -169 349 186 -39 268 -395 415 -425 -356 832 437 1218 133 1001 7 255 399 -4 301 74
6222G4n4l38o1Q75o5o47N88j98m73M52j88M55p71L56m12N1J278l21m15q42j3J5
$$ 74 20 -318 -379 496 431 -216 372 174 -299 153 -35 420 -351 5 -407 -356 922 601 186 -656 -669 -654
6244f54J353p23R4j147J614j169R21L00j287K90L49J50j134Q56M5J10J39O9j43
$$ -654 699 -24 70 -1077 537 -632 289 589 -698 -408 -59 91 -1043 -187 -142 -32 107 176 33
6263C3j71L49j74r1J21Rk2n4K05R7k42K5m2q4J67J28m77P9J85k2O2J66k17o4J96
$$ 33 -138 211 37 -54 67 76 54 0 205 302 60 85 43 -41 126 254 -223 -144 41 19 81 247 30 -34 162
6288A62l67N04l07J96j28k59K42j52j29J03J75j00j09K34P8J9p2l41L08K4k2j75
$$ 162 -205 299 -8 188 60 -199 43 -109 -238 -135 40 -60 -169 65 143 162 90 -251 57 81 59 -116
6310a16J51J4Lj3p1O8k49J07L4J11m9J28k14L1J80P3k40M99k09l37j12J86J43
$$ -116 35 49 52 39 -32 36 -213 -106 -72 39 -10 118 -96 -65 115 188 -52 447 238 -99 -211 -25 118
6333A18k07J18K1J33j18J97k11RJ95l12L13j69J6J5pj18J75k12K45l56O0N0o8
$$ 118 -89 29 50 183 65 262 51 60 255 -57 256 87 103 118 111 -7 168 -44 201 -155 -95 -45 -113
6356a13Q3q2J81j2R5m71N42k94J38J01m95M42l08J45J14j7j67k7O7J09K37m52
$$ -113 -30 -112 69 57 152 -319 223 -71 67 168 -327 115 -193 -48 66 49 -118 -145 -78 31 268 -184
6378a84L1N1q6j85N07l09K2K38k66K49j20p8N11m27j28J48o0Q1l10O20k32j7j33
$$ -184 -153 -102 -188 -373 134 -175 -153 85 -181 68 -52 -130 381 -46 -174 -26 -86 -5 -315 305 73 56 -77
6401g7k28K34L35m66K66j94M4P8k32P24m26r8j1j06K74k77Q9j72K22J01r3q9O0
$$ -77 -305 -71 264 -202 64 -130 -86 -8 -240 484 58 -40 -51 -157 117 -160 -71 -243 -21 80 -13 -102 -42
6424d2Q9R6n7J87k87R8l09K16Q4j96j3J68j74l6N58o14L08k66L6K3K12mj52J26
$$ -42 47 143 86 273 -14 84 -225 -9 75 -121 -134 34 -140 -176 382 -232 76 -190 -154 -131 81 77 -75 51
6448E1k98L79O5k99R8j09J68p4j45J79j55n0J14J6J80k35M4J49K8P4l76L23K0
$$ 51 -247 132 197 -102 -4 -113 55 -19 -164 15 -140 -190 -76 -60 120 -115 -71 78 106 180 -196 127 147
6471A47j42j87L12n0j18m2P0K8Q5n9N7R2n2n4m2l24O86m10J8r3P6j7k1Q9j51J35
$$ 147 5 -182 130 80 -38 -80 -10 18 103 44 101 193 141 87 45 -279 407 -3 15 -78 -2 -19 -40 49 -102 33
6497C3J44j53J69k31J33j40Q3j37qj33L03lj29j80J43j57L66j29L18n00k9J79
$$ 33 177 24 193 -38 95 -45 38 -99 -107 -240 63 60 -69 -249 -106 -263 103 -26 292 -208 -237 -58
6519e8K56j93O8l0p6O1k31K21J35j61q8K12j64J68o2M1j28k43K92n6J79k14J68
$$ -58 198 5 73 43 -33 28 -203 18 153 -8 -96 116 -48 120 58 99 -29 -272 20 -36 143 -71 97
6542I7j43M5k11L66l44J24J41Q9j07r4j27J56n2OJ59l42M49k74PM5J73k0j06k3
$$ 97 -46 -1 -212 154 -190 -66 75 164 57 -37 -164 -8 -60 -54 105 -237 212 -62 -55 -10 163 143 37 14
6566A4O7j28L4J61p8j82K18k56P1o8M6m5N6P9p9k61M68Oo3j76K87o0Q9l35K02
$$ 14 81 -47 -13 148 70 -112 106 -150 -79 -147 -101 -146 -90 -11 -90 -351 117 123 60 -116 171 111 200 -135 67
6591F7l02P3j24K15K23k07K61l71K79N7k30j20K05K5j94M70l91q8J8J30k69K36
$$ 67 -235 -162 -286 -71 152 -55 206 -165 114 171 -59 -179 26 51 -143 327 -64 -152 -134 -4 -273 -37
6613c7J11j11K21q5rJ24k64J22j67K96k50J48P9j63J62j01k3k09j8R3j9M0N9j08
$$ -37 74 -37 184 99 90 214 -50 72 -95 201 -49 99 178 15 177 76 53 -156 -174 -81 -100 -60 -1 -109
6637a09JK45j28J43k72pK56j93j13L80m5k32K04j70p1O9M1J93J32k80K01p1k58
$$ -109 -108 137 9 152 -120 -127 129 -64 -177 203 158 -74 130 -40 -111 -42 -1 192 324 44 245 174 -84
6660h4p0K26J33j66k87N33l36K27k64L30j65l15M2K14J44k91m8L16j51q5lJ20
$$ -84 -154 72 205 39 -248 285 -51 176 -88 242 77 -238 -196 18 162 -129 -177 139 -12 -97 -100 20
6682B0P4j74NJ82j42j15J19J16k8L2j04K4Q7J21m48L07l26J30R1k71J78j92M18
$$ 20 94 -80 -75 107 -35 -150 -31 85 57 89 -15 9 96 217 -231 76 -250 -120 -29 -300 -122 -314 104
6705A04K4m9k29J75J94k00m8J11j8l41K60pP0j40K57k44N4r1j22Q9R0J2m3p0K48
$$ 104 128 79 -150 25 219 19 -29 82 64 -277 -17 -24 46 -94 163 -81 -27 -118 -240 -151 -61 -49 -92 -162 86
6730H6n1K9j12k53K91L9k48M01j92M3Q8j40M5j3l45M78l60K35O2k6k02rL49j63
$$ 86 35 64 -48 -301 -10 29 -219 182 -10 33 121 -19 26 13 -332 146 -214 21 83 57 -145 -154 195 32
6754C2k7j90n2L46r3LK3L4k60J64J80j60L8P3p8Q0q6k20R4K6R5o0R0rJ37k75L66
$$ 32 5 -185 -237 109 16 19 42 76 -184 -20 160 0 38 111 33 113 27 -193 -99 -73 22 -38 52 43 180 -95 271
6781B71m49J31J71j06n6j01K49k2r3j08J47o0J07k35J58j26K60r8p5k16K69j55
$$ 271 -178 -47 124 18 -38 -139 110 88 -5 -113 34 -26 81 -154 4 -122 138 40 -35 -251 18 -137
6803a37K82l57K03J22k29J31o9j40J64N5j08p7J19j58L52l72qJ15O5J4R2l04L41
$$ -137 145 -212 -9 113 -116 15 -54 -194 -30 25 -83 -160 -41 -199 153 -219 -227 -112 -47 -33 59 -245 96
6826I6o3N2pk70K49l0K03p6L5j82K4lm8J99j54K02l28K18j10jj39J18j50L9K75
$$ 96 33 85 78 -192 57 27 230 154 189 7 31 28 -20 179 25 227 -101 117 7 6 -133 -15 -165 -126 149
6851A49l12J0L07k16K38k93J29J05Q1n3j21P9O6j92K68j38k06L2K67k33q1R9L28
$$ 149 -163 -153 154 -62 176 -117 12 117 198 145 24 103 169 -23 245 107 -99 -67 200 -33 -114 -15 313
6874C13k76l9k40M24k63M8l07L34j7n2mj28J00L96j95L7m6j71J91m0j13j13K04
$$ 313 37 -2 -242 182 -81 -33 -340 -6 -23 -75 -79 -207 -107 289 94 131 85 -86 105 65 -48 -161 43
6897D3R9r9n9J63k63k77J32J60L5Q9jr4K39M9J19j33k12L34k03k37J18J58k12
$$ 43 142 43 -16 147 -116 -393 -261 -101 -66 23 22 -72 167 216 335 202 -10 324 121 -116 2 160 -52
6920e2j5J60K1k68M3M0j17k50K82K61l12M41l30j23L66j29P5j08j6j83lK38N1
$$ -52 -67 93 114 -154 -111 -71 -188 -438 -156 105 -207 234 -96 -219 147 18 93 -15 -31 -214 -217 21 72
6943G2O2l15L00k90K74j93K9j5k96M45o4J27L6p4j98j6R7k22K90P7k15M41k17
$$ 72 134 -181 119 -171 103 -90 -61 -76 -372 73 9 136 172 98 -100 -116 -19 -241 49 126 -89 352 135
6966A35j04m4L9K1r6J24k83J44J5JL9J97j70j20Q8J23K3Mk25J38p8o8Q8j5j94
$$ 135 31 -13 26 47 -49 75 -208 -64 -49 -48 -9 188 18 -102 -14 109 132 136 -89 49 -29 -97 -9 -24 -218
6991b18J3J70j61L09j65J47l1k9Q8j34k76J27L39M6j53o0K48j49l3N3Q5l12J4
$$ -218 -205 -35 -196 113 -52 95 64 35 123 -11 -287 -160 179 225 72 12 260 111 78 131 216 -96 -82
7014h2J79O9j9Pl6j05l1P9k57L63j00k14K97k42K71j88O8j79m8L06o1j74J36m09
$$ -82 97 166 147 154 118 13 -18 61 -196 167 67 -147 150 -92 179 -9 59 -120 -168 138 77 -97 39 -370
7038c70J62K58j19qL29l63J25p4J44p4J51k82J1J19n4L0p1k6M21j59oo9K58k30
$$ -370 -208 50 -69 -77 252 -111 14 -60 84 10 161 -121 -110 9 -45 -15 -86 -112 309 150 144 75 333 103
7062A03n16L93J1O2j30J95j0j20J05J66m20K23k01j35P1J26J3J29J52j69l3K5
$$ 103 -413 -20 -9 53 -77 118 108 -12 93 259 -161 62 -139 -274 -203 -77 -64 65 217 48 15 40
7084D0M4N1m1M1q8j51j20J48K68k4j31j37Q1l0J43j66j51P4M98m22L2j96L84k14
$$ 40 84 135 94 135 47 -104 -224 -76 192 168 37 -100 -19 -49 94 -72 -223 -149 349 -73 -41 -237 147 -67
7108f7m2J9K38k10J58k59K30R7k91L3ln8J34J68j49l0J13j6o4k0J24j25Lj6j08
$$ -67 -109 -90 148 -62 96 -163 67 164 -127 -94 -97 -155 -21 147 -2 -32 81 65 1 -19 105 -20 -17 -33 -141
7133a41M7q4r6Q0K12o7J58j46P6J44l62L46r8k34L85m79M28j91J76l41M16l08
$$ -141 -94 -178 -274 -194 18 -49 109 -37 39 183 -179 167 69 -165 220 -259 169 -22 154 -187 229 -79
7155g9l6m8n2K94N0m23L94j2m7j04%J12r1J83n3j18R5P3l0k08L80k07q6J22j23
$$ -79 -115 -163 -215 79 129 -294 100 88 41 -63 -63 49 -42 141 88 -30 65 138 108 -100 280 73 -13 109 -14
7180a4q4R0j18J30J49m4k69J41L5p8N3k83L15J17o5J03l57J94O9j28J66k68K74
$$ -14 -98 -8 -126 4 153 109 -160 -19 16 -62 -9 -292 23 140 75 178 -179 15 84 -44 122 -146 128
7203A28k11j09m0O9M51j48j44K8j60o8K54j92K5J49K1o2M6j46J40J81j77K06j60
$$ 128 -83 -192 -232 -163 288 140 -4 24 -136 -204 50 -142 -117 32 53 -9 37 -109 31 212 35 241 81
7226H1j22p0l5J79J22k54R2j01L71l94J25QP7K47k02J4j18N1P9k02O7K02k82P
$$ 81 -41 -111 -146 33 155 -99 -7 -108 263 -131 -6 2 79 326 124 138 20 71 150 -52 15 217 -65 -58
7250e8N7Qj99K62j82L44l51j96K06J18J15r4l65K63k6k12M41m17L13k53M81k70
$$ -58 -1 7 -192 70 -112 232 -119 -315 -109 9 124 30 -335 -72 -98 -310 131 -286 27 -226 255 -15
7272a5J37J69l07P5k31K24k03K32k92J51Q1J47k6j94n3O2o4J10M46o49M1L65l88
$$ -15 122 291 -16 59 -172 52 -151 81 -211 -60 21 168 142 -52 -105 -43 -107 3 449 -200 -159 206 -182
7295a82J41k3M8J36j42K10n18J96l61N06kM6M00l10k50j9r4L0k88R82n76J10N4
$$ -182 -41 -64 -16 120 -22 188 -330 -134 -495 11 9 55 455 145 -105 -124 -218 -188 -476 506 -70 40 94
7318I4J44k24P9%K01J34j52j103N06L89k97J91l09L04L91k21k81L43L44r44M88
$$ 94 238 14 93 93 294 428 276 -827 -321 68 -229 -38 -347 -43 348 127 -154 189 533 -411 77
7339G7J72k37q6j4j09r1k48K35k98L53M92p18R5l9L71ol0L37j26m54J002l62k89
$$ 77 249 12 -74 -88 -197 -288 -536 -301 -599 -246 246 -472 -377 -416 -45 -51 -81 256 130 -324 678 316 27
7362B7Rm4n63O0L94N61m27j39K07j37LK10l5O51p62K84n30M10k03k77l7J142m24
$$ 27 36 -8 -571 -511 -117 444 17 -122 85 -52 -49 161 126 777 15 299 -231 179 -24 -301 -338 804 380
7385C80L0j093P34l21J27P5k59R28j089N70k80L75p72R07n32M09%j90l24N16k19
$$ 380 410 -683 51 -270 -143 -68 -327 601 -488 82 -198 177 -595 312 -220 189 189 -1 -325 191 -28
7406b8K78k7o57N33m26O59j49J70j51O1k12k50M8L01L97J89o40o04K65K09J7j462
$$ -28 250 223 -434 99 -327 332 183 353 202 263 51 -199 -151 150 547 736 96 -508 -243 -34 -17 -1479
7428a479J530J18L77o63o73j30J353j86n05j41M63o28Q37o02j99K27R8J8o94J362
$$ -1479 51 169 546 -117 -790 -920 433 247 -258 -399 64 -564 273 -329 -528 -301 -203 -185 -879 483
7448D83r87L38j87n39K30N42j71J97K56j174N9N90L51r6l6o38O28N43o34Km8J235
$$ 483 -504 -166 -353 -892 -662 -120 -291 -94 162 -1012 -953 -363 -12 -108 -144 -782 -154 389 -245 -243 -291 944
7470I44j063j46J416j104j430J502j139R97o42Q73p23O41l34Q9M33n18M84l69
$$ 944 -119 -265 1151 47 -1383 119 -1020 -23 -665 208 -515 126 -208 -119 314 -204 280 -89
7488h9Ml24J79J65l85L67N1r1Q5p0k09L99k5L29k25p4l85M73M31j90j98P5q68
$$ -89 -85 -409 -230 -65 -450 -83 -32 -123 -38 -108 -317 82 57 386 161 87 -298 175 606 416 218 293 -575
7511e75M48j55n23J21K23K96K94j1k90Q70r98M97Jl71L61n17p2L33m95L76L71
$$ -575 -127 -282 -805 -684 -461 -165 129 118 -172 698 -300 197 198 -173 188 -329 -401 -68 -563 -187 184
7532A84p3K57o88J41l63K06K77Q08j174N02j073j62J208L41N03q34ol57M75j32
$$ 184 111 368 -320 -179 -542 -336 -59 749 -425 77 -996 -1158 50 391 894 60 54 -303 172 40
7552D0m1m1o6L96j92p54R50M36q80n4O24m26O4l68M02J35m01m93O35L35j645J017
$$ 40 -1 -42 -108 288 96 -658 292 728 -152 -206 418 -8 56 -312 90 225 -176 -669 -34 301 -1344 -327
7574c27J119l65m21r5R18o68n33M92l00m6L68m91L97L43m35J45K96R6m30k9j34
$$ -327 792 427 6 -89 829 161 -372 120 -180 -226 142 -349 48 391 -44 101 397 493 63 34 -100
7595a00L00j58J15n29J98m27J80L86k61R17q00n6O26j295J132l0m52J65N35k76
$$ -100 200 42 157 -372 -174 -601 -421 -35 -296 621 -179 -235 391 -904 228 198 -254 -89 446 170
7615A70o11J007q31P79j29j26K28j45n39J02O62k79k63k18Q84m10m95O4k5p03
$$ 170 -441 566 -265 514 385 259 487 342 -197 -95 567 288 25 -193 691 281 -214 -150 -175 -878
7635h78P95kN55n02k79J033j032j78J92K43j4K04K38K83j69l92m8N1p91M49O5
$$ -878 -83 -85 470 -32 -311 722 -310 -488 -296 -53 -67 137 375 658 489 97 49 100 -691 -242 -177
7656a77M88L50m14m33J03m12K29Q53N97m63k99J04j135k85J286r62p48J451M5
$$ -177 311 661 247 -186 -83 -495 -266 587 1184 721 422 526 -609 -894 392 -570 -1318 133 178
7675A78M41j276R37j81R68j474P8m64Q87n56j88N11k0M40p26J02N06R04j156o9
$$ 178 619 -657 280 99 1067 -407 -329 -793 94 -462 -650 -139 -159 281 -445 -343 163 1067 -89 -158
7695a58k52Q14n37J85l28j048O16O51K86O67j852Q11l51P6L32k01J128j027m51
$$ -158 -410 404 -133 52 -276 -1324 -708 -57 229 896 -956 -145 -496 -420 -88 -289 839 -188 -639
7714f39Q13m65O51N9M63q5q24n00L74k57M80J42L32l68N76k68l53O8J71o23q42
$$ -639 174 -291 360 419 882 797 -27 -527 -153 -410 70 212 544 176 752 484 131 199 370 -253 -1095
7735a095P00Q61n53N16M23j354M11K85n46N42j137J404k65o14O12Q2l1r68L13
$$ -1095 -395 466 -87 429 852 -502 -91 194 -352 190 -947 457 192 -422 190 272 241 -727 -414
7754d14P96k54o18M56n99J33N90l38q69N82J99j65N62k39J74O16p7o9l65J76l01
$$ -414 382 128 -490 -34 -633 -500 90 -248 -1117 -535 -336 -501 61 -178 -4 612 535 466 101 277 -24
7775b4j14R3n5O6K41j423J037J41L91n64M39k38p1k81M51r4M47q19j49O41n23
$$ -24 -138 -45 -100 -34 207 -1216 -179 -38 353 -211 228 -10 -81 -362 89 -5 442 -377 -526 115 -408
7796d08L88l21O0L12mj14m86P17j65p5N10k15k92l5N26m47M8J10l15J46k3K7J33
$$ -408 -20 -341 -281 31 27 -87 -573 144 -21 -96 414 199 -93 -128 398 -49 -1 109 -206 -60 -83 -56 77
7819G7K19k61q7N3q0Q5k12K83LJ45j97J01l9j94J39J12j99J92j99p0K93k02o1
$$ 77 296 35 -52 1 -79 6 -206 77 80 225 28 129 90 -104 35 147 -52 140 -59 -129 164 -38 -99
7842i9K45m64L0N23l92J39m5j18L54p0k10P6p7n5L05r3j6J65j94q3Q6j21j81L76
$$ -99 146 -318 -288 235 -157 -18 -63 -181 173 103 -107 -31 -108 -163 142 49 33 198 4 -79 7 -114 -295 81
7866H1k55L28J0K8l36n0Q6l8K41k62J60j76K25m2L42j96j2j9O5j61L4N0l7J58
$$ 81 -174 154 164 192 -144 -194 -108 -146 95 -167 -7 -183 42 0 342 146 134 115 180 19 53 103 66 224
7890B24k04J15j04n3M86o01R1RJ45l44K60n5j24J07J97k53Q5r9J98j86j78J77
$$ 224 20 135 31 -22 464 -137 -46 -37 108 -236 24 -31 -155 -48 149 -104 -19 -118 80 -106 -284 -107
7912a07M7J63j45P2j45J72k10L20O5k80N3J11J71l10QJ69m6j14O2P3k18k4J21
$$ -107 -60 103 -42 30 -115 57 -153 167 232 -48 5 116 287 -23 -15 154 108 -6 56 129 -89 -113 8
7935HP5k09M65l34j8P1k28L06m0M0j64l4o4K09j7k38K58k59J38Q1K53M3j40l59
$$ 8 83 -126 339 5 -13 58 -170 136 96 136 -28 -62 -126 83 66 -172 86 -173 -35 46 299 342 202 -157
7959a57j27L57l03J79o0r4J28p1J33J91k86J95l33J85p8K17m3m47L81M5LJ91m57
$$ -157 -284 73 -230 -51 -111 -205 -77 -148 -15 176 -110 85 -248 -63 -141 76 33 -414 -33 12 15 206 -251
7982b51M56j34k06L31k88K00o6N2j69o9L26j06J05j76k46M07j20J0k71J76q5K27
$$ -251 205 71 -135 196 -92 108 42 94 -75 -144 182 76 181 5 -241 166 46 56 -215 -39 -124 103
8004A03J6j08j41J3J89m9K01j78j11J12j92Q0K08p0l1m0j50L59rk05M5j94J33
$$ 103 119 11 -130 -117 72 23 224 46 -65 47 -145 -65 143 73 42 2 -148 211 202 -3 42 -152 -19
8027a9j92K81K91m01n1J46m4m1M1J68k7j58j39J88Oj49J19j29K15J12j70k3j7
$$ -19 -211 70 361 -40 -91 55 11 -30 11 179 152 -6 -145 43 49 -100 19 -110 105 217 47 24 7
8050GK49l45K09j55l1mN9j60J60m0nL22k71K14k71p9p6L2J60j56J79l1K4J52j17
$$ 7 256 -89 120 -35 -66 -70 -11 -171 -11 -51 -56 266 -5 209 -62 -141 -217 -185 -25 -181 -2 -33 -9 143 26
8075B6j4J26j65j62j69L33mQ0R4Q8q2q4o7J6R7j43k5l5J9L35j57q3l5j45J12N3
$$ 26 12 138 -27 -189 -358 -25 -29 51 145 233 151 67 0 16 113 -30 -55 -90 -71 264 107 24 -11 -156 -44 9
8101IRj03K63k42P8j17L47Kl01K5p7J46K8M5k94J10m4J19J51j91K06j5k96K77
$$ 9 18 -85 178 -64 14 -103 244 246 -55 -30 -107 39 67 112 -182 -72 -116 3 154 -37 169 154 -142 135
8125A35k14J78j17K17k84%J54j23K23k86L30l2l2j88r4Q4M8k4J66l09R9NJ33J40
$$ 135 -79 99 -18 199 -85 -85 69 -54 169 -117 213 181 149 -39 -133 -49 -1 -25 141 -168 -69 -64 69 209
8149B09k00O7k14O3J22j25K65m4j14k24J51j04K78m09J88K34j85J33m22M21j58
$$ 209 9 76 -138 -75 47 -78 187 143 29 -195 -44 -148 130 -279 -91 143 -42 91 -331 90 -68
8170f8j93J97m2j24J17K01J81k04j18j34l4J92j4O9k7n7j09J38K9K69j40
$$ -68 -261 -64 -106 -230 -113 88 269 65 -53 -187 -221 -29 -43 26 -1 -58 -167 -29 0 269 129
8191A29
$$ Imaginary data points
##PAGE= N=2
##DATA TABLE= (X++(I..I)), XYDATA
0@%%%%%%Qj6QqJ6k4M0m8N6p2Q8j04J28j60J92k32K80l28L84m48N20o00O90p94
$$ 0 0 0 0 0 0 0 8 -8 0 -8 8 -16 24 -24 32 -40 48 -56 72 -88 104 -128 152 -176 208 -240 280 -320 370 -424
30d24R12j040J183j343J515j708J921k155K410k689K996l332L699m098M531n004
$$ -424 488 -552 631 -712 803 -905 1016 -1139 1271 -1418 1578 -1754 1945 -2153 2378 -2626
46b626N523o092O715p395Q142q970R888j0904J2040j3320J4769j6429J8351k0606
$$ -2626 2897 -3195 3520 -3875 4267 -4703 5185 -5719 6321 -6999 7770 -8659 9692 -10914
60a0914K3298k6574L0667l5950M3064n3218O8996r7090J62265n94350k93611J088589
$$ -10914 12384 -14190 16477 -19473 23591 -29627 39369 -57721 104544 -489806 -783417 305172
72C05172M89718n8686n85068l92180j06135J72024P4615M904K176J81232J89798
$$ 305172 794890 736204 151136 -241044 -347179 -175155 -100540 -95636 -93460 87772 277570
83B77570M5704k20203k90189j63782J11868K48975J99933j357j20551j23706l5066
$$ 277570 323274 103071 -187118 -350900 -239032 9943 209876 208519 87968 -35738 -70804
94g0804Q503J5857k136K2015N0861N8229J402o0219p5343k0127L6194N1397J4029
$$ -70804 -62301 -46444 -48580 -26565 24296 82525 83927 23708 -51635 -71762 -35568 15829 29858
107B9858k0186k1295Q931K4948P153k8057l6303q425L0822L9802J4422k1449l4144
$$ 29858 9672 -11623 -2692 22256 29409 1352 -34951 -43376 -12554 27248 41670 20221 -13923
120a3923j4712J4038K2438N731j2445j2580L918J6042J0883p882k0185j3174N310
$$ -13923 -28635 -14597 7841 13572 1127 -11453 -7535 8507 19390 11508 -8677 -21851 -16541
133a6541J8194J4006j078j0865r461j650M344L850n35j906J151L424K104k487
$$ -16541 1653 15659 14581 3716 -5745 -7395 -3051 799 264 -1642 -491 2933 5037 2550
147B550m402l449J163M612L259j64k740k178j0Q58N64k05l82L38J074O20p41j534
$$ 2550 -1852 -5301 -4138 474 3733 3569 829 -1349 -1359 -501 63 -142 -524 -186 888 1508 767 -767
165g67n99J231P09J52q86p23J32O72J100j87q89q89O0M32O49J22j80k73K5L53
$$ -767 -1366 -135 574 726 -160 -883 -751 -79 1021 834 -55 -944 -884 -452 197 319 139 -134 -109 244
185B44j40l16l32K95L90L80j0j58o88Q4J84J45K5j36j9j10J4L45n34K64L38m39
$$ 244 104 -212 -544 -249 141 521 511 353 -335 -251 -67 78 103 -33 -52 -162 -148 197 -337 -73 265 -174
207a74J59K12J68k90j88Q9PJ59l23L08k66L41k72l99l13M97L61o2j71k6L11l27
$$ -174 -15 197 365 75 -113 -24 -17 142 -181 127 -139 202 -70 -469 -782 -285 76 14 -157 -183 128 -199
229a99N8r8L69k41l58P77j103J426m01k14m08L85Q1l9J66l68K90l2L7j29K28l57
$$ -199 -141 -239 130 -111 -469 308 -795 631 230 16 -392 -7 74 35 201 -167 123 91 128 -1 227 -130
251a30L27M3J3m03j66K04J75J58l43M07L5m03J07n0J1K16m72L63l14QJ22O9L06
$$ -130 197 240 253 -150 -316 -112 63 221 -122 285 320 -83 24 -26 -15 201 -271 92 -222 -214 -92 -23 283
274B83l45l6K18M8j60k73N20lj59k14K08k06l13P25n76J6o5k76K53Q29N40j021
$$ 283 -62 -98 120 168 8 -265 255 252 93 -121 87 -119 -432 293 -283 -267 -332 -608 -355 474 1014 -7
296gk14K05l27M76p55R98j237O74N90j72m02L57n4j77O43r77o8L77M61l24k37
$$ -7 -221 -16 -343 133 -622 376 -861 -187 403 231 -171 186 132 -45 598 -379 -447 -70 391 67 -170
317a70L38L7N2j09Q37j129K4K81j9l01K19k67M72j83L35p6m01m15j03J392r69
$$ -170 168 205 257 148 985 -144 -120 161 142 -159 60 -207 265 82 417 341 -60 -475 -578 814 -155
338a55L63K74m07k24K07R35q33L60N89m68k59p69J3O27J73l93L58q17M88k24Q23
$$ -155 208 482 75 -149 58 993 160 520 1109 641 382 -387 -374 253 426 33 391 -426 62 -162 661
359F61J45n49p42J035j009m83J378j105O79n74N95K20j76l72M40L90n82l30O73
$$ 661 806 257 -485 550 -459 -942 436 -669 10 -564 31 251 75 -297 143 533 -49 -379 294
378B94j197J028k7J89J08j030J008p96N76l55L59l53N13L55n88J39l2m56k1N8
$$ 294 -903 125 98 287 395 -635 373 -423 153 -202 157 -196 317 672 84 223 191 -265 -286 -228
398b28K91L44l52j75j85N7j35N78l99R3j37L59O6j77KJ92l97j2L25j39L0j3j44
$$ -228 63 407 55 -120 -305 -248 -383 195 -204 -111 -248 111 177 0 2 194 -203 -215 110 -29 1 -12 -156
421a56L49k59J48r3J68L2p9Q4l03O3j90L32k34k0J79N4lN4J93J26n72J3O4j03
$$ -156 193 -66 82 -11 157 189 110 194 -109 -46 -236 96 -138 -158 21 75 72 126 319 445 -127 -114 -50 -153
445a53K65rj21P0j57L3K7k13n7K29R0Pj13O3K30n42L47Lp7Q6K4j55J84P2l25L84
$$ -153 112 103 -18 52 -105 -72 -45 -258 -315 -86 4 11 -102 -39 191 -351 -4 -1 -78 8 32 -123 61 133 -192 192
471A92k31K39j02K72l10Qm0j71M0O9P9J54k81J30k62K74J61p95O46l4O62r23K8
$$ 192 -39 200 98 370 60 68 28 -143 -103 -34 45 199 -82 48 -214 60 221 -574 72 38 700 -223 -195
494a95K21p01M15j28P74l48m50P96o22Q09l70m5l04J53N3L6m38O71n78m79O08
$$ -195 26 -675 -260 -388 386 38 -412 384 -238 571 201 156 -148 5 58 94 -344 327 -251 -730 -122
515a22K14R4kk12L30o15L63m55P44k71n49K06J163q10l77Q73p90L37j71Q1j20
$$ -122 92 186 184 -28 302 -313 50 -405 339 68 -481 -275 888 78 -299 574 -216 121 -50 31 -89
536h9O5j04L88m44M11k90K82R5n85K54J34k42j19l50L87P0j24O79l33O38o61J71
$$ -89 -24 -128 260 -184 227 -63 219 314 -271 -17 117 -125 -244 -594 -207 -137 -261 418 85 723 62 233
558B33Oo21N56j03M2l24J18J40j15L57l23J20l07L56j22j72K29m16J90K16j2l45
$$ 233 239 -382 174 71 113 -211 -93 47 -68 289 -34 86 -221 135 13 -159 70 -346 -156 60 48 -297
580b97K89k8J31l5ko1O8O7j20r9J41J55j97J16q1o7L12Jj36j48l09L97k61K90
$$ -297 -8 -36 95 60 58 -3 65 132 12 -87 54 209 12 128 47 -20 292 293 157 9 -300 97 -164 126
604A26m0l39K99j0k82q8K48L12k30J23l17N57k71N9j68J75l65M32j87j72l30L02
$$ 126 86 -253 46 36 -246 -334 -86 226 -4 119 -198 359 88 147 -21 154 -211 221 34 -138 -468 -166
626a66P8Q6k10lJ62l05L05L9m72R83j50m62k1J31P06m08L8m42P6J01N19o05j16
$$ -166 -88 -2 -212 -215 -53 -358 -53 -14 -486 497 347 -115 -136 -5 701 293 331 -111 -35 66 585 -20 -136
649a36J46j53n5M25q9o8K57j111P33Q6m96N99k67o50N29m51m65J430n6k47k27
$$ -136 10 -143 -198 227 138 70 327 -784 -51 35 -461 138 -129 -779 -250 -701 -1166 264 208 -39 -266
670b66j73Q35n00k18L50M55p79N2qK50j75P1j77K89N3k60K28k3J45k09K52l04
$$ -266 -439 396 -104 -322 28 483 -296 -244 -252 -2 -177 -106 -283 6 59 -201 27 4 149 -60 192 -112
692a12L34m03J25J59Pj52L5J54k38J54k0j92j0m3J77O8k9R2J00l20j2K06j77J12
$$ -112 222 -181 -56 103 110 -42 -7 147 -91 63 43 -149 -159 -202 -25 43 14 106 206 -114 -126 80 -97 15
716A5j34J95j3K36m09O1J24o6j47M5J39n11J21M83p9L17n86K06J57k56O9L81n54
$$ 15 -119 76 63 299 -110 -49 75 9 -138 -93 46 -465 -344 139 60 377 -209 -3 154 -102 -33 348 -206
739b06K91MK10n49L55l6n4pm6N1O9j66J57j53L3L01l56J70K5j85K49k81N8J38
$$ -206 85 89 299 -250 105 69 15 8 -38 13 82 -84 73 -80 -47 254 -102 68 93 -92 157 -124 -66 72
763G2m7j30J59p5K52l94J02L8j95L74k45m6J90j1j09O6J52l43J51K55j94j60L66
$$ 72 25 -105 54 -21 231 -163 -61 -23 -218 156 -89 -135 55 44 -65 1 153 -190 -39 216 22 -138 228
786B28m08J32m9q7L85l11ROJ46k28N04l27j12L07k52q9K12QK0O9j19oJ33M7k79
$$ 228 -180 -48 -97 -184 201 -110 -101 -95 51 -177 327 0 -112 195 -57 -146 66 74 94 163 44 38 171 218 -61
811f1q6p2J22J58j56K70l86K82j13R5r8N9K39l16j11L97j36o0k77K30n1J79r5
$$ -61 -147 -219 -97 61 -95 175 -211 71 -42 53 -45 14 253 -63 -174 223 87 27 -250 -20 -71 108 13
834A3j85K32k13K00l89L43J47k89J13P6RJ07l78J49J47J53l46K35j88J55j45K52
$$ 13 -172 60 -153 47 -342 1 148 -141 -28 48 57 164 -214 -65 82 235 -111 124 -64 91 -54 198
856A98k32o5J06j17R7j64J1K61j54K85j13q8j54oJ14j47K51k76M30j92K4P7k56
$$ 198 -34 -99 7 -110 -13 -177 -166 95 -59 226 113 25 -129 -135 -21 -168 83 -193 237 45 69 146 -110
879a10n4R3J02N8k8l7j04K08pj30N0j42p0J6J43k48J17J59k19O87n23K9O0K32
$$ -110 -164 -71 31 89 61 24 -80 128 121 -9 41 -101 -171 -155 -12 -260 -143 16 -203 484 -39 -10 50 282
903B82l27l9L12j47l2j25k69L06K95j65J36m3j59j37k5k00M58k81K52j09K06K4
$$ 282 -45 -84 228 81 49 -76 -345 -39 256 91 227 184 25 -112 -137 -337 121 -160 92 -17 189 213
925B13j77M4j70O1j82M35k71m9j68J92L8p4N2L28j33J42j53n5M8k93J43j88Q0
$$ 213 36 80 -90 -29 -211 224 -47 -96 -264 -72 -34 -108 -56 272 139 281 128 73 121 -172 -29 -217 -137
948a37N6R0k4K64l03P2%J1p4P0R4j25n7r4K31k24M32k28j46L6Q2J05j09lK04m63
$$ -137 -81 9 -15 249 -54 18 18 29 -45 25 119 -6 -63 -157 74 -150 282 54 -92 -56 26 131 22 19 223 -240
974b40J76j15K44K14l86L5J39p3j1l9J88l99J23L26nK4M3k24J1L45l19j20o7m
$$ -240 -64 -179 65 279 -107 -72 67 -6 -17 -56 132 -267 -144 182 177 201 244 20 31 376 57 -63 -130 -134
998a34J52qJ22k66k59K38J99L83k57k76j29L71r1j74q5J45Q2J48j82j52K75k06
$$ -134 18 10 132 -134 -393 -155 44 427 170 -106 -235 136 45 -129 -214 -69 13 161 -21 -173 102 -104
1020a04j51K90J26M1l69J35k6nK62j52k15PL13o3l01K16rMN1M8J5j88J01r7r8
$$ -104 -255 35 161 202 -167 -32 -58 -63 199 47 -168 -161 152 89 -212 4 -5 -1 50 98 113 -75 26 -71 -169
1045a69K37J93k86M5J10o5k50K08L0j7J06j82K18l0j60j76K72n8l26L33k85M87
$$ -169 68 261 -25 20 130 65 -185 23 53 36 142 -40 178 148 -12 -188 84 26 -300 33 -252 235
1067B35j02q3O5k82J20q4K15l50L38M7j57j52J90l35L25L8j04j04J62j2K37m28
$$ 235 133 50 115 -167 -47 -131 84 -266 72 119 -38 -190 0 -335 -10 28 -76 -180 -18 -30 207 -221
1089b21J63o5J59q5L44k32j99J46n8K42j89q7J50j66P3mJ44j23q6K34l53L01l93
$$ -221 -58 -123 36 -49 295 63 -136 10 -48 194 5 -82 68 -98 -25 -29 115 -8 -94 140 -213 88 -305
1112c05L88j33M8J64n06M20o6j66lL50r3j03q9l14M98r9r9K67k09J16j86Q3j41
$$ -305 83 -50 -2 162 -344 76 10 -156 -159 191 98 -5 -94 -408 90 -9 -108 159 -50 66 -120 -37 -178
1135a78L1J41L6J74k14m9J72M4k08L31j92j72K68j51l1K00l18j08M27j16l79L45
$$ -178 -147 -6 30 204 -10 -59 113 157 -51 280 88 -84 184 33 2 202 -116 -224 203 87 -292 53
1157E3N5k70K21P9j78J65l65R4J60K48j53j59J20j76o4K74r6o5j2O9L9q9l4J11
$$ 53 108 -162 59 138 -40 125 -240 -146 14 262 109 -50 70 -106 -170 104 8 -57 -69 0 39 -50 -84 27
1181B7l61M77j48j33L13L5k77j28K66j42J38j27R3Q8K49l84Oj75K2m4K34J9p8
$$ 27 -334 143 -5 -138 175 210 -67 -195 71 -71 67 -60 33 121 370 -14 -8 -183 -161 -205 29 48 -30
1204c0j3K11J09j85l1m7K53k31r0J29j23m0M2p4J53Nj52K22J02l77J64j21J58
$$ -30 -43 168 277 92 61 14 267 36 -54 75 -48 -88 -46 -120 33 38 -114 108 210 -167 -3 -124 34
1227C4l3j23J24o9K52j97l56M38N1J01l40O6K64p09L40J57l69M86M1k7J34k60
$$ 34 1 -122 2 -67 185 -12 -368 70 121 222 -118 -52 212 -497 -157 0 -369 117 158 131 265 5
1249EJ72m05P44n31J86k56K04P7j10j90L84m82J35k5K90j74N0r4p9l6J41O4q4
$$ 5 177 -228 516 -15 171 -85 119 196 86 -104 280 -202 -67 -92 198 24 74 -20 -99 -135 6 70 -14
1272a4j21M30k77J55k8k65J39J1J2k52l2K13k49K34K45l59m2J20j05j01L26m3
$$ -14 -135 295 18 173 145 -120 19 30 42 -210 -242 -29 -278 -44 201 -158 -200 -80 -185 -286 40 -3
1294ck3o1J08p7j31N6J57K2J9j85l2L32Jj18n1o5j04N77m93J8qM1j4N7j61q7M54
$$ -3 -26 -87 21 -56 -187 -131 26 48 67 -118 -150 182 183 65 14 -51 -155 422 -71 -53 -61 -20 -34 23 -138 -225 229
1321B29n08Q3Q5m0L71m38L16N4o8K82o47K10j26P8J74Q2l83L76r2j15p6r9J45
$$ 229 -279 -196 -111 -151 220 -218 98 152 84 366 -281 -71 -197 -119 55 137 -246 130 38 -77 -153 -252 -107
1344a07J98j64J2J52k8k31P7K71k17R9l79L75m5J62j99q3K44l08R5J07p3K18k87
$$ -107 91 -73 -61 91 63 -168 -91 180 -37 62 -317 58 13 175 -24 -107 137 -171 -76 31 -42 176 -111
1367a11K67l1r4k09m3L31O7j83J45j8o2j72L23p1R9l10J06J87l11p3K60p4N6K34
$$ -111 156 125 31 -178 -221 110 177 -6 139 121 59 -113 210 139 238 -72 34 221 -90 -163 97 23 79 313
1391C13k37k7J60o2O8m81J55J37j16r4L6n4L81k60k07J10M78l22L6J24L4k61O4
$$ 313 76 49 209 147 215 -266 -111 26 -90 -184 -148 -202 179 -81 -288 -178 300 -22 14 138 172 -89 -25
1414b5O8m1M2%P7K4j84J13P0q9p1K71l56K18l09M48l96J55p2j42L44l1j21m8K80
$$ -25 43 2 44 44 121 145 -39 74 144 55 -16 255 -101 117 -192 256 -140 15 -57 -199 145 114 -7 -55 225
1439B25j81j95RL05j34L68l48k7N8k1l19K48j38N7p8K21JQ6k08pk1R6L9r9J62
$$ 225 44 -151 -142 163 29 397 49 22 80 59 -260 -12 -150 -93 -171 50 51 137 -71 -78 -99 -3 36 -63 99
1464I9j73J91k94j4J21R3L30l45k37N1J54Q4j09J67j38j41l8K24M0O0k14R6N9
$$ 99 -74 117 -177 -191 -70 23 353 8 -229 -178 -24 60 -49 118 -20 -161 -199 25 65 125 -89 7 66
1487F6j26N0l1j9r3K08R4m76J79N67r0l43J55j35no4P2L41n48N5J25j46M4K2o8
$$ 66 -60 -10 -41 -60 -153 55 149 -327 -148 419 329 -14 141 6 1 -63 9 350 -198 -143 -18 -164 -120 -98 -166
1512a66J47O1L1j53P2k22L32k52J30P8l25L35K57k16Q5j80P4j43P1l9k82J91o0
$$ -166 -19 42 73 -80 -8 -230 102 -150 -20 58 -267 68 325 109 194 14 88 -55 16 -23 -305 -114 -174
1535a74L24N8l26L36j17k72Q9k69O64k70j52K26j73J00p9n7l4n2L23j44j00K23
$$ -174 150 208 -118 218 101 -171 -82 -351 313 43 -109 117 -56 44 -35 -92 -126 -178 145 1 -99 124
1557A24P5k81M33l29QJ3J6N8n0j04K47j76N2p6O0l14J3L87N7k36J32j71n9P1o2
$$ 124 199 -82 351 22 30 43 59 117 67 -37 210 34 86 10 70 -244 -231 156 213 -23 109 -62 -121 -50 -112
1582a12J08l6J06P3k64K6L72j36k20L95j66r3R7j56L0L20n81J91K16k41j21J24
$$ -112 -4 -40 66 139 -125 -99 273 137 -83 312 146 53 150 -6 24 344 -237 -46 170 -71 -192 -68
1604f8J13Q3K9l32K51j21k93K85j74K20Q5j55Q3L0m4q4J75N7j30q5m8j2R6l2l3
$$ -68 45 128 157 -175 76 -45 -338 -53 -227 -7 78 -77 6 36 -8 -92 83 140 10 -75 -123 -135 -39 -71 -104
1629a04Q6o4L3K60j60J09m61L89k17J2Q9j28O6j29J92m9P1n4P3Q6k8j45J06j56
$$ -104 -18 -82 -49 211 51 160 -301 88 -129 -117 -28 -156 -90 -219 -27 -76 -5 -59 14 100 72 -73 33 -123
1653a23J93N7l3Pj58M7J6l0m4J29R7L5k41Oo3q3J64Q3r4J91m6k32k10J2MM67M0
$$ -123 70 127 94 101 -57 -10 6 -24 -68 61 158 193 -48 -42 -105 -188 -24 59 -35 156 110 -122 -332 -320 -316 151 191
1680A91j63J49k6j85K45l41j9M64l21J63k71J83m1K2O5j54m1K9M05q2q7j21mj68
$$ 191 28 177 151 -34 211 -130 -149 315 -6 157 -114 69 28 50 115 -39 -80 -51 354 272 185 64 60 -108
1704a08N6J1K92l23jJ13K1j2j07Qj49L7K39l4k2k05N03n37K78l2j17J43k5j60
$$ -108 -52 -41 251 -72 -73 40 61 49 -58 -50 -199 -162 77 43 21 -184 319 -218 60 28 -89 54 29 -131
1728a31nJ67q6Q4j72J0L3K55o7K0l1j7l9k18J67k77J19L36m19L40J33j44k58K51
$$ -131 -136 31 -55 29 -143 -133 -100 155 88 108 77 60 21 -197 -30 -307 -188 148 -271 69 202 58 -200 51
1752E1Q0k15o0J72M9m8J07j07j75K20J51j22r8J80m70O9K23L8K6j57j16J75O7
$$ 51 131 -84 -144 28 77 29 136 29 -146 74 225 103 5 185 -285 -216 7 45 71 -86 -202 -27 40
1775D0j49K41m95K35K86k25k7K25j18J53k88K07o8J90k9k11j72J75Q4q1J51R4
$$ 40 -109 132 -363 -128 158 -67 -94 131 13 166 -122 85 17 207 178 -33 -205 -30 54 -27 124 218
1797B18j37K2k97J83m6k79M79l00RK71j85L1o2R4j91K35J7N7Q6l37K61l51J15
$$ 218 81 103 -194 -11 -57 -336 143 -157 -148 123 -62 -31 -93 1 -190 45 62 119 205 -132 129 -222 -107
1820a07K01k03M24j80l75L17k40O7J24l0P6J48k69q8K50j91r0K04l05Q8J93K4
$$ -107 94 -109 315 135 -240 77 -163 -96 28 -2 74 222 -47 -135 115 -76 -166 38 -267 -179 14 38
1842C8K4on8n6l49J73J92l4O6R9M1j78j66L60k65K95J26k09m9L0j13Lq9L54l2
$$ 38 62 56 -2 -58 -407 -234 -42 -76 -10 89 130 -48 -214 146 -119 176 302 93 44 74 -39 -36 -125 229 197
1867A97j58j13J93jM7j83j81J30L71l43j46J18J02o2O3n0j17L7j65J04L23O0j44
$$ 197 39 -74 119 118 165 -18 -199 -69 302 -41 -187 -69 33 -29 34 -16 -133 -96 -261 -157 166 226 82
1890H2j93J40k18n4M38k85K64n5j11J11j70k81K83P0j44m3L00q8j10K04l22K21
$$ 82 -111 29 -189 -243 195 -90 174 119 8 119 -51 -332 -49 21 -123 -166 134 46 -64 140 -182 39
1912C9L4k11q3K24J50j70K87j46l03M3K7J61J47j31o4p3o1K16r2N0k59R3L24j92
$$ 39 73 -138 -221 3 153 -17 270 124 -179 -136 -109 52 199 68 4 -69 -130 86 -6 44 -215 -122 202 10
1936A0j02j04K60j25M53k50k29L4Q8r1K19o0l34K97k29J90r1J16M6k74J5L39j75
$$ 10 -92 -196 64 -61 392 142 -87 -53 35 -56 163 103 -231 66 -163 27 -64 52 98 -176 -161 178 3
1959CJ28j77J42j00j71L4L94l56J97q2j05L00m73N33k38Q0L6n8jk80J41J90Oj65
$$ 3 131 -46 96 -4 -175 -141 253 -103 94 12 -93 207 -266 267 29 109 145 87 86 -194 -53 137 143 -22
1983b2m7L91k94K14k59n24N98j82J68j07J49r1l7M2J12m05J84oj74K33k55M26
$$ -22 -69 322 28 242 -17 -541 57 -125 43 -64 85 -6 -43 -1 111 -294 -110 -116 -290 -57 -312 114
2005A14j0k3j37Q0j87M10j54m04L29L5k03N0m8L89l13J81j73m0L55j88R8k52N8
$$ 114 104 81 -56 24 -163 247 93 -311 18 53 -150 -100 -148 241 -72 109 -64 -104 251 63 161 -91 -33
2028c3j20L48j34p6J54j60N5J15j6m39M6J22QN5p0K30Pk03j22K02J40j56K1O5
$$ -33 -153 195 61 -15 139 -21 34 149 133 -306 -260 -138 -130 -75 -145 85 92 -111 -233 -31 109 -47 -26 39
2052C9J57n0p3k5Q4l9j9j57Q8Kj73J35k5M2k08K41p3R9j35q3K70M6j33m0J6j93
$$ 39 196 146 73 48 132 93 74 -83 5 7 -166 -31 -56 -14 -222 19 -54 45 -90 -173 97 143 10 -30 -14 -207
2078b07K71O2k94K31j32kJ13J62o9N3k22J09j98N3l44N28m50L69L13k24j35J4
$$ -207 64 126 -168 63 -69 -71 42 204 135 188 -34 75 -123 -70 -414 114 -336 33 346 122 -13 1
2100Aj66J74j16L65j39j4R5j76jK22l20O3J67r6j1l27L62k15M8J43k96K83J07
$$ 1 -165 9 -107 258 119 105 200 24 23 245 -75 -12 155 59 48 -279 83 -132 -84 59 -237 46 153
2123A53O0q6r3J78l34P3o4K10p9j10N4J9j68M24j30J05j86j41J15p6K73j50J2
$$ 153 213 127 34 212 -122 -49 -113 97 18 -92 -38 -19 -187 237 107 212 26 -115 0 -76 197 47 59
2146E9P1j81LJ0l7R7m08P53n06oJ88q1l8J30k9l4n0o0J39J68J0j8j09k57J70j75
$$ 59 130 -51 -48 -38 -75 22 -386 367 -139 -145 43 -38 -76 54 25 -9 -59 -119 20 188 198 180 71 -186 -16 -191
2172a91J12R5n2K55r2m12K98K81m12R0J12rj04j68L06k5j08k96M93j79J19k31
$$ -191 -79 16 -36 219 127 -285 13 294 -118 -28 84 75 -29 -197 109 84 -24 -320 173 -6 113 -118
2194a18K49j92n2P2Q0Oj30L0%o9J41Lk86M47l47J53j39j51J76K8nJ00j59N0K15
$$ -118 131 -61 -113 -41 39 45 -85 -55 -55 -124 17 20 -266 181 -166 -13 -152 -303 -127 -99 -104 -4 -163 -113 102
2219A02j61J54l49K66J76Nk19j13J09j02j30L19j45o8K27k84qJ80l6K41j26N2
$$ 102 -59 95 -254 12 188 193 -26 -139 -30 -132 -262 57 -88 -156 71 -213 -221 -41 -77 164 38 90
2241I0k7n3J10k53L0J15n42N81N0j59r1J7L5K31lj75n1K21J8m02K18J22J79j11
$$ 90 63 10 120 -133 -103 12 -530 51 101 -58 -149 -132 -97 134 131 -44 -95 126 144 -258 -40 82 261 150
2265A50j91K7M94j93k18J0%J23k51n2n9j09K10J60n8l3J59k48P7%j05K20j05P4
$$ 150 -41 -14 480 287 69 79 79 202 -49 -101 -160 -269 -59 101 43 10 169 -79 -2 -2 -107 113 8 82
2289H2J93l68L11j21R5k88M8j6J45j02K52j94j50J78j53J81l8P0k38K14l46K26
$$ 82 275 -93 218 97 192 -96 -48 -64 81 -21 231 37 -113 65 -88 93 55 125 -113 101 -245 -19
2311a9j60L93j7l28k01K54J44j09j9p3K23q2OJ50r5j37L80k10J90j56k81K61l10
$$ -19 -179 214 197 -131 -332 -78 66 -43 -62 -135 88 6 12 162 67 -70 310 100 290 134 -147 114 -196
2334a96J98j90J77j67J34j20K6K49MP4j24m2Q2J75o3r1l5j61J69n5K5j58Q3M90
$$ -196 2 -188 -11 -178 -44 -164 -138 111 115 189 65 23 105 280 217 126 91 -70 99 44 69 -89 -6 484
2358D84m66k10KJ01K20j46N9j26J42j05P3n4K0j05O8m9O7K4j62K15p5J45k51J58
$$ 484 18 -192 -190 -89 131 -15 44 -82 60 -45 28 -26 -6 -111 -43 -92 -25 -1 -163 52 -23 122 -129 29
2382B9k18K00j54j4K91o4j34k91M08Q1l32J61Q6J52Q1j9j87k14L48j55j87J84
$$ 29 -189 11 -143 -157 134 70 -64 -355 53 134 -198 -37 49 201 282 263 76 -138 210 55 -132 52
2404E2J30k32l0j23K37j07O6l8q9M8m1J25q2J23j31J84k9L4m3N1J0k57L00k04
$$ 52 182 -50 -80 -203 34 -73 -7 -45 -134 -86 -127 -2 -84 39 -92 92 63 97 54 105 115 -142 158 -46
2428d6K53k57P4J06l02M04q7r4r4M0r1j89L20j4J1Q0m60M49l39J87oJ54l03M12
$$ -46 207 -50 24 130 -172 232 145 51 -43 -3 -94 -283 37 23 34 114 -346 103 -236 -49 -55 99 -204 208
2452B08k29J09J37l04K88m5j84j76J52r8R4J97j57O9j79J2K6L94k36qJ58j54M8
$$ 208 -21 88 225 -79 209 164 -20 -196 -44 -142 -48 149 -8 61 -118 -106 -80 314 78 70 228 74 122
2475A22q2n3j43J60K32k50J7k71N25n6l67J35K34j46J19j06j7j3J28j18nL5m2
$$ 122 40 -13 -156 4 236 -14 3 -268 257 201 -166 -31 203 57 176 70 53 40 168 50 45 80 38
2498C8q4M13l61j6P1J34j81K2j0k67O5R4L09k02QN5j25J00n7K45l81J86j32J06
$$ 38 -46 367 6 -10 61 195 14 36 26 -241 -176 -82 227 25 33 88 -37 63 6 251 -130 56 -76 30
2522C0j42J03JR6k3j77J61k83Q0J04l3j2K32n06K54L4J3j31O4K57l10K55J17q2
$$ 30 -112 -9 -8 88 65 -112 49 -234 -154 -50 -83 -95 137 -369 -115 -81 -68 -199 -135 122 -188 67 184 102
2546A02n8J83p0k69K03l27K24L70j03n60N28l25K94l90L69rj58N7k54K32J8N3
$$ 102 44 227 157 -112 91 -236 -12 358 255 -305 223 -102 192 -198 171 162 4 61 -193 39 57 110
2568A10k38K49j99K3r1K42j83M3LJ42k28k08K43M23l49n1M9J88J07j93J6K7o6
$$ 110 -128 121 -78 -55 -146 96 -87 -44 -41 101 -127 -335 -92 331 -18 -69 -20 168 275 82 98 125 59
2591E9j07j46R6m8M6K56j66M6J22k74K79Q6m85K11j5K45l4n9j82J43l33L94Qk10
$$ 59 -48 -194 -98 -146 -100 156 -10 36 158 -116 163 249 -236 -25 -40 205 171 112 -70 73 -260 134 142 -68
2615f8J51j44j19JM9K74j04n0J38k29rJ17MK65k66jj54J54J66k51m9RJ44M10p30
$$ -68 83 -61 -180 -179 -130 144 40 -10 128 -101 -110 7 11 276 10 9 -145 9 175 -76 -125 -116 28 438 -292
2640b92M95l42L50N0o11J93O7j37L55j34N4L2K7k11J35K3r4J14J26l90K15J25
$$ -292 203 -139 211 261 -350 -157 -90 -227 128 -6 48 80 107 -104 31 54 -40 74 200 -190 25 150
2662A50q0k13O1n8P7J0nJ36j63J44Q7k33p2K85P4l33M15l02P6j69j93K70J06J28
$$ 150 70 -143 -82 -140 -63 -53 -58 78 -85 59 146 -87 -159 126 200 -133 282 -20 56 -113 -306 -36 70 198
2686A98k61j27J19K02q7j50NJ82J1l7j25J48N7l05Q7M5l5P8K0J66l74J90R1l78
$$ 198 -63 -190 -71 131 44 -106 -101 81 92 55 -70 78 135 -170 -83 -38 -73 5 25 191 -183 7 98 -280
2710b80R7k8P1J14J25j8k11K31j09O4J24k03P4p9q9K54k24J39k12N9m8J3J50J2
$$ -280 -183 -211 -140 -26 99 81 -130 101 -8 56 180 -23 51 -28 -117 137 -87 52 -160 -101 -149 -136 14 26
2734B6j27j6p4J53J98m59K35L01m43K03o0k0J33K9ML7p2p0o5K36m45K45K2L8l09
$$ 26 -101 -117 -191 -38 160 -299 -64 237 -206 -3 -63 -83 50 79 83 120 48 -22 -87 149 -296 -51 -29 9 -300
2759c00M54j51NM5n14M50K8k47L42j35j09J23l39K99L20j05Nk5K0k16K45l43J63
$$ -300 154 3 8 53 -461 -11 17 -230 112 -23 -132 -9 -348 -49 271 166 171 146 166 -50 195 -148 15
2782A5j91K45Q2k85J37Q6j04O4j8l7J5J51l12P6k2L55j77p7J02N6l3j1P7r8k4
$$ 15 -176 69 151 -134 3 89 -15 49 31 -6 9 160 -152 -76 -98 257 80 3 105 161 128 117 194 96 72
2807G2k48K39R4j67r6L52k56J28J29j55n5j17R2K0j17n2J10O2j54P5j72O0J65
$$ 72 -176 63 157 -10 -106 246 -10 118 247 92 37 -80 12 32 -85 -137 -27 35 -119 -44 -216 -156 9
2830Ij32j98K94n4R8p5Q2jj53J74Q9j34K05l54L56J3n23J48k3J82J93m67M0L80
$$ 9 -123 -321 -27 -81 17 -58 24 23 -130 44 133 -1 204 -150 206 219 -304 -156 -179 3 196 -271 -231 149
2854A49j03o3O0r0k31K94j13L6Q6K90l34j91K43k66M23nk21p3L54k14j19J71L1
$$ 149 46 -17 43 -47 -278 16 -97 -61 25 315 -19 -210 33 -233 190 185 -36 -109 245 31 -88 83 114
2877A14j71K54j12J02J49l34o4N1K1J13o0J60k68j86L18r6j5J78K23l18on9%j4
$$ 114 -57 197 85 187 336 2 -62 -11 10 123 63 223 -45 -231 87 -9 -24 154 377 59 53 -6 -6 -20
2901b0J81j00j88K45j99N9R3O3k04r3J87l05L96l1j88J54M9j0J29k10k5j8K16
$$ -20 161 61 -127 118 -81 -22 71 134 -70 -163 24 -281 115 84 -104 50 99 89 218 8 -17 -35 181
2924A81n49K83N5j46J1R9l3K01K9k13J50l25L99k40J29j22K14l39n5J87K97j25
$$ 181 -368 -85 -30 -176 -165 -66 -99 102 131 -82 68 -257 142 -98 31 -91 123 -216 -271 -84 213 88
2946H8j00K13L9k14n8O6J32l10Q2k8L0j97K38r2K9o9J86P1j42q9P5J08j62o2K00
$$ 88 -12 201 240 26 -32 34 166 -144 -62 -90 -60 -257 -19 -111 -82 -151 35 106 -36 -125 -50 58 -104 -166 34
2971C4j98L04m1j37j27K58j52K71l0p9P7j90k3K61j30j66q0J32k78J42K99j32
$$ 34 -164 140 99 -38 -165 93 -59 212 182 103 180 -10 -33 228 98 -68 -148 -16 -294 -152 147 15
2993A5o3j6l9K82r6m3J05j20k77P2J63j05PK56r7J17m74K86pK18j32j35j14P5
$$ 15 -48 -64 -103 179 83 40 145 25 -252 -180 -17 -122 -115 141 44 161 -313 -27 -34 184 52 -83 -197 -122
3017a22P2J35L8j20n4J94K9k35m4j18L54j65K55k69j67K91k04J12l7J46M6j95
$$ -122 -50 85 123 3 -51 143 172 -63 -107 -225 129 -36 219 -50 -217 74 -130 -18 -55 91 137 -58
3039e8j20%Q5l15K95K97k76M1O4K8R3k24J2k3K1l3J21P4j20q2O2J91j73j57K27
$$ -58 -178 -178 -93 -408 -113 184 -92 -51 13 41 134 -90 -78 -101 -80 -113 8 82 -38 -120 -58 133 -40 -197 30
3064C0j65K06k02J01k74L96M8q3j60J44k6J18l74N31n78K22j65L63k3k02l1J41
$$ 30 -135 71 -131 -30 -304 92 140 57 -103 41 15 133 -241 290 -288 -66 -231 132 109 -93 -124 17
3086A7j62K08j95l0M4k6L75j15j34K40k67K3l8M00m01J44k00J47j59M87m15K14
$$ 17 -145 63 -132 -162 -118 -144 231 116 -18 222 -45 -22 -60 340 -61 83 -117 30 -129 358 -57 157
3108A57l99M13Mk74J70PO9m5k45m4N8J15K76l18J65k10L2J61p0J42j62K73m39
$$ 157 -242 171 175 -99 71 78 147 102 -143 -187 -129 -14 262 -56 109 -101 -69 92 22 164 2 275 -164
3131a64K19k16N3j47MM03k40R7l7J66j41O9k16K57l21J73L08o3k95K6K90r3k52
$$ -164 55 -161 -108 -255 -251 152 -88 9 -28 138 -3 66 -150 107 -214 -41 267 204 -91 -65 225 132 -120
3154a20M6K25No2j93J89o1J34j53J50l51O1m5J32l6J47j33J07o3k1K98j99j18
$$ -120 -74 151 156 94 -99 90 29 163 10 160 -191 -130 -175 -43 -79 68 -65 42 -21 -42 256 57 -61
3177f1J84k94J1K16J07N5p5k41o4K76o5M0L9o8k08J45k5l7J97l60M43K0k65K24
$$ -61 123 -171 -160 56 163 218 143 -98 -162 114 49 89 128 60 -148 -3 -28 -65 132 -228 215 235 -30 194
3201A94m26K60j48K90j90J85j32R7p2k97P4J36l04J15L09j84K16j89k59K09k1
$$ 194 -232 28 -120 170 -20 165 33 130 58 -239 -165 -29 -333 -218 91 -93 123 -66 -325 -116 -137
3222a37K50l28K46J03k13P1J31L54m32J31j87J57m08J44P9O1k55J90K3n5K19N8
$$ -137 113 -215 31 134 -79 -8 123 477 45 176 -11 146 -262 -118 -39 22 -233 -43 -20 -75 144 202
3244B02j57m4j11J94k73P0K64k55K15p7J59l08J19P8P0j01m6Q5Mr5J12j43J42
$$ 202 45 1 -110 84 -189 -119 145 -110 105 28 187 -121 -2 76 146 45 -1 84 88 -7 105 -38 104
3267A04l68JpM79k15J45K2l23M1R6N8p6K34q0k6J30j10j40M86l70k31J5K03k79
$$ 104 -264 -263 -270 209 -6 139 161 -162 -121 -25 33 -43 191 111 85 215 105 -35 451 81 -150 -135 68 -211
3291b11M72k61R2j11J10k72K66J45m93L45N9k86j7K72l32K94j83K27J51k26q7
$$ -211 261 0 92 -19 91 -181 85 230 -263 82 141 -145 -162 110 -222 72 -111 116 267 41 -46
3312d6L72l62j23R0J73Q9p4J00l36K73j46O2nK24l95J73nM2k12P6o9lJ99p2k40
$$ -46 326 -36 -159 -69 104 193 119 219 -117 156 10 72 67 291 -104 69 64 106 -106 -30 -99 -102 97 25 -215
3337b15J41K21l31k7J55R4J15l13K12j47P8J00k45J56lj08J40l7L7M4j33q8J18
$$ -215 -74 147 -184 -211 -56 38 153 -160 52 -95 -17 83 -162 -6 -9 -117 23 -14 23 67 -66 -154 -36
3360c6Pk12J00J8J57j2j93L30k12N3k8J85O2k84J51o5j12J11Q2O5k82J56l9K42
$$ -36 -29 -241 -141 -123 34 22 -171 159 -53 0 -28 157 219 -65 86 21 -91 20 102 167 -115 41 2 244
3384B44j07l76J66R1J22R6n30J59L41l1j84o0J4j43J66N1Q5o6R2k23K25kl22J88
$$ 244 137 -239 -73 18 140 236 -294 -135 206 175 -9 -69 -55 -198 -32 19 104 38 130 -93 132 130 -192 -4
3408dJ46j81k7q9K51J5L9n0j05m3L4N3J44K0j81p6J71l20K19lJ58j57o1O4k13
$$ -4 142 -39 -66 -155 96 111 150 100 -5 -48 -14 39 183 203 22 -54 117 -203 16 13 171 14 -47 17 -196
3433a96J61J92l11l2L04j40O9n4j34Q2J35k61N02l93J84j67j08M8K53l21K63j55
$$ -196 -35 157 -154 -186 118 -22 47 -7 -141 -59 76 -185 317 -76 108 -59 -167 -119 134 -187 76 -79
3455g9p4L91k62J5m4o3K89k70P1l6qL9On9q4L42k79J41K30j22k41K25n2J55j53
$$ -79 -153 238 -24 -9 -53 -116 173 -97 -26 -62 -70 -31 -25 -84 -168 174 -105 36 266 144 -97 128 76 231 78
3480G8o8O1l14K96l1K86l93L86l45l8M2J1j60J60J70j87K49l29J7K0L39m36K42
$$ 78 10 71 -243 53 22 308 -85 301 -44 -82 -40 -29 -189 -29 141 -46 203 -126 -109 -89 250 -186 56
3503E6l8k82K51M55m01L9M9j82Q6k31L7N02n01K74j48J38J32j37k75J91o2L51
$$ 56 18 -264 -13 442 41 80 129 -53 33 -198 -161 341 -160 114 -34 104 236 99 -176 15 -47 304
3525C04m95L26k7k71L94l62J77pm4J43R9m10K28Q0P1m50P9L74l88J99M7n9r4L24
$$ 304 -191 135 108 -163 231 -131 46 39 -5 138 237 -173 55 135 206 -244 -165 209 -179 20 67 8 -86 238
3549B38r0j20K19k71K55k66M2K31l36j2J6K38j0j18j56r0J01j0R3MN7k04K3L83
$$ 238 148 28 247 -24 231 -35 7 238 -98 -110 -94 144 134 16 -140 -230 -129 -139 -46 -42 15 -189 -166 217
3573B17l00J11k1KM4m5K4J35k1l07K27O2Rk27oQ9K55j64K7q0k3K14k84K5J43l19
$$ 217 -83 28 7 9 53 8 32 167 146 -161 66 128 137 -90 -96 -7 248 84 111 31 8 222 -62 -37 106 -213
3599b13q4L37N6j99J21K52q8j73K29n74N0J21K67j27l25R8M11l71K81o2J14j7
$$ -213 -297 40 96 -103 18 270 182 9 238 -336 -286 -165 102 -25 -350 -252 159 -212 69 7 121 104
3621A04j01j09J55R5j51J0q1K10k72M05m39N0J38M9j74l10L60L3J42p5p8j80K54
$$ 104 3 -106 49 144 -7 3 -78 132 -140 265 -174 -124 14 63 -111 -421 -61 -28 114 39 -39 -219 35
3644C5P5J53k1l44K62j31J49l3J44o12K1K94O1m4j13J71k2r2R8o2J08k25K94j84
$$ 35 110 263 242 -102 160 29 178 145 289 -323 -302 -8 53 9 -104 67 45 -47 51 -11 97 -128 166 -18
3668a8k99K19L1m6L6j40L91l46J01J30j61j67J14J6rP3j59K29O9KJ51k6k69K23
$$ -18 -317 -98 -67 -113 -77 -217 174 -172 -71 59 -102 -269 -155 -139 -148 -75 -234 -5 64 66 217 191 -78 145
3692A45m34M37k56j65J76M9J81j32J8lJ43q1o7k9K5o7j74K39m03O23j47j49M30
$$ 145 -289 148 -108 -273 -97 -48 133 1 19 16 159 78 11 -18 7 -60 -234 5 -398 225 78 -71 359
3715C59n50l2J18K80k2l07J46l4j09K49M0j73J26O0k06j64L02j58L55m27L59k26
$$ 359 -191 -223 -105 175 153 -154 -8 -42 -151 98 138 -35 91 151 -55 -219 83 -75 280 -147 212 -14
3737a4o7J81j22O2Q1k97j96N06n91N29j73L16k52m3m5L1j24K69J50l31j15L37
$$ -14 -81 100 -22 40 121 -176 -372 134 -457 72 -101 215 -37 -80 -125 -94 -218 51 201 -130 -245 92
3759I2j58k60L29n9L11m13J09K6N8jq0m9J22j37K18k57o3J30k41L21j02K57p1
$$ 92 -66 -326 3 -56 255 -158 -49 -23 35 34 -46 -95 27 -110 108 -149 -212 -82 -323 -2 -104 153 82
3782H2j10J2k42L20j17J32k51J28J2K65l53Q6L11l84J91k36K40J28j92kj24Q8
$$ 82 -28 -16 -258 62 -55 77 -174 -46 -34 231 -122 -36 275 -109 82 -154 86 214 22 20 -104 -16
3804a6J26k76M68m93O4L07j26j0K0O2j02k26L47j19M4k04J87j22J00J93k26K5
$$ -16 110 -166 302 -191 -127 180 54 44 64 126 24 -202 145 26 70 -134 53 -69 31 224 -2 23
3826B3j13K13m3L04k33J56m42J80l57K93K64J28l86J76k80K70q9j09OJ8lj89J1
$$ 23 -90 123 80 384 151 307 -135 45 -312 -19 245 373 -13 163 -117 153 64 -45 -39 -21 -24 -213 -202
3849b02L73j24L23j71l72K49j86m1L23k25r9P2j16K32j06J11J31l17j56K63J26
$$ -202 171 47 370 199 -173 76 -110 -151 172 -53 -152 -80 -196 36 -70 41 172 -145 -301 -38 88
3870H8M6%J16l65j03L11P7m24K70j84K07J75M8l36J61l70L23r7J58k14J68j59
$$ 88 134 134 250 -115 -218 93 170 -254 16 -168 39 214 262 -74 87 -283 40 -57 101 -113 55 -104
3892a04J52J21k60j9P3NJ6N5J2k17k9K37j11k4J30m2j3J34p4k96J82J40k4j98
$$ -104 48 169 -91 -110 -37 -32 -16 39 51 -166 -195 42 -69 -93 37 -5 -18 116 42 -254 -72 68 44 -154
3916a54M08p5k44M5j30J28L3KJ49J92k52q2j84j19J57K66k57K46J4o7j24N9k37
$$ -154 254 179 -65 -20 -150 -22 11 13 162 354 102 20 -164 -283 -126 140 -117 129 143 76 -48 11 -226
3939b26L27k62L0L78l46j45M27K2k21j59L27j15j20J53N2j89j25K2J92Mk04L0
$$ -226 101 -161 -131 247 -99 -244 183 205 -16 -175 152 37 -83 70 122 -67 -192 -170 22 26 -178 -148
3961a48k59N85q9j45R6j31O4K9P7l57K67K18k87j55N0K70J8J45l92M11L5o48K78
$$ -148 -407 178 89 -56 40 -91 -27 2 79 -278 -11 207 -80 -235 -185 85 103 248 -144 267 302 -346 -68
3984f8P0q2j9j21K52O0O3k25L46k25L5o5m4J26Jk63J65J81k66J63Ql00L65n0k67
$$ -68 2 -80 -99 -220 32 92 155 -70 276 51 86 21 -23 103 104 -159 6 187 -79 84 92 -208 157 107 -160
4009a60L72J09k35jJ50l16K0J55p2n8M31m54n9%J43o5j58q5R1L30o3J05j67n9
$$ -160 212 321 86 85 235 -81 -61 94 22 -36 395 -59 -118 -118 25 -40 -198 -283 -192 138 75 180 13 -46
4033d6J58k08M0J7R7j13j0J9N8j05K2J20k46M05l09J29j43K30J00k42j25J23K12
$$ -46 112 -96 -56 -39 58 -55 -65 -46 12 -93 -71 49 -197 208 -101 28 -115 115 215 -27 -152 -29 183
4056A83q3j29j18l1J37J82l11j53M35n2q4K93mp0m36J90k80L90o1k59K86K63m3
$$ 183 100 -29 -147 -178 -41 141 -170 -323 112 60 -24 269 265 195 -241 -51 -331 59 -2 -261 25 288 245
4079B45j00l78O30l46j8K0j05j38J75k09L83j42k09L22k8k70L0Q6j39L26M1k8
$$ 245 145 -233 397 51 33 53 -52 -190 -15 -224 159 17 -192 130 102 -168 -138 -52 -191 135 176 148
4101A48l22M20l71K2j59J49O8k5j03L13j96j98L58j21J59j92K50l24J36J5k5O9
$$ 148 -174 246 -125 -103 -262 -113 -45 -70 -173 140 -56 -254 104 -17 142 -50 200 -124 12 27 2 71
4123G1o4k63K63j88L42J65n30L44Lk79j02J75j80J76J22n8L7j26J09n5J03j98
$$ 71 7 -256 7 -181 161 326 -204 140 143 -136 -238 -63 -243 -67 55 -3 34 -92 17 -38 65 -133
4145a33K22QJ1j03q0k16L97k52K47j51j32j62K92l2L14j69k4j75L1J8K06Mlk14
$$ -133 89 97 108 5 -75 -291 106 -146 101 -50 -182 -344 -52 -84 230 61 37 -138 -107 -89 117 121 118 -96
4169i6P7j40J26J22o0P8J63l78P5q1j96K90j51Q8M0J82j32J88j43J70k07J41j41
$$ -96 -19 -159 -33 89 29 107 270 -108 -33 -114 -310 -20 -171 -83 -43 139 7 195 52 222 15 156 15
4192A5L10l39j74J66O2p8L4o8q8O05l13k79J50m0p9J18M4k68L46l37L64j19q4
$$ 15 325 -14 -188 -22 40 -38 -4 -72 -160 445 132 -147 3 -37 -116 2 46 -222 124 -213 151 32 -52
4215e2k3p3J44q7J2N3k18L65j64J77k10Q0j64J01K96j81j49j51J67J98j38J25
$$ -52 -75 -148 -4 -91 -79 -26 -244 121 -43 134 -76 4 -160 -59 237 56 -93 -244 -77 121 -17 108
4237A08J35j98k1J31p5j10j41J25N0j08j53M79r6k58L14o7j58K13q6j75J20PM87
$$ 108 243 45 24 155 80 -30 -171 -46 4 -104 -257 222 126 -132 182 115 -43 170 84 -91 29 36 523
4260E23o76O0K91M2l81K92n1k68J90J54k50M6j99P8P5j3m2J77J48l16L42k02O1
$$ 523 -153 -93 198 240 -141 151 100 -168 22 176 -74 -28 -227 -149 -74 -87 -129 48 196 -120 222 20 81
4283H1k35J57J89j70J53k18j2J34q0l7M8K34j43l6l67L44l4J76O8l37J08k40L33
$$ 81 -154 3 192 22 175 -43 -55 79 -1 -38 10 244 101 65 -302 42 8 184 252 -85 23 -217 116
4306A16N3k00RJ0R1nP0P1l79J7K0jJ45m2k41L86P6l49n9J00j99K58j98R6kPO0
$$ 116 169 -31 -22 -12 79 74 144 215 -164 -147 -127 -128 17 -25 -266 120 196 -153 -212 -112 -311 -53 -251 -155 -157 -150 -90
4333i0P1l9j35K32p5P9l75L18l1J34l1n1j65K26J82k82J14K53m62J69k48M07k21
$$ -90 -19 -58 -193 39 -36 43 -332 -14 -45 89 58 7 -158 68 250 -32 82 335 -127 42 -206 201 -20
4356b0p2M11k51j11K15k76J96m0k39J77J83k81L54j05r9J5j06J86k01K11k47J49
$$ -20 -92 319 68 -43 172 -104 92 52 -187 -10 173 -108 246 141 42 57 -49 137 -64 147 -100 49
4378D9l89K69p5J08j13J87L31l62J15k03j2M46n38N4R8Q6R9l6j14qL2Q0q2qJ15
$$ 49 -340 -71 -146 -38 -151 36 367 5 120 -83 -95 351 -187 -133 -35 51 150 114 0 -8 24 104 22 14 129
4403A29j08j71K65m9j18K1P8l50K31L4j11K03Q2k99K03l8j0M1k93N03r5k09O2
$$ 129 21 -150 115 66 -52 -31 47 -303 -72 -38 -149 54 136 -163 40 2 -8 33 -260 243 148 -61 1
4426AJ87l51K13q0O1j56L41j79j77l9K38k32j2K82n6j78jO8K22k23J26k67O4L94
$$ 1 188 -163 50 -30 31 -125 216 37 -140 -179 59 -173 -185 97 41 -137 -138 -70 152 -71 55 -212 -148 246
4450B46j57k06J5M0L83n99J32L35j83j07N0L86k76m8j52l1L73k15j82J30N5K22
$$ 246 89 -117 -102 -62 321 -278 -146 189 6 -101 -51 335 59 11 -141 -172 201 -14 -196 -66 -11 211
4472B11p4n9r9J09j05M5KN1k54L86k09k25K33M10m39J30M0l32K01q1P7j93J84
$$ 211 137 78 -21 88 -17 28 30 81 -173 213 4 -221 12 422 -17 113 153 -179 22 -59 18 -175 9
4495Ik39K11K7R2R6j42j94L16j06k17J41l2l3Q6M2k7J45j75K6j74J75r1J5L5R6
$$ 9 -230 -19 8 100 196 54 -140 176 70 -147 -6 -38 -71 15 57 30 175 0 26 -148 27 -64 -49 -14 82
4520H2k63Q1j75J65K31l33L92o12L85k23M79j22p3P2l8ml08K19J31n9J6n7j18
$$ 82 -181 -100 -275 -110 121 -212 180 -432 -47 -270 209 87 14 86 48 44 -264 -45 86 27 43 -14 -132
4543a32L22j82K9m41M88n6J45j29J24J8j82K6O3M9j46m7Q0P6o3jj06j42N4L10
$$ -132 190 8 37 -404 84 28 173 44 168 186 4 30 93 142 -4 -51 29 105 42 41 -65 -207 -153 157
4567A57j5P5l40J91j29K6j31L02k58J85j5j07M9J08j91J67J13j56P2j60P4j34
$$ 157 142 217 -123 68 -61 -35 -166 136 -122 63 48 -59 -10 98 -93 74 187 31 103 -57 17 -117
4589a17P5o0J05l6L07m36P7l6K08q9L7j20J17m7L0Nr8K11Kj00j2L2q2J52J40l11
$$ -117 -42 -102 3 -33 274 -162 -85 -121 87 -2 35 -85 32 -15 15 20 -78 133 135 35 23 55 -27 125 265 -46
4615d6J3J05j97L48k63p1M13n78N6J06j08j7J18J15J6k39K0L37l2L6j8l44P6J31
$$ -46 -33 72 -125 223 -40 -111 302 -276 -220 -114 -222 -239 -121 -6 10 -229 -209 128 96 132 114 -230 -154 -23
4639b3q3o7N5K37L3j34m6K17l7n07L20K98k49k32K23j86M10J0l59K26p8k30J22
$$ -23 -106 -173 -118 119 152 18 -28 189 152 -355 -35 263 14 -218 5 -181 229 239 -120 106 28 -202 -80
4662h0K69j51k76L62J7k65R1P3q0O0K7K9n2P6k16K98k84K05n2lN6M6J49j71l56
$$ -80 189 38 -238 124 141 -124 -33 40 -40 20 47 76 24 100 -116 182 -102 103 51 48 104 150 299 128 -228
4687b28j02O68n17j60M02k20K13n6%o8N0j5K18j0k98J68O1k04Q3M52j98j80l7
$$ -228 -330 338 -179 -339 63 -157 56 0 0 -68 -18 -33 185 175 -123 45 106 -98 -15 437 239 59 22
4710B2j25J81k0k23L03l3Mn3q6R4o3L9Qj23o0Q3k23Q5M40l97m9K14n6j31K15O5
$$ 22 -103 78 58 -165 138 105 109 56 -30 64 1 40 48 -75 -135 -52 -275 -190 250 -147 -196 18 -38 -169 46 111
4736A11J11k87J43j62J76n6L64n50J34Q3j36k49L62K20k10j94j41N49m28l6N4
$$ 111 222 -65 78 -84 92 36 400 -150 -16 67 -69 -318 44 264 54 -140 -281 268 -160 -196 -142
4757a42K13l18K05R0j32K71j03n2j27OL00k18P6Q9R4j67j68O4j1p6K1l01M47j
$$ -142 71 -247 -42 48 -84 187 84 32 -95 -89 211 -7 69 158 252 85 -83 -19 -30 -106 -85 -386 61 60
4781F0j46r3L76k74L7J67N3k66m6K24M6K98l68p7j1O5j93N8K54n8m08K96R0o0
$$ 60 -86 -179 197 -77 -40 127 180 -86 -132 92 138 436 68 -9 -20 45 -148 -90 164 106 -302 -6 84 24
4805B4j13K54q3j57J6P3J20k27J25k4l3J13j43J50J85Q8l56j47n5L12l48K70K35
$$ 24 -89 165 82 -75 -59 14 134 -93 32 8 -25 88 -55 95 280 368 12 -135 -190 122 -226 44 279
4828B79m32N08l54j49J83L8K3m32N77j10k79N06m40L65k10k48J72j82K82ok01
$$ 279 -153 355 1 -148 35 73 96 -336 241 131 -148 358 -82 283 73 -175 -3 -185 97 91 -110
4849a10J9J90M8n2j41K22P0j50j51j89J39K19n3M4K56o26L29j56j22K86l47K65
$$ -110 -91 99 147 95 -46 176 246 96 -55 -244 -105 114 61 105 361 -265 64 -92 -214 72 -275 -10
4871a0k29L0R9m7K89j36L75k31j25J02M5k20J88n1o7q4K20p4j54P7R5j12J74l81
$$ -10 -239 -209 -110 -157 132 -4 371 140 15 117 162 -58 130 79 12 -72 148 74 -80 -3 92 -20 154 -227
4895b27R7K52R2k12K33j75R6l42K21O5k18J36k5R2J38m16L82k20L1j3O1k20L03
$$ -227 -130 122 214 2 235 60 156 -186 35 100 -118 18 -7 85 223 -193 189 -31 0 -13 48 -172 131
4918A31n4N5j6k07K03j50K1J53k16l25K47L01l42K91l8p7j03K56L0p4p6p9K53
$$ 131 77 132 116 -91 112 -38 -17 136 -80 -405 -158 143 -199 92 54 -23 -126 130 160 86 10 -69 184
4941A84l05k0J97l86L01J32o9k6J6J24k62J1L61k26K28r3l64K74k9J06m8j65P1
$$ 184 -121 -141 56 -330 -29 103 34 8 24 148 -114 -103 258 32 260 167 -197 77 48 154 106 -59 12
4964A2q9p2k8K69k78R6K84l32K65k99J39j65K92L9j96J02j92K56j25J9j67L2k8
$$ 12 -77 -149 -177 92 -186 -90 194 -138 127 -172 -33 -198 94 133 -63 39 -153 103 -22 -3 -170 -138 -166
4987a66L0L9K30j97Mr0J57P6k05K12p7l7k02N14k28j47N2J17k86O4K68j00p4m2
$$ -166 -136 -97 133 -64 -60 -150 7 83 -122 90 13 -24 -226 288 60 -87 -35 82 -204 -140 128 28 -46 -88
5011h8m8M75l60MJ27j61J59m0j07O2J13M3j47j39K32j51J78j92K92q6K1j03n3
$$ -88 -136 339 -21 -17 110 -51 108 68 -39 23 136 179 32 -107 125 -26 152 -40 252 166 187 84 31
5034C1k4N3q5j11O8K78j19r5k9J03q8O1J7lm58L86L1Q4N2Kj53j05k02M66j63n5
$$ 31 7 60 -25 -136 -68 210 91 -4 -33 70 -18 43 60 57 -401 -15 16 100 152 154 1 -104 -306 160 -3 -58
5060e8K52l93J41j9K59l10L65r7j13J30l3j68j85J36j4j69L61p4q9L66j86j88
$$ -58 194 -199 -58 -77 182 -128 237 140 27 157 124 -44 -229 -93 -107 -276 85 11 -78 288 102 -86
5082h6l9l4K14j6J46m9p8o3J18k77K40j9j72L21k00Rk89K13N3n4J21j83J21L8
$$ -86 -125 -159 55 39 185 136 58 -5 113 -164 76 57 -115 206 6 15 -274 -61 -8 -62 59 -124 -3 35
5106C5%K5k18L07j72J74l19K24o4q7P1Kl52M34j70j35K60l3pQ7j62j01R0L28k15
$$ 35 35 60 -158 149 -23 151 -168 56 -8 -95 -24 -22 -374 60 -110 -245 15 -18 -25 62 -100 -201 -111 217 2
5131Blj20M88m64K28M02m91j18n0R1P1K27l00J5q3K32k35q%M3O6R5l2Jn1K27l23
$$ 2 -1 -121 367 -97 131 533 42 -76 -126 -35 36 263 -37 -22 -105 127 -108 -116 -116 -73 -7 88 56 57 6 233 -90
5158i0MJ1J15k10j74L14N6O2r8o4L55l50n9J43J63j36j82Q9NO0O8J28o3l08m4
$$ -90 -86 -75 40 -170 -344 -30 26 88 -10 -74 281 -69 -128 15 178 42 -140 -51 -46 14 82 210 147 -161 -205
5183b05R4J3J04J73j53J7Q8J8J72j89j53L64m64M77k92l25QN14l16j75J13Q7j33
$$ -205 -111 -98 6 179 26 43 131 149 321 132 -21 343 -121 356 64 -261 -253 261 -55 -230 -117 -30 -163
5206a63l9K61J02j92J69m5m38J90n4L09qJ35l6k09j28Q5J58J36q6j17j32J38L6
$$ -163 -202 59 161 -31 138 93 -345 -155 -209 100 92 227 191 -18 -146 -61 97 233 147 30 -102 36 72
5229G2j77K59rj93J64j97K39k33J35J46k05j14J1k8K15J90k30j81K01Mk75K15
$$ 72 -105 154 145 -48 116 -81 158 -75 60 206 1 -113 -102 -130 85 275 45 -136 65 69 -206 9
5251Ij24L5L3J22j10J00k9J57q4j55pJ11K12j79L6L09k90j45j70J09J84l40L56
$$ 9 -115 -80 -47 75 -35 65 36 193 109 -46 -53 58 270 91 127 436 146 1 -169 -60 124 -216 140
5274A40j94J4r9K20n8P9KJ47m03L23o0M9j52p5k01R9k6k09J96R3Q8K26k55K5K32
$$ 140 -54 -40 -139 81 23 102 104 251 -152 171 111 160 8 -67 -268 -169 -195 -404 -208 -115 -27 199 -56 -31 201
5299B01m07K98J09j94J22m2j25J6l2J61P5k38K4J28k91L29m09M72k82n9l3J44
$$ 201 -206 92 201 7 129 87 -38 -22 -54 107 182 -56 -32 96 -195 134 -275 197 -85 -144 -177 -33
5321c3K2j0k35j52O57j56j96J52p0P8J83j20r1P5j51J47j20l7R9L4j77M01l64
$$ -33 -11 -21 -256 -408 249 93 -103 49 -21 57 240 120 29 104 -47 100 -20 -57 42 76 -101 300 -64
5344f4J66j97%P8L9k68K42r9J75P1j48j41K45k19P3M7l1L07l84M54l35q7L56j57
$$ -64 102 -95 -95 -17 22 -246 -4 -103 72 143 -5 -146 99 -120 -47 0 -31 276 -108 346 11 -76 280 123
5368A23r1lj22j1j05K06K34m80K81j15N1J72r0J82j96j67J38K57O0Rl07J37j83
$$ 123 32 29 -93 -104 -209 -3 231 -249 32 -83 -32 140 50 232 36 -131 7 264 324 333 26 163 -20
5391b0OR8k10J44o0J37j10J81l04k18O01k13j35J58k61K47L3l40L99k19L20k92
$$ -20 -14 84 -126 18 -42 95 -15 166 -138 -356 245 32 -103 55 -206 41 74 -266 133 -86 234 -58
5413e8k50L66l4Q7j9Pm10j09L97M0j30j6J67k3j70j08J55r5J16J16j42M0k1L42
$$ -58 -308 58 24 111 92 99 -311 -420 -23 17 -113 -129 38 15 -155 -263 -108 -203 -87 29 -113 -73 -94 248
5437B48l30K00j7n5l9k21K33M4J03k03J96l18J72J1J52k01n3Q0J86r3J39k01m
$$ 248 -82 118 101 46 7 -214 19 63 166 -37 159 -159 13 24 176 -25 -78 2 188 95 234 33 29
5460B9M6O6m26N05m6l36K9K15o3M7M3j65R1L7j90L1J19p0L7P3r9R9j2j65J41k61
$$ 29 75 141 -285 220 174 -162 -133 82 19 66 109 -56 35 72 -118 -87 32 -38 -1 72 -27 72 60 -105 36 -225
5486b25J38J09R3j15J40k00k0o3L25l93LL00k09j9k8J09p2J6L3N0J13J52r1l02
$$ -225 -87 22 115 0 140 -60 -80 -143 182 -211 -208 92 -117 -136 -164 -55 -127 -111 -78 -28 85 237 146 -156
5510a56J79j05q6J86m1J02k62J75R8K23l93J83k17K93l41K34r4j46J84r7j32N
$$ -156 23 -82 -168 18 -23 79 -183 -8 90 313 -80 103 -114 179 -162 72 -22 -168 16 -81 -213 -208
5532b08K7J92q6O5J55j99K40M31n21J69K90q57L51L76j056K9J197m1l89p2K09
$$ -208 -181 11 -75 -10 145 -54 186 617 96 265 555 -302 49 425 -631 -602 595 554 165 93 302
5553C02j51L46m97j55p4L45L2J36p41Q5O40l66K30k87N72p7k59K08m22N82p04
$$ 302 151 497 0 -155 -229 116 148 284 -457 -372 268 -98 132 -155 417 340 81 289 -133 449 -255
5574b55K80Jq6p7Q8jj28K70k9j98J66J17j72m8K4K31m60J50m8K67Q8j77J05j73
$$ -255 25 26 -60 -137 -49 -50 -178 92 63 -135 31 148 -24 -72 -48 183 -277 -127 -175 92 180 3 108 -65
5598f5N49l25K11o6l3l14N88m62M80k59m97O93j135K47O51k42j58P42n51N79o13
$$ -65 484 159 370 304 271 -43 545 83 563 304 -193 500 -635 -388 263 21 -137 605 54 633 20
5619B0N27j86j05n76N81l00o1j92M94l09O25k30o03M70j10m66K22K57m13J98M21
$$ 20 547 361 256 -320 261 -39 -100 -292 202 -107 518 288 -315 155 45 -421 -199 58 -355 -157 264
5640B64l97M45k69J16m3Q3j39n78N43n9J8M1K49j4o01K25N21k50J57j64n69O05
$$ 264 -133 312 43 159 116 199 60 -518 25 -34 -16 25 274 260 -341 -116 405 155 312 148 -421 184
5662A84l21J94o8L49m43o5n5P6K35N4l28j2M20J47j229M79M04rj48L40K07j01
$$ 184 -137 57 -11 338 -105 -170 -225 -149 86 140 -188 -200 220 367 -862 -383 21 12 -136 204 411 310
5684C10N1p81n33O28M72m02k58K44M21k97j37L62l80O0K84q1j83Q32n67l75m07
$$ 310 361 -420 -953 -325 147 -255 -513 -269 152 -145 -282 80 -300 -240 44 -37 -220 612 45 -330 -737
5705g37r1O37m8J60J70O44m53j99p9r7K08M8j18p3%m3k3J7l2J13r9J16K03l26
$$ -737 -828 -191 -239 -79 91 735 282 83 4 -93 115 163 45 -28 -28 -71 -94 -77 -109 4 -95 21 224 -102
5729a02j86K36L65k53N7l9l59K2L35l41J65J31J02l0J14k23l38q8M66l45N17J12
$$ -102 -288 -52 313 60 117 78 -281 -259 76 -265 -100 31 133 103 217 -6 -344 -432 34 -311 206 318
5751C18j15j17j31m83R44k72l80nJ77k68J55l68J44Q55l43l20O62l50k44m02P21
$$ 318 203 86 -45 -528 416 144 -236 -241 -64 -332 -177 -545 -401 454 111 -209 453 103 -141 -543 178
5772A78j93Jj49jJ29P20p72J61P35j157R29M16q49l27J168q34k44N6J51K73n45
$$ 178 -15 -14 -163 -164 -35 685 -87 74 809 -348 581 997 148 -179 989 155 -89 -33 118 391 -154
5793a54N42k18L7K7k51j67L38l8M0o29P91K2o87O88l74r0j98K32rl49J251q52
$$ -154 388 170 207 234 -17 -184 154 116 156 -473 318 340 -347 341 -33 -123 -321 -89 -98 -447 804 -48
5815d8N17m05k83N1M09j80l82N22k75J50Ql90N18n42R23m72m86N54L00m80o08
$$ -48 469 64 -219 -168 241 61 -321 201 -74 76 84 -306 212 -330 593 121 -365 189 489 9 -599
5836e99Q94j65J65p3m08L4N14m61K27J25m99K35j67K41j17j69M67j78K15j02j03
$$ -599 295 130 295 222 -186 -152 362 -99 128 253 -246 -11 -178 63 -54 -223 244 66 281 179 76
5857G6l71J18n07K70K31OL95k21J4k8l10M58l8L23k84p23O79p5L16l67n7K68j2
$$ 76 -295 -177 -684 -414 -183 -177 218 -3 11 -17 -327 131 93 416 132 -591 88 13 329 -38 -95 173 161
5880A61j65l6m21O81K43l37K86q85N18j66J71j13K50j91J39j32N18p50L39K29
$$ 161 -4 -40 -461 220 463 126 412 -473 45 -121 50 -63 187 -4 135 3 521 -229 110 339
5900C39k90K00j51L60q80L21J70K22j96p29N62j53N16n57M80Q8m95L01p3J96j25
$$ 339 49 249 98 458 -422 -101 69 291 95 -634 -72 -225 291 -266 214 302 -193 108 35 231 106
5921A06m89K97O78n76j19j01M39m69K41J06N6j74L3j89L09o5k97K06k02L18k9
$$ 106 -383 -86 592 16 -103 -204 235 -234 7 113 169 -5 28 -161 148 83 -214 -8 -210 108 79
5942G9j33J53k05j66J84J23L1j54J28n24O10J32k55l22N12m80J60N34j88P9p68
$$ 79 -54 99 -106 -272 -88 35 66 -88 40 -484 126 258 3 -319 193 -287 -127 407 219 298 -470
5963d70N88j237Q21L57N78n42N18l7j156P04q36J109j61m2k68L65r26O6M56J66
$$ -470 118 -1119 -298 59 637 95 613 576 -580 124 -712 397 236 194 -74 291 -635 -569 -113 53
5983E3J7J13L27k70p79N45M7m3j44K40p1K93J65o72M90J26k66k85j18L22p5Q5
$$ 53 70 183 510 240 -539 6 53 10 -134 106 35 328 493 -179 311 437 171 -114 -232 90 15 100
6005A00l11k58L30J66J96l5j49J82m17J2M16k76L47K41n36J81l0j77O4J75R8J5
$$ 100 -211 -469 -139 27 223 188 39 221 -196 -184 232 -44 303 544 8 189 159 -18 46 221 319 334
6027C34k25J46L54n4n15K53n14M50p5k70Q38j86n05n13J30J051o98o79M19K89
$$ 334 109 255 609 555 40 293 -221 229 154 -116 722 536 31 -482 -352 699 1 -678 -259 30
6047C0l40K52j42J16q12Q48M88l43l06J17N7M20l82K61j00K5L07m32j007J141
$$ 30 -310 -58 -200 -84 -896 -48 440 97 -209 -92 -35 385 3 264 164 189 496 64 -943 198
6067A98j82J31J02m8l35J63P5R8O15p59J056l60o5p82M21n27K86R0l76J62P0J45
$$ 198 16 147 249 201 -134 29 104 202 817 58 1114 754 689 -93 328 -199 87 177 -199 -37 33 178
6089A78P04j003R2K10k87Q0N74n82m09R1K74N03l63L55q98Q15j132Q49L26j16
$$ 178 882 -121 -29 181 -106 -26 548 -34 -443 -352 -78 425 62 417 -481 334 -798 51 377 261
6109B61n28J22K06L14k71k65m48K45K15J56J70J07L51p07q1j33L02oO62l87k41
$$ 261 -267 -145 61 375 104 -161 -609 -364 -149 7 177 284 635 -72 -153 -286 16 10 672 285 44
6130D4K07J02o60N92l28j8j67P2m64K24N97j06M35j008N74m10K84N63k45l66j96
$$ 44 251 353 -307 285 -43 -61 -228 -156 -620 -396 201 95 530 -478 96 -314 -30 533 288 -78 -274
6151b74Q26j76j54K90n89k65J04M82q13J155n45M97n35J93J31O6p34L19N11m57
$$ -274 552 376 222 512 -77 -342 -238 244 -569 586 41 538 3 196 327 393 -341 -22 489 32
6171C2M50r65P0J12k39N10Q8k85M4K38k15l57R89m76l53L74M29J93m86L0o11L89
$$ 32 482 -483 -413 -301 -540 -30 58 -227 -183 55 -160 -517 472 -4 -357 17 446 639 153 183 -428 -39
6193c9O53q77k04L9M92J015n29p65j0N99l89j24JN69l88L09r1k76q08M97Q11K66
$$ -39 614 -263 -467 -428 64 1079 550 -215 -225 374 -15 -139 -138 431 43 352 261 -15 -823 -326 485 751
6215G51m1L82j132q73J417o04K81k28O07n92L89o33L03N2N5j3k66j89m35R89M3
$$ 751 710 1092 -40 -913 504 -100 181 -47 560 -32 357 -276 27 79 134 121 -145 -334 -769 220 263
6236B63r7p40J39M11k52m01K34N0K14P2k21L34K04o35O50p50J031m77L15l20j100
$$ 263 166 -574 -435 -24 -276 -677 -443 -393 -179 -107 -328 6 210 -425 225 -525 506 29 344 24 -1076
6257a076J886r98K98n46O22k80J89O5Rm4j38J45j82q9N2Q8K8j14R4J47J3Jj13
$$ -1076 810 -188 110 -436 186 -94 95 160 169 125 -13 132 -50 -139 -87 1 29 -85 9 156 169 170 57
6280E7l57M82q2j1J76m04K05j5K7J5j76j8J31j29J6P2J85o2qj14j41j4M54k08
$$ 57 -300 182 100 89 265 -139 66 51 78 93 -83 -101 30 -99 -83 -11 174 112 104 -10 -151 -165 289 81
6304H1j80J43m6N5j19j2Lr5N3j6K50k80O6l12O03n4j99J2M59k85j53RJ39j08l84
$$ 81 -99 44 -2 53 -66 -78 -75 -170 -117 -133 117 -163 -97 -409 194 140 -59 -47 412 127 -26 -17 122 14 -370
6329c70M23k73N13m08QLL44j31n6j43K32l75j30O44j07k80Q7J32j97R1J58k11
$$ -370 53 -220 293 -115 -107 -104 240 109 53 -90 142 -233 -363 281 174 -106 -19 113 -84 7 165 -46
6351d6k21K45n6o6L40k41O3R3k08jr0K89J92k53K6j85J41p1j36L43j0Mp3K6k81
$$ -46 -267 -22 -78 -144 196 -45 18 111 -97 -98 -188 101 293 40 66 -119 22 -49 -185 158 148 152 79 105 -176
6376a76J54L8j63L57K9k05R4M2J9l50L2M2K58k90q6K60m04K46J36N3j62L23l02
$$ -176 -22 16 -147 210 239 34 128 170 189 -161 -129 -87 171 -119 -205 55 -349 -103 33 86 -76 247 -55
6399e5j30L19J03l32K45j89J47m0j9k68K27n7L6R6j89J17q4K55Oj26l05L87l00
$$ -55 -185 134 237 -95 150 -39 108 68 49 -219 8 -49 -13 83 -106 11 -73 182 188 62 -243 144 -156
6422a56M34j57k10L45m65K57J21m03Mj2K28K41k63K87j55j11J6J35l03l5J30Q3
$$ -156 278 121 -89 256 -209 48 169 -234 -230 -242 -14 227 -36 251 96 -15 1 136 -167 -202 -72 11
6444A1J76j50NK81k78q3j81K72l76M34j93R3J76mj90J57j35J77l25K74j60J24
$$ 11 187 37 42 323 45 -38 -219 53 -323 111 -82 11 187 183 -7 150 15 192 -133 141 -19 105
6466A05k41L97m55J64k13L45o3p7M0j14J61l38K50K27q0J32m56K98j90L7k22K99
$$ 105 -136 261 -194 -30 -243 102 39 -38 2 -112 49 -289 -39 188 108 240 -216 82 -108 -71 -293 6
$$ [...]
8191a23
##END NTUPLES=NMR FID
##END=
