##TITLE=1H_Pr NCS-160
 200.13MHz,CDCl3,
 8 sc
 
 8.7.2025
##JCAMPDX= 6.0         $$ Bruker NMR JCAMP-DX V2.0
##DATA TYPE= NMR FID
##DATA CLASS= NTUPLES
##ORIGIN= UXNMR, Bruker Analytische Messtechnik GmbH
##OWNER= pz
$$ XWIN-NMR		Version 3.5
$$ Tue Jul  8 16:00:09 2025 Russian Standard Time (UT+4h)  she@DPX200
##.OBSERVE FREQUENCY= 200.1313
##.OBSERVE NUCLEUS= ^1H
##.DELAY= (6, 6)
##.ACQUISITION MODE= SIMULTANEOUS
##.ACQUISITION SCHEME= undefined
##.AVERAGES= 8
##.DIGITISER RES= 18
##SPECTROMETER/DATA SYSTEM= spect
##.PULSE SEQUENCE= zg30
##.SOLVENT NAME= CDCl3
##.SHIFT REFERENCE= (INTERNAL, CDCl3, 0, 14.3821)
##AUDIT TRAIL= $$ (NUMBER, WHEN, WHO, WHERE, WHAT)
$$ ##TITLE= Audit trail, XWIN-NMR		Version 3.5
$$ ##JCAMPDX= 5.01
$$ ##ORIGIN= Bruker BioSpin GmbH
$$ ##OWNER= she
$$ F:/spectra/data/she/nmr/H-C/1/audita.txt
$$ ##AUDIT TRAIL=  $$ (NUMBER, WHEN, WHO, WHERE, WHAT)
(   1,<2025-07-08 15:58:56.07 +0400>,<she>,<DPX200>,
      <created by zg, POWCHK disabled, PULCHK disabled
       configuration hash MD5:
       00 E9 B6 7A A2 85 ED C7 34 08 36 98 17 FE 4E 26
       data hash MD5: 16K
       42 29 09 3C D7 09 F5 D5 67 91 60 B3 C0 F5 2D 7D>)
$$ ##END=
$$ 
$$ hash MD5
$$ D7 54 2E 98 5E 6F CD 10 87 35 E7 C7 98 FF 5E 53
##$RELAX= 
##$RELAX= 
##$RELAX= 
##$RELAX= 
##$RELAX= 
##$RELAX= 
$$ Bruker specific parameters
$$ --------------------------
##$DU= <F:/spectra>
##$EXPNO= 1
##$NAME= <H-C>
##$PROCNO= 1
##$TYPE= <nmr>
##$USER= <she>
##$AMP= (0..31)
100 100 100 100 100 100 100 100 100 100 100 100 100 100 100 100 100 100 
100 100 100 100 100 100 100 100 100 100 100 100 100 100 
##$AQSEQ= 0
##$AQ_mod= 1
##$AUNM= <au_zg>
##$AUTOPOS= <>
##$BF1= 200.13
##$BF2= 200.13
##$BF3= 200.13
##$BF4= 200.13
##$BF5= 200.13
##$BF6= 200.13
##$BF7= 200.13
##$BF8= 200.13
##$BYTORDA= 1
##$CFDGTYP= 0
##$CFRGTYP= 5
##$CHEMSTR= <none>
##$CNST= (0..31)
1 1 145 1 1 1 1 1 1 1 1 1 1 1 1 1 1 1 1 1 1 1 1 1 1 1 1 1 1 1 1 1 
##$CPDPRG= <>
##$CPDPRG1= <>
##$CPDPRG2= <>
##$CPDPRG3= <>
##$CPDPRG4= <mlev>
##$CPDPRG5= <mlev>
##$CPDPRG6= <mlev>
##$CPDPRG7= <mlev>
##$CPDPRG8= <mlev>
##$CPDPRGB= <>
##$CPDPRGT= <>
##$D= (0..31)
0 0.7 0 0 0 0 0 0 0 0 0 0.03 0 0 0 0 0 0 0 0 0 0 0 0 0 0 0 0 0 0 0 0 
##$DATE= 1751975935
##$DBL= (0..7)
120 120 120 120 120 120 120 120 
##$DBP= (0..7)
150 150 150 150 150 150 150 150 
##$DBP07= 0
##$DBPNAM0= <>
##$DBPNAM1= <>
##$DBPNAM2= <>
##$DBPNAM3= <>
##$DBPNAM4= <>
##$DBPNAM5= <>
##$DBPNAM6= <>
##$DBPNAM7= <>
##$DBPOAL= (0..7)
0.5 0.5 0.5 0.5 0.5 0.5 0.5 0.5 
##$DBPOFFS= (0..7)
0 0 0 0 0 0 0 0 
##$DE= 6
##$DECBNUC= <off>
##$DECIM= 32
##$DECNUC= <off>
##$DECSTAT= 4
##$DIGMOD= 1
##$DIGTYP= 9
##$DL= (0..7)
0 120 120 120 120 120 120 120 
##$DP= (0..7)
150 150 150 150 150 150 150 150 
##$DP07= 0
##$DPNAME0= <>
##$DPNAME1= <>
##$DPNAME2= <>
##$DPNAME3= <>
##$DPNAME4= <>
##$DPNAME5= <>
##$DPNAME6= <>
##$DPNAME7= <>
##$DPOAL= (0..7)
0.5 0.5 0.5 0.5 0.5 0.5 0.5 0.5 
##$DPOFFS= (0..7)
0 0 0 0 0 0 0 0 
##$DQDMODE= 0
##$DR= 18
##$DS= 0
##$DSLIST= <SSSSSSSSSSSSSSS>
$$ [...]
##$SUBNAM0= <"">
##$SUBNAM1= <"">
##$SUBNAM2= <"">
##$SUBNAM3= <"">
##$SUBNAM4= <"">
##$SUBNAM5= <"">
##$SUBNAM6= <"">
##$SUBNAM7= <"">
##$SUBNAM8= <"">
##$SUBNAM9= <"">
##$SW= 18.0517328524113
##$SWIBOX= (0..15)
0 0 2 0 0 0 0 0 0 0 0 0 0 0 0 0 
##$SW_h= 3612.71676300578
##$TD= 16384
##$TD0= 1
##$TE= 0
##$TE2= 300
##$TE3= 300
##$TEG= 300
##$TL= (0..7)
0 120 120 120 120 120 120 120 
##$TP= (0..7)
150 150 150 150 150 150 150 150 
##$TP07= 0
##$TPNAME0= <>
##$TPNAME1= <>
##$TPNAME2= <>
##$TPNAME3= <>
##$TPNAME4= <>
##$TPNAME5= <>
##$TPNAME6= <>
##$TPNAME7= <>
##$TPOAL= (0..7)
0.5 0.5 0.5 0.5 0.5 0.5 0.5 0.5 
##$TPOFFS= (0..7)
0 0 0 0 0 0 0 0 
##$TUNHIN= 0
##$TUNHOUT= 0
##$TUNXOUT= 0
##$USERA1= <user>
##$USERA2= <user>
##$USERA3= <user>
##$USERA4= <user>
##$USERA5= <user>
##$V9= 5
##$VALIST= <valist>
##$VCLIST= <CCCCCCCCCCCCCCC>
##$VD= 0
##$VDLIST= <DDDDDDDDDDDDDDD>
##$VPLIST= <PPPPPPPPPPPPPPP>
##$VTLIST= <TTTTTTTTTTTTTTT>
##$WBST= 1024
##$WBSW= 4
##$XGAIN= (0..3)
0 0 0 0 
##$XL= 0
##$YL= 0
##$YMAX_a= 309130
##$YMIN_a= -268265
##$ZGOPTNS= <>
##$ZL1= 120
##$ZL2= 120
##$ZL3= 120
##$ZL4= 120
##$ABSF1= 10
##$ABSF2= 0
##$ABSG= 5
##$ABSL= 3
##$ALPHA= 0
##$AQORDER= 0
##$ASSFAC= 0
##$ASSFACI= 0
##$ASSFACX= 0
##$ASSWID= 0
##$AUNMP= <proc_1d>
##$AZFE= 0.1
##$AZFW= 0.1
##$BCFW= 1
##$BC_mod= 2
##$BYTORDP= 1
##$COROFFS= 0
##$CY= -3
##$DATMOD= 1
##$DC= 2
##$DFILT= <>
##$DTYPP= 0
##$F1P= 0
##$F2P= 0
##$FCOR= 0.5
##$FTSIZE= 0
##$FT_mod= 4
##$GAMMA= 1
##$GB= 0.15
##$INTBC= 1
##$INTSCL= 1
##$ISEN= 128
##$LB= 0.25
##$LEV0= 0
##$LPBIN= 0
##$MAXI= 10000
##$MC2= 0
##$MEAN= 0
##$ME_mod= 0
##$MI= 1.114404
##$NCOEF= 0
##$NC_proc= 0
##$NLEV= 6
##$NOISF1= 3.799351
##$NOISF2= 2.8
##$NSP= 1
##$NTH_PI= 0
##$NZP= 0
##$OFFSET= 14.38212
##$PC= 1
##$PHC0= -1361.74
##$PHC1= 16.39247
##$PH_mod= 1
##$PKNL= yes
##$PPARMOD= 0
##$PSCAL= 0
##$PSIGN= 0
##$REVERSE= no
##$SF= 200.129724274929
##$SI= 16384
##$SIGF1= 3
##$SIGF2= 2
##$SINO= 400
##$SIOLD= 16384
##$SREGLST= <1H.CDCl3>
##$SSB= 0
##$STSI= 0
##$STSR= 0
##$SW_p= 3205.1282051282
##$SYMM= 0
##$S_DEV= 0
##$TDeff= 0
##$TDoff= 0
##$TI= <>
##$TILT= no
##$TM1= 0
##$TM2= 0
##$TOPLEV= 0
##$USERP1= <user>
##$USERP2= <user>
##$USERP3= <user>
##$USERP4= <user>
##$USERP5= <user>
##$WDW= 1
##$XDIM= 8192
##$YMAX_p= 0
##$YMIN_p= 0
$$ End of Bruker specific parameters
$$ ---------------------------------
##NTUPLES= NMR FID
##VAR_NAME=  TIME,          FID/REAL,        FID/IMAG
##SYMBOL=    X,             R,               I
##VAR_TYPE=  INDEPENDENT,   DEPENDENT,       DEPENDENT
##VAR_FORM=  AFFN,          ASDF,            ASDF
##VAR_DIM=   8192,          8192,            8192
##UNITS=     SECONDS,       ARBITRARY UNITS, ARBITRARY UNITS
##FACTOR=    0.0002768,     1,               1
##FIRST=     0,             0,               0
##LAST=      2.2672688,     0,               0
##MIN=       0,             -268265,         0
##MAX=       2.2672688,     309130,          0
$$ Real data points
##PAGE= N=1
##DATA TABLE= (X++(R..R)), XYDATA
0@%%%%%%%%%%%%%%%%%%%%%%%%%%%%%%%%%jLnOoOoQj1J3j4J5j7J9k2K5k7L2l6L9
53B1m2M1m1M2l9L4k3MK3p3J60l12O00j191K628p350M8350K66298j48871l40640
73a80381j6473K04648J04257o9598o7529K348J294j96L5093J6119k4906j9845
85a5169Q824R109o148j235J2903J626j1869o074L785M678K338j12j130m188k375
100e037M683M056l113k363K034Q94j859l27J855p47j914L183K717m908m901L319
116b428O056L48n278k914L222L327r86k098K0J027N45m33j654p79K659L188k044
133A778n107n65M562L181k327m114M3K891N9j221J804J538k554k949Q50L869K103
150C841k883l998M38L511J229j328j155J63M26o93m23J410J208k192j858J735
$$ plain form
0 0 0 0 0 0 0 0 0 0 0 0 0 0 0 0 0 0 0 0 0 0 0 0 0 0 0 0 0 0 0 0 0 0 0 -1 2 -3 3 -3 3 -3 5 -6 7 -7 8 -9 10 -12 13 -14 18 -18 21
53 21 -21 20 -21 21 -18 16 -7 -3 20 -53 107 -205 395 -796 1832 -5518 42832 309130 160259 -180381
73 -180381 -196854 7794 112051 42453 -25076 -22728 -21434 -21630 13463 29582 4676 -15169
85 -15169 -6345 2764 -3384 -4619 8284 9910 -1959 -8033 -4248 430 2768 2656 1526 -2662 -5037
100 -5037 -354 3702 589 -1774 260 1154 -705 -1032 823 76 -1838 1345 4062 -846 -5747 -2428
116 -2428 3628 3976 -1302 -4216 -994 2333 1347 -751 -731 296 841 408 -1246 -2025 634 3822 1778
133 1778 -3329 -3894 668 3849 1522 -2592 -2549 342 401 -820 984 2522 -32 -2981 -2131 1738 3841
150 3841 958 -3040 -2602 909 2138 810 -345 -182 244 -449 -872 538 1746 -446 -2304 -569
166e69J942q19j442M61J051k31r22L53P12n99l95M57M48l11n83J24M21L1j60o2
186i3L23J50l96p68J64J522P12j831j951J363K359j63j628o38M02N20R6K03K87
205F33q89p80N81Q57J68k68n06k91J76N56K91l60k87p0j1Q5K81J83j24l78j70
226c23J56K30K00k5l82k81K35O04l8n06K28Q0n24J29N00J27l78n24J15Q60k3o54
248a94J4K59M7r3r3M0J08l3q6n4L4J62r7k3n8O1qKl8L5m1O4O6j01K9p6J8K29j09
277F4k51Q3K39J9j75j06M7J70j18j60K90J44k67j75K14R2Kk13o0J38J26l1o6m7
301d1N1lk3Lp7J22Q3k74m4L03J08j68j71L3R2J35j41j45J29N0Lo6P4j1k0n4k2
328g4K02L8k07j37J99K4J0m9r8J35M3r5M6K1l1J4L5k7K1j53N7P4l7n8k8Q1Qm2
$$ plain form
166 -569 1373 554 -888 -427 624 393 -529 -176 536 -63 -458 -1 447 136 -447 -323 98 129 -31 -93
186 -93 230 380 -16 -784 -620 902 1614 -217 -2168 -805 1554 1391 -237 -875 -473 47 143 346 633
205 633 -256 -1036 -455 402 570 302 -204 -495 -319 237 528 168 -119 -189 -200 -115 166 349 225 -153 -323
226 -323 -167 63 263 238 -144 -425 -190 414 376 -130 98 178 -346 -217 283 410 32 -492 -377 483 460 -194
248 -194 -180 79 126 33 -60 -20 88 55 -31 -85 -51 111 14 -9 -67 -6 -14 -12 -50 -15 -56 8 74 -27 2 -74 -56 173 64
277 64 -187 -104 135 154 -21 -127 -80 90 -28 -188 102 246 -21 -196 18 110 112 -101 -161 -23 103 72 6 -41
301 -41 10 7 -16 -13 -90 32 115 -159 -203 100 208 40 -131 -98 -6 129 -12 -157 -28 22 25 -41 33 22 2 -52 -74
328 -74 128 166 -41 -178 21 45 55 6 -92 43 86 -9 37 58 27 41 76 49 70 -83 -26 48 11 -47 -75 6 14 -28
356b8R1p2j4M8r1L3J08r2o6O1P3Q4kk13m1J69N3n5m3l4j8M6r1Q1R1r7m4K9K3Q6
386G5j2k5j24j3Q7P7p1N3p4lK4K7NN6j33o4Q6P8J5p3k6k5L4NK2mk7O5o1lkL2N6
419E7k5K7m4rm7L5J0k9R1n8K6r7RJ59J02j72j39K4P0K18p4k59OK8K7J39M7p4j69
448a21K7K6J54Q2j07j20n3k0J74J52o7k23k2R1J26K0j14j01N5k1N9J8j0n9K0N7
474B3k6k5J0N8np5j5j5M4J9qM5k4Pro4L3M6M9j0n8j02N1J56O2j67j75R8J16P7
504A16j06m2k5LQ9k3oM5r3M4jK8j7l4R8Rj53n9R1M1M9l7r8M1M4K3K7m2k4p2K5
535e9M5P6ro5q7J08L2j8N3r2ql6R6j4O2n1l6l5k4L4L7M4q7pj2R4l7J9J4r4M4J6
567CPj6K2L2Qj01Qk1P1R6o3l1n2J4J11L5p2p8j9L8P9j4o6p0P0Q1k3l1K8qL7q6
$$ plain form
356 -28 63 -9 -23 25 -66 -33 75 -17 -83 -22 51 135 133 -80 -121 48 101 46 3 -31 -49 -3 -94 -13 78 -19 -63 -34 -11 75
386 75 63 38 -86 -99 -12 65 -6 47 -27 -30 -6 21 26 82 -51 -115 -29 49 64 -9 -35 -60 -26 -21 1 -3 -30 35 -26 -29 -31 1 57
419 57 32 59 15 6 -41 -6 4 -25 66 8 34 -63 -54 105 207 35 -104 -80 -10 208 134 -125 -119 -91 -64 75 122 48 -121
448 -121 -94 -68 86 168 61 -59 -112 -132 42 194 127 -96 -118 -27 99 119 5 -96 -41 -62 -3 15 5 -54 -34 23
474 23 -3 -28 -18 40 35 -40 -55 -70 -26 -7 -15 30 6 13 4 -60 -27 19 68 58 0 -102 -51 105 167 0 -175 -77 39 116
504 116 10 -32 -57 -54 35 12 6 51 -42 2 1 29 12 -22 76 85 -68 -127 -36 5 54 17 -81 -40 4 27 54 12 -12 -84 -59
535 -59 -14 62 53 -12 -99 9 41 23 76 -16 -24 -60 36 22 84 33 -3 -38 -62 -28 9 53 -34 -41 -53 41 4 23 37 -57 -13 3
567 3 10 -6 16 48 56 -45 -37 -58 13 109 46 15 -37 -23 88 123 51 -27 -46 -8 71 57 -9 -79 -9 72 49 18 46 38 75 -11
599a1n2L2J6J0J8K1o6l6P0N8%r5K6l3O4k1J1l8L1P3j42L2O9L6m8J8j10J44M6m6
629G7j04J4m1J7P5j3p5J8N8p1O2k0j9P7q5K0P1q0Ll0J9Q3m4J5j0J1n9N7Jj6j6
660el3R9j37J24m0J0m4K7K7p2N0l5N2j6k1L2l2K4QL3qp5Q5p1rj1K8L1J0m8m0O8
692A1Ok4J8l4M0j3m6O7Lq9M4MLj2N4j9Ql2P4q9K5M2l9m3O1l6OO8m3o9O7k3l1L7
726dm0M8m1N3l9L7l6O6m0L4n5L4k3J3N3j06K3L2K4k4pj3R9j20R2m2j6k8k3J21
756G2o3Rl0K0oJkJ5j3Jlk4J2oL0m2P1j13N5M7m9j4K1J7M5mm8j2Q1r0M5n4N1J0
790C0j4K3m6M2l9j1O5j5k9J3N9j66jQ8l5L9j7J2k4L4J4k6kk4J4N0m7j0Q6r2P2
821D3J5o8K4j5M2K9o6NJ0l2l2P1j2J0K6l0k6M0j3J2k7P6o6l6MJ2j3k8M9Kl4j6
$$ plain form
599 -11 -63 -31 -15 -5 13 34 -32 -68 2 60 60 -35 -9 -42 22 1 12 -26 5 78 -64 -32 37 73 25 43 -67 77 123 77
629 77 -27 -13 -54 -37 38 25 -50 -32 26 -45 17 -3 -22 55 -30 -10 61 -19 -16 -46 -27 56 12 27 17 28 -31 26 27 11 -5
660 -5 -38 61 -76 48 8 18 -26 1 28 -44 6 -29 23 7 -14 18 -14 10 18 51 43 -32 53 -18 -27 -38 -10 21 31 -17 -57 11
692 11 17 -7 11 -23 17 4 -42 25 28 -61 -17 -13 -10 -22 32 13 21 -11 63 -26 -1 41 2 -41 20 -16 -10 58 15 -54 13 -10 -41 -4
726 -4 -44 4 -37 16 -23 14 -22 44 4 38 -17 17 -6 7 60 -46 -23 9 33 9 2 -11 88 -32 60 18 2 -26 -49 72
756 72 9 18 -12 8 2 3 1 16 3 4 1 -23 -11 -17 13 -29 42 -71 -16 31 -18 -32 -11 6 51 47 -1 -13 68 -22 23 -31 20 30
790 30 16 39 -7 35 -4 -15 50 35 6 19 78 -88 -89 -1 -36 3 -14 -2 -26 8 22 -4 -6 -30 -16 34 -13 -23 63 -29 43
821 43 58 -10 14 -1 41 70 4 9 19 -13 -45 26 14 24 50 20 -6 34 21 33 6 82 16 -20 -16 -4 -17 -45 4 6 -28 -44
853d4J7J7OPl7N5o1M9j3J1K5J1k7n8J10r0oM4j1nM8k5m1L4N4p5J7l1Nj1J9M1j
886C4n4j8J9NL7mm7J1RJN5o5J0j9PN3m9l6L9K4l3m6J10m8j0R5l8m1M7l5J2l7M6
919C4k7jk3P8l9L0l0j4k3m3J6K8Lj6M9m2J8LLPn6P6m2K0%KnK8k7n3K1R3j24K2
953c4L5K8j9Nk2K8NK2o9K8j4J5L3n1RM1k9O3o2l3MJ3J0M1r4P5o1P3n0J0jn5N8
986Bk1L8l7J7N4q0m4O3j7M6K2m2rk0l1J31p9k2K7NM6l9nn2K0j3mL4Rj1O0p4K1
1019ek4k2K6J0L0nl3J5k4j1O1K2q6lJ2M6L3n5J2m2L7lK4lj4j6L5J9n4L5Mk0M2
1052D3n4K9k8N8o6P4q2L2j3j2P6j20P5k5m0L0K7k3j1J0j8k4J00l9L1k8k4OL1j4
1082AlJ2k4Q3m7Lpk8K9k3k9L2k6O6rjk7L1q3N1O0o9KJ2l4O1lm3m6M4pO7l7n2R5
$$ plain form
853 -44 -27 -10 -4 3 -34 21 -40 9 -4 7 32 43 16 -42 68 -22 -28 16 5 0 48 23 -18 16 70 -5 12 -19 -14 -25 -6 35 34
886 34 -20 -38 -19 -14 23 19 -28 -17 -8 -7 48 -17 -7 -26 -19 34 -15 -51 -12 12 -21 -67 43 -5 -15 80 42 1 48 13 25 -12 34
919 34 7 6 -17 61 22 52 22 8 -15 -58 -42 -14 -11 -27 22 -20 -2 1 4 11 -45 31 -11 9 9 11 6 34 7 -46 -25 68 -56 -34
953 -34 1 29 10 15 -7 21 26 48 -21 7 -7 8 41 -10 -1 40 11 74 12 -21 -17 -4 6 47 -47 28 -33 40 -10 0 -1 -56 2
986 2 -19 19 -18 -1 53 -27 -71 -8 -25 21 43 1 -8 -28 -59 72 -7 -29 -2 3 49 10 5 -47 -27 -40 -44 -10 -1 -12 48 -26 -5
1019 -5 -29 -51 -25 -15 15 10 -23 -8 -32 -43 18 40 -46 -49 -37 9 42 -13 -1 -43 -6 -9 15 12 -2 -18 17 36 -18 17 21 1 43
1052 43 -11 18 -10 48 -18 56 -26 6 -7 -19 57 -63 12 -13 -53 -23 4 -19 -30 -20 -38 -62 38 -1 30 2 -22 -16 15 1
1082 1 -2 10 -14 69 22 25 18 -10 19 -4 -33 -1 -27 39 30 29 2 33 -50 1 61 -8 -6 6 -28 33 30 -13 -59 -15 -22 45 8 -44 51
1117E1p6O6j1o6O0p3J10m1l3M6p5N6l5NJ3M5m2l4NK6J3k0J2l9JK7K2L7jl9p4O0
1149dP1p3K3n6N6kj1oj8KJ6k5K5K9m7K3K4o4O1l5L4Rj8Lk3N6m7lk1pKJ0k8L1L7
1184B4k3K7l3mJ2k8K1k5M8n1QK6Or5N2J0K7l8j2L7K8p5Q7ol1L2K3r8M1LK3o2M7
1217AL2K4J0j00M2K0k7K6k3l8j7O1L3l6m2J1K3j5K4J6n4lK8m4O0l9M9m4L2m0l9
1248f9N4Q1p4k1K9N0k9j4Rn5j0K8O5m4Ml9Q6p1M1k3O7r6j1J3jJ3K7k1K2rJ7j0
1280IRk9k6L6K1Ln9K2Q7n7l5K6j4N4q0L5L8q7P8K2l7l3m9Q4Kl2m4M6Mk3K4l4O2
1313B3o4J7J8J6j04P7M2j9n7L4K0l3J9n8O5m7P0L1m4J6j9PMj2j7m6R0k6%rk3O1
1345C2l1K1K0m4m2M2K7k9J1j4K7llJ7k0o4LJ4KMnM2j7J9Om9l7J7N2nJ6k2k3L2
$$ plain form
1117 51 -25 41 30 -36 24 -49 61 20 -13 33 -42 14 -21 -16 -3 42 0 -34 -29 -3 10 -10 2 -37 -36 -9 13 50 49 10 -64 -4
1149 -4 67 -6 17 -39 17 15 4 -2 -20 -18 -2 -27 -2 27 -20 3 27 -37 24 -11 23 32 14 17 -6 50 3 0 -21 -28 -26 -16 -44 -13 24
1184 24 1 28 -5 -9 3 -25 -4 -29 19 -32 -24 2 8 -87 -35 -25 2 -36 -48 -11 17 -58 29 23 -8 24 47 -51 -10 -7 16 -46 1
1217 1 33 57 67 -33 9 29 2 28 5 -33 -50 11 44 8 -34 -23 0 -15 9 25 -29 -32 -4 -48 12 -27 22 -22 10 -30 -69
1248 -69 -15 66 -8 -29 0 50 21 7 16 -39 -49 -21 44 0 4 -35 51 -20 21 -2 65 -31 -42 -29 -30 -17 10 -11 11 2 19 9
1280 9 18 -11 -37 -1 20 23 -36 -14 73 16 -19 7 -7 47 -33 2 40 -47 31 53 16 -17 -66 18 20 -12 -56 -10 -6 -29 -5 -39 23
1313 23 -41 -24 -6 10 -94 -17 25 6 -51 -17 3 -30 -11 -69 -4 -51 19 50 6 22 3 10 14 2 -15 -61 29 3 3 -6 -29 32
1345 32 1 22 42 -2 -44 -2 25 -4 7 -7 20 17 14 31 11 -53 -50 -36 -34 -30 -35 7 -10 9 15 -34 -71 -54 -2 -7 9 -13 -36 -4
1379dJ5N7r3K0K2n2R7n7K4j9l0k6N8J7n9KNL0pMQl1kJ0J6ll4K8j2M0l5NrnK1K2
1415B3qO6r7M2l9M3Jp3M3mJ2L4Pp5jK0J2K4jj0k2J9L5Mm9L2j3k3Mm3J9Mk3n9L3
1450f3P4l1oJ7J5pkJ4Ll9KN0l2Pjj4N3j5J3j8j5L5r2N4Q3q9j4L8n2K6rk9M9J1
1484A6J0J1k9l5J8l6O3j0p0L1j4N9j5l9RK8QJ5k6No3J16m8Pj5Qk1K6nJ2J1m7M3
1517B3k7L0k7l3L8l6L0MOJ%j2K1o7M1ko5O7K3Rj8Ql0L2m8J7j5M4%Jl3K5m0J2K9
1552Hkm7N7l6K1N9p6L8j5mJ8n1N9l9m2J4J7M6n2qk9O4m9N6j7j6L0N4k5m7L2jn9
1585d2M3jJ5LK0j6m8j9O0m9L7M1J5m2j7K0k0Q6j02M6k0J3j5j8L5o5N4j8k4k7O2
1616Gm0j5J1L5k3M9m7k4P1L8m1m9M4n2J0L0n0Q5m3J1j8K0OK1p9M5L9k3k9O0k6
$$ plain form
1379 -4 11 68 -25 -5 17 -35 62 5 29 10 -20 -46 12 29 -30 -28 -23 7 0 4 12 -19 -21 -11 5 2 -32 -4 -16 24 -11 -6 -15 -20 1 23
1415 23 15 81 -16 26 -13 30 31 -42 1 -3 9 43 50 -25 -26 -6 6 30 29 19 -3 16 51 55 6 38 25 2 6 -37 -18 -14 -37 -96 -63
1450 -63 11 -20 -26 -9 6 -1 -3 11 14 -25 -23 27 -5 2 1 -13 40 25 38 20 5 40 -52 2 85 -4 -18 20 -32 -6 -15 -44 5 16
1484 16 26 37 8 -27 -9 -45 18 8 -62 -31 -45 14 -1 -40 -31 -3 5 20 -6 -1 -64 52 4 11 -4 4 -17 9 4 16 27 -20 23
1517 23 -4 26 -1 -34 4 -32 -2 2 8 9 9 -3 18 -49 -8 -10 -75 -8 15 24 6 14 -16 16 -32 -15 -30 14 14 15 -18 7 -33 -21 8
1552 8 6 -41 16 -20 1 60 -16 22 7 3 21 -30 29 -10 -52 -38 -21 25 -27 -35 -64 0 -49 7 -10 -26 4 58 33 -14 18 17 -42
1585 -42 1 0 15 18 38 22 -26 -45 15 -34 3 44 59 17 0 20 0 86 -16 30 10 23 8 -10 25 -40 14 -4 -28 -55 7
1616 7 -33 -48 -37 -2 -25 24 -23 -47 24 62 21 -28 16 -36 -26 4 -46 39 -4 7 -11 9 15 36 -43 2 41 18 -11 49 23
1647B3m7L9l5K7J0j8K0MJ2l1q0J03j00O3Ol8k4P5m2M6L7n9J9J7pk5K9K3m5m3N9
1678A8OJ3m6LM4p6O0o7Rko0J29n8Rk1kM2JJ9m0k5K0K6Jo9R5q3M6K7M1o3n9Q4l8
1712a6j3NM0kk5L6j3k4l2RM3o3N7J1m7Kj5Q5q7L2J9J0l3LJ9pN0q3L5lPjmK3l7
1747a9k7L5K4J9m5l2O5m0l0Q3q3P4k4K5k5J5pM6l0K2j7kRn5J7J7L%n1O9ok9k4
1780b3K3j3K5J7o5lJ9K8j7K6p0oM2Oj3K6m8L8J2mM2Qj2n3J8M9l4On3K2J0K8%l2
1814aKqj9LK7L3p1L2j5M0Rp2Q0l3l5qmK9L5n6MJ9nP4q0L3ml1M3j8m1J0M5o2L0
1849a5mL8MK6m2M8p4J8M1r6L0jN6k1j5K6l3Lk6P3k1m3K6M8%o6%J5nK0J8m7M5k5
1883Aj8N6n4K9L1j8k7k4M8rl6M9k3P4n3nl3l5R2q2O1k3n8L1nj4M3Qn4Q3k5l2l7
$$ plain form
1647 23 -24 15 -20 7 17 -1 19 23 35 4 -76 27 -73 -10 -4 -42 -66 9 -33 13 50 -9 10 27 20 -5 24 47 2 -41 18
1678 18 24 37 -9 -6 38 -38 22 -45 -36 -38 -98 31 -27 -18 -39 -41 1 2 21 -19 -44 -24 2 3 -66 29 -54 -8 19 60 -3 -62 22 -16
1712 -16 -29 -24 16 14 -11 25 12 -12 -44 -35 8 -55 2 13 -34 -32 -47 38 -49 -17 2 12 -21 -18 1 -6 44 -39 -4 -7 0 -1 -5 18 -19
1747 -19 -46 -11 13 32 -13 -45 20 -20 -50 33 -50 24 0 25 0 15 8 54 24 46 29 27 36 -19 -2 15 18 18 -33 36 30 1 -23
1780 -23 0 -13 12 29 -36 -39 -20 8 -9 17 -53 -59 -17 -11 -24 2 -46 -8 4 0 42 50 38 -15 3 52 18 24 -29 -7 3 31 31 -1
1814 -1 1 -7 -26 -23 4 37 -34 -2 -17 23 32 -40 40 7 -28 -36 -40 -11 24 -32 -28 -9 -14 60 -20 13 9 -22 21 3 -38 -28 17 -45 -15
1849 -15 -19 19 23 49 7 55 -19 -1 40 -56 -26 -27 29 8 -7 19 -14 -11 -37 36 15 -28 -2 46 46 -20 -20 -5 -10 10 28 -19 26 1
1883 1 -17 39 -15 14 45 27 0 -24 24 15 -21 28 5 79 26 21 -12 -47 45 -37 24 1 -57 -26 -31 -45 -2 6 -48 35 10 -22 -59
1916e9O5ll7L4K9l4m3J2O2N4j32R3K4p8K5L8m3K5k0L4n7k3K8L7%m6K2j4J3JN4
1947F1n4j2m8K4k1J0K8K4l7J5K8mm1J01q7K4j2nP7q5K5l8l1P9j7J2l4K8kP6p2
1978A2j0l6N8n9M0O2j07P9m2M8l2Jk4j2j9j3O4m1j5M6rm1L9kK2l0k6M2K5j5pM1
2010C9j7J8j3M1p5k1L8k2M0m8Mjr%K3lL9m4K7J0j6m8L1J1Pj6k5j9J12n9n6Q8n3
2043a7n9J03k9l4J0K9J7j24Q4Ml4M8j5L5M6o1J8J2l4P0k4rp9Q4l9l0L2m6M5k1
2073a8jM2%r%n9N7j5K8j8J3j0Qn9N9L0jl8n3O3j1kj3PLJ7Pn9M5K8m4M1Nk9kp7
2109f5M8j3k0Q2l6lN6m8M1pn0L7r9R0n1Ok1O0j3j6LL1j1n1J8M5o6M0N1j4l0K5
2141A9n2N2j7k5P1k5l2PJ4J9k8l3K8L2j4l2J9l4J8L8o0O9o3J4m0kM3kN1n5L8q
$$ plain form
1916 -59 6 3 -34 0 29 -5 -48 -36 26 80 -52 41 65 -13 12 50 7 32 12 46 -11 -34 -6 31 31 -15 7 -7 6 7 61
1947 61 7 -5 -53 -29 -50 -40 -12 12 -25 -10 18 14 -27 74 -13 11 -1 -6 71 -14 11 -27 -58 21 4 16 -18 10 8 84 12
1978 12 2 -34 24 -35 5 67 -40 39 -3 45 13 14 -10 -22 -41 -54 10 -31 -46 0 -9 -50 -11 -13 9 -21 -47 -5 20 5 -2 39
2010 39 22 40 27 68 -7 -28 10 -12 28 -20 -16 -17 -26 -26 -3 -6 33 -11 16 26 10 -38 -7 4 11 -5 -30 -49 63 4 -52 36 -17
2043 -17 -76 27 -2 -36 -26 3 20 -104 -20 -16 -50 -2 -17 18 64 3 21 33 -1 69 45 36 -43 41 2 -28 4 -42 3 -18
2073 -18 -19 23 23 14 14 -45 12 -3 25 7 20 10 18 -41 18 48 47 9 -44 19 8 6 -7 0 3 20 27 -32 13 41 -3 38 43 14 12 -65
2109 -65 -17 -30 -50 32 -4 -7 49 1 42 35 -15 22 -77 13 -38 -32 -53 7 -6 -22 -19 12 1 -50 -32 13 -53 -13 38 24 -6 19
2141 19 -33 19 2 -23 48 23 -9 -2 12 31 3 -30 -2 30 16 -16 3 -31 -13 25 -35 34 -29 -15 -55 -57 -14 -16 35 -20 18 10
2173A0j9J9O3j09K2J5K2kjOn0K3N6n4j2K2j4rRk0N3j9k4K3J6L0k6jk5p1M5m0R2
2206C0m5k9K0j1KM0k3J9k0L1l0M5nm4J5j2j3OO1l8k4MM4l6J1PL0k5krrKJ0K5o8
2241d1L5N3n3l7k1O2L9k0n7K4klJ0L1l7J3Jk7M6mlj7J1n1P0n6N8ll8J6l1N6m2
2274a8L0PL5m8L0q3OO7lm0J9K5l1L8m7N4J1o5L6k1m3J9k2N6j4k1K9J3p1M3M0n9
2306b8KJ5N7j9M4n8K3kNon6K8k4l0M6N4q7Q5j7K0p2J5k4J5L6j7l5L9l6L5j4l6
2338d2M2m0J8K1M5n1j2o4J33l7qm2L2J5l6O1l2N4p8KM7nnl2j1N4j0Lk7n8Q2r4
2370g5%N6J7k2J2k5lJ5RrL2K3k2k0P0m1j3L5o7N8k7j5MN0j7r8O9K1nN0j04M4L8
2403D0k1k9lJ1k1L5n4Q6k5J4k1k1K4l1rqP1o5J0l4L3Q1k8m7K8k8M3p3N3j9j8J8
$$ plain form
2173 10 -9 10 73 -36 -14 1 23 21 20 26 -24 -1 55 1 -11 11 -3 -12 -3 -23 30 11 -13 10 26 56 30 29 4 -67 -22 -62 30
2206 30 -15 -44 -24 -35 -33 7 -16 3 -17 14 -16 29 24 -20 -5 -17 -30 -24 37 -1 -25 -21 23 -13 -2 5 35 10 8 -1 -10 -8 2 27 -41
2241 -41 -6 47 -6 -43 -64 -2 37 17 -40 -16 -18 -21 -11 20 -17 -4 -3 -30 16 12 9 -8 3 -48 22 -34 24 21 -17 -1 -32 24 -18
2274 -18 12 19 54 6 36 -47 -41 26 23 -17 2 27 -4 34 -13 41 52 -13 23 2 -41 -22 -44 12 -2 -23 6 19 -52 -9 31 -28
2306 -28 -26 -11 46 27 71 13 36 34 39 33 -23 5 -19 -49 -3 51 -36 49 32 52 -20 -5 -29 -14 22 5 -30 9 -27 8 -6 -42
2338 -42 0 -40 -22 -1 44 -7 -19 -83 50 13 5 -37 -5 10 -26 35 3 57 -21 -19 28 23 18 -14 -25 29 19 22 -5 -63 19 -75
2370 -75 -75 -19 -2 -24 -12 -37 -40 -25 -16 -25 7 30 8 -12 58 17 4 39 -28 30 3 -12 -8 42 25 -73 -4 17 12 62 -42 2 40
2403 40 19 -10 -13 -2 -23 12 -42 44 19 33 12 -9 15 -16 -25 -33 38 -27 -17 -51 -18 63 35 -12 16 -12 31 -42 11 -8 -26 -8
2435hm8R5o4L4k7J0J1lLj2M7n9L7m9Q9q1L1MK1ll9lJ9k7M0o4MJ7l1R3j5NK2n6
2469glK7J0m0KK7jJ5p0pM0N7jn5kk8L0M0m7Lj1M2j9J06m6p6n0Q0J3l9j6L1MJm5
2504c5K0pj5O0p5J20j02N9j4j9Oj8N5On9Q3jn7Mk4Qk4L3nkm5O8o8L8O1q4O0p6
2537d9K5m5M6J2j3j7J2rnP0p7M0O5j08L2L8j8J8n7M6K8l1k7L0loMm4O4l0K3k0
2569fk4K6L8r7L9L2Pj0L4j8n4J1O5o7rK2K0j0N0m8%k4Mj0j5K7L4k9K4l0j6M1l3
2602b6N8j5Rj3%l2L8p9Q2j2j6l2O2k1l8M8rJ7k8J1l0J6J4m6J6QM2k3o4j1R8j9
2634Er%qM5m1kL2J8k6k6J9l0L1J2n7N9l1M4o6NN2l3j8O1l5J0K9oj5m1LMJ8O8o2
2669Il6j1N4k4mlQJ5j01L0Q0j4J3J5j4j7M6j6%K8nn0J7l1J8j7KK1K4l8J8Qj4J5
$$ plain form
2435 -8 -56 39 -25 9 -18 -8 3 0 3 -9 38 -21 16 -33 56 -25 6 10 31 28 -11 -14 5 -22 18 -46 -42 -25 -56 37 22 27 49 -7
2469 -7 -10 17 27 -13 -11 16 15 30 -40 -47 -7 50 49 -6 -8 -36 -6 34 -13 -10 -21 21 2 108 62 -14 -64 16 29 -10 -26 5 9 10 -35
2504 -35 -15 -22 -37 23 -52 68 -34 25 11 -8 -2 -20 35 41 -18 65 64 7 11 -13 -5 -29 4 -1 -3 -48 20 -48 -10 51 -33 27 -49
2537 -49 -24 -69 -23 -11 -24 -41 -29 -38 -43 27 -50 -10 55 -53 -21 17 -1 17 -40 6 34 3 -24 6 3 -3 1 -43 21 -9 14 -6
2569 -6 -30 -4 34 -63 -24 8 15 5 39 21 -33 -22 43 -24 -33 -11 9 -1 49 1 1 -23 -19 -29 -44 -17 17 -12 12 -18 -34 7 -26
2602 -26 32 17 26 13 13 -19 19 -60 22 10 -6 -38 24 3 -35 13 4 21 -7 4 -26 -10 4 -42 -26 -18 24 1 -63 -74 24 5
2634 5 -4 -4 -12 33 -8 -10 22 40 14 -12 7 -23 8 20 -37 22 -9 35 -31 -26 26 -7 -25 36 1 11 40 34 19 -22 -19 -15 3 71 9
2669 9 -27 -38 16 -8 -12 -15 -7 8 -93 -63 17 3 16 31 17 0 46 30 30 58 53 3 20 -11 7 -10 -8 13 37 -1 17 25 11 26
2703B6l8OjL3ol4j0j7L5J8j5K7m7l0N6n7J2J8O2L8j01P5o2J1j8kM8K8m2r3P0o5
2735g5R3m1O6j2JqRm0j1R4p2m4OK3K6j2k1j4N2o2L5o8N6J6k2M2k5j9M2k8N2n7
2767a8J9J9o6Q2n5J9K6nJ8n3N5o5M6K6k7m1J9m1K6J2Ol1L3jj4O4n8j0K1n2K5l8
2799e9N6PK9rk8Mj2j0L1l4K6L5n3K6l2K2j3O6k7K5J7m1Rp0j4j3P7rKk2k2J9J8
2832AqK1j3J6p6N8J7Mr4M0n3N9Rk3K0K9k1J6pj0M2K2n3OL4l2J3M4k2j6m2J1nJ6
2866CM6n2M8j0J3j3l0kJ4J4p1J00q7M3j3m5LnK4J1L6k0j3K6p6L6N2k0Nl8K7l7
2898c1N7n7L7j1K7ml3K8kL1Jn7J1O2o0l7M0N4m5L9p2j8Mj1M6l4L7k4l6R7pm4n2
2931f4lQ5p3M0L1k1M7k6lMO0n2mN1m7m5J6K2L7l9m5L8Kj1k2M6o6M9j9k6N0K1l8
$$ plain form
2703 26 -12 -6 -7 26 20 -14 -24 -41 -6 12 -3 24 -23 -53 3 -54 -42 -24 38 76 -25 50 -12 -1 -19 -21 27 55 13 -80 -10 -75
2735 -75 18 -23 43 31 32 24 33 -7 -18 76 4 -40 -34 -11 15 3 -18 -32 20 -42 -7 -75 -19 -3 -25 17 -8 -27 15 -13 39 -18
2767 -18 1 20 -46 36 -19 0 26 21 39 -14 41 -24 22 48 21 -20 -1 -42 -16 -4 2 -29 4 3 -11 53 -5 -15 6 -46 -21 -59
2799 -59 -3 4 33 24 -4 0 -12 -22 9 -25 1 36 -17 9 -23 -1 -14 52 25 50 67 26 35 -35 -49 -62 15 6 8 -14 -36 -17 1
2832 1 -7 14 1 17 -59 -1 16 20 -74 -34 -87 -28 -19 -42 -22 7 -14 2 -5 -15 27 49 -4 2 36 4 17 61 39 23 -19 -8 -13 3
2866 3 49 -3 45 35 48 35 5 3 17 31 -40 60 -27 16 3 -42 -39 -44 -20 -9 27 7 -6 20 -56 -20 32 12 17 -21 6 -31
2898 -31 26 -31 6 -5 22 18 -15 13 11 42 43 -14 -3 59 -1 -38 2 56 11 50 -22 -40 -36 -47 -1 -35 2 -22 -58 39 32 -12 -64
2931 -64 -67 18 -55 -15 16 -5 42 16 13 17 77 25 21 72 25 -20 -4 18 55 16 -29 9 11 0 -22 24 -42 7 -12 -38 12 33 -5
2964eK1m3Mm1P4j4l8J09j01L2Pp0R7n2l2qP8JJ0J6k6N3n3K0o3N9k3j5J1L1n2J5
2996BK5j8j1lJ6j9k7L3k6M6j6m2M4Nl4L7m7O2q6M1Ll2M1N1m8m2L2k3K1QpJ4K3
3029B3k4K8n2JL0lpK0l5P8n4J7M2q4QN5m6L6p5N7jj6l0JK0JK4k4KlL3k7N8j09
3063e6K4K5K8l3K5l9N8lj8l5M3J7o7P3j2m1M4q7Rk1Q0Rm5J8k4kN5o8l0Q4J3o0
3095c6K5l0Q0o6j2O5m4K7J9k7J5k2J5k8O2m8K9K5rk6l2K3k1PJ5n6N7l6P2j4j7
3126A2M2o4K5m2KJ5J5p3L8K1K0pmk3N7l5rk1M9j9n6L7l9K5L2oJ2k6ON0n6j5O7
3159C0j2ok2K5l7K0K4m4P5j6m0J4onJ5k7J2J7k3RMm4L7m3j5J6NR5o6Q6o8L1o3
3192b2K3LkkL1L3k3j9o9J4JP3k2m5K3oN0q8N8k0J0J4q2L3N2l2K1PRJ0l7j4n0J27
$$ plain form
2964 -5 16 -27 -23 -64 10 -4 -42 67 -34 -2 5 -65 32 -20 -52 -60 18 19 29 45 19 72 19 39 -24 35 12 -3 8 39 -13 2
2996 2 27 9 -2 -5 11 -8 -35 -2 -28 18 2 -40 4 9 -25 12 -35 27 -59 -18 -15 -47 -6 45 -3 -45 -13 -36 -15 -7 -14 0 23
3029 23 -1 27 -25 -24 6 3 -4 16 -19 59 5 22 64 -20 -12 43 -3 33 -42 15 14 -2 -32 -31 -11 -10 14 -10 -8 -11 22 -5 53 -56
3063 -56 -32 -7 21 -12 13 -26 32 29 11 -24 19 36 -31 42 30 -11 33 -54 -45 -66 14 23 -22 -4 -28 -30 25 -43 -73 11 24 -36
3095 -36 -11 -41 39 -27 -39 26 -18 9 28 1 16 -6 9 -19 43 -5 24 49 40 14 -18 5 -16 -9 6 -50 7 -29 43 29 12
3126 12 54 -10 15 -27 -25 -10 5 -68 -30 -9 11 4 0 -23 34 -1 -10 -31 18 -1 -57 -20 -59 -34 -2 -8 4 -22 -16 34 -22 -37 30
3159 30 18 12 -10 15 -22 -2 22 -22 53 37 -3 11 5 0 15 -12 0 17 -6 3 7 -37 0 -43 -58 -42 -37 58 -8 78 10 41 -22
3192 -22 1 4 2 0 31 64 41 22 -47 -33 -32 41 19 -26 -3 -9 41 -47 11 -9 1 15 -67 -34 18 -14 7 14 23 33 -4 -18 -68 59
3226E9p4L6m5L9j9j4L4l3lM3l9L1n4J6j4N8j7p4O7oL6L2p7pL1M1j9o6P7Qm7K4
3258B4p5L1L6JQ8j13llm6M8j0M1J1l5lJ3k8lQKm3L4MK1J9l0rK7J1m3O0l0Ook2
3293a7Q2r4K6j5K5Po5M2k0lj8k5M5rO1J7l1k0k5M7l1L2LL5n5j3OJ4j3rL5jj7k7
3327c1P6o5j3L2P2o1L8n2Pk5k0N9l0Rm7O6j5k3rP9n0Rq4J06q2L8L4m1J8l2M3l
3359Cnk8P8j7p2mL8qJ4J9k0m0KM5O9q4L9J4k3J3l8L2q3N4m8M9l7J4J9J0j5k9Q2
3392D3q8LN6mJ0p5M9%L8m3K9m2M1m3qN1m9L8k5R3q3Ol6M1N3o1jJ6l6j9N4J0j7
3425Aj6J9j2pl2J32n0p2L7kl4K1L3l9L6k2K7Om5k9N3J9nK0r8J18n1j1KK5n7K6
3457gJ1m6O0Qk4Lnm3R8q3N3o4L9k2N0l5l2M3k1LkQJ6l6KL7k9k9ON4K9n8K9j4M9
$$ plain form
3226 59 -15 21 -24 15 -4 -18 16 -17 -20 23 -16 15 -39 -23 -37 21 4 -70 -3 -9 27 59 -18 -25 6 47 28 -38 39 47 0 24
3258 24 -51 -20 16 17 105 -8 -11 -14 -60 -12 -22 19 30 -5 -8 5 -23 -26 -18 -16 -59 -25 -21 0 19 -11 -20 7 18 -25 35 5 11 5 -17
3293 -17 65 -29 -3 -18 7 14 -51 -9 -29 -32 -50 -75 -30 -39 22 39 8 -12 -37 10 -21 11 14 49 -6 -19 -13 1 -12 -21 14 13 -4 -31
3327 -31 45 -20 -33 -1 71 10 48 -4 3 -22 -42 17 -13 -4 -51 15 0 -23 -32 47 -3 6 -78 28 -54 -16 18 -23 -5 -37 6 3
3359 3 -2 -30 48 31 -41 -45 -7 -15 -1 18 -2 -42 -40 5 74 -10 29 43 20 33 -5 27 -56 -2 -50 -1 -38 -24 -5 5 -10 -39 43
3392 43 -45 -42 14 10 20 -55 -6 -6 32 -11 18 -24 17 -26 -34 17 -32 6 -19 74 -9 -3 -39 2 55 -6 -7 9 -27 -46 8 18 1
3425 1 -15 4 -8 -15 -47 85 35 -37 0 -2 -36 -15 18 -21 15 -7 20 26 -19 -48 5 24 19 39 -59 59 8 -3 -1 24 -33 -7
3457 -7 4 -42 18 26 2 5 0 -43 55 -28 25 -39 0 -22 28 -7 -39 4 -17 -14 -16 -8 8 -28 -26 11 -18 -47 -41 13 42 -16 13 -1 48
3492D8k3j2m7K8O0j17O7M0nj5pN4o9Rm5j6M9j1K0N2m0j6M4l0mj7j0L6j7n5M6P
3524Dl0J2q2O8K2qRJ2K0m3O1k8Pl0K0j6j0J6pK2k9L4k0Km7M8j1oN7l4r7L7P3o2
3558c6j2L6JK1l2pL5jkQK6m5MK1oJ1Jj8j0oM3k7M7p1j9P7m2K6j0j6j1k9L4J7k5
3593a7On2K7M6k9Oj9j4OM4o4l5Q0J7j3m5R5r3O0l0J3N4m3K5l2JO1m9PJl8N0l9
3626a3J1Q3p0Jl1P6q4L3l0NM7n9O3po1K8m7L5R1o6J9l1Nk9j9OK5k2k6P8o3N7K0
3659B5j3%%K7j8n4L2J0L4m2K0j3nOql3l0M1J3L0m5J1J5j4KQj9K3m3qJ9Mk0j5M
3694e6M8m6J19q0J8K3j7m2N8k1L4ol0K8k1Mq1N6J3Jk9K2j9O0p3M6J4m2O6k8jk1
3726ck2N5J9m6K1k6j4o2N1N6J2q5R2j01N9l2L9K3o6KL4j9K9K1l8l4N0J4pJ8n8
$$ plain form
3492 48 25 13 -34 -6 54 -63 4 44 39 24 17 71 2 11 -34 -50 -1 -12 8 60 20 4 48 18 14 -3 -13 23 6 -49 -3 4
3524 4 -26 -14 -96 -28 -6 -14 -5 7 27 -16 45 17 24 -6 14 -2 -12 4 -3 19 -10 24 4 6 -41 7 -4 -10 47 13 -84 -47 26 -36
3558 -36 -48 -12 -11 10 -22 -29 6 5 3 11 37 -8 -4 17 11 22 23 5 -5 -11 32 5 52 -19 -38 39 -3 23 13 -3 -14 -43 -9 8 -17
3593 -17 -11 -63 -36 10 -19 -13 -32 -46 -40 4 -60 -95 -15 2 -11 -56 39 -54 6 -24 -11 43 0 25 -7 -6 55 6 13 14 -24 26 -13
3626 -13 -2 81 11 12 -19 57 -27 6 -24 -19 28 -31 32 25 -36 -8 -55 -20 71 5 24 -7 -2 -31 -50 -44 -19 -41 -67 11 -52 5 25
3659 25 12 12 12 39 21 -33 -1 9 43 1 21 8 3 9 1 -32 -62 -21 -8 22 -23 -12 3 -11 -9 -1 -20 3 -40 -48 -29 -25 -45 -60 -56
3694 -56 -8 -54 65 -15 3 26 9 -33 25 4 38 32 2 30 9 13 -68 -12 1 2 -27 -5 -24 36 -37 9 23 -19 47 19 18 -3
3726 -3 -25 30 49 3 24 -2 -16 -78 -27 29 41 -44 48 -53 6 -26 13 36 -30 -28 6 -13 16 37 -1 -35 15 29 22 40 -18
3757a8M4J2j19P9j5L4K6J8n4n6L5L4o2L7n8O9n6K2mk2L6J0j0J3l3K1rO0m7M8k9
3788F%J9j7j6JJ8l%k2j1O3n1N4o6P7j5j7J8k4o3L3j2NK7m3N7L4pn5K2p2M1O4K
3822D7n5%K5n0ML0%j5K1j6M4m1NJK0Rk3l1Q8o3K9m5M4n9P2l6k6O5k8Ol9O9o9L1
3856A4jK6r4L0l3L5Q4o8OK8p1qN2k0L4%k0j8L6oK0JJ6m3Jn0KR4l6K3k8J8Rk1m2
3891c0J12m5p4jJ9j8j1M5l9O7p8mPJ3M5n8O3l3M3j7k4oO0k7L7j2k2NMj7RPj3l3
3925b6j9J4M9kl%k0nL8o1%K9Qpm2J8mj9K8M3o7O3J4n6J4kn4L5l1N7P4j9q9J6P
3960a9%J9M1k5k9K5m9J05l3k4j5K8Lr5L4J1qm4L6O4j13R3m5O6mk1pL9m8j2RK2
3992DK7k4l1J0K0L9l8j6L2K6n2n3M8MJ4OJ6j17J02o8L6%J9M1o8L8l0Q5m6l5nJ2
$$ plain form
3757 -18 26 38 -81 -2 -17 17 43 61 7 -49 -14 20 -42 -5 -63 6 -50 -28 -32 -54 -18 -8 -18 -5 -38 -17 -26 34 -13 35 6
3788 6 6 25 8 -8 -7 11 8 8 -14 -25 38 -13 41 -25 52 37 20 38 14 -49 -16 -28 -23 4 -39 18 52 45 -10 12 -60 -19 45 47
3822 47 -8 -8 17 -33 -29 1 1 -14 7 -9 35 -6 -1 0 20 29 6 -25 63 0 29 -16 28 -31 41 5 -21 44 16 22 -17 52 -17 14
3856 14 13 39 -55 -25 -58 -23 61 -7 -1 27 -44 -52 0 -20 14 14 -6 -24 12 6 26 27 43 0 1 -49 -47 47 11 34 6 24 33 12 -30
3891 -30 82 37 -37 -38 -19 -37 -48 -3 -42 25 -53 -57 -50 -37 8 -50 13 -20 23 6 -18 -24 36 9 46 34 12 17 21 4 13 20 7 -26
3925 -26 -45 -31 18 16 13 13 -7 -12 26 -35 -35 -6 2 -5 -47 -29 -33 -52 -24 19 -48 15 29 -27 -13 -15 -69 -34 -65 -8 66 47 -42 -26 -19
3960 -19 -19 0 41 16 -13 12 -37 68 35 11 -4 24 27 -68 -34 -23 -31 -75 -39 25 -88 5 -40 26 22 1 -6 33 -15 -27 -18 4
3992 4 31 7 -24 -14 6 45 7 -9 23 49 -3 -56 -8 -4 10 16 32 -85 17 -51 -15 -15 4 45 -23 15 -15 70 24 -11 -16 -4
4024dl0MM5pk9KJ9k2K8p7R4o0L0M8q5JLL6M0j6n9K2K8l0l8R7l9j4L5p4RK3qJ6
4058a2K8LK2pj00O5k8Q0o1l2M8M9l9l0O1l5m1N1m8L9PMm5j2M7oJ0K3k5nj8O8q0
4091a9J4mlj5m7J4Q3%k7k8J9P6o6RM0k4L1p5k5R9p8J9mk9Q9l1%k7L2j5qn9R4l8
4125cM7ln7J2O2rl0l5M2Jn4%RN8m4%M0p9O0k6NK2p1K6%kkMM4l5Rk0k5K9K1j3M
4162a3K9QNk7M6l3M0K1p2J8nl0L5j6m4M2OLk2J6k4M1j0k0L0Kj4l1K4Lj8K0j4K2
4196A8j1k1ON2n1J7ol1l7L2L3J3l8MK6k1JL8J5l0K0j1k8Q8n5kq0J30q3L1l2l3
4228d6K7J3N%L2j5l4M9l6%J1nj9L1j6j5M4K0j5q6L7P1o0k6L6J8m0%Q1p2L7k0j3
4261fJ8l4J8K1Op0JQJ04p4lm5J07m6o1O2m4QM2L2k7j8rL5p5L9P6q7J5Nj3L9n0
$$ plain form
4024 -4 -34 -30 15 8 -21 -19 0 -22 6 -71 23 -37 -7 41 -44 -43 -40 -4 36 20 -39 -17 11 -19 -57 40 1 -13 22 -52 -43 -20 -28 -12
4058 -12 16 19 41 34 -66 -1 -29 51 -10 -42 6 55 16 -14 47 12 -29 22 -26 13 20 24 -21 -33 14 8 18 41 16 11 -7 61 -19
4091 -19 -5 -9 -12 -27 -74 -60 23 23 -4 -32 -13 63 -3 6 46 22 53 -22 -47 52 -26 -7 -11 -40 49 18 18 -9 23 8 0 -59 35 -3
4125 -3 44 41 -16 -4 58 49 19 -16 26 27 -27 -27 -18 40 -4 -4 36 -43 17 -9 -4 18 -53 -27 -27 -29 -31 -27 17 -18 -9 -29 -54 -25 -4 -17 -13
4162 -13 16 24 29 2 48 15 55 76 4 22 17 -13 22 6 -38 4 10 13 -9 7 -17 24 14 -6 24 26 12 -19 5 8 -10 10 -4 18
4196 18 7 -14 -8 44 -7 10 4 -27 -64 -32 1 14 -24 -20 6 -15 -14 24 39 9 29 18 -10 78 23 21 -59 71 -12 19 -13 -46
4228 -46 -19 -6 -1 -1 31 16 -18 31 -5 -5 6 1 -18 13 -3 -18 26 46 31 -55 -18 53 -7 -33 3 21 -19 -19 62 -10 27 7 -6
4261 -6 12 -22 -4 17 23 -47 -46 -38 66 -8 -11 -56 51 5 -56 6 -38 -30 12 44 17 -1 -10 25 -50 -11 65 -22 -7 -2 -15 24 -26
4294b6M7l9K4J3j2QJK9m5N7m6j5J2L4n4l0N5ONJ8m6k9K4lm7P8q3J06j1j8JK5o0
4327b1k7Q7n2M0l8Q1q9L1o4Q8l5kL2k0PrQj7k8Q0o9M8j6%k5L3l0M5kl5m9N2j1
4360gl6Q1q0K8k6ML8Kj8nN9m9l7J9K8j9QkL0ok0lM4km1RNk9M1m8O3J9j14N1J9
4395FP5j49J0RQ1n4J1L2m1PJ6L3p1J7n5J05m1pM2m2L5n1RL3l3O8p9P8l8L7n8j8
4427c3j3P3n1OJ6R%mj1P2p8o0R5j4N5p3J3l4Q7o8l3N3OrQp1J25p9lj1PM1m8LN4
4462C0o9L5Rj0K6J8k6lk5L2j2l9M8m5L2J9rk8m4J06K5o1J1m4J1LOlm4M6k3J8o3
4495g3K7L4L4Qm2L3j4L1j7rl4M9j4m5Q0Pl5J7J2q2K7OM7l9RJ1n8K4K9p6N4qJ6
4528Im1jK0n2N5M8nk8Jl5QJ3mM3k1Rj7o4N5O1oo3nnK0O0q2P0m8l3O2ln3JK3O7
$$ plain form
4294 -26 21 -18 6 19 7 15 16 45 0 57 11 -4 8 42 -12 -42 13 19 24 42 -4 -33 -9 -12 -59 19 -64 42 31 13 14 39 -21
4327 -21 -48 39 -13 27 -11 70 -19 12 -52 36 1 -1 31 11 18 9 17 0 -28 52 -17 31 15 15 -10 23 -7 38 36 1 -48 4 -7
4360 -7 -43 38 -42 -14 -40 -36 2 4 -14 -19 40 -9 -46 -27 1 -18 -10 -12 18 12 -8 -11 33 31 -10 -1 4 -25 16 -32 31 50 -64 -13 6
4395 6 81 -68 -58 -49 32 -22 -11 21 -20 -13 3 36 -35 -18 -73 32 -9 -16 26 -16 19 -32 -23 10 -23 45 -34 44 6 43 -15 -33
4427 -33 -46 27 -24 -18 -2 7 7 3 -8 64 -14 -74 21 7 62 -11 2 -32 55 -13 -46 7 13 4 12 -59 66 -13 -16 -27 -20 21 -27 -24 30
4462 30 -39 -4 5 -5 21 39 13 10 -15 17 5 -34 14 -31 1 20 11 -17 -61 45 70 9 20 -24 -13 -10 -4 -7 -51 -5 -28 -10 -73
4495 -73 -46 -12 22 30 -12 21 7 38 21 12 -22 27 13 -32 48 55 20 37 49 -33 -6 0 47 8 17 28 -30 -6 23 -53 1 -7 9
4528 9 -32 -33 -13 -65 -10 38 33 5 6 -29 -21 -8 -12 31 10 19 2 -62 -7 54 48 -15 -20 -25 -5 55 -27 43 -5 -38 24 21 -32 -31 -8 59
4564E9l4J5j01N8K2m7J3L5j2j1nK8l5kN4q6N7n1O1L1om2L0j5l0J2K0O5j3o0n5
4595d5L2K1Km7N0m3%L4L2l6L2L3r5rj9O1j8J7j5J4Qmj2j7m5M2J6NO6p9M8j8m7
4628c6J1O8j3p8QKL4j9P7n1K3j6j8k1K1l1oN0Nk8J6L9j02R1K3q5qO2j8m2J7O0
4660C5j9k8J7j7pL6lm1JM1qJ0m2M0pk5M9l9RJ0l4K9l2O5q2M8QJ1o1KN0%k7j6M6
4695A9j2k0M1m7k4L3Rk3j1N5KJ2l4l1k6O5K3l1J1n6L4K2pk7K1K2nk4j8N5k1l6
4727b9J4J7pM6kj00M8k3N4J0m0K2k3k1QO0%l6M0%m6k3L9k7o6J22Pr3N4j0j4rO3
4760C5k9k9P4Mq1L0J5oM7p6M9p1L2J3M8r8L3j6Qk5J3L3m5N7k6M9m5J6o0O9p5J3
4792d4M9j6K2qm8N8jJ1o3J01o0l8P6l2j0l6M4k6L3kJ1M7q0qj0N5n4K6Ok3k2OL7
$$ plain form
4564 59 25 40 -61 -3 19 -28 -15 20 8 -3 -8 20 -15 -17 37 -49 8 -43 18 49 43 1 31 16 -14 -2 18 83 70 10 -45
4595 -45 -13 8 10 -37 13 -30 -30 4 36 0 32 65 -30 -39 -58 3 -15 2 -13 1 9 5 -7 -24 -69 -27 -11 -6 60 -19 29 11 -36
4628 -36 -25 43 30 -48 -40 -38 -4 -23 54 3 26 10 -8 -29 -8 -39 -45 5 10 -18 -2 37 -65 26 49 -36 -44 18 0 -42 -25 35
4660 35 16 -12 5 -12 -19 17 14 -27 -26 15 7 17 -25 15 8 -17 32 -7 2 12 -22 7 -25 40 -42 6 14 25 -36 -34 16 16 -11 -27 19
4695 19 7 -13 28 -19 -43 -10 -1 -24 -35 20 22 34 0 -31 -57 8 31 0 11 -45 -11 11 4 -23 -2 20 15 -9 -27 28 7 -29
4727 -29 -15 2 -5 41 39 -61 -13 -36 18 28 -12 10 -13 -34 -26 34 34 -2 38 38 -8 -31 8 -19 -85 37 44 -49 5 -5 -19 -28 35
4760 35 6 -23 51 55 -26 4 19 13 60 -16 33 -38 -6 7 55 -43 -10 -26 -18 -43 -30 3 -42 15 -11 38 -7 9 -51 18 -57 -44
4792 -44 5 -11 11 3 -45 13 12 23 -40 61 1 -37 39 7 -3 -39 5 -21 12 10 21 68 -12 -20 -30 25 -29 -3 3 -20 -42 -36 1
4825Aj6J9J9k6k2J08p9k8j2KOL2n9J50q8k1K6L2n6P6j09M6PJ1n7mM6mN5o9PRK7
4858B9l1KL6n4JM9o4j4R9n9O3l4j0MJ0q6R6j6p3K4Q9o2jML2m6j4J4qN4l9K6l5
4891a4R6p2l1L3K0p4N4QJ4j2m2N2j1j6J8qo5P2p8K7M1J8n9m3N0j8L3L8n9KL4J8
4923B6jj1l1N4o5jJ3J8kL1m7L2qJ2kk8Qm2J5Q8r4N5n4%R2q2j9M2mk1L4N1m0l2
4957a3N1n4j8J9J9N8n7ml3J7%Jk8P4o6L5lN1l5K2l8Nlj1n1N1j8L9O5j12K6j6L6
4990Il4M4n9L8lk7l9J13o3j8K5Kj0l2R2k3j7kJlM1m9M4o2N9n1Q4p1n3L8j2P9j0
5023C1m2pO0n8N6n2J1j2K4l7K7K2p2M3K9q4O4jn1K6NL7k3k1L9k5l5O5L4q4K9M1
5055C9j0j7OJ7l2l0MM1J1l8J8M5k3j6OL7r1Ql4Q9J7n6Qm3J2KL4J6m9K7o4M1N7
$$ plain form
4825 1 -15 4 23 -3 -25 83 4 -24 -36 -34 -28 4 -55 95 7 -14 12 44 -12 64 -45 1 8 19 -38 -42 4 0 55 -14 -7 2 29
4858 29 -2 0 36 -18 -17 32 -32 -46 53 -6 57 23 13 17 27 -59 37 21 -52 -28 61 -1 -2 2 34 -12 -26 -12 -20 34 -5 21 -14
4891 -14 82 10 -21 12 32 -42 12 20 34 22 -20 32 21 5 23 15 -50 22 -56 -29 12 30 -29 -72 -22 -40 -7 31 -28 -26 8 26
4923 26 25 14 -17 37 -28 -29 -16 2 0 31 -16 16 8 20 18 -10 -2 -44 -29 59 -35 20 -34 -34 58 -24 -43 -1 -5 -26 8 59 19 -13
4957 -13 38 -16 -34 -15 4 62 5 1 -32 -15 -15 -14 -42 32 -34 1 -2 49 14 36 -2 3 0 -11 -62 -11 -29 10 75 -37 -11 -27 9
4990 9 -25 19 -40 -2 -5 -32 -71 42 -21 -39 -14 -12 -22 -54 38 15 -2 -4 -3 -6 35 -14 30 -32 27 -24 60 -11 -64 -26 -38 41 31
5023 31 -11 -18 42 -16 40 -12 -1 -13 11 -26 1 23 -49 -6 23 -61 3 2 -49 -23 -18 19 -4 -25 14 -11 -46 19 53 -31 -2 39
5055 39 29 12 18 35 3 -27 -23 18 29 -9 9 54 31 15 21 58 -33 -25 -59 30 47 -9 -1 -44 -32 -30 4 20 -29 -2 -66 -25 32
5088C2%j0l3l0K7J3K7o4k2Q9Mk9J1j2M0l9N8q0O6no3J3l0L7orj6j0K3O2j17M2
5120c1Q8p5K8J7oj3m5M5K3j8Pk1J3K1J3o1n7R9p1N1L0kl4j5L1L7l7j5l8N9JK5
5152D9j6p3P4j21K8K2pj1J1M1k8N4p0K3N4o2jM2j4K7lK0l4j4L2n8K4J2N8q3J6
5183hL2pL9p6J8O0n9L6o0k5P7l1J9L3o8M0L7o3l3P0J3k6r9LP2j6J5%K2RK2r3O
5216d1R5j02P0K6r1OM3m5L4K1l3J6m4jK7pJ4kJ9lM2k6K3o4M6n3N2l9j5qK3m0J14
5249E7p8qj8N1OM3r6P1l8o1J16m8kK6Jn0J9j2O1k0rJ7j0L9l8jl1mN7kj7k6K7k6
5283dpL4LK3j1j15O7l5Q1k0l5K7j8k1lN3K7j2p8K2NR3n8J2K5l9j0MK7j0L7p7P8
5316F5n7J0J1q6O6MK4l0q1J00j7l3J0%j8L7n3J1N9p1L5n0jP7j4J5k3L9l9J5l8
$$ plain form
5088 32 32 22 -11 -41 -14 -1 26 -38 -60 29 33 4 15 3 43 4 62 -18 48 43 -20 -7 -37 0 -6 -15 -31 -41 -18 44 -73 -31
5120 -31 57 -18 10 27 21 8 -37 8 31 13 20 -1 12 33 46 -15 -72 27 -44 7 37 35 1 -14 17 54 17 2 -36 23 24 49
5152 49 33 -40 34 -87 -59 -37 -44 -55 -44 -3 -31 23 -47 -24 30 -32 -33 9 -5 22 19 39 5 -9 23 -35 -11 1 59 -24 -8
5183 -8 24 17 56 -20 -2 58 -1 35 -25 -50 27 -4 15 48 -20 20 57 -6 -39 31 44 18 -81 -78 -6 -22 -7 -7 15 24 46 -47 -41
5216 -41 54 -48 22 48 -43 -37 6 -39 -5 16 -17 -1 -45 -46 -19 -26 -12 -14 5 2 44 18 41 -23 23 -30 22 -17 -32 -40 -17 -57 57
5249 57 -21 -29 -47 4 10 53 -43 28 -10 -71 45 -3 -5 21 22 -28 -9 -21 40 20 11 28 18 57 19 18 -13 -17 40 38 21 -5 22 -4
5283 -4 -11 23 26 49 38 -77 -10 -45 36 16 -19 8 -10 -31 -34 19 46 34 -44 -22 -17 76 18 30 55 16 6 10 37 27 64 -13 65
5316 65 8 18 29 -57 9 13 37 7 -74 26 9 -24 -14 -14 -32 5 -48 -37 22 -49 -14 -64 -65 12 -2 13 -10 29 -10 5 -33
5347c3L5J6m0K9RJ2k6J4o3O2J8K1p4L2L9p7L5Rn8O7m5PmnL8j0J8j0k8L0j2pJ0
5380Il4L4k3K8l5jJk0P2n4k8P0l8P0m8O3j11R0m5kJ9J8k9j6K1l9P5k9o1P9pl5
5412fL8N3m7m5l7K2K5J0J0J5k7qk5J6oj5J7lL0K7l3K8l3LJ6qK6mLo3L1J9n4J8
5446gn1O7mJ7l7l2N0m2m9J0M1O3k3L1l1jRk0j4PK9J5n7M0o1L7QM4k5o6J48j15
5478a9K2O2n2k3L1m0j3P1q3M3%Jk8R4o4%M9p4n5O3K2l1oN9l7M7jq6P5on0N4j4
5511A1Pk6RJ1k1J9okj2RJ4j8J3Qj2K4n7qM2m7QP4J4p7m0R4%l8Pj7J6j1J0K9k9
5546bOk8L1k7k2O0n3mL6JM4l6Ln0J6k0J04p1L4k0P6n8m4M0lJ6j2m6M3m1k3O8K8
5579D6k2j1pJ3k5j8M1k8l1R6l7l9j9J3L8OM2n9k3P5m9k3rN1L5n1Mljk0K4RJ2n8
$$ plain form
5347 -33 2 18 -22 7 16 28 2 16 -47 15 33 54 -20 12 51 -26 9 18 -40 27 -18 -11 -15 -20 18 8 26 16 -12 18 6 -1 9
5380 9 -25 9 -14 14 -21 -22 -21 -41 31 -23 -51 19 -19 51 3 66 -45 45 0 -2 17 35 6 -10 11 -28 47 18 -43 36 29 -6
5412 -6 32 85 38 -7 -44 -22 3 13 23 38 11 3 -22 -6 -12 -27 -10 -13 17 44 11 39 6 9 25 17 43 39 42 -21 10 29 -25 -7
5446 -7 -58 9 5 22 -15 -47 3 -39 -88 -78 -37 26 3 34 3 2 11 -9 -23 -16 13 28 -29 11 -50 -13 -5 39 14 -52 96 -19
5478 -19 3 65 13 -10 21 -19 -32 39 -44 -1 -1 0 -28 66 2 2 51 -23 -78 -15 7 -24 -30 29 -8 39 38 -48 27 21 -29 25 11
5511 11 18 -8 1 12 -9 10 4 2 -10 -1 13 -5 8 16 4 28 -29 -37 5 -42 -34 40 54 -23 -63 31 31 -7 0 -17 -1 -12 -2 27 -2
5546 -2 4 -24 7 -20 -42 18 -35 -39 -3 -2 42 6 9 -41 -25 -45 59 -12 22 2 78 20 -24 16 13 29 17 -29 14 -27 -50 18 46
5579 46 24 13 6 19 -6 -24 17 -11 -42 54 17 -22 -41 -28 10 16 58 -1 -24 51 2 -21 -30 21 56 5 9 6 5 -15 9 18 30 -28
5613b8J2oP3o2QmN7j4m6J2m9J1L9L3j9j7Pk2N1o8N7l3J3j9p8P2QK0M7k4n8qM2
5646GK0p1K5N1L2n9Pk6J7l4L1K4p5M0N2j5K4p2oMl2J03r7M1Rk4J8j4K9m7J8k1
5678d1O3o1N0J6M7o6o2N2JM3l4Kk2K7o2O3j3k0L3M7j9p5O2k3Pm6K0O3k1o0M4o9
5710e4%P1K4n8M0M7q7lj5M2j0l1L4j8L9j1K8k5l1j8M2j7J7j9j3M7K3o1K7j1O7
5741F6kro0M4k4N5n3l9L2m4L0k6M7l4l2K6K4K6j0n2M6Mk1NJ7o3K1J4k3M6OM9n6
5774A0J3K1j1n4J0j1R0o3k3k3M6m0R7r6K2L6j6k5nJ8j0k5ON4K6l2j0n8M7k4L0
5805@o2P9j2k3MK7l8m5L0J3N2k2L1m3PK4j3N4k4n4L2o8Q3q1P8l4jL9Qk7k4J2l9
5838c7P1l9RjMl0ok4N9J6p9K4l0M0J6k0J6L8%r1R4n0PM5l5N8l5n3L0mM1l9jQj0
$$ plain form
5613 -28 -16 -22 51 -11 -3 -7 50 36 -10 2 -47 -36 3 36 17 0 7 -15 36 -32 25 -8 5 -14 -92 -20 -12 8 55 31 -27 -35 7
5646 7 27 -44 -19 32 64 5 12 -14 3 -31 0 24 -51 -11 41 26 50 -22 -28 -24 -56 47 -50 -9 0 -24 -6 -20 9 -38 -20 -41
5678 -41 22 -39 11 27 74 8 -54 -2 -1 42 8 10 -12 15 -47 16 3 -17 16 63 44 -31 31 8 15 -31 -11 52 31 -29 15 -54
5710 -54 -54 17 41 -17 23 70 -17 -20 -35 7 -3 -34 0 -18 21 10 38 13 -18 -36 6 -11 6 -13 -26 21 44 -17 10 -1 66
5741 66 64 55 -5 39 15 70 17 -22 10 -34 -4 -30 17 -17 -49 -23 1 27 17 -35 11 15 -6 -1 16 -47 -26 -12 -35 11 17 66 10
5774 10 23 44 33 -21 -11 -22 68 5 -18 -41 5 -35 62 -34 -12 24 8 -17 -22 -4 -14 -39 -33 21 47 15 5 -53 -6 -30 0
5805 0 -62 17 5 -18 -14 13 -25 -70 -40 -27 25 3 34 -9 -2 22 9 63 39 -15 17 -51 32 -49 29 -5 -6 33 41 14 -10 2 -37
5838 -37 34 -5 4 3 7 -23 -29 -53 6 22 -57 -33 -63 -23 -7 -27 -11 27 27 -64 30 -20 -13 32 -3 55 20 -33 -3 -7 34 -5 -6 2 -8
5873hK9o3OO8p8K6K6o2O4J3K0m6Q8j63L9RM2k1LJ7Ok4O9o3l3NK3K0L5o1ol3L1
5906b2Q5o5K8N3n2PK0l8J7k5O0o1L0m3rK3mk9k1J8kO3Kq2P6ql4mJ4l6L2j9L2j
5940EN8q3%L6p1P6m4J7kK5qk1rL8L4m8l1M3OK4n4M2l7l3M7l7J8L7k2j1J7J4m3
5973a7M3m9M3n3N0m7N9opkn6jK0JrP3jm3mO3p4M4L7j6n4P0n9n9L6K3RQPj3k0l3
6009c7K0pL7m9P5n1j9O0j0L3o6k3O3n7OM0mN5o9m0N7pj5j4J7L0k3RPPj3J0l8Q2
6043F6q8Q6q3K8j3QK0Lm4O5k9Koo4R3n0N0p2MK4J8oM3l0k0nJ0k8O1j3j5po0O7
6077A5j2PJ3jl3M6j0k3NJ6j4m8K6k4L0k1P9j03k1R7q1P0RL0j4Qk1J0k0jNL9o4
6110fn7Q8q8N9M0L0o4K6o0N4O8j28m2P0K0QPn8L1j1K8l8k5M6O3j18K0P3n3k8M7
$$ plain form
5873 -8 21 -42 -36 32 -46 -20 6 -56 8 21 41 -5 83 -80 -41 -32 10 -11 -8 9 15 -9 60 -3 -36 -31 -8 12 47 -14 -20 -53 -22
5906 -22 63 -2 26 79 27 34 54 16 33 8 68 7 37 -6 -15 8 4 -25 -46 -28 -30 33 35 -47 29 21 -13 -17 -3 -39 -7 -26 6 5
5940 5 63 -20 -20 16 -55 21 -23 -6 -8 17 9 -12 -21 17 51 3 -28 15 21 45 -9 33 -4 -37 10 -27 -9 28 6 -5 12 26 -17
5973 -17 26 -23 20 -33 17 -30 29 23 16 14 -42 -43 -23 -22 -31 42 41 -2 -6 57 -17 27 64 48 -6 64 5 -54 -18 5 14 22 29 16 -4 -37
6009 -37 -17 -24 13 -36 39 -12 -31 29 19 52 -14 -37 26 -31 -25 15 11 66 -3 -43 14 7 -8 -22 -5 25 2 11 18 25 12 22 -16 66
6043 66 -22 64 -19 9 -4 4 24 27 -17 48 19 21 15 -49 44 -6 44 -28 -24 0 18 12 55 25 5 0 10 -18 43 30 15 8 -52 15
6077 15 3 10 23 22 -11 35 25 2 7 23 9 -39 -13 -37 -7 -28 51 -52 -73 24 -57 13 22 52 38 46 25 35 15 14 19 58 -6
6110 -6 -63 25 -63 -4 36 66 2 28 -32 22 90 -38 -80 -10 10 18 25 -33 -2 -13 15 -23 -48 -2 61 -57 -37 36 -17 -45 2
6141BqJ8k0J1rk5N6l2J8jN1l4LK4m1k6L5JPK3j2p0L2kJ7l9N6k6k1k3K6O3q7L2
6175ao3L0J5QK1j4m4N6l7L3M2n0N4o4l8L8pM1o2j4N4j1OJ9k9jL1j3N2r4L5j3L7
6208A7L2k4j9l5J8M4%l9k8OK3J2p5R2J5n5j9L6kMk2J2Nk1R1j15J9L9KKm6M0r4
6241h5N5Q2l9J3q%L0q3N9K0m2M0q0N1RrJ6Pm6N1m4j2K6k8M5o5m2J07n2J6m5K6
6273b7N2k1lJ6r3J23jm9K3m0l2Q4mk2L0j1J6l6J3k5J7k2K9kqkl9k9L7M4n1N9L4
6306F0j05N9krMn2L0K3k1kL9ompj9M7j9k1J4kOj8K2K3o3M2qnM4q6K2LMm4P9n2
6342b4JqJJ4m1M9J5o3J7L4J8j0j6K8q7M6K0L1k7MnJ5m2M9%j2l9P3k5M2n1KNj2
6376BO4k3o4N1o4J5OLk5JP1p7K3J8Ln4N7l2O2o7J3J8L8o1R6o2%L8n9mL2k3OMk2
$$ plain form
6141 2 -6 12 -8 3 -6 -31 25 -7 11 10 61 27 30 54 13 -13 22 23 30 53 41 -29 3 1 18 -21 35 9 -12 -35 -9 54 -33 -1
6175 -1 -64 -34 -19 -11 10 -4 -48 8 -29 4 46 -4 50 -14 -52 -14 -21 20 -42 -56 -2 -13 -7 12 -17 -18 13 0 52 -42 -7 -20 17
6208 17 49 25 6 -29 -11 33 33 -6 -34 -28 -5 7 -68 24 39 -16 -35 1 -1 3 -19 -7 -2 -23 68 -47 -28 11 13 15 -31 9 -85
6241 -85 -30 52 13 26 18 18 48 -35 24 44 2 42 -38 13 22 13 29 36 -10 41 -3 -15 11 -17 28 -37 -79 28 -24 -8 -53 -27
6273 -27 25 4 1 17 -76 47 46 -3 20 -20 -52 32 28 6 36 25 41 5 18 -7 10 -12 17 15 7 5 -34 -63 -26 18 -33 26 60
6306 60 -45 14 12 3 7 -45 -15 8 -13 -15 24 18 14 7 -12 35 16 -5 9 7 13 -5 17 40 -23 19 11 6 50 -36 -14 -11 -7 -51 28 -24
6342 -24 -23 -31 -30 -16 -57 -8 7 -56 -39 -5 13 3 -13 15 -72 -26 -6 25 -2 2 -3 12 -30 19 19 7 -32 41 16 58 7 9 14 2
6376 2 66 43 -21 30 -34 -19 -13 -10 -35 -34 37 -40 -17 1 4 -50 7 -25 37 -30 -17 1 39 -22 74 12 12 50 -9 -13 19 -4 2 6 -16
6411a6Q0o9J3L5j3K2n5qj7O6nn6LL3m1O6r2j7O9j6M0jJ5n6L6J0k5k0K5PM2k4m3
6444a2%jQ1j02N2n7RJ5K1o4Q7q2M4l8P0k5jNn1L6j1NO0l8n9M2K4m7j5N4Rk9K6
6477Ho4K1L8l4k5j9O7m5O5j9O3Nk1k9k5l3J8K4nm2K8l4P0L6l9mk2ML3j9j2Lm4
6510e2K3O7l3l6j4P7k4j9RKK5Mo5K6K3Nj5N4o7P6o7J9Qj2oM3n8L6n3O4l7J2j3
6543BJ7Jnj5J2J9n4M7q7K0P8l0l6K7l5J9l2O4J9l8j9KO4m4j9nJ5L9m5L6n3kL6
6576bM5l7L2n0M2q9R4p5kM0OJ9m6K3J3l0rL0K9r5M1j3L7r2O6o3J30m4k2OoJ4r
6609a7l9N9k5M2p5M8J8K4k3m5K7Rqk4J9j9Q1j2jl8MNrrL3m0jL3J6k3mj8JJ5j5
6644a1L1k5pN3q9QML4l8lL7K8ok1M9m8K8j7mn1M7L0j9nQL0l9L2k3qmMm4K1j8l
$$ plain form
6411 -16 64 -5 8 43 30 52 -3 -11 -28 38 33 -23 -20 13 -28 38 -54 -71 -2 -18 22 21 36 -20 16 26 1 -19 6 13 55 31 -12
6444 -12 -12 -13 68 -34 18 -39 -30 -15 6 -58 29 -53 -9 -47 23 -2 -3 2 -49 -13 -24 -19 41 3 -56 -14 10 -37 -52 2 11 -18 8
6477 8 -56 -35 3 -31 -56 -75 -8 -53 12 -7 56 61 40 11 -14 -47 -29 -5 -10 -52 -24 -58 12 48 9 5 -17 -13 20 1 -11 -8 -52
6510 -52 -29 38 5 -31 -45 32 8 -11 -2 0 25 29 -36 -10 13 18 3 57 -10 66 -1 18 26 14 8 51 -7 29 -24 40 3 15 2
6543 2 19 20 15 0 12 31 -23 24 -63 -43 35 5 -31 -4 -39 -20 -52 12 31 -7 -26 -24 40 -4 -23 -28 -13 26 -19 17 -36 -38 -2
6576 -2 43 6 38 -12 30 -59 35 -40 -42 -2 4 23 -23 0 13 -17 -26 4 33 -62 -21 -34 3 -89 -23 -86 44 0 -22 -16 -22 -8 -17
6609 -17 -56 3 -22 20 -55 -7 11 35 12 -33 -6 3 -5 -29 -10 -29 52 40 39 1 5 10 1 -8 25 -15 -16 17 33 10 6 -12 -11 4 -11
6644 -11 20 -5 -12 41 -48 -40 -36 -2 -40 -43 -6 22 16 -5 44 -4 24 7 3 -48 -1 29 10 5 13 43 4 36 13 5 1 5 -39 -18 -36 -39
6680c9L3K0L2q4J3p6N7K6N1p9K4L6k3j4Jk1J2J3L6l7j0N1k6p4K5O7Q1q0L9m6p
6711Am4M3L8km9L6J0n0M7n1j2O4p6N6n9K5LJ4J6j1pJ1rL7l7k7jj5L7J1L1k4K1
6744B7n5M4L2n3Kj1K6j5K1m1L7qJ1J9k1m7QK3K3k8n0J2P4n5l1K9M6No0K1JK7K4
6777C7J3k1o7Q0o6J3M9k1n6J6Q9m0j6j5k7K9J2L6k9l1L2n4N2OJ0o9M7j4k0j5O6
6808B6j8rk2l7M8PlM2n9Lj2jM7n7L0L5L5n4J7j06Q1K2K6Lo8L8Ll3ORl1J00p3q
6842a3k2N1j5K1OL5m1Ql9L1n8nM8m1L8l0J0rK6j0j1N6o6Pl2P6J0l8j6%J4m0J06
6875E7k9o3J1J9qK4o2M8kK1j6L3j0o6M0m8N4n7j9N0J0l2J3N6o8M2Kn1J6O8l1o0
6907e8J8O7m0J1J4j4M4q4N6j7M5nk5k7mL2M3p2J6J6p4R6j0m0Qk4L9q2K4K7N6m0
$$ plain form
6680 -39 -6 14 46 -38 -25 -101 -44 -18 33 -46 -22 14 -9 -23 -22 -43 -31 -18 18 -19 -29 22 -4 -78 -53 14 95 15 54 8 1
6711 1 -43 0 38 36 -13 23 33 -17 30 -21 -33 31 -45 11 -48 -23 -20 -6 10 -1 -8 3 -6 31 -6 -33 -34 -49 -12 -1 30 6 27
6744 27 -28 16 48 -5 -3 -14 12 -3 18 -23 14 6 17 36 15 -32 -24 -1 22 -6 -56 -44 30 -25 -56 -27 19 24 -36 -15 -14 13 37
6777 37 50 29 -38 42 -24 -11 38 17 -39 -23 66 26 10 -5 -32 -3 9 45 16 -15 17 -37 15 21 31 -38 9 -5 -25 -40 26
6808 26 8 -1 -23 -60 -12 -5 -8 34 -25 -22 -34 -35 12 -45 -15 20 55 1 18 -88 -7 15 41 44 -24 14 17 -16 -10 -1 -32 68 -5 -13
6842 -13 -35 16 1 22 28 63 22 30 -9 22 -36 -41 7 -34 4 -26 -16 -25 1 -9 -20 36 -30 -23 -55 21 31 -7 -23 -23 -9 -49 57
6875 57 28 -35 -24 -5 -13 11 -51 -3 -5 16 0 33 23 -43 -3 -51 3 -54 -73 -23 -13 -45 -32 24 -44 -2 0 -51 -35 33 2 -58
6907 -58 -40 27 -13 -2 12 -2 42 -42 14 -3 42 37 12 -15 -19 13 56 -16 0 16 -58 38 28 -12 -4 -28 11 -71 -47 -20 36 -4
6939dm3M4k3lK5J2j9Nm1L1pN6j0n6rM1K0m0K7M2q0L1K1k2N3n1j5L9p1Q2r3P4k7
6972a1L0j2J6ol8J0L5m3qLJ6K8n1l3Q4k7K9l8q1J10j9M3p0M3l1O3kN2l0k9n0m
7004b1M3mn3O6n0n7Q0JoOk8L5pk0j2JrKK1K4l1N9p7j7N9p2M4QJ0l7M5l6N1m0N2
7039C0q1J13l5rL2k1L9Rj11K4l1N8Mj3o3M1K9j4j0J1J7oQk4jRn2M7Jl8L9l5P4
7072D1n5J0k5N7pr0N5N9m1pN7q3K5L8k8Jj7l2N2J2J7n1J2k9J6M3k6M1j16N8j1
7103b4Pj7K2J7M0n5N0l9k9K9k0K2nJ8p5K3J6M3k6J5NM8k0j1M7j29K0N1n2%LOk
7136b2M8k7M0j04OJ16k9n5M1p2L3j7LP3r9K5M7M7r3K3oK9p3K6L3j4j3PQ6j06Q6
7167C9j9l9M3q6J6RN7K7n2L3k6O8m6rn8pJ17q2l3M3l8kJ4J0j8J2nM1m4N0n3M3
$$ plain form
6939 -4 -47 -3 -26 -29 -4 8 -11 -6 -47 -16 -23 33 23 -33 -42 -1 19 -21 6 48 -32 -1 20 -2 51 0 -15 24 -47 35 -58 16 -11
6972 -11 19 7 23 17 -21 -11 24 -19 -27 -24 -8 20 -31 -64 20 -7 22 -16 -97 13 -6 37 -33 10 -21 42 40 92 62 33 -17 -21
7004 -21 22 18 -35 31 -19 -76 4 5 -1 5 -23 12 5 -15 -27 -26 -35 -33 -12 12 -19 40 -37 -54 5 -67 -23 -15 -5 -42 3 -33 18 -22 30
7039 30 -51 62 27 18 50 29 68 77 -34 -10 -41 17 21 8 -55 -14 15 1 -9 2 19 13 21 -3 -4 5 -47 0 1 -37 2 -33 41
7072 41 -14 -4 -29 28 21 -69 -14 45 4 -3 54 -29 -4 34 6 7 -10 -42 10 22 39 -12 0 -29 -13 30 4 45 -71 -13 -24
7103 -24 -17 -34 -12 5 45 -10 40 1 -28 1 -19 3 -2 16 -59 -36 -20 23 -3 12 17 65 45 34 81 -48 -28 23 -29 -29 -26 -20 -22
7136 -22 26 -1 39 -65 -59 57 28 -27 14 -58 -25 -42 -39 34 -65 -40 7 54 -39 -16 -22 7 -66 -40 -7 -21 -34 -27 59 -47 39
7167 39 20 -19 24 -62 -46 -37 20 47 -5 28 2 70 24 15 -43 -50 67 -15 -48 -5 -43 -45 -31 -21 -39 -27 -32 9 -35 15 -38 5
7199Ek7O7o0K2qK4Qnj0pk6jN0p0O3n5j5P4N2n7l0l7M6j2k5PK3L0o0k7P0l6N4j5
7233A2m6jM1M4q4j4P4o3RQJ2nk2M6o4NJJ0j0JM8l1K0L3J0m5N9Qo9k0N7k2jNm4
7268c8J8JL4J2n0QL7k7o5K6M7J3j3j2k7K6K7l2N5jq4M1m4J3MK1M3q4j4N2K2m1
7300c2K8l5L8L0k5j6O6k6l9j0N8m5K8q1L2N8o1N9j3n7P0Kj10J03j9o1N9k4k3L5
7330a1J4j9j1j8O9j5l4M4k4%nM%Q1j34P1o7NO3Ol9J5J1o9J6J1J5k4O5J2o7M2O
7363A3ro5L0M9n1j5L8k3O1n2K5k2O5m0RL1p2L0L6lk0j7Ro1O5pk4M4k2K5nl9OJ4
7397C%k5K1Kq8Q0K2l7nL6m6mK2j8J0%L3k5P3n4J6k4K0rk8K4M8l7n8%L7lK7L3m2
7432DMm4L1j1J2n7R4nr5R6pk5k6O2l3m7K3L7m5RL3n4N4jj6kkL5k2L0RNn3j7K5
$$ plain form
7199 5 -22 45 -15 7 -1 23 31 26 16 9 -17 -18 32 -38 25 -30 -45 29 81 24 -6 -43 3 -9 -34 -27 -4 26 -34 -61 9 -27 27 12
7233 12 -34 -35 6 50 -34 -48 26 -37 -28 -20 -8 -13 -35 11 -53 -48 -47 -37 -47 -46 2 -29 -9 24 34 -11 48 56 -13 -33 24 2 1 6 -38
7268 -38 -20 -19 15 27 -23 -15 22 -5 -70 -44 3 16 3 -9 -36 -10 17 -15 40 39 -45 -4 -48 -35 -31 -10 33 -51 -65 -13 9 -32
7300 -32 -4 -39 -1 29 4 -12 54 28 -11 -21 37 -8 20 -61 -29 29 -32 27 14 -43 27 29 -81 22 3 -58 1 -23 -46 -11
7330 -11 3 -16 -27 -45 24 9 -25 19 -5 -5 -10 -6 -6 75 -59 12 -55 -50 13 19 -20 -5 6 -63 -47 -36 -21 -45 20 32 -35 7 13
7363 13 4 -61 -31 18 -33 -48 -10 -33 28 -24 1 -21 44 4 13 44 -28 2 38 35 15 -2 7 -54 11 4 -20 24 2 27 22 -17 -11 3
7397 3 3 -22 -1 1 -87 -7 15 -22 -27 9 -37 -41 -19 -37 -27 -27 6 -19 54 0 16 -8 12 3 -25 -1 47 10 -48 -48 -11 -14 13 46 4
7432 4 8 -36 -5 -16 -4 -61 33 28 -67 29 22 -3 -29 33 0 -47 -24 13 -32 -23 10 -44 10 9 -7 -9 -11 24 2 32 41 46 -7 -24 1
7467AK4l7O5m5J7k4k8K7J7oL7l2m5L0J4oJj8j5kj5Q8o7J8k2NLj6N0l9O7l5o0P5
7501B7l1km7N4j7K4kM8m1k7M7j1K0j0m6j4M0njK5p1K5j9L1N5j04L0k2j3K8j5R
7533c5LL8Jl5O9j01M2Mm8J09l1j2J1rl0j8O7n5J0PKP2q1M6j3k8qK6k9jL8n3N9
7566A7m3l6P5j6pj4k1K2L0Olk0M5r6O7M0o5M7nj2L3k7m3J5L0k3kqPN5m5M3K0l5
7600C1rpNl1PM9j7m7JL3kk0j7N7q0LK8N1p1P0l3k8L4Nj4n5J12m5J1l4l3K0L9M4
7634E7n9j8m3M8L6k6j6j8K6L1m3J8OQm0O0r4K9K5L6n5N5k1Kl7qM8m5n8R1oJ2l5
7667c4j2R1l8q8P0K8p7Q4j5mnl6L5m6Q5l8k2J21r1O2j13L7Ro0k5O9QMKM5l9J1
7699A8Lm0K6k0l6L9m3M1JL%OL1k2m0J1J6l5K4K8qm7J9RK2n9P3jmK0q4K4rM8Om6
$$ plain form
7467 1 25 -12 53 8 25 1 -27 0 17 11 48 16 -29 1 15 9 10 -8 -23 -25 -40 48 -19 -1 -23 -18 -15 -31 19 -20 47 12 -48 27
7501 27 -4 -6 -53 1 -16 8 6 54 13 -14 33 22 42 32 -14 -28 12 7 6 31 -40 -15 -34 -3 52 -52 -22 -44 -57 -29 -44 -35
7533 -35 -32 6 7 -28 41 -60 -18 -14 -62 47 16 4 15 6 -24 -42 25 -30 -20 -13 -11 61 -20 26 13 -15 -23 3 -26 -27 11 -42 17
7566 17 -26 -62 13 -3 -10 -24 -45 -23 7 13 10 -10 35 -61 6 46 -19 28 23 11 44 17 -26 -11 19 -4 -6 -14 -7 48 3 46 66 31
7600 31 22 15 20 -11 -4 45 28 -19 -18 15 13 -7 -24 33 -47 -44 -16 35 -36 34 1 -27 7 12 -2 -57 55 10 21 -13 -46 -26 13 57
7634 57 -2 -20 -63 -15 21 -5 -21 -39 -13 18 -25 -7 -1 7 -33 27 -67 -38 -13 23 -32 23 2 4 -33 -41 7 -38 -96 -5 -11 1 -34
7667 -34 -46 45 7 -81 -11 17 -60 24 9 5 0 -36 -1 -47 38 0 -22 99 8 70 -43 -6 3 -57 -82 -13 -5 -1 1 46 7 18
7699 18 21 -19 7 -13 -49 -10 -53 -12 -11 -8 -8 -2 29 7 -33 -22 -6 -41 -17 11 3 -44 -25 -16 6 -53 20 19 15 35 -49 -25 -34 14 20 -26
7735b6LJ5M6m0l8J1rL8l9N4l8P3o4k5P0o6%M4m1RO4l8k7M6J2k9l1K4L7pm7K7J6
7768B4j4J1m5P2n2K0j2n4N7L0j1p6J2O8j9k6L1l6j1K2l8jL8k0NP9k7j1l4K1o0
7799e7K4Lk1R4l9NL1l5Ok0p%M0m1K9n4M2j7M1mj9lJ1l8m5Q9m3M7m8j6K7K4j1j7
7833b2M3k2L3k3ll6%L8N6p8pP2m1n0N5Lo6K4J01p4l2l0N1O6q5K3rl3nj2RJ4jN1
7867A0n0M0k1j0L2prl3K6P0m5k6L8l0M3Om1L4Noj1l1K4QK0l6l3Q8r0J9L1m6J8
7900a3LMJ5l3M8n3M1Mm7j1JK7l1k7L7PM1k8l5N8mM2k9l5N0m1L8Nj6j4k6J6K3o8
7934e1O4M5j16L4L9Ml1J6l4P3m2m2k5K0M4Kk1m3N8J0Qn2L6k0Q4o2j8KK6LJ0l6
7966a5k0R6m2pK3p1O7r6J6O3l1O4o1O3j7Qm1l4M3j3K1L0Kj06J12j02K2ML5Ml7
$$ plain form
7735 -26 -23 -8 38 -2 -40 -29 -38 0 -39 15 -23 50 -14 -39 31 -35 -35 9 -32 -23 41 3 -24 22 34 5 -26 -2 35 28 -19 8 24
7768 24 10 21 -24 48 -4 16 4 -50 7 37 26 -50 -38 30 11 -15 16 -20 -31 -9 -47 -48 -10 -30 -25 54 27 16 -18 3 -57
7799 -57 -33 -30 -51 43 4 9 40 5 11 -9 -16 -16 24 -17 12 -42 0 -17 24 20 1 -2 9 -29 -74 15 -28 19 -29 -45 -18 6 -5 -22
7833 -22 21 -1 32 9 6 -30 -30 8 64 -14 -21 51 10 -40 15 18 -48 -24 77 3 -29 -59 -8 58 -27 -4 -13 -46 -51 -63 -54 -40 -41 10
7867 10 -40 0 -21 -31 1 -6 -15 -48 -22 48 3 -23 15 -15 28 34 -7 27 32 26 15 -16 8 16 36 0 -33 55 -35 -16 15 -31 -13
7900 -13 -10 -6 9 -24 24 -29 12 16 -31 -42 -41 -14 -45 -72 -35 -28 13 -15 -50 8 4 46 17 -18 32 -9 29 34 18 4 -22 -6 17 -51
7934 -51 13 58 -58 -24 15 19 -12 4 -30 43 1 -41 -66 -46 -2 0 -21 -64 -6 4 12 -40 -4 -24 60 -2 -20 -18 8 11 21 -15
7966 -15 -35 61 19 12 35 -36 31 -65 -49 14 -17 47 -14 49 32 40 -1 -35 8 -5 16 46 48 -58 54 -48 -26 -22 13 17 -20
7997b0M5m5JpLK7k2MJ4J3m8M9j4k1O9rj7k1Mj1J5rJ5j5k0j0L8pnM3l8k8K0j2R
8032a0kJ4j4K3j9J4k9K9k9L2l5K9K6k3Rj5RM2p8P3j09P7Qo9J01n3m7Q6n5jL5j24
8064a05J57J2o9J9Nm7m7M9k0R8qj01OOMj8O3k1m5J9MMP9K6n1Mo6N6n9N5n2N2L7
8097D6l6J4mmk3qj1L9k7RL6j4Pp5R7m3l8L5k2K7L6r3O4J0r7L9L4m9K5JjJj5R1
8131E1p6PK5l7mj4L1K2O7j02k9P8M1o1k2Q2j3k6J8n9K9PK8Mq2L1J8Kj2j5nPM3
8164C4m0Pj9L7m9R3r5j2N7k6M6j8n8M0KrL7n6M1L9l8nj1N0rlm1
$$ plain form
7997 -20 25 -20 -19 -26 -23 4 -18 -14 0 13 -35 14 0 -21 48 39 22 1 5 -6 9 0 15 0 -20 -30 8 1 -4 39 1 -27 -7 -19 -10
8032 -10 -12 2 -12 11 -8 6 -23 6 -23 9 -26 3 29 6 15 0 9 51 -27 46 -63 14 22 -47 54 1 -46 40 -15 -16 19 -105
8064 -105 52 64 -5 14 19 -28 -75 -26 -46 52 44 -57 -51 -45 -41 -59 4 -17 -62 -43 -39 -35 44 70 19 23 -43 13 -46 9 -43 9 46
8097 46 10 24 20 16 -7 -15 -26 13 -14 -5 31 17 24 -51 46 3 -35 0 -22 5 41 -52 12 22 -75 -36 -2 -51 -26 -25 -26 -25 -40 51
8131 51 -25 -18 7 -30 -34 -48 -17 5 72 -30 -59 19 60 -1 -23 59 46 20 38 -21 8 15 43 47 -35 -4 14 16 4 -11 -16 -9 34
8164 34 -6 1 -18 19 -30 63 -32 -44 13 -13 33 15 -43 -3 -1 -10 27 -29 12 51 13 8 -3 47 38 35 -6
8191f
$$ Imaginary data points
##PAGE= N=2
##DATA TABLE= (X++(I..I)), XYDATA
0@%%%%%%%%%%qJ6j6J6j6K4l2M0m8N6p2Q8j04J20j40J64j92K24k56K96l40L87m39
33b32M96n61O33p12P99q95R99j112J234j370J521j684J860k053K265k496K751
50A443l031L336l678M059m482M957n496O114o828P665q663R875j1387J3334j5945
65h727J9656k5382L5457n8337K03716j3743m20905R5498K51546R4302j49929q4629
77f1477J3932M4105l571L2062K084k7219k5840K0417J0507j475p802J3239k225
90F737j0589o413J0558M068J548m550j132m125M69L799M666m813k455J674K152
105A594k425j44J492M91k009K269K023m215l960M628N315j557o168k044M246L621
121C157k013k566L95J360L84p30j113j8K242K005k630m186R70N336J884l627m110
$$ plain form
0 0 0 0 0 0 0 0 0 0 0 0 -8 8 -8 8 -8 16 -16 24 -24 32 -40 48 -56 64 -76 88 -104 120 -136 160 -180 207 -232
33 -232 264 -297 336 -376 423 -472 527 -585 649 -721 800 -884 976 -1077 1188 -1308 1443
50 1443 -1588 1748 -1930 2129 -2353 2604 -2892 3222 -3606 4059 -4604 5271 -6116 7218 -8727
65 -8727 10929 -14453 21004 -37333 166383 152640 -268265 -172767 78779 173081 23152 -61477
77 -61477 -47545 -3440 -7011 25051 27135 -84 -25924 -5507 5000 3525 -4277 8962 6737
90 6737 -3852 -10265 293 4361 5909 1359 227 -3898 -3429 370 5036 223 -2232 -558 1594
105 1594 -831 -975 517 1008 -1001 1268 3291 -924 -4884 -256 5059 3502 -2666 -4710 -464 3157
121 3157 1144 -1422 -1027 333 717 -13 -1126 -1144 1098 3103 473 -3713 -2743 2593 4477 850 -3260
138c260R21L528J38k043Q04J181k350k023K072L763O08l689l412J667L985N53
154B443k403j314O04R96j38k51J046O83k018j659J921J821j338j598N82J236k37
171C76q80K51Q15m97n46N56L36k93n46K46M01j9l07n4K66J6l02l50M43J046K59
192A217j846j427J690K376q71j999l43R47Q60o6j40k0o93o00P76Q61j56o41m01
211d76m9L60N94J56n58l12KK00J17J96p4j24k75j07L46K98K8k40l48j65L63M43
233C75o1n63O6L43l34R6N28j48m36l57K74P25m9p91j1N06K2j93l1O2Q5m9j39o2
257a42J18O7l9o2KK5M5n8O2k9Rr3J44n0o7j1Q6J12j00j72K0K69j9j28m1K0Q8K1
285G7j78J22K11k91j77K60J97j81p6p7J58Q2j72q3O8K0M2j8Q8r5K6Q9k01k4K69
$$ plain form
138 -3260 -2339 1189 1327 -716 88 1269 -1081 -3104 -1032 2731 3339 -350 -3762 -2095 1890 2443
154 2443 40 -1274 -670 326 188 -63 983 1666 -352 -2011 -90 1731 393 -1205 -623 613 376
171 376 -504 -253 562 65 -481 75 411 118 -428 -182 219 200 -107 -161 105 121 -181 -531 -88 958 1217
192 1217 -629 -2056 -366 2010 1139 -860 -1203 -256 604 538 398 378 -315 -915 -139 722 566 -75 -476
211 -476 -525 -165 429 585 27 -285 -283 -83 34 230 156 32 -243 -350 -4 294 322 82 -266 -431 -68 375
233 375 314 -249 -183 160 -174 -78 450 302 -134 -491 -217 508 459 -332 -343 163 185 -8 -39 23 108 59 -80 -142
257 -142 -24 43 4 -58 -56 -31 14 -44 18 -11 -2 -95 49 -1 -68 -79 7 119 19 -153 -133 136 117 -11 -52 -32 56 77
285 77 -101 21 232 -59 -236 24 221 40 -36 -113 45 127 -45 -128 -60 -40 2 -16 72 -23 3 92 -109 -133 136
310A36L7k19r5P9K12P7k59j12K13m1m7j0P6j15N5p2%K10qk09k2J78N5j17m4l6
336g8O2P6n0n2R7l2j00Q1qm7J5N1N7n4p6O2K4m6K7K0j36J10O6j01N7M8j38p0J02
365c3K1pN5j46J2K42l1j36M6j4KN5j04N2M3k6j80J36J00pj24M8n7L3%P3j4l0p
394Bl6J5J7j6Q0j16n1P7M3Pqn%j9L0J5l4N7m5L3k9k4oP3m8n2j2LL7Nl4M8J1J9
428C7o5n1L8J46Jk00j00J43J29Q2p8j65j8J42JM2M0j65q0N6P4Q0J23j62k26M6
454a30J06J39Q3j27k83P6J31J10k9o0j09O0J01L3o3j2q9L1j8N4J0j4J4Ql2j0K6
481FJ4j5p8N7K7M9m5o5L3m2Q1J8o8n4N0J58m2j81n0J07J68p7n4p1M0K4M1l2rl3
511d3Lpl1N2qK2j3JKm1N7N3k4n5q3K2J63j8j4m9pl9N4K6K0k3k6k4PR7k5l0l0j3
$$ plain form
310 136 173 -46 -141 -62 150 227 -32 -144 69 28 -19 -29 47 -68 -13 -85 -85 125 117 -92 -114 64 119 2 -42 -78
336 -78 -16 60 10 -42 55 23 -77 4 -4 -51 -36 15 72 18 -58 4 28 -18 9 29 -107 3 69 -32 25 73 -65 -135 -33
365 -33 -12 -19 36 -110 -98 144 113 -23 23 9 11 66 -38 14 57 31 -149 -13 87 80 -44 4 -53 -20 -20 53 39 9 2
394 2 -34 -19 -2 -18 62 -54 -105 -28 15 22 14 9 9 -10 20 35 1 58 13 46 17 -7 -13 60 12 -40 -52 -49 -12 -7 -41 7 18 37
428 37 -28 -79 -41 105 106 -94 -194 -51 78 160 82 -83 -101 41 42 84 124 -41 -121 -65 9 89 212 50 -176 -130
454 -130 -24 115 198 71 -212 -136 -5 105 76 16 -93 -33 68 101 38 26 -63 -32 -50 4 14 0 14 22 -10 -20 6
481 6 20 5 -73 -16 11 60 15 -50 -17 -59 22 40 -28 -82 -32 126 84 -97 -147 -40 128 51 -3 -74 -34 -10 31 -1 -10 -43
511 -43 -40 -47 -78 -26 -34 -12 -25 -24 -22 -63 -6 47 23 -32 -115 -93 70 52 38 -11 -18 -57 -3 23 43 20 -6 -30 -23 74 49 19 -11 -24
545b4o4R4PLLn5k5N3M9M7o5Jj31O5N0J9kq3M5L8j5nj7OK8n7pL2J8N0m0l1n6n3
579a22O8R1lk1m8M0L7j1J2r1OP2q5L6J7j2loo7J19k0n8N2K5k6n9Q4QK8k8j01P
611e9O4j7P7p1N0o8LL3m0R3k4j15K5P3kj3o7J0MN2O4l1k6n%k8j4M3k5nN3j2m0
644a8l3P6l5n4N1lJ5R6o9q0P0kk0nk8L1K6%K7J6m6J5Ll3j1JO7on1j3k3JO3m0K4
679A2j2j0j3L2k7L0j7K9Nm4k8R6l3l4P5o5nL5M1o6K0m4K5J3j1qJRj0k2P5o0M0
712B9j6O2j12qP5l8l1nj4O3Nk5M5p2M0l1J09j07k5N4K5%o7L0M4o5N8m2J4K3M0
743E8pj16Q4o2J7Ql%O9m9K5J2jp2J03k1m6l7L0k0L0j8mN4k0k7l7N7J7j7p0O3R
776IRo2Q3l7l2K0N3n8K0l5J04L9j02PK3m1j5P6o1L0lJ7n3j9Pl0P4q5N5K7n1LK5
$$ plain form
545 -24 -88 6 13 16 19 -36 -61 -8 41 88 23 24 -107 -42 8 27 25 -58 -13 25 10 5 -12 -6 22 -35 -42 -10 8 58 18 -13 -69 -122
579 -122 -54 37 34 13 -35 5 42 31 43 -48 -42 30 -55 -19 -2 -14 -17 -23 -90 29 9 -49 3 28 2 -57 27 35 63 35 -66 -59
611 -59 5 -12 65 -6 44 -24 -21 12 -28 65 41 -74 -49 24 22 9 -58 -48 -44 8 72 41 15 10 10 -18 -32 11 -14 -19 34 22 -18
644 -18 -51 25 -10 -64 -13 -16 -1 95 26 -54 16 14 -6 -11 -39 -8 18 18 45 61 15 30 33 0 -11 -10 57 51 0 -13 -36 -35 28 -12 12
679 12 0 -10 -23 9 -18 12 -5 24 29 -15 -43 53 20 -14 61 -4 -9 26 67 1 21 -23 2 15 4 -4 -3 6 -4 -26 49 -11 29
712 29 13 75 -37 -45 30 -8 -39 -44 -58 5 10 -15 30 -42 -2 -33 76 -31 -56 -2 23 23 -44 -14 30 -35 23 -19 -5 18 58
743 58 51 -65 19 -43 -26 -18 -21 -21 48 -1 24 36 35 -37 66 45 -1 -38 -8 -28 2 -16 -20 34 14 -13 -50 7 24 7 -63 0 9
776 9 18 -44 39 2 -30 -10 43 -15 5 -30 74 113 11 18 41 0 -15 61 0 30 27 44 -9 -28 -21 -51 23 -62 -7 20 -31 -28 -3
809cml4L8j8Mj0N7k1nrj4L3jj1k0L5k8L8o6P4j1k8J2J3M1q4OnN2K1m4oL4l3M5
844D8l8n6QJ9mM1j1J5Oo7J7j7%lL6lJ3J9J6j4j3m5J9k0L4M7n1j9J0N2l2kL1n%
879C1k0kMLkn5O0n8P0k0l5KP3j0p1M9jl2J5J1k4qj0N5r8K2N8j1L1l6K4M2m6K5
913C6m5K0j9J5L0k1J6%k2Rm3K6L0o3M3L5k9j4p6O7M4%n8l2J4K9KJ1J3m9M0K8k8
946IK1j7k2onj0LL0k4M0J7l5pL5K9k0j3k8J6J4l5j2K4M4m3j6N2r4P3Qj7Rn9j4
980e3Q3J4n6M8o8J6Qo2J20j3l9j5l1k0J12k0j8m8Q5Jm5Pj6L4L4j21N8j6N3Om2
1011dK2n1N2k0j9qK3l2K0m5R9m5j1J6qj2k3J9O4o5K3nl8K2L3O5p9L1j9Q1l0r1
1043c5L3K8K1k2l0M0k5Qn7J9M1n0K3L5n3J6j1J9Qj2J9rNl4N4m7K5k7L1pJ0rQl0
$$ plain form
809 -3 -7 -41 -3 -21 -17 -27 30 9 4 -5 -19 14 13 2 -18 17 -11 27 -39 35 24 -4 8 21 62 -22 -16 -21 31 52 8 2 36 3 48
844 48 10 -46 -38 -19 -23 18 7 22 28 -39 -22 -39 -39 -42 -6 -9 4 23 39 25 12 -33 -14 -34 0 47 -4 -23 -13 39 7 5 36 31 31
879 31 11 9 13 16 14 -41 19 -39 31 11 -24 -22 51 41 -30 19 18 -14 1 12 -12 -20 -30 25 -73 -51 7 -4 27 -9 15 57 11 36
913 36 -9 11 -8 7 37 16 32 32 10 19 -24 2 32 -31 12 47 18 4 -72 -5 39 39 -19 -51 -37 -8 -6 5 18 -31 9 37 9
946 9 30 13 -9 -15 -20 -30 -27 3 -21 19 36 1 -6 29 58 38 25 -3 13 27 -8 -20 4 48 5 -11 41 -53 20 28 11 20 -39 -53
980 -53 30 44 -12 36 -32 -16 -8 -70 50 37 -2 -17 -48 -68 44 24 6 -42 43 44 -1 6 -10 24 58 -63 -5 -21 32 38 -4
1011 -4 18 -33 19 -1 -20 -28 -5 -37 -17 -62 37 -8 -19 -3 -11 -23 -46 -27 37 -28 -5 -10 -48 -26 7 72 -7 24 5 86 56 -35
1043 -35 -2 26 47 25 -5 35 10 18 -39 -20 21 -29 -6 29 -24 -8 -19 0 8 -4 15 6 11 -23 31 -16 9 -18 13 6 16 7 15 -15
1077a5K4l0J2J6k1L7l7O9Ro8K3%J7Qj1J2k9j3K8qql4k7L7PNl0j4NKM0m5O2l1Q
1112@JJj9K9m4M0QnJ9J2r5Q9k6J6L6r9j5oN6J7rm3N6j2j3O6q4K6Rk9J4n7Q7qr
1147Io9R9q8O0j8m1NR3l0k4JQRN5j05M1L1l4O9m4l0QN5k1q6R7m9j4J0K1l6L9o
1180A5%K3l9k6k4L2N4l8m5M8ML8m1J7Jm8l1K9K2j6J09r7j6O6m8kJ4LM3m8L2k6
1212ELl6P2on8N9k3k2K8L5n9k6K2J7K2j5qJ2l6LP6m7l4J6Kn9M1klN7n2L0qJ3k
1247A7M4qm7k8K1%Jl3O8r5M8K1j2P1p4J4k4J9J0%n4K6lJj7M5m1J6mM4J1m5K0J2
1281B4M5q5K0j0JM7n7L9rn9L7K1lR5p6m8K3j2M3l0n1L3j7N8m0J00l0l5l9K3k7
1312a9M8j2m1j6nJ14q9N4j0q1M3l7O5j6k5K7J1jo0P5j5M7j26J07o2N8o8O3K2r
$$ plain form
1077 -15 9 -21 -9 7 -14 23 -14 55 64 -4 19 19 36 44 33 45 16 3 31 23 15 -19 -46 -9 -2 3 -27 -41 -36 -34 6 -39 23 -8 0
1112 0 1 2 -17 12 -32 8 16 11 30 42 -53 36 10 26 62 -37 -52 -58 -2 15 6 -37 19 7 -6 60 -24 2 11 -18 -4 -61 26 18 9
1147 9 -60 39 -49 11 -7 -48 -43 50 20 -4 -3 5 14 69 -36 5 36 2 71 27 -3 5 60 39 -47 50 1 -13 -3 18 -18 21 15
1180 15 15 38 -1 -27 -51 -19 35 -3 -48 0 4 42 1 18 19 -29 -60 -31 -9 -25 84 -13 -29 37 -11 -13 1 4 47 -1 31 5
1212 5 8 -28 44 38 -20 39 16 -6 22 57 -2 -28 -6 11 33 18 10 22 -14 -11 65 18 -16 0 2 -57 -16 -18 -21 36 -16 14 6 19 17
1247 17 61 53 6 -22 -1 -1 0 -33 35 -60 -12 9 -3 68 -6 8 -16 3 13 13 -41 -15 -18 -17 -34 11 -30 -14 -18 26 37 -8 12 24
1281 24 69 -16 4 -6 -5 42 -15 24 15 -44 -7 14 11 106 30 -18 5 -7 36 6 -45 -12 -29 29 -11 89 59 24 -15 8 -19
1312 -19 29 17 -24 -40 -45 69 -20 34 24 -57 -14 -51 14 -2 -27 0 11 10 -50 25 10 57 -69 38 -24 34 -34 29 51 42
1342D2m6l9M7N8rj5m9j4J4j6O8m5j5L3m3L4M2r3J7LN0n9Jj4L9Q4o8j1j2L8m3N5
1374C4k8j2M8l8LM5q6N2K3m7M2pk4J5rj9n8M2K2j5K8J5m1n1J08mp2K0Nl9J18q1
1406a1L0k3K1m2k6N6L7p7J2L3j4Pn1K9K1M4j05J1JP5m1OL1k3K8qL0n5N1m7m0M3
1438Cj6L2l5O4o9J01r7j3R4m0J6m2kl7M4l5M7pm0L0J08j71N2Ol2K0rk8J10m2K1
1469C3j0o5nJ7L8J5k5j2l5N3n2O5J0p1N6l9N2k5rk6J09r1J9j0J7L3j4n6l4O9r
1500bPJ9Pm5L1L8j5M6r3k3M1l5P8J4o7J7rL4n2L0qrRK6m2L0n9L8j7l7Q2k3q4P0
1534cJ3l7J0l9KJ2N0lpOJ3K6m7Mk1M3m6M7l4m0Q6p9L6L2k4rkj6K9m5l3M2K1O0
1568D7l6k1M9m1m5J8L2m9O0l9L2k3j1M6l2J9l1Q2o2k7j2N0oLJj9RM0l1%rJJ2j0
$$ plain form
1342 42 -4 -43 4 62 53 38 -11 -25 -11 -27 41 -4 -19 14 -29 5 47 -46 -29 -26 24 -35 -34 -48 -9 75 7 -4 -16 22 -21 34
1374 34 6 -6 42 4 7 52 -34 18 41 -6 36 29 5 20 11 -8 -66 -24 -2 -17 11 26 -15 -66 42 38 -34 -14 -9 -48 70 -11
1406 -11 19 -4 17 -25 -51 5 42 -35 -23 10 -4 3 -48 -19 2 46 -59 -48 -47 28 -13 -7 24 1 29 21 51 -4 47 0 -40 3
1438 3 -13 19 -16 48 -21 80 -17 -30 64 24 40 -2 -4 -41 3 -32 15 8 -32 -2 106 -65 -13 -7 -39 -19 -28 -56 54 12 33
1469 33 23 -42 -47 -30 8 23 -2 -14 -49 4 -48 17 27 -44 12 -27 25 0 -9 -35 74 -17 2 -8 9 42 28 -28 -62 7 -2
1500 -2 5 24 31 -14 17 55 40 86 -7 -30 11 -24 54 68 1 18 9 43 -9 21 13 4 13 39 -3 27 -32 6 -11 -48 34 11 -73 -3
1534 -3 10 -27 -17 -56 -54 -42 8 5 -2 4 17 43 -4 0 -21 22 -24 23 -11 -51 35 -44 -8 24 0 -9 -11 -27 2 -43 -76 -34 -13 47
1568 47 11 -10 39 -2 -47 -29 3 -46 14 -25 7 -16 -27 19 -13 6 -25 57 -5 -32 -44 6 0 3 4 -15 -6 34 3 3 -6 -5 7 -3
1602cj1j1N2l6%j9J6kl4L3M3J2lp9L4L6l9L6j8kL9k1m7J1pO1o9M2o2M7L0p1NJ3
1636b4J5K4Roj5Qk3L8ol6M3J9n3Rn6Q1o4K8R8j12L3k6N9l8j9O2n0J6J1k9J1j8
1668a1l3O1J6Qr5K8pO7n6L5%J6m3O1op6R7m6o1O2j7k5L1nJ3Pj2j0Pl5j3L1k1J
1702c1L1p1P6l9K7JM1l5k4O6r0K6N2p8N3m5O9n3K8k3J6rJ8Pj5k0M5qpj6nj9PO
1736a9j6M5l1J2J0K3m3j4RqL5K8m8ONKRj4J3N5j07P8l4k0j4Q5L8j35L1L3oj3J2
1769GJ7l2O9j7o1k5L5J4l8qM2l3P0r1M6N5k5oL0o9K5J2om1K5nj6M5k1pk0P0o6
1802b5L0j3O5m3m7N2m5M4l8NL8Nm5L7J2pl6j3Lk1K8l0J1nK9K6rk8L3l5J0J8j2
1835fj4j8O5O%k5J2j0J4mj1rM4p0O0l0m1K0l0N2l8K3lk2K5l9N3J2o4J15n4k4K9
$$ plain form
1602 -3 -14 -25 27 -9 -9 -28 -12 -14 -48 -15 28 40 37 -42 -8 28 -11 25 7 5 44 23 -24 -13 -20 41 -28 14 -48 -1 29 -42 -37 -24
1636 -24 -9 15 24 18 3 11 -12 26 20 -16 27 46 -7 2 -54 27 -37 -9 89 -23 10 -16 43 5 -14 48 -2 14 25 -4 7 -11
1668 -11 -44 17 33 41 -54 -26 -33 34 -22 13 13 29 -14 47 41 -35 62 16 -45 17 0 -25 6 1 14 21 9 -1 6 -29 -42 -11 -32 -31
1702 -31 0 -71 5 -34 -7 -6 35 0 -24 42 -48 -22 30 -48 5 -40 29 -24 4 -19 -3 -12 6 13 -2 -22 23 15 8 -8 -13 -32 -25 -19
1736 -19 -35 10 -21 -9 1 24 -19 -33 -24 -32 3 31 -17 -11 -6 -4 5 -9 4 59 -48 30 -4 -24 -38 47 85 -50 -19 14 8 -5 7
1769 7 24 -8 61 44 -17 -42 -7 7 -31 -39 3 -30 40 -51 -5 50 25 19 49 -20 5 17 11 -30 -5 -10 -26 19 -2 -9 -29 41 -25
1802 -25 5 -8 57 14 -33 19 -26 18 -20 -15 23 28 -17 20 32 25 -11 -24 -21 -42 -14 -44 -33 -38 -9 17 8 -20 13 -22 -12 6 -6
1835 -6 -20 -38 27 33 33 8 20 10 24 20 9 0 44 -26 34 4 -37 -17 -47 5 -33 -10 -13 -35 -10 -49 4 16 -48 67 13 -11 18
1868A8Oj4m1L0j7j5K2J5rK8n3O4m2K6%Mk6L1Nn9P3j04Q0L6j20R6k2l1N3n2L1k5
1900a2J4o7J06J9j05L8N7p6O9p8J3L0j4J6j0J2j8J7k8N2m7K5o2L3L0j1pL5m9j5
1930c3L6J6J5l7pL7k4J8L1o3L0m7L2j2k3M0j7kkMp9P4O2l3Km9L1J7nm2M3k0L2
1963B5K8j0p9L1N7nj5o1N0L6n8k1J2MJ9J4j5j3L7j9l5koN3j0J9p7K5L2k0QL1l4
1996AJ9k5oQJ9lOj7oK8n6jR0l7k3k8kO8J0j4oK2k9k9k0M7Kl8o0J00L2m6K1J5m2
2031@rM3l5J0O2m6j9l9J0nJ0N1p4N7k8M4l2Qj8O4qJ2q8mO3NK0q4M0Qj0o0Q8l4
2065Bl5J3oK2k5l0O4Kmj5O2m4%K1mk1J6jj1J1K6k4l8M5J5m7%K4nJ5k0mJ3k0k7
2100c0P3l0ML5n4j1j3J5K1n2PL3m0L3m4P4o8K4j5O4j4oL1l6j5k9j2O6J2o1Mk2
$$ plain form
1868 18 24 10 -31 -1 -18 -33 -11 4 -5 23 -30 34 -8 18 18 22 -4 27 32 -27 46 -58 22 58 -62 34 12 -19 34 -18 13 -12
1900 -12 2 -65 41 60 -45 -7 50 -26 43 -35 -22 8 -6 10 0 12 -6 11 -17 35 -12 13 -49 -16 14 3 -4 31 -18 -33
1930 -33 3 19 34 -3 -10 27 3 21 52 -11 19 -28 4 -8 -31 9 -8 -10 -12 -8 -87 -13 49 16 18 -31 0 17 12 -30 13 -7 25
1963 25 53 43 -36 -5 52 47 32 -29 21 57 -1 -22 -10 -6 13 27 12 -1 36 17 -18 -20 -26 27 17 36 -41 -16 16 -4 4 35 1
1996 1 20 -5 -11 -3 16 13 19 2 -4 24 -32 -33 57 20 -3 -31 -33 35 45 31 25 47 18 -11 -31 16 18 -20 -80 20 52 6 27 42 0
2031 0 -9 34 -1 9 71 25 6 -33 -23 -28 -18 33 -41 16 -12 32 0 8 -10 54 46 58 -30 -34 29 34 54 -30 10 18 8 -52 36 2
2065 2 -33 -20 -26 -4 -29 -59 5 7 3 -12 50 6 6 27 23 2 18 17 6 17 43 19 -19 26 41 -6 -6 18 13 28 8 4 17 -3 -30
2100 -30 43 13 17 52 -2 -13 -26 -11 10 -42 -35 -2 -42 -9 -53 21 -47 -23 -38 26 12 6 37 1 -14 -43 -55 11 23 -38 -34 -56
2132e6O5k9j3K4K0M1r1N8L0o2K9l7jL7Jo1M1Oj9PK0m5J2k0J06p0RK2l0j3L0j7
2164frM9q9R7l8k2m8M5J9rK8m8M9k0j8N1n0M7l4l1P6l7L0m1K2l0J8j2J6m2J5j1
2196c3k5J9j2P4l7LL7o0N9J0n5L0rk4Nj1N5l7QK1j3m0J01Qm1n1j6N2J3k4n3L0
2228a6L4J3l7J7K0n8k1R8l2j6MN0l1Ql2N0o1L7j4m6L6n7N6k7M0o5P8l4O2l9m6
2259b9O7n7Q2q8K5L8o5Q0k9m2J5O3q4K6J3l1%O4l7J6j8j2m5O0J9j8m3kK1L2l0
2290im0L8L1o9L5L3n8LOM2j9M7k4k2K3K5l6MK7j3j1jm3j6O8Lm5Q4m2n8R6m6RJ
2324B3p9L4J2K3o9Q1n0l4L3J1J8j2j1JM2k6M1k8L1k2L9j8j7l9J7k5M6k5K3J3j4
2355A9J2qrl0J6m6M9K1o6PL8l3RrQJ6J3k1KL5lo0M9JK0lPn5M4ll8N5m3J9j9L0
$$ plain form
2132 -56 9 -20 -33 -9 11 52 -39 19 49 -13 16 -21 -22 15 16 -45 -4 2 -17 -10 10 -35 -23 -43 63 -7 2 24 -6 -19 11 -6
2164 -6 -15 34 -55 42 4 -18 -66 -21 -2 -11 17 -31 18 -2 -20 31 -19 28 -6 -37 39 2 32 -9 13 -17 1 -11 5 -37 -22 -33
2196 -33 -58 -39 -51 23 -14 -11 26 -34 25 35 -20 10 1 -23 -18 -29 26 -11 -3 18 5 -35 66 74 33 -18 -34 18 31 7 -46 -16
2228 -16 18 31 -6 11 31 -27 -48 50 18 2 6 56 25 33 1 51 -10 27 13 -33 3 -54 2 -25 15 -50 28 -6 56 17 -29
2259 -29 38 -19 63 -25 0 38 -27 53 24 -18 -3 60 -24 2 15 -16 -16 48 11 27 9 -3 -48 12 31 13 -30 -32 -11 21 -9
2290 -9 -49 -11 20 -49 -14 19 -39 -36 -30 12 -7 40 16 -6 17 42 6 10 37 24 13 12 -31 -47 21 24 -21 63 21 -37 59 13 22 23
2324 23 -56 -22 -10 13 -56 25 -25 -59 -26 -15 3 -9 -20 -19 23 -3 38 10 41 19 58 40 23 -16 1 -24 22 -3 20 33 19
2355 19 31 23 14 -16 0 -46 3 24 -42 -35 3 -30 -21 -30 -22 -6 7 -14 -12 23 20 -40 9 10 30 27 34 -21 23 20 -18 37 -6 13 -6 24
2391B4p9P1j3n6Q2%l5pm1N0M1p2O4l5N9r3K3LL0L6k0m6O5q2M4k2Q7r4j3j9J0l3
2423g1Q8n8O2J4j1l6J5qN7p8P9o7oJ0RO5n1no3K1Rj4M3%LJ4J7k9l6J2K0m3KM1
2457Em1Q5m4%k7O7o7K0J1k0K7pK3L2n9l9J0M7pl1J6l8Mj4J2M8%o4P8Kr3L3o2J10
2491A7K6m2l6M8j4J5n8P1m6k0N8j0mk4L1J1l7K2Qj1K7J6Kl3m8N2j3o6O6j5Mj0
2523a3k3M3J6j00P8ml1j3P9J8p7K1J7n7J3K2L6o1J07j38O7QJ9Jn8mQQ3j9k4J4
2554B8k2pJ6n8J15o6j0L5m4K8M5j3n5J0J1k5rm9P3n4J6M6q3Q9J0q4N1M7n8K7j4
2585dmM5rk6pK4k7P5l6m4L5K6l6k8K6j5j7K2K7J3qn0M5jm7JJ1j0j0J0N5j5n0P0
2619D1n5M6l4J5nj1KJ9m3J5K0pnL6q1R9j00KO1p1N9M4p0O9m5j7M1jk4j3M5n8K9
$$ plain form
2391 24 -55 16 3 -53 29 29 -6 -13 -54 -4 37 -35 29 -6 53 -40 -17 -14 16 52 32 -14 51 -31 13 -9 78 -16 -29 -48 -38 -71
2423 -71 17 -41 21 35 24 -12 3 -5 52 -26 53 -14 -20 -10 -1 64 13 8 -55 -34 -25 -39 4 4 7 21 38 9 -27 -15 5 -38 -36 5
2457 5 -36 49 5 5 -22 45 -22 -2 9 -11 16 9 32 64 5 -34 -24 23 16 -15 1 -37 -33 -47 -35 13 13 -51 27 29 -64 -31 -93 17
2491 17 43 1 -35 13 -1 14 -44 27 -19 -39 19 9 5 -19 12 23 -14 8 16 5 32 48 50 17 -31 21 8 -58 8 -7 -3 -13
2523 -13 -36 7 23 -77 1 -3 -34 -47 32 50 -27 -6 11 -46 -33 -11 25 -36 71 -67 0 8 27 28 -30 -34 -26 57 38 14 28
2554 28 6 -1 15 -43 72 6 -4 31 -13 15 60 47 -8 2 13 -12 -21 -70 3 -51 -35 11 -72 17 27 -57 -6 41 -17 10 -4
2585 -4 -8 37 28 2 -5 19 -8 67 31 -13 22 48 12 -16 10 -5 -22 0 27 40 32 -18 27 26 -21 -20 -9 -19 -29 -19 36 21 -29 41
2619 41 -14 32 -2 13 8 -3 -1 18 -25 -10 10 3 -2 34 -47 52 -48 -46 15 -56 3 47 -23 46 1 -16 25 24 0 -13 32 -26 3
2652Cj9J3O4j08j0R9j7k4J7j5n4j1J3P2m5N2NmoQl2k3N2j2m3J8n8M9M2L3r8J9
2684b0rrN9m2K3Nm1j7P2m5N9l1m9Q6rm4L2k7J6J1o1K8J6k3L3l0K6J9p4M0j4K1
2716Aj3J7MK1m3K2Rk5oK4K4kn5K7j1M2Kl4Nk9ON6m5Mk0N6m6K4nPqk0N0l9J7k4
2752gK0j8l4P0o2K8j7j7N7k5nn2O2J4j1j4p9Q2K7l4k0P3l3n3N1k0Mn2N9mM5k8
2784Gk0K7j3mOL1m9J1o8R3o8M7l8%R0o0J1nN7l1L8l0k2j7M2lQk5k9L7j7l0K7J
2818DL2k1m7O6km0J2j4O4j01N4L3l4j2K5l5K5J4l6Oj9L8Ql3j0j6L6N8m3O0m4r3
2850f5Q7mlL9o1j7NP5o1L1q4M7RrN4l4J3K5o8N5k7j8M6r3J05m4j2Ql6K5PM4k4
2883A5o7K2NM8l5qM7m4J7K7n0P1j3m8PjJ9O0k9m4K8k5L5k1mqk5j0RPj2j5L7L8
$$ plain form
2652 3 -16 -3 61 -47 -57 42 25 1 18 3 -51 -62 -49 23 -22 30 35 31 25 33 1 -22 30 18 -25 -7 -65 -16 26 59 -39 -20
2684 -20 -29 -38 21 -21 2 7 -34 -51 21 -24 35 4 -45 41 32 -12 20 -7 9 20 -41 -13 3 -20 13 -17 9 28 -46 -6 -20 1
2716 1 -12 5 9 30 -13 9 18 -7 -13 11 35 33 -22 5 -6 36 38 4 9 -20 -14 42 -3 1 -19 37 -9 15 10 17 9 -11 39 0 17 -7
2752 -7 13 -5 -39 31 -31 -3 -20 -37 20 -5 -10 -62 0 14 3 -11 -90 -8 19 -15 -35 38 5 -48 3 -17 -13 -65 -6 -10 35 7
2784 7 -13 14 1 -3 3 34 -15 -4 -72 21 -47 0 -38 -38 52 -8 3 -2 55 24 62 32 10 -7 35 32 40 15 -14 23 6 -24 3 4
2818 4 36 15 -32 34 32 -8 4 -10 54 -47 7 40 6 -6 19 -16 9 23 -13 -7 -26 12 20 -13 -23 -39 -3 55 12 72 28 -65
2850 -65 22 18 15 54 -7 -24 -19 56 -5 26 -58 -11 -2 -11 43 9 22 47 -21 34 7 -11 35 -58 47 3 -9 -1 -37 -12 -5 39 15
2883 15 -52 -30 -25 23 -12 -20 27 -17 0 27 -23 48 35 -13 -6 -7 12 72 43 -1 27 2 37 16 12 4 -21 -31 -22 -15 -27 -42 -5 33
2917C3j02N6k6L9j2l1k8P3l1L4J8l1k7j0O4N6o2NLk2K2j6Oj9QrL3m3N4j7k6K0
2949A2l2RN5l9k2J8j5M1o8L7M0m5j7M4n3qRK1j0J8J6Pll8j6P7m3J3nqJ3l3Q6p1
2983a0QL2j5QL2l0Omn0qN2k9L7n4J3L2l3rJ7J6Ol8N9o7Nj2J5mJ7K2K5l5J5oMJ2
3019B9p0L2N5m5K7l9L9j0n9O6N8j17M4Ln2L3j2L9l7M4p3N7K1lj7k2k8MO3r3Q4
3050B1l8o6N4K2pL3j1k0ON2m9k8Pl1J00q2M0m7M1j3L7j9M2p3J9O6o5J03j33J8
3080b1N7ko7O5o1K0Nj4N2npl8J8j4n3RR3j6l7J7O2n5n7P5j6l3pQ6o1L0qj4KLJ
3115Ik6PJ8l3kK9JJ0l0Nl1L1L6k8J6l2l0J4OJ2m6M3K9oPk9K1LL0n1k2L8N6p7L7
3150A5j5J1M1m0OqJ7o3l5J7L4K2n8K7O5k4l1RoL0m2OM1rJ4%k9nj8M3k5K7K7Pl4
$$ plain form
2917 33 -69 -13 -39 0 -12 -43 -71 2 -29 5 23 -8 -35 -45 19 75 13 18 21 -1 21 5 11 -8 0 -9 24 -19 35 18 -8 12
2949 12 -20 -11 44 5 -17 1 -14 27 -41 -4 36 -9 -26 18 -35 -43 -34 -13 -23 -5 11 18 15 -23 -39 38 -5 8 3 -5 8 -25 61 -10
2983 -10 -2 30 15 23 55 25 31 27 -23 -31 21 -8 29 -25 -12 20 -13 -22 -5 11 17 -21 38 -29 -24 -36 -21 -25 -8 14 39 4 19 13 17 29
3019 29 -41 -9 46 1 28 -11 28 18 -41 25 83 -34 10 13 -39 -6 -18 21 -16 28 -45 12 33 30 13 -9 -37 -33 30 -63 21
3050 21 -17 -83 -29 -7 -14 19 8 -12 -6 46 -3 -31 -24 -55 45 -37 3 -44 -3 -16 21 2 44 -29 -10 56 -9 94 -39 -21
3080 -21 36 34 -33 32 -29 -9 -4 -18 34 29 22 -16 2 -12 -65 -56 37 21 -16 1 63 8 -49 26 10 -23 -30 56 -5 25 17 3 5 8 9
3115 9 -17 -10 8 -25 -27 2 3 13 -17 -12 -43 -12 24 -4 12 -20 -50 -36 -30 -18 -64 -21 8 2 9 -20 1 4 34 -17 -39 -1 55 -22 15
3150 15 0 11 52 12 18 10 27 -36 -71 -54 -20 2 -56 -29 36 12 -19 -10 -16 14 -28 -22 19 10 24 24 -5 -10 -28 15 -10 17 44 51 17
3185A7Kj0L5l1N3n0kJ5o8P8k0o1L0j9N0j7k5P5k5j2O4q0J0j8J4mrnoJ9n7N0jO7
3219E9n3k8jM7k7j8k7J23j4j09M4j0Q4Oj06N9j7KK1p6K4k0J1K5k4rK7oL2%J2l1
3251@Kk8K4l8L6J1j3l2j1K7N2No0M2pl5M6kL7j9o5J7K1NK5k8n9K5L8Mrj3J4l8
3285b6N5j5k6N8m5Ok5J1K1n5R3k9l1P9j2k3l8rlPk8K8l1M8N1r4N7k2J0p1O0o4
3317f3P5Ln2Q8p0P2l6m2N1mj8K2n7N9n3L2J1j3J6j6l0L6k8jj5P8o6O9j11N6Pj2
3349a2K5nJ3rl8J8j0L6mk1J7n5M9k2M1MmJ6j3l1M2l8J4Jk1l3K9N2n1lJ7j5J5M7
3383E1r2L7qK5j6k6j1J4mK7kM5r1P5n7pN2j4lK3ql6J7M5j0L1j8p5M2j1K1K8q8
3416d4L6M3pjq6P5k3klJ0l2J2O3p1Jj1NO9o2L3MjK3m7Q0n2m0l0R2q3N1m0L1j1
$$ plain form
3185 17 19 9 44 13 66 16 14 29 -39 39 19 -42 -12 -31 19 2 -23 52 27 15 79 -1 9 -9 5 1 -8 -13 -19 0 -57 -7 -8 59
3219 59 6 -22 -23 24 -3 -21 -48 75 61 -48 -4 -14 70 76 -30 29 12 14 35 -41 -17 -37 -26 -1 -25 -34 -7 -13 19 19 31 0
3251 0 2 -26 -2 -40 -4 7 -6 -38 -49 -22 30 35 -25 17 10 -25 21 19 56 37 -28 -11 10 15 40 12 -47 -22 16 20 11 -2 12 -26
3285 -26 29 14 -12 46 1 7 -18 -7 14 -41 52 23 -8 71 59 36 -2 -11 -14 -7 -35 -7 -38 10 61 -33 24 2 12 -59 1 -63
3317 -63 12 15 -37 51 -19 53 17 -25 26 22 4 26 -31 28 -25 7 18 5 21 5 -25 11 -17 -18 -33 45 -21 48 -63 -7 0 -12
3349 -12 13 8 21 12 -26 -8 -18 18 14 -7 10 -45 4 -18 23 27 23 39 26 -5 37 -1 13 14 -7 -40 -11 41 -10 -13 4 -11 4 51
3383 51 -41 -4 -12 13 -3 -29 -40 -26 -30 -3 -5 40 -51 24 -33 -40 12 -2 -5 18 10 -26 -9 36 26 57 39 -36 6 -5 16 44 -44
3416 -44 -8 35 28 27 -59 16 -7 -9 -12 -2 -34 -22 41 -30 -29 -40 -35 34 -28 5 9 8 31 -16 64 12 -28 -58 34 -49 2 -38 -7 -18
3450a8L3j0l6K2O9l4k1L5l5oj9ol0M6QK4j4n1O7M0j33K8j0OL7Ojm2mR6j0l3m6
3483d2J8M9K3l3QK1k5lk9N8nm2m3R8r6M7L8n6M1ln1O3l6J5k7j7N6ql8j1K1m2N4
3516Ck2M5n6n1O6rK3j9K7J9o4M7m2O1k3L0j2j2m3P7l5OJ5l2L2k4J4j9j1MJ3l7
3548b9Q2o9N1m7M3K1k4l7K8pKo5M1l9N1K4l1O4r2N9p4Q6l3mj1k0O0k1jj9N3o3
3580b1J5j8%K6M6n5%K7Rk6L1j2k9%j5j3N7l6K0m2qK1K1k4K0L9Rp2N3l1LJ6mj4
3614gM5kj7L9n7J6l0J8k3l7Q9p6Pj7L9K6J0J0m6M9m2k4M2k6k1L3%J4l0%K6rj6
3647a7O4q4J5K0j0J1J4J0j8OL4q9L0K9o2N1L3q3J0O1MPk0j00J20mn2J4o7rP6N9
3679E3m1l3J4J1pRJ6l6Jj5l2N3P7r1J9L6nl2J7J4l3L9k5J9p7M9J1j0l5J7L1mM
$$ plain form
3450 -18 15 5 -31 -9 60 26 5 40 5 -1 -20 -26 -56 -10 -2 22 8 -43 24 64 -69 -41 -51 -45 -8 -2 -3 -45 -49 47 37 4 -42
3483 -42 -24 25 48 15 23 44 19 16 -13 45 40 -2 -45 53 -43 4 42 -14 27 24 -27 36 0 15 -12 -29 27 19 -19 -30 -9 -51 3
3516 3 -19 26 -30 -81 -15 -24 -1 -20 7 26 -38 9 -33 28 5 35 23 11 -32 45 10 16 31 -1 31 7 21 2 -9 -5 8 -29
3548 -29 53 -16 35 -12 31 52 28 -9 19 12 14 -51 -10 -49 2 26 -5 59 -33 26 -48 38 5 1 -10 -30 30 9 8 -11 42 -21
3580 -21 -6 -24 -24 2 48 -7 -7 20 29 3 34 22 -7 -7 -22 -35 22 -14 6 -36 -44 -23 -2 -26 -6 33 42 -30 23 -8 -5 11 7 -7
3614 -7 38 36 19 58 1 17 -13 5 -18 -55 34 -42 -35 -52 -13 13 23 33 -13 36 -6 -30 12 -14 -35 -2 -2 12 -18 -18 8 -1 -17
3647 -17 47 -37 -22 -2 -12 -1 13 23 5 11 45 -44 -14 15 -47 4 37 -46 -36 25 29 36 16 -84 36 32 -20 -6 -73 -82 -6 53
3679 53 12 -21 -7 4 -3 6 22 -14 -13 -28 -60 -7 70 -21 -2 34 29 -3 14 28 -5 34 9 28 -49 0 11 1 -34 -17 14 10 14
3712A4m1J2L7m8L2J4K0m4l8M8n9Q1l6j2K0j5l1JN0K0Nml6N3n0j1k5M0Rqk3j8P1
3745B8l5k7O7J1k2j6J1K6l7j8K2Ok3M6n5K6n2R8j00M6J4j4j5JM8j7o2J7qJ9JJ8
3777Dj4l9K0K9K1j8M2q0R6m1jM7l7j0n9N6J7j5p2O3l8N6L4j04QN5m7O5o3L8j4
3808akOk0k5L9L6l5oKK9m8j1O7q6P7ol4l4N3kM9m4j0P6j31K2J0k2Q7Np0Mj9k0
3842f4M9M5o0P9p9j6jN6O9o7p1R8l2kK5j0k3m4O6J4m6k6K2J4K5l8N9k8Nm2N2k1
3874HOJ6j3n4j8P2N1k9m8l6M8k4K9q0M0M6o0K0K2L2k6lM2o6M3l5KO7o2O2Mr9M0
3907cK9N1j07QJ9J2k6L3k1JK9m9L8n1L9j5knNK4k8K7Oj8k2N4J9qm9Kl8J0M4m1
3941c3N2p2K4K1QPL8o6J9K1l8J8QN1m5L5k4k6R0j03M7k8J6k4J9L4l7l2l9P4Kj2
$$ plain form
3712 14 -27 -15 22 -26 6 20 40 -4 -42 6 -53 28 -8 -20 0 -15 -46 -45 5 25 30 26 -10 43 -7 -18 -43 -3 6 -2 -25 -43 28
3745 28 -7 -34 33 44 22 6 17 43 6 -12 10 16 -7 39 -16 10 -42 56 -44 2 16 2 -13 -12 36 19 -43 -26 -34 -15 -14 4
3777 4 -10 -49 -29 0 21 3 45 -35 61 20 19 66 29 19 -40 16 33 18 -54 9 -29 27 61 -43 -35 20 -27 38 -25 13 -1
3808 -1 -3 3 -17 -42 -3 33 -2 -8 -6 23 -25 -36 31 -55 22 16 -18 -52 1 -1 48 4 -6 70 -61 -39 -29 -51 36 41 -29 -25 -44 -64
3842 -64 -15 30 -30 49 -30 -46 -47 9 78 11 -60 38 6 4 29 19 -4 -48 18 32 -14 -40 -18 -4 21 -17 42 14 19 -23 29 8
3874 8 14 30 17 -37 -55 17 68 39 -9 -45 3 -21 8 -72 -32 14 -46 -26 -4 28 2 -1 41 -25 18 -17 -15 52 -10 52 56 -43 -3
3907 -3 26 77 -30 -22 -3 9 -17 16 -5 -4 25 -24 14 -37 2 -13 -15 -20 -15 9 -19 8 14 -4 -26 28 47 39 -10 -8 -46 -36 8 -33
3941 -33 19 -53 -29 -8 0 7 45 -21 -2 19 -19 -1 7 58 13 48 24 -2 88 -15 32 4 20 -4 15 49 12 -20 -59 15 17 5
3973El3J6j3N7l8j1m0R2Mp6M6j6j4K8m1PK5L5p5P1k6m3mJ7J7mj3K6N5q8O1j1m2
4006b6J3M6q9J14o3j6k6M5PM3m9j7l8J1rN9j1l3L8l4rO7L7p6o2M8L0Ml4J6j4O4
4038C6ql5rL6OL3j01P2k7M9n8J9Ol1l2O1n2M6ok0loJ6j5K7K1j4JOj6K1j0Kl4O8
4073D9k8n0N3Lk1o0J09p4JQlnlN6K5o1m1P2o0Q6n9m5OK0j3qkLJ2nO8o3N4l2K7
4108A9l6N5k4J1l3j5M5o9M3rK5m5N4l5K4q1L3P2l3L2p5O6m4Q4o1l8KN4o7R6m5
4139EM9j07R9j0q3O3j1m4oJ4M8no7P0J3l4l1L6l5J4l0P6q8J01n4Koj9Mj8N3k3
4171b4j8mNM0k3L3KMm3L6n0P0l5PL0q9R6l0o0N2j9k0K1L1m8K1k4K6l6j7M7L5o
4204A0l1n5M0J0N3n1M7k3l6P7k8k9K2l6M5j8J3m4Q1l0k6J9mp0N6n8O4k0l3M3J
$$ plain form
3973 5 -28 -12 -25 32 -6 -17 -57 35 39 -37 9 -7 -21 7 -34 -27 -2 33 -42 29 3 -40 -44 -27 -10 -14 -27 -1 54 -34 27 16 -26
4006 -26 -13 33 -56 58 -5 -21 -47 -2 5 48 -1 -18 -56 -45 -54 5 -6 -39 -1 -35 -44 23 60 -16 -78 -30 0 4 -30 -14 -28 36
4038 36 28 -7 -16 20 26 59 -42 30 3 52 -6 13 19 -12 -44 17 -35 11 5 -15 -18 -24 -8 -23 4 25 11 12 18 2 23 13 15 -19 49
4073 49 21 -29 24 27 6 -54 55 -19 -18 -10 -13 -18 -21 35 60 -1 -42 30 -30 56 -3 -48 -42 -22 -35 -43 -45 -42 -30 -35 33 -30 24 -8 19
4108 19 -17 38 14 25 -8 -23 22 -47 -4 -13 12 -33 21 -14 10 -71 -38 34 1 33 -42 24 -20 64 3 -35 -33 21 -46 50 5
4139 5 54 -53 46 36 -47 16 5 -39 -45 -31 17 12 -55 15 28 -6 -37 -1 -36 -22 -52 24 -64 37 -17 -15 -21 -40 -36 -54 -1 -24
4171 -24 -42 -46 -41 -1 -24 9 11 15 -28 8 -42 28 -7 0 30 -59 37 7 -53 -1 -20 -40 -19 12 -36 -15 -39 -13 -49 -66 -19 16 10
4204 10 -21 -76 -36 -26 27 -24 23 0 -36 41 13 -16 6 -30 15 -3 10 -34 47 17 -9 10 6 -64 -8 -66 -2 -22 -55 -12 -11
4235a1K6L9q2J2k0N2l2Llk5M3K9j5l5L8j9k0K3j4J5qMk3N6p0K0nK8k2l6O6m1%
4268b7J9o0P9n0L1pj2jK7l5K4j1J3N6n0J5kK0n8N3l6%O1n5jqLM9K1o4J7J6m7Q
4302a2J4J4j4k8j0M8n1KM8j6n5L8J9K5m1l9K9L6j3oj8L7l5lM0M4mm0n0K7M5k4
4334GRl4L5M8r0K8J6j4J9KPo3M6j09J11K2jn1m9P3k4P4r0M6j8j5O3j8m2N5m4k8
4366b9jN2l5K5j0L2j0k6K7lJ3Oorpm7L1m1M6p0J24m2Kp4M4kL7j8K6q1N0l4jL5
4400DrK5m9K2l0P3o9K8j2M5l3l0K8J6k7mM9kJ4k7m0P3l7k4O7n1J6j9l1M6jL5j7
4433B9o0rk8k6R0KRMl9qOj5O8j2p7N1J6l5M7k8K7oO0n5j3Ql0JK2kO0m6m0JJ5%
4469a3mKmrj4O5k8k9L8k8m0M1M1m1K6qj6j1K9nJ6K2j1o0oO6j6L3ql3J6j8Ml4L1
$$ plain form
4235 -11 15 54 -28 -16 -36 16 -16 -13 -16 -41 2 31 16 -19 19 0 -20 3 -11 4 -4 0 -23 33 -37 -17 -22 6 -16 -52 14 -27 -27
4268 -27 -8 -68 11 -39 -8 -15 -27 -28 -1 -36 -12 -23 -10 46 -4 11 9 29 -29 24 -12 -12 49 -6 -7 -15 -12 37 58 -6 11 27 -20 -12
4302 -12 2 16 2 -26 -36 12 -39 -37 11 -5 -60 -22 -3 22 -19 -58 -29 7 -6 -12 -30 7 -28 -31 9 53 49 9 -41 -14 31 7
4334 7 16 -18 17 65 -25 3 19 5 24 26 33 -30 16 -93 18 40 39 -12 -61 12 -12 62 -28 18 0 -15 48 30 -12 43 -1 -29
4366 -29 -30 22 -13 12 2 34 24 -2 25 22 35 41 35 26 19 -28 3 -38 8 -62 62 20 22 -52 -8 -10 27 9 35 -46 4 -30 -31 4
4400 4 -5 20 -29 -7 -37 36 -33 -5 -17 28 -5 -35 -7 9 -18 -22 27 25 39 12 -28 45 8 -16 51 0 16 -3 -34 12 11 46 29
4433 29 -31 -40 -68 -94 -4 -2 7 11 -28 -36 -30 -45 23 11 -66 -15 1 -34 13 -15 12 6 66 11 -2 6 -24 -23 -1 -3 57 11 -29 -28 -13 -13
4469 -13 -17 -15 -19 -28 -42 23 -5 -34 4 -24 -64 -23 18 -23 3 -5 -21 -32 -3 -8 8 30 19 -41 -47 19 3 36 28 -5 11 -7 -3 -37 -6
4504fMJ4L2l6k5J5l6P9l7j0J9n4N5k4l1P1rn0M3k5L1ok3k7Q8m1j9J2jlj2P4o2
4537@j9J4kj1J4L2j6l2j2L1l9J6L2K4r4M2Nj6N7k5J4n8P0k8m2L9j8LJ7Jm2L7O5
4570E9p6j8O3n5J5J7j4O2m5QJ3NjlJ9m2j3Ql7N2Kl8L1k3OK9l1j2M5m3K8mk0lj6
4605c2K0N9r1J1MqK7jJ3nm4O3l8O5o5J3J8l8K8k7nO0j9L4J6p0J0P7j17K9N4n7
4637a6j8J8nJ9J8%l0L3o5Q2p6K9oM8m7%k4J5J4j9K6l0N0nJ1o7lM1qkMK4nNl7K0
4673fM4l3jRl5ON8m4J5Mn0J4j7M5qk0J1j1m6O9n3J7KNj5L3N4p9K8l4J3N3k8L1
4707C1o2K0k1K8Km2Q9%k5j0k7k8J17o7k7M9l0N8p0KOL1Mo7J4K8m8M7k9L9j1k5
4739b4k7j4M2M3n4L2k5R4p1Jk8L2o3N4L0l7O8m7m7N3K9n9L0l4rL8J9J1j05Q0n2
$$ plain form
4504 -6 -2 12 44 8 -17 -2 -38 41 4 -6 13 -41 14 -10 -41 30 21 -29 14 -11 20 14 -9 -36 52 11 -8 4 3 0 -12 62 0
4537 0 -19 -5 -7 -18 -4 28 12 -20 -32 -1 -40 -24 8 32 -62 -20 -15 -31 26 1 15 -43 27 -1 -43 -4 -22 -19 -2 -1 -43 -6 59
4570 59 -17 -35 28 -27 -12 5 -9 53 8 16 29 34 33 30 49 7 -6 2 -35 17 19 -19 12 -11 -5 24 -7 -19 26 -17 11 7 -13 -16 -32
4605 -32 -12 47 -44 -33 -29 -37 -10 -11 2 -3 -47 16 -22 43 -22 -9 9 -29 -1 -28 -33 27 8 42 58 -12 -2 75 -42 -13 41 -16
4637 -16 -34 -16 -21 -2 16 16 -14 19 -46 36 -40 -11 -17 31 -16 -16 -40 -25 -11 -30 -4 -34 16 11 22 -45 -48 -7 -15 -17 -13 11 6 11 -26 -6
4673 -6 38 5 4 13 -22 -16 42 -2 13 17 -33 -19 -36 9 1 -19 -8 -19 -65 4 -49 -32 -30 -25 -40 -7 47 -32 -4 -38 -25 28 0 31
4707 31 -31 -11 -32 -4 -2 -44 45 45 20 10 -17 -45 72 5 -22 27 -3 55 -15 -13 -7 24 28 -39 -25 3 -45 2 -27 12 1 -24
4739 -24 -51 -65 -23 20 -34 -2 -27 67 -4 -3 -31 1 -62 -8 22 -15 53 6 -41 12 41 -18 12 -22 -31 7 26 37 -68 12 -40
4770d0L5J2L3l8k2OK4L4l7l6j2O0k4M7q0Q7m8j7L6lo1R3m5m7P9j4l2J2k2L8k3
4801eM6l0J0j5j8oM8k0k8kJ2J3j5mQML9Lk7qp2N7j3N1n5L4Nk5k4L2O5k9l2J1J1
4836B1J6K0j2J3o4O2m3K1l2j7q3J05l2Pj2mJ8K1l7mJ1O2l5K0J4k4k5j9M4l9N0
4867B3j6k0K9k5O0o6N1l2J8Np7O3m0L8l3%J5M6p4N8j6o2M1N6qj7m7L2M1r4L7Q7
4899G3m0j3k3pRq3P5k3L1M0Mm6ll7%L6O5n3k4J6jl2J8Q6j05P2J1qp6j9M6k0M8
4932A7k3l0L2J9Kj4%K0nl0L8m3k3L4n6L8nL1nL5n4j4J8M9J8m2j2J2j7J9j4K5j7
4965Cj9K9K8m6K0Jl7lm5Q0m2M5l2j4m3N1J9jpK5K8j3r4O5j2m6K6M2j8K2n3%J5
4998b6L7l9mL7qL3o3N6J2j9m0L2j2M0l2j3J9n1L3nj9P2p9O2l5l7O4j9qm9L5L0
$$ plain form
4770 -40 -5 7 40 2 -20 -14 10 44 7 -29 -41 19 -5 42 -38 49 1 -16 20 17 -44 49 4 -43 36 22 -10 2 -20 18 -5
4801 -5 41 11 21 6 -12 -18 30 10 -18 -20 -8 5 -10 -14 -6 -2 37 40 13 5 -67 -10 -23 28 -27 7 12 -13 -37 -5 60 31 -1 10 21
4836 21 37 57 45 58 -6 56 13 34 2 -15 -98 7 -25 -18 -30 -34 -16 5 -32 -36 -25 37 2 22 36 12 -13 -32 12 -27 23
4867 23 7 -13 16 -9 51 -15 36 4 22 27 -50 13 -27 11 -22 -22 -7 39 -35 23 7 -55 -14 42 34 17 -30 2 43 -51 -14 73
4899 73 33 20 -3 -10 -1 -84 -9 -32 -1 39 43 -3 -6 -43 -43 -7 58 5 -19 -3 -4 -36 -18 68 -37 35 46 38 -38 -57 -11 -31 17
4932 17 -6 -36 -4 15 17 3 3 23 18 -12 26 -17 -40 -6 -62 -24 -29 2 -3 32 -22 -36 -18 31 49 7 -5 7 -10 9 -5 20 3
4965 3 -16 13 41 -5 15 16 -21 -24 -69 11 -31 14 -18 -32 -75 -24 -5 -6 -13 12 40 27 -67 -2 -14 -60 -34 8 -10 12 -41 -41 -26
4998 -26 11 -28 -32 5 -3 30 -33 23 35 16 -24 8 -4 36 4 -9 10 -41 -8 -13 -32 40 -39 23 -12 -49 15 -4 -12 -61 -26 4
5030Dl0J8j6loN2k3K8%q4O4p3J02%o6K1%N0n0K9J0k8Mj3L0j3n0J05o9PK3j5L2
5063D0k7j9L6M4n1%o8M6l1QJj3R8p5J7MJn3M6J7j8n2N5l3R0o7j0L1j6K4p2J45
5095I8j31K1N1M4j29M7J7J4J2K4q9M6k7l9L6kj1lL1k7km0P8j8Jpq7R4l6k2R0k4
5127A0l3l2K8N8k7oj9M8kLk9J0M3n8N9m1l0LL5m4J8n5O7l6Q7j12K2L8o5N5K1n7
5159d1J8M3K3o7K2j6m4J43q3J9KL0j6mj6m4oM7M6q1PJ9m4J06l1k7PqJ5rPk4qm0
5193e5Q9n1O1j9k8Mn6Q0p0nJ5pL7L1on0M3M2o7K7j5k6M0k7M8l3L0l1JQ3o4k4K4
5226B1m7Q7n7J9Lk7M7Kr2M0j3K6j0l7N9M4l3k6l6k2L6M4q1K4K2k6K4N7j21Q2l6
5257b7k3N4QL0l7J5M2K2q7L2j7n8L6M6k2ln0oR0q8Q0n9R9jq4L0n3Oj3QK4pJ5P
$$ plain form
5030 4 -26 -8 -24 -27 -33 19 -4 24 24 -60 4 -69 33 33 -33 -12 -12 38 -12 17 27 -1 3 -10 20 7 -43 62 -7 0 23 8 40
5063 40 13 -6 30 74 23 23 -45 1 -30 -22 -21 -34 64 -11 6 10 11 -42 4 21 3 -49 6 -27 63 -4 -14 17 1 25 -47 98
5095 98 -33 -12 39 83 -46 1 18 32 44 68 -21 25 -2 -41 -5 -7 -18 -21 10 -17 -19 -59 19 1 2 -5 -92 2 -34 -56 34 10
5127 10 -23 -55 -27 31 4 -2 -21 27 25 28 -1 9 52 -6 53 12 -18 -15 20 -24 -6 -61 6 -30 57 -55 -33 5 -60 -5 16 -41
5159 -41 -23 20 43 -24 -2 -18 -62 81 -2 17 19 49 33 29 13 -31 -37 10 56 -25 -18 1 -43 63 32 5 12 4 19 10 17 -7 -15 -55
5193 -55 34 -17 44 25 -3 1 -55 25 -45 -50 -35 -42 -5 26 20 -30 13 55 -12 15 0 -26 14 -13 35 2 32 1 2 85 21 -3 21
5226 21 -26 61 4 23 26 -1 46 48 -44 -4 -17 9 -1 -38 21 65 32 6 -30 -52 -16 28 -53 -29 -7 -33 -9 48 -73 9 -27
5257 -27 -50 4 12 42 5 20 62 84 -3 29 12 -46 -10 36 14 11 -39 -45 45 -43 37 -22 77 76 -8 22 -31 -25 -38 -30 -6 -13 2 9
5291Il0k9K8k6l2Q2j9M7k8om3lJ9N6Kmm6L0j2l7N5M9q1K0N8k6j1l7k6ON8M9p8
5324fo9L6P4j2k0L3l5j9l0O0j5J9j7k5J7J8r7P5K2QPJ7m5j7LJ6K1J9J1o4m0N9
5356DmMM0l1j7o8N0K2j7J1J0k7N7n6J2J5O0q5m5M9N3K3n3o5L1RM7n6L1k1J9J3
5388A5Np4R6p4M5p3R0k4j7J8m6L1lJ8k9K2N7q3Q2m0Mj8jM5p2P7m4k1L2ro0M7O
5421BM9K9q2J2k7N2j0lq1Q8Jj4k0k4K5NK7k4j3l0M4Rk4k7Q4o1j8O2q1O2mj2lN2
5455D5q3l5P0NJ8p3N8l4RJM4j4o1K7O0m0NJ7M1j20P7m3PP8r2O5l8Lkj2J1jk7N8
5489B4j8rK3L7o3l3K0L7J5q0MO1kk7J1pL0p4M4L0J1k3N5q2K2L9o3N7p4K3M4j3
5521A9Jlk2J5n0J14j01O2n2j9L8l6J9K9Oj4M4j8J5n9M9np6N9Ll5M2n8N3K1p7J3
$$ plain form
5291 9 -21 -50 -22 -48 -80 2 -17 30 2 -4 -47 -50 -31 25 27 23 -23 7 -5 -42 13 62 -19 1 59 33 22 -15 -41 -35 23 72 -6
5324 -6 -75 -39 35 23 3 36 1 -18 -48 12 -3 16 -1 -26 -9 9 -88 -13 9 17 24 41 -4 -21 -18 -2 19 38 49 -15 -55 4
5356 4 0 4 44 13 -4 -72 -22 0 -17 -6 4 -23 34 -22 -10 5 65 -20 -65 -16 37 60 7 -58 -27 -18 29 -27 4 -17 2 15
5388 15 20 -54 42 -32 13 -60 30 6 -11 7 -39 -8 -11 7 -22 0 57 -26 56 16 20 2 1 46 -26 51 7 -14 18 9 -51 -4 2
5421 2 51 80 -2 10 -17 35 25 22 -59 29 30 16 -4 -28 -3 2 29 5 -8 -38 6 15 -9 -36 48 -13 -31 31 -50 12 8 -4 -7 45
5455 45 -38 -73 -3 2 20 -53 5 -29 -20 -19 25 11 -50 -23 37 -3 2 19 60 -60 17 -26 -19 59 -33 32 -6 -3 -5 -17 -6 -7 -34 24
5489 24 6 -3 20 57 -6 -39 -19 18 33 -47 -43 18 16 -11 0 -7 23 -51 -7 23 34 11 66 -16 6 45 -18 39 -35 -12 32 19
5521 19 20 17 -5 10 -40 74 -27 35 -17 -36 2 -34 -15 14 20 6 50 32 47 -12 37 32 -44 15 18 -17 25 -33 20 41 -36 -23
5553b3OM5n0K6lJ9J3k5J0nJ1J3Km3j3J3k0M4o3P1l6k7pP3p4N4nJ6m5lN5k5J3R
5587B6l1J4k9J00n5m5N4j9oJ9M3m5q9J20m9K9l6K4K4o8mJ7mmJ2j8kJ7J2knk0K0
5620@m4L8K4J3k0K5p2N9n1lL4o7M6kL7j4kJ2m5J12j11%O0p6N7J8l6J8mJ9k7Oj8
5653a4kK3Pl8P4o5KK0jl8J9K1J8J5l9J2L1n5N1m3l1M4J1j6k9N4l1m7K6N4r9K3
5685d3Q4m3O2r9L1M0l6m6K5O0lnp0rjM9m5lO9k1L6o1K5mRK8j7l2k2J4L0qj6NM
5720a3N5o5l5O9j2M0j6k4k1NM0o5L5K8n5Q3k6n6J9RM3pn0O5o0J7k5K9OrJ6o6J6
5753c0kmN1K5l7m4N9l9J5m0M1mQ1j06QJ2K3Kk3J7l6L8O7j7l9k3j7Q6k7m8rj8j5
5786e3J8qP9p0M8l4j9K9K5J0M4n2J9Mk0l4J2mj8P1mo5Ko3M2Q4m2J7qJ0l2L1K3
$$ plain form
5553 -23 -17 28 -22 4 1 20 33 8 18 13 24 37 39 -4 -17 -4 -24 20 -43 28 -8 -35 -42 31 -43 11 6 22 -23 -26 29 4 17 26
5587 26 -5 9 -20 80 25 -20 34 15 9 28 71 26 -63 57 8 37 1 25 49 -19 -23 -6 -10 -14 -2 -20 -22 -5 7 5 0 -20 0
5620 0 -44 -6 18 31 11 36 -36 23 -28 -31 3 -64 -18 -20 17 3 1 13 -32 80 -31 -31 29 -47 10 28 -8 10 6 25 -2 4 -14
5653 -14 -16 7 14 -24 50 -15 -13 7 6 -32 -13 8 26 41 2 14 45 -10 41 -2 -33 11 22 6 -23 31 0 -47 -21 33 -66 -43
5685 -43 41 -2 60 -39 -8 32 -4 -50 -25 35 32 27 -43 -52 -53 -4 -49 -52 17 -4 32 -29 -4 -8 1 29 12 -20 -42 -28 2 -6 -22 -17 -13
5720 -13 42 -23 -58 11 -1 39 23 -1 -22 -17 23 -42 -7 21 -34 49 23 -33 -14 -5 38 31 -19 46 -14 3 -22 7 13 4 20 -46 -30
5753 -30 -32 -36 15 40 3 -41 18 -21 -6 -46 -5 -9 72 -34 -26 -14 9 11 -12 5 -31 7 74 57 18 -5 -22 64 37 -11 -20 -38 -53
5786 -53 -35 -43 36 -34 14 -20 -39 -10 15 25 69 17 36 40 20 -14 -2 -6 -24 47 43 -22 -20 -83 -41 43 1 18 10 20 -12 19 42
5819D2o3K4o1Q7MJ1n6lj4j1L5k3L2L5r1P1m0j1K1k0K0m2M3M2r3P1m7JR6r8J8O1
5851D1l8rM6p2J04o6m2O5k3j6L0J3n4k3J2O3n3N7Op4M0l8k4L5OL9op7P0j0nOm
5884aj5Pj9M0jpk3k0O1k5k0qM1M5l3j5K3M2p0j7M7j5j6l3K9k7J04r1Nm7O4M2m8
5917al7kNNM4m0k1O3N8j13J2L4%J2l0pRL7n0L7k6Qm0M9Nm1M8l0L5k9l8J3M6M0
5951E5m9rj8L2n9L3K1L1p2K8j0K3Ol1PoJk3J4N2jm9M5l5N9o8jL6J9m8NM6Nlk0
5986A6OK0j2p5k6O1J2O2k0nm8QK2q4N0J5L0n2K3j6jK3j4Pk2JN1m4L3o1L3%lj4
6020b4k1M1K4p1Q8j05N2N7n3j5K9K2m5J9JJ1Pl3Ok0LnJ9N8j1p1Q3l8k3l0P1pm7
6053b8J7j0N9r4Q5o3M4M7p5J7L0o4K5ok0J0L6j0M1l9PJ0Rl9M1j13R3nM6p1L6m0
$$ plain form
5819 42 -21 3 -58 29 33 44 -12 -15 -29 -40 -5 -28 4 39 -52 19 -21 -32 -11 -31 -11 -53 -10 32 -61 10 -37 -36 60 -38 -20 41
5851 41 3 -6 40 -32 72 6 -36 29 6 -10 20 33 -21 -44 -32 31 -22 35 41 -33 7 -31 -55 -20 -14 25 19 -58 12 2 -3 3 -1
5884 -1 -16 -9 -28 12 11 4 -19 -39 22 -3 -23 -31 10 55 22 7 30 72 2 -15 32 17 1 -32 -3 -30 74 -17 -12 -59 5 47 -1
5917 -1 -38 -40 -35 -30 14 -26 -47 16 74 -39 -27 7 7 19 -11 -18 -9 28 -22 15 -11 -3 -43 6 11 -30 18 -12 23 -6 -44 -31 15 55
5951 55 6 -3 -21 11 -48 -15 6 37 -35 -7 -17 6 12 -19 -12 -18 -17 -40 -26 26 25 -24 21 -14 45 -23 -24 12 31 -17 -12 34 39 36 16
5986 16 22 42 30 -45 -71 -10 2 64 44 39 -9 -1 21 -63 -13 2 32 -20 3 -13 -14 9 -5 2 -20 -19 32 -12 21 -40 -7 -7 -10 -24
6020 -24 -45 -4 20 -51 37 -68 -16 41 -12 -27 2 24 -21 -2 -1 10 17 -16 -10 -30 -27 -32 -13 45 34 -37 46 8 -15 -45 26 19 -28
6053 -28 -11 -21 38 -56 29 -34 10 57 -18 -1 29 -35 -10 -16 -36 -26 10 0 41 2 9 19 28 -11 30 -83 10 5 51 -20 16 -24
6085b4K3L3n1n0Q0o5K7O4o0O5j9%m8j2Ol5R3k7Nj9K4M5o3j9J1M4k0l6MmN0L3o5
6118a0J3mj1N0Jm6K3l1Pl3L4Lnk1K9k4JL6Np4N0Ql1L7l7oO1n3O5j17Q8j4J5k7
6152a8k2N1%n0P0n4J4l0J4QmL9l5K3k3L7l4jJ2Oj5l0N6k3pK0Pj2k7%J6J2L5j8
6186A7L7K3o5k1QK0m0m4O1N1n4j7J7L3l6J2K8J1Mn0k1N2l8K1j4K2rL0j00M0L2
6217A0m7K5Lqk1L3K2K9j0l4K7n8L3m2O6k2L5Nk4J8k7oO8m3n0P8j25L5kN4k4mP4
6250F8j07M8j3m9M5%mkL1j6J1l0j9O4lq6J5L5J3J2m7L5L2K0p6K8oN0q2L9lJ7l8
6283a8k5K9k9K9l6P3L0n6rM1k5j3%j8P5p1j9N7k5qPk7N1k5N3m8k4J1K3pJ4M0n3
6316cj6lK8rKk0KN0j0J1j9k8kjL3k6M1jr9M7m7Q8j5Rlk9N5m4Nm0J2j0K7J3L3o3
$$ plain form
6085 -24 -1 32 -19 -69 11 -54 -27 37 -23 42 23 23 -25 -37 -31 -66 27 0 5 -14 10 55 -8 -27 -16 28 8 -28 -24 -28 22 55 -10
6118 -10 3 -1 -12 38 39 -7 16 -15 -8 -41 -7 -4 -9 -30 -1 -25 -24 12 17 -57 -7 1 -30 7 -30 -36 25 -28 37 -80 8 -6 9 -18
6152 -18 -40 11 11 -39 31 -23 -9 -39 -25 -17 -21 18 -17 6 -17 20 -14 -15 -3 3 -12 -42 14 -9 -16 4 11 -1 -28 -28 -12 0 35 17
6186 17 54 77 12 -9 -1 19 -21 -65 -4 47 -7 -24 -7 26 -10 2 30 41 45 -5 -26 26 -12 9 -5 17 8 38 -62 -22 10
6217 10 -37 -12 -9 -17 -38 -5 17 46 36 2 29 -29 4 -38 28 6 41 46 22 40 13 7 75 32 -18 60 -65 -30 -32 22 -2 -6 68
6250 68 -39 9 -4 -53 -8 -8 -12 -14 17 1 12 -18 -37 27 24 -62 -47 -12 1 13 -34 1 33 53 -23 5 -1 49 -33 6 3 20 -18
6283 -18 -43 -14 -43 -14 -50 23 53 -3 -12 29 4 -9 -9 -27 48 -23 -42 15 -10 -18 -11 -38 13 -12 41 -7 -31 -20 3 -4 10 50 -3
6316 -3 -19 -22 6 -3 -1 -21 -19 31 21 32 13 -15 -17 -18 15 -11 30 29 -70 -23 -70 18 3 12 9 -20 35 -9 -4 -44 -32 -42 -15 -2 31 -32
6352c2M5j4K0k7r0J22l9k7K1K1NJ07j37P5o0oL4qrl5K0J3l0LM1j3n4N9kn0L9J02
6384I4q5L8k7l3M2j6k6m1R2p6NKO3j9l5P1l7Ln2L4L8n4J2J4n3R0n9K6K1nj4q2
6416f9N5L6k2j2N3p0nR3q5j0P7q7Q1j24P9O5n7RJ5l8qJ6J3llL9q1O7NNrl2j4N0
6450B9l9K7n1lJ0l4K9K9K5k8qN1o6M1k3N4n9k3M9m5J0M7k5jN4m7J3k2mL7j7Jn2
6483d1M0nM0m1OM7l4J8j4ml8NLKJ7K9m3l7Q0n3mK9MOl5J8j2OK2qqk7Pn6M4kL4
6520elL7n8L9N0j06l3P1Jl9J4K4J3J9J3l1j6JL2k9m3L0M9l5rm1L4K4Ln1K0K1K4
6553B0LlKl7L4n8O4Lj0n4j7M2j7P3l4m4L9l9Q1m3Jj9L3o0O5j1M1r5P7nn1mP3l1
6587A9J0K6p4Nkk6j6K7L6m4l0L6JRL6J3k2ORk1J6J7J6k2k1l1M9j2kJ3QL7m5K3
$$ plain form
6352 -32 13 -1 19 -8 -98 24 -15 -42 -21 0 5 112 -25 50 -10 -16 18 10 1 -34 -14 -1 -31 -28 13 0 -54 5 3 -47 -8 94
6384 94 9 47 20 -13 29 13 -13 -54 38 -38 -33 -31 32 13 -22 49 12 15 -37 -3 35 -19 -7 7 -46 44 -15 11 32 27 13 -69
6416 -69 -14 22 0 -12 41 -29 -34 59 -26 -36 41 -46 35 -89 -10 55 -2 7 22 -16 -24 -8 5 2 -1 38 -43 24 29 34 25 -7 -21 29
6450 29 -10 17 -34 -37 -27 -61 -32 -3 22 -6 -14 37 -29 12 -11 43 -16 -39 10 -35 -25 22 -3 -4 50 3 16 -6 -10 27 10 11 -41
6483 -41 -1 -6 34 -7 -1 46 12 30 16 12 -26 -21 -18 -16 1 30 -13 -50 30 -23 -27 2 6 12 -23 -5 -17 -11 11 3 -5 -32 -25 -81 -37 -39 -5
6520 -5 -8 29 -29 10 60 -46 -79 -8 -7 -46 -32 -8 5 24 37 6 -10 -9 23 -6 -49 -19 30 -5 -14 -55 -21 3 6 -45 -25 -4 20
6553 20 23 20 22 -15 19 -39 25 28 18 -36 -53 -11 -28 45 11 -33 6 -33 48 5 6 -13 20 -40 25 14 55 -40 37 32 -19 -23 50 19
6587 19 29 55 -19 -14 -16 -42 -58 -31 5 -39 -69 -33 -32 -23 13 26 4 10 19 -2 14 31 47 25 4 -27 22 10 8 21 29 66 21 44
6621D4n7mK3k8K6k9NJ4L0j7Oo2M8NL8r6L2M2k8j4M5j4j6Nj0O6r3L4l5OL2N5o4
6654a1J8j7K2L0n2lJ7k9O6jn7oJ8k1K8l7N2jk8M7J6k1M1m6k5P2p9k1L4PpL3q2
6687d3O0l1N3k6n2L2K0m3P2q5P7Qn2N8o7L8jr5R7l8j2K5J1J8l9l0M3q8K9JM1k3
6719d2R0kl5K5n0J0on7K8L1L4n7pP2m3L0l8j0Lj2K9l0kN0K1k2jmJ8r2P5Kl3L2
6753GL5m3Ll7k2N2j0K3pKK1k9l2J7l4L0L5k4m8O8k1k0LJ6rJ3m3L9M9o7L7k8K0
6786dM6k3j3L4n8ML2n2O5Kk1orMPj1KK3K6k2m9M0q2L2M1J7Pj7k6OM8n9Qj2M2K1
6822D3m4KO7p5qL8k7L0n0M0p0N0RM4j4l4K7p1J8M5M3q4j3N5j4l5P2m8OpLKl0j1
6856d1L0M1k7j1N3l4K2jl9K1ll0L6l0J6J3p0P7k5L5k0J1l2J4m6J0J4KJ9J8n3P
$$ plain form
6621 44 -13 -17 6 -22 4 -25 -20 -6 24 7 13 -49 -1 4 42 -54 -22 20 -8 -22 23 9 -7 -2 -12 54 -39 -5 -40 -34 -2 53 -11
6654 -11 7 -10 12 42 -10 -13 4 -25 41 40 -17 -23 -5 -26 2 -35 17 16 -12 35 51 30 71 25 0 72 -7 -28 6 13 6 39 -43
6687 -43 17 -14 39 13 -39 -7 13 -30 42 -43 34 42 -10 48 -19 19 18 -77 20 -18 -30 -5 6 24 -15 -45 -2 -90 -61 -60 -19 -42
6719 -42 48 46 11 36 -14 -4 -10 -67 -39 -8 26 -31 -38 34 -9 21 -17 -27 -24 -36 -7 -37 -39 11 32 10 9 5 23 -69 6 8 -25 7
6753 7 42 -1 2 -35 -57 -5 -15 8 1 3 24 -5 -37 -20 -54 -24 11 -13 -61 7 -14 -34 -31 -15 -24 -11 -54 -15 34 -33 4 -24 -4
6786 -4 42 19 6 40 -18 -14 18 -34 31 33 12 6 -3 1 8 -3 -1 22 48 26 -23 17 -65 -33 8 25 32 15 -11 -5 43 -16 -8 -20 22 43
6822 43 -1 1 68 -7 -15 23 -4 26 -24 16 -54 -4 5 49 35 1 28 -43 -25 20 63 -21 -34 21 7 -28 44 -4 2 -5 -2 0 -30 -41
6856 -41 -11 30 3 -8 45 11 33 32 -7 14 11 -19 17 -13 3 16 -54 23 -2 33 13 24 -8 6 -40 -30 -16 -14 5 23 -30 -23
6888b3L1J1k6K7j7k5L4k8M4k6l4k0O5k9l9Q2l6Mj1K4Rm1k9J04o1k0J2rL3n1O3
6919A8O4k0n2Pmj5j8J1j2J2lN1o1%PP0r0OJJ1K5p2L6M7n2N9jo6M7j0N1n9P7nl1
6954B9j2O7j13J13o6j0j9K0j0J1l3M2o9L7O8o2Nj2N2p6L2K2j8k0J6m2M0K2j9J1
6984Fk7O7l4l9M2n9M9lJ4M1J7o6m1O4j3J4k7o1Q8j1jj1J9j5nK0Mo9N7k0pj1JM5
7018B8j9J8n6j7M2K6j9l5Ok1K0O1p3P0j9Rj0k2K1M0l4j5L6k8j6M2m3M3j1rJ5l5
7050eJ6J7l8j7N1m5K1m9K9L1l0k8L6j3K6JkL6l6k9OnM0j7J9m0N4k1rkL5L0k7m2
7084go6J03j2pP4n5n0JM1j7L1j5J9m0Pk6O7q2j9N3m4J1K2K8n6k4O9j3j8MN4j6
7116A7oj6n6L1K0l1RK0O0k1J2k2Nj0l4m7O7ln5J8M9k3L5k0j7K7p3L2M7K7Mn8n
$$ plain form
6888 -23 8 19 -7 20 3 -22 12 -16 28 2 -32 -52 13 -16 -55 27 -9 -5 -16 8 17 -24 -53 51 -10 -30 -18 -27 6 -45 18
6919 18 82 62 10 17 13 -2 -20 -9 -21 -9 -12 39 -22 -22 -15 55 -35 -29 -28 -17 8 -64 -28 19 -33 26 25 -41 6 -4 47 -12 65 60 29
6954 29 17 84 -29 84 18 8 -11 9 -1 10 -23 19 -50 -13 55 -7 -2 -14 38 -38 -6 16 -2 -22 -6 -48 -8 14 -5 6
6984 6 -21 46 12 -27 15 -44 5 2 16 57 74 8 -33 31 18 32 5 -56 32 21 20 9 28 13 8 28 32 -37 20 0 -7 -18 -17 28
7018 28 9 27 -29 -46 -4 22 3 -32 -26 -47 -27 34 -39 31 12 21 11 -11 10 50 16 1 37 9 -7 35 -8 35 24 15 30 -5
7050 -5 11 28 -10 -27 24 -21 0 -49 -20 11 -19 -47 -11 -24 2 3 1 37 1 -28 -22 -27 13 -4 15 -25 29 8 -1 -3 32 62 35 -7
7084 -7 -73 30 18 11 85 30 -20 -19 22 5 36 21 40 0 7 -19 48 -34 -53 0 -44 -33 -11 17 -39 -63 6 -7 -25 -21 33 17
7116 17 11 -5 -61 -30 -10 -41 -32 -12 48 27 39 17 22 12 -22 -69 -2 -5 -60 -42 7 -16 19 -1 -18 9 -64 -32 15 42 46 -12 -17
7149a7k3O1j0m5K5n4N3kkNJ3%rm2J7J1M1%lQo9N7j6K0l9J7OpJN9ko4Jl3L8m1N6
7186A1K0m0m6P0n5J00q3K7j0m7M2n6R2oj5j1K6n0M6J6r1L2L2NK2n9j5K1O1J9n6
7217Bq0R7k9j7rO4o5J4m5L5L4k7j2K6j0M2l5L5l1k0j0O2o5M9k8L7p7Q9l5%L0Q
7249B9p9R3q8L5Oj7L4p4P1J0Rm0M6p1k5J4O9k9L1Q8j40M2o1M8j1J8j6l6N2j4R9
7280I3j02KOK0j1j3j0J1l%LL7J5m5k3OO5k9o0lO9p3M7j9lJ2M3k7rm2J9J3k3KK8
7315dk3K8n5P0l1J6k8N6n2K7ko6L7j4L1M3Rk2J0Qk3l6K6l7O6m8L5j5m6L6lqL3
7348A8J1o4P3jm4J9m5K7l7M5j3L6j07P0K8n6N4l0K5j3j7O7q3J5m1P9L2l4l3J2
7378gO5n4J2L2k9M2k4k4JnL3m6lOl8N0Ll1K5K0o6O0n8M3Qpn1L0nJ3N9j06Q5J8
$$ plain form
7149 -17 -40 21 11 -34 -9 -63 -10 -12 -14 -9 4 4 -5 -47 -30 -19 22 22 19 27 -42 15 -1 19 -20 -3 3 -4 -3 56 54 -10 -9 -42 -4 -45 11
7186 11 31 -9 -55 15 -40 60 -23 4 -6 -53 -11 -67 25 19 4 -7 19 -31 15 31 -60 -28 4 9 31 -28 -43 -22 39 58 2
7217 2 -78 19 -10 -27 -36 28 -37 -23 -68 -33 1 -26 -38 -12 -22 20 -15 20 -11 -31 -41 21 -44 5 -23 14 -63 26 -9 -9 21 29
7249 29 -50 43 -45 -10 -4 -21 13 -61 10 20 29 -11 35 -36 -61 -47 22 -7 24 112 -28 14 -47 1 -10 8 -8 -44 8 -6 93
7280 93 -9 -7 -1 19 8 -5 -15 -4 -7 -7 -4 33 48 3 -20 -14 51 22 -38 -41 28 -45 2 -17 -20 -8 35 8 -1 -43 -24 -11 -34 -32 -4
7315 -4 -27 1 -54 16 -15 1 -27 29 -23 4 2 -64 -27 -41 -10 33 42 20 30 38 15 -21 5 -32 34 -14 21 6 -40 -4 -7 -15 18
7348 18 29 -35 38 37 -7 12 -33 -6 -43 2 -11 25 -82 -12 16 -40 14 -16 9 -4 -21 46 -37 -22 -63 16 48 14 -19 -7
7378 -7 58 4 16 48 19 61 37 13 14 9 42 -4 -7 -1 -39 11 14 -17 8 28 -38 22 -36 7 15 8 -43 -13 -18 -5 54 -52 33 51
7412E1j9k9n0K9L8j0k0L5o3J2Qk8O3J8k3J3n7L4qjM2k9j5k1K8J7k0m2O3J4n9J8
7444a1M3l7Qk5J1k4M0L1K0r1J2L7l3O9o0j3N0n5L4J6k9Nn1R1K0j7m1K6m8J7M1
7475C6j4J1oJk0K4n0k3J3M8p0O5j9K9%J9rn1K5oJ1m6N1qM3j6j2rK6m5N8m6Lkl1
7510b0O1j7rNj3Lj4K2k9K9j9N0m5m6M0RK0k8RJ4n1K9J7K4n4%j7O0l6mJ9Qn7jO6
7545B5m4K1NNL3lk3l2L2n4Q4r2j9N4K4k6m0KJ3okL4mmj1m1L4J5k9N6Rp1P0L0n5
7580a0J9l9N6j4o4N2m0lJ0L4j3M5o5R1l5n6lJ9J6OL4n8K3n5Q3n7J0NNNM7q2L1
7613cL6j8r7J36q1J3Ol9O3l9M8l3j9qN6j2K2rJ1k6pj7nl2R6l8L8qp2N7j5l9O6
7646C1q7L2O7j9m7OL5J1Nj1l1k0oM0oo1R4n5K3j8M5m9L1k9N0n1K7n5O8J6l0j5
$$ plain form
7412 51 32 3 -47 -18 20 10 -10 25 -38 -26 -18 -46 17 35 12 25 -32 2 -6 -7 35 6 -9 -30 -2 15 -5 -47 16 30 -29 -11
7444 -11 32 -5 3 -22 -11 -35 5 36 56 -35 -23 14 -19 50 -10 -23 27 -28 6 22 -7 -2 -53 38 58 41 0 26 -22 -5 36
7475 36 22 33 27 28 8 32 -18 -41 -28 20 -50 15 -4 25 25 44 35 -16 9 3 14 -32 19 11 54 38 26 17 43 -2 56 10 13 11 -20
7510 -20 41 24 15 20 7 10 -4 18 -11 18 -1 49 4 -42 -2 7 27 -1 8 22 -29 0 17 41 -13 -13 -30 30 -6 -10 9 17 -40 -41 25
7545 25 -19 2 7 12 45 42 19 -13 19 -35 49 -43 -62 -8 16 -10 -50 -48 -35 -41 -43 -9 -13 -17 -28 -69 -35 -20 -49 7 16 -55 15 45 -10
7580 -10 9 -30 26 12 -52 0 -40 -43 -33 1 -12 33 -32 59 24 -32 -35 -16 0 6 40 -18 5 -50 33 -24 -14 -9 -4 1 48 -34 -3
7613 -3 33 15 -82 54 -27 -14 -8 -47 16 -23 25 -8 -27 -35 21 9 31 22 33 7 0 -17 -22 -54 42 4 42 34 -38 19 4 -35 31
7646 31 -56 -24 43 24 -23 -17 18 29 34 23 -8 -28 -34 6 0 -61 33 -22 1 -17 28 -21 10 -19 31 -20 7 -48 20 36 6 -9
7678iK7j9K2km0L9n8K6jPlj6J6o4K3M0nk3k2M7L2n2M7k5k3N4ol2rL9n4O5m6K4
7712aK2J8J1n8l0O9Ml2j6L9j8Rk0L7l1K3k8k7NJR6q9K8J6%p1L7Rm8K6L9k6L2n8
7746c2P5n5jO5j01Q2o8M7m2L4k6M5k6L2Rm7J5p7O4J5m7j7K3N8m3qM2k5J7Kj3M
7778AL3n5M7j5O2o6Rj3J3K6qnNk7K2k3L0p0N5m7J9pM6m3K8oOk3k3J3m7K6QNL8
7813A4l6k5P2k0mRL1n0lj8J2k5M7k1Kk1L8l6N5j8n0N2k2k7P6KJ2j03P4j6K1m6
7845b4K0K8j7j3j6L6J7K1k0J5r0N1Rj5L3m6M1j7pj1n5Q8j1nj1l7J1K4k1P1n2l6
7877c9L1k2N2nK3j3jJ4m2l0P3k7Mr0Q6l0j3M2M1p4lL6Kj1p4R3l9RrK9l0RJk7K5
7912iM7j4n7KQ5r6N8%l3L3ROk7J7l3K9pk3N4n7nN2%q0N1l6lM8jjooJ3j1Jj6Kk2
$$ plain form
7678 -9 18 -1 21 19 -21 18 -40 -14 -15 -8 -11 -27 -11 -75 -52 -12 -17 -40 -62 -15 17 -35 12 -13 -36 18 12 -20 -29 10 -44 21 -25 -1
7712 -1 21 39 50 -8 -38 31 35 3 -13 26 8 17 -3 34 3 26 -2 -29 -24 -23 73 -16 12 28 28 -43 -6 3 -45 -19 20 -6 26 -32
7746 -32 43 -12 -13 52 -49 33 -35 12 -30 4 -22 23 -3 29 38 -9 6 -71 -7 8 -39 -56 -33 25 -18 -26 16 -9 8 10 -3 1
7778 1 34 -21 26 11 73 7 16 3 16 42 34 29 34 7 29 6 36 -34 21 -26 -7 -14 32 -11 17 11 17 -6 -29 -16 -63 -37 -29 -24 14
7813 14 -22 -47 25 5 1 10 41 -9 -12 -30 -18 -43 4 -17 -15 -36 2 -34 21 3 -47 5 -17 -44 32 34 46 -57 17 1 22 -24
7845 -24 -4 24 7 -6 -22 14 31 52 32 47 -43 8 17 2 35 -11 30 13 6 -5 -60 28 17 12 1 -36 -25 -1 -22 49 -3 -39
7877 -39 -8 -30 22 17 40 27 26 40 -2 -32 41 14 18 -72 14 -16 -29 13 54 -20 -23 13 15 4 -70 23 -16 -7 -16 13 -17 -8 -7 -34 -9
7912 -9 38 24 -33 -31 54 -42 16 16 -17 16 25 31 4 21 -12 17 10 -13 41 -16 -21 31 31 -49 2 -34 -37 11 10 9 3 -3 10 -1 0 -16 -14 -36
7950c6j0N2k1N0o3J6L9m6P2j04L2L9Kk1k6j4M3j7k0M0J3l5M2m3JM2l1K3Npk0r
7982a2oM2jl8jk5O1j7J5j3l4LMl8K9j4J4L9n1N6j3KjjJ0k6L8l5N0Ql0J8k3m7j5
8017e2J7k3M5M2m5p4Q4J3K5pl0K8J5J1l1J3l0lj2L0m0jM3Rm2l2J8L9j6N8k4o1
8049c3qQ5j3l7nJ8Nn7N2j8M5m1P8l2p2k3P9J0%l1Jm1L4l2j0K8J7N1n6LlL7n8O3
8083C6q5K2M8rj3jJ4o1Q6o3L3L0n1M4m7RNJ7j5K9kj9K0l5JJ2LK4j1kJ0m4LO3q8
8118c7J2O4n7N1m3J1o1R1lJ0J2m6rrk3J8O3No0K5J8m8LkL1m7M3Nj2J6o5L6L2m6
8152b2j1J2Mj1m7Q4k3n9L9lQ6k4j1k8K7n3L1lk9N4MrRn3k2J14p1L0Nlql1nJ9J3
8187Ek7M4m5j4
$$ plain form
7950 -36 -46 6 -15 35 -28 -12 27 -19 53 -51 -19 20 22 1 -25 -39 4 -13 -33 7 20 -15 27 -16 -15 27 -4 19 24 17 -3 -12
7982 -12 -18 24 23 -15 -16 -41 20 3 18 5 -29 -26 -22 -60 -31 -45 -31 8 -43 13 0 2 1 0 10 -16 22 -13 37 45 15 33 10 -37 -52
8017 -52 -35 -58 -13 29 -16 -90 -6 7 32 25 -5 23 38 49 18 31 1 -2 -14 16 -24 -25 18 27 -15 -47 -29 10 -6 52 28 -33
8049 -33 -41 44 31 -6 -11 7 12 -45 7 -11 34 -7 71 39 -33 -56 23 33 33 2 3 -38 -4 -36 -46 -18 -1 50 -6 -3 -6 31 -27 36
8083 36 -49 -27 21 12 -1 -2 12 -49 37 -26 7 37 -14 30 -17 -8 -3 14 -1 28 26 7 27 -8 -7 5 8 32 21 19 29 -15 -12 51 -37
8118 -37 -25 39 -18 33 -10 1 -60 31 28 38 50 4 -5 -14 -37 -19 44 49 -11 14 32 -16 -13 -15 16 -31 12 17 5 21 -44 -8 24 -22
8152 -22 -33 -21 -17 -28 -75 9 -14 -73 -34 -37 49 25 14 -14 13 -40 -9 -12 -41 13 17 8 17 -36 -58 56 -15 15 20 17 9 -22 -27 -8 5
8187 5 -22 22 -23 -37
8191c7
##END NTUPLES=NMR FID
##END=
