##TITLE=1H_Pr NCS-12
 200.13MHz,CDCl3,
 8 sc
 
 8.7.2025
##JCAMPDX= 6.0         $$ Bruker NMR JCAMP-DX V2.0
##DATA TYPE= NMR FID
##DATA CLASS= NTUPLES
##ORIGIN= UXNMR, Bruker Analytische Messtechnik GmbH
##OWNER= pz
$$ XWIN-NMR		Version 3.5
$$ Tue Jul  8 16:15:50 2025 Russian Standard Time (UT+4h)  she@DPX200
##.OBSERVE FREQUENCY= 200.1313
##.OBSERVE NUCLEUS= ^1H
##.DELAY= (6, 6)
##.ACQUISITION MODE= SIMULTANEOUS
##.ACQUISITION SCHEME= undefined
##.AVERAGES= 8
##.DIGITISER RES= 18
##SPECTROMETER/DATA SYSTEM= spect
##.PULSE SEQUENCE= zg30
##.SOLVENT NAME= CDCl3
##.SHIFT REFERENCE= (INTERNAL, CDCl3, 0, 14.3821)
##AUDIT TRAIL= $$ (NUMBER, WHEN, WHO, WHERE, WHAT)
$$ ##TITLE= Audit trail, XWIN-NMR		Version 3.5
$$ ##JCAMPDX= 5.01
$$ ##ORIGIN= Bruker BioSpin GmbH
$$ ##OWNER= she
$$ F:/spectra/data/she/nmr/H-C/1/audita.txt
$$ ##AUDIT TRAIL=  $$ (NUMBER, WHEN, WHO, WHERE, WHAT)
(   1,<2025-07-08 16:14:29.39 +0400>,<she>,<DPX200>,
      <created by zg, POWCHK disabled, PULCHK disabled
       configuration hash MD5:
       00 E9 B6 7A A2 85 ED C7 34 08 36 98 17 FE 4E 26
       data hash MD5: 16K
       35 5E 4E EB FF AA EA AF 34 73 9A BB 31 53 94 D0>)
$$ ##END=
$$ 
$$ hash MD5
$$ FD 75 A7 7E 1D 03 99 9B 80 3B 54 2B 78 D7 8B E3
##$RELAX= 
##$RELAX= 
##$RELAX= 
##$RELAX= 
##$RELAX= 
##$RELAX= 
$$ Bruker specific parameters
$$ --------------------------
##$DU= <F:/spectra>
##$EXPNO= 1
##$NAME= <H-C>
##$PROCNO= 1
##$TYPE= <nmr>
##$USER= <she>
##$AMP= (0..31)
100 100 100 100 100 100 100 100 100 100 100 100 100 100 100 100 100 100 
100 100 100 100 100 100 100 100 100 100 100 100 100 100 
##$AQSEQ= 0
##$AQ_mod= 1
##$AUNM= <au_zg>
##$AUTOPOS= <>
##$BF1= 200.13
##$BF2= 200.13
##$BF3= 200.13
##$BF4= 200.13
##$BF5= 200.13
##$BF6= 200.13
##$BF7= 200.13
##$BF8= 200.13
##$BYTORDA= 1
##$CFDGTYP= 0
##$CFRGTYP= 5
##$CHEMSTR= <none>
##$CNST= (0..31)
1 1 145 1 1 1 1 1 1 1 1 1 1 1 1 1 1 1 1 1 1 1 1 1 1 1 1 1 1 1 1 1 
##$CPDPRG= <>
##$CPDPRG1= <>
##$CPDPRG2= <>
##$CPDPRG3= <>
##$CPDPRG4= <mlev>
##$CPDPRG5= <mlev>
##$CPDPRG6= <mlev>
##$CPDPRG7= <mlev>
##$CPDPRG8= <mlev>
##$CPDPRGB= <>
##$CPDPRGT= <>
##$D= (0..31)
0 0.7 0 0 0 0 0 0 0 0 0 0.03 0 0 0 0 0 0 0 0 0 0 0 0 0 0 0 0 0 0 0 0 
##$DATE= 1751976868
##$DBL= (0..7)
120 120 120 120 120 120 120 120 
##$DBP= (0..7)
150 150 150 150 150 150 150 150 
##$DBP07= 0
##$DBPNAM0= <>
##$DBPNAM1= <>
##$DBPNAM2= <>
##$DBPNAM3= <>
##$DBPNAM4= <>
##$DBPNAM5= <>
##$DBPNAM6= <>
##$DBPNAM7= <>
##$DBPOAL= (0..7)
0.5 0.5 0.5 0.5 0.5 0.5 0.5 0.5 
##$DBPOFFS= (0..7)
0 0 0 0 0 0 0 0 
##$DE= 6
##$DECBNUC= <off>
##$DECIM= 32
##$DECNUC= <off>
##$DECSTAT= 4
##$DIGMOD= 1
##$DIGTYP= 9
##$DL= (0..7)
0 120 120 120 120 120 120 120 
##$DP= (0..7)
150 150 150 150 150 150 150 150 
##$DP07= 0
##$DPNAME0= <>
##$DPNAME1= <>
##$DPNAME2= <>
##$DPNAME3= <>
##$DPNAME4= <>
##$DPNAME5= <>
##$DPNAME6= <>
##$DPNAME7= <>
##$DPOAL= (0..7)
0.5 0.5 0.5 0.5 0.5 0.5 0.5 0.5 
##$DPOFFS= (0..7)
0 0 0 0 0 0 0 0 
##$DQDMODE= 0
##$DR= 18
##$DS= 0
##$DSLIST= <SSSSSSSSSSSSSSS>
$$ [...]
##$SUBNAM0= <"">
##$SUBNAM1= <"">
##$SUBNAM2= <"">
##$SUBNAM3= <"">
##$SUBNAM4= <"">
##$SUBNAM5= <"">
##$SUBNAM6= <"">
##$SUBNAM7= <"">
##$SUBNAM8= <"">
##$SUBNAM9= <"">
##$SW= 18.0517328524113
##$SWIBOX= (0..15)
0 0 2 0 0 0 0 0 0 0 0 0 0 0 0 0 
##$SW_h= 3612.71676300578
##$TD= 16384
##$TD0= 1
##$TE= 0
##$TE2= 300
##$TE3= 300
##$TEG= 300
##$TL= (0..7)
0 120 120 120 120 120 120 120 
##$TP= (0..7)
150 150 150 150 150 150 150 150 
##$TP07= 0
##$TPNAME0= <>
##$TPNAME1= <>
##$TPNAME2= <>
##$TPNAME3= <>
##$TPNAME4= <>
##$TPNAME5= <>
##$TPNAME6= <>
##$TPNAME7= <>
##$TPOAL= (0..7)
0.5 0.5 0.5 0.5 0.5 0.5 0.5 0.5 
##$TPOFFS= (0..7)
0 0 0 0 0 0 0 0 
##$TUNHIN= 0
##$TUNHOUT= 0
##$TUNXOUT= 0
##$USERA1= <user>
##$USERA2= <user>
##$USERA3= <user>
##$USERA4= <user>
##$USERA5= <user>
##$V9= 5
##$VALIST= <valist>
##$VCLIST= <CCCCCCCCCCCCCCC>
##$VD= 0
##$VDLIST= <DDDDDDDDDDDDDDD>
##$VPLIST= <PPPPPPPPPPPPPPP>
##$VTLIST= <TTTTTTTTTTTTTTT>
##$WBST= 1024
##$WBSW= 4
##$XGAIN= (0..3)
0 0 0 0 
##$XL= 0
##$YL= 0
##$YMAX_a= 419955
##$YMIN_a= -351841
##$ZGOPTNS= <>
##$ZL1= 120
##$ZL2= 120
##$ZL3= 120
##$ZL4= 120
##$ABSF1= 10
##$ABSF2= 0
##$ABSG= 5
##$ABSL= 3
##$ALPHA= 0
##$AQORDER= 0
##$ASSFAC= 0
##$ASSFACI= 0
##$ASSFACX= 0
##$ASSWID= 0
##$AUNMP= <proc_1d>
##$AZFE= 0.1
##$AZFW= 0.1
##$BCFW= 1
##$BC_mod= 2
##$BYTORDP= 1
##$COROFFS= 0
##$CY= -3
##$DATMOD= 1
##$DC= 2
##$DFILT= <>
##$DTYPP= 0
##$F1P= 0
##$F2P= 0
##$FCOR= 0.5
##$FTSIZE= 0
##$FT_mod= 4
##$GAMMA= 1
##$GB= 0.15
##$INTBC= 1
##$INTSCL= 1
##$ISEN= 128
##$LB= 0.25
##$LEV0= 0
##$LPBIN= 0
##$MAXI= 10000
##$MC2= 0
##$MEAN= 0
##$ME_mod= 0
##$MI= 1.114404
##$NCOEF= 0
##$NC_proc= 0
##$NLEV= 6
##$NOISF1= 3.799351
##$NOISF2= 2.8
##$NSP= 1
##$NTH_PI= 0
##$NZP= 0
##$OFFSET= 14.38212
##$PC= 1
##$PHC0= -1388.853
##$PHC1= 54.39247
##$PH_mod= 1
##$PKNL= yes
##$PPARMOD= 0
##$PSCAL= 0
##$PSIGN= 0
##$REVERSE= no
##$SF= 200.129724274929
##$SI= 16384
##$SIGF1= 3
##$SIGF2= 2
##$SINO= 400
##$SIOLD= 16384
##$SREGLST= <1H.CDCl3>
##$SSB= 0
##$STSI= 0
##$STSR= 0
##$SW_p= 3205.1282051282
##$SYMM= 0
##$S_DEV= 0
##$TDeff= 0
##$TDoff= 0
##$TI= <>
##$TILT= no
##$TM1= 0
##$TM2= 0
##$TOPLEV= 0
##$USERP1= <user>
##$USERP2= <user>
##$USERP3= <user>
##$USERP4= <user>
##$USERP5= <user>
##$WDW= 1
##$XDIM= 8192
##$YMAX_p= 0
##$YMIN_p= 0
$$ End of Bruker specific parameters
$$ ---------------------------------
##NTUPLES= NMR FID
##VAR_NAME=  TIME,          FID/REAL,        FID/IMAG
##SYMBOL=    X,             R,               I
##VAR_TYPE=  INDEPENDENT,   DEPENDENT,       DEPENDENT
##VAR_FORM=  AFFN,          ASDF,            ASDF
##VAR_DIM=   8192,          8192,            8192
##UNITS=     SECONDS,       ARBITRARY UNITS, ARBITRARY UNITS
##FACTOR=    0.0002768,     1,               1
##FIRST=     0,             0,               0
##LAST=      2.2672688,     0,               0
##MIN=       0,             -351841,         0
##MAX=       2.2672688,     419955,          0
$$ Real data points
##PAGE= N=1
##DATA TABLE= (X++(R..R)), XYDATA
0@%%%%%%%%%%%%%%%%%%%%%%%%%%%%%%JlNoOpRj1J3j4J5j7K0k4K7l2L7m1M6n0N3
$$ 0 0 0 0 0 0 0 0 0 0 0 0 0 0 0 0 0 0 0 0 0 0 0 0 0 0 0 0 0 0 0 1 -2 3 -3 3 -4 5 -6 7 -7 8 -9 11 -13 14 -18 19 -22 24 -26 27
51B7n9O7p1P5p9Q1q2P8o8M9j4m7J54l46P12j483L372r631O4929L62291j89791
$$ 27 -32 35 -36 39 -40 41 -41 37 -31 18 4 -43 111 -235 477 -1006 2366 -7265 57664 419955 230164
72B30164m63730l0924K72162J31641r1269p5376R012o57q373L6455K3719k2324
$$ 230164 -233566 -264490 7672 139313 48044 -27332 -18320 -18977 -27350 9105 32824 10500
84A0500k4057O725J0183o832m004J3998N803j0355q786J724L974J950J470J522
$$ 10500 -13557 -6832 3351 -3481 -7485 6513 12316 1961 -6825 -5101 -1127 823 2293 3815
98C815l527m772K742M759j748k759J606J839j580j084J688jl155J793M475j808
$$ 3815 288 -4484 -1742 3017 1269 -1490 116 1955 375 -709 979 978 -2177 -384 4091 2283
114B283n826p68M819L308k093l600P8K380N02p97r40l14J074J412n78l154l11
$$ 2283 -3543 -4311 508 3816 1723 -1877 -1799 581 1083 286 -654 -968 106 1518 940 -2214 -2525
131b525M300K676l678m826P02M652J945l062k028J813J196j517q6K092P73k281
$$ -2525 1775 4451 773 -4053 -3351 1301 3246 184 -1844 -31 1165 -352 -438 1654 2427 146
147A46l095M91L468J910k088k683J47K069J187j086j111N65M00j721m66K257J553
$$ 146 -2949 -2458 1010 2920 832 -1851 -1704 365 1552 466 -645 -80 320 -1401 -1867 390 1943
164A943j777j581R36J564m71r41J62N03k57l13K64J49m71nK91K65k65j54J58j8
$$ 1943 166 -1415 -479 1085 614 -327 -165 338 81 -232 32 181 -290 -295 -4 261 -4 -158 0 -18
184a8J30%l14K4O51j35j023m02J435J360r31j840K46J512K91q44k96k28N7j09
$$ -18 112 112 -202 -178 473 338 -685 -1087 348 1708 777 -1063 -817 695 986 142 -154 -382 -325 -434
204d34M70N77l86n10j62K85K02J86J3m55k63K66L24R5o6R2k29j05J0K6J77jM6
$$ -434 36 613 227 -283 -445 -160 42 228 241 -214 -477 -211 113 208 142 234 5 -100 -90 -64 113 112 158
227A58k64k96M34K85j2n27k41L28P8j99K60K17l97p4L07M28o7m52k44L43J79l23
$$ 158 -106 -402 32 317 305 -222 -463 -135 -57 -256 4 221 -176 -250 57 485 418 -34 -278 65 244 -79
249g9L3J2M9o7j2L9K4k4R1j45OJ21Oj07jJ93j9j96N1K63j04j72N6n6K91j89l80
$$ -79 -46 -34 15 -52 -64 -25 -1 -25 66 -79 -73 48 54 -53 -54 139 120 -76 -25 238 134 -38 18 -38 253 64 -316
276c16J96K06m7j62L7J95J15j33j49J75J15m35J12J59j9k22k2J82J90k33mO6j2
$$ -316 -120 86 39 -123 -86 109 224 91 -58 117 232 -203 -91 68 49 -173 -195 -13 177 -56 -60 6 -6
299fl2o1j4J63r1J15L7j91q7J98Qp0j11Q1J42Oj39N5n0J30p2j0o3K3L6J8j34K26
$$ -6 -38 -99 -113 50 -41 74 111 -80 -167 31 39 -31 -142 -61 81 87 -52 3 -47 83 11 1 -62 -39 -3 15 -119 107
327A07Q3k53M7M8P2j8j26q2K40o1k0r4J02q6J5O2r1P5q9R6J80q2k12J4rN9p3J71
$$ 107 190 -63 -16 32 104 86 -40 -122 118 57 37 -57 45 -41 -26 36 -55 20 -69 27 207 125 -87 -73 -82 -23 -96 75
355G5j17J20M6m5R4q8j47M9k0N8j26J05p1m4J60O0q9J03j29N9n0p9L1O0P2q1N9
$$ 75 -42 78 124 79 173 85 -62 -13 -33 25 -101 4 -67 -111 49 109 20 123 -6 53 3 -76 -45 15 87 6 65
382F5r3P4J35k00r1L9J3R4J4L6m2p5MQ0Kp6J7l6q9J30n2j9P0J4J41j87k9J17n8
$$ 65 -28 46 181 -19 -110 -71 -58 36 50 86 44 -31 -27 53 55 -21 -4 -40 -129 1 -51 -70 0 14 155 -32 -61 56 -2
411bj7p2J15j1%ln5N3N9n8N8M9j14p8m9N6N3l5k4l7J25J39l9k56J4R4J00J01l01
$$ -2 -19 -91 24 13 13 10 -45 8 67 9 67 116 2 -76 -125 -69 -16 -51 -75 -112 13 152 113 -143 -129 -35 65 166 -135
440a35M4J9O0J8P6mj58L6O3p8Q6J5r2n0k4L7J32K9qj7RKm7L9o2J00j44Q2k1r4
$$ -135 -91 -72 -12 6 82 78 -80 -44 19 -59 27 42 -50 -100 -124 -87 45 74 66 49 58 60 13 52 -10 90 -54 28 7 -87
470h7J40p5Q8j82J32k3P9j10J8m9P4j4j0J3k1J3j7R4j25Q6j60K14R7p8k98J08
$$ -87 53 -22 66 -116 16 -7 72 -38 -20 -69 5 -9 -19 -6 -27 -14 -31 63 -62 24 -136 78 175 97 -201 -93
496i3P4J00j6k42J25J17j3n6J59l06J69P5M1j19n9r7K71j01J5j31j02J21L20j04
$$ -93 -19 81 65 -177 -52 65 52 -4 155 -151 18 93 134 15 -44 -141 130 29 44 -87 -189 -68 252 148
520A48k28q4J43Q5R1j11j40N1QRJ32j24M1M0k26J61o4J54j3j4m6j01J68k1n7n3
$$ 148 -80 -164 -21 64 155 44 -96 -45 -37 -28 104 -20 21 61 -165 -4 -68 86 73 59 13 -88 80 59 2 -51
546e1P8j3oM9j59N6J0j39J74k7L0K7rj12J18o3l2M2j1J11j10k6N6o2J16k0j75
$$ -51 27 14 8 57 -102 -46 -36 -175 -1 -28 2 29 20 -92 26 -37 -69 -27 -38 73 -37 -63 -7 -69 47 27 -148
573a48K46j32K5N0r7K27j47l2%%K3N6o1o2J03p8L6o5R7m9J13j57o4oR8J25pj04
$$ -148 98 -34 -9 41 -56 171 24 -8 -8 -8 15 71 10 -52 51 -27 9 -56 41 -8 105 -52 -116 -122 -24 101 94 -10
601a0q3qM8K23j55j19M2R7r9J48o2rp0j01R9P3q8J95Q4j37r5OP4j1k5QM8j17M3
$$ -10 -93 -101 -53 170 15 -104 -62 35 -64 84 22 13 -57 -158 -59 14 -74 121 205 68 -27 -21 53 42 17 25 73 -44 -1
630aL3Nl6M1N5nl1r0J08j8j17jJ13P5o7j03P7n3mJ1r5M1Q0M9n2o4K6L5n9j7Q3
$$ -1 32 37 1 42 97 92 61 -29 79 61 -56 -57 56 131 64 -39 38 -15 -19 -8 -103 -62 18 67 15 -49 -23 12 -47 -64 19
661A9MP4r7L4k9j8PQ6r1PN7L7j47P9R5j24M5p2R8j00J51j44M3kj10O0P3r3N1r
$$ 19 23 97 0 34 5 -13 -6 80 -11 -4 53 90 -57 22 117 -7 38 -34 64 -36 115 -29 14 12 -98 -38 35 -58 -7 -16
691a6k0qo3R0k6M6p3J46j11qj3J02m5j04R0o5L2M8n0Q5K0j2J9o0p3N3L0j0l9P6
$$ -16 -36 -44 -107 -17 -43 3 -70 76 -35 -43 -56 46 1 -103 -13 -78 -46 2 -48 37 57 45 64 4 -69 -16 14 4 -35 41
721D1o8P3p3J18m2L7j39N0k3J0ol0J2L7lr5R2J58j04m9M3j28J25m4P7j1n6j31
$$ 41 -27 46 -27 91 49 86 -53 -3 -26 -16 -22 -52 -40 -3 -6 -101 -9 149 45 -4 39 -89 36 -8 69 58 2 -129
749a29J05J49j93N3O5M4n0l4R8j13j1q7J53j52P6j6L4k8R2ol8M0Ml9l9M4j05k
$$ -129 -24 125 -68 -15 50 94 44 10 108 -5 -16 -103 50 -102 -26 -42 -8 -36 56 50 12 52 56 17 -22 22 -83 -85
777h5J44j37J01pM4p6N6q1JQ3k9N9j00M8L7r1p0J23J3j6j50K08p2j4J20j49Mk4
$$ -85 59 -78 23 16 60 -16 40 -41 -40 43 14 73 -27 21 58 -33 -103 20 33 17 -133 75 3 -11 109 -40 -36 -60
805f0J01j38K7J27p7K8k9p3J0J48K8p4rj1mm4%J66j56o2J00qq6J04q2N0Q4Pj43
$$ -60 41 -97 -70 57 -20 8 -21 -94 -84 64 92 18 9 -2 -6 -50 -50 116 -40 -102 -2 -10 -96 8 -74 -24 60 67 -76
834g6P2r5J67j50J22K2r9N9k6M6m5k1J9%p3P2O0k7J2m0l1O5j33J27l2K7K5J19
$$ -76 -4 -99 68 -82 40 62 -37 22 -4 42 -3 -24 -5 -5 -78 -6 54 27 39 -1 -32 33 -100 27 -5 22 47 166
862A66k26J00n4j4R7k3j22J56p6L2o7K0N2o1J04p2N4o1K7k9RJ9p0L5j3j2rO4q9
$$ 166 -60 40 -14 -28 69 46 -76 80 4 36 -31 -11 41 -20 84 12 66 5 32 3 12 31 -39 -4 -17 -29 -38 26 -63
891f3K52r2j39nN2Q2j00n3J0KO6N4j18J01j19N5KJ15j42J2J23Pj95P3k7K1mK5
$$ -63 189 97 -42 -47 5 87 -13 -66 -56 -54 12 66 -52 49 -70 -15 -13 102 -40 -28 95 102 -93 -20 -47 -26 -30 -5
919eMk1L5J8l1J03k3k16M5J07l6J6J3jK9o7m9j2J02k0j8L5l3J1m3j7M6q5M8P2
$$ -5 -1 -22 13 31 0 103 80 -136 -91 16 -20 -4 9 8 37 -30 -79 -91 11 -9 -27 8 -25 -14 -57 -74 -28 -113 -65 7
949Gj62J35M3r5O9K2k8K5Qj02J77j46J77K8j82L8N7o9L1Kk3m2p8J18K0o7m6J1
$$ 7 -155 -20 23 -72 -3 19 -9 16 24 -78 99 -47 130 158 -24 14 71 2 33 35 12 -30 -108 10 30 -37 -83 -72
977g2N1J9j5P2p7R1q6r4J31Q7j44Q3j0j55J48lj17J25kj9l6N8Ql0K1q3K1L0j15
$$ -72 -21 -2 -17 55 -22 69 -17 -111 20 107 -37 46 36 -119 29 26 -91 34 32 13 -23 35 43 13 34 -49 -28 2 -113
1006a13J65j02K2R7J8l5n0o6J2J16r7l7J19q9L9N4j10M6k3J2q7J51o4j7o3J24
$$ -113 52 -50 -28 69 87 52 2 -64 -52 64 -33 -70 49 -40 -1 53 -57 -11 -34 -22 -109 42 -22 -39 -102 22
1032B2m0p5R2k8R1J6p1K4q3J42q1L1J44n6q3j14J06J41j46J04l1M6j34l3J9L8
$$ 22 -18 -93 -1 -29 62 78 7 31 -52 90 9 40 184 128 45 -69 37 178 32 136 105 151 17 -16 3 41
1058D1j4m3n8Nj8J74l3oK4j4p3R4j29Q3%K6PK5Mo1r3Q7p9L2o8O7K0L8m7o1J48
$$ 41 27 -16 -74 -69 -87 87 54 48 72 58 -15 79 -50 33 33 59 66 91 95 34 -59 28 -51 -19 -87 -20 0 38 -9 -70 78
1089G8L4j82K9J12K5J8j50P6l1n1l7R8p9R1n6K0J22j24lK1l6L1p3R6l9N6Rr1o
$$ 78 112 -70 -41 71 96 114 -36 40 9 -42 -79 19 -60 31 -25 -5 117 -7 -10 11 -25 6 -67 29 -10 46 55 -36 -42
1118d2K7J31j96M0mJ07o6m1MO6m5j7O9N1j1j90J9J55L1j15np3O4J23k8L0j25Q1
$$ -42 -15 116 -80 -40 -44 63 -3 -44 -40 26 -19 -36 33 84 73 -117 -98 57 88 -27 -32 -105 -41 82 54 84 -41 40
1146D0k7k6k3J04j6m3m1rP2j01P1n6l5J07l4M3M1o3J2o3O4m1l1J12j57J24j4m5
$$ 40 13 -13 -36 68 52 9 -32 -41 31 -70 1 -55 -90 17 -17 26 67 4 16 -47 17 -24 -55 57 -100 24 10 -35
1174c5J50n7o6J29j27K7Rr2K8J5J09j69P4Ql5O9j38J18q5K9n8J41j52O7O3m3J80
$$ -35 115 58 -8 121 -6 21 30 -62 -34 -19 90 -79 -5 3 -32 37 -101 17 -68 -39 -97 44 -108 -41 22 -21 159
1201A59j87K22j88J1J1j23N4L1J9k2J17j04J3l6J3lN5j1q1L3Q1m1j18J18Jm9J8
$$ 159 -28 194 6 17 28 -95 -41 -10 9 -13 104 0 13 -23 -10 -13 42 31 -50 -17 64 23 -95 23 24 -25 -7
1228gl5J62o0p3l0LM5o7J62j27k3R8m9L0L8K7q1j4l7J3Q6j11J22r0M4K2k8P6r8
$$ -7 -42 120 60 -13 -43 -40 5 -62 100 -27 -50 48 -1 29 67 94 13 -1 -38 -25 61 -50 72 -18 26 48 20 96 -2
1257bj6N1r4J1L2J9N7j04K11j43j0K5j1KJ3j4l5k6N4j02J34k1j1P9q1oM2oo0p
$$ -2 -18 33 -61 -50 -18 1 58 -46 165 22 12 37 26 28 41 27 -8 -34 20 -82 52 31 20 99 18 12 54 48 -12 -19
1287a9R4j63N4Q9j0%k3M5j70P0P7K4m8L8j04P2l5J1j8J2lJ30o8J1l4j28L7O3K0
$$ -19 75 -88 -34 55 45 45 22 67 -103 -33 44 68 20 58 -46 26 -9 2 -16 -4 -7 123 55 66 32 -96 -59 4 24
1316B4k6P1k4q5k6J18n6K0M2j23J12k9r6R5q2R8m9J96k17J7Q9j54J61m5N3m8q9
$$ 24 -2 69 45 -40 -66 52 -4 16 58 -65 47 18 -78 17 -65 33 -16 180 -37 -20 69 -85 76 31 84 36 -53
1343e3J17j8j07K5j8J43k3r3J3k0o7R1K2J33l2j32mOjl8P1m5K2N8l4N0p7m8j21
$$ -53 64 46 -61 -36 -54 89 66 -27 -14 -34 -101 -10 12 145 113 -19 -23 -17 -18 -56 15 -30 -8 50 16 66 -11 -59 -180
1372a80J53l5R1O3l5L0p7N6l9n0l9K9N6j9r6L0kM3n4M5M9J4j8ll1n4J54o6KLj16
$$ -180 -27 -62 29 92 57 87 10 66 27 -23 -62 -33 23 4 -92 -62 -64 -21 -75 -30 19 33 15 12 -19 -73 81 15 17 20 -96
1403i6P5Q3j16J54j58O8k3j12R6M3p0J9n4K32k49J33L5J7m7p3Q2k9J22k21j4K06
$$ -96 -21 62 -54 100 -58 10 -13 -125 -29 14 -56 -37 -91 141 -108 25 60 77 30 -43 39 10 132 -89 -103 103
1429A03p7k7J36j87J72p3M9m2j11Q1m0q0R7l3J3l2JqNK11j70o4M3j3P4j0n4O3
$$ 103 26 -1 135 -52 120 47 96 54 -57 24 -16 -96 1 -32 -19 -51 -50 -58 -53 158 -12 -76 -33 -46 28 18 -36 27
1457B7M0n4O3k6j41R2LL5q5j2O7L5j7l8o1M8O4P8j12M6j02P7L5j50O6r7R1LnL5
$$ 27 67 13 76 50 -91 1 4 39 -46 -58 9 44 27 -11 -72 -24 40 118 6 52 -50 27 62 -88 -22 -119 -28 -25 -30 5
1487Ej5r0K08j06k2L2nK3r7MO9l9r6J96j06L3L3j2j18J64j3o3L7l5jOM2Nl6o3
$$ 5 -10 -100 108 2 -20 12 7 30 -67 -63 6 -33 -129 67 -39 -6 27 15 -103 61 48 -15 22 -13 -14 -8 34 39 3 -60
1517f0L4k4l8q4K0J98q2M7k3n2J46j61l6K16N7k27J37n9J5K4Q7j7r2k3J3j09K4
$$ -60 -26 -50 -88 -172 -152 46 -36 11 -12 -64 82 -79 -115 101 158 -69 68 9 24 48 135 118 26 3 16 -93 -69
1544f9M8M8j4o4O3qq6K11n0j58P6N2m9q9K6O6M7q4N3k4J7k0P6j6r8Q6r8J62j83
$$ -69 -21 27 13 -51 12 4 -82 129 79 -79 -3 49 0 -89 -63 3 50 -34 19 -5 12 -8 68 52 -46 40 -58 104 -79
1573g9NP8J9q5j0J16q0Q8l7m5L5qLM2o1q6J07jm1M7k3P5L3r2K1L8J0n6mQj35J87
$$ -79 -74 4 23 -62 -72 44 -36 52 15 -30 5 -3 0 42 -19 -105 2 1 -40 7 -16 59 92 0 21 59 69 13 9 17 -118 69
1605F9k07J17N3o8qP1K7l8p8J04q7j4J06j00R4j12J50m8Oj38N8J2N5k3q0R5M7
$$ 69 -138 -21 32 -36 -44 27 54 16 -62 42 -45 -59 47 -53 41 -71 79 31 37 -101 -43 -31 24 1 -79 16 63
1632F3J7m4n3j1L8Q3j42R2j01j2J00Mn3J07m3j1po2N8J8o0o3L5Q9Lj30lN1Q0j12
$$ 63 80 36 -17 -28 10 93 -49 43 -58 -70 30 34 -19 88 45 34 27 -35 23 41 -19 -82 -47 42 45 -85 -88 -37 43 -69
1662f9J10q8k4J07lL8l8j01K30q6j80J32j1l9N7O2j37J56j79Q1J09p9or7O9PK5
$$ -69 41 -47 -71 36 33 71 33 -68 162 76 -104 28 17 -22 35 97 -40 116 -63 18 127 48 42 -55 14 21 46
1689D6p7Q2n2kk7N4r8J22n1Q1Pj25J77r8k9N9j04K5J09j38J2KO6l0j3P3q3M5K
$$ 46 -31 51 -1 -3 -30 24 -74 48 -3 78 85 -40 137 39 10 69 -35 -10 99 -39 -27 -25 41 11 -2 71 -12 33 35
1718C5L6p8j6J24j21MQ2p2L8j08K7Q9K9r4N7r8J49n2K6j09N8J4J7r9Q0j6L7j17
$$ 35 71 -7 -23 101 -20 -16 66 -6 32 -76 -49 40 69 -25 32 -66 83 31 57 -52 6 20 37 -62 18 2 39 -78
1746g8O2j9L6l4L3jN2pp3O2J78k73J7N3pO2q8O7l7K8RMO2j20N7j08L6P6L2q7J18
$$ -78 -16 -35 1 -33 0 -1 51 44 -29 33 211 -62 -45 8 1 63 -25 42 5 33 42 46 108 -12 45 -63 -27 49 81 -6 112
1777A12p5n9K8l9M4r9J19j31J73L0j00Q8o7k0L7n0R2j73K01J2j39P0N5j76N5J5
$$ 112 37 -22 6 -33 11 -88 31 -100 73 103 3 91 24 4 41 -9 83 -90 111 123 -16 54 109 -67 -12 3
1803CJ6l8P2n5J29j05Jk6qN4n0J5P8p6oo6J49j5j31L1J28q0p5J14j05L6j9J11
$$ 3 19 -19 53 -2 127 22 23 -3 -11 43 -7 8 86 10 4 -62 87 72 -59 -28 100 20 -55 59 -46 -10 -29 82
1831H2m7ro8pJ1K3l2J09J5j34J18n9K3J4l0nJ4Nm2pl4N4J3l5J01L0m6j20K8K7
$$ 82 35 26 -42 -49 -38 -15 -47 62 77 -57 61 2 25 39 9 4 18 23 -19 -26 -60 -6 7 -28 73 103 57 -63 -35 -8
1861ho6K5l7J77q5r4J41r6k8Q6Pj7n5M4N9l2J6k6J0l9%P7j00J00q8j00J47M5j9
$$ -8 -74 -49 -86 91 6 -88 53 -43 -71 15 22 5 -50 -6 53 21 37 11 21 -18 -18 59 -41 59 -29 -129 18 63 44
1890D4m6m3l4O1K3jK3M8j74R4K2po3j4j6O5k0M7j71K65j53K4K2j16J23l3J00j08
$$ 44 -2 -45 -79 -18 5 4 27 75 -99 -5 17 10 -53 -67 -83 -18 -38 9 -162 103 -50 -26 -4 -120 3 -30 70 -38
1918c8k6p7J56j43J85l2mmNM0n8NoK4n6j2J09j03R4n6P5l6l6o0N6j3j5P2j32l1
$$ -38 -64 -141 15 -128 57 25 21 17 22 62 4 9 3 27 -29 -41 68 -35 59 3 78 42 6 -54 2 -11 -26 46 -86 -117
1948a17J73j34K4J28p7N4j32M3J1J16l2q9l9N1Q0l0l7k6L3k7k1P0k3L4o0Q4p6
$$ -117 56 -78 -54 74 -3 51 -81 -38 -27 89 57 -32 -71 -20 60 30 -7 -33 0 -27 -48 22 -1 33 -27 57 -19
1975a9k2J30k6j0j46k4P6J17mO6j33j1km7L5N9n3O0p5k0O6k1K4ol7p8P9M3j8l5
$$ -19 -41 89 63 53 -93 -117 -41 76 72 138 5 -6 -8 -55 -20 39 -14 46 -29 -49 17 -4 20 14 -23 -101 -22 21 3 -32
2005c2Q7j71Q7J07k8p8J25j31pO7K5j44J04N2k3op0K8O2J5j33N8LO4o6O6l8j72
$$ -32 55 -116 -29 78 50 -28 97 -34 -41 26 51 -93 11 63 40 34 -36 -8 54 69 -64 -6 -3 61 -5 61 23 -149
2033a49J37m9M6K3m1R0p0m5j8L3n4J43l6j7K4j6n9O0j5O3p0o8J54p3P4k6j17j4
$$ -149 -12 -61 -15 8 -33 57 -13 -58 -76 -43 -97 46 10 -7 17 1 -58 2 -13 50 -20 -88 66 -7 67 41 -76 -90
2061i0P4n2P4j42P7M9n2O9k3J03q6q2J66j51R1j11J31J13r1k4n4m3n2J14j0k7
$$ -90 -16 -68 6 -136 -59 -10 -62 7 -16 87 1 -81 85 -66 25 -86 45 158 67 43 -11 -54 -106 8 -2 -29
2087b9L2J08m0J0q9l4k2J03q6J14j42J34j28R6n4k0R7j75J20ONj4K%M7j10Q6l6
$$ -29 3 111 71 81 -8 -42 -64 39 -47 67 -75 59 -69 27 -27 -47 50 -125 -5 1 6 -8 -6 -6 41 -69 17 -19
2115a9o0J14p7K0PM6j7j3p0kP3l4k4J6L1J6j2r3P6l2mJ9OR7j2p9Q0k8P6j72m9
$$ -19 -79 35 -42 -22 -15 31 14 1 -69 -71 2 -32 -56 -40 -9 7 -5 -98 -22 -54 -58 -39 -33 64 52 -27 53 25 101 -71 -120
2146a20J13M4j77R9oJ7m9J6J1K0M3N3p4k2L9j6o8J36r0L7Q0l7q8k0M6n2NO0L8
$$ -120 -7 37 -140 -41 -47 -30 -79 -63 -52 -32 11 64 -10 -32 7 -9 -77 59 -31 6 86 49 -39 -59 -13 -65 -60 0 38
2175C8L6n7n1q7J09l0k7K8n5JqP5J09j17M2LQ7j46P5J3j16R8o9r2J71j1j3j09
$$ 38 74 17 -34 -121 -12 -42 -69 -41 -96 -95 -103 -28 81 -36 6 9 96 -50 25 38 -78 20 -49 -141 30 19 6 -103
2203a03J68p8k4l2k8J13l6n3R3j3J59k32J00q6N5m1k4L9N7Kl1O6k7o2k1J04j09
$$ -103 65 -13 -37 -69 -97 16 -20 -73 20 7 166 -66 34 -52 3 -38 -62 -23 34 36 5 71 44 -18 -39 65 -44
2230d4O9M0p6N7j01J20o4R0j17O8l5k3N9l3O5p0o4p3R1k9M8oKJ9nk5j3R1l6K3
$$ -44 25 65 -11 46 -55 65 1 91 -26 42 7 -16 43 10 75 5 -59 -132 -41 -70 -22 -28 -26 -7 -12 -37 -50 41 5 28
2260B8Q2p0n0K5k9Q2q8Q2p9K2j04K11k00J67o6r8J8P1l5P2Rj74J77r0j3N8O0j
$$ 28 110 40 -10 15 -14 68 -20 62 -17 5 -99 112 -88 79 13 -85 -67 4 -31 41 50 -124 53 -37 -50 8 68 67
2288F7j13J38j59q1J80L2m2J9r4J09q9J6R0N8j43J33k8j48J32mj8j08R6Q7r0j14
$$ 67 -46 92 -67 -148 32 64 22 41 -53 56 -33 -17 73 131 -12 121 93 -55 77 73 55 -53 43 130 40 -74
2314g4R4n7R3r4P1j06J11r4J2n1O9O3l6j2j8N3j25J34Oj6q0K3N2J0j37J55q7j7
$$ -74 20 -37 56 -38 33 -73 38 -56 -44 -95 -26 37 1 -11 -29 24 -101 33 39 23 -57 -34 18 28 -109 46 -41 -58
2342e8J9PJ3M5M9j54J00j7K4J44j66o3J51j38m7J48n1r7J07k7l9J63k60J55Q1
$$ -58 -39 -32 -19 26 75 -79 21 4 28 172 6 -57 94 -44 -91 57 6 -91 16 -11 -50 113 -147 8 89
2367H9j34q5J98k39L4J18nJO1k7j07Q3J7rRJ7m9L1q8J19J2N0j44K10k02J34p8
$$ 89 -45 -130 68 -171 -137 -19 -24 -23 38 11 -96 -13 4 -5 4 21 -28 3 -85 34 46 96 -48 162 -40 94 16
2394A6p6J29j28J9l2k2J89r7k8J7K6L3q3J31k31J36pN1L3m5M3o3l2p6J4L8k5J59
$$ 16 -60 69 -59 -40 -72 -94 95 -2 -30 -13 13 46 -37 94 -137 -1 -8 43 76 31 74 11 -21 -97 -83 -45 -70 89
2422H9m5m1r9N6L3m9Q3J5J2l9j29P4M7N8q2J00l6j29J82p8q5L1NL3m1nL4M6P4
$$ 89 44 3 -96 -40 -7 -56 27 42 54 15 -114 -40 7 65 -17 83 47 -82 100 22 -63 -32 -27 6 -35 -40 -6 40 114
2451A14m5rq7N7j9Rj2n2J75j99N8n7j2J4rJ40j53J46j37P9Nn1O7o3O4j32J4J56
$$ 114 69 60 -27 30 11 20 8 -44 131 -68 -10 -67 -79 -65 -74 66 -87 59 -78 1 6 -45 22 -41 23 -109 -95 61
2479F1j68Q6O7j08L9l3J34Pq4J4k1m9j8M6R5j21P5L0n0m3k9J27j00Q2p2R0j80
$$ 61 -107 -21 46 -62 -23 -56 78 85 1 15 -6 -55 -73 -27 68 -53 22 52 2 -41 -70 57 -43 39 -33 57 -123
2506a23RO1J13p8pJ25j09k4pmM7J9m2nN4J0q9L6L0Nj41J47J7JO2j27L1n4K2q2
$$ -123 -114 -53 60 -18 -25 100 -9 -33 -40 -44 3 22 -20 -25 29 39 -50 -14 16 21 -120 27 44 45 107 -20 11 -43 -21 -103
2536a03M6k9L6K2l2M8K7p7J08J3j6o1N3j79N7J62p9J43q1Ol4p6k8J64j14Q3j79
$$ -103 -57 -86 -50 -28 -60 -12 15 -62 46 59 43 -18 35 -144 -87 75 -4 139 58 64 30 -46 -74 90 -24 59 -120
2563a20J20jN9j09M6P0L5j33O2j66O5P1L9l4r7J68j46k0l7R3M7k5J17j35L9J5
$$ -120 0 -1 58 -51 -5 65 100 -33 29 -137 -72 -1 38 4 -93 75 -71 -91 -128 -35 12 -13 104 -31 8 23
2589B3M7k7p8o3R7Qo0n4J38n4J0J73j24j3r0J60kl5q1M6l5L8j2k5J9K9O9m2l9
$$ 23 70 43 -35 -98 -1 7 -53 -107 31 -23 -13 160 36 23 -67 93 91 56 -25 21 -14 24 12 -13 6 35 104 62 23
2618B3j24J75j04L7Qp3J14k3j06J34l6J18k80Q7K8j3j1J53j32j03J41R7j21P3
$$ 23 -101 74 -30 7 15 -58 56 33 -73 61 25 143 -137 -50 -22 -35 -46 107 -25 -128 13 110 -11 62
2642F2L0j13k7P4M4r5N1n1J6O0m7L2m1M6j0o3K5k4qrK8j05J57Rj44J04j07M1n8
$$ 62 92 -21 -48 26 70 -25 26 -25 -9 51 4 36 -5 41 31 -32 -7 -31 -39 -48 -20 -125 32 41 -103 1 -106 -65 -123
2671a23J05Q2j55K28j69M2l3qP8J6L5j03J00j12n7J81r0k7J7K7k5L7%q2J02O4
$$ -123 -18 64 -91 137 -32 10 -23 -31 47 63 98 -5 95 -17 -74 107 17 -10 7 34 9 46 46 -36 66 130
2697A30j92o1L4Q4J4p6J49r2K9OK4j18P5j0M2j9r7J68j58RL6N1M4ql6K7n0O0k4
$$ 130 -62 -123 -89 -5 9 -67 82 -10 19 25 49 -69 6 -4 38 19 -78 90 -68 -59 -23 28 72 64 28 55 5 65 41
2726D1K6j19Q1q2J02j2J14j60M1M6q0j7M2lOm2N5o1k4J10J6k4n0K9n1j3K1%J39
$$ 41 67 -52 29 -53 49 37 151 -9 32 78 -2 -19 23 20 26 -16 39 -22 -46 64 80 56 6 35 -16 -29 -8 -8 131
2755A31j57J7m3r0K57j46J5p0N0Q4j21P5Lk7N0j9L1m1jn5M8m8O3J5p1Q3k0M0j35
$$ 131 -26 -9 -52 -142 115 -31 -16 -86 -36 48 -73 2 5 -22 28 9 40 -1 -2 -57 -9 -57 6 21 -50 33 13 53 -82
2784h2J39nj1m7m6J01n9k9P6m3M3m9j5j17K33j93J32m6l1N7k0p9J17K4p2n8P2
$$ -82 57 52 41 -6 -52 49 -10 -39 37 -6 37 -12 -27 -144 89 -104 28 -18 -49 8 -12 -91 26 50 -22 -80 -8
2811hrj4MJ32q0r6J15K6q9J11J02j33m4q7k0J0Q3l3M1Jn6P5j45J76J25k61J2L8
$$ -8 -17 -31 -27 105 25 -71 44 70 -19 92 194 61 17 -70 -90 -80 3 -30 11 12 -44 31 -114 62 187 -74 -62 -24
2839b4P5o0j2m5J02m8l2LP5M7o3L3pj60R8j6J76j41O8j23N4N4k7p6J08lk0o2k8
$$ -24 51 -9 -21 -66 36 -12 -44 -41 34 81 18 51 44 -116 -18 -34 142 1 69 -54 0 54 27 -49 59 56 36 -26 -54
2868e4L3M4n0J06j04M4j24O9Q6p5N1q5R9j38K53j72k2j2j4K4N7n2N1Q0L8o1j81
$$ -54 -21 23 -27 79 -25 19 -105 -36 50 -25 26 -59 40 -98 155 -17 -39 -51 -65 -41 16 -36 15 95 133 72 -109
2895a09J21J00j55J17n6J4l2Pk1%J74q7m4J00j07j9m3Q9k0K8rlK2q0mO0k04K00
$$ -109 12 112 -43 74 18 32 0 7 -14 -14 160 73 29 129 22 3 -40 49 29 57 48 45 67 -13 -17 43 -161 39
2923C9M4p9J2L4j0n2Pp8R5l7k3J5J8N8j2k7K7J0K2q8J7J13r0j9NM4q8J55j06K7
$$ 39 83 4 16 50 40 -12 -5 -83 12 -25 -48 -33 -15 43 31 4 31 41 63 -25 -8 105 15 -4 1 45 -43 112 6 33
2953C3j8kn2N7l6j3L0O9j1p1O1q4R7K1m6m3R6j28l0k4R1OK4J42k72J59j90LQ6
$$ 33 15 13 -39 18 -18 -31 -1 68 57 -14 47 -37 60 81 35 -8 88 -40 -70 -94 -3 3 27 169 -103 56 -134 -131 -45
2982d5M0o3M8J21nn3J3N7j24J09j00J54j10k2o9J06N0k2r5M0K6p5Q0o5Q2r7L3
$$ -45 -5 -68 -20 101 96 43 56 113 -11 98 -2 152 42 20 -49 57 107 85 -10 30 56 -19 61 -4 78 -19 14
3009A4M8n1q2P3q0J68j81Q0oP5j33J0M0Q0K8j41R5M3k3j7K2J7o0n2R3l8p3k4Q3
$$ 14 62 11 -71 2 -78 90 -91 -11 -17 58 -75 -65 -25 55 83 -58 37 80 57 40 62 79 19 -33 60 22 -51 -75 8
3038Hl9J24m8o5oj3Q9k0j11O7P8k9Qp8Q4l6K6j0j05N6n6mO7j5P4q3j0oJ0Q5j19
$$ 8 -31 93 45 -20 -26 -39 50 30 -81 -14 64 35 43 -35 49 13 39 29 -76 -20 -76 -80 -13 -28 46 -37 -47 -53 -43 42 -77
3069g7L0lQ7L5j07L3P7o1m0M0p5LN3M1L0j23K00k16L0k2J4qR8l2J5l3j21L1J7
$$ -77 -47 -50 37 72 -35 -2 75 14 -26 14 -61 -58 -5 36 66 -57 143 -73 -43 -65 -51 -59 39 7 22 -11 -132 -101 -84
3098h4J11L4o2K6O6rp5O2k1O7j64j1J01l5j57K05q0N2q8J22j51Q5M3r4M5j7J5
$$ -84 27 61 -1 25 91 82 7 69 48 115 -49 -60 41 6 -151 54 -26 26 -62 60 -91 -6 37 -57 -12 -29 -14
3125a4rQ5m9j6M1l2j8o4N0M0QPj12JN3o8J00n8J68n2o4P3o4p4L0M5nP4o9o2nJ27
$$ -14 -23 62 13 -3 38 6 -12 -76 -26 14 22 29 -83 -82 -29 -97 3 -55 113 61 -3 70 6 -68 -38 7 2 76 7 -55 -60 67
3157F7j15m6kJ34K0k1Mm9P6j34M0N9j01J23j7l9r2P6ln9M2k4L2M7p0j0J04o2Q
$$ 67 -48 -94 -96 38 58 37 41 -8 68 -66 -26 33 -68 55 38 -1 -93 -17 -20 -79 -37 -61 -29 18 -52 -62 42 -20 -12
3186a2K3N1k08N4Q1J1J23k03J56j18p2Q7J9kO6j72J89q4J16j60K4p0K02j36p7
$$ -12 11 62 -146 -92 -11 0 123 -80 76 -42 -114 -27 -8 -10 56 -116 73 -11 105 -55 -31 -101 101 -35 -112
3211a12J21J3jP0q8L3on9J12j20N6m0o0oP4j09J16lM8p9m0J3J01k9q1J55m4p8
$$ -112 9 22 21 91 3 36 30 -29 83 -37 19 -21 -81 -87 -13 -122 -6 -9 39 -40 -80 -67 34 5 -76 79 35 -43
3239d3P7j14M8R8K7j67Q0j5l7J4L2LK8M3j5l7K3L3j35j1N9m7J38r8P4o4K3j37
$$ -43 34 -80 -32 66 93 -74 6 -9 -46 -32 0 3 31 74 59 22 45 78 -57 -68 -9 -56 82 -16 58 -6 17 -120
3267a20J18K3R7o0mko3k5J18O9j83J00l4j04O2QRm8M7Rr7J50j40poJ81j71O3P8
$$ -120 -2 21 118 58 54 52 -11 -36 82 151 -32 68 34 -70 -8 0 9 -39 8 17 -80 70 -70 -77 -83 98 -73 -10 68
3296F8n0K3q7M4K5n9K5j9Q5%q5O8j00M9K8J01j54J6l0J5l3O3l2m8J15J6j02J44
$$ 68 18 41 -46 -2 23 -36 -11 -30 55 55 -30 38 -62 -13 15 116 -38 -22 -52 -37 -70 -7 -39 -87 28 44 -58 86
3324H6j12P0o3Q5Qj08n8J21j27jP0J1J6n8J41l0m9r1O6QJ15o9Rn0oj7P2p3k5J9
$$ 86 -26 44 -19 66 74 -34 -92 29 -98 -99 -29 -18 -2 -60 81 51 2 -89 -23 -15 100 31 40 -10 -16 -33 39 -34 -59 -40
3354d0P8o4J5l1J78q7p6l9L9r3M6J9n1o0L3J82m9K5r2J74q9mmP2j23l4Q7j14N6
$$ -40 38 -26 -11 -42 136 49 -27 -66 -27 -120 -74 -55 -106 -166 -133 49 0 25 -67 107 18 14 10 82 -41 -75 12 -102 -46
3383d6J8j8j9j2J28n0r1L9J20j07J57k05M7N0pnL8jn7l2M7R8j40J32n0q0J21j63
$$ -46 -28 -46 -65 -77 51 1 -90 -51 69 -38 119 -86 -39 11 4 -1 37 36 -21 -53 -6 92 -48 84 34 -46 75 -88
3411h8J13o9M4O6j75J47R8k28M3O7L8r6J6J42j58QP3o1M2o9L2K4L5j1n7O7p8J2
$$ -88 25 -44 0 66 -109 38 136 -92 -49 18 56 -40 -24 118 -40 -32 41 -20 22 -47 -15 9 44 33 -24 43 -35 -23
3439b3j7L9j20M0R8K8r0Q4j03J28j00J36K7j53j1J6j0Q4J3p6k7l3L5m7J11j5r2
$$ -23 -40 -1 -121 -81 17 45 -45 39 -64 64 -36 100 127 -26 -37 -21 -31 53 66 -10 -37 -70 -35 -82 29 14 -78
3466g8nP7l5L7kL2o6J00o5l1j6J50j13mj2L7N9m1K7Ol2qL5k2No0J4L9n9L6Q2m9
$$ -78 -83 -6 -41 -4 -6 26 -40 60 -5 -36 -52 98 -15 -19 -31 6 65 24 51 57 25 17 52 30 35 -25 -11 28 -31 5 87 38
3498C8J3j1n4on6Q6N7jj65J04J4l1K2O0j4n3k6k6K4j14P6R7l3k2M3r5N7L9Qj05
$$ 38 51 40 -14 -20 -76 10 67 66 -99 5 19 -12 10 70 56 3 -23 -49 -25 -139 -63 34 1 -21 22 -73 -16 23 31 -74
3528g4J23Jk3m3J8L4o8QJ14j9L6j03j5Q1k1o7j3O9J6n6o7R4m3O0q6M5Q0r7Rj5
$$ -74 49 50 27 -16 2 36 -32 -24 90 71 107 4 -11 70 49 -18 -31 38 54 -2 -69 25 -18 42 -44 1 81 -16 -7 -22
3558b2Q2K1j39J4N3j08J51o6m0O1r1Q8M9j14l6J40l2k5O3j7p4J0K3rJ8qK0J1l4
$$ -22 60 81 -58 -44 9 -99 52 -14 -54 7 -84 4 53 -61 -97 43 11 -14 49 32 -42 -32 -9 -18 0 -8 12 23 -11
3587a1q9J07r1J33q6P8L3j05k7L7Q7j7lj57Q8J29j35J3qn9R3on7nl3J20J9n3k3
$$ -11 -100 7 -84 49 -37 41 74 -31 -58 -21 66 49 46 -111 -23 106 -29 -16 -24 -83 10 4 -53 -58 -91 29 48 -5 -28
3616b8O1Q2r6L2j11L4lJ16j71M6Q5L8n4j25J68j42q3O1OJ43k6n8n7L7QJ8j35J93
$$ -28 33 115 19 51 -60 -26 -29 87 -84 -38 47 85 31 -94 74 -68 -151 -90 -84 59 33 -25 -82 -45 -37 -19 -154 39
3644C9L8O8p2j15J92j46Q6o1J45k61K53k37m7P7j2Q3o0J8jP3J9j3o4K4R2j87M5
$$ 39 77 145 73 -42 150 4 90 29 174 -87 166 -71 -118 -41 -53 30 -30 -12 -13 60 79 66 2 26 118 -69 -24
3671b4m3K6l4P8mP2j03o3K74l29J56q4J21j34J05k9m3n0L8M1J60j68M3Q9n8m8
$$ -24 -67 -41 -75 3 -1 71 -32 -95 179 -150 6 -78 43 -91 14 -15 -58 -108 -70 -29 131 -37 6 95 37 -11
3697a1O7O9j29J9M3J1j71J8M3n9J06J1m2J7Nk0L5M7n3j11P2J30j47M1N8l4m7m9
$$ -11 56 125 -4 15 58 69 -102 -84 -41 -100 6 17 -25 -8 -3 -23 12 59 6 -105 -33 97 -50 -9 49 15 -32 -81
3725h1O0j0l8J11pjj3q1L7K7m2L7PMo9N8k3RL0l8M4rl1O0p1o4J04j02JQ9j0N3
$$ -81 -21 -31 -69 42 35 34 21 -60 -23 4 -38 -1 6 10 -59 -1 -24 -15 15 -23 21 12 -19 41 -30 -94 10 -92 -91 -2 -12 41
3757D1p3O8q9l1J34j01Q5p1M9qoR1p2r1O6j04J26K6n4N3K0l6K8l9k5rJ05j16Q6
$$ 41 -32 36 -53 -84 50 -51 34 -37 12 4 -2 89 17 -74 -8 -112 14 40 -14 39 59 23 51 12 -13 -22 83 -33 53
3786E3r2nP4N7j24J15l5N5nj20M0o7R1j07J30l0k1Nn3l7M5Pq2J65o1p4M0Q1J0
$$ 53 -39 -44 30 87 -37 78 43 98 93 -27 13 -54 37 -70 60 30 9 14 -39 -76 -31 -24 -106 59 -2 -76 -36 45 55
3815E5L5q3m6N2R0j37M5l9J21m7j30MJ5Q8M1j39j8J70k4pK9o1k1L6j4j8o4No9
$$ 55 90 7 -39 13 103 -34 11 -28 93 46 -84 -80 -65 23 64 -75 -93 77 53 46 75 14 -7 29 15 -3 -67 -62 -131
3844a31J25L0m2q%l8Q0M0n9o8l0J25O1M5k20K3K0O4Mj21J13n0j4L2M2O1r1J00
$$ -131 -6 24 -18 -26 -26 -64 16 56 -3 -71 -101 24 85 130 -90 -67 -47 17 21 -100 13 -37 -51 -19 23 84 -7 93
3872I3j39J1J03q7OM1j20K37j97L4O7q3k7K3P1k5j12J55p4k8N8j1j08O0mR4n3
$$ 93 -46 -35 68 -19 -13 28 -92 145 -52 -18 49 -34 -61 -38 33 8 -104 51 -23 -51 7 -4 -112 -52 -56 38 -15
3899a5J22j12q3J36r8R7k2R5j26o5Q9J7q4J5J05o6J4j0M7j57Q6j6k8P9J9n3j11
$$ -15 107 -5 -88 48 -50 47 25 120 -6 -71 18 35 -49 -34 71 5 19 9 56 -101 -15 -31 -59 20 39 -14 -125
3926a25J22m7L9m1k6N7j6M7j0L3j05qQ8%l3qJ0O9L4l4j16Q7p3J8J4N9rp8Q5j2
$$ -125 -3 -50 -11 -52 -78 -21 -37 10 0 33 -72 -80 8 8 -25 -33 -23 46 80 46 -70 17 -56 -38 -24 35 26 -52 33 21
3956B1l3m8J1j00R8k6P0K9o8J78j4j05%P8j20j02Q7k1jO6Q9j15N1nk2n2Q5M4j33
$$ 21 -12 -60 -49 -149 -51 -77 -7 22 -46 132 118 13 13 91 -29 -131 -44 -65 -66 0 89 -26 25 20 -2 -54 31 75 -58
3985e8M9jk3kR6j03R7q3M5p6j8R6j23J82j79JJ72q8J14j14J6l0M5N0p8n7J07l7
$$ -58 -9 -10 -33 -35 61 -42 55 -28 17 -59 -77 19 -104 78 -101 -100 72 -16 98 -16 0 -30 15 65 -13 -70 37 0
4013@n3NkR8j28J8J13q6%n4K05Qj32rm6k3M3pQ8k1j28J34o2O8j7MJ5j14J03q5
$$ 0 -53 -48 -50 48 -80 -62 51 -35 -35 -89 116 124 -8 -17 -63 -86 -43 -50 38 17 -111 23 -39 29 12 16 31 -83 20 -65
4043f5J26n9Q6M0j93Q4M6j10N6K3J24j73R3r1J37k03K25o6j18RO7q8J6Q2p9j7
$$ -65 61 2 88 128 -65 19 65 -45 11 34 158 -15 78 -13 124 -79 146 80 -38 -29 38 -50 -34 48 -31 -48
4069d8R3M9j70J19m1j31R2Mj4J33n9k2o3J00p0J46j13O7o9mr8K45l15K07q1m8
$$ -48 45 94 -76 43 2 -129 -37 -33 -47 86 27 5 -58 42 -28 118 5 72 3 -1 -99 146 -169 38 -43 -91
4095i1J67q1pp8N9J10%r6J19q2KK5M0j23Mm3J4M5l4J41j47P1n1J06r9j0k0m1J65
$$ -91 76 -5 -12 -90 -31 79 79 -17 102 20 22 47 87 -36 -32 -75 -61 -16 -50 91 -56 15 -36 70 -29 -39 -59 -100 65
4124F5j5j8o1K4j3N7k4l7m9J03O9j85L6J39n4k8j5L6r8rJ04j00Q9r7Q9M8r7O3
$$ 65 50 32 -29 -5 -18 39 15 -22 -71 32 101 -84 -48 91 37 9 -6 30 -68 -77 27 -73 16 -81 8 56 -41 22
4152B2J06j38M9Rj8M8j24J09Mo2n8J80j12Jm5l2R7K5n1Mn6N6O4j25R1p0LK4j7
$$ 22 128 -10 39 48 30 78 -46 63 67 5 -53 127 15 16 -29 -61 36 61 10 14 -42 14 78 -47 44 -26 -23 1 -16
4181a6q3Q9j20K03j21nk1O0p9Q0L5r5m6J68j08O2k6O7k8j8l9P5j4j04J38J8j31
$$ -16 -99 -10 -130 73 -48 -53 -74 -14 -93 -13 22 -73 -119 49 -59 3 -23 44 16 -2 -41 34 20 -84 54 72 -59
4208e9J65q2J6n3Q2r6J54p5j16P5N5Qj32P8L4mO9p1j34j04R7K17j53l3R0J8j38
$$ -59 106 24 40 -13 69 -27 127 52 -64 11 66 74 -58 20 54 50 119 48 -86 -190 -93 124 -29 -62 28 46 -92
4235i2Q8J19j49p1N1N4jM1l3O2j01Q7o4j07K30k28K33k6j76Q0L2p0J7Q4p5P1r8
$$ -92 -4 115 -34 -105 -54 0 -1 40 7 69 -32 55 -9 -116 114 -114 119 93 -83 -3 29 -41 -24 60 -15 56 -42
4262d2J31r7q3J05L6j58J05J6n5L2MM9j23O2j5N5j8r3J26j4rr4P4M2l8O8p4mo1
$$ -42 89 -8 -91 14 50 -108 -3 13 -42 -10 -6 43 -80 -18 -33 22 4 -89 37 23 14 -80 -6 36 -2 66 -8 -12 -73
4291g3m5O0L9jM0J3k9O3k1j21R7L6o9q%J47p0j64R1K3j0P8r0l1P3l1r0Q5K6k48
$$ -73 -118 -58 -19 -20 20 33 4 67 46 -75 22 58 -11 -19 -19 128 58 -106 -15 8 -2 76 -14 -45 28 -3 -93 -8 18 -230
4321b30J88J27j24j9M0J04j8k9o2o0N2rqJ5P3j13R0p9L7j13R5L2N9m8n3jK8k4
$$ -230 -42 85 -39 -58 -18 86 68 39 -23 -83 -31 -40 -48 -33 40 -73 17 -62 -25 -138 -43 -11 48 0 -53 -54 -26 -50
4349e0P1m2M4m8o7K02j09Q3j23J01j31L5J30p1k2o3N0mPo8Q6l8M5L9p5m3l3Q6
$$ -50 21 -21 23 -25 -92 110 1 84 -39 62 -69 -34 96 25 3 -60 -10 -14 -7 -75 11 -27 18 57 -18 -61 -94 -8
4377hJ1rp4J18N5p0r3J16l2k3n1J01K2n2m4l2LJ42j04K0K9l7j27J19N0p7J4K7
$$ -8 3 -6 -80 38 93 23 -70 46 14 -9 -60 41 63 11 -33 -65 -62 80 -24 -4 25 -12 -139 -20 30 -47 -33 -6
4405fkQ4p1l0nM3o3L6o2J07J5l9npj3K1J22q4l7k4M9l6ll6O0o2kJ74p5o3L9j9
$$ -6 -8 76 5 -25 -30 13 -50 -14 -76 31 46 7 2 -5 -18 3 125 41 4 -20 29 -7 -10 -46 14 -48 -50 124 49 -14 25 6
4437FO3q4Q6j6p5k8K5M5o2m6J08j5n8LR8Rl7pj9NK2l5J4J11j3q8on9J16p0j0O9
$$ 6 69 -15 71 55 -20 -48 -23 22 -40 -86 22 7 -51 -48 50 59 22 15 -4 1 23 -12 2 113 100 12 6 -53 63 -7 -17 52
4469E2j9P2r1j09NJ07L2n5m2L3J3l5q4J16L2k9Jq8K4Q7n0O2p4j6K6O3n1N5j3N4
$$ 52 33 105 14 -95 -90 17 49 -6 -48 -15 -2 -37 -121 -5 27 -2 -1 -89 -65 22 -28 34 -40 -56 -30 33 -18 37 24 78
4499G8j36R9j4N5m6jJ8j3l0P8p7rN3l1lj52J55M4r0Q2p6j6rL5K1J12j59J32q4
$$ 78 -58 41 27 82 36 35 53 40 10 88 11 2 55 24 21 -131 24 68 -22 60 -16 -32 -41 -6 15 127 -32 100 16
4528A6q2N0j8j3J17Jq6p4J82r2J6Rm5K9r6J01j2R9j27P4M3j12L0N8N9j41On4N6
$$ 16 -66 -16 -34 -47 70 71 -15 -89 93 1 17 26 -19 10 -86 15 3 102 -25 49 92 -20 10 68 127 -14 -8 -62 -6
4557fQ6m5m2L6m0Kj2mj27J45L4q9J51j44l8J13o3J01n4M5o4j9K8ro8J35q0O2L8
$$ -6 80 35 -7 29 -11 -9 -21 -25 -152 -7 27 -62 89 -55 -93 20 -43 58 4 49 -15 -34 -6 -15 -83 52 -28 34 72
4586G2m4L2j6r8P3o7P4l0K5l8m5M7n7J06l1j04J51k6j0j54J41mQ0rj93R1R2oQ
$$ 72 28 60 44 -54 19 -48 26 -4 21 -17 -62 -15 -72 34 3 -101 50 24 14 -140 1 -3 77 68 -125 -34 58 52 60
4615F0k5N4m1j80K58m4k05J81r8L1L3j05P5K7o3N0mQ5lj05K4J6K2Lo2K6lN5q4
$$ 60 35 89 48 -132 126 82 -123 58 -40 -9 24 -81 -6 21 -42 8 4 89 86 -19 5 21 43 46 -16 10 7 62 -22
4644b2Jp9MJ74j76K11m8kl2j11P6m3O6j5Q1o0l2N3j25N3J4LQ3q8L9P0l7M8j00
$$ -22 -21 -100 -96 78 -98 113 65 63 31 -80 -4 -47 19 4 85 25 -7 46 -79 -26 -12 -9 74 -14 25 95 58 106 6
4673FRJ1p3K7O7j23J22r0J13m1j32J1Q9P0L3j37J33n6j11l4R6j6J34j29m6L1K6
$$ 6 15 26 -47 -20 47 -76 46 -44 69 28 -104 -93 -4 66 99 -38 95 39 -72 -106 -10 -26 108 -21 -67 -36 -10
4700a0nl9j8J13k5Nq5O4q1J6R0R8r3q0J08p8N9q5L7qM3L3k8m1r2J25%k0J5j8l1
$$ -10 -15 -54 -72 41 16 21 -64 0 -81 -65 25 123 30 -50 58 -20 39 -46 -9 -17 26 59 31 -10 -102 23 23 3 18 0 -31
4731c1O1J15j77M4lR3j66no7J49K1m0j41P5K18j40Q2q6j2pJ9j6l9K6O7j84N0J24
$$ -31 30 145 -32 12 9 102 -64 -69 -136 13 34 -6 -147 -72 146 6 88 2 -10 -17 2 -14 -53 -27 40 -144 -94 30
4759C0o3Q6k2l3M4n1j1lj9J37k02N7R4o1m4l4J44J04j65l3J8M6j31R5k7M1K7j05
$$ 30 -33 53 31 -2 42 -9 -20 -23 -42 95 -107 -50 44 -17 -61 -95 49 153 -12 -45 -27 19 -112 -17 -44 -3 24 -81
4787h1R9p0J47n1m5QK1k1j8K6nnk9Knn6J24m5l6M5m4L9r7J46L8q7K1m0PO1p2L3
$$ -81 18 -52 95 44 -1 7 28 7 -11 15 10 5 -24 -22 -27 -83 41 -4 -40 5 -39 0 -97 49 87 0 21 -19 -12 49 -23 10
4819A0l3N4m0jP9k3mj38R9l0N7kj21P2J66j74O6kK7o0J1P0n3O7j21P9o4K9L3k4
$$ 10 -23 31 -9 -10 69 46 42 -96 3 -27 30 28 -93 -21 145 -29 37 35 62 2 13 83 30 97 -24 55 -9 20 53 29
4849B9k2J6n5N2qm3L6j84J94J6m6QK0N3r5RO4j48J78j18J10K7j47J2PK1J07r9
$$ 29 7 23 -32 20 12 -31 5 -179 15 31 -15 -7 13 66 -29 -20 44 -104 74 -44 66 93 -54 -42 -35 -14 93 -6
4877fK4J1n0O1k1mRL4r3Q4L5n3l3L0n4J44qn2l3Kj6O6o2ok2MO3n8J7OL0m4rK7
$$ -6 18 29 -21 40 19 15 24 58 -35 49 84 31 -2 28 -26 118 110 58 25 27 11 77 15 9 -13 -9 54 -4 13 19 49 5 -4 23
4911B3o2O5m8M1l4Lp8R6M2r2m3jJ26o9R7q5R2j38rJ03L2k8N3r9L0J3O4r3m3R0
$$ 23 -39 26 -22 19 -15 -12 -90 6 48 -44 -87 -88 38 -31 66 -19 73 -65 -74 29 61 33 86 -13 17 30 94 1 -42 48
4941D8m1K9r4l8J04m4O7p4M3M2k9p6k5O6j8p8P2J00J0Kj03J02p1j8k1l3J42l4
$$ 48 7 36 -58 -96 8 -36 31 -43 0 42 13 -63 -88 -22 -40 -118 -46 54 64 66 -37 65 -6 -24 -45 -78 64 30
4969C0o8P0Q5j22k2m6J38n6o9J13k9Q0r5j9Q2q2Q8p7r5J08j5j5l7j2J16k9q9J09
$$ 30 -38 32 117 -5 -27 -73 65 9 -60 53 24 104 9 -10 72 -10 78 1 -94 14 -1 -16 -53 -65 51 22 -67 42
4997D2o0k9ro9J50K9j8j17J0P2N0p7L2J7RL2mr4K7M3q3J94j20r9M8J6l1J6k5p3
$$ 42 -18 -47 -56 -125 25 54 36 -81 -71 1 51 -26 6 23 32 64 60 -34 -7 36 -47 147 27 -72 -24 -8 -39 -23 -48 -121
5027a21R6k7J04k7J6p7qK7Kk3J10M1j25nO1m4j12J51p9P8P6j08M7Q4j30J7M4Q
$$ -121 -25 -52 52 25 41 -36 -44 -17 -15 -38 72 113 -12 -17 44 0 -112 39 -40 38 114 6 53 137 7 24 68 76
5055G6l3p4J07o8nn8J9p5K06pL0j54K3J7M3m6M9l8j2j1N5o6n0J60m3j45L0O0l7
$$ 76 43 -31 76 8 3 -55 -36 -111 95 88 118 -36 -13 4 47 1 50 12 0 -11 44 -22 -72 88 45 -100 -70 -10 -47
5084d7q2L8L8J90j41l1J01K7l0jJ3j0M1j61L7M5j5j9%p9kM9rJ74j62M0o7J66m4
$$ -47 -129 -91 -53 137 -4 -35 66 93 63 62 75 65 106 -55 -18 27 12 -7 -7 -86 -88 -39 -48 126 -36 4 -63 103 59
5113E9K0j04M1MJ5M1p2k7R9l2q0l3L0qM0l1n9M5N4K1r3N9k8P9m3K5L9n6J19j92
$$ 59 79 -25 16 20 35 76 4 -23 76 44 -36 -69 -39 -47 -7 -38 -97 -52 2 23 -70 -11 -39 40 -3 22 61 5 124 -68
5143f8J22l0o0K9j66J89o6J6q9J18j05J14m8P1q4J09q2J5J3Q2n6j9j13J03lm0
$$ -68 54 24 -36 -7 -173 16 -50 -34 -123 -5 -110 4 -44 27 -57 52 -30 -15 -2 80 24 5 -108 -5 -8 -48
5169d8j3J35j43p4J58l6l8q8J17J29Mo1l2Jo6J02J8j31K4N4J2p7n3J85n2k3R4
$$ -48 -61 74 -69 -143 15 -21 -59 -147 -30 99 103 42 10 11 -55 47 65 -66 -42 12 24 -53 -106 79 27 4 98
5196I8J2j99K0L0pO9j07QJ91j71J17q2k8P3J3k0q5J14Q7l7j33J4rk8J39k47K01
$$ 98 110 -89 -69 -39 -46 23 -84 -76 115 -56 61 -21 -49 24 37 17 -68 46 133 96 -37 -23 -32 -60 79 -168 33
5223C3J9r7J68o7j05Mj06K08o0N7q6J0K0K0P2p0l7L6J4k4j23R6P7Pq1k3R8j11
$$ 33 52 -45 123 56 -49 -45 -151 57 -3 54 -32 -22 -2 18 90 20 -17 19 33 9 -114 -18 59 66 -15 -38 60 -51
5251e1j7Q5nJ9n7R9l6Rn0l6L3j1J9k3P9pj2K7q3L9j35R5N1Q5l5j73R1K4M6n0k1
$$ -51 -68 17 12 31 -26 73 37 46 -4 -40 -7 -18 1 -22 57 50 38 65 -18 21 -114 -19 32 117 82 -91 0 24 70 20 -1
5282aQ2j19J4J7k6p6K2O7j8JK2n8O4Jo7J94j23Ln5R3L2j43K19k27O9K1M0Q6j89
$$ -1 81 -38 -24 -7 -33 -109 -87 -20 -38 -37 -15 -73 -9 -8 -75 119 -4 -1 -56 37 69 -74 145 -82 -13 8 48 134 -55
5311e5O7j9k7%K1k1N9j69K41q3K2j46Q2Q9k5l7q6n2K29r4j11M7J4L2L7j1j10N9
$$ -55 12 -7 -34 -34 -13 -34 25 -144 97 14 36 -110 -28 61 36 -1 -87 -139 90 -4 -115 -68 -54 -22 15 4 -106 -47
5339d7NJ44j16R3k2j21Q3n7J5m1p0J40Q3q0m7O5l6K0O0p9M0j41R7PL5o0J41j78
$$ -47 -42 102 -14 79 57 -64 19 -38 -23 -64 -134 6 89 9 -38 27 -9 11 71 -8 32 -109 -12 -5 30 -30 111 -67
5367f7LJ19j11k1J55p4n1L8j03J01m6N2l9l3J05N5n2N6j6p8k4K5M3k8L3j08R9
$$ -67 -64 55 -56 -77 78 4 -47 -9 -112 -11 -57 -5 -44 -77 28 83 31 87 71 -7 -31 -6 37 9 42 -66 33
5394C3o5J0j9O3RO1j35P3QR0j94O3P2r1m1O8JK5q3O0j54J45M9o3K4%L2j5o5K9
$$ 33 -32 -22 -41 22 31 92 -43 30 38 128 -66 -3 69 -22 -63 5 6 31 -52 8 -146 -1 48 -15 9 9 41 26 -39 -10
5424a0Q9j00K0L6L4n2K1o9l5n4P5Q3j2o5qO8l5jN7j54J14J3o8N7M8q5K7j24J54
$$ -10 79 -21 -1 35 69 17 38 -31 -66 -120 -45 38 26 -39 -47 21 -14 -15 42 -112 2 15 -53 4 52 -33 -6 -130 24
5453B4j35kM4Nl6J92j05N0k6j9l4j2J30p3Q8q3q9J8R4j28J91p3K0j27P0l5K04
$$ 24 -111 -113 -69 -64 -100 92 -13 37 11 -8 -42 -54 76 3 91 8 -81 -63 31 -97 94 21 41 -86 -16 -51 153
5480A53j71N9kJ6p3M3j9m0J42j13N1n2LL5o6R0j12R1n6O4r3R7K6j11m4j6J25j44
$$ 153 -18 41 39 55 -18 25 6 -34 108 -5 46 -6 -3 32 -34 56 -56 35 -21 43 -50 47 73 -38 -82 -98 27 -117
5508a17J56rl2M8j12J03j6K6jl5j19J50m6k3L1O5j61K07j41K6k0l8J36q2j3J17
$$ -117 39 30 -2 46 -66 37 21 47 46 11 -108 42 -4 -27 4 69 -92 115 -26 0 -20 -58 78 -4 -17 100
5534A00k12J27r5J29K5r5L6J12j09j35J17m0j9K3J07J8Lk10Q8n0J31NmR8j38k5
$$ 100 -112 15 -80 49 74 -21 15 127 18 -117 0 -40 -59 -36 71 89 92 -118 -30 -80 51 56 52 150 12 -13
5560a3M0rOk4J7j9n7J15o9q8Q9j15J36j76J27J37r3O6kj80P5J47j08j24J52j50
$$ -13 27 18 24 0 17 -2 -59 56 -13 -101 -12 -127 9 -167 -40 97 4 70 68 -112 -37 110 2 -122 30 -120
5586a20J28o2Q2O2j33K22j20j6Qqm3K6K0q1OP6K5j55J51k2j52J48p0J3J9m1O9
$$ -120 8 -54 28 90 -43 179 59 43 51 43 0 26 46 -35 -29 47 72 -83 68 46 -106 42 -28 -15 4 -37 32
5613C2l5n6PJ10m4m5%N9k3p8O2j4O0M8j36J2J4J4K1R7j55P0N5LkL9j00o9L4PJ12
$$ 32 -3 -59 -52 58 14 -31 -31 28 5 -73 -11 -25 35 83 -53 -41 -27 -13 8 105 -50 20 75 78 76 115 15 -54 -20 -13 99
5644I9j43P0Mm4j0MKn8J30Kn1M1J0k2p2j9J00p6P6j22J17l5m8k9R6o1J0LJ91j58
$$ 99 -44 26 30 -14 -24 -20 -18 -76 54 56 5 46 56 34 -38 -57 43 -33 43 -79 38 3 -45 -74 22 -39 -29 -26 165 7
5674GJ3M4K1q0oK3k1Qq8%R8p2R3k7j1R3p9O4k3J3N2j66L4L5j39J08M9k4N1j13
$$ 7 20 64 85 5 -1 22 1 9 -79 -79 19 -53 40 13 2 95 16 80 57 70 122 -44 -10 25 -114 -6 43 19 70 -43
5704d3l3L6J24j30J61j01K2m3M4k9j7J15j03M4j7OL8j09P7j20M1J22j10M0l6K0
$$ -43 -76 -40 84 -46 115 14 36 -7 37 8 -9 106 3 47 30 36 74 -35 42 -78 -37 85 -25 15 -21 -1
5730apJl3%M5J03j28J5L1j8q2J00j0N6j27Jn4K74j73m1N3Rk3L5j5K9o2j37J68
$$ -1 -8 -7 -40 -40 5 108 -20 -5 26 8 -74 26 16 72 -55 -54 -108 166 -7 -48 5 14 -9 26 11 40 -22 -159 9
5759IN8j60J02O0%M4j62J65j33q1MJ81p0j35O9J9Q9o8L7n9k9LJ33n3o8J19n6N7
$$ 9 67 -93 9 69 69 113 -49 116 -17 -98 -94 87 17 -118 -49 -30 59 -9 28 -31 -60 -57 76 23 -45 74 18 75
5787G5q8k5L0n1L3j2Q3Qj5m0j32Q6L4N9J2L2n9r0N6k6Q7j9j06R8j0lm3K5O3j93
$$ 75 -13 -38 -8 -59 -26 -38 45 53 38 -2 -134 -48 -14 45 57 89 30 -60 -4 -30 57 38 -68 30 20 17 -26 -1 62 -131
5817a31R4Q8m8n6l4O2L8J0qM5j19K8L8M6m6J8R0j42J29j58K8K4r1N1Q3N8L4j85
$$ -131 -37 51 3 -53 -87 -25 13 23 15 60 -59 -31 7 53 7 25 115 -27 102 -56 -28 -4 -95 -44 39 97 131 -54
5845e4Q4jP6q5p8J3L2lL9M7j36J37j39N9K7O2oj38J24L9j25P5l1m6m4Q2j7J8r8
$$ -54 30 29 105 20 -58 -45 -13 -16 23 70 -66 71 -68 -9 18 80 74 -64 60 99 -26 49 18 -28 -72 10 -7 11 -87
5874h7L9Q2p2M6np5M9m4J8Q0o4O8j09N9M2po0RR3jn4L8q9m9K45j43p5O4o4J13
$$ -87 -48 34 -38 8 3 -72 -23 -67 -49 31 -33 35 -74 -15 27 20 -40 -31 62 61 7 45 -44 -93 152 9 -66 -2 -66 47
5904D7%k5N8N0j50j19J83q2J33j46J7P0l3N2j68K09j54M9Op1L7L6M4j12P3Q7o6
$$ 47 47 22 80 130 -20 -139 44 -38 95 -51 -34 36 3 55 -113 96 -58 -9 -3 -74 -37 -1 43 -69 4 91 25
5931B5P1j56l5Q4L2o0J6J00o6J33q9p5k5L6K9q9J33p7J1Q1r7jo7J38mj14l5J43
$$ 25 96 -60 -95 -11 21 -39 -23 77 11 144 55 -20 -45 -9 20 -69 64 -13 -2 79 -18 -19 -86 52 48 -66 -101 42
5959D2J5K6k17K5O0J07j49N0J28j72N0p7N6K4R7j44R4r9N4o5J49j05J4k1P9pj2
$$ 42 57 83 -134 -109 -49 58 -91 -41 87 -85 -35 -112 -56 -32 65 -79 15 -84 -30 -95 54 -51 -37 -58 21 14 2
5986BN9J2n3J4lm4j8j9n3O5o7M9J31j3m9J8q6J12k2m8l8L6oq5J27j01J02k5q6
$$ 2 61 73 20 34 31 -13 -31 -50 -103 -38 -105 -56 75 62 13 31 -55 57 35 -13 -51 -15 -21 -106 21 -80 22 -3 -89
6015h9J13n0MR3J0j23J38o2j37P8Q6q8k8%N7P8o8r9J87j3j12P2k2M3j50J86j70
$$ -89 24 -26 -22 71 81 -42 96 34 -103 -25 61 -27 -55 -55 2 80 12 -87 100 87 -25 47 25 68 -82 104 -66
6042f6Q9n0j8L1nO1j2j12P5rP3Mj50K8Q0L6J7o3jJ08j17k9rQ6r4R7Mj8l4L4k6
$$ -66 23 -27 -45 -14 -19 42 30 -82 -7 -16 57 61 -89 -61 19 55 72 9 8 116 -1 -30 -39 47 -47 50 54 36 2 36 10
6073A0N0j62J29N3j13K6n8J46Km5J9k4p9l5K4J19p2r8P6L0j75J30P9o8J6kP4m2
$$ 10 60 -102 27 80 -33 -7 -65 81 83 38 57 33 -46 -81 -57 62 -10 -108 -32 -2 -177 -47 32 -36 -20 -22 52 10
6101A0o8K8n7pN5R0q4j1J45r1l9M6L7j04J04j01rK1m2j01J45J3N8n0o4P7N5j75
$$ 10 -58 -30 -87 -94 -39 51 -33 -44 101 10 -29 17 54 -50 54 -47 -56 -35 -77 -178 -33 -20 38 -12 -76 1 56 -119
6129a19J84p1QJ31j80N4J27j51O1qj18R2P6r4R9p6j03J35Rj02p2P1Q1q8N1O5o9
$$ -119 65 -6 2 133 -47 7 134 -17 44 36 -82 10 86 -8 91 15 -88 47 56 -46 -118 -47 34 -54 -3 62 -7
6156gK6o8j2J36j39N5k7N4j78M4JQ6M1r7J17j3q0N7o9j0J9L1J25j35P5Mj36J18
$$ -7 19 -49 -61 75 -64 -9 -36 18 -160 -116 -115 -29 12 -85 32 19 -61 -4 -73 -83 -64 -33 92 -43 32 36 -100 18
6184A8Q1o1J9pl9J03j66qJ21m3k0r9J26r1k8l9P8ok5R2pn3O0n3O8%j45%O7P5L5
$$ 18 99 38 57 50 11 114 -52 -60 61 18 -2 -101 25 -66 -94 -133 -55 -61 -86 6 -1 -54 6 -47 21 21 -124 -124 -57 18 53
6215E3j1Ol6R5q2mm3Q4p4J6K6%QL0p3O9Nj63J60o6n0J39q5N9N3j22n9J12k8k8
$$ 53 42 48 12 107 25 21 -22 62 -12 4 30 30 38 68 -5 64 69 -94 66 0 -50 89 4 63 116 -6 -65 47 19 -9
6245ik2k9l2K02j18l9J65j05K5n7K8l0pM8L4q6j5L8JK1j3p8J50n7k5j4M5p1N3
$$ -9 -31 -60 -92 110 -8 -47 118 13 38 -19 9 -21 -28 20 54 -32 -47 -9 -8 13 0 -78 72 15 -10 -24 21 -50 3
6274CLL6r3nJ9j2J18l3l4k1O5l0n4r3J63PL3r9L1P7L1m0q2J06j05J03q5q7J99
$$ 3 6 42 -51 -56 -37 -49 69 36 2 -19 46 16 -38 -131 32 39 72 -27 4 81 112 72 -10 96 -9 94 9 -78 121
6303A21r6n3J11l2j30J34Kj42J43n5r7J53r3J17o5L8kR4p7J50k76J7K2J9nr4J73
$$ 121 25 -28 83 51 -79 55 57 -85 58 3 -94 59 -34 83 18 56 54 148 71 221 -55 -38 -16 3 -2 -96 77
6330G7j50R5%p7k1J5K6P5k4Mj17P8L7j4L0O2j06K0l5k8P0m7R3m8k2j0L6N6j08
$$ 77 -73 22 22 -55 -76 -61 -35 40 16 20 -97 -19 18 4 34 96 -10 10 -25 -53 17 -30 63 15 -7 -17 19 75 -33
6359c3lmM5n1Q5K8j02p3NQ6J02j47P9L2r5L2K6j14k7M4O3m5J10r8K0pK3L2K4j47
$$ -33 -36 -40 5 -46 39 67 -35 -108 -103 -17 85 -62 17 49 -46 -14 12 -102 -129 -85 -22 -67 43 -55 -35 -42 -19 13 37 -110
6389a10J05pJ19q1k3n5R6m7m9K9R0j08J00j9N0O1r9No6j25P5R3p8PL6m5rJ21r7
$$ -110 -5 -12 107 26 3 -52 44 -3 -52 -23 67 -41 59 40 90 151 52 57 -9 -134 -59 34 -44 -37 -1 -46 -55 66 -31
6418c1J2M4Rj14K7K7M5n0MR2q9O1MK5o4J2r3Q6l9K4r2J69K1m0O8O7j55l4Q0r6
$$ -31 -19 25 34 -80 -53 -26 19 -31 -27 65 -24 37 41 66 2 14 -79 7 -32 -8 -100 69 90 50 118 185 30 -4 76 -20
6448b0K2R6q7k9JJ2JKK1LP1m3N0p5m2M5j14p0J51M2m1l0J8j7J22j36%K0J5M6p5
$$ -20 2 98 11 -18 -17 -5 -4 -2 19 22 93 50 100 25 -17 28 -86 -156 -5 37 -4 -34 -16 -33 89 -47 -47 -27 -12 34 -41
6479d1N2k6k5O6j03m8J55j8j1l2oJ04k29J93k0J1N7q1R3j47NK7j4K6L6Pr2m2J17
$$ -41 11 -15 -40 26 -77 -125 30 12 1 -31 -37 67 -162 31 11 22 79 -2 91 -56 -51 -24 -38 -12 24 31 -61 -103 14
6508A4j64R3L7N8j07Q1r8P9n2J14p3J2J8R9p4k8N7m2K8Ok5j6l2k5M5M6o8J4o1
$$ 14 -150 -57 -20 38 -69 12 -86 -7 -59 55 -18 -6 12 111 37 9 66 24 52 58 33 17 -15 -40 5 51 -17 -3 -64
6537f4R7m6Q1j04O1j06J24k4o5N4J5J29j75L2j2N5l1j6r0J23j32J02O9q2j6N4
$$ -64 33 -13 68 -36 25 -81 43 19 -46 8 23 152 -23 9 -3 52 21 5 -85 38 -94 8 77 -5 -21 33
6563C3p5Q0LjJ8m0J6n9Q3R0n4q1O3J3k01J23p9K4K8J16j05K0n5n3L7J79j01L2
$$ 33 -42 38 41 40 58 18 34 -25 58 148 94 13 76 89 -112 11 -68 -44 -16 100 -5 15 -40 -93 -56 123 22 54
6591E4j4p3LR6r1k7J90k08QP1p2J05l6k7rN2m0K3l6kml5L4n6L4J76J9j08o3P6
$$ 54 40 -33 -30 66 -25 -52 138 -70 -62 9 -63 42 6 -21 -30 22 -18 5 -31 -33 -37 -72 -38 -94 -60 116 135 27 -36 40
6621D0j15P0p0k6R7L4n5N6K9kj17mR4r8L1Kl1K0N8o2J70j42J5J9P5j69O4l9l6
$$ 40 -75 -5 -75 -101 -4 30 -25 31 60 58 -59 -63 31 -67 -36 -34 -65 -45 13 -49 121 -21 -6 13 88 -81 -17 -56 -92
6650i2J95p6o9m3R0JK1j95J59j1J06Kj46K6Lp5P0j3M7J49j59M6j31P6k6M6J1q
$$ -92 103 27 -42 -85 5 6 27 -168 -9 -20 86 88 -58 -32 -29 -104 -34 -47 0 149 -10 36 -95 -19 -45 1 12 4
6678Dl5K7M4r0J59j32j8M2K8L2n3M6m1j5k0P1j22J08m9P4l8J3q3L1J43p1K0n6
$$ 4 -31 -4 40 -50 109 -23 -41 1 29 61 8 54 13 -2 -22 49 -73 35 -14 60 22 35 -48 -17 126 55 75 19
6706A9k0q5J71r8J23o2q7jNJ02kq3M1NN6q8l2L0k9K5jN0p9K1l4J25j39R4p7M8
$$ 19 -1 -86 85 -13 110 48 -39 -40 -35 67 65 -18 23 28 84 -4 -36 -6 -35 -10 -11 39 -40 -19 -53 72 -67 27 -50 -2
6736bM5j25Q1l8Q9j60Q8NJ0p1m3J37M3j53J52j3m0pK7N3q1K0M7r7K1p3O3K7J3
$$ -2 43 -82 -1 -39 50 -110 -22 -17 -7 -78 -121 16 59 -94 58 45 5 -2 25 78 -3 17 64 -33 -12 -85 -22 5 18
6765A8nPLn4K9J7L1j7J5q9N1oj0J24j4j28J05q5J2o7K5Pk1J20q3Q1j49J12n4M
$$ 18 13 20 23 -31 -2 15 46 29 44 -45 6 0 -10 114 100 -28 77 -8 4 -63 -38 -31 -52 68 -15 66 -83 29 -25 -21
6795b1j2P1o3O9l5L1K2j8l8M6o5M1m6m5PML7J8L3L0j34N1LL3qp6N7L7Q0q6p1o6
$$ -21 -33 38 -25 44 9 40 62 44 6 52 -13 28 -18 -63 -56 -52 -15 3 36 66 -68 -17 -14 19 11 -65 -8 29 109 23 -48 -114
6827a14K17j11J42k30L4j8OQ2o7j9l2kJ4JK8Q6m3k8P4l7o7Q1k3j0J17j6J0n0N0
$$ -114 103 -8 134 -96 -62 -80 -74 8 -59 -78 -110 -112 -98 -97 -69 17 -26 -54 20 -17 -84 -3 -26 -36 81 65 75 25 75
6856G5lp1O8J12n8j11M5p9Kn7N0L4J20j27O9rK3oJ1k9q4J7m0n7K09p6P9j66L2
$$ 75 72 1 69 181 123 12 57 -22 -20 -77 -27 7 127 0 69 60 83 77 88 59 -25 -8 -48 -105 104 28 107 -59 -27
6885b7R2k2q2K3P9r1Q0n0oj8N0j%N8l0j18l0J2Q7q1M7M3Q2j08Oj8J25k15J01L6
$$ -27 65 43 -39 -16 63 -28 52 2 -4 -22 28 27 27 85 55 -63 -93 -81 6 -75 -28 15 97 -11 -5 -23 102 -113 -12 24
6915B4j03J22l6m8m5P6L0k4q9J59j7k5p2J2N5p6l2J07j14J18j2M8p9J8N7k0o1
$$ 24 -79 43 7 -41 -86 -10 20 -4 -93 66 49 24 -48 -36 19 -57 -89 18 -96 22 10 58 -21 -3 54 34 -27
6942b7m6J21n1p7R2O8k5l1Kj14M9Q0k2m6J32Kj60O5r9J31l5J3l2L7j25J55p6n2
$$ -27 -73 48 -3 -80 12 80 55 24 26 -88 -39 41 19 -27 105 107 -53 12 -87 44 9 22 -10 27 -98 57 -19 -71
6970g1R6Pr6o1J39J8j47J88j6r4j8J32n7K5j1j2r6K8K0M0j3J63k04J13q2j14J52
$$ -71 25 32 -64 -125 14 32 -115 73 57 -37 -55 77 20 45 34 22 -74 -46 -26 14 1 164 -40 73 -9 -123 29
6997B9j15J97j10pk8J62p0r1K2q7O0J1J1N6p2l8R4oK4p6Q4n7m3J99j95P8p2L8
$$ 29 -86 111 1 -6 -34 128 58 -33 -11 -98 -38 -27 -16 40 -32 -70 24 18 42 -34 50 -7 -50 149 -46 32 -40 -2
7025bm6K3M6r2K01j87J6K5o0J79q7J8r0J8L7P0k4r5P0M0p3k8O5Jn0m4J24j26L5
$$ -2 -48 -25 21 -71 130 -57 -41 -16 -76 103 16 34 -56 -38 -1 69 45 -50 20 60 -13 -41 24 25 -25 -69 55 -71 -36
7054c6N6n4R8k5J2m2m2l5J53p1MRl4L0K0q6o8J31j3j29J36n5M5nO3j27J01j44
$$ -36 20 -34 64 39 51 9 -33 -68 85 14 18 27 -7 23 43 -43 -111 20 7 -122 14 -41 4 -1 62 -65 36 -108
7082a08O2%M5PL0J23j84jK0j0j5Rj00J32j54P9K0J20l6M0k3J7Jp4K3O8j32Q1j00
$$ -108 -46 -46 -1 6 36 159 -25 -26 -6 -16 -31 -22 -122 10 -144 -65 -45 75 39 79 56 73 74 0 23 91 -41 40 -60
7111f0Q0K2q7MJ6J13q6K9P3j12K6J2p1q3P3N4o8J16m6l3Q9j38P6k2J22j41J6p6
$$ -60 20 42 -45 -41 -25 88 2 31 104 -8 18 30 -41 -124 -51 3 -65 51 5 -28 61 -77 -1 -23 99 -42 -26 -102
7139a02K1L1jK6Q2j54k6J33O4q9NJ5l8M6L3r6J4P7J6L1j25Q8j48K39j73NJ00j51
$$ -102 -81 -50 -51 -25 57 -97 -123 10 74 -15 -10 5 -33 13 46 -50 -36 41 57 88 -37 51 -97 142 -31 -26 74 -77
7167g7J17J9k3o8p7N7n5J16R2j76Q2j04Q0m2L7R1L5j90P4p3J83j51Q9j2o5m2R3
$$ -77 40 59 36 -32 -109 -52 -107 9 101 -75 7 -97 -17 -59 -22 69 104 -86 -12 -85 98 -53 36 24 -41 -83 10
7194A0l6p9P1l0J08o2o1R4P0p4J38j42L5j5q3J24r5j2N9o4Q2O1o3Ll2q1R4j17
$$ 10 -26 -105 -34 -64 44 -18 -79 15 85 11 149 7 42 27 -56 68 -27 -39 20 -44 38 99 36 39 7 -74 20 -97
7222i7j8J13jn2K9o1N6L4K2lMRj20J00n1N6j3J5MR6Lj21Rj5J5j05J04n8P6p4O4
$$ -97 -115 -2 -3 -55 -26 -87 -31 3 25 22 26 35 -85 15 -36 20 7 22 26 122 125 4 13 -2 13 -92 12 -46 30 -44 20
7253B0r9kJ45k8L0M9j02L6p5m2M5M0n9O3l6k4O8l5j7j31Q9J35o4M3q1L8l5J70
$$ 20 -79 -81 64 36 66 115 13 49 -26 -68 -23 17 -42 21 -15 -39 29 -6 -23 -154 -65 70 6 49 -32 6 -29 141
7281A41j56J7k2j18J25j3J4qJ6M1L0j19kJ15o7N8j9j07l9J69K3j69J16rm2LL6
$$ 141 -15 2 -20 -138 -13 -26 -12 -20 -4 37 67 -52 -54 61 -6 52 33 -74 -113 56 79 -90 26 17 -25 -22 14
7308A4L0L2r2k6J3N5%n3M7K3l1L3j02J16m6K6l9O6n4K7o5k7R7M9q2L7O4j51J03
$$ 14 44 76 -16 -42 -29 26 26 -27 20 43 12 45 -57 59 13 39 0 66 12 39 -26 -53 44 93 11 48 112 -39 64
7337F4j15P0J2l9J6j00J11j21J03jm6J30j05o6k2J12O2n2J7J4r1K5L6L2o4J7J8
$$ 64 -51 19 31 -8 8 -92 19 -102 1 0 -46 84 -21 -87 -109 3 65 13 30 44 -47 -22 14 46 -18 -1 17
7364A7m4L7pP2j25N2J0rN1q0j7RM0M6r1oJ5j4n5J27k2M7l7m5m0R7l5Q8j50L8N
$$ 17 -27 10 3 75 -50 2 12 3 54 -26 -43 -34 6 52 -39 -45 -30 -44 -99 28 6 53 16 -29 -69 28 -7 81 -69 -31 -26
7395b6PQ0j43O0M9j28L6J4L2OL5Mr6J01P3j13j7j5R3j2J6oN1k11J8O6K4o%J7p0
$$ -26 -19 61 -82 -22 27 -101 -65 -51 -19 -13 22 26 -70 31 104 -9 -26 -41 52 40 56 50 101 -110 -92 -26 -2 -8 -8 9 -61
7426f1R1j11Q1J04q8j1o2J4%Pj01O3R4l9l2N3o7J0q4P7k5N4L0pmP1n5R7n3kK9
$$ -61 30 -81 0 104 16 5 -57 -43 -43 -36 -137 -74 20 -19 -51 2 -65 -55 -139 -62 -87 -33 -3 -10 -14 57 2 99 46 44 73
7457G3p1l9J6K5l9M3K4l4N6k1j40J14P5j45J8pM5r1J10k6m0K5jO5J4j7J9j7l4
$$ 73 2 -37 -21 4 -35 8 32 -2 54 33 -107 7 82 -63 -45 -52 -7 -98 12 -14 -54 -29 -30 35 49 32 51 34 0
7486@L5m3L3o0R8j42K54j43k5r4o2J55q4K6M0L1r2pN4R2o4J4l4k2R8k0o6j9L9
$$ 0 35 -8 25 -35 63 -79 175 32 7 -87 -149 6 -78 -52 -12 19 -73 -80 -26 66 2 16 -18 -40 58 38 -28 -47 -8
7515hj15J95n7J29j79K9J4j5l3Q0j02k6J34q8k3N2N5q3R9n7Q0j20R4q9k5J94j64
$$ -8 -123 72 15 144 -35 -6 8 -7 -40 40 -62 -88 46 -42 -65 -13 42 -41 58 1 81 -39 55 -34 -59 135 -29
7542b9l8L4K9R2k6j24N8L7j9j0N6n8J02k28K11k04J77j01rO8NKmN5r6K6K1p1N6
$$ -29 -67 -33 -4 88 62 -62 -4 33 14 4 60 2 104 -124 87 -117 60 -41 -50 18 23 25 21 76 -20 6 27 -44 12
7571A2P8m5j37J35J8o1p7M4M3k5O6rJ1j36J22p8n1J11O3o8L0o3n7J45N4o6L1j40
$$ 12 90 45 -92 43 61 0 -77 -33 10 -15 51 42 53 -83 39 -39 -90 21 84 16 46 -17 -74 71 125 59 90 -50
7599e0l6Q8l2k2Q1k4m7MM6l3p2P8J17o7O1q6P6J21k52N2j6m5M4QQN1K8qq2k1j
$$ -50 -86 2 -30 -52 29 5 -42 -38 8 -25 -97 -19 98 31 92 6 82 203 -49 3 -13 -58 -14 -6 2 53 81 73 -9 -30 -31
7630c1QQ0o7J16j30M8K4mj41J40l4j5p8R2j1j04J70Oj9j9n1Q3j07j6J01O9n7n3
$$ -31 -23 57 -10 106 -24 24 48 44 -97 43 9 -6 -84 8 -3 -107 63 69 50 31 -20 63 -44 -60 41 110 53 0
7658@L7n1jJN6l3P1j62J1R6n1Q5L6j00Q2j17R8j79J34m4M9Nm1L8n9j2P7l2N9p4
$$ 0 37 -14 -15 -14 42 9 80 -82 -71 25 -26 59 95 -5 77 -40 58 -121 13 -31 18 23 -18 20 -39 -51 26 -6 53 -21
7688b1N5j4qqK8p6L4O8m8n4J05r4l1j6L8N9J6j07Q3M9K8k3o8j06J64l7J9K2q7
$$ -21 34 20 12 4 32 -44 -10 58 10 -44 61 -33 -64 -80 -42 17 33 -74 9 58 86 63 -5 -111 53 16 35 57 -30
7717c0J24j26R3n5P8m5L3n1j27J08J67j56M5r9N1j12M2J21j37J01k8n2J03q6Q5
$$ -30 94 -32 61 6 84 39 72 21 -106 2 169 13 58 -41 10 -102 -60 61 -76 25 -3 -55 48 -38 47
7742D7P1j05K5q6J14n4l0p9J62m4K9M1k9p3P5m4Rj26L4L0pR3J4m4m3L9j1N2j84
$$ 47 118 13 38 -48 66 12 -18 -97 65 21 50 91 62 -11 64 20 29 -97 -63 -33 -40 53 67 23 -20 19 8 60 -124
7771a24J36m7n4K41j9j24p2N7J00r5m7P9nj24J67n4l0Lnm2l0L6J39j58J34j90
$$ -124 12 -35 -89 152 133 9 -63 -6 94 -1 -48 31 26 -98 69 15 -15 -12 -17 -59 -89 -53 86 -72 62 -128
7797a28J50Oj06J15l7P9j78J03k6K3K6n4j23K24n8j53J93o3RQ5r2L3q8O3oj4Q9
$$ -128 22 28 -78 37 0 79 -99 4 -22 1 27 -27 -150 74 16 -137 56 -7 2 87 -5 28 -60 3 -3 -17 72
7824G2j21J18l5m0m5M8j5J7L0r0R5p6P9O2j26M9n9J3LK1l3R0r9J02L8j38K4l7
$$ 72 -49 69 34 -6 -51 -3 -18 -1 29 -61 34 -42 37 99 -27 22 -37 -24 -21 0 -33 57 -42 60 98 -40 -16 -53
7852e3K1mJ04L8j13P8j05O4J4Q0r1l2j0k4O9qk9k0M3J4k6J32j1j43m6J23r4K1
$$ -53 -32 -36 68 106 -7 71 -34 30 44 124 33 1 -9 -33 36 28 -1 -21 22 36 10 142 131 -12 -58 65 -29 -8
7880hj9M8J27j2l5m8Pr6N5qm5J2j04J46j18k0J04kJ0n6ON1J19q4L8j09M5k6j6
$$ -8 -27 21 148 136 101 53 60 -36 19 11 -34 -22 -126 20 -98 -118 -14 -16 -6 -62 -56 -5 114 30 68 -41 4 -22 -38
7909c8J13n6N5n6o0L7M3m9J15p9L3r3m0O7O4p4N4l8o5O8j3M5kr0Q6Nl3j06J27
$$ -38 75 19 74 18 -42 -5 38 -11 104 25 58 -35 -75 -8 56 -18 36 -2 -67 1 -12 33 31 -59 27 32 -1 -107 20
7938B0j1J0L0j13L7J05k3K5j48O1l3nR2j29K9P4q3N5LJ3l1l5L4M3n0o5O8J8K2
$$ 20 9 19 49 -64 -27 78 55 80 -68 -7 -40 -45 47 -82 -53 21 -62 -7 -4 9 -22 -57 -23 20 -30 -95 -27 -9 13
7967A3K5j33K72j51p4o0O8J23j04J6k0p0J57o8J0n0PL4N7K0p1l9K0o3QJ82j03
$$ 13 38 -95 177 26 -48 -108 -40 83 -21 -5 -25 -95 62 -6 4 -46 -39 -5 52 72 1 -38 -18 -81 -73 109 6
7994Fql3j11J81p9rN4L8k5j8m4K4J5j27L9J83j32J7P6NLm8kj00R0L4jm5Q0j81
$$ 6 -2 -35 -146 35 -44 -53 1 39 14 -4 -48 -24 -9 -136 -97 86 -46 -29 47 52 55 7 5 -95 -5 29 28 -17 63 -118
8024a18M8k1P2l9L4M2p4o4J12N8r1J24nr9J20j01N6J7j04Q2j0k7r8J65p1o4P5
$$ -118 -70 -91 -19 -58 -24 18 -56 -120 -8 50 -41 83 78 -21 99 -2 54 71 -33 49 39 12 -86 79 8 -56 19
8051A9m5m5J66j95N2K8p2J53r6Q1p4l2K0J63j08Jp8K9O7q9P3r4MJ44j65J94j18
$$ 19 -26 -71 95 -100 -48 -20 -92 61 -35 46 -28 -60 -40 123 15 16 -62 -33 34 -55 18 -76 -72 72 -93 101 -17
8078a7OL3o9P9j7J1K7j4j06O2Q4j81J41j18N5n1m6J29K3j3p7J15k18L35j73K2
$$ -17 -11 22 -47 32 15 26 53 39 -67 -5 79 -102 39 -79 -24 -75 -121 8 31 18 -59 56 -162 173 0 22
8104B2j16J28o7J2L0JMmk1j0QJ4M8p0k6J04j68J55m5O6q5k2o8J6J23o7M5j8NR9
$$ 22 -94 34 -33 -21 9 10 14 10 -11 -21 -13 1 49 -21 -47 57 -111 44 -1 65 -20 -42 -110 -94 29 -38 7 -11 -6 93
8134I3j33k3M3k7R2p1qO2Q9k16J38j2O0r4q6qJ35ml9k3K5jnJ21j80L0jJ07kp4
$$ 93 -40 -63 -20 -47 45 -26 -34 28 117 -99 39 27 87 -7 -93 -101 34 30 -9 -32 -7 -8 -13 108 -72 -42 -43 64 62 -12
8164a2lM7L1q4l1M7J17k08J22L0j82Q8K7np2O3J8M7k1J53j08r7o2J16p5J7J5
$$ -12 -15 32 63 -21 -52 -5 112 -96 26 56 -126 -38 -11 -16 -88 -25 -7 40 19 172 64 -33 -95 21 -54 -37 -22
8191b2
$$ Imaginary data points
##PAGE= N=2
##DATA TABLE= (X++(I..I)), XYDATA
0@%%%%%%%%%Qj6J6j6K4l2M0m8N6p2Q8j04J20j44J71j98K35k72L12l60M16m80N47
$$ 0 0 0 0 0 0 0 0 0 0 8 -8 8 -8 16 -16 24 -24 32 -40 48 -56 64 -80 91 -107 128 -144 168 -192 224 -256 291
32B91o21P04p96Q99j011J132j268J418j578J753j947K159k390K641k915L215l544
$$ 291 -330 374 -422 477 -534 598 -670 748 -830 923 -1024 1135 -1255 1386 -1529 1686 -1858
49a858L904m300M738n222N760o364P040p803Q680r692J0878j2296J4018j6164
$$ -1858 2046 -2254 2484 -2738 3022 -3342 3698 -4105 4575 -5117 5761 -6535 7483 -8681
63h681J8926k2634K7905l6041N0376q2994K92020m598n86120J13706L34016J26918
$$ -8681 10245 -12389 15516 -20525 29851 -53143 238877 234279 -351841 -238135 95881 222799
75B22799k01095r8657K1470N2776j1616L8590P860k3253l4547J9034R925L07j0754
$$ 222799 21704 -76953 -55483 -2707 -14323 24267 32127 8874 -25673 -6639 3286 3593 -7161
88g161J6018N19r017j1087Q996L584L441l812J194n149j745J789O787l232k534
$$ -7161 8857 9376 359 -10728 -1732 1852 5293 1481 2675 -2474 -4219 -2430 4357 1125 -1409
103a409N28K829k701p25J318J405k743J736L660j947n907O71N073K352l620l787
$$ -1409 -881 1948 -753 -1478 -160 1245 -1498 238 3898 1951 -3956 -3285 1788 4140 520 -3267
119c267J102L510M16j540p35J42O54O61j018k260M33M085J563m143l842K255M832
$$ -3267 -2165 1345 1761 221 -514 -372 282 943 -75 -2335 -1902 2183 3746 -397 -4239 -1984 2848
136B848N37m171k325K178J611j171p1K166L87k441j923J475L286N00l280k619
$$ 2848 3385 -786 -3111 -933 678 -493 -564 1602 1989 -452 -2375 -900 2386 2886 -394 -3013
152c013J125K756R83j213j037O11M29j277k41J770P50k312j530J583J695n12j164
$$ -3013 -1888 868 1851 638 -399 212 641 -636 -877 893 1643 -669 -2199 -616 1079 567 -597
169e97K55P99l03l84L77M2l47k5L69K12n34k50J72L33J6j01j28Q2M54k49p94j14
$$ -597 -342 457 154 -230 147 189 -158 -183 186 398 -136 -386 -214 119 135 34 -94 -12 442 193 -601 -715
191g15J095Q01j171j530N98J869L18j203m19L23M6m7L37K99n72o39J60N24K95
$$ -715 380 1181 10 -1520 -922 947 1265 62 -357 -34 12 -35 302 601 29 -610 -450 74 369
210C69N2l48l65j19K75M11j87k07P2r3J02J6J37M1j13K0l21P4L92K37j79m54n2
$$ 369 421 73 -292 -411 -136 275 88 -119 -47 -140 -38 -22 115 156 43 63 -258 -184 208 445 266 -188 -240
233b40M81J06l58J56M4o38N7L93K93j02n08m3N74R3j88k51J88O4q8j1jP8j45J40
$$ -240 241 347 -11 145 189 -449 -392 1 294 192 -316 -359 215 308 120 -131 57 121 33 22 21 99 -46 94
257I4l5n4P5j1n0j17J21k9o0n0K10p9j72K08q3J67j2k53J85M08l55k96o7R5J32
$$ 94 59 5 80 69 19 -98 23 -6 -66 -116 94 15 -157 51 -32 135 123 -130 55 463 108 -188 -255 -160 -28
282b8J04j89J17K42l02r3L46J24m50k4K76o3q7j90J50J36j10K2mMP3O3o4q6K3
$$ -28 76 -113 4 246 -56 -149 197 321 -129 -153 123 60 -27 -217 -67 69 -41 -19 -23 -19 54 117 53 -33 -10
307a0J43J58l53K1k5K46j57j43J38K0K29j41j08j4j6P8j02j18Q1J43k06o2J36
$$ -10 133 291 -62 -41 -66 180 23 -120 18 38 267 126 18 4 -12 66 -36 -154 -73 70 -136 -198 -62
330f2K70j91oq9J37P2k8r1L7p1j1P2j43P5r1l0K38j01m4PM8M4m4M3k7o0M4RM5
$$ -62 208 17 11 -78 59 131 103 12 49 -22 -33 39 -104 -29 -120 -150 88 -13 -57 -50 -2 42 -2 41 14 -46 -2 7 52
359E2K2j29J40jo3K2K2j35O9M0j0j24J08j25R4P6K2j25J7J2o7R3k5L2J01p2j40
$$ 52 74 -55 85 84 21 43 65 -70 -1 39 29 -95 13 -112 -18 58 80 -45 -28 -16 -83 10 -15 17 118 46 -94
386i4P2L7L9K4M2j70M2l4n3O5p8J84N6j08qjj7N8m0m5R7j45M3Q8p7l2m0J62j42
$$ -94 -22 15 54 78 120 -50 -8 -42 -95 -30 -108 76 132 24 16 15 -2 56 16 -29 68 -77 -34 54 -23 -55 -95 67 -75
415g5J54j64J11l5N8l6m9Q4r3l2J20m5p6m3j3J84k1l4m7K7J04P3n3j81K0J12r2
$$ -75 79 -85 26 -9 49 13 -36 48 -45 -77 43 -2 -78 -121 -134 50 29 -5 -52 -25 79 152 99 -82 -62 50 -42
442d2M9L1j3m6k4J04O9J23j61k01J27k2Q2j7l5k66Q6J49J5k1Q5o3n3Q3l4J3n8
$$ -42 7 38 25 -21 -45 59 128 251 90 -111 16 -6 76 59 24 -242 -156 -7 8 -13 72 9 -44 39 5 18 -40
469d0N5j07N3K4k1n2J5K22j74m7J4L4QJ00j36j05J88q4J34k97K34M9P1j66j8P7
$$ -40 15 -92 -39 -15 -36 -88 -73 149 -25 -72 -58 -24 -16 84 -52 -157 31 -53 81 -216 18 67 138 -28 -46 31
495C1M1P5j24j91R5J81p2p6j36J18QP9j03M8j02Q8J75n3j90J6J6K36J25k48j95
$$ 31 72 147 23 -168 -73 108 36 -40 -176 -58 -50 29 -74 -26 -128 -40 135 82 -108 -92 -76 160 285 37 -158
520a58%J43P3J39k13Rm8J0P9J9n7R4j16K3q4J25M8o5O6l5j33K08Q6j40j60o0J65
$$ -158 -158 -15 58 197 -16 -7 -55 -45 34 53 -4 90 -26 -3 -87 38 86 21 87 52 -81 127 213 73 -87 -147 18
547A8R1j97M7J42r7K9K0J37k59K8o5nJ23p4j03J35JQ0n7J29k79J49q5J43K9q7
$$ 18 109 -88 -41 101 4 33 53 190 -69 -41 -106 -111 12 -62 -165 -30 -29 51 -6 123 -156 -7 -92 51 80 -7
573gl1K5J21j39J33p8j7l6P2j3O3o0M6q9N8j18p7J68P8p5j47N6Q0p5J35P9p8p6
$$ -7 -38 -13 108 -31 102 24 7 -29 43 30 93 33 79 -10 48 -70 -147 21 99 24 -123 -67 13 -62 73 152 74 -2
601bK2J31j4m9k70K4K05K3q4M1j9l4J1J14l4J2l4o7O7KlO3K3o7j25P5p8P5p8K
$$ -2 20 151 137 88 -182 -158 47 70 -14 27 8 -26 -15 99 65 77 43 -24 43 45 42 105 128 61 -64 11 -67 8 -70 -68
631f8N2r3J50k7j29J48J09j12m8o4N8n6N4M4Qj9q0qP2J11p4K2J8j71J38J4P8j23
$$ -68 -16 -109 41 14 -115 33 142 30 -18 -82 -24 -80 -26 18 26 7 -73 -81 -9 102 28 50 68 -103 35 49 127 4
659Dn4J15J1kj9j28J46j01J6n2Q3p0M3L5Qj06J38J2j17K3j71Q6K6JJ03J04j76
$$ 4 -50 65 76 74 55 -73 73 -28 -12 -64 19 -51 -8 27 35 -71 67 79 -38 -15 -186 -100 -74 -73 30 134 -42
686d2M4J04m3j09rJ24p2m9L1R3q3J16m2p4M2r8Q6L4n6j3J9j09N3LR5o3L2M0J59
$$ -42 2 106 63 -46 -55 69 -3 -52 -21 72 -11 105 63 -11 31 -67 19 53 -3 -16 3 -106 -53 -50 45 -18 14 54 213
715B13l03M4O6l5K1j08J49L9k2o2j21P7Q5l5Q1j08L6Q6j15P7q1L4m6J5Q0j77R6
$$ 213 -90 -46 20 -15 6 -102 47 86 64 2 -119 -42 43 8 89 -19 17 103 -12 65 -16 18 -28 -13 67 -110 -14
742a4N5m9K0j7nj9l4L2j8KJ7M5k3Lj9q5J11j6j03J18Rj6J7o0J17r6M0m0l9J31
$$ -14 41 -8 12 -5 -10 -29 -63 -31 -49 -47 -30 15 -8 -5 -24 -109 2 -14 -117 1 10 -6 11 -49 68 -28 12 -28 -67 64
772F4j07N7l%nO1n4j10J83p8L0m1lJ7j07K7N8M9m0p0M0%M9l9Nj7J32K4j05j6q0
$$ 64 -43 14 11 11 6 67 13 -97 86 8 38 -3 -6 11 -96 -69 -11 38 -2 -72 -32 -32 17 -22 -17 -34 98 122 17 1 -79
803g9J43J4j3o3K3pj02J88j00%n4J09o2J0R2j62P8O1j39K8J9O1o6M8l4o8J48j12
$$ -79 64 78 65 2 25 18 -84 104 4 4 -50 59 -3 7 99 -63 15 76 -63 -35 -16 45 -21 27 -7 -75 73 -39
831c9J8p6J67rj08P5j25J82j07LJ9L1N4j82L5k1J43j01J14m8r9m5O0O1Q4p9nr1
$$ -39 -21 -97 70 61 -47 28 -97 85 -22 -19 0 31 85 -97 -62 -83 60 -41 73 25 -74 -119 -59 2 86 7 2 -89
859h9J07J7N3j8L2j42M1J7LM4j7q2O6k5r8mJ37k6q8J43r9qJ07l0l7m8P4j07J22
$$ -89 18 35 88 70 102 -40 1 18 21 65 48 -34 32 7 -91 -95 42 16 -72 71 -28 -36 71 41 4 -44 30 -77 45
888D5K2k0K3j32K8PJ36j78J94n1j28oQ2Q4j34L1M1k5j69M6L3l6J45o4R7j6K1j80
$$ 45 67 47 70 -62 -34 -27 109 -69 125 74 -54 -60 22 106 -28 3 44 19 -150 -104 -71 -107 38 -26 71 55 76 -104
916a04k9J46o3k2O5pr9Q9K1o2pm9Q1J79p2j12Q2n2O8J9r4Q6j27K7R2j05P5Q2l3
$$ -104 -133 13 -50 -72 -7 -14 -113 -24 -3 -65 -72 -121 -40 139 67 -45 37 -15 53 72 -22 64 -63 -36 56 -49 26 108 75
945G5qr3l4P7P3m1jr2l2P3L7r1J6J60j49n6O1O0oo3L0q2J07N6j29M5j1l5O5k2
$$ 75 67 -26 -60 17 90 49 48 -44 -76 -3 34 -57 -41 119 -30 -86 -25 35 29 -34 -4 -86 21 77 -52 -7 -18 -53 12 -10
975a0q6J22r5K09j14L1nr7J1m8J20j67Q8K5o0P6J29j53J3L3j29J46o1J50j15L4
$$ -10 -96 26 -69 140 26 57 52 -45 -34 -82 38 -129 -41 -16 -76 0 129 -24 -11 22 -107 39 -22 128 13 47
1001D7r4J57n6on8n8J16L1n6j3p0P0orkM3jQ8q3JQn7m6P1p7nP5o2j5N2J5M4O8
$$ 47 -47 110 54 48 -10 -68 48 79 23 10 -60 10 4 -5 -7 36 35 123 40 41 49 -8 -54 17 -60 -65 10 -52 -67 -15 0 44 112
1034A12j02K6j65J35pJ3ko9j5J44k1l0J9j38kJ13J00o9j17O0Q5q9P6l3j50M4k0
$$ 112 10 36 -129 6 -1 12 10 -59 -74 70 49 19 38 -100 -102 11 111 42 -75 -15 70 -19 57 24 -126 -82 -102
1061a02R9Jn4m7O3JQ5m0m2jN5j3j1n9kO3K2Q7m5m3j11J68j04M1O2pr7J4L0n7J08
$$ -102 -3 -2 -56 -103 -40 -39 46 6 -36 -37 18 5 -6 -65 -67 -4 18 105 60 17 -94 74 -30 11 73 66 -31 -17 13 -44 64
1092F4k3r4L5l7J20O3j82J31O5j98k1K04j49k1O8n3P3J8m2n8J18j08J08q5Q9j15
$$ 64 41 -53 -18 -55 65 128 -54 77 142 -56 -77 127 -22 -43 25 -28 45 63 21 -37 81 -27 81 -4 85 -30
1118c0P4p5K7L4n6o5L6O7M7p7J70j99oL7k3J15j21j8J3J11l4j16J97j27l5J08
$$ -30 44 -31 -4 30 -26 -91 -55 12 59 -18 152 -47 -53 -16 -39 76 -45 -63 -50 61 27 -89 108 -19 -54 54
1144E4j46R1O7o0j18J17rK6L4PL0qj29J03n2k2o1nQ5l1Lk1L7n6J10j31J19rmj6
$$ 54 -92 -1 66 6 -112 5 -4 22 56 63 93 85 -44 59 7 -15 -76 -81 4 -27 -24 -45 -8 -64 46 -85 34 25 21 5
1174Eo2J15p0J09j75J17j02O7L4K2j24J28o5N1P3k23J82o7k1O1m3m3J8l8J9%P5
$$ 5 -57 58 -12 97 -78 39 -63 4 38 60 -64 64 -1 50 123 -100 82 15 -6 55 12 -31 -13 -51 -32 -32 43
1201D3k1N7q1Q4m9j0M4J5k2j60K10j40R0j11J18r5P1j57K6O7K5n4o1R7J5m7J7
$$ 43 22 79 -2 82 33 23 67 82 60 -100 110 -30 60 -51 67 -28 43 -114 -88 -21 4 -50 -111 -14 1 -46 -29
1228b9l0J45p3j18J70n8q7J38r2k4L9M1p6M3P2j07O0k8J42r9j3p8P6N5m9j62O0
$$ -29 -59 86 13 -105 65 7 -80 58 -34 -58 -19 22 -54 -11 61 -46 14 -14 128 29 16 -62 14 69 20 -142 -82
1255h2M9M8l1j6J3k3J14j41Mk7K06j59O5K6o4qJ04j1l0l8j17K9J90r7n5J61j15
$$ -82 -33 15 -16 -32 -19 -42 72 -69 -65 -92 114 -45 20 46 -18 -26 78 67 37 -1 -118 -89 101 4 -51 110 -5
1282eM7q1J3j0P2M9j88J01qL6QJ3j0J03j61k8R6pK1j24jJ27o2Jp7J4j10J02Q9
$$ -5 42 -39 -26 -36 36 85 -103 -2 -10 26 34 47 37 140 -21 -49 47 40 61 -63 -64 63 1 2 -75 -61 -171 -69 20
1311B0n8Q1r2O6K4l2o0J20j59j2K8n1J96J3L1oj89R6lJ05k17J47n9r8J50Q0k21
$$ 20 -38 43 -49 17 41 9 -51 69 -90 -102 -74 -125 71 84 115 109 -80 16 13 118 -99 48 -11 -109 41 121 -100
1338a00Q2l3J55k01K9R2j6k7o3L4J07n7m7l1J19n2k2M3J2q6O0k8M1k3R8j44oQ4
$$ -100 -18 -51 104 -97 -68 24 8 -19 -82 -48 59 2 -45 -76 43 -9 -31 12 24 -62 -2 -30 11 -12 86 -58 -64 20
1366B0qr3j1J34k3kl4o8J34r9K6P3mj18M4mRK8M3o1N3p4j2r7N7J43Qj79L1J09
$$ 20 12 -81 -92 42 19 17 -17 -85 49 -50 -24 49 45 -73 -29 -33 -24 4 47 -14 39 -35 -47 -144 -87 56 64 -115 -84 25
1396B5LM2p9N4j03JQ2%r7p7J22Ql5J09K6k3j51J25o9O0j9lJ10j22n2rN9N9l9R2
$$ 25 28 70 -9 45 -58 -57 25 25 -72 -149 -27 -19 -54 55 81 58 -93 32 -37 23 4 1 111 -11 -63 -72 -13 46 7 99
1426I9j28m8J9J22l3l2J59j07l2R0j44K6j4rM0P3p8J42j14J1j52J25k6r6J66j2
$$ 99 -29 -77 -58 64 31 -1 158 51 19 109 -35 -9 -23 -32 8 81 3 145 31 42 -110 15 -11 -107 59 47
1452D7j33OM9N7n6O7Q7j4j40P0j54J77k6j23O3M1Qj1n1j7l6KO1R9r3j3j8O0r2
$$ 47 -86 -80 -31 26 -30 37 124 110 -30 40 -114 63 37 -86 -23 18 26 15 -36 -53 -89 -87 -26 73 -20 -33 -51 9 -83
1481h3J05k4j27J41j23O8R0L9j01N3M2p4m9J22j80J46l1L1j32N0Q2j0J45j06j11
$$ -83 22 -2 -129 12 -111 -43 47 86 -15 38 80 6 -43 79 -101 45 14 45 -87 -37 45 35 180 74 -37
1506c7J49m1r0J8M7J9jn9LJ1m3p3R7l6Q9nj06K9J41j97J12n1J3J07k13P3P6q1
$$ -37 112 71 -19 -1 46 65 64 5 8 19 -24 -97 0 -36 53 48 -58 -29 112 -85 27 -24 -11 96 -117 -44 32 -49
1534d9L4kQ1op5k6L1J26j16O1J9j71J56j38rR3ok3QK4j4J8n1Q1n1J0j02R0p7O4
$$ -49 -15 -17 64 58 -17 -43 -12 114 -2 59 78 -93 63 -75 -84 9 3 -20 -12 12 -2 16 -35 46 -5 5 -97 -7 -84 -20
1564b0L4k1r1O7J0ro0J8K11j68J09j69O0l4P9or2Q0J5N1m8m8m2P6J27k08M6O3
$$ -20 14 -7 -98 -31 -21 -30 -90 -72 139 -29 80 -89 -29 -63 16 10 -82 -2 13 64 16 -32 -74 2 129 -79 -33 30
1592C0j7mj1mk7l2Jk9N8M1j10J47RJ4p1MrM9j7r9N4J9K4p4J2n9J60m4r9P1j0j1
$$ 30 13 9 -2 -6 -33 -65 -64 -93 -35 6 -104 43 52 66 -5 -1 -10 39 22 -77 -23 -4 20 -54 -42 -101 59 15 -84 -13 -23 -34
1624c4j7P3N4j19N9J06j28O5j28J26o1l5j21K23L5j14Q8j70J56l5m1K0o5J18r5
$$ -34 -51 22 76 -43 16 122 -6 59 -69 57 -4 -39 -160 63 98 -16 72 -98 58 23 -18 2 -63 55 -40
1649d0J57j96J35j7q1R1j14P5L0j0M1k6m3m2m2J14N5j4O3J7k32J75Mj96J59J5
$$ -40 117 -79 56 39 -42 49 -65 10 40 30 71 45 2 -40 -82 32 87 73 136 153 -79 96 100 -96 63 78
1675G8j82M7J10m4O4p8K6Q3r8N0l1N5j67K9L9J1q4N5J53j19l2k7q0J21J8j7M2
$$ 78 -104 -57 53 9 73 -5 21 104 6 56 25 80 -87 -58 -19 -8 -92 -37 116 -3 -35 -62 -142 -21 -3 -20 22
1702B2k9m6NM6q0L4QJ20j41L7P4k1l3k7M5j09J03J15j38M7n4K7L4j9P3j03M2Q
$$ 22 -7 -53 -48 -2 -82 -48 -40 80 -61 -24 50 29 -4 -31 14 -95 8 123 -15 32 -22 5 39 20 93 -10 32 40
1730D0p8R7j07M3j12J36k9nL6n2O5J0k6oJ9ll3OL8o7K1P3o9Q3j6m5m2m9J1O7L4
$$ 40 -38 59 -48 -5 -117 19 -10 -15 21 -31 34 44 18 12 31 28 -5 1 39 -28 -7 66 -3 80 64 19 -23 -72 -61 6 40
1761D0n5l3P7J01q3m1j4K9R0j45J6R0k7m8k5K0M1m0j1Nl0P5n9n8R7l0K5p3J7j5
$$ 40 -15 -48 29 130 47 6 -8 21 111 -34 -18 72 45 -3 -28 -8 33 -7 -18 -13 -43 32 -27 -85 12 -18 7 -66 -49 -64
1791f4pJ40k9lk9j0m7O2N1r7R0l8l8N2M9j66R0M7k3lL5j40O0k0R1n8J24j11J62
$$ -64 -71 69 40 37 8 -2 -49 13 64 -33 57 19 -19 33 82 -84 6 53 30 27 62 -78 -18 -38 53 -5 119 8 170
1820A70j06k53J99n1R7l8j10k2O3N3l6J24o3j03P7m0O5l6k6m2J65m2l0R3Oj76
$$ 170 64 -189 10 -41 56 18 -92 -114 -51 2 -34 90 27 -76 1 -39 26 -10 -36 -78 87 45 15 108 114 -62
1846f2J44j18P8j56j6J69j4M9j42J26j87K50j75K7R4o5pOM7Oj40O3N5q3R4l3K4
$$ -62 82 -36 42 -114 -130 39 25 74 -68 58 -129 121 -54 -27 67 2 -5 1 48 54 -86 -23 32 -51 43 10 34
1873C4j49K06j98J50j3m6O7k61L33j52N5o2N5O0j66J99r6J2N7n2rj39J32K8l9
$$ 34 -115 91 -107 43 30 -16 51 -210 123 -29 26 -36 19 79 -87 112 16 28 85 33 24 -115 17 45 6
1898Fj54M6J68n6l0N7j10O6o0K4m5R5j22N4LQ2m2J06k9r6R5j07Q6r4J75j36P8
$$ 6 -148 -102 66 10 -20 37 -73 -7 -67 -43 -88 7 -115 -61 -58 24 -18 88 59 -37 58 -49 37 -57 118 -18 60
1925F0j11j4K31j48rN2n6N8k2j3o0l9K9O3L8j05J61j70M0m2Q8m3NrKl5J07r2j
$$ 60 -51 -65 166 18 9 61 5 63 41 28 -32 -71 -42 21 59 -46 115 -55 -15 -57 31 -12 -7 -16 -14 -49 58 -34 -35
1954c5MO7j2Q4L0j32M6j03O1K4k4pK5l3j1j5O5L5j29M6l1Q6J2m2PN5j06Q2j00
$$ -35 -31 36 24 108 138 6 52 -51 10 34 10 3 28 -5 -16 -31 34 69 -60 -14 -45 41 53 11 18 73 -33 49 -51
1983e1J05j47P4J20j28k5J2M5rQj3po6R6l9pK8k1Q6l8R7j97R2p5R9l0k5M1n7K5
$$ -51 54 -93 -19 101 -27 -52 -40 5 -4 4 -9 -16 -82 14 -25 -32 -4 -25 61 23 120 -77 15 -60 39 9 -16 25 -32 -7
2013gn3P8j11M9M4K2N6L6j31r2J48P5j71K5OJ65j28qj4k6L3J%p9K7k5J18O0j40
$$ -7 -60 18 -93 -44 0 22 78 114 -17 -109 39 114 -57 -32 -26 139 11 3 -11 -37 -4 -3 -3 -82 -55 -80 38 98 -42
2042d2qJ13o9jq5J02lo6J35p7KM5j06N2J35n0m0P3r2J6J00j92M5L0Kp9O6q7%N0
$$ -42 -50 63 -6 -7 -92 10 7 -59 76 -1 1 46 -60 -8 127 77 37 110 18 34 134 -58 -13 17 19 -60 6 -81 -81 -31
2072c1o4J62n1q2J42j29J42n2rO0j69Q4r6J48n2p6K5J37l5j27J35p7J13j54P0
$$ -31 -95 67 16 -66 76 -53 89 37 28 88 -81 3 -93 55 3 -73 -48 89 54 -73 62 -15 98 -56 14
2097A4k3l3j2J05j0j24J65j36J59j28O1r8oJ6L4K9p4mN2o3j8O6P3j0K6q4N1K8
$$ 14 -9 -42 -54 51 41 -83 82 -54 105 -23 38 -60 -66 -50 -16 13 -61 -65 -13 -76 -94 -28 45 35 61 -23 28 56
2125E6K1j00J6k2kJ19n8o9mK07j15K6j22P2j4j31M8J23j62N8rR8L1j15L3r6J52
$$ 56 77 -23 -7 -29 -31 88 30 -39 -43 164 49 75 -47 25 11 -120 -72 51 -111 -53 -62 36 67 -48 -15 -111 41
2152D1m9N0m8q8j4P9N8Oq4k2R0k1KO1m2j13O1N6L2p2pl9P3Ml7nJ02k1o6L6M8p6
$$ 41 -8 42 -6 -94 -108 -29 29 35 -49 -71 19 -2 0 61 19 -94 -33 23 55 -17 -24 -63 10 14 -23 -28 74 53 -13 23 71 -5
2184eN3q5Q6p5K9o4J9Q7p9j0O9K9j6o8J0P8j26j0J06q1R5J1M1j14Q1j13J54p8
$$ -5 48 -37 49 -26 3 -61 -42 45 -34 -44 25 54 38 -30 -20 58 -68 -78 28 -53 42 53 94 -20 61 -52 102 24
2212B4J1m0k1m0J68p1j8j8N8l8P1j25J43Jj10l3j6P4Q6m0q7Q7n0R9j45OJ13Oj92
$$ 24 35 -5 -26 -66 102 31 13 -5 53 15 86 -39 104 105 -5 -38 -54 20 106 66 -21 66 16 115 -30 -24 89 95 -97
2241i7J48r6rJ02j56R6KJ17j55N6K7pM1n6PM3Q5j53N2o4k5q2J03L3Q0j29M3k2
$$ -97 51 -45 -54 48 -108 -12 -10 107 -48 8 35 28 69 13 20 63 148 -5 47 -17 -42 -124 -21 12 92 -37 6 -16
2269a6Pj08K04j55N5L0q3O9k5M4k5kL1K8q6L6P4j8j46J75p7j08Q0J20p9jJ25j93
$$ -16 -9 -117 87 -68 -13 17 -66 3 -22 22 -3 -5 26 54 -32 4 78 60 -86 89 12 -96 -16 104 25 24 149 -44
2297d4K8j0kQ5k6N7r9r7J48k2j25Q8m0r8J51J74j71r3J16q3J33j29l1R9k6P1J8
$$ -44 -16 -26 -28 57 31 88 -11 -108 40 18 -107 -19 -59 -157 -6 168 -3 -96 20 -63 70 -59 -90 9 -17 54 72
2324G2m7j8p6N7q1J19m9K2J9rJ8N8j04j8J5j1j9mJ2k4JJ23O3j52J24p9K3l0K1
$$ 72 25 7 -69 -12 -93 26 -23 -1 18 9 27 85 -19 -37 -22 -33 -52 -56 -44 -68 -67 56 119 -33 91 12 35 5 26
2353B6m7j14J61pk6P1j48J1J66j58J07M9j97Q7J52p1j09N7l3Q4N2r6n1O5p8K8
$$ 26 -21 -135 26 19 -7 64 -84 -73 93 -65 42 91 -106 -19 133 62 -47 10 -23 61 113 17 -34 31 -47 -19
2379a9J26r0o2K1O8kJJ29j02L1o5m9j15J39MK0Mr7J82p2lo5p5J20j4JJ9K8j24
$$ -19 107 17 -45 -24 44 42 43 172 70 101 36 -13 -128 11 15 35 39 -58 124 52 49 -16 -91 29 15 16 35 63 -61
2408f1k4N9L9o2n0J24J8j02N6L4r1R8p5KM4Jk1Q0j56R9ml9J9N0L3j1j60M3J6Q5
$$ -61 -85 -26 13 -49 -99 25 43 -59 -3 31 -60 38 -37 -35 9 10 -11 69 -87 12 8 -31 -12 38 71 60 -100 -57 -41 44
2438D4j82J49J0qK3J3l8R5Lj38lM7n1L3j8K2j02K3Q5PL6p3Q4j32J54p8k4M1K1
$$ 44 -138 11 21 13 36 49 11 106 109 -29 -32 15 -36 -3 -21 1 -101 -78 7 14 50 -23 61 -71 83 5 -19 22 43
2467D3K5r4M7J0n8J2J03p5o3N1OJ5k7P2j14R5o5N4J6k8nKL5r8R8r4kJ04j43N3
$$ 43 68 -26 21 31 -27 -15 88 13 -50 1 7 22 -5 67 -47 48 -17 37 53 25 20 22 57 -41 57 -37 -39 65 -78 -25
2497b5jpM2j01J21r2N1j7j5Rp9J63oj90P7J51L1m7Q3j91L6Pnp2P4m8Q1J5r6K2
$$ -25 -26 -33 9 -92 29 -63 -12 -29 -44 -35 -114 49 43 -147 -70 81 112 65 148 -43 -7 0 -5 -77 -3 -51 30 45 -51 -29
2527b9J16q4Kj1K5J17j36Pj2L9j13N5J4kM5j6J34k38J80n5L2j40j6J24N8k6r1
$$ -29 87 3 5 -6 19 136 0 7 -5 34 -79 -24 -10 -12 33 17 151 -87 93 38 70 -70 -86 38 96 70 -21
2554b1N9o0J34j34K2M3J5n4j4J79k41O6L2l4pl1O4p5P2m5K1J04p7K9N2j07m7M8
$$ -21 38 -22 112 -22 0 43 58 4 -10 169 -72 -6 26 -8 -15 -46 18 -57 15 -30 -9 95 18 47 99 -8 -55 -7
2582go6O2l0N2k0m4K0m1K4k9Q2K3O0mj11J04j02N1oM5j21J45l0m6M4n6Ro6L4M8
$$ -7 -73 -11 -41 11 -9 -53 -33 -74 -50 -79 3 26 86 82 -29 75 -27 24 18 63 -58 87 57 11 55 -1 8 -58 -24 24
2612B4m8M8Ql8r6l1J30pl9KL4m3R5K3K4j08P2Kn5P8q5J28j02L6n0J05j76J02j02
$$ 24 -24 24 32 -6 -102 -133 -3 -10 -49 -47 -13 -56 39 62 86 -22 50 52 -3 75 -10 118 16 52 2 107 -69 33 -69
2641f9M7M4m8K0jm2o6J20O7lm9jM9j78J63o2J4j21J40l4J5MQ5n2j26n9K8J39o4
$$ -69 -22 22 -26 -6 -7 -49 -115 5 72 69 20 19 68 -110 53 -9 5 -116 24 -10 5 9 94 42 -84 -143 -115 24 -40
2670d0J05j7JpOn5j1r1R7J21l4o4m4LQQ5r9K3R3q5j4R3j10N8M8j04o1J48n4j31
$$ -40 65 48 49 42 48 -7 -18 -109 -12 109 75 11 -33 -30 -22 63 -36 -13 80 -5 -19 74 -36 22 70 -34 -95 53 -1 -132
2700a32P6J11n3jj6J7M3q8P0k4M7m5J12j25j8m3M3m8O6J50j07l6j1j6Q0m9o5R0
$$ -132 -56 55 2 1 -15 2 45 -43 27 3 50 5 117 -8 -26 -69 -26 -74 -8 142 35 -1 -12 -28 52 3 -62 28
2728B8k8m0Q7j11R6k0m5N7J1p5M%J5Q1m5q5O3j3k2N9oKJ8n2J7RO0K8N0r8o6J9
$$ 28 0 -40 47 -64 32 12 -33 24 35 -40 -36 -36 -21 60 15 -70 -7 -20 -42 17 11 13 31 -21 -4 5 65 93 143 45 -21 -2
2760bl6R5o6O9l8P6j22Q5j03k2O5J1P6l7l1j30J42o5%O1j05J9R9k3L2n4J00j48
$$ -2 -38 57 -9 60 22 98 -24 61 -42 -64 1 12 88 51 20 -110 32 -33 -33 28 -77 -58 41 18 50 -4 96 -52
2788e2k5J33pj08k3n9J33PJ02p2L3n0K9kK8r4k8M2l8O1p3O6N8J27j28j04J2J08
$$ -52 -77 56 49 -59 -82 -141 -8 -1 101 29 62 12 41 39 67 -27 -55 -13 -51 10 -63 3 61 188 60 -44 -32 76
2816G6M3n0j30M2Q9j07k3J79j56j2J28q0n9J15p4l5P2k0K8K2p6M0K7Lj07Q3j19
$$ 76 119 69 -61 -19 70 -37 -60 119 -37 -49 79 -1 -60 55 -19 -54 18 -2 26 48 -28 12 39 42 -65 18 -101
2843a01j3K14l3j65Q5O5j1M7p7M1n5Rj2O9o9N6P3j2j10L5l0P%J1l3J14o7r6M3
$$ -101 -114 100 67 -98 -13 52 41 88 11 52 -3 6 -6 63 -6 50 123 111 1 36 6 13 13 24 -9 105 38 -58 -15
2872a5M6L6N7j16L2j4n5P7p0L3mL6j01L7OK1R4j40R8L4q8K5p6J29r2J53j47N7
$$ -15 31 67 124 8 40 26 -29 48 -22 11 7 43 -58 -21 -15 6 100 -40 58 92 4 29 -47 82 -10 143 -4 53
2900E3j5qj05J28p0q2J08n4J31p1jlJ5L1j47J27j3m4J03L7j17m4J17n1N1j31P6
$$ 53 38 30 -75 53 -17 -99 9 -45 86 15 14 11 26 57 -90 37 24 -20 83 120 3 -41 76 25 76 -55 21
2927B1P3j74J00j5J7m8L4L3M4j23O4o1P3l1L1Q8j12M2l7l0n3J07Qn3m4lN5%P6
$$ 21 94 -80 20 5 22 -26 8 41 85 -38 26 -35 38 7 38 126 14 56 19 -11 -64 43 51 -2 -46 -49 6 6 82
2956H2j31Q4Qr5P1k5L7k9J70o9j66r2J72J3O9p2N0J18p6j47J31l2j93J85l7K9
$$ 82 -49 35 43 -52 19 -6 31 2 172 103 -63 -155 17 30 99 27 77 195 119 -28 103 71 -122 63 26 55
2982E5M1Jj63J56o5j8L3r4L5oMJ7q7J12J8m4n8lP1M0j11P3J8k2J8Ql1P1m4q5J39
$$ 55 96 97 -66 90 25 7 40 -54 -19 -25 -21 -4 -91 21 39 -5 -63 -66 5 45 -66 7 25 3 21 29 -2 69 25 -60 79
3013G9p0n6qJ30o6p6j2R2L5p9J9L8Op5P9r0L7L2q4J31l2m5n7M0kM1Nj7j25Q2N5
$$ 79 9 -47 -55 75 9 -67 -79 13 48 -31 -12 26 32 -43 36 -54 -17 15 -69 62 30 -15 -72 -32 -34 7 12 -5 -130 -48 7
3044Gm8O9n3N5J7m3r4P8j1R4j35l2O9r7J74R3j49J09j22j7O7q9M7J7Q6j88J48
$$ 7 -41 28 -25 30 47 4 -90 -12 -23 71 -64 -96 -27 -124 50 143 -6 103 -19 -36 31 -58 -11 6 92 -96 52
3071E2l1j4q7M7M3P4M1j73oJ9K7J6j8P7q6l2R3l9n3P7K4r7j02J98Mj14m4J28o6
$$ 52 21 7 -80 -33 10 84 125 -48 -54 -35 -8 8 -10 67 -19 -51 42 3 -50 27 51 -46 -148 50 54 -60 -104 24 -42
3100d2J7j5L0J10j8j8lJ8q5J49j62o0R1P7j41O0L6J32j31J5j1o7J0j03J48n5O3
$$ -42 -25 -40 -10 100 82 64 61 79 -6 143 -19 -79 12 89 -52 8 44 176 45 60 49 -18 -8 -111 37 -18 45
3127D5nj8j8knM8K7j74J02K4JJ9j86J49R1m6J8k4k9K0q7J51kj35J31j14K4J07
$$ 45 40 22 4 2 -3 45 72 -102 0 24 25 44 -142 7 98 52 70 46 17 37 -50 101 99 -36 95 -19 5 112
3155A12j79J03k7l1L2j9p2O9K4J5m2j6K8P9p5J8n4R1o6PM7j2q9J33m9J5J7m5O3
$$ 112 -67 36 9 -22 10 -9 -81 -12 12 27 -15 -31 -3 76 1 19 -35 56 -10 -3 44 32 -57 76 27 42 59 14 77
3184G7j43MJ28k8J21k26P9l9l5R6Ln2k9J43j10o2K4J05j02JJ22r9L6m9J16j19
$$ 77 -66 -62 66 38 159 -67 12 -27 -62 34 37 -15 -44 99 -11 -73 -49 56 -46 -45 77 -22 14 -35 81 -38
3210c8N3p6K4Q3k8k2M9j16J10j5O7j26N7p9Q9K2mp4R2m9n0Q8j1N4r2j8N9no0J8
$$ -38 15 -61 -37 46 18 -4 45 -71 39 24 91 -35 22 -57 32 54 50 -24 68 19 -31 57 46 100 8 -10 49 44 -16 2
3240Bn7Q9r7J05m4K2k4J10k20k5J89l4p4M1l2O2k2L0M4J5j91P9P9k9Qr1jJ33j64
$$ 2 -55 34 -63 42 -2 20 -4 106 -114 -139 50 16 -58 -17 -49 13 -9 21 65 80 -111 -32 47 18 26 -65 -66 67 -97
3269i7M9M2p3J34o4m5J79r2o2K7P3N2q5k09J54m2R9p9J11K7q9j8Q9r4K2n0N2M2
$$ -97 -48 -6 -79 55 -9 -54 125 33 -29 -2 71 123 38 -171 -17 -59 40 -39 72 99 10 -8 81 -13 9 -41 11 53
3297E3M1k15J28Rk9N7q9J42o2kl7P7l9j5K6j11KJ56n3k4R6n2K8K9q2K2l6ql7q7
$$ 53 94 -121 7 16 -13 44 -45 97 35 33 -4 73 34 19 45 -66 -64 92 39 15 111 59 87 116 34 56 20 12 -25 -112
3327a12J50j18O5N7m7l4r6K83j40l5O7j29J27q2j0N8J9n4j0O9j06P4R6n4o6j05
$$ -112 38 -80 -15 42 -5 -39 -135 148 8 -27 40 -89 38 -44 -54 4 23 -31 -41 28 -78 -4 92 38 -28 -133
3353a33M8K05j29O0q4J19j23K2k7qQ1Q1q6k8j08Q8m7M7Om9J0K22m3j51QN7OJ6
$$ -133 -85 120 -9 51 -33 86 -37 -15 -42 -50 31 112 26 -2 -110 -22 -69 -22 -16 -65 -55 167 124 -27 -19 38 44 60
3381F0n2P8n0j11J40j95J70l1L4q0k6Q5K4jm9l0m3J32r4Q3l4Q0j91J84l9o3j1
$$ 60 8 86 36 -75 65 -130 40 9 43 -37 -63 22 46 45 -4 -34 -77 55 -39 44 10 90 -101 83 44 -19 -30
3408c0J48j64j6k7M2L8q7M4N8n6Q9j31r2J59N8o2O2M3J4l5j09K2l2j2R1p0R4m7
$$ -30 118 -46 -62 -89 -47 -9 -96 -52 6 -50 39 -92 -184 -25 33 -29 33 76 90 55 -54 -32 -64 -76 15 -55 39 -8
3436hj9l4J16J7p5J2J07j5j76J36r5P9j40L3O0n4J34p4M4J8m0N4J4k00J38j3J
$$ -8 -27 -61 55 72 -3 9 116 101 -75 61 -34 45 -95 -62 -2 -56 78 4 48 66 26 80 94 -106 32 19 20
3463B0j06N1K4m8kJ1P9n0K4m8N2L6J63j95J3m2J6mK8j33O9L4L0n4m8Q0j36K15
$$ 20 -86 -35 -11 -59 -61 -50 29 -21 3 -45 7 43 206 11 24 -18 -2 -6 22 -111 -42 -8 22 -32 -80 0 -136 79
3491G9o2L0j6Jp7J21j17J7J16j15r8P8l6J06Lj11J6n1O8J93k79J53N2n7m4l1L8
$$ 79 17 47 31 32 -45 76 -41 -24 92 -23 -121 -43 -79 27 30 -81 -65 -116 -48 145 -134 19 71 14 -30 -61 -23
3518b3r3J17p6J28j08M7K8K2L3j8k8k4J4j0j1M6m6j46J17K6O5j37J73r8N7l0j16
$$ -23 -116 1 -75 53 -55 -8 20 42 75 57 29 5 19 9 -2 44 -2 -148 -31 -5 60 -77 96 -2 55 25 -91
3545i1N2K9P9%p4r7Q5N6n3m5O3P7q4k1k8q8K23l8q1J18lj24J92j68J3J8J38j57
$$ -91 -39 -10 69 69 -5 -102 -17 39 -14 -59 4 81 -3 -24 -52 -140 83 45 -36 82 79 -45 147 -21 -8 10 148 -9
3573iK3rn7J17m3j50J88o7RJ2K7j04j7J05j15P2O2m4LJ1k3RN5o3M3K0r2J32p5
$$ -9 14 5 -52 65 22 -128 60 -7 2 14 41 -63 -80 25 -90 -18 44 0 3 14 -9 0 55 -8 35 55 -37 95 20
3602B0RMm8O2j27K46k10p2J16pN7j43J21K1J4m8L2q7K0Q3m5O5o2j5j59J15J99
$$ 20 29 33 -15 47 -80 166 -44 -116 0 -7 50 -93 28 49 63 15 47 -40 -20 63 18 83 21 6 -153 -38 161
3629A61j64N3J7j23P9Rk2J7k7M7o9Q7m6k6l0k4J70q4O5q4j7O1l9j2O1L1q4j20
$$ 161 -3 50 67 -56 23 32 10 27 0 47 -22 65 19 -7 -37 -61 109 25 90 6 -11 50 11 -1 60 91 7 -113
3657a13J06K6p6M4j6P6k6P2j28M0k3N3o7M5Ok4l2P0q5o1N8n1P9L2q9Q3j8l0J23
$$ -113 -7 19 -57 -13 -29 47 21 93 -35 5 -18 35 -32 13 19 -5 -37 33 -52 -113 -55 -106 -27 5 -84 -1 -19 -49 74
3686G4m4L7j05J60m3q7j22J87qo8j5M4J14j42K0J1K7L0r1J2Q3j75J35J1j23J19
$$ 74 30 67 -38 122 79 -8 -130 57 49 -19 -34 10 124 -18 2 13 40 70 -21 -9 74 -101 34 45 -78 41
3712D1o7j64J85n1J14j20J48j01j3J05n7m6P4j64J70r1K0Rq2Q9l3O0J9j50Q2K6
$$ 41 -26 -190 -5 -56 58 -62 86 -15 -28 77 20 -26 48 -116 54 -37 -17 -8 -90 -1 -34 26 45 -105 -23 3
3738CJ3p7R1m5R7Pj00j4r2J17j04J31LP3l6k0q6j1j1K5J7K9n1M1j9J5N0jo4KN2
$$ 3 16 -61 30 -15 82 89 -11 -25 -117 0 -104 27 30 103 67 47 -39 -50 -61 -36 -19 10 -41 0 -19 -4 46 45 -19 -17 35
3769C5o3Q1k5p8J04n4M5n3J08j63J74n2Oj5Q5j13o3J99j50j5O9rj28P6P0k3j50
$$ 35 -28 53 28 -50 54 0 45 -8 100 -63 111 59 65 50 135 22 -41 158 8 -7 62 53 -75 1 71 48 -102
3796a02J49qj11j8K32k10N6L1o6%O8m8m0P9M6j27L2J00rl8j05J47j07Q5j3n5j16
$$ -102 47 39 -72 -90 142 -68 -12 19 -47 -47 21 -27 -67 12 58 -69 -37 63 54 16 -89 58 -49 36 23 -32 -148
3823a48J36J4l1L0nm5J13K7q2J2M0q3j5j3N0o0k9J58m5R8k17M4R4k1m2%%O3jj3
$$ -148 -12 2 -29 1 -4 -49 64 91 9 21 61 -22 -37 -50 0 -60 -89 69 24 122 -95 -51 43 22 -20 -20 -20 43 42 29
3853B9o8l9P5j7J57j64j4J6Q7Nr2j4M7j1K0J3k1N9L4p1J1j10L0M2m2Q6k7M6l4
$$ 29 -39 -78 -3 -20 137 -27 -41 -25 62 67 -25 -39 8 -3 17 30 9 68 102 31 42 -68 -38 4 -38 48 21 67 33
3882C3n5p9J7o6P6O9o0J02p9M8m7P8n5l4J3k9P6J9M1k8%l0p6J75j58j6N3n2lN7
$$ 33 -22 -101 -84 -150 -74 -5 -65 37 -42 6 -41 37 -18 -52 -39 -68 8 27 68 40 40 10 -66 109 -49 -65 -12 -64 -67 -10
3912a0nk0nJ14m9p9J03o7o5P0n2o1J02Ln9l2J16O1m9J2L2l8pm7n3J37Qj46J96
$$ -10 -15 -35 -40 74 25 -54 49 -18 -83 -13 -65 -126 -24 -21 -80 -112 4 65 16 28 60 22 15 -32 -85 52 60 -86 110
3941A10j86M7Q0J0j11J25o6PL2J8j36R5O5l2j12M3k9R0L5p0J1j02J46j97J25k2
$$ 110 -76 -29 51 61 -50 75 9 16 48 66 -70 25 90 58 -54 -11 -40 50 85 15 26 -76 70 -127 -2 -24
3967b4j1j4L3L7nLk3L7k2K3L4q9J13k6j35J27j49Q8K2qr1lJ60j60M4L5m0oO5K
$$ -24 -35 -49 -16 21 16 19 -4 33 11 34 68 -21 92 66 -69 58 -91 -3 19 11 -80 -83 77 -83 -39 -4 -44 -50 15 17
3997A7n4j06J51p7J16M2j69J32P8o8j9r1k9O0jM0l7k6N4p2Q8M0M5Jj53N2K2r5
$$ 17 -37 -143 8 -69 47 89 -80 52 130 62 43 -48 -77 -17 -18 22 -15 -41 13 -59 29 69 114 115 -38 14 36 -59
4025e9k4J18Qq8q6K42o8p6R4J7m3mm9p5K17j07k7J09m7M6j31K7l1o7N0j8JP4j06
$$ -59 -83 35 43 -45 -131 111 43 -33 61 78 35 31 -18 -93 124 17 -10 99 52 98 -33 -6 -37 -104 -54 -72 -71 3 -103
4054a03N9k8M9l5P5k4nO2l4j11N1M8j6O3r3R8k15J23N5L6l0K5n5j08k2M8P2p0
$$ -103 -44 -72 -23 -58 17 -7 -12 50 16 -95 -44 4 -12 51 -42 56 -159 -36 19 55 25 50 -5 -113 -135 -87 -15 -85
4082h5P9j19J55k1N6m3m9J3K1R5o6j4q9%N9N6k7RLm7QL7j3o0J5L9m1J39j18j2
$$ -85 -6 -125 30 9 65 22 -27 -14 7 102 36 22 -67 -67 -8 48 21 30 33 -14 -6 31 18 -42 -27 12 -29 110 -8 -20
4112b0Q8l4rj7J01j00Q6j25o5J16J7n2N2M2q3q9J12l1Q7p9p9P8p0J21j90O4J31
$$ -20 68 34 25 8 109 9 95 -30 -95 21 38 -14 38 80 -3 -92 20 -11 76 -3 -82 -4 -74 47 -143 -79 52
4139E2j79L8M0qo4L5Q5L5k0M3K9p6q7J53Nj07Q1j08KR6N0j11K5j3J4p3p3R5Q9
$$ 52 -127 -89 -49 -57 -121 -86 -1 34 14 57 86 10 -77 76 81 -26 55 -53 -51 45 95 -16 9 -4 10 -63 -136 -41 48
4168D8o8N6pm0p9J05R2j08kM2p8pK8K7J3k4o1j7P7L3M7j88J70q3R0r0l9P3pK5
$$ 48 -20 36 29 -11 -90 15 107 -1 -3 39 -39 -46 -18 9 22 -2 -63 -80 -3 30 77 -111 59 -24 66 -24 -63 10 3 28
4198B8pn2M7K5J0j3j2Pm2P2j13Q2m3n2J17P7j64M0l7P7q6N4o3Q3l5r3m4J25n6
$$ 28 21 -31 16 41 51 38 26 33 -9 63 -50 32 -11 -63 54 131 -33 7 -30 47 -39 15 -48 35 0 -93 -137 -12 -68
4227f8L9j24J72J8J5n9PJ10j70J54q3n5M4mQ3q1k9J4k3PlK8l3J7l4k7O4N3Rj40
$$ -68 -29 -153 19 37 52 -7 0 110 -60 94 11 -44 0 -4 79 -2 -31 -17 -40 -33 -36 -8 -41 -24 -58 -85 -21 32 41 -99
4257i9J74m6qMm3m3J04r0L2J21k43N9K16j55Qj18O3J3L2l9J17J83m05J53N6J22
$$ -99 75 29 21 25 -18 -61 43 -47 -15 106 -137 -78 138 -17 -9 -127 -64 -51 -19 -58 59 242 -163 -10 46 168
4283A68k44J14M6l7lO9j46J37j5J4J1k56J00j0J21r6jK0K9j5J6P0m8R0j54KL8
$$ 168 -76 38 84 47 44 113 -33 104 89 103 114 -142 -42 -52 69 -27 -28 -8 21 6 22 92 44 134 -20 -18 20
4310B0Jm1J1L7j04M9p3N6O0q2J11j03K3L0p1jR9k2M6j40J30p2RQ0n5p4q1J31n
$$ 20 21 -20 -9 28 -76 -27 -100 -44 16 -66 45 -58 -35 -5 -76 -77 22 0 46 -94 36 -36 -27 53 -2 -76 -157 -26 -31
4339c1K2J9K2n8O6O0j32k2Opl7J37j6Q6j15K7n3l4l8Q3N7p0J35p7j6j7M0k4P5
$$ -31 -9 10 32 -26 40 100 -32 -54 -48 -55 -92 45 29 115 0 27 -26 -60 -98 -15 42 -28 107 30 14 -3 37 13 88
4368H8j56J00k0p1P7j8Qj12O6J11j1l1l1o0M4P9m5K8j17MR7q2M7r7J89r6pO7j43
$$ 88 -68 32 12 -59 18 0 8 -104 -38 73 62 31 0 -60 -16 63 18 46 -71 -67 30 -52 -5 -102 87 -9 -16 51 -92
4397i2J90j66K5J18o9k0o0O1K0J07j04N8j20P3k8P0j02J15n0rj5m5J22j05M7l4
$$ -92 98 -68 -43 75 6 -14 -74 -13 7 114 10 68 -52 21 -7 63 -39 76 26 17 2 -43 79 -26 21 -13
4423a3N5l5J0Rl0k6Q3j36O3j6M6k5Q6n5O2j61L9N6Ml9N0km0n2M7Rn6J35j71Q9
$$ -13 42 7 17 26 -4 -30 53 -83 -20 -36 10 -15 71 16 78 -83 -44 12 16 -23 27 25 -15 -67 -20 -11 -67 68 -103 -14
4453a4j2Ok8k3M3q9O5P0Q5m0p9J19j40kJ0P5p5L5L7L0q3oO3L4j04J5K1p4O0m7
$$ -14 -26 -20 -48 -71 -28 -117 -52 18 103 63 -16 103 -37 -39 -29 46 -29 6 43 73 -10 -16 47 81 -23 -8 13 -61 -1 -48
4483d8O8%q1J30m1O4j86J14n5L7l7RL6L5k0q0O9j8J10j85M4k3J17p6J1m6J19m9
$$ -48 20 20 -61 69 28 92 -94 20 -35 2 -35 -26 10 45 25 -55 14 -4 106 -79 -35 -58 59 -17 -6 -52 67 18
4511A8rn5Q7n3p6K04j63m2J35r2J7l5k5N1p1P0l1J2k0R4R0j36L5j9O6l6k4J11
$$ 18 9 -46 41 -12 -88 116 -47 -89 46 -46 -29 -64 -89 -38 -109 -39 -70 -58 -78 16 106 -30 5 -14 52 16 -8 103
4539A03r7j2L1m8j17K60q0j08N8J71o2r5m8j6pQ7n3m2J44j02L3m2J04q1L3p9L8
$$ 103 6 -6 25 -23 -140 120 40 -68 -10 161 99 4 -44 -60 -67 20 -33 -75 69 -33 0 -42 62 -19 14 -65 -27
4566b7k9O6L1N4r1P5r5n9J87j02k9lL2O5j28K2J06k4p0K3m6L5j9pJ12lm4j40N2
$$ -27 -56 10 41 95 4 79 -16 -75 112 10 -19 -22 10 75 -53 -31 75 51 -19 4 -42 -7 -26 -33 79 76 32 -108 -56
4595e6M8R3j64J07j8l7J04m7p8O1m2K7L6p0J01j04J02k4j2r4J6O0p1K9l8P3K7
$$ -56 -8 85 -79 28 10 -27 77 30 -48 13 -29 -2 34 -36 65 -39 63 39 27 -67 -51 9 -62 -33 -71 2 29
4622B9M0R7j80j0Q6j3n5O5M6j41q7J24L6k5N9q0J7RJ1QL3j36P3J18j51Q7r3K37
$$ 29 69 166 -14 -24 62 49 -6 59 105 -36 -123 1 37 12 71 -9 8 17 28 36 69 -67 6 124 -27 60 -33 204
4650B04j87K6K6j24p0J51P1j05O9k9k9J58j21K9j03L0n2J60j02o1K0j09Q2J12
$$ 204 17 43 69 -55 -125 26 97 -8 61 32 3 161 40 69 -34 -4 -56 104 2 -59 -39 -148 -66 46
4674D6o2M7R4j56M0rj13m8N1J18R2j28L3n0PQ9Q5l01J96rnj06K5K32j08k0J7r6
$$ 46 -16 31 125 -31 9 0 -113 -161 -110 8 100 -28 5 -45 -38 51 136 -165 31 22 17 -89 -64 168 60 40 57 -39
4702c9%Q6nq9mK9L7o1P2l9k6J12k2l9N1j41R0lR7r8l3q7K9J26j14J26k8o0J07
$$ -39 -39 47 42 -47 -51 -22 15 -46 26 -13 -39 73 51 12 63 -78 12 9 106 8 -25 -112 -83 43 -71 55 27 -33 74
4731G4K6j56J29n7O0M4k07J25J29j78m3P0OM4q3M8p5M1ll7J46j97K26j11m2k1
$$ 74 100 -56 73 16 76 120 -87 38 167 -11 -54 16 22 66 -17 31 -44 -3 -6 -43 103 -94 132 21 -21 -42
4757d2%J05q7O5k03K14m1j49J94m2lp7J1K4k2pQJ07j04j4J20j40J60o2N5j39K5
$$ -42 -42 63 -24 41 -162 52 11 -138 56 14 11 -66 -55 -31 -53 -60 -52 55 -49 -63 57 -83 77 15 70 -69 -44
4784d4J09n1j12J31k4l9N7M4p9J84j51m8J8K3q9J57j84L8K7Q7m5n3R2q0L5O4L
$$ -44 65 14 -98 33 9 -30 27 71 -8 176 25 -23 -5 18 -71 86 -98 -60 -33 54 9 -44 48 -32 3 67 70
4811G0nj04L7O5J1j1p5J8m8M2J09j15nJ43q4r5J84j46Q0k0nn0M2k1O5n8J7j1o4
$$ 70 65 -39 -2 63 74 63 -12 6 -42 0 109 -6 -11 132 48 -47 137 -9 71 51 46 -4 38 17 82 24 41 30 -34
4840c4O5kj27Q3M4M3j70OL6J07r7Q1Jn4J15q4k6J3l1l3mQ1j02J93r4lK2k9N4p0
$$ -34 31 29 -98 -15 29 72 -98 -92 -56 51 -46 35 36 -18 97 13 -13 0 -31 -64 -68 13 -89 104 10 7 29 0 54 -16
4870a6Qj3KJ4n9M4J35j37L2J23p8j3Nj51J23j70J71J27k12J30j48K9pR6j4j1k1
$$ -16 -8 -21 -19 -5 -64 -20 115 -22 10 133 55 42 47 -104 19 -151 20 147 -65 65 -83 -54 -61 35 21 10 -11
4897a1O6j5p7N2j9M7q0J0L0Mk9J10r4J4%l0Q2k5j05R1L8RL6j52n3L6k2J56j55
$$ -11 55 40 -37 15 -4 43 -37 -27 3 7 -22 88 -6 8 8 -22 60 35 -70 21 59 68 104 -48 -101 -65 -87 69 -86
4926h6J25j9Mn5qL1RN5nr5P6j1o2MK0j1Pl3O2k2q3J35k0M5m1K2n7j20O7J00r4
$$ -86 39 20 24 -31 -39 -8 1 56 51 -44 32 21 -41 -37 -17 -28 -21 -54 8 -14 -97 38 18 63 22 44 -13 -133 -66 34 -60
4957f0P9O7j20J0nk9M6ojK0j7l5PQM8J2r4J31o5p7J12o9J38j22J23j69l8J16n1
$$ -60 19 86 -34 -24 -29 -58 -12 -18 -19 1 -16 -51 -44 -36 12 24 -70 61 -4 -81 31 -38 100 -22 101 -68 -106 10 -41
4986d1J7k8nN4O6k00K08j23l4jk1J69l9K7j02J05Oj00P9j37J93p6j18J1L9Q2o
$$ -41 -24 -52 -57 -3 63 -137 71 -52 -86 -87 -108 61 22 49 -53 52 58 -42 37 -100 93 17 -101 -90 -51 31 25
5013B5R8j20M0p7j0J17r5J01q0k7O9j51J07ml2P3p0N9jj16L9O4l7jK5l8N4M4j4
$$ 25 123 3 43 -34 -44 73 -22 79 -1 -28 41 -110 -3 -7 -39 34 -36 23 22 -94 -55 9 -28 -29 -4 -42 12 56 42
5042D2j09j1J10O2j88J15M7r3Om3M7J8k2M3LL1j19M8q7J08M9j46J05n5k7j0n8
$$ 42 -67 -78 32 94 -94 21 68 -25 -19 -62 -15 3 -19 24 27 58 -61 -13 -100 8 57 -89 16 -39 -66 -76 -134
5069a34k1J61r9J45k0j24Q4o3J49j32P2P1j29kP0m2j31J47k4J20j69P7r4J27q
$$ -134 -155 6 -93 52 32 -92 -8 -71 78 -54 18 89 -40 -42 28 -14 -145 2 -22 98 -71 6 -88 39 31
5094C1j11J42j27J29K0j16lJ6L9l1Ln9rJ15q5J10p1R3n0M1j39J5PJ19m9M2n7q2
$$ 31 -80 62 -65 64 84 -32 -35 -19 20 -11 -8 -67 -76 39 -46 64 -7 86 36 77 -62 -47 -40 79 30 72 15 -67
5122f7L1m5K08j04k5N8J4n1n9M3r1O3rm8L3l5J3N6m5J08q7k6Q3j0mJ1J02j09m7
$$ -67 -36 -81 127 23 -2 56 70 19 -40 3 -88 -25 -34 -82 -49 -84 -71 -15 -60 48 -39 -65 18 8 4 15 117 8 -39
5151c9N8j3l7J58k42R2J57j49M3K9o6l0K1J07j35R4n3rR8j02Q1j07J18l2J0j14
$$ -39 19 6 -31 127 -115 -23 134 -15 28 57 -9 -39 -18 89 -46 48 -5 -14 84 -18 63 -44 74 42 52 -62
5177f2J8L8J5pj40O4R8k9K4N9Q3j89m8J23j7k3k8P4J1l6L0p3n0L0%%Q0K2n7l%
$$ -62 -44 -6 9 2 -138 -74 24 -5 19 78 161 -28 -76 47 30 7 -21 53 64 28 58 -15 -65 -35 -35 -35 45 67 10 7 7
5208Gj10N1j13K01m4L8l0k4N8j03O7p2L3K3l3P5l8M7k2r1J01o3j2N1L4o6Q1r5
$$ 7 -103 -52 -165 36 -8 30 0 -24 34 -69 -2 -74 -41 -18 -51 24 -14 33 11 -80 21 -42 -54 -3 31 -35 46 -49
5236d9Q0l6m2L1K09k63M4M3j3Q3j63J0m2J38N6o7M6n8P0l4k0L2n3k7j7J08j60
$$ -49 31 -5 -47 -16 193 -70 -26 17 4 87 -76 -66 -108 30 86 19 65 7 77 43 23 55 2 -25 -42 66 -94
5263i4J14J2j3k8N2Qq9j2L1O8l5Op8O7Kj7l5L0R7j15N0J6q8R5j05n3J07J4j2J78
$$ -94 20 32 19 -9 43 51 -38 -50 -19 49 14 20 -58 9 11 -6 -41 -11 86 -29 21 37 -51 44 -61 -114 -7 7 -5 173
5293A73j95m6P7K2J1r3J11o8o8L4N2l2K1M2Q3r9rl2l2m2P2j4J3M6m4o8N2M2J5
$$ 173 -22 -68 9 31 42 -51 60 -8 -76 -42 10 -22 -1 41 124 25 16 -16 -48 -90 -18 -32 -19 27 -17 -85 -33 9 24
5322B4J23j85r3Q4Rn0K39j03p3n1P7J8j18K5J0R9Q0k3o1m6O9jm2l8Q2m4n2m4J85
$$ 24 147 -38 -131 -47 -38 -88 151 48 -25 -76 1 19 -99 -74 -64 35 115 92 31 -15 54 53 11 -27 55 11 -41 -85 100
5351A00n0q2M2j29K17r3J8j43M0O1k8M8l0r1J12j13R0Ll0R9K2j68J19MQ3j26K7
$$ 100 50 -32 10 -119 98 5 23 -120 -80 -19 -47 1 -29 -120 -8 -121 -31 -28 -58 41 63 -105 14 18 101 -25 2
5378BR3o5K2q1N0p8N5j1O2J8r9O8o1j3P9j16K3R1j34M0qJ03M7o1n7%J09o4r6J54
$$ 2 95 30 52 -29 21 -57 -2 -13 49 67 -32 36 -25 -38 41 -75 -52 39 -95 -55 -63 40 87 26 -31 -31 78 14 -82 72
5408G2j2j05JN4o5P2m9J26r2J43k41J11r1J71p3k8M0m2n3J40J5N8j40o4P4J0o7
$$ 72 60 -45 -44 10 -55 17 -32 94 2 145 -96 15 -76 95 22 -6 34 -8 -61 79 94 152 12 -52 22 32 -35
5435c5L1qj6N0KoL2j4j67J30J7NLL1l3lj40L6J40q7OP4o5J17j9k36J28J08M6j11
$$ -35 -4 -12 -28 22 24 18 50 36 -131 -1 16 21 24 55 22 19 -121 -85 55 -32 -26 48 -17 100 81 -155 -27 81 127 16
5465A6j0J12j02n3L7o6N4K8n4%JL1k0J6Q5Rj43J96j44o2R5nr6J32o2J4K1J9n9
$$ 16 6 118 16 -37 0 -66 -12 16 -38 -38 -37 -6 -26 -10 75 84 -59 137 -7 -69 26 21 -75 57 -5 9 30 49 -10
5494a0Pm6K7rQ3o7o3J49r9N0l7J50q8K0p7QO0k8n0P1j06N2K6n1nO9J1qp9Q4k2
$$ -10 -3 -49 -22 -31 52 -15 -78 71 -28 22 -15 135 47 67 -10 -2 58 30 -20 51 -55 -3 23 -28 -33 36 47 39 -40 44 22
5525B2L5o6J2n5j1O4q0J1JM2J12j63J74j05p1J09O0q6J4j6m8J38j04L6m9oJ14
$$ 22 57 -9 3 -52 -63 1 -79 -68 -67 -25 87 -76 98 -7 -78 31 91 5 19 3 -45 93 -11 25 -24 -30 84
5552H4q1p5Q7P0q9m9J6R9q4J1m2l5k4J34p2N8L0j60J56j47J29j58K28m9j17J18
$$ 84 3 -72 15 85 -4 -53 -37 62 -22 -11 -53 -88 -112 22 -50 8 38 -122 34 -113 16 -142 86 37 -80 38
5578C8j5m0J02o1K3r8m3K13j22o1J52k24Q5L9J62l4j50K8m3l4M8L3M5N3o5j01
$$ 38 23 -17 85 24 47 -51 -94 119 -3 -64 88 -136 -51 -12 150 116 -34 -6 -49 -83 -35 -2 43 96 31 -70
5604g0K00r4j29J12Jp1m6j5R4k5P4n0K5R6q8q9J2q0J52m2J93j57n9n7P0N0KP1
$$ -70 130 36 -93 19 20 -51 -97 -112 -18 -43 31 -19 6 102 14 -75 -63 -143 9 -33 160 3 -56 -113 -43 7 9 80
5632H0K8q0j4m6J38o6o6j9NP2j42P6o8J54j13lJ14n3l1o3N9L3kj2j3P8j5p5P7
$$ 80 108 28 14 -32 106 40 -26 -45 -40 32 -110 -34 -102 52 -61 -64 50 -3 -34 -97 -38 -5 -7 -19 -32 46 31 -44 33
5661C3K9l4n3L2J31j94p2J02n1J44l6m4k9N0oP1j47P0L1m6j1O6J9r9%m8L5O4o3
$$ 33 62 28 -25 7 138 -56 -128 -26 -77 67 31 -13 -42 8 2 73 -74 -4 27 -19 -30 36 55 -44 -44 -92 -57 7 -56
5690e6k4R5n7k9J31j6n3qP7o6Ql9N6j6P5J6j79P5j3J99j72N5n0R0k1j93K08K3
$$ -56 -80 15 -42 -71 60 44 -9 -17 60 -6 2 -37 19 3 78 94 -85 -10 -23 176 4 59 9 99 78 -115 93 116
5718A16j30j5J22j27J02l6m4PNJ2l0j1Q0p8N2r4P6L2op9o8L3j6J15m7N8o6p8J42
$$ 116 -14 -29 93 -34 68 32 -12 -5 0 12 -18 -29 51 -27 25 -69 7 39 33 -46 -114 -81 -97 18 -29 29 -37 -115 27
5747B7J40j16J8o1m5j11J73j58K57k46P1J3P5j70J42K4P0j7j48J35j57K4L0q1
$$ 27 167 51 69 8 -37 -148 25 -133 124 -122 -51 -38 37 -133 9 33 103 86 -62 73 -84 -60 -30 -111
5771a11Q7o2O9P1k1O2k18Q5O8j45Q6J55k00L0kR0j03j7R7O5j43J19M2q5M3o1l7
$$ -111 -24 -86 -17 54 33 95 -123 -38 30 -115 -29 126 -74 -44 -46 44 -59 -76 21 86 -57 62 104 19 62 1 -36
5798c6Kl0J09R6n4l4k3j28R2m2N3o1J20j5l5j32J48p6J4J00j26JJ58j19Q6j01
$$ -36 -34 -64 45 141 87 53 30 -98 -6 -48 5 -56 64 49 14 -118 30 -46 -32 68 -58 -57 101 -18 68 -33
5824c3J8l3P0j99J41L8r3P9Q0k6j5Kp3J50q2j80K39p0q1J02m1p8Q1R5m9m0N3p9
$$ -33 -15 -48 22 -177 -36 2 -91 -12 68 42 27 29 -44 106 24 -156 83 13 -68 34 -7 -85 -4 91 42 2 55 -24
5852b4M1j1N1o7M7J0N5k02J75j12k0R2j7lj6r3K13j66QL9j0J96k39K9J8m2M4M8
$$ -24 17 6 57 -10 37 47 102 -100 75 -37 -57 35 18 15 -1 -94 119 -47 -39 0 -10 186 -53 -24 -6 -48 -4 44
5880D4oM7Qj66j05J77J38j42n1R1q3J70k8j93J24q9Q0r9P0L7k1l5R6k3r9l7QR3
$$ 44 38 85 93 -73 -178 -1 137 -5 -56 35 -48 122 94 -99 25 -64 16 -83 -13 24 3 -32 64 41 -58 -95 -87 6
5908FK6J0r1R9o6J14j29P9m6r7J07K4j14J52j15J23M1j28P6k2m7M1K4l8rl6n2
$$ 6 32 42 -49 50 -16 98 -31 48 2 -95 12 36 -78 74 -41 82 123 -5 71 49 2 43 67 29 20 -16 -68
5935f8K7J1l2Q5o0j0K7j9p0J68R3k21J25m4n0p6J26p7J01j05Q0N8j50N1nrJ0L3
$$ -68 -41 -30 -62 23 -37 -47 -20 -39 -109 59 152 -69 56 12 -38 -114 12 -65 36 -69 11 69 -81 -30 -35 -44 -34 -1
5963aj7J67p9o6P4l4q5K8o7K6J24m1r1J5o5J81n2qJ13q7k9q3R7p7k5J18q6K33
$$ -1 -18 149 70 4 78 44 -41 -13 -80 -54 70 29 -62 -47 -112 69 17 9 122 35 6 -77 20 -57 -82 36 -50 183
5991A83j88j7K9J48q8j68J01kP9j31K2M9p0k1J09No9LPL1P4qj44R0M1M0j20R6
$$ 183 -5 -22 7 155 67 -101 0 -2 77 -54 -32 17 -53 -74 35 40 -29 -26 -19 12 86 78 -66 24 65 105 -15 81
6019H1j13P6m5kJ64q5K2n8m4P2r5m6L0L4NK8P3j98J72j89J86j83K10o4%p4M0r7
$$ 81 -32 44 -1 -3 161 76 98 40 -4 68 -27 -73 -43 -9 -4 24 97 -101 71 -118 68 -115 95 31 31 -43 -3 -100
6047a00J66j90J13K6r9P5r3J46n6m3l1R2Mj0M5j6Nj24J16M2j11J5K9mP4j25K6
$$ -100 66 -124 -11 15 -84 -9 -102 44 -12 -55 -86 6 10 0 45 29 34 -90 26 68 -43 -28 1 -3 71 -54 -28
6074b8J09j59J55p6J07j28L7l6L4l5o7J31p3Pq5J22o6R6q5Q9k1m3j8J25j17J84
$$ -28 81 -78 77 1 108 -20 17 -19 15 -20 -87 44 -29 -22 -107 15 -51 45 -40 49 28 -15 -33 92 -25 159
6100A59p1j21k3j1J19j21P4M8m6k4K1K0o5M3l9K5O3q1N1J6j25N1J05j77N2O2P1
$$ 159 88 -33 -56 -67 52 -69 5 53 7 -17 4 24 -41 2 -37 -12 51 -30 21 37 -88 -37 68 -109 -57 5 76
6127G6j28NK3K1N1jo5M1r9K4P1j04N1k9L9O2K1j07O7k9Pn9O7l1L1j4n0k6J65q4
$$ 76 -52 -47 -24 -3 48 47 -18 23 -76 -52 19 -85 -34 -63 -24 38 59 -48 19 -10 -3 -62 5 -26 5 -9 -59 -85 80 -4
6157dP%m0O6K3j28Q3Q0r2M6J0j2j05N8M3Kj32J55j07P6O7j06oL3n3m7n3J78J4
$$ -4 3 3 -37 29 52 -76 7 87 -5 41 51 39 -66 -8 35 37 -95 60 -47 29 96 -10 -16 17 -36 -83 -136 42 56
6186E6j23J09p7J56j59O9n5L1l0r3J06M3n7k8O2Km7K46k13M9Lq9l7K7O2l7jO9
$$ 56 -67 42 -35 121 -38 31 -24 7 -23 -116 -10 33 -24 -52 10 12 -35 211 -2 47 50 -39 -76 -49 13 -24 -25 44
6214D4k2L7Mp2jP5j09L3J7j03J56j7M2j66J58j3m0K1q0L9r5lJ56k00J23R2r1K3
$$ 44 22 59 63 -9 -10 65 -44 -11 6 -97 59 42 84 -82 76 63 23 44 -36 3 -92 -95 61 -139 -16 76 -15 8
6242HJ9K7n4m3LJ8j8J0J0P0j8j40J59j80K32Oj35K5O9j28J77Jj31O0Oj76K6QR7
$$ 8 27 54 0 -43 -40 -22 -40 -30 -20 50 32 -108 51 -129 103 109 -26 -1 68 -60 117 118 -13 47 53 -123 -97 -89 8
6271HL3j54R2P5n7k9m1NJ5Kl0J22r9R9n8l3q7J52O3m5r9K0J4K1Op6O7L5N5o8l7
$$ 8 41 -113 -21 54 -3 -32 -73 -68 -53 -51 -81 41 -58 41 -17 -50 -137 15 78 33 -66 -46 -32 -11 -5 -81 -14 21 76 8 -29
6302b9P0kj8o5Q9p5l0j3QOK2M9l9qJ52j46M1Pj78J53m2J06M1r1R0Op9j8M1m1p4
$$ -29 41 39 21 -44 45 -30 -60 -73 -65 -59 -37 12 -27 -35 117 -29 12 19 -159 -6 -48 58 99 8 98 104 25 7 48 7 -67
6333f7N5q9O2j7R9j07N9Q1J1j12pk1P6o6J49n2q2R4k0Q3j68j9J31p8Q9j59J37
$$ -67 -12 -101 -39 -56 43 -64 -5 76 87 -25 -32 -53 23 -43 106 54 -28 66 46 129 -39 -58 73 -5 84 -75 62
6360F2q8K7M3q0J2L2M6l6p5M2R5j39Q6O2j24j7P1qO0j50J15n7M0l8j08O8P7O5
$$ 62 -26 1 44 -36 -24 8 54 18 -57 -15 80 -59 27 89 -35 -52 19 11 71 -79 36 -21 19 -19 -127 -59 18 83
6388H3j18J71j20j1l2rQ0j9N0p1k7R6p2l0R3j6m5lk0kNK9n6J12j09o1lQ9pm0P3
$$ 83 -35 136 16 5 -27 -36 44 25 75 4 -23 73 1 -29 64 48 3 0 -20 -22 -17 12 -44 68 -41 -102 -105 -16 -23 -63 10
6419A0j47J66lq1J02q6N6j2o2N2qM1K2p2N9n0j7R3j27J5L3Q9k9O2j09q0J45j47
$$ 10 -137 29 26 -55 47 -39 17 5 -57 -5 -13 28 50 -22 37 -13 -30 63 -64 -49 -16 73 44 106 -3 -83 62 -85
6447h5J11k1K6Pr7M0J3n1J02j30Q7R0j67Q2k0oK0n1j8K4J2Q0j35J41K0k23K24
$$ -85 26 5 31 38 -59 -19 -6 -57 45 -85 2 92 -75 7 -13 -19 1 -50 -68 -44 -32 48 -87 54 74 -149 75
6474G5j16Q9n5q1J09pJ3O2j65R3j66J82m8K5N8J1r6N6n1l0k2M1j9O4l7J45k9j17
$$ 75 -41 48 -7 -88 21 14 27 89 -76 17 -149 33 -15 10 68 79 -17 39 -12 -42 -64 -23 -42 22 -15 130 101 -16
6502a6NL4p5J68j26L2M8J3J4j99J01k5N7Q8j64q9J02K4n2J18L2m4k8n2Q1M3kp4
$$ -16 -11 23 -52 116 -10 22 70 83 97 -102 -1 -26 31 119 -45 -134 -32 -8 -60 58 90 46 18 -34 47 90 88 14
6530A4J2oj9J9qO1j52n8M8J17j53J11K4j42K3O3J00m0k2%po0J59m6l6Q0J7j27
$$ 14 26 20 1 20 12 73 -79 -137 -89 28 -125 -14 10 -132 -109 -46 54 14 -8 -8 -15 -75 84 38 2 82 99 -28
6558b8N4m4K4J2j05J59j20P8Qk5O0j2k25Q3O7J4J9R3K3j19p1j6M8j3N3jO1jj07
$$ -28 26 -18 6 18 -87 72 -48 30 38 13 73 61 -164 -81 -14 0 19 112 135 16 -55 -71 -23 -36 17 16 77 76 -31
6587c1k1J12l5k2J56j84L8J9Nn7N8l6MJ28j82R9n3L3j29J36K7k6O6n0j7j25N6
$$ -31 -52 60 25 3 159 -25 13 32 37 -20 38 2 6 134 -48 51 -2 31 -98 38 65 39 105 55 38 -87 -31
6614c1j7M5l0J9N2l9JO8q0Q9l2r7P2l2m5L3p4K06r8l3Q7p0m4R0P0j23OOK6n7N9
$$ -31 -48 -3 -33 -14 38 -1 0 68 -12 77 45 -52 20 -12 -57 -24 -98 108 10 -23 64 -6 -50 40 110 -13 -7 -1 25 -32 27
6645B7J1n2R8J02j90r7J0J53r8M5Oj3o3N8p4P6O0l6N4j21R0k7p8Q3Nj19R6M4l9
$$ 27 38 -14 84 186 -4 -101 -91 62 -36 9 15 2 -61 -3 -77 -1 59 23 77 -44 46 19 -59 24 29 -90 6 50 11
6674A1J19j29Oj1Q3j56L5L4jj2p6J53m9ok6Q1K5j35K34k23N7K8o5o7JJ27j85J16
$$ 11 130 1 7 -4 79 -77 -42 -8 -9 -21 -97 56 7 1 -25 56 81 -54 180 -43 14 42 -23 -90 -89 38 -147 -31
6702c1qJ00Rj43Q7J4o1K3LK7q7R2o9J26n0K7l6M7j39J10k8M5l1jK8j08m3J96k6
$$ -31 -39 61 70 -73 14 28 -33 -10 -7 20 -67 25 -44 82 32 59 23 70 -69 41 13 58 27 26 54 -54 -97 99 73
6731G3j9o4l4O3LK3j63J16N6j4l5qr7J48J6pj13R8l4n0qJ14m0j40J25M6L8q2m
$$ 73 54 -10 -44 19 22 45 -118 -2 54 40 5 -3 -100 48 64 57 -56 42 8 -42 -50 64 24 -116 9 55 93 11 7
6760GO2Mm8r7N4M9p0oo5k0J94o3q4J67j3Rl5l0M8KJ4j33R5k9Oj5j13P6k0R1mm3
$$ 7 69 73 25 -72 -18 31 -39 -45 -110 -130 64 1 -83 84 71 80 45 15 63 65 79 -54 41 12 18 3 -110 -34 -54 37 33 -10
6792a0l4J9Q6p5%M5J7k5N5k2n5Q1k0k1j3J8p6R7q3j1j2L6L7r8l6K42j41k8K0m1
$$ -10 -44 -25 61 -14 -14 31 48 23 78 56 1 82 62 41 28 46 -30 67 -16 -27 -39 -3 34 -64 -100 142 1 -27 -7 -48
6822d8K04j57P4r3o7M7L5n9M4NJ0Rn4j7M8l7Q2m2j02J55j4n6J15r0m1l4R6J8q2
$$ -48 156 -1 73 -20 -87 -40 -5 -64 -20 -15 -5 4 -50 -67 -19 -56 26 -16 -118 37 23 -33 82 -8 -49 -83 13 31 -51
6851e1J82K6k09N7n0j0Q1k2J19j58J70m5j04kJ1k8K3K4M4p6O6m6M6oq0km5jN8
$$ -51 131 157 -52 5 -45 -55 26 4 123 -35 135 90 -14 -16 -5 -33 -10 14 58 -18 48 2 48 42 -38 -40 -85 -86 -28
6880b8O3m2R2j47O2pJ9O8m8p2J37j2n5nJj5l0Q7k3o9k5oJ63r9j51J57Q2l9j15
$$ -28 35 -7 85 -62 0 -7 12 80 32 -40 97 85 30 25 26 11 -19 68 45 -24 -49 -55 108 9 -142 15 97 58 -57
$$ [...]
8191a05
##END NTUPLES=NMR FID
##END=
