##TITLE=1H_Pr NCS-117
 CDCl3
 8 sc, 
 6.06.2022
##JCAMPDX= 6.0         $$ Bruker NMR JCAMP-DX V2.0
##DATA TYPE= NMR FID
##DATA CLASS= NTUPLES
##ORIGIN= UXNMR, Bruker Analytische Messtechnik GmbH
##OWNER= root
$$ XWIN-NMR		Version 3.5
$$ Mon Jun  6 14:08:02 2022 Russian Standard Time (UT+4h)  she@DPX200
##.OBSERVE FREQUENCY= 200.13135
##.OBSERVE NUCLEUS= ^1H
##.DELAY= (6, 6)
##.ACQUISITION MODE= SIMULTANEOUS
##.ACQUISITION SCHEME= undefined
##.AVERAGES= 8
##.DIGITISER RES= 18
##SPECTROMETER/DATA SYSTEM= spect
##.PULSE SEQUENCE= zg30
##.SOLVENT NAME= CDCl3
##.SHIFT REFERENCE= (INTERNAL, CDCl3, 0, 15.7039)
##AUDIT TRAIL= $$ (NUMBER, WHEN, WHO, WHERE, WHAT)
$$ ##TITLE= Audit trail, XWIN-NMR		Version 3.5
$$ ##JCAMPDX= 5.01
$$ ##ORIGIN= Bruker BioSpin GmbH
$$ ##OWNER= she
$$ F:/spectra/data/she/nmr/H-F/1/audita.txt
$$ ##AUDIT TRAIL=  $$ (NUMBER, WHEN, WHO, WHERE, WHAT)
(   1,<2022-06-06 14:06:52.25 +0400>,<she>,<DPX200>,
      <created by zg, POWCHK disabled, PULCHK disabled
       configuration hash MD5:
       00 E9 B6 7A A2 85 ED C7 34 08 36 98 17 FE 4E 26
       data hash MD5: 16K
       86 5C A0 B3 09 C4 4A 4E E3 B4 28 75 7A BB 01 DF>)
$$ ##END=
$$ 
$$ hash MD5
$$ A2 BB E8 07 7C 3F 48 94 49 E6 C5 94 42 30 7D 67
##$RELAX= 
##$RELAX= 
##$RELAX= 
##$RELAX= 
##$RELAX= 
##$RELAX= 
$$ Bruker specific parameters
$$ --------------------------
##$DU= <F:/spectra>
##$EXPNO= 1
##$NAME= <H-F>
##$PROCNO= 1
##$TYPE= <nmr>
##$USER= <she>
##$AMP= (0..31)
100 100 100 100 100 100 100 100 100 100 100 100 100 100 100 100 100 100 
100 100 100 100 100 100 100 100 100 100 100 100 100 100 
##$AQSEQ= 0
##$AQ_mod= 1
##$AUNM= <au_zg>
##$AUTOPOS= <>
##$BF1= 200.13
##$BF2= 200.13
##$BF3= 200.13
##$BF4= 200.13
##$BF5= 200.13
##$BF6= 200.13
##$BF7= 200.13
##$BF8= 200.13
##$BYTORDA= 1
##$CFDGTYP= 0
##$CFRGTYP= 5
##$CHEMSTR= <none>
##$CNST= (0..31)
1 1 145 1 1 1 1 1 1 1 1 1 1 1 1 1 1 1 1 1 1 1 1 1 1 1 1 1 1 1 1 1 
##$CPDPRG= <>
##$CPDPRG1= <>
##$CPDPRG2= <>
##$CPDPRG3= <>
##$CPDPRG4= <mlev>
##$CPDPRG5= <mlev>
##$CPDPRG6= <mlev>
##$CPDPRG7= <mlev>
##$CPDPRG8= <mlev>
##$CPDPRGB= <>
##$CPDPRGT= <>
##$D= (0..31)
0 1.2 0 0 0 0 0 0 0 0.06 0 0.03 0 0 0 0 0.0002 0 0 0 0 0 0 0 0 0 0 0 0 
0 0 0 
##$DATE= 1654510011
##$DBL= (0..7)
120 120 120 120 120 120 120 120 
##$DBP= (0..7)
150 150 150 150 150 150 150 150 
##$DBP07= 0
##$DBPNAM0= <>
##$DBPNAM1= <>
##$DBPNAM2= <>
##$DBPNAM3= <>
##$DBPNAM4= <>
##$DBPNAM5= <>
##$DBPNAM6= <>
##$DBPNAM7= <>
##$DBPOAL= (0..7)
0.5 0.5 0.5 0.5 0.5 0.5 0.5 0.5 
##$DBPOFFS= (0..7)
0 0 0 0 0 0 0 0 
##$DE= 6
##$DECBNUC= <off>
##$DECIM= 32
##$DECNUC= <off>
##$DECSTAT= 4
##$DIGMOD= 1
##$DIGTYP= 9
##$DL= (0..7)
0 120 120 120 120 120 120 120 
##$DP= (0..7)
150 150 150 150 150 150 150 150 
##$DP07= 0
##$DPNAME0= <>
##$DPNAME1= <>
##$DPNAME2= <>
##$DPNAME3= <>
##$DPNAME4= <>
##$DPNAME5= <>
##$DPNAME6= <>
##$DPNAME7= <>
##$DPOAL= (0..7)
0.5 0.5 0.5 0.5 0.5 0.5 0.5 0.5 
##$DPOFFS= (0..7)
0 0 0 0 0 0 0 0 
##$DQDMODE= 0
##$DR= 18
##$DS= 0
##$DSLIST= <SSSSSSSSSSSSSSS>
$$ [...]
##$SUBNAM2= <"">
##$SUBNAM3= <"">
##$SUBNAM4= <"">
##$SUBNAM5= <"">
##$SUBNAM6= <"">
##$SUBNAM7= <"">
##$SUBNAM8= <"">
##$SUBNAM9= <"">
##$SW= 18.05172834244
##$SWIBOX= (0..15)
0 0 2 0 0 0 0 0 0 0 0 0 0 0 0 0 
##$SW_h= 3612.71676300578
##$TD= 16384
##$TD0= 1
##$TE= 0
##$TE2= 300
##$TE3= 300
##$TEG= 300
##$TL= (0..7)
0 120 120 120 120 120 120 120 
##$TP= (0..7)
150 150 150 150 150 150 150 150 
##$TP07= 0
##$TPNAME0= <>
##$TPNAME1= <>
##$TPNAME2= <>
##$TPNAME3= <>
##$TPNAME4= <>
##$TPNAME5= <>
##$TPNAME6= <>
##$TPNAME7= <>
##$TPOAL= (0..7)
0.5 0.5 0.5 0.5 0.5 0.5 0.5 0.5 
##$TPOFFS= (0..7)
0 0 0 0 0 0 0 0 
##$TUNHIN= 0
##$TUNHOUT= 0
##$TUNXOUT= 0
##$USERA1= <user>
##$USERA2= <user>
##$USERA3= <user>
##$USERA4= <user>
##$USERA5= <user>
##$V9= 5
##$VALIST= <valist>
##$VCLIST= <CCCCCCCCCCCCCCC>
##$VD= 0
##$VDLIST= <DDDDDDDDDDDDDDD>
##$VPLIST= <PPPPPPPPPPPPPPP>
##$VTLIST= <TTTTTTTTTTTTTTT>
##$WBST= 1024
##$WBSW= 4
##$XGAIN= (0..3)
0 0 0 0 
##$XL= 0
##$YL= 0
##$YMAX_a= 180258
##$YMIN_a= -237012
##$ZGOPTNS= <>
##$ZL1= 120
##$ZL2= 120
##$ZL3= 120
##$ZL4= 120
##$ABSF1= 10
##$ABSF2= 0
##$ABSG= 5
##$ABSL= 3
##$ALPHA= 0
##$AQORDER= 0
##$ASSFAC= 0
##$ASSFACI= 0
##$ASSFACX= 0
##$ASSWID= 0
##$AUNMP= <proc_1d>
##$AZFE= 0.1
##$AZFW= 0.1
##$BCFW= 1
##$BC_mod= 2
##$BYTORDP= 1
##$COROFFS= 0
##$CY= 11.3945322036743
##$DATMOD= 1
##$DC= 2
##$DFILT= <>
##$DTYPP= 0
##$F1P= 2.36226072786647
##$F2P= -0.459571619588291
##$FCOR= 0.5
##$FTSIZE= 0
##$FT_mod= 4
##$GAMMA= 1
##$GB= 0.15
##$INTBC= 1
##$INTSCL= 1
##$ISEN= 128
##$LB= 0.24
##$LEV0= 0
##$LPBIN= 0
##$MAXI= 10000
##$MC2= 0
##$MEAN= 0
##$ME_mod= 0
##$MI= 1.114404
##$NCOEF= 0
##$NC_proc= 0
##$NLEV= 6
##$NOISF1= 3.799351
##$NOISF2= 2.8
##$NSP= 1
##$NTH_PI= 0
##$NZP= 0
##$OFFSET= 15.70392
##$PC= 1
##$PHC0= -18035.51
##$PHC1= 12.40074
##$PH_mod= 1
##$PKNL= yes
##$PPARMOD= 0
##$PSCAL= 0
##$PSIGN= 0
##$REVERSE= no
##$SF= 200.130013532006
##$SI= 16384
##$SIGF1= 3
##$SIGF2= 2
##$SINO= 400
##$SIOLD= 16384
##$SREGLST= <1H.CDCl3>
##$SSB= 0
##$STSI= 0
##$STSR= 0
##$SW_p= 3612.71676300578
##$SYMM= 0
##$S_DEV= 0
##$TDeff= 0
##$TDoff= 0
##$TI= <>
##$TILT= no
##$TM1= 0
##$TM2= 0
##$TOPLEV= 0
##$USERP1= <user>
##$USERP2= <user>
##$USERP3= <user>
##$USERP4= <user>
##$USERP5= <user>
##$WDW= 1
##$XDIM= 8192
##$YMAX_p= 0
##$YMIN_p= 0
$$ End of Bruker specific parameters
$$ ---------------------------------
##NTUPLES= NMR FID
##VAR_NAME=  TIME,          FID/REAL,        FID/IMAG
##SYMBOL=    X,             R,               I
##VAR_TYPE=  INDEPENDENT,   DEPENDENT,       DEPENDENT
##VAR_FORM=  AFFN,          ASDF,            ASDF
##VAR_DIM=   8192,          8192,            8192
##UNITS=     SECONDS,       ARBITRARY UNITS, ARBITRARY UNITS
##FACTOR=    0.0002768,     1,               1
##FIRST=     0,             0,               0
##LAST=      2.2672688,     0,               0
##MIN=       0,             -237012,         0
##MAX=       2.2672688,     180258,          0
$$ Real data points
##PAGE= N=1
##DATA TABLE= (X++(R..R)), XYDATA
$$ [...]
1843fJ12M38o10R83n65n83J003k97l58O9n40R26n14q32J249q34l85Q03m55K82
1863a14l41j90Q33q07K9Q89p66M34K10m99Q82n16l55J072j054P00N52j097M64
1882C26p2l97N61p83M63K46j197Q29o6o06Q76p75J96N07j319J452j2j034P76q2
1902a11J51R7m69O83N1r05J156l47l71N88p36J074l47r84Q07L1o66M49p35O40
1922E6Rr22O17Ol05N16n28R6Q6m23J028j10m99O64l86L25K35r10O82N10q29N15
1944D33l12J5M29r65P88K20p86L81l76r3O14j242J025L43j164L36L50k83J63o75
1964g99P51N13j143O75K30k41M62q34P57P31j513O83M36n58K75o52O75K02j128
1983d78L42M28o38L71m89K90L88r46J77Q16j020O74o04N01N86j170Q22M41r26
$$ y = [-6, 106, 544, -66, 917, 352, -231, 772, 475, 117, 186, -354, 572, 58, -774, 475, -359, -744, 59, -396, -114, -455, -645, 188, -619, -590, 299, -467, -33, 177, -322, 560, 44, -311, 761, -293, 407, 959, -138, 326, 254, -143, 418, -365, 98, 344, -853, -24, -90, -696, 180, -595, -399, 108, -1211, 241, 229, -805, -29, -111, 40, 137, -332, 351, 402, -503, 653, 306, -65, 523, -213, 861, 514, -470, 337, 368, -298, 151, -584, 56, 65, -857, -240, -234, -539, -23, -551, -455, -369, -792, 236, 126, -373, 291, -95, 230, 465, -445, 237, 747, -82, 433, 121, 136, 565, -400, 388, 608, -178, 203, -173, -266, 348, -894, 131, 474, -690, -354, -4, -287, -124, -799, -48, 465, -678, -3, 227, -14, 448, -386, 371, 1102, -411, 272, 708, 150, 425, -227, 448, 650, -478, -136, 292, -346, 25, -464, -174, 214, -732, -555, 261, -759, -85, -689, -188, 398, -772, 50, 491, -435]
2002d35N94q0l6O64q73M09P31j213M55L23m50O14r78J82P46j347N76R4m66O09
2022A19o86N46L23j148N70M27l93P07q99M33M68q26M77L31n27O76m12q5N67o98
2042c0P7R73r71K29m76M8O20j031K56Q12r47J81M6l32O82p61L21L85n26K55J98
2063In53O71m33M28O26q72Q9N89n48N02l66J40N76j053L49M22n56K92m12q3N57
2084C74q42K46K81o24O25l95l01J113j042K48N86p87O07%k72Q34n95Q9M94n39
2104A00M60k87m91Q38l86n37Q72p95J18J36j90N27q77o6Q57q27K0K87j19M84n43
2125d19lQ19p58M73K8l86O11k60r3P54q42J64N74n07J4J70n72R00p72J61J87o43
2147d00M15k17k14O67n62o8L84n21M25r9m04Q81k85m44J145r18K19M08l37M53
$$ y = [-435, 159, 79, 43, 707, -166, 243, 974, -239, 216, 539, 89, 703, -275, -93, 653, -694, -118, -24, -490, 119, -567, -21, 302, -846, -276, 151, -242, 465, -434, -1, 467, -359, 118, 449, -78, 598, 186, 101, 668, -30, 47, 1020, 49, 278, -198, -150, 470, -561, -305, 507, -440, -259, -213, -545, 137, -624, -303, 82, -444, -189, 9, -544, 127, -306, 122, 748, -124, -35, 554, 6, 508, 142, 282, 858, -195, 154, 576, 20, 312, -100, -183, 374, -468, -222, 59, -565, 60, -335, -636, 477, -565, -317, 269, -518, 89, 89, -183, 651, 56, 145, 639, 100, 560, 273, -218, 620, 234, -303, 569, -226, -108, 28, -162, 365, -512, -578, 279, -548, -528, -241, -360, 124, -419, -422, 397, -361, 112, 140, -246, 365, 105, 12, 766, -76, 88, 662, 155, 169, 339, -233, 667, -105, 56, 243, -400, 15, -202, -416, 251, -311, -379, 5, -516, -91, -190, -594, 287, 2, -442, 703, -215, 4, 412, 75, 528]
2167E28k09j16L56k51L3j12m80Q00m17m20R06n00m52L53j48M24q69m4R01p97r
2188e23P41n38K00o2J55N77o52lO66l11M9j19l91O53k04m12P17l40O5K32p51O72
2210D21l07k52O49j108M98K99r62O39o9k97L28j16K05Rm02P10O5p85O68m56L55
2231I2M70n60K55j68l41Q86m44j82K57l75M42k11n48O73k27l56N12m75Q0M13o61
2252d68M58o17k5Q77l81O4J57m90P38j14l41O22n06K08N49p26M58P7n81M31l90
2273@J29K27o16K04K50o62P16n75j11M63m44M34l7l40J07K86l47M76k82K33K84
2294C95o62O66j08m12P09o03J31M04n91L14P4m47L12j49j21K16m17M70m16l91
2314f26P15l29l34L95j45K81p3l94J035o03l1Q56r99L27L59n55O04j89l58P48
$$ y = [528, 319, 203, 559, 308, 341, 229, -251, 549, 132, -288, 618, 118, -334, 19, -129, 295, -574, -618, 283, -514, -523, 218, -320, -120, -182, -27, 550, -102, -105, 561, 250, 299, 180, -211, 442, 238, -174, 543, 203, 268, 500, -251, 421, 114, -138, 511, -597, -99, 200, -762, -123, -192, -489, -161, -277, -72, -63, -465, 245, 310, -475, 193, -263, 92, 562, 2, 257, 89, -252, 634, 190, 8, 265, -110, 332, 121, -427, 246, 19, -337, 175, -300, -220, 193, -468, -10, -627, -652, 225, -156, -92, 65, -425, 313, 199, -142, 480, -26, 182, 731, 5, 463, 540, -41, 390, 0, 129, 356, -260, -56, 194, -468, 248, -327, -438, 25, -419, 15, -22, -362, -255, 31, -316, 160, -122, 111, 395, -267, 399, 291, -121, 588, -15, 116, 520, -71, 243, 317, -130, 182, 33, -88, 128, -289, 181, -235, -626, 89, -240, -574, -179, -324, -43, -116, -510, 525, -78, -109, 747, -252, 75, 434, -121, 483, 294, -64, 684]
2334F84m67j50J42l39K16j5l43P29o35O0K32o50K10J57j53J73p9p2N09p75Q23
2355B57j95k93O43l55J42K59o00K57K97m66N22m67k86P93n00K06J06p43M26r5
2375i2j74N76o47L72J31p35N64jm54P35k41j97N66p09M48J48o02O46m67K68L65
2396E00r19O38K08m87J49j15J7L05l49k1K74n58L05l45J50L03p36K28O25m57J57
2417a28J37k25M62m95RM98k14L95Qm81O96p92J58N03o56L16J56k88L44o61J73
2438h5L40p64M47K8q25Q61j67P1r0j63M0L40k32K56M3k1K36m05M59J52o99M79
2460C01rm60O33n26j18Q19n93J37l8p6K26p22J97P27j032M23K2o35Q26l11K0N67
2482C78p50q8O35m29P31m13o0P11p29M8L06l89L59k51j62Q28p54l68Q68p42M4
$$ y = [684, 217, 67, 209, -130, 86, 71, -272, 457, -178, -118, 114, -536, -326, -169, -322, -149, -228, -300, 209, -566, 257, 62, -231, 412, 57, 199, 458, -142, 115, 412, -54, 468, 1, -285, 508, 8, 214, 320, -423, 3, -92, -266, 310, -337, 35, 166, -569, -5, -6, -460, 275, 34, -163, 403, -306, 142, 290, -312, 334, -133, 135, 500, -419, 219, 427, -60, 89, -26, -9, 296, -53, -74, 200, -358, -53, -398, -248, 55, -681, -453, 172, -285, -128, 9, -216, 246, -249, -240, 258, 44, 439, 447, -34, 662, -130, 28, 531, -125, 191, 347, 59, 403, -258, -85, 255, -509, -62, -34, -859, 2, -165, -94, -184, -347, -307, 33, -199, 57, 100, 79, 315, -90, 369, 521, -178, 301, 292, -168, 465, -61, -179, 640, 47, 184, 146, 70, 296, -426, -229, 498, -534, -111, -89, -724, 102, -209, -189, 378, -372, -460, 175, -254, 477, 64, 4, 715, -14, 34, 340, -49, 310, 59, -103, 725, -29, -397, 471, -271, -227]
2503b27L7O6J93m90q5P95m93K17q2l13O46p80K06N99m69J90J71n85P19k38k15
2524a38P38p68L87K58l23J17k92j95O39l76q5n6k67M40k26k38M19m21Q0P2q4N53
2546B34k62j72L47j49j98L09j41K88j76n28J010m66k98N47l29J94J59n77O11k98
2566A05l50N44n46J12K06n84M58n47l5Q95n62Q4N87p31L63j07p2N61m27M02M3
2587C99l85J72J71j01P7k98J71j55k12L07j63l32M78l99lL9j39J75J82o71P75
2608H8j87k30L53l02J55M96p78Q27j78m64K57rK69k01k70M89j77q0K56O1l67L22
2630C30m54J4J16m22M48k56j65M38l37K36J45m36M41k92j95O32o75L90K06j38
2650B6K54j63Q8K50n69J80L84n50M91j96l70M94p58O42lo30N17J19m00P7j45P4
$$ y = [-227, -190, -124, 69, -421, -506, 289, -204, 13, -69, -382, 264, -516, -310, 289, -180, 10, 181, -404, 315, 77, -138, 600, -168, 219, 477, 154, 271, -21, -216, 423, 47, -38, -94, -361, 79, -147, -385, 34, -387, -307, -235, -319, 234, -28, -200, 147, -2, -200, 109, -32, 256, 80, -448, 562, 96, -202, 345, 16, 210, 369, -208, 403, 105, -245, 299, -247, -135, 71, -513, -55, -602, -637, 258, -304, -220, 367, -364, -1, -108, -180, 381, -46, 356, 399, 14, 186, 357, 256, 333, 35, 206, 51, -161, 146, -17, -349, 129, -270, -273, -234, -373, -198, -16, -687, 88, -99, -329, 24, -278, -123, 373, -405, 422, 244, -220, 37, 28, 297, 96, -174, 315, 138, 58, 314, 375, 8, 330, -124, -110, 6, -416, 32, -224, -389, 49, -288, -52, 93, -343, 98, -194, -389, 243, -432, -42, 164, 26, 280, 117, 205, 455, -114, 66, 450, -100, 391, 195, -175, 319, -439, 203, 200, -430, 87, 206, -194, -117, -262, -188]
2672a88K67m49J98R1k22K08m01M65J09j75J39L31l22N1K18k86M16l63J98j24n11
2693c50L87k9k39L74l62J23K55m67L00p8m23P10l66j53K66j41J22J48p6K72k68
2714EN0M57m92m3J32j34K72n04Q1O18l75K6K3k74M02l10j24K6j92K20K21n17N59
2737A27k31p2P1j30Q8L0J56J14r9j60J47l6P9M30n93K86k45q3M50j14k71L58m49
2760a47K77m3l40O21m24l46M73j23n6N1j89L55m20k5M96m57J33J67j22K70j15
2781C6K46J29l47k16P69m97p4K3O7J24k98k58M25m22L13r5l56L82l9Q4j23qK45
2804A10l63j4N35j47l9N6j56J5J58k8J24k50Q9K42k89J42Q0m86M21k41j31M63
2826B91k99p2n9l73M27j7j72L62k22P0L50n74K11J52k68N74m38L5L32j50j83K21
$$ y = [-188, 79, -370, -172, -81, -303, -95, -496, -31, 78, -97, 42, 373, 51, 102, 320, 34, 450, 87, 285, 161, -350, 37, 8, -231, 143, -219, -96, 159, -308, -8, -86, -509, 201, -165, -318, -52, -193, -71, 77, 1, 273, 5, 55, 512, 20, -23, 109, -25, 247, -257, -176, 442, 67, 93, 116, -158, 244, -66, -190, -164, -356, -136, 85, -432, 127, -104, -176, -105, -235, -147, -117, 39, 153, 54, -106, 41, 5, 84, 514, -79, 207, -38, -121, 329, 215, -56, 302, -147, 130, 87, -253, 368, -56, -402, 71, -52, -108, -57, -246, 109, -311, -336, 160, -297, -164, 3, -119, 151, 36, 282, 411, 64, -152, 617, 120, 46, 69, 136, 260, -38, -296, 129, -293, 20, -75, -431, -49, -88, -4, -127, -135, 110, -253, -267, 268, 121, 82, 138, -18, -3, 155, 127, 251, 1, 90, 332, 43, 185, 265, -221, 200, -41, -172, 291, -8, -80, -139, -512, -85, -102, -274, 88, -134, -64, 286, -288, -77, 75, -193, 381, -57, -22, 310, 160, -23, 198]
2848A98j10J85j30j90M37m68o7K49k60K27j26k49M19l59l0L34n26N11k57J57R7
2869D2l38J58L63m26M61j23l01M56j98J10L01o00J89J07m50L83l31J99L0l31K85
2890a4K20m68L19k03k55M65k74j52M64n90P94k41m37M09l66J65K72M9K08j43k32
2911a0N68o30K75M36n87l9l3r3L65l07j70K18l46M46k88j9J24L5j15J46j64l7
2933b25J97l20L70P7l23M97k80k12N28n70L72Q1j92J16P5k51L70m76K85L6m19
2954b64M80j99j22Q4k67L91j27k05M76m75j12L63m5J23Q1p7L1J85m09K31j14O5
2976I4P1L4n4Lk28L67l05P5M3j76L56l85k17J67J31k07K61k73L95p2j32J06j69
2999a15J08L55n63L40J13l70L64J3k86R1L8J22J17l48L19j64l96O57n02o1k1k07
$$ y = [198, 88, 273, 143, -47, 390, -78, -145, 104, -156, 71, -55, -304, 115, -244, -274, 60, -466, 45, -212, -55, 42, -296, -138, 225, -201, 260, 137, -164, 292, 94, 204, 505, -95, 94, 201, -249, 134, -197, 2, 32, -299, -14, 206, -262, 57, -146, -401, 64, -210, -362, 102, -488, 306, 65, -372, 37, -329, -164, 108, 157, 365, 222, -10, 558, -72, 203, 639, 52, 13, -20, -113, 252, -55, -225, -7, -353, 93, -195, -214, -90, -55, -170, -24, -188, -225, -28, -348, 22, 99, -224, 273, -7, -219, 309, -261, 111, 192, 0, 116, 191, -60, 310, -166, 119, 155, -264, 216, 17, -105, -21, -288, 103, -24, -229, 247, -228, -340, 23, -22, 101, 182, 105, 136, 321, -88, 143, 29, 94, 165, 199, 145, 148, -80, 287, -18, 57, 100, -76, 280, -105, -322, -155, -24, -231, 30, -243, 152, 80, -52, 54, -115, -7, 348, -215, 125, 238, -132, 232, 245, -41, 50, 88, 210, 327, -21, 298, 134, -262, 395, -107, -168, -189, -396]
3021c96N42j24l56R5N1R2Rk9j82L20n17L71L97j01q5o6J59j14j49N62m81l8O31
3044E91n44L2Om94L45K0O2K71m15L19l54l31M06J18m18O90o75K57Q8m30N36l5
3066D5j39J00l9j2L70k86J84qm07L24K7j84J27j81J30o0k25L15q6j18Q1j08J89
3089C9p8j59K49o3l81O08n46K37K24j59J0N0m2K04l50K22K14l25M09j63j09j22
3111c1k23M38J56m16J0K19k70J52j19P6L06n20R6Q2k77N47l78%O48p26J40j14
3133b04k3M12j64p9M52m39J92J92l82K18k37k37O38o53M18J49j76Pj08K30r6k26
3155a16k52K14j95K73j6K1k1O7k45P18p28N88j26l61L66l21J55J82k82J97O2j83
3177cK78k15k14L81k38rJ81k22k02K03M0qk37J41K89l22lM10n97O64l48k18M52
$$ y = [-396, 146, 22, -334, -239, -188, -96, -87, -116, -298, 22, -495, -124, 273, 172, 87, 21, 180, 66, -83, 479, -2, -40, 591, 47, 79, 85, -409, -64, -44, 18, 289, -126, 193, -161, -492, -86, 32, -386, 304, -371, -114, -26, -456, 80, 45, -94, 6, -33, -45, 325, 39, 223, 215, -192, 132, 159, -25, 102, -79, 51, -9, -234, 81, -5, -123, -42, -150, 39, -39, -198, 51, -12, -393, 215, -331, -94, 130, -29, -19, 31, -11, 193, -157, 65, 279, -46, 363, 200, 91, -31, -254, 184, 340, -76, -66, 153, -117, 35, -84, -8, 298, -222, -126, -44, -321, 226, -152, -152, 496, -230, -90, -204, -227, 185, 21, -58, 394, -45, 147, 339, -43, 175, -62, -299, 339, -314, 104, 253, 77, 84, -24, 206, 110, -116, -368, -154, -349, -76, -92, -71, -92, -25, -270, 448, -280, 308, 182, -179, 187, -134, 21, 203, -79, 118, 180, -3, 275, 60, -154, 227, -11, -20, 161, -61, -263, -60, -20, -28, -265, -124, 165, -157, -160, 250, -347, 317, -31, -249, 203]
3200B03k15J00L1J32l1k76m7L89m13J86K62l92K75l58l74N94l90O8L21l45K06
3221g4J12p8J90k18k03L75l07L22j85N1K69l27K36k2m93N75J74m52K42l50J3L75
3243B25j83J13j48j89L64n55J75J41l0j7j48O3N44m89k33L34l80N55K18m08J69
3264A21j36j63M32mm54L67k55L56k8j35kk62J78L23o54K65R5k01L75m24Q3L1j6
3287a08J08J17k60L46m48J21N57l84J0J44k22M0j15j58M44q4n8k5p5P9J20l43
3309a94L36r4k70K27j60L27l92r6N11l55K38j71O5J51m2j72L38j32j48J49j97
3330h1L34K08n36K73Km01J76o5O29k99o48P86l10j26J12j88J72j6j04L8L7j89
3352a96O5O9J87j62k06L13J9r7K66l40J35M33n33K33q7k12K98j81M5P6m29L45
$$ y = [203, -12, 88, 119, 251, 220, -56, -103, 286, -127, 59, 321, -71, 204, -154, -528, 66, -324, -256, 65, -280, -74, 38, -40, 150, -68, -271, 104, -203, 119, -66, -15, 254, -73, 163, 141, -352, 223, 397, -55, 187, -163, -150, 225, 42, 155, 7, -182, 182, -373, -198, -57, -87, -104, -252, -189, 355, -134, -367, -33, -413, 142, 360, -48, 121, -15, -178, 254, 250, -204, 163, -92, 264, 236, 101, 99, -163, 15, 338, -316, -51, 44, -157, 218, -206, -123, -92, -108, 0, 117, -143, 203, -245, -124, 433, 49, 59, 203, -19, 21, -94, -252, 192, 108, 50, 25, -50, 29, 149, -194, 142, 48, -222, 5, -155, 172, -220, -316, 195, -160, 78, -93, -28, 123, 81, -91, 247, 115, -33, 116, -81, 253, 461, -75, 198, 200, -201, -25, -90, 539, 240, -408, 378, 68, -58, 54, -134, 38, 22, -82, -44, -7, -196, -131, -62, 125, -37, -243, 70, 89, -8, 258, -82, 53, 486, -47, 186, 99, -113, 185, 4, 49, 125, -304, 41]
3374D1M1j32K02j56j02K7j78L83j28k70K49j79j2R0Q1Q7K03m39L34m22K21M40
3396C81m05J25J14k18J21j81j03L67l22J31R1m22K77l9o6K43n16L37J5P2N3j4
3418D1l34M34l45J67J61j86J49Q4p3nk1l2L87l27j47J63k24O9J87j40J00k56P6
3441g2j09k01M79k43k53M48r8J04J44l07M05j73n8R9l74L63J77n12L08Q3k56J02
3463E6l9j26O9OK72l42K59k46J22o1j08O9o5N51o02M5J57k39K49q9j97L07n6K18
3487B10r9k00L58j05j83L53l37L25m2k22J53l36nL92m58J87j18M7p9R1j88M30
3509A74l47J66K22k21Q7K9k95K10m33M94J0l84L50N1l18J76K2q5L27k05k86O23
3531C67m71K62k27O3qn7m3K75n83J66k4J65L50m65J39l5l11L35K38l86K48k52
$$ y = [41, 82, -50, 152, -4, -106, -79, -257, 126, -2, -272, -23, -202, -214, -124, -43, 44, 247, -192, 142, -280, -59, 381, -24, 101, 215, -3, 118, -63, -166, 201, -121, 10, 101, -321, -44, -83, -149, 94, -422, -85, -70, 2, 55, 41, -293, 141, -204, -37, 124, -62, 87, 171, 98, 93, 72, 40, 427, 100, -47, 116, -108, -39, 148, 8, 108, -148, -72, -181, -382, 97, -146, -399, 49, -49, 55, 199, -108, 297, 124, 66, 165, -209, 154, 331, -181, 127, 210, -46, 56, 17, -109, -40, -34, 238, -104, 155, -91, 31, -30, -138, -69, -134, 417, -185, -140, 17, -222, 27, -62, -259, 48, -8, 210, 111, -89, 269, 164, -19, 334, -3, 322, 280, 58, 211, -125, -130, 262, -196, -9, -127, -80, -159, -68, -256, 174, -173, -7, 215, -6, 81, 110, -185, 25, -408, 86, 96, -288, 62, 113, -205, -29, -7, -92, 235, 30, -256, 367, -104, 158, -69, -6, -14, -71, -114, 161, -422, -256, -280, -115, 235, -230, -91, -126, -437, -102, 136, -250, -2, -254]
3553b54M70r2j22P7m4k0Q8l74K13L19l33q9K04j87N4J43j29J65j44o0J84j65J01
3576En8J38J33n23M18l59J80J38k05J12L07l62J22J91j81L0j51J28L69k80j72
3597b0K03k92J41m0o5L8Q4J24j14j92m2Mm5L1lK02J86m86J22J95j52J45L7P5J62
3622B98l21P8J40j25Q0j04o9J48L9k75NJ23k6J7j88K51j5k2m1m5j51J81j83J74
3646c1m6k00N12k92K11r6j21M81l45O9J26j41n4J28l09K21j23q5K64k37n9J89
3668F2j78J84k9k40K48l04K69k01j49M49k48J45Q2j40k9L05k50K06n1p4K6pl4
3691D2L1Q4k15o1q9K98J38m50M76l17q7N94o35K63k82J76K06l13K87k41k68K96
3713f7k4j20L57j00K84p8k11N0j86j69M05l11M60k61j72J11J35m15L71K9j52J15
$$ y = [-254, 216, 124, 2, 79, 35, 15, 103, -271, -58, 261, -72, -161, 43, -144, -90, 53, -76, 89, -55, -115, 69, -96, 5, -53, 85, 218, -305, 113, -246, -66, 72, -133, -21, 286, -76, 46, 237, 56, 86, -65, 63, 432, 152, -20, 183, -109, 32, -8, -73, -35, 49, 173, 59, -133, -175, -171, -216, -185, -188, 14, 200, -286, -164, 31, -121, 24, 61, 136, 298, -23, 55, 195, 70, 150, 46, -23, 125, 164, -111, -106, 17, -9, 8, -180, 71, 56, 34, -7, -52, -203, -22, -205, -31, -77, -277, 235, -57, 154, 58, -63, 418, 73, 142, 268, 127, 73, 201, -108, 113, -10, -95, 169, -68, -127, 62, -116, 68, 39, -201, 47, -257, 12, -189, -338, 111, -137, 8, 90, -50, -79, 226, -24, 182, 131, 57, 83, 76, 42, 73, 157, -58, -119, -208, 90, 228, -222, 254, -63, -150, 444, -191, 72, -210, -34, 172, -141, 146, -95, -363, -67, -91, -211, 146, 46, 330, 252, 41, 91, -95, -264, 141, -170, 290, 29, -143, -32, 103, -312, 59, 88, -64, 51]
3735E1j23O8J10o1j10p8j98K20q2J88P7k09K45j91K68n4j86nK78l09L25j93J4
3758D5k2R9r3R6j55J13N0m31K20o8J16Qk95L80j52J76J34k27JJ75l01M78j31j39
3782G7O3k71J13K07j36L6r7k4N7LP4r7N2J23j71k04J19N9o8J36l70J13j1k1K83
3807D5J30k79L01j05j59K49l39J88o2n3L87k67m1J51P1j58L2k42L37j05j47K61
3829A95l50K3M8m3J86m44L65J36k79Q1K14k23J25j33J11M5M4j06j4J74k2K8N5
3852B16j6j73lM0j28J12Pp9J59o5m0J68l01J52j66N1J30l35M9J90n0J57K78k50
3876A03p6L22j89R4j10j87L9j41L30l59J49K30m29L14J72l42L6j6L8K48n57K73
3898e8K48m52PJ62K1J5O3j14K20J0k7j14l7J92j57J23n2q1J29Lk76N3R1m9L86
$$ y = [51, -72, -4, 106, 45, -65, -143, -341, -121, -203, -15, 62, -147, 98, -93, 175, 121, -65, -70, 208, -101, 224, 31, 45, 23, 122, 29, 125, -30, 83, 133, -298, -78, -146, -30, -22, -317, 63, -89, 87, 221, -6, -5, 170, -131, 347, 216, 77, 140, -131, -18, 189, 53, 89, -8, -32, 25, 28, 102, 5, 57, 180, 9, -195, -76, -17, -85, 51, -319, -206, -217, -238, 45, 175, -104, 197, 92, -67, 182, -157, 31, -31, -84, 303, 36, -5, 146, 217, 59, 91, -151, 186, 81, -66, 195, -155, -132, -84, -127, 59, -385, -20, 116, -163, -82, 132, -91, 34, -99, 12, 57, 101, -5, -19, 155, 133, 161, 216, 200, 27, 24, 64, -64, 48, 55, -24, 135, 70, 30, 198, -103, 49, -117, -66, 64, -271, -222, -32, -82, 75, 353, 103, 27, 349, 160, 254, 144, -43, -4, -145, 185, -174, -25, 205, -224, 90, 262, -80, -44, -60, -22, 226, -331, -58, 190, -262, -255, -93, -72, -57, 6, -108, 112, 122, 95, -19, -56, 136, -21, 102, 50, -31, 98, 101, -175, -122, -31, -80, 306]
3923C06n08Q9J01j21J14m9o5J96J02j47j47j21Q1J29l02L53J94l48K13N8lk35
3945a10Q8O9K06l27J58O4j57P2k43M40l40j8JQ7J04k51l1j97K30K97k15qJ08J53
3969A80p4j27J64r7m4k8j26J51Q8n3J3J10j47m8J78n1m64J91J70j45L87k89L4
3992b7%L8J44k09m7nK99l24pM3n2K16j74J98J02j94K81m09K91k70J87J95j67j80
4016g1L12l73n0L43m63Q46n96m6J73k56k38O01n11K97J19j36r4J08OJ27m26L93
4038F5r1o9K12k48K22J17n31M50l6k06L30o9j22J8o4J5qk51K69R9j85o7K40j56
4062f6J5n5k6J73k4J44k47R9j57L12J17O8n21Q7K32l04J98k2m7R7o5J46j25k86
4086b57J47N7j24N6%K18j63m4J07O6m63M37k8j59J25Q5J8J17n44O46l17J6J70
$$ y = [306, -202, -113, -12, -133, -19, -68, -133, 63, 165, 18, -129, -250, -169, -40, -342, 11, 205, -143, 70, 128, 125, -110, -22, 47, 253, -74, 84, 148, -9, 63, -180, 260, -80, -98, -97, -10, 94, -157, -188, -385, -155, 142, -73, -81, 27, 180, 106, -21, 143, 46, 2, -26, -152, -1, 87, 34, 47, 157, 10, -38, 140, 89, -375, -184, -14, -159, 228, -61, -27, -27, 11, 155, -54, -101, -106, 193, -131, -138, -95, -147, 69, -105, 93, 195, 1, 282, -127, 164, -106, 81, 276, 109, -71, 241, -132, -182, 161, -302, 544, -52, -98, 75, -181, -419, 182, -329, -32, 87, -49, -143, -35, -29, 98, -328, 65, -26, -95, 117, -131, 91, 208, -323, 127, 91, -115, 215, 146, 24, 42, -22, -7, -15, -266, 3, 102, -83, -150, 90, -66, -51, -106, -132, 41, 17, 161, -86, 13, -144, 168, 285, 353, -168, -81, 151, -153, 45, 23, -24, 73, 8, 154, 29, -257, -110, -53, -177, -121, -121, 97, -66, -110, -3, 63, -400, 37, 9, -150, -25, 60, 78, 195, -349, 297, -20, -4, 166]
4109A66j52p8K10l54J61j09K79k01qj22J39J71l51K29l77K78j76J9K65n6J19k32
4131a80K60J85l89J4K51j07o9pN0J97j30k5l3l9J49k62J99Q0m55L58n0J63J72
4154C32l67k07L16k31K12R7k15j5l5J39J82l08J97N4k21n8J04j63J31k11M48j02
4176G9j99P3J30j03j12R6q4O10l81r4j85K50j92K41j50O3j92ML49k85l4m5OL33
4200A78M6q2m2P7q5j47j12L32L01n15n0J25rl8j58R4K59l9j71l4j32O2l0M22l03
4225e1m0J38r6j28K45J18k26J17j45Q3k8p1K51k62J78k62K71K5j06J49r5r2p2
4248i9QL9pK9J02K3n15L80L6R7j08j9o6K34J51m33J25j5j05j06N79k46J0k10K68
4273A52j97K50j39l69K60Q8K9j61j93J39K49k72j4k21M46K6k87R9j3J09PJ99q3
$$ y = [166, 14, -64, 146, -208, -47, -156, 123, -78, -86, -208, -69, 102, -249, -20, -397, -119, -295, -276, -11, -67, 52, -180, 80, 265, -124, -110, 141, 34, -35, -42, 8, 205, 75, 50, 17, -22, 127, -135, 64, 144, -311, 47, -3, 160, 332, -35, -242, 74, -157, 55, 152, -63, -78, -113, 26, 208, -100, 97, 151, -70, -128, -24, -187, -56, -267, 181, 79, -120, -47, 83, -20, -132, -36, -120, 490, 109, 15, -170, 80, -112, 129, -21, 42, -150, -146, 203, -82, -116, -161, -155, 178, 224, 142, 100, 177, 92, -55, -167, 165, 466, -49, -99, 26, 17, -21, -179, -85, 174, 135, -36, -70, -202, -140, -170, 252, -51, -91, 47, -49, -177, 68, 186, -40, 77, -68, 15, -13, -84, 167, -95, 83, -179, 92, 117, 11, 160, 65, -27, -99, -91, -52, -59, -30, 72, 95, -420, -40, -4, 93, -15, -34, -100, 134, 285, -148, -23, -38, -143, -249, 330, 84, 94, -116, 152, -45, 205, 66, -303, -43, 45, 74, -87, -280, -141, 108, -164, -178, -399, 47, 73, -214, -115, -128, -19, -12, 187, 104]
4296A04K23k74q6Q1k3O2l3r6L44l57J10j94K78N6j69k6J0j94L72k25P5k02L70
4319B06l6m86K65l04N21l23K81j23K4J94k40J40l00R8J56K9LpL5m30L90j16q6
4342a09J71k15K63P1l07J2j04P8P4P7j38J56j22R4O3o4R1j64K9L3L3m7K22r5J62
4367B64l99L15l50J3J11L32l70m2K6R9P8q4J99k94M5K04l54L63j17k09J70l25
4389c25M89k09J11R3k8j98k73N58k07k29J18m3L84k93n8J21Q9j21j0J2J59j9j95
4412g4J0k83M65J49k97J0J51k23j28P6K61k14m6K54j07J15P9l11J29p8P8j38N5
4435f7M8L33k54j77J62n5J78j99k29L99l14J82k9P5O4j70L02l60O6m6R9OJ57j14
4459E7m8J39q8J51l69N4Q4QP6J20k38P5J75j82J7j57Q6Ol1jJ45k05p0K80k70l9
$$ y = [104, 327, 53, -33, 48, 25, 87, 54, -42, 302, -55, 55, -139, 139, 195, 26, 0, 10, -184, 188, -37, 38, -164, 206, 170, -316, -51, -355, 166, -157, 124, 1, 25, 219, -21, 119, -181, -83, 73, 102, 105, 98, 133, -297, 93, -23, -109, 62, -153, 110, 181, -126, -114, -218, -140, -66, 11, -127, 29, -93, 1, 64, 0, 91, -73, -44, -11, 22, -25, 197, 102, 264, -135, 180, -170, -157, -46, 286, -84, -126, -100, -1, 77, -7, 192, -102, -57, 147, -207, 156, 39, -170, 0, -325, 164, -45, 66, 159, 131, -67, -340, 218, 11, -218, -100, -143, 241, -52, -110, 11, 100, -21, -31, -19, 140, 121, -74, -64, -347, 118, 267, -30, -20, 131, -92, -220, -144, 117, -97, -143, 111, 4, 119, 198, -113, 16, -62, 16, -122, -67, -19, 314, 60, -117, 45, -10, 168, -31, -260, 139, -175, 7, -22, 53, 117, -53, 249, -111, -45, -91, 8, 14, 171, 57, 9, 148, 60, 211, -158, -104, -20, -12, 64, 184, -54, 21, 196, 14, 31, -126, -40, -34, -65, -66, 79, -126, -196, 84, -186, -225]
4485b25J30J57k58j0M37j68r3k9j38K08O4o2l9j96J06J98k69K37Lk11J94j2j8
4508Fo6M2r2n8k2M15j08n03L67N2j14J83k30J33K36k68J69j60q2K58j25r0J57
4531A00j27q0j8O1J25j82K07k90J64R9j45j35L45k03k37M06j77k79M13k24K78
4552A01j64L20k04k10K16j16M8l31M93J26k88m13N93n4O2J39l59o8N9l4m8P9J13
4575F0k49k9r8L50J2j45K4j88K79J59k42j06J94K9r6k4R5J09l97L13j57L4J23
4598E0J07l28L30r7J68l07J06k41O8J50j02J91j65K5O6R6k23Q8J28k32K18K2J8
4621A36J23k90k32L99l59J08L23k35j39K59o7k17J77k07J57J25J22j48m2M3p8
4642d2O5M3m1J82m35K49r0N0L4M1k6j40K70k00l4PK63k64JlOO1k73L57j40J31
$$ y = [-225, -95, 62, -196, -206, 231, 63, -30, -59, -197, 11, 75, 13, -26, -222, -116, 82, -187, 50, 53, -158, 36, 24, 6, -60, -18, -110, -168, -190, 225, 117, -386, -19, 33, -81, 102, -128, 5, 241, -27, 142, -18, -100, 158, 33, -57, 100, -27, -107, -125, -64, 61, -121, 86, -204, -40, 59, -86, -221, 124, -79, -316, 90, -87, -366, 47, -177, 101, -63, 257, 53, -157, 59, -57, -9, -340, 153, 279, -9, -422, 171, 117, 179, 318, -41, -109, -50, -84, -132, -53, 60, -189, -218, -316, 34, 46, -99, -75, -263, 16, 175, -67, -173, 21, 50, -46, -70, 25, 134, -263, 50, -107, -73, 50, 157, -171, 159, 62, 230, -77, 29, -212, -144, 6, -96, 95, -70, -45, 21, 117, -106, -18, 110, -122, 96, 118, 136, 259, -31, -263, 136, -223, -115, 208, -27, -166, 93, 26, -191, -14, -221, -64, 61, 183, 35, -7, 36, -42, 23, 66, 25, 207, -228, 21, -69, -19, 15, 56, 30, -110, 160, -40, -74, -67, 196, -68, -67, -70, -64, -3, -276, 81, -59, 72]
4668G2k8j32J18k39J66M0jl2j70K21j2lj8j16J33j22J51j90J41K24k57M7J05J29
4692B27l11P5M7j61L7J51Q4N3j95m49M91r8J81M1m32K47J36n6l6R1o8k07M5P4
4716c3p3M9K23j81j09L09n78M12O7k19K60k2k06L24l28J01J98r8j48M2J64k50
4738i6p7J61j48M3K54o0j18P4j51J89p0J47l63J79j17K03j50J92J20j76J38k11
4760c7J23j32K61k98Nj3P5j20K02P5j78j06J50j29K47n0j58K47p4j51J65j04o6
4783f6K22k86R1M3o0j34K97K65j10q3j01k11K1J37r0k05J43P4Q0M5k02J86k65
4806b09L69p8k29Q1j5M8K99k54R2L6O3o4k20J21j51M34j67pm03L83k38l0L09k21
4830e1j11K02p2J21J61j58k44J43n6J26m6j06K04p6K9p4r7J75l2j12N0kr0L45
$$ y = [72, 44, -88, 30, -209, -43, -3, -4, -36, -206, 15, 3, 0, -18, -134, -1, -123, 28, -162, -21, 203, -54, -7, 98, 227, -84, -9, 38, -123, -86, 65, 149, 202, 7, -442, 49, -49, 132, 173, -259, -12, 124, 68, 32, 123, 55, -152, -107, -33, -106, -57, 166, -15, -124, 185, -393, 19, 86, -133, 127, 105, -101, 223, -105, -4, 194, 96, -52, -10, 154, -96, -173, -12, -160, -117, 137, 77, -41, 33, -118, 71, 1, 148, -215, -36, -153, 50, -100, 92, 212, 36, 174, -37, 86, -46, 215, -83, -78, -91, -16, -136, 66, 141, -37, -143, 7, -122, 125, 75, -83, 164, 90, -61, 104, 0, -66, 156, -130, -39, 4, -56, -190, 107, 372, 262, 179, 78, -133, -112, 25, -65, -270, -127, -53, 27, 72, -130, 56, -209, 160, 82, -147, -66, -81, -33, 266, 12, 104, 140, 203, 139, -81, 40, -111, 323, 156, 149, -254, 129, -109, -139, 170, -51, -162, 40, -32, 89, 250, 92, -152, -9, -65, 61, 15, -91, 113, 37, 66, -8, -105, 70, 38, -74, -24, -26, -116, 229]
4854B29n0j21J79P0j41q8j76K18l99L04N2O0j09RJ25J0j71l6O4r3K65p9p6j40
4878i4L1J15j32K77j59M7j50R1J5j08O6J13j35N5k4P6j59K25j49R8k05n3j26L86
4902A01M5k64J64k89J95o5n2J34J51j21P8j40M3P7O0j40m0K56j06k02M68m62J46
4925C7j38J99m2j63K90j45j31J43P0j10k83K57k9N3j32k10K05P7r6J81M3K05k83
4948bJ49k9k56N4m3K15k55J17K0L3Nj29K00j7J96l9j33r7o3r9K46j43K16K2l18
4973a50J91j77O0K46j61p8L12k29N8k20J43l9L51l61J97k69J69l6q2jQ3L7j54
4996a10o9K35j28n7J12pr8o0J01Q4N2j31P5p3l2K12j70J72k5j26M8K25j39l20
5020b29rJ92J19k93J32j7p1n7L83l65J70N5Q8k0k34K38m7l3j3J11Rj01p6J15o5
$$ y = [229, 179, 58, 237, 307, 166, 78, -98, 120, -279, 25, 77, 137, 28, 37, 162, 172, 1, -35, 29, -64, 201, 122, 46, -94, -63, 52, -80, 197, 38, 85, -65, 26, 41, -67, -1, 112, -23, 32, 8, 84, -75, 150, 1, 99, -106, -159, -285, 101, 146, -118, 46, -243, -48, -113, -165, -31, 120, -1, 77, -63, -20, 57, 117, -23, -63, 193, 87, -115, 353, -109, 37, -101, 98, 56, -107, 183, 38, -93, 50, 120, 10, -273, -16, -45, 8, -124, -334, -129, -52, -148, 33, 76, 281, -2, 147, 118, -138, -84, -127, 88, -167, -50, -30, 3, 8, -121, 79, 62, 258, 219, 86, -11, -74, -173, 73, -70, 146, 168, -150, 41, -136, -76, 170, 9, -69, 243, 14, 72, -148, -5, -44, 307, -54, 143, -126, 43, 7, -75, -76, 7, 44, -110, -179, 56, -72, -129, -17, -24, -122, -182, -81, 3, 55, -76, -1, -74, -106, 106, -64, 108, 83, -43, 5, 230, 91, -229, -238, -46, 73, -220, -88, -105, -176, -233, 150, -215, -45, 10, 98, 78, -156, 82, 35, 2, -11, 100, 109, 8, -68, 47, -18]
5045a8j9J19j61JM5K75l66K37q1j35Q1J52K2j12jo9k14J84K3l3L43j21n9n7j30
5070i4J23k45K94m00L53K2k40J74J83l09J20o2J40L0q0k11J78k42r0L42J67j71
5092a8l6N5R8r4n4O7O1j70J41k4j32o1P9L26m52N6K23l0J23l4k67J47j60L05j87
5117c8J44L1k17J6K2K84m35L29j93K4p6J22O1K59l05K00j31L3j34j4rJ52k35K12
5141A02lk68m5K28k1J37j73K85n65L60p4q8J74K5j67L52k82Pk29L26M5j45J3j93
5165a99K34j2L2k7k59M19k46p3K63j1l9q9J62k8p8L6j43J52ml63K78p0J30p0q4
5190h9J00L5k47J6J46j46L59m1R1l30n6J70J22N3k34J96j89K92M8j35l2m5k53
5213a69J56j14J39K4j67j66M80j60K8l6L7j8O0j31J7J99j89q6M5P0P0j25n4J0
$$ y = [-18, -37, 82, -79, -78, -33, 242, -124, 113, 32, -103, -22, 130, 152, 40, 39, -30, -244, -60, -37, -70, 273, 152, 93, 36, -94, 29, -216, 78, -322, 31, 53, -187, -13, 170, -139, -19, -81, 59, 89, 9, -202, -24, -266, -356, -14, 153, -18, -54, 1, 99, 5, -49, 18, 79, -91, 50, 26, -106, -167, -88, 238, -214, -158, 65, 35, 158, 124, -143, 4, -156, 149, -38, 106, 137, -80, -64, -42, 242, -193, 136, -57, -33, -109, 13, 74, 333, 28, 228, 97, 130, -4, -18, -27, 125, -110, 102, 99, -169, -214, 14, -7, 130, -43, 242, -323, 37, -37, -125, 49, 74, -93, 259, -23, -16, -245, 81, 126, -19, -6, -199, 35, 23, 55, 28, -231, 188, -58, -131, 132, 121, 82, -7, 155, 127, 49, 85, -58, 94, 90, -273, 5, -65, 65, -5, -89, 11, 46, -201, -185, -39, -185, 174, 133, 224, -106, -162, 8, 130, 183, -51, 145, -44, 248, 296, 161, 129, 84, -169, -13, -127, 12, 36, -131, -297, 183, 23, 51, 15, 52, 34, 94, -37, -20, 179, -10, -96, -51, 19, 89, -36, -90, -80]
5237h0K6K4O7j69oN0J94n0j14q4j28L82o5j4Q1k29J03j96K41K68j56j26j46J15
5261a2J4J0j33K79l50J65L7K68k82P6o3q0J15m6j37J74K59m15M7n3J14j15n3O9
5285a12K70k79M4N7j4J23q7K1mk19K47J6q6K8q5J96j33j32J65qj5J82k95K57j12
5310B5R5j77j5K8J01j03Q3j56K62j15l8J06r4J2n4r3L54m77L07P2k84J69j3m9
5334e4J55O7o40K98J34q7j0J99k12l4J66J15l2p4m4j8K45R3j33j7O5j17j98K40
5358A07k2k14L22j16L8k16J08l3J34n9j5m0o1K25k14j02J74P9j20L71j57l14J3
5381a12n0LJ12q9L52q1k30L23N9m21P7J24Q0k54J4K71l24J64j0l4k3J02R8l20
5405a69P6N1k9N8N8j19j28K39K04k52l5K6L25j45m04J43O7L9J23n0m4q1O3m0Q6
$$ y = [-80, -54, -30, 37, -132, -138, -88, 106, 56, -58, -142, -270, 112, 47, 33, 114, -115, -12, -208, 33, 301, 145, 19, -127, -12, 2, 12, -121, 158, -192, -27, 10, 278, -4, 72, 9, -71, 44, -2, -139, 35, 294, -121, -74, -127, -13, -128, -181, -112, 158, -121, -77, -20, -34, 89, 2, 23, 19, -200, 47, 63, -23, 5, -80, 116, -17, -149, 16, 8, -7, 175, -120, 137, 25, 120, -57, -72, -44, 57, -46, 37, -119, 143, 28, -10, 96, 2, 14, -40, -133, 221, -256, 51, 123, -161, 8, -5, -54, 101, 168, -472, -174, -40, -127, -137, 62, -150, -184, -18, 97, 65, -9, -53, -71, 174, 267, 134, 117, 182, 65, -133, 107, 85, -129, 193, 77, 115, -101, 7, -26, 108, 49, 34, -6, -67, 158, -56, -158, 16, 95, -25, 346, 189, -125, -112, -162, -159, -47, -136, 216, 135, -95, 228, 287, -134, -57, 67, 147, -107, -93, 178, -146, 18, 8, -26, -49, 53, 151, -169, -93, -42, -71, -13, 45, -74, -202, 37, 241, -11, -46, -20, 305, 160, -244, -101, -34, 5, 128, 78, 34, -47, 16, -24, 62]
5430F2q4P6r9j7j2k10J55K13Rj43J84rl52M15j71N8J17k07q5P4J04J21j82j19
5454a02L19q9N2j70M19l89j44Q4m1L5J59j24r9J3J11J09j25Oj60J53l6j61M22
5477B42j23M9k41J76r2m0l16N84j94J55Ll49J48j18l2Q9q2P3J35R1j41p3Q9p0
5501c7%k57L89j83L6N6O1J0k71N8m7K14K3k9O7L5r5P8l94M37j44k74J14O9J50
5526F6n3j1N8n1J03j98L1J26k1o0N9j42Q0M0j14O7O6q7Q6l14K83J1p3J67n6J8
5552H1J3j03o0J0J21k73J43m7O9J61k24N7l8j4J66N9j46J21j20J25j30L6L8K7
5576G2o5Knk04K44K4k32J40K8k61J94L25o07pM69k36J65n5J83l98N10k60k40J71
5600d3mj83K72j28J25k3k9j38K46N0k01j8k35R4J82J12K07j95j49j7k69L89j45
$$ y = [62, -22, 54, -45, -62, -74, -284, -129, 84, 93, -50, 134, 125, -227, 188, 17, 75, 192, -15, -100, -26, 78, 199, 17, -102, 217, 128, 180, 10, 429, 40, -104, -20, -61, -26, 133, 9, -90, -77, 34, 143, 18, 24, -136, 17, -19, -180, 242, 119, 168, -73, 103, 11, -29, -345, 239, 45, 200, 203, -146, 2, -116, -148, -59, -141, -68, 67, 158, 17, -56, 33, -37, -37, -294, 95, -88, -52, 4, 65, 75, -196, -138, -185, 29, 52, 23, 90, 125, 30, 108, -286, 151, 7, -267, -153, -84, 66, 13, 2, 60, 9, 112, -86, -55, 71, 50, -10, 49, -93, -13, 27, -87, -20, 46, -41, 45, -269, 14, 25, -48, 119, 63, 81, 94, -9, -69, -59, 62, -211, -68, -115, -46, 115, -109, -52, -90, -104, 62, 121, -25, 96, -24, 101, -29, 7, 45, 72, 7, 9, 4, -200, 44, 68, -164, -24, 4, -257, -63, 262, -345, -352, 117, -119, 46, -9, 174, -224, 286, 26, -214, -43, -47, -230, 42, -86, 39, 16, -13, -151, 95, 145, -56, -74, -309, -215, -33, 79, 286, 91, -58, -75, -344, 45, -100]
5623a00o3J15J0j81K43J33m81O30j43R4l02K2J9Q3j22J45N6m02l3N21l19J12p3
5646c6P4j11k01N4L8R8M3%rJ46M6j41K09l10m0J93N3j71M8Q6j80L89m27J27J55
5671A33k96M16k18K50k76P4q9n3j8Q3k69J42n6K4J26O6j06L5j1p7j3j33K18J17
5695F9m4j69J45J40j46j14J37K30l19K49j42k4Rj78K34k62N5n3p7K06J79l0J47
5718B42k19k4J72k66P7J69M3l7j95j25K27O2k00j14j82M35k8J32k52o6j1mJ35
5741b9j03P3r8J08J90k39l6J80j60K81j46j6L48n29L24k06J02J06j56qK38j11
5763A13R4m8k80P2j62K90J30k53M3j24J07K85j93o3j75K14n2J6K51k46Q5pj48
5786e1J40k83P0k6J85o2K06k19P7K9j81J55PJ56k46R2j7p4K40l4j2m84L03P8l17
$$ y = [-100, -163, -48, -38, -219, 24, 157, -324, 306, 163, 257, -45, -23, -4, 79, -43, 102, 158, -244, -277, 244, -75, 37, -36, 38, -73, -274, -220, -182, -84, -41, -41, -50, 96, 142, 1, 210, -100, -140, 53, 106, -65, -17, 69, -111, 278, -149, -22, 133, -163, 253, 35, 285, 9, 83, -6, -59, -77, 6, -263, -121, -177, -153, -27, 39, -67, -32, -43, -120, -133, -266, -48, 69, 25, -144, 1, 141, -5, -119, 18, 248, -71, 178, 36, 12, 21, -157, 77, -185, -130, -183, -260, -54, 125, 95, 242, 23, -1, 171, -95, -18, 151, 194, 157, -38, -163, 64, 126, -74, -188, -370, 65, 37, 169, -83, -149, -160, -164, -29, -132, -59, -157, -49, 141, -98, -134, 46, -114, 167, 21, 5, 353, -176, 148, -58, 44, 150, -6, -14, 224, 113, 207, 159, -121, -49, -211, 79, 209, -44, -1, -125, -18, 267, 74, 11, -164, 50, -2, 14, 265, 19, 104, 97, -51, 89, -194, -124, -150, 35, -27, 179, -40, 37, 66, -115, 40, 47, 203, -43, 49, 32, -42, 198, 164, 152, -332, -29, 49, -268]
5811b68J64J12L9o1k6J96r5k83L37j48J00Q3M4l22M7j1K43o3K0l78q8M54j90J92
5835I8k15K12j28J18k21J86M0M5R3l25k4K80k21J26J20k53J90l09K3J32R8j53
5857h8J40j5k51L41k22L1K40l8j30N0O2k49K3J72J51k58J4k3K13k24QJ03l0j09
5881h9J68l22J37J18r0J71J8k28M2K85l03R1J32j0r1K5j58J51l4r4J34K20l51
5904g8J22k0L7L6j9J59j90o3m4J01M1L9k55Q6J31k9J70l74jL74j76r4O2R8o4J18
5930A67P2l72L98j30j38J13j54oK1p3N1j08L35k94J70j78K55q1j49M46n26L62
5952A81j19j21M2J49O4k56r0J51J27k0m9r1J26k30K39n2l1m7Q3n8R3j99J11q6
5976h3l8L57k84j22K09o8J49jk60L41k57p4O4J74l61J75K27k84Q9q6P5J58j50
$$ y = [-268, -104, 8, 47, -14, -40, 156, 61, -222, 115, -33, 67, 150, 194, -128, -81, -92, 151, 88, 108, -270, -358, 96, -94, 98, -117, 95, -33, 85, -136, 50, 90, 135, 228, -97, -121, 159, -62, 64, 184, -69, 121, -188, -165, -33, 65, -88, 52, 37, -214, 127, -95, -64, 176, 138, 8, 58, 120, -129, -106, 66, 217, -41, -27, -50, 163, -61, -53, 50, 20, -89, 79, -243, -106, 12, -78, 93, 111, -117, -75, 210, -93, -2, 130, 120, 29, 54, -104, 47, 13, -81, 53, 273, -78, 44, 24, 61, 97, 78, 237, 47, -16, -60, 41, 82, 121, -134, -48, 83, 54, 224, -150, -151, 223, 47, -47, 15, 113, 49, 167, 239, -133, 265, 135, -3, 110, -44, -50, -29, -102, -51, -159, 176, -118, 52, -126, 129, 48, -101, 345, -181, 181, 62, -59, -17, 132, 196, -60, -150, 1, 128, 108, 59, -32, 94, -136, 103, 51, 20, -27, 56, -2, 91, -108, 3, -83, -121, 236, -48, -170, 39, -29, 120, 119, -141, 200, -57, -131, -67, 107, -254, -79, 148, -136, -47, -133, -58, 100, -50]
5999e0o0J47J69j17jo3k1J96Rj16j71r2j7J07O2j26J86o8M2L2k7n8j49J83j17
6024a20J71M6m14M17j05r7K12p4m4r4J2M1M3K67l50LK90m08l8R2J28k19J21OJ60
6049D6k6J98j35j17k14M95j36k08J09j33M0O9j09N6M1J32j97j4R3K8J36j81qj9
6073e4j9L4j42J92K1QM1j1L2k63J82j23M77m97K62k29J1J50k19J28J0k0rK8K62
6098B52l19N5j32L15l25O4J80n1J12l3j47J04k80K74R1r6k12J70j16O3K34k32
6120b9j92J47P7Q8q8j03K07M7l38K37j24K10n2m4J42j89l5J85j70j4M8OK16j72
6144F0R5l25K3P0J1l8K56k79K09m2J5J20P8k83J20J56l46M8J79j71K54m88K46
6167c2j15M64k52j10J89m0K6R5j11N0k28J73Q2r3j80J94k22J01q2J98M6m08J65
$$ y = [-50, -110, 37, 206, 89, 88, 25, 4, 200, 209, 93, -78, -170, -187, -80, -18, -144, 42, -26, 16, 48, 21, -37, -186, -3, -120, 51, 97, -317, 100, -5, -102, 110, 36, -8, -102, -90, -49, -6, 261, -89, -86, 204, -204, -242, -150, -22, -241, -120, -114, 46, 20, 218, 83, -34, -248, 247, 111, -97, 12, -121, -81, -12, -121, -65, -24, 108, -89, -103, -10, 18, 154, -27, -35, -54, -73, -39, -181, 11, 32, 40, 81, 70, 102, -161, 21, -102, 375, -122, 140, -89, -78, 72, -147, -19, -9, -29, -38, -10, 252, -67, -12, -144, 171, -154, -90, 90, 39, 151, 118, -29, 75, -205, 69, 160, 64, -148, 22, -94, -31, 203, -29, -221, -74, 3, 91, 3, -100, 107, 154, -184, 53, -71, 139, 87, 43, 185, -4, -39, 146, -24, -38, 10, 16, 232, 60, 155, -170, -147, -77, -66, -104, 152, -127, 82, 40, 55, 175, 253, -30, 90, 246, -100, -52, 127, -44, 210, -278, -32, -147, 317, 65, -45, 144, 104, 130, 225, 114, 164, -64, 109, 191, 98, -82, 112, -110, -9, -91, 107, 153, -255, -90]
6190i0J92M2m4j67j43K83q0K20l29q2M22m44J34K76j69K37j43k05K54k11J54m15
6212c08M66l58L34Jr2m6j42J68J71r3j24k80M31q4j14O3m1j07R3J04n6l7j95K18
6236b8j3k4K11j60M6j80J60J75j18Q4l83K10K60n53L08J43k79K78k86J44Q3k08
6258a30j07K16J90j64p5K87j60j18j30J29K7J53j43m5J54K5j65k0k49J73K08J17
6280A73l85J6J88kk83K33Rp1K84pJ17k37q4K3J06L8m7K9j23O5M2m6k70L98m4p5
6306D7l03N06k92J27K9p0j99K7K15k45K18k49K19k97L67l37O6J38l41M94j05r5
6328h0K81k32L4lK5j85L26l10J72P1J26j46j6j32J34N1k08K75j21qr9lK30j22
6352F0n3j66Q0%J17K0j51M8J61n4j49j03L68n58M95l04K74l14L63j79J33N6k57
$$ y = [-90, 102, 144, 100, -67, -210, 73, -7, 213, -116, -198, 224, -220, -86, 190, 21, 258, 115, -90, 164, -47, 107, -308, 158, -200, 134, 135, 43, -3, -145, 23, 194, 101, -23, -303, 128, 44, -70, -7, -48, -155, -62, 42, -14, -51, -246, -28, -41, -65, 146, -14, 32, -148, 12, 187, 69, 153, -230, -20, 240, -313, -5, 138, -141, 137, -149, -5, 78, -130, -237, -21, 169, 5, -70, 217, 57, -61, -191, -62, -35, 118, -25, -70, 84, 109, -56, -76, -325, -152, 56, 173, -212, -196, -8, -10, -293, -60, -51, -122, 162, 155, 272, 35, -49, -26, 80, 118, 71, 100, -23, 42, 84, 38, -232, 166, 122, 47, -256, 250, -42, 85, 114, 44, -155, -128, 87, -158, 60, -189, 30, -267, 100, -237, -171, -33, -374, 120, 15, -80, 201, -31, 3, 0, 25, -160, 166, -144, 28, 99, 225, 79, 63, -69, 65, 116, -92, 183, 62, 54, -45, -48, 182, 60, 7, -159, -79, -79, 38, 58, -93, -45, 116, 62, -87, -190, 178, -380, 115, -189, 85, -229, 134, -45, 88, 144, -113]
6375a13k6R6J16r2Q1m1J27r0Q0j33J85l51L07j58J37m91K29n0J39K43l44M2j44
6398b51K87j4j45L50k19j86K79j7O5j22J22j84K4Q0mk70J59P8P7J18l87L20j79
6421a9k3K55k7l01Q4j07Q0j98L95j58R6k10J97K6k7K17j32k76K03L0L0l11J40
6444c6j78J46J5j78N38k01j01j12m9K23J2j96J92k23J80j2j74K68j39o7L8J03
6466D9O1o9k8j85K35k9L2j73j57L35J00k44j7Q8R5r3m7J33k57J16J24Q6j77j09
6490a31nJ73O7j71M1k5k04M77j18j58j8J61k03k7R8K16k00O1O2n4Q4j18p0Nj55
6515b12L09j33M5J45nP7j04l02k1N0J40j52J38K02m03J63O3j23J20J60j77M4M1
6538F5j82J81k30r7M13j18L8k77L8K99r6J51j91P5j92J14l3j0n6j56J84M28k92
$$ y = [-113, -139, -43, 73, -19, 62, 21, 148, 58, 138, 5, 190, -161, 146, -12, 125, -366, -137, -187, -48, 195, -149, -107, -251, 36, 22, -123, 227, 8, -178, 101, 84, 149, 27, 149, -35, -11, 69, 65, -205, -46, 32, 109, 227, -160, 160, -19, -42, 213, 186, -115, -31, -138, -58, -256, 139, -19, 77, -133, 64, 90, 63, 280, 148, -128, 75, 105, 135, -176, -36, -214, -68, -53, -231, 307, 106, 5, -107, -156, 67, 79, -117, 75, -148, 32, 20, -154, 114, -25, -92, -54, 49, 110, 41, 13, -172, 63, 34, 66, -107, -264, 71, 171, -73, -90, -2, 93, 0, -47, 86, -171, -55, 69, 155, -22, -131, -136, 37, 104, -67, -26, -51, -255, 222, 104, -54, -72, 89, -114, -141, -43, 173, -27, 34, 96, 42, 126, 8, -62, -57, -212, 97, -36, 9, 154, 149, 226, 122, -180, -201, -151, -11, -163, -25, 177, -226, -63, 0, -123, -3, 157, -20, 24, 65, -117, 64, -166, -263, 150, 32, 70, -207, -169, 130, 34, 185, -6, 69, -123, -9, -42, -52, -108, -264, -80, 348, 56]
6561E6k43L35j25j75L06j50j91K31k72k4K08n0J22j39p6K91O4j76R0n4j71r1L59
6584A25r2M5n4k30J48k08N15j85P9l31K22J7k35J92Lk79K26k9k3J55k9M8j35O5
6608A0l38K18L6K52l99J26L37k64N4QJ05j71R7P7j39k15J84m7K47j50j53Q1J08
6631F4J74l40K07k15J63K6J41j62J08j9k99K02J05P6l16K8j01k9K77p2o3o9J16
6654Br8n1M08j93J07j77pr0L36l80JJ09k8l4P0J73k88K22LMJ65M1k04j52Q1J72
6680A92j96J56k92J10k07L35j13l2RK47m87J76N0j10J99N9R3k50K6l7J26J13k84
6703a17K31j48o5L2R5o3j63p8M01p8p5J29j07r4O8R4M0lj58l8M9Q0j30J66j76
6728a08K15k60p5J10J65j93K77j8L9K3l94L83jj20j10N4J47N4k80l4J95J42l61
$$ y = [56, -187, 148, 23, -152, 154, 4, -187, 44, -228, -252, -44, -94, 28, -111, -187, 104, 168, -8, 82, 28, -143, -234, 125, 33, 78, 24, -206, -58, -266, 249, 64, 143, -188, 34, 51, -184, 8, 11, -268, -42, -71, -94, 61, 32, 80, -55, 10, -328, -110, -74, 178, -221, -95, 242, -22, 32, 40, 145, -26, 71, 148, 9, -206, -22, -69, 178, 28, -125, -44, 64, 238, -102, 105, -110, 53, 79, 220, 58, 166, 147, -152, 50, 155, 231, -85, -57, -158, -187, 90, 18, -45, -114, 2, -96, -147, 261, 68, 175, -2, -9, -99, 237, -143, -142, -33, -61, -95, -25, 148, -140, 82, 85, 89, 254, 295, 91, -61, 20, 192, -4, 152, -140, -30, -237, 98, -15, -47, -38, 209, -278, -102, -52, -162, 37, 96, 189, -61, -35, -72, 54, 167, -117, 114, -34, -99, -67, 28, -35, -198, -276, 125, 47, -28, 101, -6, -100, -32, 62, 102, 99, -59, -97, -48, 32, -98, 68, -108, 107, -153, -228, -118, 47, -146, 131, 113, 152, 175, -219, 164, 163, 43, -67, -13, 134, 188, -92, -126, 69, 211, -150]
6751a50M38j53k46O5n3Rl3J39R6l31J12K5m6M09m53J71J7K26k80L6K82j95j28
6774d3K13k55K96m14l3K17j15o6K89q3J36p8j20K4m8m1M2J92q1k0Oj7p4J95j65
6799d3J21l71L48k24K6j0q0O9L8M1j84J21L43J30k97j79R6J08p2K05o7k7j28j09
6823a45J69j06J21R1J6j21o2J42jk60J90O0oK7m26L84k56J97N0j05O4K62l62K44
6847A67j86O7j92L14j95K3O8p0L5n9j71L26k27R8k12L82m9j70R7K00k70K83k53
6870Fj92L30q1l68L38M1j02L4J59r4j84Q5k2K21k87J8J50J11k33j40J44K01k48
6893a13K49O0k87M9k67K24n6m4K22j34L1K19l05m9J12J67j84o0K78j35pJ38j71
6916f3N5J79k37r7nK33j15J9o4K35k94K1P2J95j50K9j33K69p7l69K68N2o7r7L3
$$ y = [-150, 288, 135, -111, -46, -99, -90, -123, 16, 112, -219, -107, -82, -128, 281, -172, -1, 16, 242, -38, -2, 280, 85, -43, 170, -85, 211, -203, -236, -19, -134, -200, 89, 6, 142, 64, -56, -32, -80, -121, -79, 113, 32, 12, 18, 1, -73, 122, -43, 78, -293, 55, -169, -143, -153, -233, -164, -126, -85, -269, -148, 195, 325, 28, -151, -55, 53, -19, 186, 119, 92, -36, -145, 24, -82, 39, 130, 146, 25, -37, 105, 104, -156, 34, 94, 88, 115, -311, 73, -183, 14, 64, -41, 23, 285, -77, 167, -19, 48, -144, 170, -25, -2, 66, -4, 31, -28, -199, 127, -100, -2, -214, 168, 119, -51, 46, 246, -24, 259, 6, -186, 144, 63, -305, 33, 74, -28, 6, 165, 71, -113, -28, -50, 171, -116, -98, 52, 163, -70, -210, -66, 135, -113, 136, 196, -91, -42, -309, -85, -141, -185, 37, -97, -66, 153, -152, -201, -89, 78, -106, -166, 112, -23, -30, 108, -63, -8, 171, -66, -163, -168, 65, -50, -31, -95, 140, -154, -133, -61, 134, -16, 13, -120, 149, 72, -297, -29, 23, -44, -141, -108]
6941a08q6K18j78K46j92J83j4j20J78R%j57K5l6j23K57j6j30nJ43j0j82J78j9
6965F1j12J55k55K74j46Kn0P3j4o5j46L46Jj78J19j83J68j42J20j84L6o5J61N4
6989C0R9l59L80j89l7k3L4M4k10J00J51j66J11M1J16o0j63KK86r3k62j7K26k77
7013b36L15j64K84K3K0k72j43J82qm4n4Q5J0N5j00j30N8K69k45N8J75l52L7J88
7037A1j61k4jM8J30p1r2K78j12qJ47l8r2J47k29j51L31k70K54l52K84K32j35k55
7061a29K55l05J31m2K39k7l34L00O4j11j1q5J61L3k91K26j05N7o3P2r2P5Q9j2
7085I5l43K00J26L9J6n6m0k53L64k09K24l02R3J72j14K36l63l9M4J57oK3o8K34
7109B30k09j46q5K29r7J59j12j72K57p1R9k06L81k4m0p9N2j48k35J99J61j10K9
$$ y = [-108, -194, 24, -154, 92, -100, 83, 69, -51, 127, 136, 136, -21, 4, -32, -155, 102, 86, -44, -49, 94, 84, -98, 80, 61, -51, 104, -151, 123, -23, -21, -71, 2, -12, -77, -223, 123, 124, -54, 65, -118, 50, -92, 28, -156, -120, -185, -24, 30, 129, -230, 150, -39, -76, -99, -65, -21, -231, -131, 20, -146, -35, 6, 122, 62, -101, -99, 187, 94, -168, -185, 41, -236, 79, -85, 199, 222, 242, -30, -173, 9, 1, -43, -97, -12, -2, 53, -47, -177, -119, 150, -95, -37, 138, -214, -177, 11, -150, -174, -175, -127, 3, -68, -160, 118, 6, -2, 145, 107, 15, 162, -67, -218, 113, -157, 97, -255, 29, 261, 126, -129, 126, -179, -48, -90, 149, 122, -212, 88, 152, 41, 30, -55, 106, 139, -152, 74, -31, 26, -37, 35, -57, 18, 107, 95, -248, -48, 78, 117, 133, 77, 37, -216, 148, -61, 163, -139, -46, 126, 12, 248, -115, -154, -110, 47, 41, 64, -4, 230, 21, -125, -210, 19, -78, 81, -31, -203, 54, -17, 82, -124, 257, 233, 193, 114, 166, 18, -217, -18, 143, 33, 62]
7132F2q7O9j7Rj96K81J39l90K6J40j19r0J96j5pr0o8K33R6j77Q2o1O8j65J2Lo
7159g2K33l41R4P0J38r5J8j02P3j34J90j66o9K38k32J89J15k92J44mn9J09j72
7182a27j3J61k04J33rN6r9Q1J64j8j65k50N54k86l2L55m78K38L7q3J34k15l1J48
7206E1k8J96m08Nj4J75Q7j54K12n1k80J11L76m01LJ22K01j99K11l90L6k3J74K13
7230B25k86K20l30J74N4J44l09M7J75l4qO1k88L47m07L12on5Q4l15J90J18k69
7253a56j7J98q7J63K3j89K7q2q6J33j41K96j79J65q6J49K22n41J24J01J05k3l03
7276a84N0O3M52m20p5L7J93L5j37m1p8J64J00l60K93p8K06j93J6J4L7J60k60k2
7300b8k32M74k90l9J77J4j90k0K18k58M99l49Qj4N1K3l8l00L08j57J57Q0j14K03
$$ y = [62, -25, 44, 27, 36, -160, 121, 260, -130, -104, 36, -83, -173, 23, 8, 1, -89, -157, 76, 172, -5, 77, 16, 84, -81, -69, -66, -72, 161, -180, -86, -16, 122, 27, 45, -57, 16, -118, 72, -94, -163, 75, -157, 32, 147, -145, -1, -5, -64, 45, -127, -140, 21, -183, -50, -59, -3, -102, -21, 143, 125, -40, -290, 264, -22, -54, 301, -177, 61, 98, 15, 149, -66, -97, 51, 23, 219, -189, -184, -198, -23, 64, -90, 122, 71, -209, -98, 278, -123, -120, 2, 203, 4, 215, -175, -139, -162, 12, 225, -61, 159, -171, 3, 57, 201, -108, -61, 114, 80, 72, 133, -155, 192, -215, 97, 91, 36, 120, -195, -5, 113, -156, -173, 25, -62, 101, 124, -65, -38, -120, -206, -73, -214, 82, -97, 68, -18, 131, 353, -188, -64, 37, 142, 119, -184, -134, -71, 381, -39, -114, -77, 116, 151, 14, -27, -105, 59, 159, -201, 92, 14, 220, 27, 43, 57, 94, 254, -6, -28, -260, 214, -76, -115, 62, 76, -114, -134, 84, -174, 325, -24, -16, -30, 21, 44, 6, -294, 14, -143, 14, 94, -20, 183]
7324A83j88P2r2O7n6K63l39Q8k2L67l55k63P0J74J34R2l37QL6L52j60j43K46j90
7348GQ2J34l91k5N7L09M2k10j58J46j03J94j37M1K1n1J41O9j15k01Q3k35K56Q
7372c6j40L29j81j09J87L42n15J45m35L15K49L3k72n5m2J47pjQ5r4L77m21J19
7395B0j48M35k45N5J15j91q2J66k47j00K75Ok7m2K20k22o3Q2m0QM3j6J02J65j66
7420A03n2l1J45n32L99k5j11j5j50K41k39K03K28j84r2K51j71l3l05K21M8J48
7442D7O5l19K16J63k29K56j19k30J72lJ08l18Q6L13l08J34j41m9L38k65J48m7
7464A8rJ6j63m4R8O4jj34K01J07k67P3J62q7j71J60J85j85L2k39K54j13J60L5
7488A52k46l7Q4j0O1rJ33j50k8L0J79j52J56l21J48K6R6k97K4K44o9k0q4K20j72
$$ y = [183, -5, 67, -25, 42, -14, 249, -90, -2, -24, 343, -12, -275, -205, -31, 103, 195, -142, -134, -98, 254, 94, -49, 197, 7, 89, 223, -168, -193, -136, 173, 215, 5, -153, -7, -110, 84, -53, -12, 9, -42, 99, 168, 53, -148, -65, -300, -44, -36, -176, 153, -28, -137, 50, 392, -123, 22, -413, -98, 151, 184, -88, -143, -185, -38, -45, -46, 39, -55, 322, -99, 20, -128, 307, 62, 117, 232, 41, -41, 125, -122, -222, 53, 59, 32, -10, 210, -12, -75, 7, -33, -25, 18, 2, 104, 269, 103, 51, 20, 165, -367, 32, 7, -104, -119, -269, -28, -267, -64, 164, -20, -112, 139, -32, -65, -370, -149, -101, 47, 112, -207, 9, 172, -57, 199, 80, -150, 22, 19, 127, -191, -105, 208, -100, 34, -107, -156, 182, -83, 65, 18, 9, 25, -138, -182, -84, -20, -21, -155, 46, 153, -114, -41, 121, 34, -137, 23, 208, 23, 55, -184, 70, -43, 117, 152, -94, -131, -47, -57, 4, -5, 128, -22, -50, -20, 159, 7, 163, -158, -10, 16, 112, -185, -161, 83, 14, -6, -90, 130, -42]
7513d2n0R8J70j19k30J78J05m14M50K20k09j23m0M4J04l00R8L20l48J09p4K92
7535B39J8l20J62o3j22Q0j60L80j27m24M78l88J52p5O9L26k74k0KmK22j13j16
7558g8M0j69J79J12k38K63k39O6oq3K20mn1j55M33k70J97m56J17Q3J31k00J84
7581G6L4k34n0L5j09K89J7q6J04j71n7J58Mn8r3N5J04J04K4k45j13J60J67j08
7605Gj52RQ9L4J4j05L7J44j20l0L1p6Q2J05J4j91J88K4j05K36l28PL55l08K8j16
7631a27K93oL5k07O9k31M47m38L32l77P4J56j99K93n5LoJ39j74j80L08l22K07
7654C4L52l34j36J86j89K56j60J33J2l36k8L65k43k2L05k81n0L13Qj37j81L13
7676A80P8p9j12j58n4R0J78N8k85P7j62K28K4q1L2L7nl0K24l58R5j01K32k39J68
$$ y = [-42, -92, 6, 176, 57, -173, 5, 110, -304, 146, 366, 157, 34, -6, 38, 142, -158, -60, 260, -88, 21, -53, 239, 257, -63, 99, 36, -86, -6, -166, 214, 87, -337, 141, -247, -95, -170, -101, 225, -49, -69, -67, -71, 151, 38, -78, -38, -207, -28, 84, -154, 109, -130, -64, -70, -153, 67, 63, 12, -143, 290, 20, 217, -239, -122, -39, 92, -108, 76, 110, -124, -174, -139, -248, 41, 58, -28, 76, -95, -152, 6, 10, -48, -141, -86, 18, 122, 146, -99, -212, -52, 115, 7, -145, -136, -47, -13, 1, -104, -67, 77, -43, -73, -42, -118, -36, 69, 83, -108, 80, 104, -1, 235, -93, -86, 269, -39, -11, -127, 166, 160, 195, -12, 57, -174, 273, -165, 167, -210, -136, 20, -179, 114, 59, 62, 56, 195, 21, -159, 149, -173, 34, 386, 52, -84, 102, -87, 169, 9, 142, 154, -182, -210, 155, -88, -110, 195, -86, -136, 177, 185, 48, -133, 180, 258, 179, 67, -91, -145, -55, 123, 181, -104, -27, -189, 39, 63, -18, 14, 51, 46, 16, 240, -118, -23, -124, 108, -131, 37]
7701C7q2K73L0p9j19MJ64r2n9M8j63J70j74KJ49p5k42M78k33l10K00J0L05k79
7725c7m9P5M6l9K75k28p1r4j03L19m2K09k76L7j31j74L77r7l4Q8P4K8k60NL23
7750B21j24n4j22M7k16M20o1kr1J51k63K02k45Q3R2j85J33L2l1J21q8n9j0J23
7774G4kj8J40j27p4L0j3NM2j76P9J39j09J09L2l70K54Q1k69J45J4oN0j74J21K09
7800A86L4O8l03l7o3K59P5k17j13J86J15p6l22L97j44mq1J05P6p1R4J71l45n0
7824f0p8L06j82J22p2j04j69K12Q5J56j72j99r0L22M3l15K66K19j90k78L01j20
7846CP8m6L1n0q1P0J34k34j36M19l95J45J75r5K9q7K10L2j76J15n5k2j86k7K25
7871G6Q2o3m3J39j01l82j4K99M1k32L16j6k97J71m2JP7k23K25J6j20M3K2J90k07
$$ y = [37, -45, 228, 258, 179, 60, 64, 228, 136, 77, 125, -38, 132, -42, -40, 109, 34, -208, 270, 37, -273, -73, -63, 242, -37, -86, -11, 35, -4, 271, 43, -28, -122, -225, 94, 52, 261, -15, 22, -109, -283, 94, -3, -37, 51, 125, 153, -107, -102, 221, 97, 43, -79, -32, -248, 172, 111, 109, 18, 169, -94, 108, -137, -54, 38, -147, -14, 18, -13, 108, 20, -39, -49, 74, 72, 54, 194, 67, -7, 23, 10, 15, 57, -119, -40, 99, -10, 99, 131, -239, 15, 96, -173, -28, -14, -20, 30, -144, -23, 186, 220, 288, -15, -52, -115, 144, 219, 2, -111, 75, 190, 114, -208, 189, 45, 41, -40, 65, 141, 70, 164, 335, -10, -60, -138, 168, -14, 108, 36, -68, -237, -25, 60, 216, 44, -155, -245, 77, 120, -195, 71, 290, 100, -178, 123, 3, 81, 35, 66, 16, -65, 5, 139, -95, -231, 188, -207, -62, 113, 18, 47, -40, 170, 202, 26, 141, 86, 64, -122, -149, 76, 158, 95, 52, 191, 90, -292, -306, -7, 34, -198, 118, 102, -195, -24, -66, -65, 12, -211, 14, 30, -90, -47, -25, 165, -42]
7896d2m3R4p4J60P0m6k14N1J26N3j29J24l47M29j44l54N0J48J61l32J27P5M1K05
7920A89j78j93L08r0k08o3K5J19K17jk81K7J78j67J44j72K11m6N6k19J11n2n1
7943a36J81J19o7k44M58l21k39M98l48Q2Oj5l3l3K26n7j53k4o0jM30j14k75J30
7967A0k39L34L02n04j01K08J10k38K13j55r8K54LO2N0j53j25M52m80J81n08L03
7989a19J19Q7P0r5K10m37J05k89L23j47k4K80k36K85k50K5j06K45Q1j2k27J3J36
8012C7L76m48l2R1O6j44R9j83J85k68K84Q2l22K24q7K42j99N2L5Pj14P1m4R0L7
8037A37M2k97J50O0j5o5L4k9r2r7P3M6K52k84J30N7j3n14L41K87j64m6Q5j68K7
8062f3K77m91L66j63J00j23n2J00j32L42l6k02K41n6k85J31Q6r1J2lJ78k30J36
$$ y = [-42, -85, 9, -65, 95, 165, 119, -95, -44, 82, 135, 6, 130, -217, 212, 68, -286, -236, -88, 73, -259, -132, -57, -16, 189, 11, -182, 126, 36, -172, -235, -210, -91, 126, 125, -156, -129, 49, -118, 26, -146, 65, 19, 75, -144, -33, -85, -136, 45, 164, 97, -147, 311, -10, -249, 249, -99, -17, -11, -26, -59, -92, 134, 77, -76, -100, -160, -161, 269, 155, -120, 10, -229, 105, 407, -97, -198, 10, 120, -118, 95, -60, -158, 96, 99, 161, 211, 58, -67, 385, -95, 86, -422, -119, 0, 87, 157, 62, 272, -165, -60, -349, -26, -173, -197, 83, -153, 132, -118, -93, -199, 46, 127, 115, -112, -99, 37, 413, -35, -67, 24, 90, -54, 45, -138, 47, -221, 63, 145, -177, 47, -40, 202, 3, 55, 90, 97, -17, 54, 10, 100, 137, 179, -118, 32, 92, 77, 12, 46, 17, -75, -172, -99, -53, 199, -85, 45, 102, 89, -425, -84, 203, 39, -7, 78, -90, -63, 214, -277, 89, -74, 26, -97, -149, -49, -181, 161, 125, -77, 164, 108, -177, -46, 40, -51, -39, -42, 136, -94, 42]
8085D2J18j39j69J27K48l44J47k62L47j63j70L82l53q5K63r2j29J47K14k78O3
8106h6L4j25J47J17j04L27l24k15%L90J26k91J34k45r2M65k05j91Q3K30k69P0
8128b4L06m4k50J52J73k99l61K38L0K49k68R1j06q3K34l3N0k09P1J17q7j1J09
8151D5N6l16K45j58l6K58o1o7J02N1k22J63M4p9N6r6R6l18Q2p0n4M2N10l20Q4
8176C7Rj39J5J66K6m0P5j32q0J00pj72N6L4J11
$$ y = [42, 160, 21, -148, -21, 227, -117, 30, -232, 115, -48, -218, 164, -189, -274, -11, -103, -232, -85, 129, -149, -86, -52, -177, -30, 87, -17, 310, -14, -229, -229, 161, 287, -4, 130, -115, -207, 258, 53, -138, -55, 175, -94, -24, 282, 238, -12, 140, 313, 14, -347, -109, -79, 170, -98, -7, -113, -196, 38, 5, 55, -154, -83, 34, -53, -64, 45, 101, -215, 30, -128, -164, 94, 33, -34, 68, 119, -103, 60, 104, 25, 81, -15, 81, -237, -155, -225, -279, -237, 273, -47, 37, 46, -93, -78, 88, 114, 74, 149, 17, -63, 37, 30, -142, -86, -52, 59]
8191E9
$$ Imaginary data points
##PAGE= N=2
##DATA TABLE= (X++(I..I)), XYDATA
0@%%%%%%%%%%%%%%Pj5J6j6J6j6K4l2L2m0M8n6O4p2Q7r7J07j22J41j63J84k05K29
37A21k58K89l20L56l96M39m86N36n92O54p19P91q72R61j059J168j290J426j579
56h30J754j957K194k474K812l231L763m466N435o861R174j3524K4369r8502j54668
71b37012K85785J31485j83020j23081J19221Q6252o4072l8791J8392k6029M0663
82I793O7221n6953j07145K9542J41885J0078j63186k8270J32314L7859q0536m4656
94e2054M0343L3654j8980K375j8279l2693O2261M5680p7699n1036O3689O2621
106E9882m6962n1123M1800Q157k8473L7768J0163n3478m657N3293J0346o7223
118c0507p922Q1714r471p3965J7031M9196k1416l8432M2304L9073q2389l4046
$$ y = [0, 0, 0, 0, 0, 0, 0, 0, 0, 0, 0, 0, 0, 0, 0, 7, -8, 8, -8, 8, -8, 16, -16, 16, -24, 24, -32, 32, -40, 47, -50, 57, -65, 76, -87, 97, -108, 121, -137, 152, -168, 188, -208, 231, -255, 281, -311, 343, -376, 415, -457, 504, -555, 613, -677, 749, -830, 924, -1033, 1161, -1313, 1499, -1732, 2031, -2435, 3000, -3861, 5313, -8211, 16158, -82344, -237012, 48773, 180258, -2762, -125843, -6622, 79630, 15558, -23233, -4841, -30870, 9793, 77014, 20061, -87084, -57542, 84343, 94421, -68765, -97035, 35279, 73138, -7398, -52054, -11711, 21943, 2963, 5338, -12941, -45634, 16627, 62307, -15392, -66428, -2739, 59882, 12920, -38203, 3597, 11754, -16719, 21049, 31212, -22266, -26923, 26370, 36716, -30507, -38429, 43285, 33814, -40151, -23120, 26076, 4660, -33772, 8532, 47605, -34784, -68830]
130f8830J08481K3329j02585k2679R3044K6775r2444j4450Q7163l538n5945J1980
142i699K2434j4076o659L1157J318n5418R283N8930j9542m5134J4345L4723j0743
155A0919l8016J9115K9748l0351n984K6866j4054k0651J8778K7633k1045l2984
167c0026L1498K0724l4417L169K7570j1073k2371Q568K8567j3852k7534K6666
179G489J2517k9387n70J8855N46j6195L065J9795k5068k0661M4242J4184m6482
192a7670j6093L9961K4954m2506k2198M5891Q639l2451m88J3861L392l869M801
205F224K122k3512O707L4647j4265k9110R995K2479k188k6760M829K4735j4859
218A044r964J2715o056p198R118J2640j2031k5509K1192K6505k5829j4468J8814
$$ y = [-68830, 39651, 62980, -39605, -62284, 30760, 57535, -34909, -49359, 37804, 34266, -21679, -9699, 12735, -1341, -8000, 23157, 24475, -30943, -21660, 37270, 17728, -27406, -13061, 21662, 10919, -27097, -7982, 21766, -8585, -14569, 12297, -1757, -22408, -3630, 24003, 2958, -30026, 1472, 22196, -12221, -9052, 18518, 7445, -14926, -6358, 22209, 8357, -19177, 7489, 20006, -9381, -9951, 8904, 9450, -6745, -3680, 16115, -8953, -29614, 14628, 28812, -17670, -33763, 6198, 31152, -11354, -33552, 12339, 20978, -11473, -11961, 1900, 5292, 1423, 6224, 8346, -15166, -8459, 26188, 11923, -17187, -7192, 15287, 13099, -13661, -8832, 15903, 1044, -8920, 3795, -2261, -9459, -341, 12299, 268, -25241, -4049, 22456, -3373, -17841, 973]
231I73R442j0301j1764J3921Q383j5322N886O603j3222L249J0719M46j0683q151
245i821J7841J685k0117R400J0963j1719p363N828J2585j0376j3620K0061J436
258F783j9388O333J1051j118p886k144J1904n619o738J5318l508j0075N457M489
272D859J032q660N63J4520j0740r790J1882J147m893k137K262M051j2290K783
286e411J5305j3151p315J1965J909n927o462Q621J0179j5031j684J1289l820P88
300A255P94k060K387l475N546J989j1441O273P780q633m228Q67R605K48j6061
315i154O127Q481q847J154J561j225M70l117N501j707o948J1371J94r624L774
330a989K538L576j758o556P995k86n470N630j542j216J877l161L503l804k705
$$ y = [973, 10415, 114, -11650, 2271, 10654, -4668, 1218, 7821, -5401, -2152, 8567, 9013, -1670, -9821, 8020, 9705, -10412, -1012, 9951, -1768, -9131, -3303, 9282, -1094, -14714, 5347, 6783, -12605, -6272, 4779, 3661, -4225, -6369, 5535, -84, -6822, 8496, 4988, -5087, 370, 4859, 5891, -2769, -2206, 12314, 1574, -8216, 3666, 4813, -80, -2217, 45, 4096, -8194, -5411, 9894, -3257, -10572, 1393, 3302, -2625, -9087, -466, 9713, -5318, -7002, 4287, 467, 1255, 2049, -11, 2376, -1099, 4447, 6436, -5005, 1268, 9048, 415, -3813, -2946, 6659, 6907, -9154, -3027, 5454, -3393, -2239, -678, -1903, -1433, -4550, 951, -756, -7704, 3667, 3861, -5763, -1989, 549, 4125, 2367, -4189, 3806, 3520, -1950, 3680, 2138, 922, 2799, -362, 3141, -663, -3368]
345c368R749n419p136O272O11m33l643q73P934o006l559P087l216J053K517m548
361b978K979p54J166M651p275J005N970l431R33k474L88O364p104r37M077m184
377a604K729J324m436K21j857N120J504r856L471M915l155J714m093P55O222k702
393B72o42j795j052Q982j779n952J798q95O393R6r217L361L409j63K99o726J731
410a880N010k262M62n901j010R697k847m977N16r36N961k65n359K246j366M349
426A438L688q362N20M129J934K536p879k445R452k47k427m411j515Q370q51m343
442d13j95m255N899M155q066j884J270M568L931r416l349O578L702K184q945l486
458g722J1235J744n027k443r36Q086Q47p099J231q9L027K708o410l35J131r8N382
$$ y = [-3368, 6381, 962, -6174, 98, 709, 276, -3367, -4240, 3694, -2312, -5871, 1216, -2000, -947, 1570, -2978, 1, -753, 413, 5064, -2211, -1206, 4764, 1333, 2266, -208, 180, 6544, -560, -1497, 2580, -1604, 1125, 2449, -1987, -1766, -3623, 1497, 3001, -6855, -3384, 1531, -1624, 90, -4003, -3248, 2974, 272, -370, -2165, -3217, 5765, 3986, -1966, -168, -1063, 5330, 5426, -3791, -430, 2979, 2816, 3115, -3611, -1880, 3130, 868, 1330, -4571, -5581, 4116, 1269, -3708, -3192, -4128, 1833, 1568, -3791, -1545, -2911, 1438, 5126, -3236, -2716, 1413, 3347, 5883, -1996, -4441, 5011, 4764, 2337, -2074, -3589, 4781, 3930, -413, -608, -4863, 1036, 5191, -2875, -4759, -3489, 1079, 5010, -4406, -7755, -1177, 2525, 4709, -4236, -7722, 3513, 5257, 230, -2213, -3149, 4937, 5784, -1315, -84, -173, 2854, 5562, -848, -1183, -52, -150, 5232]
475E232n516n472N270J666o3m190k063P024k400k943N080l714r19K652J191K776
491C611o918k448J1254K04n679m012J733J0589l221r862L912K054K325Q72p381
506b967k3K717K856K682j0597l414J1263K921m462r400q98J5836P58j2325l255
521h308O001J0703m084j2825N891P718n60k167n429K533L472j177L665n496o540
536f603Q749M429m364p537j461J3147l21j2782J518M775K125p76m334K666j204
551a973k192R109k354r393K310Q396N908j1065j0152J4119P530p693o180j058
565d688R169L613q892j805n4K838O899o237o478P05M849Q393q046j2016P506J0026
581E782L55j0922p837J4147R824j1274q090K802J0990K884j1866l70O011n23K344
$$ y = [5232, -284, -5756, -486, 1180, 1117, -3073, -5136, 1888, -512, -3455, 1625, -2089, -3008, -356, 835, 3611, -3307, -5755, 5499, 5703, 24, -3988, -2255, 8334, 5113, -4749, -837, 1217, 3542, 4414, -2967, -2990, -273, 2583, 5265, -5332, -8746, 2517, 5438, 976, -8424, -9322, 6514, 7272, -5053, -8308, -2307, 8396, 4312, -8513, -2622, 5096, 4536, 2369, -3060, -527, 2945, 1768, 5433, -63, -6603, 2146, 6575, 2211, -5326, -6787, 6360, 6039, -6743, -5225, -450, 1675, 899, -3435, -769, -1973, -4165, 4944, 2590, -6803, -4493, 3903, 9811, -1254, -11406, 2713, 10243, 2550, -3630, -4688, 4481, 8094, -798, -2603, -2657, 181, 7080, 843, -5635, -4930, -81, 8312, 266, -11750, -4244, 5782, 6137, -4785, -12622, 1525, 11349, 75, -8015, -5213, 5777, 8661, -3205, -3575, 2436, 1913, 4257]
596D257k740m172J580K624N905n725j0712Q119Q232m890p117k591R363L188r341
611d020J41L314n43J893j325k22j731j310Q852n29j0088K940N640K054l657o148
627d739N696M566l535j177k993J514N431l661j382p66k116N225j7m408r43K86
643c019O245o60q961K288N059J642r95p366L008P799l027l356p01L026M128n078
659C2m57K403l332L705J514n228J07J354K644o57o256K950L237k721O01k529K24
676b409L908l220Q69N52k590L330M08j584O19j677L946O67n148L157J288j767
692C49J674j758K43J499k137J996j611j516L050k131k85J495l248J441J196j943
708a686J598k095NL412k699O51M12j115L553k121j534L119j451R47R26k520K016
$$ y = [4257, 1517, -2655, -1075, 1549, 7454, 1729, -8983, -864, 7368, 2478, -4639, -7230, 2133, 5321, -4020, -3879, -565, -1108, 785, -540, -762, -2493, -3803, 5049, 4520, -5568, -2628, 3012, 5066, 1409, -4739, 957, 5523, 1988, 811, -2182, -668, 4763, 1102, -280, -1046, -3162, 2063, 2046, -2362, -3305, -3019, 3226, 2566, -6395, -4107, 952, 2594, 1599, -5767, -2759, 5040, 2013, -1343, -2044, 982, 5110, 32, -425, 1978, -1354, 2351, 3865, -1363, -1256, 98, 2742, 2085, -4171, -1221, 2016, -705, -104, -2633, -2409, 1499, -1721, -852, -300, -2890, 440, 848, -736, -117, -1794, 2152, 2819, -2329, 828, 2116, 349, 2023, 265, 508, 2007, -130, 1866, 255, -1261, 1789, -342, -627, 868, -2380, -939, 257, -1686, -88, -2183, -2178, 1234, -1465, -814, -402, -1517, 2036, -85, -1619, 1500, 49, 996, 1922, -598, 1418]
725A418l87k21J952l717J062K436k878Q01r20r92L216k581q81J198j746L050j030
742b20k884L100q79P88P88l772L233K359l140R02o39J384K112l881J150J584j889
759I6K411k040j267K757k187M21J83k148K757j210j997K239j801J095J188l113
775b616K428J47j643K715j997QK285k142J648l34r74L283k461l98K275k353J226
792A097M33k447K335q30r29J842k875J152N17k528K255q67j037K621k906J087
808a080J601k412J911pj027K247k187J242J857l076K108O33k225K237j197k20
824D05J455k493J731j22k130K420j687j173K307k069J086M01k886L092l75k129
840b167J892j288J622O51k654K843p02q72K865k363k13K553j808J309j334r24
$$ y = [1418, 1031, 810, 2762, -955, 107, 2543, -335, 466, -454, -1446, 1770, -811, -1692, -494, -2240, 810, -220, -3104, -4, -883, -95, 693, -3079, 154, 2513, -627, 275, -364, 1020, 3132, -749, 401, 1985, 96, 2507, 467, -800, 1957, -230, 191, 374, -1774, 983, -227, -2224, 15, -1786, -691, 497, -2616, -188, -41, -1684, 1031, -966, -958, 1327, -815, 833, 499, -475, 2808, 347, -51, 2224, -129, 1097, 1530, -917, 1418, 588, -341, 1501, -1374, -222, 295, -2233, 22, -845, -1882, 739, -2167, -1080, 521, -1891, 20, 13, -1014, 1233, -954, 288, 2145, -931, 1177, 1810, -415, 1822, 625, 405, 1860, -633, 1098, 976, -1154, 1266, -421, -1594, 713, -1356, -270, 131, -2755, 337, -38, -2167, -275, -1563, 59, 710, -1944, 899, 197, -675, 2190, -173, -386, 2167, 359, 1668, 334, -590]
856e90L491k289r43J444k094K064j06k790J852j045M10J548l437R15K016j239
872g93P28j942K48L649k745N02J046j643K306J33j865J123j133K509M68m062K205
889G34O34q74J146k491K07K093k062J468j709j956L412j12j766m18r25M024p09
906F96l817K857L69r1J636k581R51N10k85K698l329j511M387m19j210j153q11
923a103M028j963k677K213j118K98J346k572O47q63P51L162l965j316L434m52
939a50P93j526j128L092n70K37o8k756L587J693l253m8L0J195J611l498K21J508
957I70j349J982j573k202J686K05J784j871m373N042K165m506m53J102K828n53
973H84l573L485m86j445L094p27j897O98N77K756k725k939M749m9k574m3r74K593
$$ y = [-590, 2901, 612, -331, 1113, -981, 1083, 977, -1813, 39, -1006, -596, 952, -2485, -1570, 446, -793, -65, -2007, -1759, 1890, -855, -353, 693, -950, 1356, 1489, -376, 747, -386, 2123, 2591, -1471, 734, 1368, 494, 1640, -851, -644, 1449, -613, 855, -854, -2810, 602, 490, -1276, -1694, -2619, 1405, 696, -3121, -264, 105, 14, 1650, -931, 20, 530, 245, 2943, -386, -1897, 2490, 2071, 861, -292, -1103, 2925, 962, -1715, 498, -620, -322, 1024, -1548, -901, -1764, -1013, 2149, -1816, -3132, 302, -150, 643, -883, -2011, 1081, 511, 748, 680, -2076, 1511, 3204, -49, -97, -67, 1128, 2739, -759, -538, 970, -379, 1603, 30, -2172, -486, -281, 1503, -368, -4741, 301, 2466, -2040, -2493, -1391, 1437, 884, -2689, 796, 310, -1135, 1959, 1232, -665, 33, 610, 3366, 641, -2298, 2451, 2402, -172, -215, -1189, 1404]
991A404o55k469K901k011j203K797j442o55L56l11K657k497p77K835k239J134
1007a75K356k986J71J302N36N64l587K443K854l703M2J009p17O37r43R83K97l954
1025b871K973K206m018l28J203K261j182m215L444K603l982J131J437q87O52j223
1041g96K163m09k973L903L69k901J173J02J018n52k480K707m02k458K843j243
1057F4r94N90m11J481j507j594L589j887j059K592j887l99J101O65R75l526J361
1074h46M720l603j950K455N70M42k418P24K307l212O05K404k716o51J042J226
1090A099n77m144K744L720m170p62J618L87k3j778J731J093l030K480J229l197
1106a580J499J161L08p75j997L022K62l168K164L45j275J103j138P06r26j775
$$ y = [1404, 749, -1720, 1181, -830, -2033, 764, -678, -1333, -977, -1288, 1369, -1128, -1905, 930, -1309, -175, 2181, -805, -634, 668, 1204, 1768, -1819, 624, 3478, -225, -183, 826, 109, 746, -197, 786, 1083, -2871, 102, 2308, -1710, -2038, -835, 1426, 244, -3971, -527, 2076, -1906, -775, 662, -225, 427, -796, 1367, 958, -2015, 1888, 2257, -644, 529, 631, 1649, 1097, -1383, 1324, 922, -1536, 1307, 64, -930, -340, -751, 730, -777, -2371, 1218, -669, -1728, 864, -1023, -1422, -321, 344, 1319, -2207, -846, 3874, 271, -1679, 776, 1346, 1788, -630, 94, 2401, -811, -206, 2198, -518, -1169, -127, 1099, 522, -3622, -878, 2842, -1328, -2090, -472, -85, -108, -1886, -155, 938, -2092, 388, 1617, -1580, -81, 1080, 1388, 613, -1384, 1638, 1900, -1268, 896, 1241, -34, 1069, -69, 637, -289, -2064]
1122b064L697j112k970K321l6o17j64l44K165j910q88L565j853j869K595M26k54
1139F88j765P32L399k888j514L537j370n66l5L28Q58k487R33K477l249p26K222
1156E74p93m1j523J231J652l520J149K130k194M89R80O4J0j844K603Q40l708K234
1174C33J619j624k10r5J146l73k148K522L63l149J858K21m39m96o14K034j285
1191c37k033K603j80j714J291k34P79o53q71L019j659j664L011n03p97N4M48J336
1209A896k352j45L014k158j246K124n52m52r04M37J817l089M84K610k399l60J070
1226b05k18K06j526J156J884k843Q16J833j086K27o09J046J018k748J702J302
1242A955k572R18P91p30K18j597J948M0k903K163J96j842J197Jj86o0j359K614
$$ y = [-2064, 1633, 521, -2449, -128, -164, -781, -945, -1289, 876, -1034, -1922, 1643, -210, -2079, 516, 942, 688, -1077, -345, 3054, 166, -1348, 2189, 819, 253, 218, 546, 1404, -1083, -150, 2327, -922, -1648, 574, -219, -260, -1783, -552, 1100, -2420, -1271, 859, -1335, -846, 134, 198, 208, -1636, 967, 1807, -1901, 333, 1952, 328, 118, 23, 1169, 796, -1352, 1170, 1533, -1616, 242, 463, 24, -472, -1086, 948, -337, -2370, 233, 53, -1661, -370, -604, 175, -478, -1349, 1670, 11, -1653, 1358, 855, 58, 112, 560, 1896, -456, -601, 2413, 255, -991, 1133, 581, 129, -775, -338, 1479, -1610, -1126, 1484, -915, -1275, -205, -423, -217, -1743, -587, 1297, -1546, -730, 1103, 17, 244, -365, 681, 1699, -1049, 653, 1955, -617, 301, 1092, 362, 580, -1017, 931, 971, -1932, 231, 427, -1415, -218, -217, -403, -463, -1822, 792]
1260G92r32j893K471q0j040P54m16J364l25j716K847j227j067J439n04M11r00
1277b2m55K413k183q17K528j492p92J064q49P84j447rK161k436J27K055j334L27
1295c77k09J50J496j868O06J752j716K01O85n18P23j241J005R51k730J007J365
1312A282j640O08m44K10O19k162J495L73j996J463m9r86R56q99J287K69j808K091
1330F69m5j197J259q40K99N96j102J553m35j353J997j032p17J041q22O85n63p21
1348g28J508j385n14J729j466K13K23n76J243j323l41K469j816J41J057o62J416
1365A188j123m06J776j355J18R77j115L56k99N0Q87j780N60J221j506O44k90r36
1383a033J415q89m04P36j127J203K99j427J187m05l6J090j180P84O42j261J282
$$ y = [792, -140, -2033, 438, 358, -682, 72, -344, 1020, 695, -1021, 1826, 599, -468, 971, 467, 878, -22, -477, 1936, -247, -1064, 1464, -28, -820, 244, -605, 179, -1268, -1277, 884, -1552, -1425, 630, -704, -377, -586, -436, 1060, -808, -202, 1550, -166, 35, 720, 202, 925, -316, 689, 1640, -1090, -83, 1282, -358, 250, -194, 16, 635, -1527, -32, 341, -1655, -192, -241, -1227, -271, -1170, 117, 386, -1422, 669, 624, -573, 686, -154, 145, 741, -361, 1192, 757, -596, 1401, 369, -348, 693, -129, 556, -7, -728, 780, -605, -1119, 610, -856, -643, -420, -996, 247, -1076, -1417, 1052, -764, -623, 434, -228, 1188, 65, -341, 1435, 80, 198, 1175, 60, 416, 117, 167, 1054, -726, -166, 1055, -451, 193, -97, -1033, 382, -507, -911, -175, -1302, -99, 200, -1227, -40, -445, -481, 609, -571, 213, 855, -406, 876]
1400H76m30n72J204p56L83J40j622J814j30j586R34o06N08K61j622J104j67p45
1418a012J094n26L3L06r63J397k90j517J850l89KM48j149J490M07j702J192j77
1436D94k58O68j381Q22K68j234J090j48j052R04p96M90K83j784J595J70q49L52
1454c66n80P68Q07j697J006N39p03Q10p92M50P10j156R49M07j512Q77l97P21J42
1473I83k038J190J249j742N5j81N24J61j517J127N82j879J175J66n69M94m38R38
1491B80N45k013J385Q14n99R0j043J164N96j765R46N51j031P82p06J85K86j282
1509h15P95M69j510Q04k48J1J041j951O31J180j228R35o70K71J066j440O23Q87
1527H51j324R57l1r5N06j042N81N17q97K25k08j28R13k008Q21J466k026J64Q58
$$ y = [876, 446, -126, 1078, 322, 705, 845, -777, 1037, 907, -679, 255, -351, 157, 418, -1204, -100, -267, -1012, 82, -444, -411, -105, -1068, 329, 39, -1478, 372, -17, -15, 433, -716, 774, 1181, -521, 671, 494, 236, 904, -477, 345, 613, -621, 469, 321, -731, 173, -623, -133, 150, -1634, -39, 131, -718, -366, -946, -178, 629, -1068, -62, 477, -226, 584, -208, 242, 952, -204, 745, 1152, -360, 517, 120, 841, 983, -1055, 135, 1384, -358, -303, -484, 40, 201, -1316, -189, 393, -1486, -311, -145, -714, -220, -658, 280, 825, -1188, 197, 1011, 412, 502, -541, 623, 1219, -546, 400, 951, -80, 702, -4, 181, 467, -815, -20, 449, -1061, -257, -505, -494, 547, -1404, -773, 407, -821, 114, -556, -285, 781, -659, -36, 851, -473, 484, 453, 358, 864, -178, 403, 920, 23, 248, 40, -88, 825, -1183, -362, 1104, -922, -758, 100]
1546A00p23N98q47N66P86j519O91J031j274O56l19J59R64j185M94Q71j018N32
1564E63m44J30J061j622Q46L45j661P79M92r38Q96r14K12K10j145J145l44q41
1582a230J796q74m03Q32o34P45M6n54J219j029J51J035j433N87O13o71P33o02
1600C27l78J298j300k74P37o50N78r16r7J040j359M25Q34r54p2M75j1K76r13P26
1620b08J100j513P02L07p82J101o65J21P88j174P85O36j169M22l33n7M38j227
1638g28N80N90j426J016l64m37Q98q58M91p4o11J228k11p55J196m83k18P89p97
1657a74M75K17p15J260q40l93O46k15K86n18l47J060j220j88J185r78P3K50r5
1676b31J28n82r5J368j330L03Q65p50M15k41K67L08q23M64Q81j173O33%k74O08
$$ y = [100, -623, -25, -872, -306, 480, -1039, -348, 683, -591, 65, -254, -95, 869, -316, 178, 1049, 31, 563, 119, 249, 1310, -312, 534, 879, -782, -3, 489, -449, 447, -467, -255, -45, -1190, -45, -389, -1230, 566, -308, -711, 121, -513, 232, 278, -276, 943, -86, 65, 1100, -333, 254, 867, 196, 929, 327, -51, 1247, -53, -327, 410, -240, 338, -578, -675, 365, -994, -569, 265, -689, -761, -286, -297, -21, -934, -208, 892, -621, 81, 388, -394, 707, 42, 163, 951, -223, 562, 1198, 29, 451, 118, 61, 499, -728, -148, 442, -984, 32, -332, -769, 129, -729, -238, -312, -923, 305, 94, -661, 535, 52, -166, 623, -174, 301, 518, -197, 1063, 223, -170, 476, 261, 547, 29, -318, 742, -478, -666, 519, -459, -386, -136, -231, -103, -685, -780, 588, -742, -439, 426, -324, 91, -150, 117, 425, -398, 66, 947, -226, 407, 407, 133, 741]
1696G41p03L93N11j584P60K29p47N85n58J7M39j054N77M38j005R08Q3p55P50l83
1716c58N05L5p95J398n63m65J134n80l0P0l53R63m96p11J104p11j47L94o36M39
1736A97n57j73J020j169l4P80q19M83p5k07Q73p25p2J119j077N61N63p37P14o23
1756D2j13J436j454J15P73r68N68l40j42N78j006M48M22j079Q84l06n60M74n21
1775g49M23L99q84Q85j20o54J048n43J78K93o45J079l52n86J169o40m14N34l49
1794G2L68j95p31J297p12q58J093o13J66j69l15J011j295k11J513p89k52N88m63
1813d95O64n50j01J193q85Q7J084j183O23J05m90Q33j078O2R90j488Q82m5q66
1832f58R37m24r0O01j303P36L42q85O86l55k2N62n49N64Q2r33J295j54p37Q74
$$ y = [741, 38, 431, 942, -642, 118, 347, -400, 185, -373, -356, 83, -971, -394, 44, -961, -53, 30, -725, 25, -358, 147, 182, -613, 785, 222, -243, 891, 311, 281, 351, -2, 961, 465, -246, 858, 147, 0, 394, -242, 197, -360, -533, 487, -682, -716, 64, -755, -272, -347, -554, 319, -406, -478, 641, -436, 125, 688, -49, 665, 42, -71, 1365, -89, 26, 799, -169, 399, 59, -83, 495, -511, -63, 359, -720, 164, -142, -702, -228, -749, -326, 73, -811, 74, -46, -700, 348, -195, -17, 276, -369, 710, 358, -228, 941, 301, -113, 421, 72, 440, 245, -486, 811, 99, -759, 334, -279, -113, -282, -597, 414, -881, -1092, 421, -368, -620, -32, -495, 169, -381, -482, 711, -174, -87, 997, -186, 437, 542, 52, 885, -193, -131, 859, -629, 253, 208, -658, 279, -145, -235, 366, -937, -201, 141, -744, -58, -413, -435, 127, -422, 142, 224, -709, 586, 432, -305, 569]
1852E69k05O7K38q19R70k64j153J049j9n28K04p21Q62k91o61J003q05j94N02k71
1872d67M37k31n11J063m05n81J063o80N65J07q92J234l58m07J134j295K35N10
1890E21l81M8L19o34N61p64M71N91j303L99K61l82J42l64M54M25j185N17M35p60
1910f29O80q6J47N19j234Q55M96p53M89l23M1N35j219N99O31j095Q03p13k15R20
1930D48p07j29N90q13O06o22J73L50n81N05Q17j277M27J91k42N55m70K79P73r70
1950i7N17q4k48M34m32j29Q46j134J67O46o58K55n08k4J032j238j7J042j013L37
1970c06q0m07J202p14o9N09j22J40j66m3J039j552O38R02r97J87K56k34O23r17
1990a11k73J142r42L4L78m57L40o98KJ011j179P4N34N1M77j081K12J048q77l5
$$ y = [569, 364, 431, 669, -150, 820, 556, -597, 452, 433, -95, 109, -612, 250, -41, -702, 301, -504, -698, -196, -467, -30, -261, -772, 291, -114, -695, 368, -312, 253, 360, -532, 702, 344, -63, 1071, -224, 11, 521, 140, 188, 507, -127, 434, -330, 141, 732, -571, -172, 89, -293, -151, -515, -61, 364, -821, -304, 131, -629, 51, -35, 112, 631, -603, 252, 748, -5, 484, 161, 202, 737, -482, 117, 748, -347, 456, -257, -472, 448, -259, -388, 202, -611, -5, -627, -454, -104, -685, -180, 637, -640, -213, -22, -264, 291, -179, 100, 873, -97, 420, 336, 88, 522, 90, -39, 807, -327, -160, 486, -172, 83, -425, -449, 583, -655, -672, 370, -643, -306, -386, -793, 409, -305, -374, 135, 13, 153, -13, -56, 983, -569, 69, 971, -26, 161, 417, 183, 806, -111, -384, 758, -184, -150, 228, -229, 111, -587, -585, 426, -753, -679, -145, -94, 383, -698, -486, 562, -315, -350]
2010c50O40k84M78l83q2J046r94j24O14n11J08R6l11P85j053m1P04p66N80l00
2030a48n78R45n51n6P07p55L06m1n08J304p50j16R11l99j52J6n5N63n34k10P94
2051F93n65l92R70p74N02l29o57J043q68q2L39o9K00k71n15J003o92k32P82l68
2071b82K17p3j75Q84n52m1O17o73K23L8k15O02o35J49P69r27o2K90l73Q01o16
2092c4n06Q25p70K33J92q03O93r5m79R77m52k05P35o17O06Q9n65Q80n20l29O23
2113D78k44L71l08m00O39m42l97N58m29m0O9k12M63j11r42J154o51Q7J82l62O89
2134A52j77q05J320m25l90O85p21P44l8m25P23o80M5N43o80L83J00o65Q49p46
2154b08L9M09o81L21L29q81O78j48k72L80l20K54K90o81P18l52J8N33o02N98m8
$$ y = [-350, 290, 6, 484, 101, 19, 1065, 71, -53, 561, 50, 158, 254, -57, 728, -325, -366, 338, -428, 152, -148, -726, 219, -332, -388, 319, -436, -130, -171, -679, 625, -125, -241, 670, 271, 119, 135, 80, 643, 109, -101, 693, 128, -264, 706, -68, 434, 105, -552, 491, -377, -459, -120, -189, 11, -260, -775, 228, -464, -696, 86, -282, -65, -138, -313, 571, 19, -22, 595, -78, 145, 183, -32, 570, -65, 84, 853, -74, -136, 154, -219, 582, -34, -540, 285, -485, -252, -60, -863, -170, -265, -744, 233, -219, -424, 311, -306, 300, 389, -176, 704, 184, -145, 478, 234, 605, 297, -103, 536, 94, -303, 255, -174, -214, -145, -357, 106, -5, -947, 207, -444, -357, -175, -537, 152, -25, -830, 490, 65, -325, 360, -361, 383, 345, -80, 643, -37, 8, 551, -129, 254, 354, -311, 538, -208, -169, 240, -441, -120, 209, -672, 6, -142, -414, -34, -354, -100, 190, -491, 227, -125, -107, 426, -176, 422, 374]
2175C74m33L05j1m44P99k01k35J59m77Q61m52r60J067n96j1M39p74N50Nn90Q43
2196B18l35k01O58p38M62K39n91P73j66k48M81o97K03N59r46Q22m08k68Q99j076
2216c60M85R2m38N9J36r4J54n87J62Q87j217P81j73m84P06k59J7L81p63N58J94
2237B37l82N61m24R1N43r65Q42K3r10N26K0k23R2l63K73Q3m86M48n9l03O34o40
2259c82Q4L82o84N97n7k64P73n41j3L79k16L74k22m43R50p04j38O66p86N30J82
2280D67p44O28m85j8P61r40L21L39p60K43j42J5M55m35J12L06n74N00k6l21N79
2301B81m52J31M93o42L92J83n47O58l31j77N20p32N28j33n30N55n14m3M44m55
2321c71K97L53p03N23k57k21K29M6M2M84p70M37M7l42Q36k90l1o3k22N41l77l75
$$ y = [374, -59, 246, 235, -209, 590, 389, 154, 313, -164, 697, 245, -715, 352, -244, -255, 184, -590, -40, -35, -625, 218, -117, -318, 340, -398, 64, 303, -288, 485, 319, 71, 552, -145, 58, 617, -329, 493, 85, -183, 716, -360, 125, 217, -221, -162, -26, -120, 34, -553, -391, 496, -721, 60, -113, -597, 109, -150, -133, 248, -515, 43, 237, -145, 416, -8, 83, 626, -339, 503, 526, -384, 142, 162, -61, 31, -332, -59, 24, -462, -14, -73, -376, 258, -382, -298, 84, -600, -3, -60, -324, 449, -92, -105, 274, 58, 432, 210, -233, 717, 13, -125, 541, -245, 285, 467, -277, 351, -134, -152, 609, -331, -10, 329, -431, -188, -330, -315, 140, -295, -183, 123, -451, 49, 23, -298, 281, -171, -40, 453, -189, 203, 386, -161, 497, 166, -11, 509, -223, 305, 172, -358, 197, -317, -360, 84, -371, -74, 279, -424, 99, -158, -379, -150, -104, -62, 422, -348, 89, 136, -206, 630, 340, 309, 246, 24, 565, 188, -187]
2343a87Q70n95k97M86m03L52o52k08Q25l71N5K54n51J06K44l71L98l09K12L29
2363A87n77L14J79j17L04k03p6L53l79J26N96p35M33k84k06L60m51N1N05p04K26
2384i8k6n5M10m47q2N37j006Q07J38l31M02m67Q0N36n17M28N5k93L71l40r8O42
2406F46m92J51O8l33M55p95n5N04l01l14N77n48J31J84k56N48n22M6L18j13o1
2427a62L54n91Q29l84o9M35m14L79k72k95Q11l92k34M73l81o5K92m81K60k66r7
2448b70M29l89k9M71n10L50k51l21O60k68J17j52J66K07l5m20Q11m05k06K24q
2469A71J62k3n18O11l00j60K82l35L48k88l31P00l03j72L25o68L39K12l67M72
2489A57l78j60N26j37p7J53l10R44n68m36N31k17m5L56n29M38j46k10P18m52k50
$$ y = [-187, 683, 88, -209, 277, -126, 226, -426, -634, 191, -180, -125, 129, -422, -316, -72, -443, -45, -354, -142, 187, -390, -76, 103, -14, 290, 87, 11, 364, -15, 111, 707, -28, 405, 121, -85, 275, -176, -125, 380, -324, -98, -124, -179, 231, -216, -298, 239, -767, 40, 178, -153, 249, -218, -138, 398, -119, 309, 364, 71, 442, 102, 4, 646, 154, 305, 373, 40, 495, -300, -355, 149, -152, -466, 111, -437, -306, -122, -378, 170, -352, -306, 12, -101, -162, 192, -399, 430, 46, -23, 412, -2, 377, 105, -190, 621, 229, -5, 468, 87, 22, 314, -167, 93, -173, -270, 159, -230, -259, 212, -298, 52, -199, -520, 140, -128, -11, -163, 3, 210, 175, -245, 566, 161, -45, 179, 171, 333, 310, -208, 403, 103, -57, 225, -110, 238, -50, -381, 319, 16, -156, 169, -499, -160, 52, -315, 157, -221, -381, 145, 8, -69, 84, -226, 718, 150, -286, 245, 28, -17, 339, -190, 248, 102, -108, 610, 158, -92]
2510i2J15k28K58j51n42Q19m35l01O51m64L19J25k32L71j20m32P64m31M54r7l71
2531b0N78n41j85Q03m96J18K61n97L34O2p38L87l06J60J73l82O44j42m54J76M4
2552a21j26L29p57P16J60j53J15K4J17M2o77P10J9n03K21J35k61R0m8K53J5n58
2574b58M18j98l10K82j89K46J82m49M82j59n18M17N1%L73n49L01K48n59N96l99
2595HJ35K75l52P4k6l25L24j22%M71n99M7M63q44L13K73k71K29n08L86L17p26
2617d58L13J57k13M01l12j22O21n11N29j27n79N99k86n8O51r45M70J06o37N92
2637A91k81r3M15n68L20L7l21L71j28n21Q06p70M16J92l41K79K09l40N59o77J32
2658a13N13l62L67l82j5L23j28k95L38j64k13L12m72N64l53l20N44m69O4k8Q8
$$ y = [-92, 23, -205, 53, -98, -640, 179, -256, -557, 94, -370, -51, 74, -158, 213, 93, -339, 425, -6, 448, 351, -20, 558, 17, -168, 635, 139, 257, 518, -79, 255, 317, -421, -34, -340, -180, -7, -389, 255, 113, -341, -165, -121, -247, 82, -675, 41, 201, 48, 163, 187, 304, 346, -331, 379, 398, -105, 116, 251, -10, 80, 32, 285, 300, -258, 160, -38, -348, -66, -255, -9, 173, -276, 206, 47, -471, -54, -3, -3, 370, -179, 122, 370, -189, 407, 8, 143, 418, 66, 140, 114, -211, 113, -9, -9, 462, -137, -90, 373, -471, -158, 115, -156, 73, -435, -49, 268, -458, -145, 12, -201, 200, -112, -234, 387, -124, 405, 278, -301, 298, 12, -46, 605, -340, 130, 236, -401, 191, -90, -183, 232, -336, -16, 21, -300, 71, -57, -578, 228, -542, -126, 66, -275, 4, 213, -127, 432, -245, -113, 400, 38, 405, 23, 8, 331, 203, -92, 246, 82, -131, 181, -291, 273, -80, -400, 144, -325, -261, -289, -201]
2679b01L82l89J24O5n9q0N59o51N69j49l15M88l83J77N2j04J05k99NL45l11j52
2701b22L35j25J29n7l91L17j91k0Q4k81K61j72q3M33m6j54M12j92J10o5l82Q10
2723E10o39J7N57k31N0r4l64N10m93O9L38k7J36k31Q7l6k70k41M97l57k59M70
2745al66K37L72o00M07j90J10R6l46L48K50m48N16j45j80J64j83J96J30m96L19
2766A90J5m83L59m79L18K74l37N15o52j8N08o18K20L33l71M79j72k15N64n08N6
2787b2K10m07M67o6k96M86j03o9J75l52J82%l32J97j73j38K26l77J69J75P2J91
2809B15k64l68M46j88j43O58l94K00J98k35L69o03K04O9k04J10J95m80N97l42
2829D0k7J85m88M96k79m36O48k24k20J79l06M12L8l68K40K06l53M88m71L31k6
$$ y = [-201, 181, -208, -84, -19, -78, -158, 401, -250, 319, 170, -145, 343, -40, 137, 189, 85, 190, -109, -104, 241, -70, -222, 113, -12, 117, 60, -331, -14, -205, -225, -141, -422, -161, -333, -416, 17, -29, -183, 229, 37, 147, 82, -300, 510, -129, -112, 445, 214, 264, 170, -194, 316, -177, -108, 230, 203, 339, 108, 195, 159, -111, -352, 145, -212, -471, -1, -367, -130, 242, -358, 49, -141, -31, 65, -281, 67, 317, -131, 385, 240, 60, 224, 41, 237, 367, -129, 190, 205, -278, 81, -398, -80, 194, -143, 372, -280, -298, 210, -408, -188, 145, -226, 253, 81, -134, 430, -78, -22, 188, -219, 248, 182, -114, 372, 269, 200, 375, 23, 205, 205, -127, 70, -103, -241, -15, -392, -223, -48, 24, 215, -49, -417, 29, -159, -302, 356, -38, 162, 360, 125, 494, -109, 95, 164, -40, 70, 265, -215, 382, 40, 13, 198, -290, 206, -73, -509, 139, -85, -305, -126, -432, -20, 18, -350, -110, 96, -257, 231, -240, 91, 65]
2850F5j53L42r1m35M73j30J16Q5n40O27m03j3L52j77k46L07m16K71j24o3K92l41
2872b02l2M01o09J66J56p1J73J4Q5O4p7k33K79j40M40m60O2J68l31K92J84l91
2894f2J96J02m19L18m7j75m1m21K91K71k59p8J62J28k9l18N31j92o8J90l6K22
2916B66r3k92N69j97l45K06K62l95K20k91M22k43j16O5k10r8M38k84M0r5K9L43
2938B01l62p2K05rP3J72m60L28j39mK81j39j00K65l13J99P8l50L37j13j03J63
2960A38m12L66j30J07k28K9j7J42k94K59J82p14O00O6k92J16l13L66K51k92P9
2981IK84m61J99L5J41J03m24L58k3k65L37l58J47J06l78J35L2m88N52l73J13K29
3003A0l87L56J10l27J82l41M73J41n03K08L77m20L76j21q0J80j78R5L6k18J68
$$ y = [65, -88, 254, 163, -272, 201, 71, 187, 272, -268, 359, -44, -57, 295, 118, -128, 179, -237, 34, -90, -153, 139, -202, -234, 167, -442, -276, -120, -191, -18, -4, 81, 145, 68, -165, 114, -26, 414, -46, 16, 184, -147, 145, 329, -62, 134, 236, -183, 135, 88, -87, -128, -549, -258, 13, -246, -324, -162, -34, -63, -381, 150, -42, -110, 80, 44, 266, 173, -119, 450, 253, -92, 114, 376, -19, 201, -90, 332, 89, -27, 38, -172, -270, 168, -116, -76, -171, -142, 201, -161, -233, -28, -37, 36, 208, -252, 76, -63, -67, 214, 75, -25, 240, -73, 126, 204, -146, 191, 78, -25, 138, -274, 92, -38, 69, -159, -130, -147, -5, -299, -40, 142, -572, 28, 94, -198, -82, -395, -29, 222, -70, 9, 293, -168, 31, 66, 207, 310, -114, 244, 221, -44, 293, -65, 82, 188, -190, -55, -23, -511, 41, -332, -219, 10, -377, -21, 89, -238, -56, -397, 76, 217, -286, -78, 299, -121, 255, 134, 54, 234, 56, 151, 187, -31, 137]
3024A37J73j97O2k92j95L87m65L68m4j77K38k01J73N2l28L53j1k82M58k02K09
3045B16j88j25K35K10l72J95k86j2N91l48pL6k31J99j14k34L55o4l75L80j85J40
3067A6O0m63N10k65j33N22o24K99L18n13M27J11j01K51n29K04J49m78L82k0j88
3088f5K95l00j0J68o5J30k05j42K84l03R0J48l27L16k87L14L1q3J37j86J50J52
3110B42j88K77j5l80K32l2j58J47P9l23O05k81k99L75m41J52J21l62K59l61K14
3131a37M19o14K66pp8L94k58p9K10J14J18n65L07L6k32P0N40n65J35K84m46N09
3153D21k52p08O44k34O5L7j03Q3K52n28M23l20n3L46j77q9O9k38K25L20j14N1
3175A20l80L26p6j53P08m48l82O32j79Q3K9o18L28j9m08N98l43J64m1o3j02L05
$$ y = [137, 310, 113, 175, -117, -312, 75, -390, -22, -66, -243, -5, -206, -33, 19, -309, 44, 33, -249, 209, 7, 216, 28, -97, 138, 348, -24, 171, -115, -127, 464, 116, 109, 145, -86, 113, -1, -235, 120, 56, -319, 61, -124, 16, 76, -387, 123, -142, -275, 247, -377, -78, 240, -273, 154, 265, 164, 415, -114, 90, 239, -239, 143, 123, -65, 230, -70, -80, 88, 23, 153, -52, -194, 90, -213, -123, 25, -302, 14, -273, 41, 72, -11, 126, -60, 90, 242, 54, 331, 316, -64, 168, 136, -22, 125, 204, -119, 486, 205, -94, 281, -160, -8, 113, -249, 10, -351, -137, 282, -332, -66, -73, -151, 243, -15, -94, 116, 230, 348, -217, 90, 126, -106, -36, 504, -61, 74, 358, -88, 421, 169, -539, 105, -129, -64, -27, -130, -47, 205, -323, 100, -220, -273, 73, -104, -193, -124, -362, -137, 183, 69, 120, -260, 66, -10, -163, 545, 97, -285, 347, 168, 251, 280, -338, -10, -29, -437, 161, -182, -18, -59, -122, -224, 81]
3197H1l91J36J18m8J66j87L72j54m43O02j45j82L58l37K4L54k39L9N2k90K70j86
3219c0O7J70m53N91l75k28J71l82M40j0j11K89j43j35K65k9l15L40q1M5J8oJ49
3242B47j88L9K11n94O34k18l63L69j18K1K36l74R2J71k89p0kJ02n9k1K6rK59j18
3266a6P8K2J13k58M1K14l80K49l9j17K26K4k36L56n40L26Nm4M8J21l57j32p2K44
3290a24K20k15j91L92k96J02j1R1j30K7Q9L47m72L78k91K8K47j04P9J13p6K49
3312D52o24L6K21j99MJ48k05J36K16k54j00M3m9J22l9p0J75j83Q4j80L09J97n00
3335b60R2L17r2J99m43J57J83k98K41J19j75M12m90J25L52o36L31j5m84K82P4
3356ik49K41j83L34J5j11K78mn56L04r2N5K5j06L82n63K20K24l44L93J25l92K2
$$ y = [81, -310, -174, -56, -104, 62, -125, 247, 93, -350, 252, 107, -75, 283, -54, -30, 324, 85, 124, 176, -114, 156, -30, 37, 207, -246, 345, -30, -258, -87, -469, -29, -39, -150, 139, -4, -139, 126, 97, -218, 122, 41, 86, 104, 98, 247, 59, 98, 309, -285, 349, 131, -232, 137, 19, 40, 276, -98, -6, 165, -124, -194, -196, -94, -153, -174, -148, -157, 102, -16, 62, 84, 197, -61, -20, 194, -186, 63, 24, -93, 133, 157, -79, 277, -263, 63, 68, 24, 72, 193, -164, -296, -368, -124, 96, -119, -310, 82, -214, -112, -123, -32, -162, -135, -46, 301, -171, 207, -84, -56, 191, 87, 166, 279, 203, 452, -172, -136, 85, -114, -110, 38, -167, -31, 185, -69, -169, -126, -175, -53, -92, -162, 13, -170, -86, -266, 43, 240, -260, -168, 149, 57, 256, -187, -30, 153, -145, 96, 215, 40, 452, -38, 87, 439, -197, 134, 119, -365, -83, -9, -258, -17, -200, 134, 149, 38, 316, 312, -244, 60, -32, 23, 48, -58, 324, -239, -19, 205, -139, 254, 379, -13, 9]
3379Ij11L5O1J5j16L66m01K40pk99K80k43L7J14m7J88j13k39N04j97Q8Q4m15J41
3403b6K14k47L83l00p5K9k8n5J17j98M08n26Q9K49k93K94N8l02K84m68P5L54l05
3426b69K00K9l08L44L5j85L51k66j28N35j63k52P5p2J91j66k0L53k71j11O3J7
3448a8J23l46J57J05j44L9q5J04j51m1J62L44k14k15K31K0K77l68J11K57n32K64
3470H0J66m51M87j86k51K32p5L14j55k47k14L19l65L74k84K15N3j04J53k76j01
3491c16K94k02J77J29l09L15L8o4jk4j04K50j87L69j40k35L7mk3K27m35K51R1
3514A34lj15q2j13J49K74j27K12o19K72k5K34J9j61M4j75l91O18R4n05O46k94
3536H6J39k07j07r6K52k50K22J8j45q6K05j19K34j05q3L5k54L91J21m40L43l88
$$ y = [9, -102, -67, -6, 9, -107, 259, -142, 98, 91, -208, 72, -171, -134, -20, -67, 121, 8, -231, 273, 76, 164, 248, -167, -26, 188, -59, 324, 24, -51, -22, -50, -105, 12, -186, 222, -304, -215, 34, -259, 35, 93, -209, 75, -393, -318, 36, -269, -69, -40, -348, -4, 31, -154, 197, -69, -197, 338, 175, -77, -2, -74, 117, -49, -69, 284, 13, -98, -35, -18, 105, -241, -84, 21, -123, -84, -169, -65, -216, -257, -95, 249, 35, -180, 51, 71, 348, -20, 91, 348, -184, 80, 246, -205, 282, 96, -155, 77, 2, 316, 161, -86, -300, 19, -346, 28, -256, -41, 12, -92, 61, -215, -316, -22, -224, -47, 82, -227, 88, 126, 62, 61, 37, -67, 183, -4, 365, 225, -10, 27, 23, 0, 227, -208, 43, 134, 131, 16, -66, -179, -30, 244, 117, 329, -290, -18, -43, 191, 210, 49, 93, -82, -473, 145, 239, -266, 380, 86, 225, 18, -89, -185, 67, -183, 39, 57, -88, -174, 31, -88, 146, 41, -42, -7, -261, 130, 251, -189, 154, -234]
3558b34M8K2j61N77l27L20j78j13l1Q8Q8K24k24q0m6j16J70q3j16K39L17n79J04
3581i1K71m41K24M6J95m90J27K07L2N5K2k41L42j97j91lm6L63o9o0K67j90l89
3604b57M31k7k09O6M4P2Qk27Q9Q0k85M43o38K75K41j70K3P4j67K35K5K2M4k06
3628a4J44k85q9O71l05l7R7k39M74k28j35K44n03K40p9r6L03j68r6K44r2j36r5
3651a80J0K76r1k51M77j47j75J66lj14K19k09J97j40j54J54Q9k14J44j44K10l31
3673b11K84J97n01L83k33J53r3K84k91O2k33MM20j80j1j96k6O2L33l40J47j80
3695a66J64K55l78K12K09Kk06p3N1p7r7K62k82j9J33r6j22J07r6K76j14p2L67
3718B40l52l1j9NN85n72L30j0k49N9M33m40L34k27l59M44r7Ll6P4%k66j22L80
$$ y = [-234, -186, -164, -325, 252, -75, 245, 67, -46, -77, 11, 99, 323, 99, 19, -27, -143, 27, -56, -172, 67, 384, -195, -91, 180, -261, -37, 9, 204, -286, -159, 48, 80, 135, 157, -84, 258, 61, -130, -133, -179, 184, 115, 55, 322, 132, -257, 174, 147, -62, 4, 48, 120, 128, -99, -10, 70, -215, 228, -410, -135, 106, -64, -41, 33, -134, 101, 126, 148, 192, -14, 130, -155, -244, 427, 122, 85, 182, -57, 417, 189, 54, 298, -205, 35, -44, -140, 163, -5, -101, 143, 51, -85, -180, -170, 106, 15, -236, 241, 94, -81, 85, 82, -32, 187, -22, 175, 35, -119, 35, 124, -90, 54, -90, 120, -211, 73, 270, -231, 152, -81, 72, -21, 263, -28, 34, -199, -195, 225, 45, 34, -162, -188, -126, 207, -133, 14, -166, -2, 253, -125, 87, 296, 298, 92, 19, 70, -7, -104, 158, -124, -143, -10, -106, -228, -121, -217, 59, -55, -127, 240, -112, -143, -162, -157, 428, -144, 186, 176, -73, -14, 419, -21, 313, 86, -273, 171, 74, 77, 41, 115, 115, -151, -273, 107]
3742A07j45k03K45j15J36R1l42j69L87l59M01rJ3p8l29M38M4k34L61k5l00J33
3764D8kj1k54RK68j72N6J39o9K07l18r4N3j36j04L80J25j48M3j26M8p9o0M06l16
3789a07K30P2j01j22N9q1N25m98m5K58O1j34j63j9N5K26k10K13l49j1K08m19L16
3812c6J11k72J25J56J39j73m22N61J63m24L00l28J60j75K29M8L0n9N3j77j30P9
3834d2m17L08J4L9q7J43j74L17l28K46P5k43J14o6M2n3j83M19%k92J00M34m82
3857a16L40j85L15k21k31K72k07J42l2j98Ro8j69M28q8L0J8k27L41j60k88M23
3879A28rk27K7J20l5J47R8j43j82K38j97J89n23M58q2K7J7q2J04j13j32L08n1
3902H5r1Q3j81J63j21J08j86O2m9J40r0k8R0q9J79j04J01J84n15J90N21n49J18
$$ y = [107, -38, -241, 4, -111, 25, 116, -226, -395, -8, -367, 34, 25, 38, -40, -369, 69, 113, -121, 240, 215, -85, 48, 46, 35, -219, -210, 58, -114, -58, 81, 12, 219, -99, -193, -140, -276, -380, 0, 125, -23, 20, -106, -58, -137, -197, 209, -107, 123, 195, 94, -28, 31, -50, 475, -23, -68, 190, 251, 117, -46, -65, -10, 216, 6, 219, -130, -141, 67, -352, -36, 75, -197, -72, 84, 223, 50, -372, 189, 352, -72, 228, -100, 60, -115, 114, 162, 192, 133, 186, 9, -121, -42, -459, -151, -137, -98, -185, -42, -216, 101, -227, 19, 94, -149, -35, -101, -59, -112, -295, 124, 124, -168, -68, 366, -116, 224, 39, 354, 133, -98, 174, -33, 109, 77, -121, -112, -180, -349, 79, -9, 21, 39, -188, 153, -7, -295, 128, 119, -108, -81, 39, 4, 151, 249, 106, -76, 162, -35, 154, -369, 89, 7, 34, 51, -31, 73, -40, -172, 136, 85, -6, 77, -104, 59, -62, 46, -140, -78, -127, 13, -77, -105, -15, -104, 75, -29, 72, 256, -259, -69, 452, -97, 21]
3925B1K3K4J21k24P7K5k58L56j22k10N6k17M37N3k12j99L05q9J4m49M30J11l56
3948b83L26J88k58k6J35j8K1l19L93j35kRj27J72k03p5K49k04K55L02l09j74K07
3971A24l40P6j7NL77l42N5J70o9j17J07j31K60j90j64L46l4j59M7m3Q7K1j34j47
3995b12Q5K35k71O4R0j9P5K1l56K28J44k08L94k44o2K6L7R5J1k1K2J5j73Lp7K37
4021A39j07j69P3J02j12J30l5J81j39R4q1k59L99O3l21J64m2p7M5Jj40J76j59
4044g4%L94k04j90J58j40K27r6j66P4O5L3r7j52L02j65n6L55n28L15M2j23l33
4067c59O45m32O8m5m2L67l14o3L75n97N82l18j91J42j20M89j17k4j6j65Q6oJ73
4090A18P9k06K09j71j99K41J74m14J85L2n0J89m65K77M4Oj04p8J75P0K8k51K62
$$ y = [21, 44, 68, 189, -35, 42, 67, -191, 165, 43, -167, -111, -328, 109, 162, -50, -249, 56, -33, -19, -468, -38, 73, -283, 43, 231, -27, -53, 82, 64, 85, -234, 159, 24, 22, 31, -96, 76, -127, -202, 47, -157, 98, 400, 91, -83, 124, -216, -140, -157, -152, 225, -117, -62, 108, 39, -78, 29, -102, 158, -32, -196, 150, 116, -43, 4, -39, 48, 69, -65, -212, -127, 108, -163, -99, -9, -28, 47, 68, -288, -60, 84, -124, 270, 26, -36, -10, 27, 122, 133, 112, 134, 149, -24, -21, -98, 139, 32, -137, -64, 38, -74, 56, 21, 202, 63, 157, 76, -183, 216, 279, -42, 122, 80, 3, 48, 49, -91, 85, -74, -74, 320, 116, -74, 84, -56, 171, 75, -91, -17, 48, 81, -16, -168, 134, -31, -87, 268, -260, 55, 97, -26, -359, 286, -146, -78, -123, -165, 202, -112, -175, 200, -397, 185, -133, -324, -182, -302, 187, 70, 46, 30, -135, -49, -55, 118, 197, -9, 200, 29, -170, 71, 245, -169, 16, 48, -2, 187, -278, -1, 43, 49, -55, -133, 42, 112, 140, -111, 151]
4113A51j07R7J12k62J95o5N1m6j34K9R8j82m5Oj45K41M2j49P9l18M49j99K7q8
4137a63K58k16J5J24N8r5Q9Q6R8j17j75J77j59L00o92M72L3o0l7L4n8M5k56K24
4161a5nk91J95n2k58O04j42n1%k11J04J25j86J26k5J88Rp3O4j87L7kJ91n7R1k98
4187a19L70k87k28K87q9l4J50j59J65J24j87m5K38m02L70l09L22L2l99K39J7J43
4209A99q3k83P7K01q6q1Q4o8K23J88k85k1k67K55kj04J30j75Q2K4q7j37L44k42
4233a14J19L5k44J10J67m5Lj80L0K44j94J95k7m00L95J37k66K03k97J48j50J33
4255BL7r0J39k94J54J18j09j81M99n70J38K92k61J7K28l71J98P6m0q9J98n1J43
4278A83K7j71J82k62J04OJ36l19j36L15r8K3k51OPJ57n2K16M3k17M54l54J23l3
$$ y = [151, 44, 141, 253, -9, 186, 121, 172, 126, -8, 21, 119, -63, -108, -102, -247, -6, 36, -113, -34, -352, 97, -102, -75, -163, 95, -121, -106, 18, 76, -19, 70, 156, 254, 137, -38, 139, -20, 280, -412, 60, 93, 33, -4, 30, -28, 17, -239, -15, -20, -311, -116, -168, -426, 178, 36, -15, -15, -226, -122, 3, -183, -57, -82, 106, 115, 42, 106, -81, -44, -46, 145, 88, 179, -119, 251, -36, -264, 23, -66, -100, 50, -109, 56, 180, -7, -52, 186, -216, 154, -155, 167, 199, -200, 39, 56, 199, 116, -167, -90, 111, 25, -56, 28, -40, 183, 371, 86, 65, -202, 53, 51, -53, 77, -98, -16, 8, -79, -216, 128, -114, 5, 40, -204, -94, 73, 28, 31, -149, -119, 125, -69, 126, 99, -301, 94, 231, -35, 168, -129, 19, -131, 2, 39, -51, 88, -206, -52, 66, -43, -224, 275, -295, -157, 135, -126, -109, 119, -252, -54, 22, -18, -107, 91, 40, 183, 210, 39, 221, -41, 63, 69, 205, -114, -250, 65, -33, -10, -261, -255, -248, -91, -143, 73, 116, -101, 353, -1, 122, 89]
4302H9k0J02o3rK9j98L04n9l19K14K3n4K5j03j01L00j72k09K18l8k34K57L1K40
4326B53m42N1R6n6K9j92L45J83o97K95J50n7L77m21Q6L61m01j12J31J23jr7N1
4349E5O1j18L7q8J45l4q4q0J88n6q5R8l30M65k64J23N6n7j01p0L6K25k5j04P1
4374F4l1K71q8l15J27L2j23M0J11n4m9J92j02j79n8L57j91J77J25n26J55j6j73
4397b54L95M3l40K31N8n9j28j66M94k48N0j34J03N0J82q9j28Q2l52K7j3J2L67
4420A83r1j08j03N7qJ9J9P6m1O3q9j71N5J26R4K13r1m2k48O2J06L37k30J72k46
4445A14o9m3J09P1j34j1k81L97l03K59K6k79Q9K02k4j91p4K70j2J51l39J75K23
4468C26l87K01j64L7lM3qJ27j04j95L63j69R9k75J42J66j73j05L55j56k60O2Q6
$$ y = [89, 69, 171, 108, 99, 128, -70, 234, 175, -144, 70, 93, 39, 64, -39, -140, 160, -12, -221, -3, -41, -275, -18, 13, 253, -189, -138, -42, -98, -69, -261, 84, 267, -430, -135, 15, -42, 335, -86, 0, 361, -40, -152, -21, 102, 101, 4, 55, 116, -2, 35, -53, 92, 58, -26, -106, 82, 26, -59, 39, -291, 174, -90, 33, 89, 32, -69, -139, -103, 122, 97, -7, 64, 33, 304, 216, -99, 28, 60, -63, -23, 88, 34, -15, 177, 75, -104, -162, 195, 4, 181, 306, -220, -65, -81, -254, 141, 184, -156, 75, 133, 74, -54, -220, 274, 26, 76, -58, 45, 95, 277, 188, 60, 142, -210, -183, -196, -184, 183, 92, -16, -119, -62, -70, -51, -32, 44, 3, 66, -23, -194, -139, -13, 81, 294, 203, 161, -87, -25, 81, 418, 188, 360, 114, 45, 2, 111, 182, 48, 37, -244, 153, -150, 109, 135, -144, -55, 147, 123, -68, -142, 128, 116, 267, -72, 103, 326, -61, 140, -24, 13, 10, 53, 45, 172, 68, -127, 236, 67, 166, -109, 33, 199, 26, -79, 276, 120, -140, -78, 8]
4491HJ62N3m48L03k38J03J78O8N4k50K4J20k77K54P1j2j01M4p6K10l27j18L00
4514A05l7p5J7j58L3N1nK34k19L47k40j29n3J75k76L05j96K34l4q8Q5J22k62L6
4538b8J74M0j1r5j57J41j8K0p1k20L12j50J04j3l94K50K64k55K66q7J31k47R5
4561E1K3j53J08M66n43J19J89k98N6m0J32J36l54j30K45j43K34k7Q2j71j16K38
4583A04l59O8J50M3P2o1k65J37J48L0l13R8L18q4J44m25L70l65L29j48O5o3n3
4606f0j02K34k38M2L3J18k07M9J61p0K9N6Q9k66J57k16J47J95k31K4O3j24K15
4629I8l68J96p3J1n4L75j53J9j14R3Nj38P8Q2M0l73M62k53j50J79N8L3l22J50
4653a19L23j00k36K14j35K45k38q2m7K89KO1j45K41R9l94j20K02m1j14K24q2k32
$$ y = [8, 170, 223, -225, 78, -160, -57, 121, 189, 243, -7, 17, 137, -140, 114, 185, 173, 72, 116, 40, 250, -77, -195, 105, 68, -7, 10, -148, -115, -64, -69, 165, -54, 293, 53, -76, -129, 46, -230, 75, -121, 113, 79, -9, 76, 198, -64, -28, 146, 186, 175, 80, -77, 64, 46, 66, -5, -225, 87, -63, 41, 28, -366, -116, 148, -107, 159, 72, 203, -44, 51, 74, -79, 29, 495, -48, 71, 260, -38, 18, -22, 110, 246, -108, -238, 7, -136, 98, 71, 153, -18, -134, 104, -255, -187, -37, 6, 78, 17, -248, -111, 37, 67, -246, -148, 170, 86, 230, -195, 175, -190, 139, -9, 56, -7, -60, -162, 72, -166, -124, -91, 27, -180, -131, 30, -40, -11, 45, 134, -132, 25, -191, -44, 151, -80, -56, 7, -117, 98, -270, -74, -147, -136, -190, 185, 32, 51, -63, 30, 35, -103, -25, 57, 97, -276, 186, -67, -217, -38, 20, 53, -269, -119, 204, 104, -132, 82, -53, 192, -46, -128, -175, 114, 116, 177, 32, 273, 372, -22, -142, 60, 19, -95, 129, 47, -185]
4676a85K25j3l9qj8k5J67n1R2l4q6K48k76j03j68M17j66L3m1K98l11p4K19k32
4700a31J36R9j47J87R2l86J26j66J96o3r9kK28k17J87o4K6O6j96k13J05K00J18
4723H2k0L7q5l1j0J37k63M6L68j74j81q6O5K33j85j64J15k2j02K73q5R7j80QK55
4748A28j67J96j09N9J6K7j71Q6k11J36J29l4K8j8O0j07k8M9J26k72J16K8j35K77
4772B09l59J40J78k51R2j48p9r0M10j97NO4J92k33r2L07j56m9K9L9j75K37k82
4795b09K84K9j60j31K6R8k7J86n5j16l0J07K4P9k16j33M57Q6l19J72n1k64K94
4818A31j48j46Q4l5N1M0j38K38J6j41J86R1k45K6J63j36j71k6J74K70k45R4j85
4841e2J38j93Q9K51m58J44J45k41M42m53K75k77L25p8R5k70K96k25J42J05j9j12
$$ y = [-185, 40, 27, -12, -20, -38, -63, 104, 53, 145, 111, 25, 273, -3, -106, -274, 143, -23, 10, -31, 267, -44, -118, 101, -131, 5, 104, -43, 144, 236, -150, -24, -190, 6, -57, -156, -158, 70, -147, 40, -24, 2, 68, -128, -341, -236, -36, 82, 62, 99, 14, -17, -27, 110, -153, -107, 261, 87, -94, -180, -115, 118, -67, -231, -116, -138, -240, 33, -52, 45, -135, -127, 128, -39, 157, 48, 107, 123, 150, -21, 65, -146, -10, 119, 85, 113, 95, 155, 48, 20, 69, 195, -77, 39, 67, -68, 209, -150, -10, 168, -83, 9, -139, -218, -308, 102, -95, -90, -26, 166, -67, -159, 148, -8, -57, -28, 11, -164, 73, -209, 75, 104, -56, -187, -161, -63, -90, 96, 41, -75, -105, 2, 26, 105, -111, -244, 213, 299, -20, 152, 101, -163, 131, -17, -163, -79, -114, -63, -23, -161, 77, 93, -48, 138, 229, -16, 10, 173, 37, -134, -160, 14, 284, 39, 133, -52, 86, -107, -18, 233, -225, -81, 64, -177, 265, -188, 87, -190, 135, 57, 152, -118, 178, -47, 95, 200, 181, 69]
4863F9N1j99JO6J72q1j91J42K4k5j61L26k94Q4J9J48K02l46l4n4l7J66k61K04
4887ik4n9J72J66j85K17l14Q8R3q1ko9N5o0k4R6K1j20j0K99m68L16q1m8J40k12
4913a03j28K52R1j12P8k2N6qp6j54K61R3k11p9K59l64M13k41j7P1K9K17l51j06
4937a52L00ql50K84L0N3J0l14K71J57o84J70L13j08l1k57M14k9k75J18L03P5m01
4960a11J90j21K9K69l24j1j39L44l2J87k89l38M06K7p2J3j41J17p8oJ12M6j36
4983e8l1k1o0M63k67m7J61j20P8J27l75L1J84n3K00k46O5k69K56M0L0p5n8P0j72
5008a47O2J37M2j15kP7K7R5o4j70K87l02J05j86K55O6J37l09k6ok40L96O1m1k57
5033a18K71l42L7L07m15L45P2k67J50j12l05M95j22J75l8k45K13l5m9j43R6J05
$$ y = [69, 120, -79, -78, -12, 160, 79, -112, 30, 54, 29, -132, 194, -100, -16, 3, 151, 353, 7, -27, -81, -118, 48, -213, -9, -33, -92, 80, 246, 61, 278, -36, 52, 145, 64, 62, -7, 48, -12, -36, 60, 81, -39, -49, 250, -218, 98, 17, -31, 109, -103, -231, 21, 112, 0, 78, 56, 112, 104, 28, -126, 135, 228, 17, -62, 197, -167, 246, 5, -12, 59, 88, 305, -46, -152, 148, 140, -210, 74, 104, 157, 167, -147, 124, 281, -403, -233, 80, -28, -59, -316, 98, 69, -206, -88, 215, 290, -111, 79, -42, -13, 256, -68, -79, -218, 126, 94, 281, -8, -346, 60, 87, 15, 28, -113, 4, -74, -80, 32, 78, -58, -89, -110, -170, 293, 26, -21, 140, 20, 98, 225, -150, -119, 65, 12, 212, -34, 31, -238, 18, 58, 88, 13, -45, 25, -147, -85, 52, 94, -21, -23, 54, 81, 176, 112, -58, 229, -73, 32, -154, 101, 167, 304, -5, -31, -37, -277, 119, 180, 139, -118, 153, -189, -152, 155, -260, 85, 157, -110, 40, -72, -377, 118, -4, 171, 133, -112, 101, 66, 17, -126, -30, 75]
5055G5p3J79J15m37R1n4J26j07Mm6K20j76q2K46r6Ok46O5M8L31l22M3J62k62M07
5080B17k49j1K23J5n7j75K49K2k3l68q2M02o2J24j67k7k21M34k44q8J74l84K82
5103a6L7j06L99l98J41j89P7J67j2J50k11j49l7J80%Q9j77j24K81q0P6l3Jk70
5127b04K46j5Q4j75L5j0J65j68K82m15L58j27k23J65R4l8O7k96J90j54R1Q9R6
5150A37j18o8j99K30oL3J08l43J12k87M60J99k18m3L1j21J20q7K52l32L60l9l44
5173a63J64r7L6M4J15k07J38K45l79J13k9q0j4L0L39m29j22K68j9o4J02k32J95
5196d6K78k50R1O4j56J45j57m1L7K55m35J93J2J88k98K7N1J81k44K39oj83J95
5219A40J17j89J14j06j37K21j44J41l35K33P8k97Q4J50r3j59O1J54j83P8j37J14
$$ y = [75, 2, 181, 296, -141, -50, -104, 22, -85, -81, -127, 93, -83, -165, 81, -15, -9, -255, -190, -142, 189, -133, -90, 72, -190, 217, -32, -43, 180, 195, 138, -37, 212, 234, 211, -157, -239, 163, 101, 225, 58, 31, -190, 244, 0, -88, 86, -298, -16, 21, -85, 314, -84, 57, -132, -55, 112, 100, 250, 39, -110, -147, 33, 33, 122, -55, -179, 102, 22, 98, 65, 66, -204, 42, 27, 111, -64, -29, -39, 126, -42, 240, -175, 183, 56, -167, -2, 92, 54, 121, -175, 15, -139, -48, 41, 137, 19, -49, -248, -18, -24, 9, 117, -226, -114, -401, 59, 258, 40, -3, 28, -93, 27, -60, 192, -140, 220, 181, -163, 1, -96, -60, -16, 99, -108, 30, 275, -104, 9, -20, -100, -114, -84, 255, -174, -296, -28, -47, -111, -9, -241, -46, 232, -18, 73, 137, -19, 126, -31, -72, -35, 220, -215, -22, -10, 178, -120, -93, -42, 139, -105, 134, 128, -55, 140, 257, 68, 182, 76, -61, 160, 16, 157, -178, 55, 133, -164, -80, 70, -23, -182, -121, 33, -150, -72, -209, -95]
5241i5nJ37n7K2J13n9oL9j31j15K73j78N6J96k66j71K78o0L3O0P5j65J39o9j48
5266a04K94j09j88J39k19M46l12r7L3K7L4P0P4k72L30j08j37p3r8K95o8lO8K51
5290B73k59j2N3M08l74q9M0j50K6J43L4j30P0M3P4m16L91k48K41m8P4n9r7L0j34
5315a16J61l0o5J04J00m4n7m2p0j39Q4j59M32J96k54k88K67k73L32j18j27Q5P3
5338E2J5k21M36l04j57J26L3k9N8j12K50l18K38m8J81k06j68K95k18J63j64J21
5360B3L44j23k96r7M9q8J91m9K89n33l7K30Q1M5Q1k29J54L44k92k9k31K84m9M
5384F6n2%J18l4o9M9j14p7K1K8N8O9n7K13m32J98n2J16n0q5K71j46L3o3j71J27
5410c5K21l04J02j37L36n9j27M84q00K63J32j87K00r2J2J50l10J17J41J22j36
$$ y = [-95, -100, 37, -20, 2, 115, 56, 50, 89, -42, -157, 116, -62, -6, 190, -76, -247, 31, -29, 4, 64, 139, -26, 113, 44, -104, 190, 81, -107, 32, -187, 259, -53, -150, -117, -90, -56, 14, 88, -184, 146, 38, -99, -172, -270, 25, -43, -46, 22, 273, 14, 2, 55, 463, 89, 0, 40, -110, -84, 59, 93, -37, 33, 76, 150, -266, 125, -123, 118, 70, 144, 85, -12, 18, -116, 45, 15, -50, 54, 154, 110, 53, 11, -59, -198, -114, -273, 159, 355, 101, -187, 80, -193, 139, 21, -106, -21, 52, 67, -154, 282, -22, -179, -53, -20, -49, 9, -103, 147, -171, 67, 19, 200, -6, -174, 121, -97, 66, -98, 23, 367, 244, -52, -149, -100, -188, 3, -46, 243, -290, -327, -97, -16, 29, 110, -119, 35, 379, 87, 58, -173, 111, 62, 66, 14, 14, 132, 98, 29, 78, -36, -113, -92, -64, -6, 63, 6, 219, -213, -15, -67, 49, -1, -86, 185, 39, 72, 9, -162, -35, 186, -118, -16, -153, 183, 124, -3, 481, -319, -56, 76, -111, 89, -3, 9, 159, -151, -34, 107, 229, 93]
5431I3K7k51J89j78k61K88J9J17P4l13L69m3m10L30n0K1J37j46k4J06j42K7k6
5454d7Q5p3m1J29j68l1K45j95J41J32j75J54M9k45j04J46m9L39l60J50O0j25q4
5477f7J06m9K21j84K05l99P9L62k82m8l39J71K26L2j7j57K44R4j32L4J16k30N6
5500D2k26K40j27o9j4K83p7l43M47j15p3J12p3o8J80j53j89L00N8n7J24j23j03
5523b4M9k8l8R3j98J63j34M0K81k38j55K84J95m40Q2K03j45J57j11o0J53l3M2
5546A38q5k2l6k81L23N9l55L99j5k92K44pl7K8M2K31k77k8O8kN6m2p8R2l60K25
5572a2q9K81j04j06k14K74J13k68L47q0k70M26l11R9l8r1K43j24j86LN8L33k01
5595H3l65N27l20L8M9k54J05J62p9j60R0K28j56j57L16m0j04j75L67k58nK01l6
$$ y = [93, 120, -131, 58, -120, -381, -93, -74, 43, 117, -196, 173, 130, -280, 50, 0, 21, 158, 12, -12, 94, -48, -21, -47, 38, -35, -76, 53, -115, -146, 99, -96, 45, 177, 2, 156, 205, -40, -144, 2, -47, 292, -68, 82, 142, 17, -67, 39, -10, 211, 27, 232, -167, -88, 274, -8, -56, -395, -224, 2, 34, 17, -140, 104, 198, 66, 100, 216, -14, 42, -184, 56, -71, -140, -154, 129, 52, -291, 156, 41, -32, 80, 7, -61, 119, -34, -223, 77, 135, 78, 202, 79, -24, 25, -3, -41, 52, -146, 17, -117, -77, 204, -34, -189, 95, 290, -150, -68, 135, -10, 147, 36, -24, 129, 96, 138, 53, 31, -5, -286, 37, 96, -259, 140, 125, -167, 77, 70, 33, 61, 103, 334, 57, 29, 97, 95, 151, 109, 31, 123, -237, -12, -101, 180, 76, -30, -244, 30, 143, -125, 222, 142, -128, 298, -13, 86, 48, -43, 200, 76, -110, -107, -49, 284, 83, -282, 245, -75, -37, 12, -242, -137, 25, -54, -214, -124, 104, -52, -209, 107, 67, -37, -212, 155, -103, -108, 93, 57]
5618E7o0m6j34J68J52k08J63k51K63q8p3j09r2J36k4j8K70m2k5j86J8K59k46K62
5642A46K3k97J10m9K79k69J18q0K2r0L04k60J94l8j17J32j03j90J53o6j26L71
5664A67j16nJ07l99j1L49j71K13r8n6O9pl13L19j47J71P0j15j30M6m8J18J8p3
5688d2J43j68Pom6K79j16J32l80L3P0P0M4j28K61N6r9j40J95q6k49K58J29Q1k05
5713I3k12J96k52R2j14K56K4K0o9PJ63k57j4j43M27m47K38j30J02K8l17J00J49
5736f0K11j32l4L8Lk66K41%M5M3j96j49J40J09J6P6k12q5K4L00j75K42l58K33
5760E4K20j93J19r9o5m6R0k55J73Q1j50m8K80L0l07J65L63k09j31K96m78k5M68
5783C33l67J5k06J92j87J42O9N3J89k65K28mk53K03j01o8O8k08L68k18r2J62Q8
$$ y = [57, -3, -49, -183, -15, 137, -71, 92, -159, 104, 16, -57, -166, -258, -122, -146, -164, 106, 64, 39, -147, -129, 130, -116, 146, 169, -128, -18, -67, 212, -57, 61, -19, 3, -87, 217, -43, 151, 113, -4, 128, 25, -165, -12, -78, -204, 167, 51, 46, 153, -246, -257, 92, -79, 134, 36, -20, 49, 42, -271, 48, -99, 72, 142, 27, -103, -57, -105, 13, 31, -42, 101, -67, -60, -66, -112, 167, 51, 183, -197, -164, -94, -24, 20, -108, 153, 209, 110, -30, 165, 79, -170, 88, 217, 298, 93, -119, 77, -175, -83, -197, 59, 83, 103, 34, 41, 204, -53, -67, -210, 217, -230, 8, -122, -20, 8, -309, -209, -60, 151, 19, -15, 23, 26, -240, 1, 1, 46, 89, -107, -256, -116, -7, 9, 85, -127, -212, -188, 112, -63, 179, -179, 54, 274, 81, 200, 101, 36, -10, 80, -175, -2, 79, -71, -119, 161, 191, -116, 49, 412, 203, 72, 368, -110, -135, 333, -34, -19, -225, -33, -220, -78, -9, 44, 233, -32, 196, 192, -61, 142, 41, -27, 41, -167, 201, -17, -109, 53, 141]
5806A41k02M7j66L31j75J91m42K48J81j20j00k5K38k54J0M1j41K98j37o0L4O6
$$ y = [141, -61, -14, -180, 151, -24, 167, -275, -27, 154, 34, -66, -91, 147, -107, -97, -56, -197, 101, -36, -96, -62, 4]
$$ [...]
8191A1
##END NTUPLES=NMR FID
##END=
