##TITLE=1H_Pr NCS-115
 CDCl3
 8 sc, 
 3.06.2022
##JCAMPDX= 6.0         $$ Bruker NMR JCAMP-DX V2.0
##DATA TYPE= NMR FID
##DATA CLASS= NTUPLES
##ORIGIN= UXNMR, Bruker Analytische Messtechnik GmbH
##OWNER= root
$$ XWIN-NMR		Version 3.5
$$ Fri Jun  3 14:32:12 2022 Russian Standard Time (UT+4h)  she@DPX200
##.OBSERVE FREQUENCY= 200.13135
##.OBSERVE NUCLEUS= ^1H
##.DELAY= (6, 6)
##.ACQUISITION MODE= SIMULTANEOUS
##.ACQUISITION SCHEME= undefined
##.AVERAGES= 8
##.DIGITISER RES= 18
##SPECTROMETER/DATA SYSTEM= spect
##.PULSE SEQUENCE= zg30
##.SOLVENT NAME= CDCl3
##.SHIFT REFERENCE= (INTERNAL, CDCl3, 0, 15.7039)
##AUDIT TRAIL= $$ (NUMBER, WHEN, WHO, WHERE, WHAT)
$$ ##TITLE= Audit trail, XWIN-NMR		Version 3.5
$$ ##JCAMPDX= 5.01
$$ ##ORIGIN= Bruker BioSpin GmbH
$$ ##OWNER= she
$$ F:/spectra/data/she/nmr/H-F/1/audita.txt
$$ ##AUDIT TRAIL=  $$ (NUMBER, WHEN, WHO, WHERE, WHAT)
(   1,<2022-06-03 14:31:02.04 +0400>,<she>,<DPX200>,
      <created by zg, POWCHK disabled, PULCHK disabled
       configuration hash MD5:
       00 E9 B6 7A A2 85 ED C7 34 08 36 98 17 FE 4E 26
       data hash MD5: 16K
       33 58 DF E7 F0 5F 75 A3 F7 3B FE 82 6E 6A 81 9A>)
$$ ##END=
$$ 
$$ hash MD5
$$ 36 3B 75 E8 06 EA 54 2E AC 9F 0C EC 6F 64 41 72
##$RELAX= 
##$RELAX= 
##$RELAX= 
##$RELAX= 
##$RELAX= 
##$RELAX= 
$$ Bruker specific parameters
$$ --------------------------
##$DU= <F:/spectra>
##$EXPNO= 1
##$NAME= <H-F>
##$PROCNO= 1
##$TYPE= <nmr>
##$USER= <she>
##$AMP= (0..31)
100 100 100 100 100 100 100 100 100 100 100 100 100 100 100 100 100 100 
100 100 100 100 100 100 100 100 100 100 100 100 100 100 
##$AQSEQ= 0
##$AQ_mod= 1
##$AUNM= <au_zg>
##$AUTOPOS= <>
##$BF1= 200.13
##$BF2= 200.13
##$BF3= 200.13
##$BF4= 200.13
##$BF5= 200.13
##$BF6= 200.13
##$BF7= 200.13
##$BF8= 200.13
##$BYTORDA= 1
##$CFDGTYP= 0
##$CFRGTYP= 5
##$CHEMSTR= <none>
##$CNST= (0..31)
1 1 145 1 1 1 1 1 1 1 1 1 1 1 1 1 1 1 1 1 1 1 1 1 1 1 1 1 1 1 1 1 
##$CPDPRG= <>
##$CPDPRG1= <>
##$CPDPRG2= <>
##$CPDPRG3= <>
##$CPDPRG4= <mlev>
##$CPDPRG5= <mlev>
##$CPDPRG6= <mlev>
##$CPDPRG7= <mlev>
##$CPDPRG8= <mlev>
##$CPDPRGB= <>
##$CPDPRGT= <>
##$D= (0..31)
0 1.2 0 0 0 0 0 0 0 0.06 0 0.03 0 0 0 0 0.0002 0 0 0 0 0 0 0 0 0 0 0 0 
0 0 0 
##$DATE= 1654252261
##$DBL= (0..7)
120 120 120 120 120 120 120 120 
##$DBP= (0..7)
150 150 150 150 150 150 150 150 
##$DBP07= 0
##$DBPNAM0= <>
##$DBPNAM1= <>
##$DBPNAM2= <>
##$DBPNAM3= <>
##$DBPNAM4= <>
##$DBPNAM5= <>
##$DBPNAM6= <>
##$DBPNAM7= <>
##$DBPOAL= (0..7)
0.5 0.5 0.5 0.5 0.5 0.5 0.5 0.5 
##$DBPOFFS= (0..7)
0 0 0 0 0 0 0 0 
##$DE= 6
##$DECBNUC= <off>
##$DECIM= 32
##$DECNUC= <off>
##$DECSTAT= 4
##$DIGMOD= 1
##$DIGTYP= 9
##$DL= (0..7)
0 120 120 120 120 120 120 120 
##$DP= (0..7)
150 150 150 150 150 150 150 150 
##$DP07= 0
##$DPNAME0= <>
##$DPNAME1= <>
##$DPNAME2= <>
##$DPNAME3= <>
##$DPNAME4= <>
##$DPNAME5= <>
##$DPNAME6= <>
##$DPNAME7= <>
##$DPOAL= (0..7)
0.5 0.5 0.5 0.5 0.5 0.5 0.5 0.5 
##$DPOFFS= (0..7)
0 0 0 0 0 0 0 0 
##$DQDMODE= 0
##$DR= 18
##$DS= 0
##$DSLIST= <SSSSSSSSSSSSSSS>
$$ [...]
##$SUBNAM2= <"">
##$SUBNAM3= <"">
##$SUBNAM4= <"">
##$SUBNAM5= <"">
##$SUBNAM6= <"">
##$SUBNAM7= <"">
##$SUBNAM8= <"">
##$SUBNAM9= <"">
##$SW= 18.05172834244
##$SWIBOX= (0..15)
0 0 2 0 0 0 0 0 0 0 0 0 0 0 0 0 
##$SW_h= 3612.71676300578
##$TD= 16384
##$TD0= 1
##$TE= 0
##$TE2= 300
##$TE3= 300
##$TEG= 300
##$TL= (0..7)
0 120 120 120 120 120 120 120 
##$TP= (0..7)
150 150 150 150 150 150 150 150 
##$TP07= 0
##$TPNAME0= <>
##$TPNAME1= <>
##$TPNAME2= <>
##$TPNAME3= <>
##$TPNAME4= <>
##$TPNAME5= <>
##$TPNAME6= <>
##$TPNAME7= <>
##$TPOAL= (0..7)
0.5 0.5 0.5 0.5 0.5 0.5 0.5 0.5 
##$TPOFFS= (0..7)
0 0 0 0 0 0 0 0 
##$TUNHIN= 0
##$TUNHOUT= 0
##$TUNXOUT= 0
##$USERA1= <user>
##$USERA2= <user>
##$USERA3= <user>
##$USERA4= <user>
##$USERA5= <user>
##$V9= 5
##$VALIST= <valist>
##$VCLIST= <CCCCCCCCCCCCCCC>
##$VD= 0
##$VDLIST= <DDDDDDDDDDDDDDD>
##$VPLIST= <PPPPPPPPPPPPPPP>
##$VTLIST= <TTTTTTTTTTTTTTT>
##$WBST= 1024
##$WBSW= 4
##$XGAIN= (0..3)
0 0 0 0 
##$XL= 0
##$YL= 0
##$YMAX_a= 129335
##$YMIN_a= -210113
##$ZGOPTNS= <>
##$ZL1= 120
##$ZL2= 120
##$ZL3= 120
##$ZL4= 120
##$ABSF1= 10
##$ABSF2= 0
##$ABSG= 5
##$ABSL= 3
##$ALPHA= 0
##$AQORDER= 0
##$ASSFAC= 0
##$ASSFACI= 0
##$ASSFACX= 0
##$ASSWID= 0
##$AUNMP= <proc_1d>
##$AZFE= 0.1
##$AZFW= 0.1
##$BCFW= 1
##$BC_mod= 2
##$BYTORDP= 1
##$COROFFS= 0
##$CY= 11.3945322036743
##$DATMOD= 1
##$DC= 2
##$DFILT= <>
##$DTYPP= 0
##$F1P= 2.36226072786647
##$F2P= -0.459571619588291
##$FCOR= 0.5
##$FTSIZE= 0
##$FT_mod= 4
##$GAMMA= 1
##$GB= 0.15
##$INTBC= 1
##$INTSCL= 1
##$ISEN= 128
##$LB= 0.24
##$LEV0= 0
##$LPBIN= 0
##$MAXI= 10000
##$MC2= 0
##$MEAN= 0
##$ME_mod= 0
##$MI= 1.114404
##$NCOEF= 0
##$NC_proc= 0
##$NLEV= 6
##$NOISF1= 3.799351
##$NOISF2= 2.8
##$NSP= 1
##$NTH_PI= 0
##$NZP= 0
##$OFFSET= 15.70392
##$PC= 1
##$PHC0= -18042.88
##$PHC1= 11.80074
##$PH_mod= 1
##$PKNL= yes
##$PPARMOD= 0
##$PSCAL= 0
##$PSIGN= 0
##$REVERSE= no
##$SF= 200.130013532006
##$SI= 16384
##$SIGF1= 3
##$SIGF2= 2
##$SINO= 400
##$SIOLD= 16384
##$SREGLST= <1H.CDCl3>
##$SSB= 0
##$STSI= 0
##$STSR= 0
##$SW_p= 3612.71676300578
##$SYMM= 0
##$S_DEV= 0
##$TDeff= 0
##$TDoff= 0
##$TI= <>
##$TILT= no
##$TM1= 0
##$TM2= 0
##$TOPLEV= 0
##$USERP1= <user>
##$USERP2= <user>
##$USERP3= <user>
##$USERP4= <user>
##$USERP5= <user>
##$WDW= 1
##$XDIM= 8192
##$YMAX_p= 0
##$YMIN_p= 0
$$ End of Bruker specific parameters
$$ ---------------------------------
##NTUPLES= NMR FID
##VAR_NAME=  TIME,          FID/REAL,        FID/IMAG
##SYMBOL=    X,             R,               I
##VAR_TYPE=  INDEPENDENT,   DEPENDENT,       DEPENDENT
##VAR_FORM=  AFFN,          ASDF,            ASDF
##VAR_DIM=   8192,          8192,            8192
##UNITS=     SECONDS,       ARBITRARY UNITS, ARBITRARY UNITS
##FACTOR=    0.0002768,     1,               1
##FIRST=     0,             0,               0
##LAST=      2.2672688,     0,               0
##MIN=       0,             -210113,         0
##MAX=       2.2672688,     129335,          0
$$ Real data points
##PAGE= N=1
##DATA TABLE= (X++(R..R)), XYDATA
$$ [...]
1898d45n73Q15l95M53mk23R29l48j67Q11m91K79K50o39Q61l49m45Q62p79m09M72
1919D65o31K98l19l42M75n94K92N8q38O71N2l16N39o32L39M31m37P01j91l23J151
1940H49k01m16L79n41N90J45n51O46n71k99N46r69M26N7p43P00m56m25M86n82
1960i30M22J91r41J082k91k67P63n87M04M48l82P18k01k82O77o41K65O04j066
1979a4O64Q9o44M35n79J66j51n51O30j71q10P28m56N5J26l52K49J11m46J202o36
2000c55J8R64o22J59L43k58N27l5j96K18n83K13L06q18P77m18k78M33q58o8L18
2021b13n88Q57l97o05R27p49J62M03m20O91q1k05M96o27N54M71q73O58M62q28
2041I5P02k57P1J47o85M32l77p24P76j50n54O23o45R3n1k22O77p38L00M61p33
$$ plain form
1898 -445 -1018 -203 -598 -145 -149 -372 557 209 42 853 362 641 891 252 1113 764 319 1181 402 -7 465
1919 465 -166 132 -187 -529 -54 -648 -356 -298 -1136 -465 -413 -729 -190 -822 -483 -52 -489 212 21 -302 849
1940 849 648 232 611 70 660 805 254 900 329 30 576 -393 33 90 -653 47 -409 -834 -348 -930
1960 -930 -508 -317 -1258 -176 -467 -734 29 -558 -154 294 -88 630 429 147 824 183 448 1052 -14
1979 -14 650 739 95 530 -49 117 -34 -585 45 -126 -936 -208 -664 -609 -483 -835 -586 -475 -921 281 -355
2000 -355 -337 627 5 164 507 249 776 741 545 763 180 393 699 -119 658 240 -38 395 -463 -531 -213
2021 -213 -801 56 -341 -946 -19 -768 -606 -203 -623 68 -13 -218 278 -349 205 676 -197 461 923 95
2041 95 797 540 611 758 73 505 128 -596 180 30 -524 99 -546 -453 -504 -726 -49 -787 -487 -26 -759
2062g59M10N16q41R74J22m84Q66m46K80k37l49Q09o8o36J034r60k57N31o53L58
2082B10m11R1L30q84j13O29j016N85K96n29K06k6K77J6l37P85K67p16J127l61
2102D26m91O30k48L13p4m57N77j94l46L21m57N7K44p95O10m17j54L05n33L57k28
2123e54o04J122k95m09R21j93m0L77m47M60k42j05J209p10J4L58q74K82M32m70
2143B32L26k82j82K19p57L46K32j060R19k68l04J74o44O40r5m53J349o48j38Q20
2163D26p16N28J35n93P95k60J18K20m23K93O1q50Q37l3o52L55l47K70j94p87M29
2184c88pn63R16l41k54L12k01M19k07q5P99l39j06Q02q52M84N6r6L62k58r9N71
2206I25q82L80J5o77L59k0l50M07q60J34J57m99M32K0j73P07n62L49J58o52P43
$$ plain form
2062 -759 -349 167 -674 300 422 -62 804 358 638 401 52 861 793 157 1191 231 -26 505 -148 210
2082 210 -201 -110 220 -664 -777 -148 -1164 -579 -283 -812 -606 -632 -355 -339 -676 109 376 -340 787 426
2102 426 -65 565 317 630 556 99 676 482 136 457 0 57 301 -494 116 -301 -455 -150 -683 -326 -554
2123 -554 -1158 -36 -331 -740 181 -12 -52 325 -122 338 96 -9 1200 490 504 862 -12 270 702 232
2143 232 558 276 94 313 -444 -98 134 -926 -7 -275 -579 -405 -1049 -409 -504 -957 392 -256 -394 426
2163 426 -290 238 373 -220 575 315 433 653 230 523 584 -266 571 538 -114 241 -106 164 -30 -817 -388
2184 -388 -395 -958 -42 -383 -637 -325 -526 -107 -314 -399 400 61 -45 757 -95 389 445 349 711 453 354 925
2206 925 43 423 438 -239 120 100 -250 157 -703 -569 -412 -911 -479 -459 -632 75 -487 -138 20 -632 111
2227A11j26K52L25n64L86J9o78R78r9l66M38n66L08j61o63O91k32m74O17m90p5
2248c69K88q22N43M5q14J053n28K02N12n24L39K23m34P12k20j65P07o69L65Lk70
2269A77P70n32j20K59m91K3K36p51L64j10l08L74p10L36K75o44O16j33r5N25m81
2290d20L23L70p71P65J34k90O81l84r4M48o02K46j5l97P92n89l66N18p04J95n0
2311b10m50O87m58L2J10m12L16M9l44N73j51j69P26m09L61J47n86R57l09k06N90
2332H44p07M34J13p40O14k35m49L38n00J09L01o37L81k57l07N85m12J73J44m30
2352f38M61J74l32N31m33k2P96o82P25q7m93P70m41q2J93l31M22R4r01P47m14
2373E7l14K38o03M22J95n26M84m47k70M68k58J42L63l92M71N0l21O70l98L60Q5
$$ plain form
2227 111 -15 237 562 -2 384 403 -275 703 604 238 676 110 418 257 -406 285 53 -421 196 -294 -369
2248 -369 -81 -903 -360 -315 -1129 -76 -604 -402 110 -414 -75 148 -286 426 206 41 748 79 444 447 177
2269 177 947 415 295 554 63 86 322 -429 -65 -175 -483 -109 -819 -483 -208 -852 -236 -369 -464 61 -420
2290 -420 -97 273 -498 267 401 111 792 408 314 762 160 406 391 -6 786 197 -169 349 -355 -160 -210
2311 -210 -660 27 -431 -399 -289 -701 -385 -336 -680 -107 -258 -427 299 -110 251 398 -188 769 460 254 844
2332 844 137 571 684 -56 558 323 -126 212 -288 -179 122 -515 -134 -391 -698 -113 -525 -352 -208 -638
2352 -638 -177 -3 -335 196 -237 -259 537 -145 580 493 0 770 329 247 440 109 531 625 -276 471 57
2373 57 -257 -19 -622 -200 -5 -531 -47 -494 -764 -296 -554 -412 -49 -441 30 80 -241 429 31 391 476
2394D76l04M24j09k66M21l74L1K15n93N77k41o65L55l59O8L53r06O07j89l09O24
2415a64j55j6K56l77L31P2o0N11m44J40M90m11K63O8k22N21n05j11L50n31J45
2436A51R2m77K55k56k06M98o52J22L12l62L33k66J01L41m37L06J48m06O80j68
2456A09m9N58k13j01K51l04K20P5k89N20o49q7J02n37O15j3o87L16k50j10J54
2477c69m76M12K30n07M43J8o4L33k21N60j69j23N52l28k80Q18o03N3L51p43O57
2498E44k24l27N27j138O03J76r16O86q5l41J20l56M50K33n96Q50l99l27R49o09
2518a80K21L56o24L90M31l15M72n74o2N02m21P8M14p51L08M4m31Q5l45L78k40
2539b64j43J95J0k88K43l74K55N77m54J41n3J74K80k62L10L06n84N39J07n82M12
$$ plain form
2394 476 172 596 487 221 642 268 299 514 -79 498 257 -408 -53 -412 -344 9 -897 -290 -479 -788 -164
2415 -164 -319 -335 -79 -456 -125 -53 -113 398 -46 94 584 173 436 504 282 803 298 187 537 6 151
2436 151 243 -234 21 -235 -441 57 -595 -473 -161 -523 -190 -456 -355 -14 -451 -145 3 -403 277 109
2456 109 60 618 405 304 555 251 471 546 257 777 128 41 143 -394 221 208 -479 -163 -413 -523 -369
2477 -369 -845 -433 -203 -710 -267 -249 -313 20 -201 359 190 67 619 291 11 829 226 279 630 -113 544
2498 544 320 -7 520 -618 -15 161 -755 -69 -154 -495 -375 -731 -281 -48 -644 206 -193 -520 429 -180
2518 -180 41 397 -227 163 594 279 751 177 115 617 196 274 688 -63 245 289 -142 -57 -402 -24 -264
2539 -264 -407 -212 -202 -490 -247 -621 -366 211 -243 -102 -155 19 299 37 347 653 69 608 715 133 545
2560E45k57N8o3l60M36j95m99M11k82m10N44m49NQ4j16M90l28j34L90l97M92K3
2582a2k43N58q2j89K08k33M38L3o10Q89m38j20M33n31j43N12m79J54l88k53N87
2603I1q94K67L62l46K8J53k32N61p37M32M04m87O34r1k16N28l92J5M92n20M99
2624E51k65K8L37m76j20k6m90M44K01m38J79j91o9L20o27O45m35kL12j49o7L96
2646E8l83K36J69k47N52l81N1L63j68k64O65n74J62K67m65N34o49J8J92n95L64
2667i5o4k16Q8k9j03J76l60L84J06m25N68j55O2L01r7J1J80k96M81k60m5K66m39
2690C9K33j09k81K58k4j46K16p07Q33o45k91O09j17n70O44j40k62L16j50M59m35
2711b70KO11o71L80L02j85K78k07K3J98k38J32j53j68L65k92k04K44k29j30L20
$$ plain form
2560 545 288 346 283 -77 359 164 -335 76 -206 -616 -72 -521 -516 -432 -548 -58 -386 -520 -130 -527 -35 -12
2582 -12 -255 303 221 32 240 7 445 478 -132 757 319 199 632 101 -42 470 -9 145 -243 -496 91
2603 91 -803 -536 -174 -520 -492 -339 -571 -10 -747 -315 89 -398 236 145 -71 457 65 80 572 52 551
2624 551 286 314 651 175 55 29 -461 -17 184 -254 -75 -266 -335 -15 -642 3 -432 -434 -122 -271 -338 58
2646 58 -325 -89 80 -167 385 4 55 418 250 -14 651 77 239 506 41 575 -74 -56 136 -459 -95
2667 -95 -159 -375 -287 -316 -419 -243 -603 -219 -113 -538 30 -125 -63 238 141 152 332 36 517 257 212 478 39
2690 39 272 163 -118 140 116 -30 186 -521 312 -333 -624 -15 -132 -702 -58 -198 -460 -144 -294 165 -270
2711 -270 -268 343 -328 52 354 169 447 240 263 461 223 355 202 34 399 107 -97 147 -82 -212 108
2732A08m50J12j89j49L99m00K66K17l22J77L06j75M22j76l0L44m68L41K06p06
2752a67O01p6k9j1j94J79qn48N59k75l56M84n33R7K8k15R2N4k90N67j58o9M07
2775A39n36M78l0n5N48n05J72K93l10J57kk65L75m61K0K88o92L17N4j87L25l07
2797a84j14J70l33J43L15l89K28j77L6O7j31M45J19k11K24j42K8K45l22J92K09
2818D18k78L44j95j81K94o43J25L2k51K14q9k00L49k27j49J73l40M68n1r9K60
2839b6p3l3M38l96K79J82k84N43l15j32N70n39J74nn14M37r8j66L22p22J74J29
2861e5m43O04m69q5L14k05J29O9k95O26n09J3M62k74L56j4j10L76k98j91M50l18
2883A33Q7J88k61K08p1m69K27k03n8J41l57J27l5j67L43k93NL22m84M79j8j6M27
$$ plain form
2732 108 -342 -230 -419 -568 -169 -569 -303 -86 -408 -231 75 -100 322 146 116 460 -8 333 539 -167
2752 -167 434 358 329 318 124 303 295 -253 306 31 -325 159 -374 -277 -249 -464 -372 -318 -608 -41 -199 -268 139
2775 139 -397 81 51 -4 544 39 211 504 194 351 349 84 459 -2 18 306 -386 -69 -15 -202 123 -184
2797 -184 -298 -128 -461 -318 -3 -392 -164 -341 -305 -238 -369 76 195 -16 208 66 94 339 17 209 418
2818 418 140 484 289 108 402 -241 -116 -84 -335 -121 -210 -410 -61 -288 -437 -264 -604 -136 -187 -286 -26
2839 -26 -99 -132 306 -90 189 371 87 630 315 183 753 214 388 383 -131 306 208 42 364 -358 -184 -55
2861 -55 -498 106 -363 -448 -134 -339 -210 -141 -436 190 -319 -306 156 -118 238 224 114 490 192 1 451 133
2883 133 220 408 147 355 284 -185 42 -161 -219 -78 -435 -308 -343 -510 -167 -460 -455 -133 -617 -138 -156 -172 255
2906B55l73J95K52k25l7K23k92K05M2o7L73m93J20L15o62L40j66k70J72k89n5
2927d37K64l51L55j5k73L84k94J95L02n84M34Q5j78N67j97R3j8j06K23k70q3K43
2949C39k01l8R8l80K96k19j34K79j73k66L85m92K63j72m2L59k13N1M68n60L67
2970A5J56l07K83R6j62M18m69N02j00j63L25l06m34O33m95j22M18o93L16J0j9
2991i8m9m86L45J97m97L92J78l39N57j61k31J17N7R8P3j05L65n26J77O12o25L37
3013C88N5k54O8J03l33L8l87L30j45m33N83k36r1M03q43M70j41k9O79m01l3M91
3035B82n19K10K29k66L60O0k01J54j15j80L10l43K84M1l77M56n76O3J01m04J85
3056b46k95K19K01k19j37M36j59l4K29k69M03k93j6M31k91J98L11l63L55l8k27
$$ plain form
2906 255 -118 77 329 104 67 290 -2 203 245 178 551 58 178 493 -169 171 5 -265 -93 -382 -437
2927 -437 -173 -524 -169 -184 -457 -73 -367 -172 130 -454 -20 65 -113 454 257 350 332 226 449 179 96 339
2949 339 138 100 198 -182 114 -105 -239 40 -133 -399 -14 -506 -243 -415 -457 -98 -311 -260 208 -352 15
2970 15 171 -136 147 243 81 499 30 532 432 269 594 288 -146 487 -8 -130 288 -405 -89 -79 -98
2991 -98 -147 -633 -288 -91 -588 -196 -18 -357 200 39 -192 -75 -18 80 153 48 413 -113 64 676 51 388
3013 388 443 189 257 360 27 65 -322 8 -137 -570 13 -223 -314 89 -754 -284 -425 -454 225 -176 -209 282
3035 282 -237 -27 202 -64 296 356 155 309 194 14 324 -19 265 306 -71 385 -191 -128 -27 -431 -246
3056 -246 -541 -322 -121 -340 -477 -41 -200 -234 -5 -274 129 -164 -180 251 -40 158 469 106 461 423 196
3077A96L42m19K58L3m80M01m19m25N86k76J31j26j62K27j34o2L21l90N4K79k20
3098b85L14R8j91L00k35j5N41n30N44l23k16M26q7k95K38l41RK31l96K71j87j12
3120b41K21l59J64j37j45K46j48K49J03k60K91J64l81M57mk82M23k28Q2L35l81
3141A69M08l12k48N31l88p8J05m32K24j56r1L12l55j14K36l35K16K55l15N05l48
3162b11K77L6j78K14K16l48N39l04M7K39k19j91J75j32K32k21q5K70o64L2M65
3183A89n10J78M7m52L62k40J96l6m6L08K1l87P98n31Q5k5r9N61l71rN65m09q7
3206A08L09l41l5J83l06M6n3O3J96n41M64l13k29K58k8j21J46p1K2rj16M73k12
3229a07J07K87j79M0J01j62J80N3K0j08j22J69n5k05J97l8k69o8J69k46N4j11
$$ plain form
3077 196 538 119 377 410 -70 331 -88 -513 73 -203 -72 -198 -360 -133 -267 -329 -8 -398 -344 -65 -285
3098 -285 29 127 -64 236 1 -14 527 -3 541 218 2 428 341 46 284 -57 -48 183 -213 58 -129 -241
3120 -241 -20 -379 -215 -352 -497 -251 -399 -150 -47 -307 -16 148 -233 224 220 -62 361 133 215 550 169
3141 169 577 265 17 548 160 82 187 -245 -21 -177 -268 44 -311 -425 -189 -524 -308 -53 -368 137 -211
3162 -211 66 102 -76 138 354 6 545 241 288 527 308 117 292 160 392 171 86 356 -308 -276 189
3183 189 -321 -143 -96 -548 -186 -426 -230 -266 -312 -4 17 -370 428 -103 -18 -43 -142 419 48 39 604 195 108
3206 108 417 76 41 224 -82 -36 -89 -26 170 -371 93 -220 -449 -191 -219 -340 -194 -265 -243 -252 -368 105 -107
3229 -107 0 287 108 148 249 87 267 320 340 232 110 279 224 19 216 178 -91 -159 10 -236 -182 -293
3251b93J43m2j19M02n09K60KP4l1J24p8L47j43JK88m78M86k01q5J52n8L0J26m83
3275h5N24k48l80K91j86j1O6m46K48m1k77L22j45J13L40l88J07L46n11M59j6j54
3297g2N28k70O7J20j75K61k83q0L63n87M20j14k09K14l79j44M29l44R4j95k1K90
3319h7R9m19N23j78J35j45K1L01j15l25N69l03N6K60m39M26n6l47N60m16j30L06
3341B96m75K02j1l74L12p6nL28o16K98J69m07J58R5L9K85j34n5Q4l8J30N0r3P6
3365B38J5J7J59l44J38J83m88L53l48j61K57k08P6P6l60L52q7J72l3j41j55J78
3387a11k58K52n8J44J8j15O17l68j14N38l95L26j95k58K83ol78K06j74j73L79
3408A60n05K44Q6l05O7j18j59O04k79Q6Q1O6k69J82R5J99j28j3K4k3M05n4l83
$$ plain form
3251 -293 -150 -192 -311 91 -418 -158 -156 -82 -113 11 -67 280 137 138 426 -52 434 233 148 300 242 272 398 -85
3275 -85 439 191 -189 102 -84 -95 -29 -475 -227 -268 -545 -223 -368 -255 85 -303 -196 150 -361 98 82 -72
3297 -72 456 186 253 373 198 459 176 96 459 -128 292 178 -31 183 -196 -340 89 -255 -161 -356 -377 -87
3319 -87 12 -407 116 -62 73 -72 -51 250 135 -190 379 76 132 392 -47 379 323 -24 536 120 -10 296
3341 296 -179 23 12 -362 -50 -126 -131 197 -419 -121 48 -359 -201 -106 -67 218 84 29 113 75 205 255 162 238
3365 238 253 270 429 85 223 406 -82 271 -77 -238 19 -189 -113 -37 -397 -45 -132 40 7 -134 -289 -111
3387 -111 -369 -117 -175 -31 -13 -128 489 121 7 545 150 476 281 23 306 300 -78 128 -46 -219 160
3408 160 -345 -101 -15 -320 -253 -371 -530 74 -205 -119 -38 28 -241 -59 36 235 107 94 118 95 500 446 63
3431F3M70n66K50J58l81L21l0m52K79j75l96O04m06K37q4l01K62j49qJ51l94L21
3453b26K59k36K69p6o3N62m68J56Q7k09K00N2k11o5P0O1K13l54k10J47j96L82
3475A44l43j53K64l65K01j1O8K90m80J66K97k52L78k6J46j9j02o2K72k52P5L1
3497B67k51M27j52k43L06j94j85J42l91L19j19q3J35l39k3K34l33L68j84O9M63
3518B33k98k2J09j90M17P6l67K80j43J72O1j67rJ07j52r9j35L29m0m34J39L8l00
3541c95K59m6r5J90m09M02J31l25P50p11L00n3O4J74n5j73n2K39K2Q1m60J89M47
3564D74n50L08k39k49J53J6J92q2k26J55m15K84K67m32Q5K96k26J44R6N7K90l68
3586C0J19L36m08J47J68k88L56l34j12M14m07J11j5j88K78j84j09Ql61M01o8k98
$$ plain form
3431 63 533 -33 217 375 -6 315 285 -167 112 -63 -459 145 -261 -24 -108 -409 -147 -296 -304 -153 -547 -226
3453 -226 33 -203 66 -10 -73 489 21 177 264 55 255 307 96 31 101 162 375 21 -189 -42 -238 144
3475 144 -199 -352 -88 -453 -252 -263 -195 95 -385 -219 78 -174 204 178 324 305 203 141 413 161 236 267
3497 267 16 443 291 48 354 160 -25 117 -274 45 -74 -157 -22 -361 -384 -150 -483 -115 -299 -230 233
3518 233 -65 -87 22 -168 249 325 -42 238 95 267 328 161 152 259 107 8 -127 202 162 -272 -133 -95 -395
3541 -395 -136 -182 -277 -87 -496 -94 37 -288 462 -249 51 -2 62 236 181 8 -44 195 217 298 -162 27 474
3564 474 -76 232 -7 -256 -103 -87 105 23 -203 -48 -463 -179 88 -344 -259 37 -189 -45 51 108 398 30
3586 30 149 485 77 224 392 104 460 126 14 428 21 132 117 -71 207 23 -86 -78 -439 -38 -106 -404
3608d04N69m71j37M70j55L1J68j01J1q1K72J0q4L0K37m12L60m6r2J02k55O6l1
3631E7m3L07l53k98P75n61j53M81m64N2K11l50K80j47jM13n91M64J93l70K75r6
3653H1J21j04k30M08l20r1O94m29L0j4k73O5J5m3N9j91j30P1n9K99O3n24K76J65
3677f1k90L73j02J99q0M4J57J4l44O11k29n7J54k86L24k17K3j9l21K89j17j03
3699c8L2k3m19L13k12k3K76jk7k2j50K30o4P6J48k51K09K38m33L82k15N8J42K38
3723D64l59K95n10N05m57L0K73n94M66j22k55Q5J15l91K44L3l6J47j07N1p6J96
3745cM32m80p3M34k87O7N2n5K7j28J72K60l11K29k22l22N02l07jK6l42J95Qj44
3769b71J57m1j26K33k18L48mk96L50l3j95Q1r9K59M04o72N71k72l39L40j63J11
$$ plain form
3608 -404 165 -306 -443 27 -128 -97 71 -30 -19 -100 172 182 98 128 365 -47 313 267 175 277 22 88 57
3631 57 14 321 -32 -330 445 -116 -269 212 -252 -200 11 -339 -59 -206 -207 206 -385 79 272 -98 177 81
3653 81 202 98 -132 276 -44 -135 559 130 160 146 -127 -62 -47 -90 -31 -222 -352 -281 -340 -41 22 -502 -226 -61
3677 -61 -351 22 -80 119 39 83 240 254 -90 521 292 235 389 103 427 210 233 214 -107 182 65 -38
3699 -38 -6 -29 -448 -135 -347 -370 -94 -95 -122 -144 -294 -64 -128 -52 96 -155 54 292 -141 241 26 84 226 464
3723 464 105 400 -110 395 -62 -32 241 -353 113 -9 -264 -179 -64 -455 -211 -178 -214 -67 -174 -123 -199 -3
3745 -3 429 -51 -124 310 23 90 142 87 114 -14 158 418 107 336 114 -208 294 -13 -14 12 -330 -135 -127 -271
3769 -271 -114 -155 -281 -48 -266 82 78 -218 132 99 -96 -15 -114 145 549 -123 448 176 -163 177 14 125
3791A25R1l37J12P8l73J57o7n1K64m2j70j12O6L04l48O2J13K3K52o9n0J40r6p6
3815dL12j20NN5l77N09j16j49L5j98J63J12l81J85k15j33M70k16j22l3p5K32j41
3838b02K6P1O0m9J86j47L37k9j55O3j7K10k11Q1K88l92q2L22k72o9m8O3j46J29
3862A7m04K94k65J09K46k71%J09J76k2m36K90K50N9Q0q2K0Q7o5k09M30l02J31
3885B42j22j37L02j52j21m7J34J9j09l03J39J73k92K30r4p6L17n25N04L0l72K86
3907B6R4k79L68j56L28j58j78J89q8L9K12k92Q2n9r0J60l31M6K29l46j08M26l14
3930b00L03l86m2L70k38K6K34j44K15l17J51J8J08N7Mk50L37q1j23m2R1J7J98
3953C06l97J27K34l40Q8k74J26J52k64J82%j36J62j56L5L24k63K37j33k10K16
$$ plain form
3791 125 216 -121 -9 69 -304 -147 -214 -265 -1 -43 -213 -325 -259 45 -303 -241 -128 -105 147 78 28 168 72 -4
3815 -4 308 188 193 248 -129 380 264 115 150 -48 115 227 -154 31 -184 -317 153 -63 -185 -218 -293 -61 -202
3838 -202 -176 -105 -45 -94 92 -55 282 253 98 161 144 354 143 224 512 120 38 360 88 19 -29 34 -112 17
3862 17 -387 -93 -358 -249 -3 -274 -274 -165 11 -11 -447 -157 93 152 232 150 170 257 192 -17 413 111 242
3885 242 120 -17 285 133 12 -35 99 118 9 -294 -155 18 -274 -44 -138 -214 103 -422 82 112 -260 26
3907 26 120 -159 209 53 381 223 45 234 146 185 397 105 187 128 38 198 -133 -87 142 -204 -312 114 -200
3930 -200 103 -283 -325 45 -193 -167 67 -77 138 -179 -28 -10 98 155 159 -91 246 165 42 0 91 108 306
3953 306 -91 36 270 -70 18 -256 -130 22 -242 -60 -60 -196 -34 -190 -155 169 -94 143 10 -200 16
3974A6j44J04K65k99K89J77m16J67n2O0J64m86K55O1k66j28K80k55J39j46L5P2
3996a08j89L19j41k57M51l51J79K15l79K74l5O1l7p1J06J55n2J01J41n50O40n44
4018g2l2Qp3L41k70r9K70j34k14K77k76K25j17Q0J37l90K37L29m66R1L39l92M69
4041B68J20j47mp3j31K05PJ23l07j51K07k16Q0j42j23N0J82k29J09nk9J97k57
4064b66M35q4j65J67k00N0K82q6J57j47l81N29k04k45M40k20P9l8j13J04r3p7
4086g6j24P3K02j34k53K19K7j0R5q9l2K42m38K43r4K38J37j20J09j63P9k28K70
4109A73j70J98q9J89p9k40K37j21j55O5m5n1R3m55K99J15k40K27m2L3n8j65K06
4132g5k78M55K9k5jPj8J45J04o02N52j38K3P6k19K75j50k96J59j90L2K96m59J08
$$ plain form
3974 16 -128 -24 241 -58 231 408 -8 159 107 167 331 -155 100 161 -105 -233 47 -208 -69 -215 -180 -108
3996 -108 -297 22 -119 -376 75 -276 -97 118 -261 13 -22 39 2 -69 37 192 140 241 382 -168 472 -72
4018 -72 -104 -96 -169 172 -98 -197 73 -61 -275 2 -274 -49 -166 -86 51 -339 -102 227 -239 -148 191 -201 268
4041 268 388 241 237 164 33 238 245 368 61 -90 117 -99 -19 -161 -284 -234 -52 -281 -172 -177 -206 -9 -266
4064 -266 169 85 -80 87 -113 -63 219 133 290 143 -238 291 87 -158 282 62 141 103 -10 94 1 -76
4086 -76 -200 -127 75 -59 -312 -93 -66 -76 19 -70 -102 140 -298 -55 -149 89 226 106 215 52 131 -97 173
4109 173 3 201 112 301 222 -18 219 98 -57 8 -37 -88 5 -450 -151 -36 -276 -49 -91 -58 -116 -281 -75
4132 -75 -353 102 131 106 105 112 94 239 343 -259 293 155 178 254 35 310 160 -136 23 -167 -135 161 -298 -190
4156a90p5P4J18J01k88L51l37N7K87k24J81J50j56l8J60k45K75j11J03j59J9J48
4178B01j40O2n6Mj90J07j25J13k36J24K02k13O1J26j67L40j74o5J11k50L16Nk75
4201a19K92k61K3K93j54N5J93l03P7K20m66L13k10K6M97p54L51R1o03M51k66K4
4223b30K80k35L12j72R0N1K0k84N8j9M54l01J67l9o8K3J23m56K12kjJ03n9J03
4247A30k15k5J25O7k77J10O9j41N3r3L0Q2m36L32J45r6M36r0k00q5K46J21l66
4270g8O4J85j39j22M74l79K79r7j01J48n58J94LK11p8o8k34L26l63R9J24l1MJ40
4294Ck04J41O3R1K56k41k8P8K1J66l89P3l0j50K30Lj53L0M6k76L62m09P8J11M29
4319C01m96R8j47O9J29q8K5p8J36R0q5J38K4J94r6j23n2K30n52M62q3J10j8k08
$$ plain form
4156 -190 -265 -191 -73 28 -260 91 -246 -189 98 -126 55 205 49 11 171 -74 201 90 193 34 53 201
4178 201 61 123 67 71 -119 -12 -137 -24 -260 -136 66 -147 -86 40 -127 213 39 -26 85 -165 151 156 -119
4201 -119 173 -88 -65 228 74 129 322 19 96 316 -150 163 -47 -21 476 -278 73 164 -439 12 -254 -230
4223 -230 50 -185 127 -45 45 96 116 -168 -110 -129 325 24 191 152 84 107 230 -226 -14 -16 -17 86 27 130
4247 130 -85 -110 15 82 -195 -85 -16 -157 -104 -197 -167 -85 -521 -189 -44 -140 296 206 6 -79 167 288 -78
4270 -78 -14 171 32 -90 384 5 284 187 86 234 -324 -130 -127 84 6 -62 -296 30 -333 -234 -110 -141 -137 3
4294 3 -201 -60 3 94 350 109 81 159 180 346 -43 30 0 -150 80 83 -70 -40 6 -270 92 -317 -239 -128 301
4319 301 -195 -97 -244 -175 -46 -134 -109 -187 -51 39 -46 92 116 310 214 91 39 269 -283 179 96 206 188 -20
4343b0k4l3M0K34j84j07J25k49K56L8l69L48j06j49J90O8j21J18K1n5J50j40k0
4366A1mJ9L54m05K27j37K37j17j35j06J94j42n9J81l89K43k74P4K38r0j38R9m6
4389a65K39l48L52J04k61J33ol1N6J10k52L81k68j91L81k93J50k07%L43n21L69
4411G5k52J08J0k8n5J13q5q5J56j59K42k46J62K04k83J97J38k75N60m8l71J90
4433B68k46J00n8k6K77m13l0K52k15O3m6J63m9j31J32q7rj70K79k82J31j85L32
4456E0J79m19J07K74k83K56j01m0K59l25k3M67k59j17K77k76P8j97J10m7o1n5
4478a46L28l39J39N0j78L12m08J57j08R0K29K9k77K29j79K9K98k74j54J86j7L34
4500C30l28j57J28n0L57j43j05o7k53K82m7p6J0k4k7r3J8K80r4L9j32N36l97N3
$$ plain form
4343 -20 -44 -77 -37 197 13 -94 31 -218 38 76 -293 55 -51 -200 -10 58 -63 55 76 21 171 31 11
4366 11 7 26 380 -25 202 65 302 185 50 -56 138 -4 -63 118 -271 -28 -302 -228 10 -80 -218 -119 -165
4389 -165 74 -274 78 182 -79 54 48 17 73 183 -69 312 44 -147 234 -59 91 -116 -116 227 -294 75
4411 75 -177 -69 -59 -87 -142 -29 -114 -199 -43 -202 40 -206 -44 160 -123 74 212 -63 497 449 78 268
4433 268 22 122 64 38 315 -98 -128 124 -91 -28 -74 89 40 -91 41 -46 -55 -225 54 -228 -97 -282 50
4456 50 229 -190 -83 191 -92 164 63 23 282 -43 -66 401 142 25 302 26 104 -93 17 -30 -91 -146
4478 -146 182 -157 -18 32 -146 166 -242 -85 -193 -103 126 155 -122 107 -72 -43 255 -19 -173 13 -4 330
4500 330 2 -155 -27 -77 280 137 32 -35 -288 -6 -53 -129 -119 -143 -170 -263 -245 35 -59 -20 -152 384 -13 40
4524D0J81k83K19k08J68k5M1R7j29K73k39j01r9J76j19K82j61l13M87m78L52k49
4546h8m52N18L5j99J52K0j94M20k38J39k74K19N5j84K12k6m5K21r8k5R6m55J64
4569b7L05l39P0J02l96L43k72M2K4K39rl02l9L46k51j56K47j18K51R0m9m0N1j51
4593c9L48n09M59k34l1J24q2J06K2k6nm09k4K37j6l4J1k2PpM5J68k65K51M5p2
4619D8Q7P1l49K09L6j73N6m2M4L28n11L31Q0k03J58j52P9n1j69J92m5m11O00j97
4643A6j31l6j09L45Q4l72J20J05k6oJ02l4j05j08K67j50J27J83j94K6N5p0j55
4666f6J66j77M3n6K1N5k30J03j79N6K07j18j08N31m57L1K87j67J25l2q2N2J0k7
4690a2J77p5J77k90K81q6j65m7J26j90Lj0l5J00n2L6M4m04M28k37l3L65m04J06
$$ plain form
4524 40 221 -62 157 -51 117 92 133 230 101 374 135 34 -65 111 -8 274 113 -200 287 -191 161 -88
4546 -88 -540 -22 13 -186 -34 -14 -208 212 -26 113 -161 58 113 -71 141 115 70 291 193 168 264 -191 -27
4569 -27 278 -61 9 111 -285 58 -214 -172 -148 91 82 -220 -259 87 -164 -320 -73 -191 60 150 101 61 112 -39
4593 -39 309 -200 259 25 -6 118 36 142 164 138 133 -276 -300 -63 -79 -113 -102 -124 -117 -124 -79 89 -176 75 120 48
4619 48 135 206 -143 66 102 -71 -15 -57 -13 315 -196 135 215 12 170 18 97 46 -123 69 24 -387 213 16
4643 16 -115 -151 -260 85 169 -203 -83 22 -4 -10 92 58 -47 -155 112 -38 89 272 78 104 159 89 -66
4666 -66 100 -77 -34 -90 -69 -14 -244 -141 -320 -264 -57 -175 -283 248 -209 -178 109 -58 67 35 -47 5 15 -12
4690 -12 165 90 267 -23 258 172 7 -40 86 -104 -101 -111 -146 -46 -98 -62 -18 -422 6 -231 -264 101 -303 -197
4714a97P4J37q8J89j23K36p7J15k69Q0l9P2k66J73N3N3J6k49K6J0J48j9j39O5
4738a9r8j16J71j00l0M1P9N9p4J2L9k8%M49l68n3P9pJ80j65j14J90R2j26j82J74
4764H5j54N2j55M10m26M3K33k79M8K14l39K76lj28J88k98R4J7J49P9j49mK10J66
4788C29j45q8k13J86N3j89L50k48k62J36R3j22J96m65K85n7J04J82k92On2k1M39
4811B05m75Q5K03j33K31P6j21q0L07k63L05m55L73o7k03J21J4j96R8mj71R5p3
4834a28L26j43k21R1j48J24m2j0K05j12LL1O5p3J49o2Q0L6j53J57j49j67L81j56
4858H4J56j84J8m7N2j74R7N6o7J04l40Q9Q3q8N5N8j14J15k03L59j24j22L10k44
4882g1R7K00j38P6j78P0Q5Km6n5j9M9q1k23K61r6q3O0Q7j29O3p8L3J4Q0j80P6
$$ plain form
4714 -197 -123 14 -74 115 -8 228 151 266 -3 77 38 110 -156 17 70 123 139 -110 -84 -74 74 55 -84 -19
4738 -19 -117 -233 -62 -162 -192 -151 -72 -13 -87 -75 -36 -64 -64 385 17 -36 43 36 216 51 -63 127 219 93 -89 85
4764 85 -69 -17 -172 238 -188 -145 88 -191 -143 71 -268 8 5 -123 65 -233 -139 -122 27 106 -43 -47 163 329
4788 329 184 96 -117 69 122 -67 283 35 -227 -91 2 -120 76 -389 -104 -161 -57 125 -167 -161 -213 -234 205
4811 205 -270 -185 18 -115 116 192 71 -9 298 35 340 -115 258 191 -12 109 123 -73 25 21 -150 -55 -128
4834 -128 198 55 -166 -75 -223 -99 -141 -151 54 -58 -55 -24 41 -32 117 55 135 171 18 175 26 -141 240 84
4858 84 240 56 74 27 79 -95 2 58 -9 95 -245 -156 -73 -161 -106 -48 -162 -47 -250 109 -15 -137 173 -71
4882 -71 26 226 88 164 -14 56 141 143 97 42 23 72 -9 -232 29 -67 -150 -90 -3 -132 -69 -147 -114 -100 -20 -200 -124
4909a24J56Q5j15J48j99P9K39qj25N0k70l33N81m2R8j39L1l1l64L40k08QQ7j5
4933g1O1q6n7J33J40k96K72J64j72j9k59K27j86K70k7k07M22k26R4Rk13P0L00
4956C43k31l06M70n75M50M4k71J53k75k2K18k36MM04k72r7m7M1K90jj62pJ72l9
4980D8j68J47K63l51K30Q5j75J77k05j52K26r8L5j26j45K53L2k46KJ53n3J47j60
5003h1K3J05j72K02k42L05o3J06R9l07J40J89j06r8k6k0J32J57k46j68K19L4j85
5026cl04K98N1j84N6j54L16j20j16K57m1k04L83k22k11J17J67M28j51j44j52J4
5048H1k29L20M5k56L17l94J53J2r1Q8j10j31K23m23L39j30l3O7j19J81K31k04
5070f3JJ13j07M07k55l04K26Q6N8r4j35J70J58j60K0j27J78j68L72n51K8J05M6
$$ plain form
4909 -124 32 117 2 150 -49 30 269 261 136 186 -84 -417 164 122 220 81 112 81 -283 57 -151 -143 -56 -71
4933 -71 -10 -96 -153 -20 120 -176 96 260 88 69 -190 37 -149 121 94 -113 309 83 177 186 -27 43 343
4956 343 112 -194 276 -299 151 195 -76 77 -198 -220 -2 -238 -234 170 -102 -199 -246 -205 85 84 -78 -85 87 48
4980 48 -120 27 290 -61 169 254 79 256 51 -101 125 27 62 -64 -209 44 76 -170 -168 -15 -68 79 -81
5003 -81 -58 47 -125 77 -165 140 77 183 282 -25 115 304 198 100 74 54 186 343 97 -71 148 182 -3
5026 -3 -307 -9 42 -142 -86 -240 76 -44 -160 97 56 -148 235 13 -198 -81 86 514 363 219 67 81
5048 81 -148 172 217 -39 278 -116 37 49 -42 46 -64 -195 28 -395 -56 -186 -219 -152 -271 -90 141 -63
5070 -63 -62 51 -56 351 96 -208 18 104 162 68 -67 103 261 101 121 -6 172 4 376 -175 -147 -42 4
5093Dj34J55k29j3J96r4J07j0k07M0M68j75KJ26N4k30J1k1j00mL46Q9j18l5j24
5118A04nJ5m8N6o4j39J82l99K02J73j93K6k3m4J84k5j07K10j00N1k8j4J57j36
5142C5j83K67j80L51m01J87K42l52k7J40j73rL25m01J58J15k01J20m80M22M0j54
5164a59R3J04rr3p2J55J23n5k8K4j1j12J73J16k50k57K65K53k16J77j54k67K50
5187E0j94n0K38k90J5L44k07L2o8J28J0k19M32l17N2K6N3L5K7j48K74j86L2K60
5211C29l02J29J22m61J57L9j59P2J04j19K08j68j80L35l20L58k09O0n5q9L31j69
5233A3k46J36J26J0J87j90R7J99l14L0m1M1J98k43N4J72k55o2n1PP2j89K81p6
5257d4p4Mj13J24K3j38KK8L6R5K90j73P4k3q1K52k14R1J27j87J24j23qM0j60j11
$$ plain form
5093 4 -130 25 -204 -217 -21 -115 -8 -18 -225 -185 283 108 110 236 290 60 71 50 -50 -54 292 381 263 228 104
5118 104 99 114 66 122 58 -81 101 -298 -96 77 -116 -90 -113 -157 27 2 -105 105 5 56 28 14 171 35
5142 35 -148 119 -61 290 -111 76 318 -34 -61 79 -94 -103 222 -179 -21 94 -107 13 -467 -45 -5 -159
5164 -159 -66 38 29 -64 -136 19 142 87 59 83 72 -40 133 249 -1 -258 7 260 44 221 67 -200 50
5187 50 -144 -194 44 -246 -231 113 -94 -62 -130 -2 8 -211 221 -96 -44 -18 35 70 97 -51 223 37 69 329
5211 329 27 156 278 -183 -26 13 -146 -74 30 -89 119 -49 -229 106 -214 144 -65 -5 -60 -149 182 13
5233 13 -233 -97 29 39 226 36 133 332 18 48 7 48 246 3 57 229 -26 -88 -139 -132 -60 -249 32 -44
5257 -44 -118 -114 -227 -103 -80 -218 -216 -188 -152 -57 233 60 134 111 30 282 68 159 286 99 223 100 92 132 -28 -139
5283a39K51j72j28p8K35o5m3P6J43j39J07j23M6j38j5L64k32j98L78j35K28J75
5305C98k51q7J38l23N32l52j44K01k7q5J58j82J74j79j39L72k81J01j00K7J94
5326A45k37J10j0O7P2K7r4J7R7j22L91j76j98K00k07K38k97j90L92k61J82j22
5348B4j95J97n8l4o2M31o41L19k77K11k1k19L15j57J90Mo3j1K42j76J5q0R8J16
5372A68j81K20J05l32j30K08N7N2k99p0J57j42M90m32j69J75L6J5O3J8n5R8l4
5395A8m6K6k7J24j92J05J04k2M8J1j87R6k1K78m7m04J23%j01L8p3%M49l40J11
5420G1k57j62L41j99K73k34R8J10Pj32K88l98L22j63kK96N5k03R8lj15K73k58
5443A06r9J22l01L30k32N4Nj06J41n7j10J27m5q0J17k04K21K9l3j61J93j06J2
$$ plain form
5283 -139 112 -60 -188 -266 -31 -96 -139 -63 80 -59 48 -75 -29 -167 -182 182 -50 -248 130 -5 223 398
5305 398 147 60 198 -125 407 55 -89 112 85 0 158 -24 150 -29 -168 204 -77 24 -76 -49 145
5326 145 -92 18 8 75 147 174 80 97 194 72 463 287 89 289 82 320 23 -167 225 -36 146 24
5348 24 -171 26 -32 -66 -128 303 -338 -19 -296 -85 -106 -325 -10 -167 23 27 -36 -47 195 19 34 -46 52 168
5372 168 -13 207 312 -20 -150 58 115 167 -132 -202 -45 -187 303 -129 -298 -123 -87 -72 -9 9 -46 52 18
5395 18 -28 -2 -29 95 -97 8 112 90 138 149 -38 58 37 315 268 -136 -13 -13 -114 -76 -149 -149 300 -40 71
5420 71 -186 -348 -7 -206 67 -167 -69 41 48 -84 204 -194 128 -35 -37 259 314 111 209 206 91 364 106
5443 106 7 129 -172 158 -74 -20 -15 -121 20 -37 -147 -20 -65 -145 -28 -232 -11 18 -15 -176 17 -89 -77
5466g7J68K1M3Q4O8j05O2k55jJ09k5j63J36n7q9j33K25k79J18L6L29k0k07j84
5490a96q7L95j81k0K03J12m67K32N2q5N1J27r8J37k82J58j67J82Q1k14L7Q8j48
5513i0K2j60o1M06l29J92j2j24K84j46k61N37k28k68K88p7L15l1j48p6J08Q4j67
5536E8k63L74k35J41rm08L82j63J26L4l9l82K44J19l05J83k27M14k33L3J62LJ0
5559A9O1j94K05r6j08K09j01O6l0l0J8J63l83L64l68L75o2l15K40J12m17K90k22
5582b04o4K31P6k1N0j75P4L7j64J36j30J51Kk5J24J7m5J01j03%J24k27K21q1j0
5607I5k0p3M5J53l81K2J46j60J14K28k29K37m8J8k07KJ9J51j12%N9j91M78k38
5631A08j2k76J86J25k39N0J86k92K90m9l38K08Nk04K61j90K63k67JQ2l7L4K09
$$ plain form
5466 -77 91 112 155 239 307 202 264 9 8 117 92 -71 65 8 -81 -214 11 -268 -150 -114 215 195 -12 -196
5490 -196 -283 112 -69 -89 114 226 -241 -9 43 -42 9 136 38 175 -107 51 -116 66 147 -67 -30 58 -90
5513 -90 -68 -228 -289 117 -212 -20 -32 -156 128 -18 -279 258 30 -238 50 -27 288 257 109 33 141 225 58
5536 58 -205 169 -66 75 66 -342 40 -123 3 37 -2 -384 -140 -21 -326 -143 -370 44 -189 -156 6 9 19
5559 19 80 -114 91 -5 -113 96 -5 61 31 1 19 182 -201 163 -205 170 108 -207 33 145 -272 18 -204
5582 -204 -268 -37 39 18 68 -107 -33 4 -160 -24 -154 -3 -1 -26 98 115 70 171 68 68 192 -35 186 105 95
5607 95 75 2 47 200 -181 -159 -13 -173 -59 169 -60 177 129 147 -60 -58 -39 112 0 0 59 -132 346 108
5631 108 96 -180 6 131 -108 -58 128 -164 126 77 -261 -53 -48 -252 9 -181 82 -185 -184 -102 -139 -105 104
5654A04l39P8J87O4K09n08M76p1k02R8O6k12R8J04k61K58j30Q9J9k18L56l29R4
5677C0K11k69P7J19j94K61j60j17R9j79Q1P8r2J53m5K5J03n2l1J00J5k01K21k22
5701A1J10J3j38j7j20K2M9j49J12j78J30J76N2k17j5K45J5j44O2L63j66j36j79
5724i9J32K03k30J97mj11K07N0m29J85p4J5J00k43NJ05k41K06k03j5J52K19l61
5747b34K37l7Q5rq4O3n9j41L30j96K36l6k78K15q8J14l10K25J0M2m6L1o8k13J77
5772c4J3q5j29j74L97k15nJ80o2J71k14K07K3j54K21K26k56J37j70j00j8J11Q6
5795A56j51n2o6J39l5pJ9m3J1r8J36q3q8l15K23L84M4m46J97K20k08J91r8qn6
5820c4M4K79k26q7L18k33Q6k4j09q9J19o3P0j90P6K90l08J49q3l16L85m7J6kj46
$$ plain form
5654 104 -235 -157 30 94 303 -205 271 200 -2 96 162 -50 48 152 -109 149 19 108 127 -91 265 -64 30
5677 30 241 -28 49 168 -26 235 75 -42 57 -122 -41 37 -55 98 53 78 181 129 98 198 213 12 233 11
5701 11 121 134 -4 -21 -141 -119 -70 -219 -107 -285 -155 21 73 -144 -159 86 101 -43 19 382 216 80 -99
5724 -99 33 236 6 203 199 88 295 345 -84 101 27 42 142 -101 -96 9 -232 -26 -229 -244 -92 127 -234
5747 -234 3 -34 51 42 -42 21 -38 -179 151 -45 191 155 -123 92 4 118 -192 33 43 85 39 70 2 -211 -34
5772 -34 -21 -106 -235 -409 -12 -227 -232 -52 -114 57 -157 50 73 -81 140 366 110 247 77 -23 -41 70 156
5795 156 5 -47 -113 26 -9 -16 3 -40 -29 -127 9 -74 -162 -477 -254 130 174 -272 -75 145 -63 128 30 22 -34
5820 -34 10 289 63 -24 294 61 147 123 14 -75 44 -19 51 -139 -63 227 -81 68 -15 -331 54 7 23 21 -125
5845a25O0O9o9l3K39k11Q3K43j36n5J05Rj25p3M3J86j83P8j55r0M6J12l6m3k01
5870b62L46j54j72L22k05O4j72m2L48q1j91K94l84M08K18j91o4M3R8j34J5j7K1
5893A08j1O4j07J22j3n7j42K61k99k7O7Q9k05j33K34O7q2J62j40j96M15O1k20
5916A8n7J92l29L39q6K89m38K18K66m90K11n6J71R5n29R4M1q1j22L08j54N1J01
5939E2k46K67l34J89J8j82L85k0j40K03j56LK35j28p1J15j46j27RJ84Jo8j48K30
5963A25j84m2N7j5j10J30O5J8j72K11j37O5k8m5J77k73M57l16J71k95M07l44O9
5986iO1q4R2j09J63l23J38J75L3j54L5k2k61J56P5j68p9K99j86J55J01j84L03
6009B07q0l05K74j6J13j50j13J07k00M26j94l0J14j51j42Q9M8q6N1K43j93q3p6
$$ plain form
5845 -125 -65 4 -65 -98 141 -70 13 256 120 65 170 179 54 -19 24 210 27 105 -50 -140 -94 18 -18 -61 -262
5870 -262 84 -70 -242 80 -125 -61 -233 -275 73 -8 -199 95 -289 119 337 146 82 125 223 89 104 87 108
5893 108 97 161 54 176 163 106 -36 225 -74 -101 -34 55 -150 -283 -49 18 -64 98 -42 -238 177 238 18
5916 18 -39 153 -176 163 77 366 -72 146 412 -78 133 77 248 343 -186 -92 -51 -132 -254 54 -100 -49 52
5939 52 -194 73 -261 -72 -54 -236 149 129 -11 192 36 39 274 146 75 190 44 -83 -74 110 111 43 -105 125
5963 125 -59 -101 -44 -59 -169 -39 26 44 -128 83 -54 11 -17 -62 115 -158 299 -17 154 -141 266 -78 -9
5986 -9 52 -32 60 -49 114 -209 -71 104 137 -17 18 -4 -265 -109 -34 -202 -281 18 -168 -13 88 -96 207
6009 207 127 -178 96 80 193 43 -70 37 -163 263 69 39 153 2 -140 -51 -3 -89 -38 205 12 -71 -147
6032a47J22m1L7J3j06J13Q0j5r1J11r7K25l26K11K17l57J89J74k80k6J84j67j76
6055a53K71j52J71O6m04L31o7p9L9j87j04K34l21L95j12O8K42l87j40K33j7Q8
6077A5J59j74M9J89j47K0l04J48J49p6J76J33k39J1k35J80j1r6j6m8l1K9K53k94
6101a60o3mJ05Q7pK16j78po3r6N43l22o4K07n2K17l34j29K67p4j96J94n9k56L70
6126A42k06j26O9J58k1r8K9j88P9q3K17j55K07j40K22j69J88j31O9J74J6J26l66
6149A3J29j16jq1L8O6j43r6M26l30j78L08j55j50J94r1K28k74J81J16k78P2K29
6172A07n5K23l93k2L75p4l9O6k48J00J36J57j72j5j90n6k12K55j10l5M0lJ36J62
6196A33l18J85j56jj8J62R2j08L95l50o5j43K02J70k19J42l45N05l03J31J17q4
$$ plain form
6032 -147 -25 -66 -29 -16 -122 -9 71 56 -35 76 -21 204 -122 89 306 -51 138 312 32 6 190 23 -153
6055 -153 118 -34 137 203 -201 130 63 -16 23 -164 -268 -34 -355 40 -72 -4 238 -149 -289 -56 -73 15
6077 15 174 0 49 238 91 111 -193 -45 104 28 204 337 98 109 -126 54 43 -53 -69 -117 -148 -119 134 -160
6101 -160 -223 -227 -122 -35 -42 174 -4 -11 -74 -170 373 51 -13 194 142 359 25 -104 163 89 -107 87 28 -228 142
6126 142 -64 -190 -121 37 16 -82 -53 -241 -162 -245 -28 -183 24 -116 106 -63 125 -6 63 237 253 379 13
6149 13 142 26 25 -56 -18 48 -95 -191 235 -95 -273 35 -120 -270 -76 -167 61 -213 -32 84 -194 -122 107
6172 107 52 275 -118 -140 235 161 122 188 -60 40 176 333 161 146 -44 -100 -312 -57 -167 -202 -162 -165 -29 133
6196 133 -185 0 -156 -157 -175 -13 79 -29 366 16 -49 -192 10 180 -39 103 -242 263 -40 91 208 124
6218A24J5j73k0o5J81j89J60R2q2k4j56P7j83kJ30J93k45L00r5N6o5r8K31J0j46
6243B6K66k21p5J12j43Q7j5J03j09p7m6R1n4L86l33j51L00l08Q4J17j11j7J05
6266A7r9K01l14J91J53j01K88k57j06R5j07K95r3n9j00j02K14j87Np9M09m25L3
6289a28l2j48M55q6k71J09jJ79k30K5K91l1j49J82l98L57m8m0N7J53k56j2lL2
6313GQ2k76K43N7j49j71J74N5J06k52k01K89l50K97p1Q7J47l67M65r0l4q4o2J93
6337I5J43r6QJ76k08J37j36q6J2r5j47K53k29L26p9j20J07k92J86K36m49J26p
6360a39L0P1j11J41K46l34J02o9j31K29J28p9j06J89j58L02j69q5j6p6k3j35K83
6383I0M3l17K58l3K2j04l3m2L56l31pO7q9K97k69J69J44k34Kl2P3j47j4L73J37
$$ plain form
6218 124 139 -34 -54 -119 62 -127 33 125 43 19 -137 -60 -243 -245 -115 78 -167 133 38 94 29 -69 162 172 26
6243 26 292 71 -4 108 -35 52 37 140 31 -46 -92 -1 -55 331 -2 -153 147 -161 -77 40 -71 -88 17
6266 17 -82 119 -195 -4 149 48 336 79 -27 68 -39 256 163 104 4 -98 116 -71 -66 -145 264 -161 -128
6289 -128 -160 -308 147 61 -210 -101 -102 77 -153 -128 163 132 -17 165 -233 124 76 36 93 246 -10 -22 -25 7
6313 7 89 -187 56 113 -36 -207 -33 22 128 -124 -325 -36 -386 -89 -160 -73 74 -293 172 82 48 -36 -98 95
6337 95 238 142 150 326 118 255 119 33 45 -50 -197 56 -173 153 74 -46 61 -231 -45 191 -258 -132 -139
6360 -139 -109 -38 -149 -8 238 -96 6 -63 -194 35 163 84 -22 167 9 311 142 57 41 -35 -58 -193 90
6383 90 133 -184 74 41 63 -41 -74 -116 240 -91 -98 -31 -120 177 -92 77 221 -13 -11 -43 30 -117 -131 242 379
6408C79l70J07K2k14J50m28M06lk76K26j53p5J54j27JQQ8J32n1j74J42j02J36
6431b2RJ60k79K88J5oM5J36j82p0k84K62k4O8m2j37R4j77K49L1o3p6j24O2K3%
6457d4j67P4P9L59l65J2rK6J74P1j25L0Q1l04K94q3l16J96l3k7J67j97O8k60K88
6482a1n0O1K9K9k77L06j76J67k31K72lm3j34J37J0nj26P5K1mN9J07Nk73K08k20
6508f7J67j06l1M6j22K47K0k90O6NN4R6k60L9P6J45L6k09k7K64j07J7l3j30J50
6533D6m6rK94j59JMk0q4J65k35k2m0J98j18j49J20J38k75J26P7l5k8r1k3j4J65
6559a4J63k85J64j8O9pn4R7n8op3NN9k17k4K68j75J26j62O4K24k33pL8j6N8j63
6586a77K44j53J0J16k39M55l00J56l0j05J02P0j25J29j59J64j12J70k45J97j52
$$ plain form
6408 379 9 116 138 -76 74 -354 52 49 -227 -1 -154 -229 -75 -202 -201 -193 -105 27 -24 -198 -56 -158 -22
6431 -22 -13 147 -132 156 171 165 210 346 164 94 -190 72 48 116 74 -63 31 -146 103 134 71 -5 -129 -67 -44 -44
6457 -44 -211 -137 -58 301 -64 -52 -61 -35 139 210 85 115 196 -108 186 103 -213 -17 -50 -77 90 -107 -39 -299 -11
6482 -11 -61 0 29 58 -219 87 -89 78 -153 119 116 73 -61 76 86 81 -45 30 51 47 106 213 218 -55 153 -67
6508 -67 100 -6 -37 9 -113 134 154 -136 -70 -65 -11 85 -175 -136 -60 85 121 -88 -115 149 42 59 26 -104 46
6533 46 0 -9 285 126 127 131 111 27 192 -43 -65 -105 93 -25 -174 -54 84 -191 -65 12 -23 -51 -142 -165 -179 -14
6559 -14 149 -136 28 10 79 72 18 115 57 51 -22 -17 42 -175 -199 69 -106 20 -142 -78 146 -87 -94 -56 -72 -14 -177
6586 -177 67 -86 -76 40 -199 256 -44 112 82 -23 79 149 24 153 -6 158 46 216 -29 168 16
6607A6J96k41j21K37K1j41J56k26R2p2J45j81J41k65K51R9k06L30k59j35L51q6
6629A02j25K60p7q8J61k12J87j03J26j92j31P5l4Q3l0K8j13J14On8k22l7K21j80
6653b39RK41J0j37K5J63J33j46q8P2p6K11k76lJ99j63Q6k2m0K83k50j8ml5j20
6678a85Q1l3J57O8q5pj99j09K44oj45M49j51m6q5r4J72k7J33p5L4lk2q9l4j02
6704a59L1K37Nk91J06Q4K0k01N4J32j1r3j83J85J75k06n7M91m31K80Rq7J24j85
6728B9k00J35l4J82o8r8J2O0K06q6r1j64J69k89K78k16o2K10l42M80R1r4k37M9
6752h0k7J88l0J44j20k92L74m1m8p2k8O8r7n0K20j61L24k66k09NK17j03K09r2
6776C3l66n5Q9K5K99k85J59K35k17P9n8N6N0j50J92k7j93K21k25k3L48l16R6k
$$ plain form
6607 16 212 -29 -150 87 108 -33 123 -103 -11 -83 62 -119 22 -243 8 107 -99 231 -28 -163 188 102
6629 102 -23 237 160 72 233 21 208 105 231 39 -92 -17 -51 32 2 30 -83 31 37 -21 -243 -280 -59 -239
6653 -239 -230 11 21 -116 -91 72 205 59 -29 43 -33 178 -98 -101 98 -65 21 -1 -41 242 -8 -26 -30 -65 -185
6678 -185 -104 -137 20 88 3 -4 -203 -312 -68 -74 -219 230 79 33 -52 -146 26 -1 132 57 91 88 66 -23 -57 -159
6704 -159 -128 109 114 -177 -71 13 33 -168 -114 18 7 -86 -269 -84 91 -115 -172 319 -112 168 177 90 214 29
6728 29 -171 -36 -70 112 44 -54 -42 18 224 138 47 -117 52 -237 41 -175 -237 -27 -369 111 202 108 -129 -80
6752 -80 -107 81 51 195 75 -217 157 116 68 -4 -32 36 -61 -111 109 -52 272 6 -203 -198 19 -84 125 33
6776 33 -333 -388 -299 -274 25 -260 -101 134 -83 -4 -62 -6 44 -106 86 59 -134 87 -138 -161 187 -129 -33 -35
6800c5oO0J81k27o7PK35k20j57J83m0J38P0k16n1N0n5J0J80j18K36j50l2M0q5
6825f9K15mk40L94l49q7J43Q5J34k16L7K5k3l6j12k22L46p5N7j10J23j87J72j34
6849a33N4J74l5o8K25n06M16M6j76P3m0n9O4j19K9L96l65j13p1J04l0Q0R6l3q8
6874g9q9Ln7K17P7j55J32j7L1J3L4O3j0j75r6L99k10r7K25k05n6J44j63j4J75
6899I0k81J52J66k23j33M0KK76k00j27Q7J05O7n4M4M4o0J57K9k34J4K7Q4J05k0
6924A57k63J23k89K26K58K1l15l5K27k35P9J03o4k93K04nj24K92l87M35j23j27
6946a35J49P3O0L6k87K04j11J6J59m0k7j00mn6K93m15P3L60q2j74M4J40l34k8
6970a86R5q0J26K0m4K12k51l9R7J97q1k9m2r0O5K54j66r4j61J48J70j60J28j24
$$ plain form
6800 -35 -41 19 200 -27 -94 -87 148 -72 -229 -46 -86 52 122 -94 -145 -95 -150 -140 40 -78 158 8 -24 16 -69
6825 -69 146 142 -98 296 -53 -140 3 88 222 6 43 68 45 9 -103 -325 21 -54 3 -107 16 -171 1 -133
6849 -133 -79 95 60 -8 217 -289 127 173 -3 70 30 -29 35 -84 -55 341 -24 -137 -208 -104 -134 -54 42 9 -79
6874 -79 -168 -165 -222 -5 72 -83 49 32 63 76 110 173 163 -12 -108 291 81 -16 209 4 -52 92 -71 -85 90
6899 90 -191 -39 127 -96 -229 -189 -187 89 -111 -238 -151 -46 21 -33 11 55 -5 152 181 -53 -39 -12 72 177 157
6924 157 -106 17 -272 -46 212 233 -82 -117 110 -125 -46 57 -7 -300 -96 -101 -225 67 -320 115 -8 -135
6946 -135 14 87 147 183 -104 100 -11 5 164 124 97 -3 -7 -63 230 -185 -112 248 166 -8 36 176 -158 -186
6970 -186 -91 -171 -45 -25 -69 143 -108 -147 -50 147 66 37 -5 -95 -30 224 58 -36 -197 -49 121 -39 89 -35
6994c5K0P9l89L65j59K7K18k10j70J86Q5J04o0j06q5N0Q0m8P1R0p9j16M09k04
7018A23rm9q0m8J08M1m0j80l9M55k54J34j39j68l3J45j18J67n3q8p9K69P4m11
7042b72K26P2p5P6k8j40K99k18K1J57q0J03K50l80j3QJ1K99l25j60K61j08J13
7065I7j00J16j42j26K06j01Q9n5%J6o4M2o8J32J62j94j2n1O4J68j7J7k19J21j57
7090g6K26rk36l0K03q6j5j14o0J03J69j25J96k49J18O4j07M5j52J08L9K47k26
7113C3rP9N4k55J15o4J47j33N5j29L70k82qO5J18J9l49j12K91n3J47j3j11j56
7137a81J73L8k0r2J18K64k90jR0k85K43Q8mKj08J63j07j47m7L01l15m5k7J01P
7162h1jNp9o4mK3n8K17j1L1j04O1L46k90r2J36p9J59j30K8J89r3Q8j08k65J80
$$ plain form
6994 -35 -15 64 -325 40 -119 -92 126 -84 -254 -68 17 121 61 -45 -130 -80 0 -48 23 113 34 -82 327 123
7018 123 114 65 -15 -63 45 86 46 -134 -173 282 28 162 23 -145 -178 -33 -151 16 -37 -125 -204 65 139 -272
7042 -272 -46 26 -49 27 -1 -141 158 -60 -39 118 38 141 391 11 -2 6 17 316 -9 -169 92 -16 97
7065 97 -3 113 -29 -155 51 -50 39 -16 -16 0 -64 -22 -90 42 204 10 -2 -53 11 179 162 179 -40 81 -76
7090 -76 150 141 -95 -125 78 -8 -23 -137 -197 -94 75 -50 146 -103 15 79 -28 17 -135 -27 12 259 33
7113 33 24 103 157 -98 17 -47 100 -33 22 -107 263 -19 -27 38 156 175 -174 -286 5 -48 99 86 -25 -181
7137 -181 -8 30 10 -82 36 300 10 9 99 -186 57 145 141 143 35 198 91 -56 -103 198 -117 -162 -189 -88 -81
7162 -81 -82 -77 -156 -220 -224 -201 -259 -42 -53 -22 -126 -65 281 -9 -101 35 -44 115 -15 13 202 109 197 89 -176 4
7188DR7n2k1J2j65K46k31m6J49k46K34j51P0J60j20jJ21k38J55N9J27j21K2N0
7212A14j25O8k3M7j6K42k56l9Q8l8n8m06L83J07k47P5M2N5j34n7J98Pm1j20K4
7237a10R8O6m3J6J59l15n8K68J28J53m20J40N4M6Q9j40l23J79J9pl9N9j19j25
7261b25K99Q0j38N9n9j22J48J08k27K5J13o8J51N8j53L1k06J94N9l25N6J13K67
7284B38j16o4q4j36J9L74j52l41J43k04J27J80j94K34j37J54j49O7n4M58k70q9
7306DK9K3K23j29k51N33m18J23j09j96K15j18J36j25j3M5k02LJ63J73j75j07J66
7329gJ0Ok28L0K06PJ04N3j22J2K7j30k1J72k88N5n4K73m0j95K27j51P5rj56P1
7355g3K2ook46L66k1Ll9J67j98J1k3o6R2N5j03J26j75L08j05L5k16K55J06j97
$$ plain form
7188 4 101 49 28 40 -125 121 -110 -156 -7 -253 -19 -170 -100 60 -60 -61 60 -178 -23 36 163 42 64 114
7212 114 -11 57 34 81 65 307 51 12 100 62 4 -402 -19 88 -159 -84 -42 13 -121 -178 20 27 -14 -134 -110
7237 -110 -12 54 11 27 186 -129 -187 81 209 362 -58 82 136 182 271 131 -192 -13 6 -1 -40 19 -100 -225
7261 -225 74 154 16 75 16 -106 42 150 -77 -52 61 -7 144 202 49 80 -126 68 127 -198 -142 -29 238
7284 238 122 58 -26 -162 -143 231 79 -262 -119 -323 -196 -16 -210 24 -113 41 -108 -41 -95 363 93 4
7306 4 33 56 279 150 -101 432 14 137 28 -168 47 -71 65 -60 -73 -28 -230 -227 -64 109 -66 -173 -7
7329 -7 3 9 -219 -189 17 24 128 181 59 71 98 -32 -53 119 -169 -114 -168 105 65 -130 97 -54 21 12 -144 -73
7355 -73 -51 -57 -63 -309 57 36 39 0 167 -31 -20 -43 -109 -17 38 -65 61 -114 194 89 124 -92 163 269 72
7380G2M5r2n3J63j17M8m3p3J55q6r3J47k46j22L62j12m5J15m7Q5K03j25J36k33
7404D4NR8l47L11j12J39M0j64j26J67k96L08J77p4j34j45L2Ln6O4j3N0mO2m6J01
7430H4q4k9J29j19q2J84n2N8p4J1J80k38L31l74j33L14r4oj6k70J42K3PK55j94
7455d7j89M2J13n6P8j81L98j92O6m1J68j43q7j7K57j56K99j57N7r4J47k08j47
7478i0O3j04L29k21L11l40K82l61J18M5j75O2J39qj09r8L11k50J9k00K07J85j56
7501d1J63r5J28k64J19Q2k49J22O1K15k98K48j34j87J03K2J01m1n8J6J25m11K82
7524IJ6k22L52j92J57j29j73K64r3N9j26Q6j6m9J59p9N5M6r2J63k09N0n4n1J1
7549e8m5J08j54P4k06K17K73l23O3L6j37rK55L3k38k2R5Q9J21o3K0j59J6J02k48
$$ plain form
7380 72 117 25 -28 135 18 66 23 -50 105 19 -74 73 -173 -295 67 -45 -90 25 -22 63 266 141 277 44
7404 44 49 147 -200 111 -1 138 178 14 -112 55 -241 67 244 170 36 -109 -77 -74 -130 -66 -79 -29 -33 29 -17 84
7430 84 0 -29 100 -19 -101 83 31 89 15 26 206 -32 299 -75 -208 106 12 6 -10 -280 -138 -115 -108 147 -47
7455 -47 -236 -194 -81 -137 -59 -240 158 -34 32 -9 159 16 -71 -88 169 13 312 155 212 118 265 57 -90
7478 -90 -27 -131 198 -23 288 -52 230 -131 -13 32 -143 -81 58 50 -59 -157 154 -96 -77 -277 -70 115 -41
7501 -41 122 27 155 -109 10 92 -157 -35 26 241 -57 191 57 -130 -27 -5 96 55 -3 13 138 -273 9
7524 9 25 -197 155 -37 120 -9 -182 82 -11 48 -78 8 -8 -57 102 23 78 124 32 195 -14 36 -18 -69 -58
7549 -58 -103 5 -149 -75 -281 -64 209 -114 -51 -15 -152 -161 94 127 -111 -133 -38 51 172 109 129 -30 -14 88 -160
7574a60O5R1J93k82j25K47m1l00K47o8J25K06m58L86l66K78o5N0j75J95j55K43
7596A31J06l02L6J71nj78J05Q4J4j34kJ08k60J45J28k20j6L30k07j19J05k56J44
7619i2J10j7m9j98nJ99j94J51K08j72J96l06K1K71l4m7J92j88j82J08J45mk82
7642a69K13mo5p8J10L5j78K10k13l7K98l26K42J47n50O38k54j62J45O2n7K28k20
7665A5J4rj97L77l63M38m23O6M29l73j84K35j70J68K3p6K46j56l75L12p9j30L18
7688A06o4J05j99M9R4Jj39J65m7O3K84l25o7N0l7K05l49K1m2K44j8k66J03P9K8
7713D4j2J8j69K12q8L9N7l38L31%k20J98j9m3OM4J8j47N2J3J46q6Q2k1j72j6K8
7740d3K4j02l8j7j08K8Q9j4K33j35L7N5k89M58l22J83L9j02J3O6M1j54J35L7o1
$$ plain form
7574 -160 -95 -4 189 -93 -218 29 -12 -312 -65 -133 -8 198 -260 126 -240 38 -27 23 -152 43 -112 131
7596 131 237 -65 -29 142 137 -41 64 148 162 28 26 134 -126 19 147 -73 -89 241 34 -85 20 -236 -92
7619 -92 18 1 -48 -246 -251 -52 -246 -95 113 -59 137 -169 -148 123 89 42 234 46 -136 -28 117 113 -169
7642 -169 44 40 -25 -103 7 42 -136 74 -139 -176 122 -204 38 185 -365 273 19 -143 2 64 7 235 15
7665 15 29 20 -177 200 -163 275 -148 -82 347 -26 -210 25 -145 23 46 -30 216 60 -315 -3 -82 -212 106
7688 106 42 147 -52 -3 91 92 -47 118 71 134 418 93 26 76 39 244 -105 -84 -126 118 100 -166 -63 16 44
7713 44 32 50 -119 93 5 44 101 -237 94 94 -126 72 53 10 16 60 78 -69 -17 -4 142 56 138 117 -55 -71 -43
7740 -43 -19 -121 -159 -176 -284 -256 -167 -181 52 -83 -46 9 -280 178 -144 39 78 -24 -11 55 96 -58 77 114 53
7765E3o6J45o3m4j98K04M2o8J1J18j50K00p4j70K04k45K57r4j36k90L26J4O5k0
7789B1j54J27j29Lj54K17L9J00L7j41M1m7j64J30M0l9o2J65K7Ol53N7J93N2j80
7814a68J91m6j17J62J07k29J41N2j28Q3o0o5L85l32m8N3Ll9o8K35R0k38J19q0
7838Ck17R9O4K8J75j25j11J1L5n2K85k36j09J78lo6l7P4m5L57k74p4J35P2J58
7863C25k49J8r9l2n0k26M95q5j09Pjk37L34j82K1J27j25P5m7q1M09k00k72K60
7887G6K0Op5Q2R3k85k0J52j85K04K31l97J67j7J54n6k9j18n3r1p1lJ53N1k5N7
7913B1j79K26j12j94L79j20J85p7j38J24k49r9L81k55J31J16j59m9mJ08NR1l11
7936a79J61p6J79k57P6J56J03l67j38L91m9J5Ok03J58M2n6j09Q7J33m0J05k71
$$ plain form
7765 53 -13 132 69 25 -173 31 73 5 16 134 -16 184 110 -60 144 -101 156 62 -74 -364 -38 -24 41 21
7789 21 -133 -6 -135 -132 -286 -69 -30 70 107 -34 7 -40 -204 -74 -34 -73 -135 30 57 63 -290 -233 -40 12 -168
7814 -168 23 -23 -140 22 129 -100 41 93 -35 48 -12 -77 308 -24 -72 -19 -16 -55 -123 112 202 -36 83 3
7838 3 -214 -115 -51 -23 152 27 -84 -73 -38 -90 195 -41 -150 28 25 -41 -78 -4 -49 308 34 -40 95 167 325
7863 325 76 94 -5 -37 -87 -313 182 97 -12 -5 -6 -243 91 -91 -70 57 -68 7 -40 -121 288 88 -184 76
7887 76 96 102 27 109 202 -83 -103 49 -136 68 299 -98 69 52 206 150 121 3 -50 -141 -212 -215 -62 -11 -36 21
7913 21 -158 68 -44 -238 141 21 206 129 -9 115 -134 -233 148 -107 24 140 -19 -68 -72 36 41 132 -179
7936 -179 -18 -94 85 -172 -96 60 163 -204 -342 49 0 15 21 -182 -24 18 -38 -147 -60 73 33 138 -133
7959a33J94rj25l2M04k51KK1k26L41j30k11J91P5k77J48J92j18k6j20J33p4J6
7982a5j05K08L7j45j08L68l58K8l3J57j88K96j39N4Q7k69J10o0oJ50j2j60L4j28
8006a97K69P6k25K16j07q6K97j74J15k34L65m90K2L56j18Lj17L0J38o4k2L2q9
8029dJ87j15J9L3K6j86m3P0n7k87L9OK85q1L8J23J75jm47M51m65J17J94j37K32
8054A72Jj74j52M0R4j03K38j75k4MJ96J50j98j74m3K19O5r1j0j11o5J44j61L14
8078A56k08K50l81K08q6J28j72K01n0r9oJ77j44q8K32j51J00m7p7j04J84R7rk55
8102a44Q9P2j50J43j69J29N4r4J35Jj79J20l6p5J52j06O6K28k40J30L0j11p3R0
8126F2Q9j78Q5l20K23J14l84J35J39J4k46K51J1j01r2K79j71J12n1k9R6N2p1N4
$$ plain form
7959 -133 61 52 -73 -105 299 48 50 71 -155 186 56 -155 36 111 -166 -18 174 56 30 -90 43 -31 -15
7982 -15 -120 88 125 -20 -128 240 -118 -90 -123 34 -154 142 3 57 144 -125 -15 -75 -81 69 57 -103 -69 -197
8006 -197 72 148 -77 139 32 -54 243 69 184 -50 315 -175 -153 203 85 88 -29 1 139 75 53 85 -4
8029 -4 183 68 87 120 146 -40 -83 -13 -70 -357 -318 -312 -27 -108 -70 53 228 227 -220 231 -234 -117 77 -60 172
8054 172 173 -1 -153 -113 -19 -122 116 -59 -83 -79 117 267 69 -105 -148 71 136 45 35 -76 -141 3 -158 156
8078 156 -52 198 -183 25 -61 67 -105 96 46 -53 -59 118 -26 -114 118 -33 67 20 -57 -161 23 120 111 -144
8102 -144 -55 17 -133 10 -159 -30 24 -70 65 66 -113 7 -29 -104 48 -58 8 236 -4 126 156 45 -28 62
8126 62 151 -27 58 -262 -39 75 -309 -174 -35 -21 -267 -16 -5 -106 -198 81 -90 22 -29 -58 38 90 19 73
8150G3j01P0j76K00P3m3J27n6l24J13j31K08o2J55l1j88J58J16p4k28J21j49L09
8173A60L4j77O7k05Q7K68l07Q7Q8k8J2l2k23M97l66K39j11J96
$$ plain form
8150 73 -28 42 -134 66 139 96 223 167 -157 -44 -175 33 -29 126 95 -93 65 181 107 -121 0 -149 160
8173 160 194 17 84 -121 -34 234 -73 14 102 74 86 54 -169 328 -38 201 90 286
8191B86
$$ Imaginary data points
##PAGE= N=2
##DATA TABLE= (X++(I..I)), XYDATA
0@%%%%%%%%%%%%%oJ4j6J6j6J6k4L2l7M5n4O2p2Q6r6J07j23J44j66J86k10K38k68
36a42L02l38L77m22M70n20N77o40P09p83Q64r53J048j154J274j404J548j708J885
55I90k087K318k584K891l253L689m225M899n779O982q727J1503j6603K8927j13344
70i4403j15710K71298O7085j63167p9091J08162N1189m4706j1266L71m4946N4902
82b82P1716m6265q2182J3914Q7732J5593q6247q799N4728Q063j6300r662n941
95c932o242J1786M3787l2213o4620N2542N4411n3967l6969M1461K8576m4078j2708
108b2166M8679k2962l5061N0616M597n6948O481N6878r371p4942J8715Q8494l6920
121A6090q2327L6662O6712k4579o2612K8887O0442m3061l5140N1586J2404m1116
$$ plain form
0 0 0 0 0 0 0 0 0 0 0 0 0 0 0 -6 8 -8 8 -8 8 -16 16 -21 24 -30 32 -40 46 -50 57 -66 78 -88 98 -112 126 -142
36 -142 160 -178 199 -223 247 -273 304 -336 373 -410 454 -499 549 -605 669 -735 813 -895 990
55 990 -1097 1221 -1363 1528 -1725 1964 -2261 2638 -3141 3841 -4886 6617 -9986 18941 -94403
70 -94403 -210113 61185 128270 -34897 -113988 -5826 45363 657 -10609 -10238 -55184 -282
82 -282 71434 25169 -57013 -43099 44633 60226 -26021 -34820 19908 27971 11671 2009 -3932
95 -3932 -10174 1612 45399 13186 -51434 1108 55519 1552 -35417 6044 34620 -9458 -22166
108 -22166 26513 3551 -31510 19106 23703 -33245 -26764 30114 20743 -54199 -35484 53010 16090
121 16090 -66237 -29575 37137 12558 -50054 -21167 39275 -3786 -38926 12660 25064 -16052
133a6052k584M2986R507m4095L083L4983j5968o059J6524j4725j1243J7971J8959
146C3287k6477l6370L2581K8898l6231j8202J8586P199j4935r045K0311p326l0629
159c8353K5838K7588k6509k2690J6725K6980q433j5436J5873n236o296L5450J586
172B7087m1474l827M7577K2307n1925k7009M9487J8727l1380j5743P201J1311
184A2339m495l080K83k1365J965K6971r952k4468j834J8279J0558j9517n009J1423
198g902m764P915R067j5186n032J5340J8449j1432k6411K0312K7121j8645j5809
211f977R585J6931l555j9528P169R411r970L961j388j0829N477O690k899j4944
225a0866k184K3174o662k1892J1623J0547n865p430J410J2287o920o991J4338
$$ plain form
133 -16052 -18636 24350 33857 -10238 -7155 27828 11860 5801 22325 7600 -3643 14328 33287
146 33287 6810 -29560 3021 31919 -4312 -22514 -3928 3271 -11664 -20709 -398 -7724 -38353
159 -38353 -12515 15073 -11436 -34126 -17401 9579 1146 -14290 1583 -3653 -9949 25501 27087
172 27087 -14387 -18214 29363 51670 -255 -27264 22223 40950 9570 -6173 1028 12339
184 12339 7844 4764 5047 -16318 -14353 12618 2666 -21802 -23636 -5357 5201 -14316 -19325 -7902
198 -7902 -12666 -4751 4316 -10870 -15902 -562 17887 6455 -19956 356 27477 8832 -6977
211 -6977 2608 19539 15984 -3544 3625 13036 3066 7027 5639 -5190 287 6977 4078 -10866
225 -10866 -13050 10124 3462 -18430 -6807 3740 -2125 -9555 -8145 4142 -2778 -9769 4569
238D569k316p513M746J769K955m721k573J0260o900l026R291o353l384L882K490
253C176J207j1647M472J2573j3392k314J0904l396l196j052P221K627j3860O011
267f66J0858q994j558J741R67L561p144K201K062p612P462N95j0378K479K997
282a429K289n065q506J2570J441j1858O057L034j624L3j039P163k491n381J1173
297F367j394m874N817j506K246J35l531N869m832k046P976o895l968K923j32J741
313C896r347j872J0287p529m614M415k489J798j289q22L657m901L935N936p659
328f598L525M786r69K687l132L227M795n700L901K028m581L606j491j49N75o510
344@N248Q43q875K434L47k243K07m675K844N39m671M755k408l050O365j877K08
$$ plain form
238 4569 2253 -5260 -514 1255 4210 -511 -3084 7176 276 -2750 6541 188 -3196 686 3176
253 3176 4383 -7264 -2792 9781 -3611 -5925 4979 1583 -1613 -2665 4556 7183 -6677 -666
267 -666 10192 1198 -360 1381 2348 5909 -1235 966 3028 -4584 2878 3473 -6905 -4426 -1429
282 -1429 860 -4205 -12711 -141 1300 -10558 -4501 -1467 -3091 -3058 -4097 3066 575 -4806 6367
297 6367 4973 99 5916 4410 6656 6791 3260 9129 4297 2251 10227 3332 -636 2287 2155 3896
313 3896 -5451 -7323 2964 -4565 -9179 -4764 -7253 -5455 -6744 -7566 -3909 -8810 -4875 1061 -6598
328 -6598 -3073 1713 744 3431 299 3526 8321 2621 6522 8550 3969 7575 6084 5935 6510 0
344 0 5248 6091 -2784 -350 -3 -2246 -2039 -6714 -3870 -3331 -8002 -3247 -5655 -8705 -2340 -4217 -4009
361d009Q30j182O072j661k697N942j354Q84J835k798L999j593k317N586m181j604
377A752K896l655J445r98k289K303m926J569L673o155M41J606j324L594l508q49
393d425L782j701L513q09l875M184L52J124J518o338K915M960l029K26l781n8
409a442N720k144j862l316j276Q696k761p545L050J258K282n6m693K806J10R43
425b30M113n222j10L854j034L235k733l483N623j117r22J77k863L394j814k824
441a956M348m222j992K972k069K023j526l817M146j044K74J899m245L309K489
456E89j443L845l881j140O337k37Q29k689k748P753j9n397k67n04M141q28n728
473a387L659k407m054M454j171j833k225k019O857j253n372J559j091M934K975
$$ plain form
361 -4009 -3179 -4361 1711 50 -2647 3295 1941 2825 4660 1862 5861 4268 1951 7537 3356 1752
377 1752 4648 993 2438 1440 -849 1454 -3472 -1903 1770 -4385 -3944 -2338 -3662 -68 -3576 -4425
393 -4425 -643 -2344 1169 360 -3515 669 1021 2145 3663 -2675 240 5200 2171 2397 -1384 -1442
409 -1442 4278 2134 272 -3044 -4320 4376 1615 -5930 -2880 -1622 660 604 -4089 -1283 -1173 -230
425 -230 3883 -1339 -1449 2405 1371 4606 1873 -1610 4013 2896 1974 2151 -712 2682 868 -1956
441 -1956 2392 -1830 -3822 -850 -2919 -896 -2422 -6239 -2093 -3137 -2863 -964 -5209 -1900 589
456 589 -854 2991 -890 -2030 4307 4070 4899 2210 -538 7215 7196 1799 1532 1028 5169 4341 -1387
473 -1387 2272 -135 -4189 265 -906 -2739 -4964 -6983 -126 -1379 -6751 -5192 -6283 -1349 1626
488A626o408J551J965J100N163l353l016K004K281P559m994r119O062M831K72
503G524l431q721L924P510j124n199q773L825R540n126m941k225L10R521r72q736
519g094k230M219R865k218j0267M354O186O49n48o355K484P306j217j700k893
534E41N46N161m748q99K303l687L011K73m867M56l25K388n73o033M650L368l778
551b213o62k960L794O571n530l936L001N427L513r257l302R163J458q01k981m506
567c221N654K732k576l010m802N210M783m538k185l368J773P968m767n968J771
582d544L747M919m814m308M751o01K144K861n507J49L891K140L01p196O05O333
598D871j443j331k508q20M865l514k734K230k352Q70J48j87K710n095k285O094
$$ plain form
488 1626 -4782 -3231 -1266 -166 4997 1644 -1372 632 2913 10472 5478 -3641 2421 7252 7524
503 7524 4093 -4628 -704 6806 5682 483 -8290 -4465 5075 -51 -4992 -7217 -6907 2614 1642 -7094
519 -7094 -9324 -5105 4760 2542 -7725 -3371 2815 3464 2916 -3439 -955 6351 5134 3434 541
534 541 1087 6248 1500 601 2904 -783 2228 2501 -2366 -1910 -2235 153 -420 -6453 -1803 1565 -2213
551 -2213 -2875 -5835 -2041 4530 -1000 -4936 -1935 3492 7005 -2252 -5554 3609 5067 4266 1285 -3221
567 -3221 2433 5165 2589 -421 -5223 -13 4770 232 -1953 -5321 -3548 4420 -347 -6315 -4544
582 -4544 -797 4122 -692 -5000 -249 -850 1294 4155 -1352 -1203 2688 4828 5129 -2067 -1462 4871
598 4871 3428 2097 -411 -1231 3634 120 -2614 -384 -2736 -1866 -1718 -1905 805 -4290 -6575 -481
614d81o2r23j540j42O369j576l619K040N8L131R49l217K307m77j020K424k369
631A852o92K98q76L866m028m408M448l57k663j84o30K619k238j306L668l374J38
648c867L848k326K28J536J028J499k960J150L827k169N65q88P9N077l063m227
664f63K622O08R38k823l050L685k47j558n18l854K864K501m065P93L63n11J504
681a411j526J827l1k148N251k3l535K297M90J417M22k409K717r58q73K397l134
698G70q02K245j596N97j929r41K814k687j246K365k021Q94m64p15K903k426m17
715b656K879j188J231P6j379L166j086k54J951k545J861J074l031J711m92J2P34
732B064l558J845J091l762J634K89j392P58j899J795O60l120L218k66j420K549
$$ plain form
614 -481 -543 -1466 -3006 -3148 3221 1645 -1974 66 124 3255 4204 987 3294 2817 1797 4221 1852
631 1852 1160 1458 582 4448 420 -3988 460 103 -2560 -2744 -3374 -755 -2993 -4299 -631 -4005 -3867
648 -3867 -19 -2345 -2117 -581 447 1946 -1014 136 3963 1794 2359 1471 1550 6627 3564 -663
664 -663 1959 2567 3505 682 -2368 1317 1070 -488 -1006 -4860 -1996 505 -3560 -2767 -2404 -2915 -1411
681 -1411 -2937 -1110 -1141 -3289 1962 1939 -1596 701 1191 2608 3030 621 3338 2380 1507 3904 770
698 770 -32 2213 617 1214 -715 -1656 1158 -1529 -2775 -410 -2431 -1537 -2001 -2716 187 -2239 -2656
715 -2656 223 -965 266 342 -1037 2129 1043 789 2740 195 2056 3130 99 1810 1318 1330 2064
732 2064 -1494 351 1442 -2320 -686 -397 -1789 -1031 -2930 -1135 -475 -3595 -377 -643 -2063 486
748D86j681N24K072j681K190q89q78L757k150r85J558j272J855j414k467L271
764B296j830j121R92k522J403k51j797K430k265m70K777k218N15J225j366K776
780E74r57k89K101k305K409J596k957K004k00l77K109l294J049J901k902P70o17
797F15j433J940k438k47J183k559J892o25j917K370j233K30J689j941K088p6j072
814a534L079j090m82K179j426J540K07k064K952r51j082J079j711J016M7k526
830g67J966j663p62J752k468J50R02k078J644m42r43J960j717R80J753j765J848
847C50qo57K567j619L62J506j564J742n82j632K007j158k64J057k582J185K2k066
865a334J480j757k50J458k024J154j10j544K413q08n34J973j467J412R71j928
$$ plain form
748 486 -1195 -671 1401 -280 1910 1021 143 3900 1750 765 2323 1051 2906 1492 -975 2296
764 2296 466 -655 337 -2185 -782 -1033 -2830 -400 -2665 -3135 -358 -2576 -2061 -836 -2202 574
780 574 -383 -672 1429 -876 1533 3129 172 2176 1976 1599 3708 414 1463 3364 462 1232 615
797 615 -818 1122 -1316 -1563 -380 -2939 -1047 -1672 -3589 -1219 -2452 -2222 -533 -2474 -386 -462 -1534
814 -1534 1545 455 -27 2152 726 2266 2473 409 3361 2410 1328 2407 696 1712 1759 -767
830 -767 1199 -464 -1226 526 -1942 -1792 -890 -2968 -1324 -1766 -2709 -749 -2466 -1486 267 -1498 350
847 350 342 -315 2252 633 995 2501 937 2679 2097 465 2472 1314 1050 2107 -475 710 732 -1334
865 -1334 146 -1611 -1861 -403 -2427 -1273 -1383 -2927 -514 -1322 -1856 117 -1350 62 1033 -895
881h95K192j23n09J571j756J350O54j956J244o38m35J279k621M72J175k282Q53
898d25p18j242K020j155P7J37j406K608l55k024J946q0N79J354j837J253M20o76
916D76K844k324o97K030r54J082j365j600J982p23p04M18k213J248M07j715J310
933d98j851l15K357j273L27l84p16K739l52q03J374j117J874J027k262J681l01
950A507j01J517j899K57L13j470K358j311k792J483L04pj052k360L315n95k849
967c382K321n98m51R50o72J976p16j405L230j048m55J650r81J643j45j890K635
984B662n31j640N50m74K249j473l201K879l99k030J332j743N49J021j471J078
1000f42j990K81K166j594Q99M76k101L399J261l146N1J090L139p53m003L405R45
$$ plain form
881 -895 1297 1174 665 2236 480 1830 2484 528 1772 1134 699 1978 -643 -171 1004 -1278 -425
898 -425 -1143 -2385 -365 -1520 -1443 -1306 -2712 -104 -459 -2483 -537 -617 -38 1316 -521 732 1152 476
916 476 3320 996 299 2329 1375 2457 1092 -508 1474 751 47 465 -1748 -500 -93 -1808 -498
933 -498 -2349 -2664 -307 -1580 -1253 -1637 -2353 386 34 -769 605 -512 1362 2389 127 1808 1507
950 1507 1406 2923 1024 1281 1594 124 2482 1171 -1621 -138 166 159 -893 -3253 62 -533 -3382
967 -3382 -1061 -1659 -2110 -1160 -1832 144 -572 -1977 1253 205 -250 1400 419 2062 1917 27 2662
984 2662 2131 491 1041 567 2816 1343 -1858 1021 622 -1408 -76 -1819 -1270 -249 -1720 -642
1000 -642 -2632 -2351 -185 -1779 -880 -404 -2505 894 2155 -991 -940 150 3289 2536 -1467 1938 2883
1017B883k419J345q41q88J177j098J667j546k997K577J7o06o24j945L259N88l678
1034c129J578O43j63L36p56K003J1j579K870o68j627K155q76Q60J71j497J921
1051B253j005j106J240j617M19J007k392Q51O12j136j16j787J683J368k811J331
1067a206J210j401P12m30J011R54j872K264Q76k027Q52M1N03N77j908J267Q54
1084B277j942O82j054mM13j612J449m2k206J300L53j466M16o94J450J04j188K208
1102D44j285r48K799p48m02J146k60J475j174l37J556k304J058J545k172K58K54
1119I05m51J77j998M68J064j734Q52m8j237J465j245J19J237j604J687M47r47
1136h43J189q15O93R12j510J645J098j896J035l35j42L89j110J142l63j809J955
$$ plain form
1017 2883 464 1809 968 80 1257 159 1826 280 -2717 -140 -123 -729 -1353 -3298 -39 549 -3129
1034 -3129 -1551 -908 -1071 -735 -1491 512 523 -1056 1814 1146 -481 1674 798 1658 1829 332 2253
1051 2253 1248 142 1382 -235 184 1191 -1201 -350 262 -874 -990 -2777 -1094 274 -2537 -1206
1067 -1206 4 -1397 -685 -1115 -104 850 -1022 1242 2118 91 943 984 1487 2064 156 1423 2277
1084 2277 335 1017 -37 -41 372 -1240 209 167 -2039 -739 -386 -1852 -1436 -2130 -680 -576 -1764 444
1102 444 -841 -1789 1010 262 -140 1006 746 2221 1047 710 2266 -38 1020 2565 393 651 905
1119 905 454 631 -1367 -899 165 -1569 -717 -765 -2002 -537 -1782 -1663 -426 -2030 -343 104 -843
1136 -843 346 -469 224 1136 -374 1271 2369 473 1508 1173 1031 1420 310 1452 1089 -720 1235
1153A235p87j812J013n08J43k64j123K080j567p07K323j778K58J321l46J003o42
1170a58j01J714j431M62J211j112J048J50j070J362j635K28J098j701L81j53r28
1187f35J293k124L93J387k492Q12Q67j022O35l57L63J005j718J595N63j642K058
1204I81n8q54J011k81Q41j97j513K241j044j275J772j231k38M8p94J029r93j109
1222a664J648j202j90P81j000R91l14p28J946j084j25J364o97J191l32m53J841
1239A973j405P5J467j475K57O05p53N58j407M58N88j968O20Q77j844P64j57m44
1257a211O69j469J325M28j470J448j57n09J352q53Q85M47j013J449j87q47J387
1274A674p95K07J91j257J451p81j205J722j465n34R10j039L97n32p13J784j469
$$ plain form
1153 1235 448 -1364 -351 -859 -716 -980 -2103 -23 -1590 -2297 26 -1752 -1494 -173 -519 484 -158
1170 -158 -259 1455 24 486 1697 585 1633 1783 713 2075 440 668 1766 65 446 293 -635
1187 -635 658 -1466 -1073 314 -2178 -1366 -499 -1521 -886 -1243 -880 125 -1593 2 565 -1077 981
1204 981 923 69 1080 799 1640 1443 -70 2171 1127 -148 1624 393 155 203 -591 438 -555 -1664
1222 -1664 -16 -1218 -1408 -627 -1627 -636 -950 -1678 268 -816 -941 423 -274 917 585 132 1973
1239 1973 568 643 2110 635 892 1497 744 1302 -105 353 941 -1027 -407 470 -1374 -610 -767 -1211
1257 -1211 -542 -2011 -686 -258 -1728 -280 -437 -946 406 -447 438 885 -128 1321 1134 287 1674
1274 1674 879 1086 1277 20 1471 690 -515 1207 -258 -792 118 -921 -524 -1056 -1769 15 -1454
1291a454k57J426j064O60J81m48J601j073L86J558j511O35Q23r66J224r56J25
1308H90J074j631M80N34j440O60n27m42P39j646O86L42j573J279k10q08Q97o94
1326a390P04N03r53J403k40o86J474m66P4P20p05J185o69p17J708j306l42O75
1344I72q18M56l01r91J236j195m48R48j318M44K73p82J102o40k77J470j378R55
1362b92M64q91J502l32l03J133j198R28M34j353J380m77o83R49j208K85L89j515
1380g88J148l64j068R24r34M52K16j262R35K89r61J106m03O5Q56q93J031K28o72
1399i5J537q95J55R95j374O64J47r17J091o74n74Q47j322L47J04j240R66p51o
1418i95Q54j687J028K42q92J032O5q69J510o77O97M71j085J310j28l73Q76q94
$$ plain form
1291 -1454 -1711 -285 -1349 -689 -508 -956 645 -428 -42 1516 5 640 1463 497 1721 765 890
1308 890 1964 333 813 1347 -93 567 40 -402 337 -1309 -623 -281 -1854 -575 -785 -1593 -696 -1390
1326 -1390 -686 -183 -1136 267 27 -659 815 349 423 1143 438 1623 954 237 1945 639 297 972
1344 972 154 610 309 -682 554 -641 -1089 -141 -1459 -1015 -742 -1524 -422 -1062 -1339 131 -1247 -292
1362 -292 172 -719 783 451 148 1281 83 1011 1445 92 1472 995 312 1261 53 338 727 -788
1380 -788 360 -4 -1072 -148 -1082 -630 -414 -1676 -741 -452 -1413 -307 -710 -645 211 -682 349 577 -95
1399 -95 1442 547 702 1697 323 987 1134 217 1308 634 60 907 -415 -68 36 -1204 -238 -989 -995
1418 -995 -141 -1828 -800 -558 -1450 -418 -353 -1222 288 -389 308 779 -306 1004 876 503 1379 485
1436D85L15R76j446L56J2n67N28j117L17M88j266Q54k69j192R44m50J54O63j053
1455a268O81M21p12R23o69J74J601j128N43O22p02N33k08j6N99j333Q49L89j649
1474c50Q67j36p14K76o97M71m4j143R82m37n72R63n89L66N67o68P73j98n9J070
1494G28o76N29N09r13J003J73j071O75j87l5J65q08N64j84j179J120j139l97Q58
1513b65q78N54M2m95M94n09K33N82j272J299O74r45N47K43m0M82m94J058K47j549
1533HJ269k53q75N79m73L42r3j191R14m21p76Q49j048M37P47j158M29Q2n20Q83
1553b69p30N92M75p79J444k05q53J324n37N8L22l83J020l48r51J060r77l68J102
1572I97j189K21J75q22M45o71J3N62j396Q05R51j518P76L80p07N75j98J076J50
$$ plain form
1436 485 800 1776 330 686 698 131 659 -458 -141 347 -919 -65 -334 -1526 -582 -1032 -878 -215 -1268
1455 -1268 -587 -166 -878 45 -624 -450 1151 23 566 1188 486 1019 811 795 1394 61 910 1299 -350
1474 -350 517 381 -333 -57 -754 -283 -327 -1470 -488 -925 -1497 -534 -1123 -757 -190 -858 -85 -283 -342 728
1494 728 52 581 1090 177 1180 1353 282 957 770 735 900 92 656 472 -707 413 -726 -1123 -265
1513 -265 -1143 -589 -547 -1042 -548 -1057 -824 -242 -1514 -215 459 -486 61 304 264 746 252 1310 1557 8
1533 8 1277 1024 149 728 255 597 504 -687 227 -194 -970 -121 -1169 -732 15 -1143 -714 -632 -1152 -269
1553 -269 -999 -407 68 -711 733 528 -325 999 462 520 842 459 1479 1131 180 1240 263 -105 997
1572 997 -192 29 204 -618 -173 -844 -831 -269 -1665 -860 91 -1427 -651 -271 -978 -403 -601 475 625
1591F25r21J437n32m82J091o36N6N53q85M44j16m73M36r25K90N21j530P26K58
1610f3j218P55j31k01M17r27J296j92j046J312mq65J373l97K74N83o69P98p83
1629C12q9J273j069R7N78r30M09n93l56O03r96M73L06j149P04j56q96J089o10
1648a000J29R17q54K34L29k35R54q82O66R05j220O88M95n89K74m08K45N5q51P28
1668E80Q2j330R62n98l88L84l84L38j74n16O65m17m81J166n39qQ80l81M01N4j85
1689A11O72p09P03L61q21P19l10l18N79o73j29O10r72O23n16n21O48q16m0N31
1709b68q41M82j04n33J145r40O08Q36r63O45L57n65Q01n84L76N58q07P45j7q04
1729A27R67n43k56K33n33J43k40m57P21q03j64Q28r35L01J4l76Q02n30kP84l31
$$ plain form
1591 625 -296 1141 609 127 1218 582 638 1191 306 750 634 161 597 -328 -38 483 -1047 -321 -63
1610 -63 -1281 -526 -657 -858 -441 -1368 -72 -264 -1310 2 -2 -867 506 109 383 966 297 1095 312
1629 312 223 1496 427 524 1102 172 581 -12 -368 235 -761 -288 18 -1131 -427 -583 -1479 -390 -1000
1648 -1000 -871 46 -808 -574 -245 -480 474 -408 258 1163 -57 631 1126 537 811 403 648 703 -148 580
1668 580 662 -668 294 -304 -692 -308 -692 -354 -528 -1044 -379 -796 -1277 -111 -650 -658 222 -159 242 296 111
1689 111 783 74 777 1138 317 1036 726 408 987 314 185 795 -177 446 -70 -591 57 -759 -799 -268
1709 -268 -1109 -627 -731 -1264 -119 -1059 -451 385 -578 67 424 -141 660 76 452 1010 203 948 931 127
1729 127 1094 551 295 528 -5 138 -102 -559 162 -641 -805 23 -912 -611 -597 -973 -171 -701 -703 81 -250
1750b50J83O19q68J136k10o22J249o77R6L81o25O07n27k79P03r53O2L69j070J86
1770d90K88o55L30o45K82L23m70M98K19n41P54q3j2O95p95Q75J93q91J219k89
1790H05l41N50p44L32M40r42N90l35n70N42p23L03j15p81N99n45j75P30n02O5
1810h17K87k89P53j15l84J160o81J72P13p78O08J05k63O94q85L43L44j003N24
1829D88J36q35N25l74l60N21r79M61J43p38O32m52J44O02p01K66O08o03Q47l6
1849B95m53O70m75M81J84m67P99l07m64N82m33j10P6m39M80n14n74R23q28J8O9
1870d87k62L93j99o51J069n62K05P77q31M01K73m00J110o57J14R93r45M28J74
1889I43n11M85l97l11M25r24M99l4r17Q17m29l17N21j077M99M98r37P91j54l32
$$ plain form
1750 -250 -67 552 -316 820 610 -12 1237 560 656 1037 412 1019 492 213 916 -37 25 394 -676 -490
1770 -490 -202 -857 -527 -1172 -890 -567 -1037 -539 -320 -861 -107 -190 -202 493 -302 573 766 -125 1094 805
1790 805 464 1014 270 602 1042 100 690 355 -215 327 -396 -93 -208 -989 -390 -935 -1110 -380 -882 -817
1810 -817 -530 -819 -66 -181 -565 595 -86 86 799 21 629 734 471 1165 280 623 967 -36 488
1829 488 624 -211 314 -60 -420 101 -878 -417 -274 -1012 -380 -832 -688 -86 -787 -521 87 -516 331 295
1849 295 -158 512 37 518 702 235 1034 727 263 845 412 302 378 -61 419 -95 -669 254 -574 -556 -487
1870 -487 -749 -356 -555 -1206 -137 -699 -494 283 -548 -147 126 -274 836 179 293 1286 341 769 943
1889 943 432 917 520 209 634 -290 209 175 -742 75 -354 -671 -150 -1227 -728 -230 -1167 -376 -530 -862
1909h62R06m24N32Kn85R39k76j1P05n42K26J67p56P23j18m78L59n71J2N12r90
1930e30M05j43n00P35p98P4P38j027M84L49n35O89k06n9O18n38N41K76j11K81
1950G43l94J34O03j070L48O22j154O72k3l71K89j167O02N35j229O99k63l44N25
1969b43p58M02M43o99N94J92k83N97l77K79N07p08N41J20k96O13n45j07Q37j062
1989D7L41K72o87L26m61m8K91o93K63J88p79M13j98k03Q04o74P44N9n40O65j63
2010c3j00Q07o32K37N12m85K86l71K74L21n77L55K36j052O47k08n31L33l07k42
2030e30M58o46L48l03j64R43r49J06J090p76K56J54l70Q17j71K25L34q92P36L12
2050I78j172R58q4n06M06l56m9L5q69Q22n64l34N93o14K80L06n84L73k71J04K82
$$ plain form
1909 -862 44 -380 152 154 -431 508 232 221 926 384 610 777 21 744 626 148 507 -64 -52 460 -530
1930 -530 -125 -268 -768 -33 -831 -757 -19 -1046 -562 -213 -748 -59 -265 -324 294 -244 297 573 462 743
1950 743 349 483 1086 16 364 986 -168 504 481 110 399 -768 -166 369 -860 -161 -424 -768 -243
1969 -243 -1001 -599 -156 -855 -261 -69 -352 245 -132 147 654 -54 487 607 311 924 379 272 1109 47
1989 47 388 660 -27 299 -162 -210 81 -612 -349 -161 -940 -527 -725 -928 -124 -798 -54 5 -535 130 -33
2010 -33 -133 674 42 279 791 306 592 221 495 816 239 594 830 -222 425 217 -314 19 -288 -530
2030 -530 -72 -718 -370 -673 -837 106 -843 -737 353 -423 -167 -13 -383 434 263 488 822 -70 666 978
2050 978 -194 764 680 174 580 224 175 210 -659 163 -401 -735 -142 -756 -476 -170 -754 -381 -652 -548 -266
2071b66l80N94M50n22P58k11o95Q15R9J1K51o63Q92o57o85J070q58j59P82q69
2091b43q5J98n43O18q64M33M07p65O08j27m09M49J36j74N05m38O11K22p30Q96
2111G05k38k76O30l32L2M15r12O72p00l1L68n62J90K31r77O21L4n68L35m81K57
2132e87K67m56O98q6m81Q59k22k6N52k13J19k2j09O78p90N4P11o86L57p8m61J77
2154B55o76j52N44p32N97k6p17Q02o59j22P63l55P3N28n64P31l12k32Q25n24L88
2175D35L54n33M60k02k66P33o88J10K91j041Q47l79n56M79l08j45K64n95N25j67
2195c82n87R75o56o8P34o95O95k2l02P49k24J6P18p86M43P3m44N21k11m64P21
2216H04j085M46J34p01P08q29n0P74r14M08K25q15P51l37oL95m74M20N07p98K60
$$ plain form
2071 -266 -646 -52 398 -124 634 423 -272 543 642 653 904 241 1133 476 -209 861 3 -156 626 -243
2091 -243 -328 -130 -673 -55 -919 -486 -79 -844 -236 -363 -772 -323 -187 -361 144 -294 317 539 -191 705
2111 705 467 191 821 489 521 936 24 696 -4 -35 333 -229 -39 192 -785 -164 -130 -698 -363 -844 -587
2132 -587 -320 -776 -78 -164 -645 214 -8 -34 518 305 424 402 293 971 181 235 946 260 617 539 78 255
2154 255 -421 -573 -29 -761 -164 -190 -907 -105 -764 -886 -123 -478 -405 123 -441 290 -22 -254 571 47 435
2175 435 789 256 716 514 248 981 293 403 694 -347 500 121 -435 44 -264 -409 -145 -740 -215 -382
2195 -382 -969 6 -650 -718 16 -679 16 -6 -308 441 217 233 951 165 608 681 237 758 547 83 804
2216 804 -281 165 299 -402 306 -523 -573 201 -713 -305 -80 -895 -144 -481 -487 -92 -566 -146 361 -437 -177
2237a77M55k52N87n35L07K17l47O36l57j56L34o09j77K52l98M27l54l31L61m19
2257e36r6L97o00M07P5m02P58m68R1L32k95M79J99k69N04l27J10M98n91K60K8
2278E54l21L91m92k18O38p18J04L5o90M98L5l99L06k58J94K69o31L36K3j49Q25
2299C32n14l0R16o57O15l6n57N64k45j69L58p00O33l22l37N15k39l27K10m90M46
2320c4k56n09Q47m00m46Q00p35K93J53k96P22l27K9P47q51L06M15k54M81k48j29
2341C08M26l33J7K17p96L25O0n27O09q33J34N21r90O59j80k86M59m73L06K59m41
2362e59L65J72j99M85m56J45O95m50J99L77o46N01j75l38N75m59k2p6o08O42j40
2383B8n27M92n57j76M46m36K37J39k59N10l50J57M71m73M77r7N7O67n57J32J64
$$ plain form
2237 -177 278 26 613 78 385 602 255 891 534 378 712 103 -74 178 -220 207 -147 -478 -117 -536
2257 -536 -632 -235 -835 -428 -353 -755 3 -465 -374 -42 -337 142 341 72 576 249 359 857 266 526 554
2278 554 233 624 132 -86 552 -166 -62 -27 -717 -219 -184 -583 -277 -535 -341 -72 -703 -367 -344 -493 332
2299 332 -182 -212 704 47 662 626 69 633 388 219 577 -123 510 188 -149 366 127 -200 10 -480 -34
2320 -34 -290 -799 48 -352 -798 2 -733 -440 -287 -583 139 -188 -159 588 -263 43 458 204 685 437 308
2341 308 734 401 418 635 -161 164 224 -303 306 -527 -393 128 -862 -203 -383 -669 -210 -683 -377 -118 -559
2362 -559 -194 -22 -221 264 -192 -47 648 198 397 774 128 629 454 116 691 232 210 134 -474 168 28
2383 28 -499 -7 -564 -740 -294 -730 -493 -354 -613 -103 -453 -296 175 -298 179 82 139 806 249 381 545
2404E45k63J37Q2l89N28n52J47Q1o23L70J7o73O47m74q8M86r19O31J07m68N20
2425a51N5j86K10k03L44K39m23N35r3N1K90l61J05K13m54K52r4l79P75o50K0q9
2447Fm77L73l04j83N01n77K57N56q48M89k12j47P29k84K1L32m40P20k20k45O31
2468F78n05Q4M19l85J10J04n81O19n08N0M03q93J57K66o94L66k53K08L84o70M36
2489b05k57j96Q64l71P7L18j32mN28o58M98r8l64R01o53L34P0n81K28j23m59M01
2511A18k66M9n3k90K68N2q16P80l67Q7L61m12M17j87J06M43m48K23M76m84L15
2532C72K84m56L08j00k44N19o63L35L06j198Q51n62q6L92m96P3J39k45J31k48
2552e88P7M68o69L30N94n27L23K07j85L90o33N22M10n23K38k0n13O14l50N4j7
$$ plain form
2404 545 282 419 501 112 640 88 235 316 -307 63 80 -593 54 -420 -508 -22 -941 -310 -203 -671 -151
2425 -151 -96 -282 -72 -275 69 308 -115 420 327 378 668 307 412 625 171 423 329 -50 725 75 95 6
2447 6 -471 -98 -402 -585 -84 -661 -404 152 -696 -207 -419 -566 163 -121 -100 232 -208 512 292 47 678
2468 678 173 257 676 291 401 505 -76 543 35 85 488 -405 -248 18 -676 -310 -563 -355 29 -641 -205
2489 -205 -462 -658 206 -165 -88 230 98 94 622 -36 462 364 0 901 248 582 652 71 299 176 -283 118
2511 118 -148 -99 -152 -442 -174 -122 -938 -158 -525 -438 -77 -489 -72 -259 -153 290 -158 65 541 57 372
2532 372 656 200 508 408 164 683 20 355 661 -537 314 -248 -334 58 -438 -365 -226 -471 -340 -588
2552 -588 -511 -43 -712 -382 212 -315 8 215 30 420 -213 309 719 196 434 414 -99 515 165 219 202
2573B02k18L7k26k70O22l69j80N90n15P0O0l12J39j04J51K33m51O90K65q09P42
2594C47Q1k83J09q7K12Pn2J37l01l18O86m79j90K94n72K22k01L1L88o53J75M45
2616bn39O3N69q52O08l25L77L53l10L27J94n91P12m14K96L32o21K84k10l29N16
2637D38n33J02L01m94K27j99m28M11m39P0L02k63K34J56k86M17j93o5L76J40O6
2658C40Q7k17N95m07l44P84p43J89J02l44J06Q6l96L81n89K24L33n96K78j07m84
2679g22L87k12J87J94j76J43J99k20O06n88j86R85n39K13K24k35L80j98k47K63
2699D58l59J09J17m64L12j00m26L44k35j77L06k14L72k89o7K38m26Q6L49l56O10
2720A88j74q3M01k51L37J18m77N29l31k61N44k81p6K75m36L6r3k80M90l26l81
$$ plain form
2573 202 -16 21 -205 -475 147 -222 -402 188 -327 -257 -197 -509 -370 -474 -323 -90 -541 149 414 -395 347
2594 347 428 145 254 167 379 386 334 471 170 -148 538 59 -131 163 -409 -187 -388 -357 31 -622 -447 -2
2616 -2 -541 -478 91 -761 -153 -478 -101 252 -58 269 463 -128 584 170 466 798 177 461 251 -78 438
2637 438 -95 7 308 -186 41 -158 -586 -175 -614 -544 -242 -505 -271 -115 -401 16 -177 -242 134 274 340
2658 340 427 210 805 398 54 838 95 284 386 42 148 234 -162 219 -370 -146 187 -409 -131 -238 -722
2679 -722 -335 -547 -360 -166 -342 -199 0 -220 386 -202 -388 597 58 271 495 260 640 442 195 458
2699 458 99 208 325 -139 173 73 -353 -9 -244 -421 -115 -329 43 -246 -313 -75 -501 -415 -66 -422 188
2720 188 14 -69 332 81 418 536 59 588 257 -4 540 259 183 458 22 58 -35 -315 175 -151 -532
2741e32M61n04J57J05k78M59l88K20N90p71O44K1l38O36l17k04N25m56L32j4l83
2762c5N78l11J2M23p38K59kn45M30K7n74K70k97O5J19l78N61j65j39O15l50k54
2784d29O80m32M25J3l45N73k89K72J92l43l4m2j42K37k11j01J47n62K59r2l06
2805e30M41k90j35L30l19J77J07k87L11M2R4J96p5Q8J30m15N64j08j4K39l74K34
2827D06K2p46M84J07m29M32m24j84M13n93K18J52m75N57l26k53M52k95L11J18
2847e3l94P60m07O9M14n52N94nl53M28j34pP9n38K42J49n21N34n30n0M47n16J1
2870c33K46m83K50j6K1O2m4p8L97k91R9J76k02O71m67Q2L09j08j02K14j73M56
2892F86n33m2L09l36J49j56m62M52j53j1k9j54k57K29l55P45n34R7M69m55L33
$$ plain form
2741 -532 -71 -575 -418 -313 -591 -132 -520 -300 290 -481 163 184 -154 482 165 -39 486 30 362 348 -35
2762 -35 543 232 244 667 -71 188 186 -359 71 98 -476 -206 -503 -438 -319 -697 -136 -301 -440 175 -175 -429
2784 -429 251 -181 244 257 -88 485 196 468 660 317 283 241 99 336 125 24 171 -391 -132 -224 -530
2805 -530 -89 -379 -514 -184 -503 -326 -219 -506 -195 -153 -59 137 62 150 280 -135 429 321 307 546 172 406
2827 406 428 -318 166 273 -156 276 -148 -332 81 -512 -294 -142 -617 -60 -386 -639 -187 -482 -171 -53
2847 -53 -447 313 -94 -25 389 -163 431 426 73 501 367 360 439 -99 143 292 -229 305 -225 -275 172 -344 -333
2870 -333 -87 -570 -320 -336 -315 -253 -297 -375 22 -269 -170 6 -196 475 8 90 399 291 189 403 230 686
2892 686 153 111 420 84 233 77 -385 67 -86 -97 -126 -280 -537 -308 -663 82 -452 -355 114 -341 -8
2913hK47r8J42j55K6J33j72J52K40n63L33Jj71J52l75O4K23m85K76j29j25K21
2935g1l74J35M18n10O9J76k99L71j10oL70l54K66O3K8J30j50J79j18M2J18pn40
2958a74O49m52k47L80m07K93j65k60J36r2K6J78l28L33J95m05L91o7k58P54o15
2979a35K81M4Q6m4L9l15M23p2j10K90l34L91k11k97J55m54J33K35m23J6N04p81
3001e79N77k50O2J72n90P45l93o1N87r5j95M18l48L53j20j41L72j08j90L67m52
3022A31j17K49j43l0j48j27K08k19j89L14m92M67k50J19L81m77N3m6j58O15l16
3043a75j37P21m18K69l2j56R9L95m49K94l09Q1L08o37N17l72l69N19k69k14L24
3064a0k31r1J51k50L40l08Q8M15m71M00J33n52N06K5L5K94n62N10J53n46M85l89
$$ plain form
2913 -8 239 141 283 128 154 287 115 267 507 -56 277 278 107 259 -116 -52 171 -314 -38 -167 -292 -71
2935 -71 -445 -310 108 -402 -333 -157 -456 -85 -195 -201 169 -185 81 144 172 302 152 331 213 255 373 366 -174
2958 -174 475 23 -224 156 -251 42 -123 -383 -247 -339 -313 -135 -463 -130 65 -340 51 -16 -274 480 -135
2979 -135 146 190 276 232 271 -44 379 307 197 487 153 544 333 36 191 -263 -130 105 -318 -302 202 -579
3001 -579 -2 -252 -190 -18 -608 137 -256 -317 270 175 -20 398 50 403 283 142 514 406 216 583 131
3022 131 14 263 120 90 -58 -185 23 -196 -385 -71 -563 -96 -346 -227 154 -323 -270 -316 -474 141 -175
3043 -175 -312 409 -9 260 228 72 171 566 117 411 102 183 491 -146 371 -1 -370 149 -120 -334 -10
3064 -10 -241 -332 -181 -431 -91 -399 -311 104 -367 33 166 -386 120 145 180 474 -88 422 575 29 514 125
3086A25J56L16m38K16l85l51L91l16r5N04q56M62J16l31J54R4l3L93j93q7L62
3107B04l58K75k0k90O13j45j34J17r7J97j96l14N95l62mK73k76R0j09k90J32j11
3129b10k24K26k40J76M1k81J39L01k62R9R4J91J23k27M23l0k71L99k11L7J81m09
3151F5J97l9l80M87k63p7L66o21K23J16k61j90QK11M4j10Q2J54l87N24j11j18
3173h0K70P6O4n5k93M53k35L6L13p40N68O6l95Mj11J48j1k35j03J35l74M19q5
3196a65j11P2n1k8L62j26L8J67l21L32j51n0M11k84M00k68j50L24j39j7J93n63
3218a25K85r4k12J74j85m4K52l83K48K5n12L96j21J6J95m80M65O9n2L29k28j97
3240a79M94j79Q5j00R3K46k65q1O8j32L10q6l02J34m34j42M99k70M7J76p21O58
$$ plain form
3086 125 281 597 159 375 -10 -361 30 -286 -381 123 -733 -271 -155 -486 -332 -238 -271 122 -71 -158 204
3107 204 -154 121 101 -189 424 279 145 262 165 362 166 -148 447 85 81 354 78 168 59 -231 -99 -210
3129 -210 -434 -208 -448 -272 -231 -512 -373 -72 -334 -235 -141 50 173 -54 369 339 68 467 256 293 474 65
3151 65 262 223 -157 330 67 -10 356 -265 -42 74 -187 -377 -369 -158 -114 -224 -142 12 -375 149 38 -80
3173 -80 190 266 330 275 -18 435 200 236 549 -191 377 443 48 52 -59 89 78 -157 -260 -125 -499 -80 -165
3196 -165 -276 -204 -255 -283 79 -47 -9 158 -163 169 18 -32 379 95 495 227 77 401 262 245 438 -125
3218 -125 160 66 -146 28 -157 -201 51 -332 -84 -59 -571 -175 -296 -280 -85 -565 -100 -31 -83 246 18 -179
3240 -179 315 136 221 121 214 460 195 114 182 50 360 274 -28 106 -328 -470 29 -241 -194 -18 -739 -81
3262h1o9k92L22r8J65K75m47M00J43n32O93j73p6L09m38K66r0j90L32k12j13L39
3284D33q56N68J68o11O22o54R6J34n06N03m7j46O0J6n9L84k18Q6M82o16L88K93
3306E20o82N36kl39L49k66J70m3j91P5j98J7P9j79j2j88N8L43l71M2K28n62M28
3329a88K30m05N17k68L7L51k33J62K40m30J55N4k39N52l29RKl41L86l33n2K94
3351A71m16K12N2m08L70j94o2K25k87J87K84n46K24K76m66M39q9J52K24l49K42
3372B41J9k91M56m14J77K43l61j05J93l37L62m38O6J39j91J23O0m94N15l24J88
3393a73J97k92l2N31m59L49j84R5L59n09L04J20l72N16l26p1J17ok24J71r7J60
3415A74j64k13K31j80j68L91l90R3P0k58M61k56P2J96m57M27k17N5M15k85K7J99
$$ plain form
3262 -81 -150 -442 -120 -218 -53 222 -225 175 318 -214 479 306 230 539 101 367 277 87 419 207 94 433
3284 433 -423 145 313 -298 324 -330 -234 -100 -606 -103 -150 -296 -236 -220 -279 105 -113 -27 455 -161 227 520
3306 520 -162 374 372 33 382 116 286 243 52 127 -71 -54 25 -154 -166 -354 -296 47 -324 -282 -54 -616 -188
3329 -188 42 -363 154 -114 -77 274 41 203 443 13 168 222 -17 535 206 215 217 -124 262 -71 -123 171
3351 171 -245 -33 19 -389 -19 -213 -275 -50 -337 -150 134 -412 -188 88 -378 61 -28 124 348 -1 241
3372 241 260 -31 425 11 188 431 70 -35 158 -179 183 -255 -189 -50 -241 -118 -58 -552 -37 -361 -173
3393 -173 24 -268 -300 231 -228 121 -63 32 391 -118 186 306 -66 450 124 53 170 164 -60 111 14 174
3415 174 10 -203 28 -152 -320 71 -319 -226 -156 -414 47 -209 -137 59 -398 29 -188 -133 282 -3 24 223
3437B23k09K34oj68K31n5J37j80m50L60l2o16N27q0l8J7l43J62J19j5J20l26q3
3460d71O42k87L02J69m98K67J19j81J03J6K1k2O8J34j91j13K34r0j12J61n78L83
3482G6k20o0O3q4m0m6KJ27J62m29N57k97J35L26l25K90j30l83N24j45j83M33m54
3505a01L00J84m93L81l00J09J56n18J97K50m16J05l20L1M42j40m3k0k51M40j10
3526a17j26K80J1oL65n47M77r0l02M97n39M17j21j39j8L25m37J31j82K9K60k69
3548a01J05R7n20M05j57L5Lj94J48L59n81P42k84j89N04m31J88K06k88Q0j7N8
3570A68Q3k67L16k10k61J29j2J7K58m76L14j1n41N02k16l37O01n03J57M34k57
3591a12J00m9j49M10l14K97K53m16M24l8m42M33k62Q7o4k77K30K42q60M72p6r9
$$ plain form
3437 223 14 248 242 74 305 250 387 207 -243 117 85 -531 -4 -84 -122 -105 -448 -286 -167 -182 -62 -388 -471
3460 -471 171 -116 186 355 -143 124 243 62 165 181 202 180 248 382 191 78 312 222 110 271 -307 76
3482 76 -144 -204 -141 -225 -265 -311 -309 -182 -20 -449 108 -189 -54 272 -53 237 107 -276 248 103 -80 353 -101
3505 -101 199 383 -110 271 -29 80 236 -282 -85 165 -251 -146 -466 -435 7 -133 -176 -196 -447 -7 -117
3526 -117 -243 37 48 42 407 -140 337 247 -55 442 -97 320 199 60 42 367 -70 61 -121 -92 168 -101
3548 -101 4 101 -419 -14 -171 -136 -133 -327 -179 180 -401 341 57 -132 372 -59 129 335 47 127 110 168
3570 168 251 -16 300 90 -171 -42 -54 -37 221 -255 59 48 -493 9 -207 -544 57 -446 -289 145 -112
3591 -112 -12 -61 -210 200 -114 183 436 20 444 406 -36 397 135 222 158 -119 111 353 -507 -35 -111 -210
3613b10M0j66K75J5k48J98k82J20K09k5L0K89o33L89J17j95K32l20N73j40j76
3634I2Q7o3q0L57k82K9o8m4K6j49j43R9j59J64J82l39J39J13j40J27k2j64K00
3657c8K10j28L40m65L69n1l41N79m08jJ61k1l9j65j07K76k54M9K91l44k8n7l04
3680d76L90j10Q3P9l66K84M0j23L69k83O2L03l07K46j24K23j13p3Q4K46l78J17
3702A73j41J2Q9k98O9K07m80K95N7n30N74m55K41R0k05K22o2j02L89k45R8K1k25
3725b06L34JJ77J16k35R9Q8n75L46J96l47K66m20m2K12j79j64K58l38L04j54q5
3747c48R1k31J57L37j70J75RK7K04k34P1L95m37K55R7k78P6j0k05L27l11R0M9
3770A36l73J56l2J40k19k0M0p6Q1K3o3J37K8k30L52J48l11L73k38j15L44k78M27
$$ plain form
3613 -210 -170 -336 -61 -46 -294 -96 -378 -258 -49 -74 -44 245 -388 1 118 -77 155 -165 408 268 92
3634 92 179 116 36 393 111 140 72 28 54 -95 -238 -139 -298 -134 48 -291 -152 -39 -179 -52 -74 -238 -38
3657 -38 172 44 384 -81 288 237 -104 475 67 66 227 206 167 2 -105 171 -83 -34 257 -87 -115 -172 -476
3680 -476 -86 -196 -113 -34 -400 -116 -76 -199 170 -113 -51 252 -55 191 67 290 177 104 188 434 56 173
3702 173 32 44 133 -165 -96 111 -369 -74 -17 -547 27 -428 -187 -97 -302 -80 -142 -244 145 -100 -2 19 -206
3725 -206 128 129 306 422 187 286 374 -201 145 341 -6 260 -160 -202 10 -169 -333 -75 -413 -109 -263 -348
3747 -348 -257 -488 -331 6 -164 11 20 47 251 17 88 483 46 301 398 120 196 186 -19 308 -3 87 136
3770 136 -237 -81 -113 27 -192 -212 -172 -248 -167 -144 -207 -70 -42 -272 80 228 -83 290 52 -63 281 3 430
3793D30k48J45m1O6l59K61k02r8O3m9K09k50k63M57j59j99K24k47M00k57j85N22
3815B20k28j73J51o4j10N74l65K22m0j04K29m20M41J08k76j43J17P2jj68j38l6
3837a32j21N41n74m2J62J69j08J8j53K98j67l1L0J9n0K54K6O8j22Q1K24k50J22
3860B62L2l20K05l7j32Q0l51J88K30m91J30J53k97K75m4k01K00j73J32J36J9K41
3882B37k79j50K06k95K49K20k15K94Mk67L01l17J22K45m69K48J9k88K03l40L58
3903H6M4l46J82m5j58K04k14j41N82n17K32lO9K53m41K26L19m37K21M60n03J49
3925B22l2K6Pk68k38M09k65L32l83J48N7j79k19L06l9K04k36q4K90m0ML1j5j42
3949a04J44J04q6K4K4MO1J1k24J07R2k7k17K24l11k52N02k90J62k13J42m3j39
$$ plain form
3793 430 182 327 286 352 -7 254 52 -46 17 -32 177 -73 -336 121 -38 -237 -13 -260 140 -117 -302 220
3815 220 -8 -181 -30 -94 -204 370 5 227 187 83 312 -108 333 441 165 22 139 211 210 42 -96 -132
3837 -132 -253 288 -286 -328 -166 3 -105 -87 -240 58 -109 -140 -110 -91 -141 113 139 207 85 166 390 140 262
3860 262 294 -26 179 142 10 90 -261 -73 157 -334 -204 -51 -348 -73 -117 -318 -118 -291 -159 -23 -4 237
3882 237 -42 -192 14 -281 -32 188 -27 267 271 4 305 -12 110 355 -114 134 153 -135 68 -272 86
3903 86 130 -216 -34 -79 -237 -33 -247 -388 194 -323 -91 -94 -25 228 -213 13 332 -105 116 576 73 222
3925 222 190 216 223 -45 -283 126 -139 193 -190 -42 15 -164 -383 -77 -116 88 -148 -232 58 18 22 53 38 -104
3949 -104 40 144 58 82 106 110 171 182 -42 65 157 130 -87 137 -174 -426 76 -214 -52 -265 -123 -166 -305
3972c05L2J51l05K59J48J4K49k88K07J85n00N65l84QpL5K15k6n3K69k28j38j1
3995I2j56q6K41k31J43k52J01L22l03J80o0q1L3M3k29L43M%j52P5J17J21K6q3
4019B08m30M14K49m38J58r7l5J76l12J27J41m22K51j13p9K55k80J44j92K52O8
4040D5J32m33M09r6J25n7j7n0J95l36N25m35r6R0J13l9mL6l5K1J6l2l06K51J33
4065A55k45J11p4l01L83m8j09J89j71J91j82k61L25o0j99N16j1m6rj46L94k66
4087A36J28R8m21K42m3m38J52J47J02k68J01N6K2j62l4q1J08J23k32K13N5j21
4109a17M7l0R0L0K28o5J43l44J52K06k16J18j28K6P9l09o4K4K18L0m16J43K68
4132A13j99O4j06k14N90m96P1K23j71K01m3j41K80j40O6J99k60J66j2p5j27j2
$$ plain form
3972 -305 -273 -122 -427 -168 -20 -6 243 -45 162 347 -153 412 28 36 29 64 279 253 200 469 241 103 92
3995 92 -64 -150 91 -140 3 -249 -148 174 -129 51 -9 -90 -57 -14 -243 100 104 104 -48 27 144 265 291 208
4019 208 -222 192 441 3 161 64 29 205 -107 20 161 -261 -10 -123 -202 53 -227 -83 -275 -23 45
4040 45 177 -256 153 57 182 125 108 58 253 -83 442 7 -89 1 114 75 71 107 72 93 109 77 -229 22 155
4065 155 -90 21 -53 -354 29 -19 -128 61 -110 81 -101 -362 -37 -97 -296 220 209 163 154 8 402 136
4087 136 264 362 -59 183 140 -298 -146 1 103 -165 -64 -8 14 -148 -182 -263 -155 -32 -264 -51 4 -117
4109 -117 -70 -100 -10 20 248 183 326 -18 134 340 124 242 114 140 219 -90 -154 -130 88 118 -298 -155 113
4132 113 -86 -22 -128 -342 248 -248 -177 46 -125 76 33 -108 172 32 98 297 37 203 191 116 -11 -23
4154b3O1L59k84k81K06m86J86K99k14Q6q4Q5r4n6M6K80l64K82k01K70q4k3R4K21
4178B81j83K4l3J25J10n82M16J90m67N80m56j17K28k69J96j12J64r0j14j39M39
4199A91n75L98N0m5Kj9p8J91j5k97K53m3M7K9j11J92k75K27L30n97K72q2k4M6
4223F7k32K59j86n0k8J72p1P4k85Q4M3K7P3J03j39J82j30L99l37r2J9K31l36L43
4247A90n7j24Pj83L46j49k5M0j0j06P5l72K90J44k60J91l37Q2K40j3m0j8m1J73
4271D3j08N3j1j4J29K76n43L53K6k01K49q0J72j49j56J32L7m48L93m64J20J92
4293Ak15L41m11j7K39n2J60Q0m93K27J68q4K23j20m8J59j21P5P9k51J23J0k5K36
4317B84l68Q1J12m03M02k59J40p4j14q0O9j41L03j4j16K24l8j79J17nJ59J30k64
$$ plain form
4154 -23 38 397 113 -168 38 -448 -262 37 -177 -91 -175 -90 -184 -240 -194 86 -278 4 -197 73 -11 -34 60 281
4178 281 98 122 89 214 324 -258 158 348 -119 461 5 -112 116 -153 43 -69 95 5 -109 -248 191
4199 191 -384 14 64 19 21 2 -76 115 100 -197 56 13 60 89 -22 170 -105 122 452 -145 127 45 21 67
4223 67 -165 94 -92 -142 -170 2 -69 5 -280 -196 -153 -126 -53 50 -89 93 -37 362 25 -67 -48 183 -153 190
4247 190 133 9 16 -167 179 30 5 45 35 -71 4 -368 -78 66 -194 -3 -340 -258 -18 -31 -71 -89 -130 43
4271 43 -65 -12 -23 -37 92 368 -175 178 204 3 252 172 344 195 39 171 208 -240 153 -311 -191 1
4293 1 -214 127 -284 -301 -62 -114 46 126 -367 -140 28 -56 167 47 -1 158 37 112 191 -60 63 73 48 284
4317 284 -84 -3 109 -294 108 -151 -11 -85 -199 -279 -210 -351 -48 -62 -178 46 8 -171 -54 -59 100 230 -34
4340c4L08k5J5j60j24m0J27j39J75k1j65K22j23j40J14j87L22k89J81J0l58L86
4362E5m4n01K31L07k18J76j34L86j11o8J10l47L92r2l12J95J87p5n8Q9k18J46
4384I6j45L6k6l75K59N6K73r0l15LJ38p5K31r7j91J59r7K69J06k03J32O8Rj00
4408A21J37k28K05k67R3J25m9J30l85J12K23l47m4K9K1J79j85n5l9K02j33K42
4430H7k14L05j08j16K0L1K39r1K5m3J04J7P4j95j9Q2k09O9L9j89J55k90Q5P9l98
4455d61J17J62J4J72j06p2J62k03K49j17J16K73k39q0J9o3K95m5l28Q2J58l17
4477b12L17k46K67n3j1j14j56pJ92K6m8K8K4k58J32mL23j40M3K51j16k13p6J28
4501G7J44k70K29J29j79N4o8J69k09m0%j57J14M5k72K73l3k6j9O6k26M24l62k0
$$ plain form
4340 -34 274 249 264 104 -20 -60 67 -72 103 82 -83 139 16 -124 -10 -197 125 -164 17 27 -331 55
4362 55 11 -490 -259 48 -170 6 -128 258 147 79 189 -158 234 142 -170 25 212 137 79 168 -50 96
4384 96 -49 -13 -39 -414 -155 -99 174 84 -231 -228 -90 -165 66 -31 -222 -63 -160 109 215 12 144 212 221 121
4408 121 258 30 235 -32 61 186 137 267 -118 -6 217 -130 -174 -145 -124 55 -130 -185 -224 -22 -155 87
4430 87 -127 178 70 -46 -26 5 244 153 178 135 239 256 330 135 116 198 -11 58 97 -92 63 -227 -142 -63 -461
4455 -461 -344 -182 -168 4 -102 -174 -12 -215 34 -83 33 306 67 -13 6 -57 238 193 -135 -53 105 -212
4477 -212 105 -141 126 73 62 -52 -208 -215 -23 3 -45 -17 7 -251 -119 -123 200 60 103 354 238 25 -51 77
4501 77 221 -49 180 309 130 184 116 285 76 36 36 -121 -7 38 -234 39 6 -20 -39 27 -199 225 -137 -157
4525a57K28r3k22L44k40K16n3L7J80l4k64J84m8K15j11m1q5k3jJ81q0k03J93k49
4549a26J12R0l21L04j44j33Q7j17O1l4J62R6mj73k3QK59o2k07K74M7q0P8o5k44
4574a55K59R6J4l01P3R6j27QL8k77K02o5j47K96p6l3P3M6j61j43K24j9O2K6K20
4599B29j43J02j28K18j51p9J32N0k79J73Nk26Q3J27Q0k46k13K67j00l0Q3K23m48
4622b71K15o0K01J20l06M51l14J57j08j06K36M9k14m4J3J15Jj18J6O3q8J09j82
4645f5r5K89k67k3J84j65M8O8j94K52O9r3j58J71p7j13J24J29J34j64O6k8M6L1
4669A69j49K9J1n1J11L1j92K33l64J92J03k64K02j5k01O2k03J07K11j75J83j33
4691a03J78P6k37L4R3J7K49j57q0L1o3j69R3j14M82k24j85M24l55Mm5j15J44j25
$$ plain form
4525 -157 71 -22 -244 100 -140 76 23 60 240 206 -58 126 78 293 182 141 56 33 32 213 133 -70 123 -126
4549 -126 -14 76 -245 59 -85 -218 -131 -248 -187 -221 -59 37 33 -140 -163 -155 104 42 -165 109 156 76 154 89 -155
4574 -155 104 200 214 -87 -14 82 -45 -37 1 -276 -74 -139 -286 10 -66 -99 -26 20 -141 -284 -60 -79 -17 9 229
4599 229 86 188 60 278 127 48 180 230 -49 124 129 -97 -14 113 193 -53 -266 1 -99 -129 -46 177 -271
4622 -271 -56 -116 85 205 -101 350 36 193 85 -21 215 264 50 6 19 134 135 17 33 96 8 117 -65
4645 -65 -160 129 -138 -161 23 -142 -94 -26 -220 32 101 8 -150 21 -56 -169 -45 84 218 54 120 92 138 169
4669 169 20 49 60 9 120 151 -41 192 -172 20 123 -141 61 46 -155 -93 -296 -189 22 -153 30 -103
4691 -103 75 151 -86 -52 41 58 307 150 70 101 38 -131 -38 -152 330 106 -79 345 -10 -6 -51 -166 -22 -147
4715a47J22K25k33r9N7K7K8j18mJ15o5K98k65J6O9j25k2M06m22K02j46R2J34l32
4739a87K75l02J46J18n4l85L64j4j43J78l04J93J09l46N82j92j97K83k36jjK86
4761A72J26j04j09J21k46J47L8p6J18Ll49O7J62j08J61l30J6K88l24L56j52k87
4783c10M09m14J51K98p0P9R6l62L42k50J59K6l16L78m9k25K11j21j02J69k23J81
4805E7m7j7j31j63J63O9k69K44J50k52L38m39K31K04j62m2kJ06O7j29nJ10J10
4828A91L4n2k9m6j53J55J6j59R3J15l66K93l73P4K85m14L51j15j26J14J70k13
4850a55J92m3p1L5j5J29K73l15K76Mk93Q5j81K36o6j58K12k57l8K44k89K63k82
4873b14P2p6J17r4J43J15Q6m05L57k06j2N0R4n2P3J15l28L31j18J17rl02J15J28
$$ plain form
4715 -147 -25 200 -33 -132 -75 -48 -20 -138 -142 -27 -92 206 -59 -43 26 -99 -121 285 -137 65 -81 11 145 -187
4739 -187 88 -214 -68 50 -4 -389 -25 -39 -182 -4 -308 -115 -6 -352 230 38 -159 124 -112 -113 -114 172
4761 172 298 194 85 206 -40 107 145 69 187 190 -159 -92 70 -38 123 -207 -191 97 -227 129 -23 -310
4783 -310 99 -315 -164 134 64 143 239 -123 219 -31 128 154 -162 216 167 -58 153 32 -70 99 -124 57
4805 57 10 -7 -138 -301 -138 -69 -338 -94 56 -196 142 -297 -66 138 -24 -66 -68 38 105 -24 -29 81 191
4828 191 225 173 144 98 -55 100 116 -43 50 165 -201 92 -281 -207 78 -336 15 -100 -226 -112 58 -155
4850 -155 37 -6 -77 -42 -57 72 345 30 306 310 17 102 -79 157 91 -67 145 -112 -150 94 -195 68 -214
4873 -214 -142 -218 -101 -195 -52 63 149 -256 101 -105 -117 -67 27 -25 48 163 -165 166 48 165 156 -146 -31 97
4897I7k09K94k29O9K16l70K45j05p2Qk2n9J88k96K64j8q5J03k71J40J11k3PL8
4921B1j85J83n5K65j29J58k00P8j64K2m9j2J23k30Q5J77j91J24p9M3Oj71o3J81
4945f2J95j69Q9k70L46k14J21L7k00L12k14M6K27l17K79K18k76m4j70J14K25k03
4967G0j22q8M6J61j51j84K92m8j86L12k01J00m4k33M41k68l2K41k3k6K13l97K53
4990A26o4J19k03K06j27J35k44K56j52j79L77l84l4J0K9N3J8j90P4R8j62J95j92
5013b35N3K11p9J03Q9j39J24k7j06N8O6Mkj96J91l0Q2N8j99JM4j65J65l56K64
5038b1k00pJ31R1j53K94j59Q5k19K57j0k60J19r1K28j6KJ17n2J03m29L91j71q9
5062e9r5J97l1M9k56O5N3j33m8K12j73K40l89M12k74m3J92L3k6R6K8Q6j98K16
$$ plain form
4897 97 -112 182 -47 22 238 -132 113 8 -64 -56 -78 -137 51 -245 19 1 -84 19 -252 -112 -1 -24 -17 21
4921 21 -164 19 -36 229 100 258 58 136 -28 -6 -55 -67 56 -174 -89 88 -103 21 -58 -15 -9 -180 -243 -62
4945 -62 133 -36 53 -217 129 -85 36 73 -127 185 -29 17 244 -73 206 424 148 104 -66 48 273 70
4967 70 -52 -140 -94 67 -84 -268 24 -24 -210 102 -99 1 -43 -276 165 -103 -135 106 83 57 270 -127 126
4990 126 62 181 -22 184 57 192 -52 204 52 -127 250 -134 -168 -158 -129 -76 -58 -248 -174 -76 -238 -43 -235
5013 -235 -182 29 -50 53 142 3 127 100 -6 52 118 122 120 -76 115 85 167 225 26 27 71 -94 71 -285 -21
5038 -21 -221 -228 -97 -6 -159 135 -24 61 -158 99 89 -171 -52 -143 85 69 71 188 136 239 -190 201 30 -59
5062 -59 -154 43 12 61 -195 -130 -77 -210 -258 -46 -219 21 -368 44 -230 -273 -81 -48 -74 22 50 136 -62 154
5086A54pM3j56J45k66J39j9k7Pj8L5m3p7N0M4o2J44j33q0J50j59o9J66p5K33j27
5112ho1J84Kj07O6j15k4K25k49J60j5l08O81m22o9k6l1q0O6J14j67O4LOk45K56
5138a00Q8q3j7J04r5K02jP2k75K74j51j85L26j76J51j8K11k12J74l76N5L7l7p8
5162a10N7O5j07k31L64k96J74J07j26P9M3j98N1J05k19M61k02p9J30k30J88L60
5184C86l66J27N5j2Kj78j17L0K8J68j30N1J11n39K08L83k47K8l3j15Q0J30k80
5207b30K47k48K63j78J94J71k38J14o6Q6k29L43j50J05k54J37j25J4Q6n6j28j07
5229b49R4N5J60l06Q3k2j66L73j05q8K40k06J28Oj80L15k19J90Jj49K19Mq0j22
5253b4K89j54j94K73k84N9q2K5j79k1J54K1k0N7j07L12l59j4J75j6K21j38J77
$$ plain form
5086 154 147 190 34 179 -87 52 33 6 13 -5 30 -13 -90 -40 4 -58 86 -47 -127 23 -136 -205 -39 -114 119 -8
5112 -8 -69 115 117 10 76 -39 -63 162 -87 73 58 -250 431 9 -60 -86 -117 -197 -131 -17 -184 -120 -117 -111 -356 -100
5138 -100 -12 -95 -112 -8 -103 99 98 170 -105 169 18 -167 159 -17 134 116 327 115 289 -87 -32 5 -32 -110
5162 -110 -53 12 -95 -326 38 -258 -84 23 -103 -24 19 -179 -128 -23 -242 219 17 -62 68 -162 26 386
5184 386 20 147 202 190 192 14 -103 -73 -45 123 -7 44 155 -384 -176 207 -40 -12 -45 -160 -80 50 -230
5207 -230 17 -231 32 -146 48 219 -19 95 29 115 -114 229 79 184 -70 67 -58 -44 42 -14 -142 -249
5229 -249 -155 -100 60 -246 -163 -185 -351 22 -83 -171 69 -137 -9 -3 -183 132 -87 103 104 -45 174 178 98 -24
5253 -24 265 111 -83 190 -94 -35 -117 -92 -271 -292 -138 -117 -137 -80 -187 125 -234 -248 -73 -89 132 -6 171
5276A71L0J9k22J76j99P3o8L7J7M57n74M2L3rK70l21m9K52m15M25k61m7K3p2J38
5301g4nNM1j19P4J58j45K50j6O5p4q0j52m3J18J95K6M3m9L5k10j0m0J01k79j33
5327c18J03J15l9J44j73N0J70l84K70K46j47O3pq1M36l59j03J37j10r6K35m8k61
5350a57J21K73P2m49K58m16L46m6pk19J43j14J27k6l0qJ85m8K53l53M7J0J57O3
5374A82k52p0K85r6l6L17l36L28k07j21J49M4n8m2p0q0N6k3k97O8L45j57l6j63
5398b70M19j87Q2l15J43R0K18J31l04J10J23k85K04L7j02q4K7K35q8l8k26K33
5420A53k17K60l26K16k07J57j43K00m60J52J18j50M40r0j67n3J22Q6l1J38n7q8
5442E3o5J08k4r5J93m9J82k58J73r1r0L2l2j09L9j90PK15k95O7K00n6J64o8J33
$$ plain form
5276 171 201 220 -2 174 -25 48 -20 17 34 491 -83 -41 -8 -17 253 -68 -117 135 -280 145 -116 -163 -140 -212 -74
5301 -74 -79 -74 -33 -152 -78 80 -65 185 169 234 160 80 -72 -115 3 198 224 267 218 253 43 33 -7 94 -185 -318
5327 -318 -215 -100 -139 5 -168 -118 52 -332 -62 184 37 100 93 12 448 89 -14 123 13 -83 152 104 -157
5350 -157 -36 237 309 -140 118 -298 48 2 -5 -224 -81 -195 -68 -94 -124 -132 53 5 258 -95 -48 -38 119 182
5374 182 -70 -140 145 49 13 330 -6 322 115 -6 143 187 129 87 17 -63 -7 -30 -327 -259 86 -71 -107 -270
5398 -270 149 -38 44 -271 -128 -38 180 311 7 117 240 -45 159 196 94 10 37 272 184 146 -80 153
5420 153 -64 196 -130 86 -121 36 -107 93 -367 -215 -97 -247 193 103 -64 -117 5 91 60 198 141 53
5442 53 -12 96 72 -23 170 121 303 45 218 127 37 69 37 -72 -33 -223 -216 -1 -296 -229 -29 -85 79 11 144
5467A44k67K1J87q5j44L63k28j6K78k00k00K37j17J40m3l00L59k70J62M7j75J04
5489cK3k17m6K6j21M34l08R7K35m38M06j56K24q7j67J35K75l51K82k33R6j52Q2
5512C6R2Q8oL3j49j59M9j57M3j07K78j7r5j83J80o5Q8M3r8K09j67K0p2J00%J34
5538A18R4N7j23p3K50m08L23r2k62J68K74m54J14k29M7J74k9j08K2M9L33m64r1
5561c10M54j98J34R1k49j6P0K6J27j15M7Q7N9k28l4P5K17j33k09K29l71K34M3
5584C0o6K28l75K24p3j38O7j63N0K42j03J73p6Q3m0Q6j57M09n49Q9L06n2l6o4
5608I5P3j89O4L0J13j19k65K56j28no2l6O8O0K2O0k57K34j6Q6M3l95J74K49o9
5633H6k46J69j2M2l8P7J53k91O0j7J55K3l37L25j57j28k39K66j66L52k58M2J43
$$ plain form
5467 144 -123 -102 85 0 -144 219 -9 -25 253 53 -147 90 -27 113 70 -230 129 -141 21 68 -107 -3
5489 -3 20 -197 -243 -217 -338 96 -212 -115 120 -318 88 -68 156 69 -98 37 312 -39 243 10 106 -46 36
5512 36 128 216 210 243 94 -65 -16 -173 -130 -237 41 24 -71 -254 -74 -139 -51 -8 -106 103 -64 -44 -116 -16 -16 118
5538 118 212 269 146 73 323 -85 238 146 -116 52 326 -128 -14 -243 -196 -22 -51 -159 -137 -88 245 -219 -310
5561 -310 144 -54 80 171 -78 -94 -24 2 129 14 61 148 207 -21 -55 20 237 104 -105 124 -247 -13 30
5584 30 -36 192 -183 41 -32 -170 -103 -266 -216 26 -77 96 20 103 63 149 -8 401 -148 -59 247 195 159 95
5608 95 168 -21 43 73 186 67 -198 58 -70 -75 -137 -173 -105 -45 -23 37 -220 14 -2 84 127 -268 -94 155 86
5633 86 -160 9 -3 39 1 78 231 -60 0 -17 138 161 -176 149 -8 -136 -375 -109 -275 77 -181 -139 4
5656Dk1J30k3k68K09k85L61J10j96K80l36Q7q9O5O4N0J1k4L73o37K17j29q7M28
5680B94m65J87l9N3k13K12m05K88o2N2P0J6J30p8k59K08P8o5J90o7q2J16j34J37
5704A62q7J72p0k20J00r5J31k86Q4k8l9J2M4o7k18L28J1q5P1k55M01j35k11L85
5728A05N6o9L5r6K21J82m06K03q1r7mj31J80J56l41L85m92M85n56J21J86p0k47
5751b75M03K2k52J42k56L8J99k22Q5L22l34K99j04p9K12m58M19J02k66J77q6o
5773H2J35n00O27l47k8J92l78K38L5j53J20n7p8q6J82Q2J08j62J52o8n5J41J0
$$ plain form
5656 4 -17 113 90 -178 31 -254 107 217 21 301 -35 52 -37 28 92 142 153 129 502 -135 82 -47 -134 294
5680 294 -171 16 -23 30 -183 29 -376 -88 -150 -98 -28 -12 118 40 -219 -11 67 2 192 125 43 159 25 162
5704 162 75 247 177 -43 57 -38 93 -193 -109 -137 -176 -164 -120 -187 -405 -77 -66 -151 -80 -335 66 -69 -280 105
5728 105 161 92 127 31 252 434 28 231 150 53 49 -82 98 254 -87 298 -194 291 -265 -144 42 -28 -275
5751 -275 128 150 -102 40 -216 -178 21 -201 -116 206 -128 171 67 -12 200 -258 161 263 -3 174 88 82
5773 82 217 -283 344 -3 -31 161 -217 21 56 -97 23 -34 -112 -198 -16 66 174 12 164 96 41 182 192
$$ [...]
8191a8
##END NTUPLES=NMR FID
##END=
