##TITLE=1H_Pr NCS-113
 CDCl3
 8 sc, 
 3.06.2022
##JCAMPDX= 6.0         $$ Bruker NMR JCAMP-DX V2.0
##DATA TYPE= NMR FID
##DATA CLASS= NTUPLES
##ORIGIN= UXNMR, Bruker Analytische Messtechnik GmbH
##OWNER= root
$$ XWIN-NMR		Version 3.5
$$ Fri Jun  3 14:26:06 2022 Russian Standard Time (UT+4h)  she@DPX200
##.OBSERVE FREQUENCY= 200.13135
##.OBSERVE NUCLEUS= ^1H
##.DELAY= (6, 6)
##.ACQUISITION MODE= SIMULTANEOUS
##.ACQUISITION SCHEME= undefined
##.AVERAGES= 8
##.DIGITISER RES= 18
##SPECTROMETER/DATA SYSTEM= spect
##.PULSE SEQUENCE= zg30
##.SOLVENT NAME= CDCl3
##.SHIFT REFERENCE= (INTERNAL, CDCl3, 0, 15.7039)
##AUDIT TRAIL= $$ (NUMBER, WHEN, WHO, WHERE, WHAT)
$$ ##TITLE= Audit trail, XWIN-NMR		Version 3.5
$$ ##JCAMPDX= 5.01
$$ ##ORIGIN= Bruker BioSpin GmbH
$$ ##OWNER= she
$$ F:/spectra/data/she/nmr/H-F/1/audita.txt
$$ ##AUDIT TRAIL=  $$ (NUMBER, WHEN, WHO, WHERE, WHAT)
(   1,<2022-06-03 14:24:51.67 +0400>,<she>,<DPX200>,
      <created by zg, POWCHK disabled, PULCHK disabled
       configuration hash MD5:
       00 E9 B6 7A A2 85 ED C7 34 08 36 98 17 FE 4E 26
       data hash MD5: 16K
       B0 2B 51 56 AD 11 41 90 B0 8B CF 1C 09 2B 48 80>)
$$ ##END=
$$ 
$$ hash MD5
$$ 17 AF F5 26 76 CE B2 C7 CB 07 71 6A 54 C0 0B CA
##$RELAX= 
##$RELAX= 
##$RELAX= 
##$RELAX= 
##$RELAX= 
##$RELAX= 
$$ Bruker specific parameters
$$ --------------------------
##$DU= <F:/spectra>
##$EXPNO= 1
##$NAME= <H-F>
##$PROCNO= 1
##$TYPE= <nmr>
##$USER= <she>
##$AMP= (0..31)
100 100 100 100 100 100 100 100 100 100 100 100 100 100 100 100 100 100 
100 100 100 100 100 100 100 100 100 100 100 100 100 100 
##$AQSEQ= 0
##$AQ_mod= 1
##$AUNM= <au_zg>
##$AUTOPOS= <>
##$BF1= 200.13
##$BF2= 200.13
##$BF3= 200.13
##$BF4= 200.13
##$BF5= 200.13
##$BF6= 200.13
##$BF7= 200.13
##$BF8= 200.13
##$BYTORDA= 1
##$CFDGTYP= 0
##$CFRGTYP= 5
##$CHEMSTR= <none>
##$CNST= (0..31)
1 1 145 1 1 1 1 1 1 1 1 1 1 1 1 1 1 1 1 1 1 1 1 1 1 1 1 1 1 1 1 1 
##$CPDPRG= <>
##$CPDPRG1= <>
##$CPDPRG2= <>
##$CPDPRG3= <>
##$CPDPRG4= <mlev>
##$CPDPRG5= <mlev>
##$CPDPRG6= <mlev>
##$CPDPRG7= <mlev>
##$CPDPRG8= <mlev>
##$CPDPRGB= <>
##$CPDPRGT= <>
##$D= (0..31)
0 1.2 0 0 0 0 0 0 0 0.06 0 0.03 0 0 0 0 0.0002 0 0 0 0 0 0 0 0 0 0 0 0 
0 0 0 
##$DATE= 1654251891
##$DBL= (0..7)
120 120 120 120 120 120 120 120 
##$DBP= (0..7)
150 150 150 150 150 150 150 150 
##$DBP07= 0
##$DBPNAM0= <>
##$DBPNAM1= <>
##$DBPNAM2= <>
##$DBPNAM3= <>
##$DBPNAM4= <>
##$DBPNAM5= <>
##$DBPNAM6= <>
##$DBPNAM7= <>
##$DBPOAL= (0..7)
0.5 0.5 0.5 0.5 0.5 0.5 0.5 0.5 
##$DBPOFFS= (0..7)
0 0 0 0 0 0 0 0 
##$DE= 6
##$DECBNUC= <off>
##$DECIM= 32
##$DECNUC= <off>
##$DECSTAT= 4
##$DIGMOD= 1
##$DIGTYP= 9
##$DL= (0..7)
0 120 120 120 120 120 120 120 
##$DP= (0..7)
150 150 150 150 150 150 150 150 
##$DP07= 0
##$DPNAME0= <>
##$DPNAME1= <>
##$DPNAME2= <>
##$DPNAME3= <>
##$DPNAME4= <>
##$DPNAME5= <>
##$DPNAME6= <>
##$DPNAME7= <>
##$DPOAL= (0..7)
0.5 0.5 0.5 0.5 0.5 0.5 0.5 0.5 
##$DPOFFS= (0..7)
0 0 0 0 0 0 0 0 
##$DQDMODE= 0
##$DR= 18
##$DS= 0
##$DSLIST= <SSSSSSSSSSSSSSS>
$$ [...]
##$SUBNAM2= <"">
##$SUBNAM3= <"">
##$SUBNAM4= <"">
##$SUBNAM5= <"">
##$SUBNAM6= <"">
##$SUBNAM7= <"">
##$SUBNAM8= <"">
##$SUBNAM9= <"">
##$SW= 18.05172834244
##$SWIBOX= (0..15)
0 0 2 0 0 0 0 0 0 0 0 0 0 0 0 0 
##$SW_h= 3612.71676300578
##$TD= 16384
##$TD0= 1
##$TE= 0
##$TE2= 300
##$TE3= 300
##$TEG= 300
##$TL= (0..7)
0 120 120 120 120 120 120 120 
##$TP= (0..7)
150 150 150 150 150 150 150 150 
##$TP07= 0
##$TPNAME0= <>
##$TPNAME1= <>
##$TPNAME2= <>
##$TPNAME3= <>
##$TPNAME4= <>
##$TPNAME5= <>
##$TPNAME6= <>
##$TPNAME7= <>
##$TPOAL= (0..7)
0.5 0.5 0.5 0.5 0.5 0.5 0.5 0.5 
##$TPOFFS= (0..7)
0 0 0 0 0 0 0 0 
##$TUNHIN= 0
##$TUNHOUT= 0
##$TUNXOUT= 0
##$USERA1= <user>
##$USERA2= <user>
##$USERA3= <user>
##$USERA4= <user>
##$USERA5= <user>
##$V9= 5
##$VALIST= <valist>
##$VCLIST= <CCCCCCCCCCCCCCC>
##$VD= 0
##$VDLIST= <DDDDDDDDDDDDDDD>
##$VPLIST= <PPPPPPPPPPPPPPP>
##$VTLIST= <TTTTTTTTTTTTTTT>
##$WBST= 1024
##$WBSW= 4
##$XGAIN= (0..3)
0 0 0 0 
##$XL= 0
##$YL= 0
##$YMAX_a= 527868
##$YMIN_a= -747323
##$ZGOPTNS= <>
##$ZL1= 120
##$ZL2= 120
##$ZL3= 120
##$ZL4= 120
##$ABSF1= 10
##$ABSF2= 0
##$ABSG= 5
##$ABSL= 3
##$ALPHA= 0
##$AQORDER= 0
##$ASSFAC= 0
##$ASSFACI= 0
##$ASSFACX= 0
##$ASSWID= 0
##$AUNMP= <proc_1d>
##$AZFE= 0.1
##$AZFW= 0.1
##$BCFW= 1
##$BC_mod= 2
##$BYTORDP= 1
##$COROFFS= 0
##$CY= 11.3945322036743
##$DATMOD= 1
##$DC= 2
##$DFILT= <>
##$DTYPP= 0
##$F1P= 2.36226072786647
##$F2P= -0.459571619588291
##$FCOR= 0.5
##$FTSIZE= 0
##$FT_mod= 4
##$GAMMA= 1
##$GB= 0.15
##$INTBC= 1
##$INTSCL= 1
##$ISEN= 128
##$LB= 0.24
##$LEV0= 0
##$LPBIN= 0
##$MAXI= 10000
##$MC2= 0
##$MEAN= 0
##$ME_mod= 0
##$MI= 1.114404
##$NCOEF= 0
##$NC_proc= 0
##$NLEV= 6
##$NOISF1= 3.799351
##$NOISF2= 2.8
##$NSP= 1
##$NTH_PI= 0
##$NZP= 0
##$OFFSET= 15.70392
##$PC= 1
##$PHC0= -18052.57
##$PHC1= 14.60074
##$PH_mod= 1
##$PKNL= yes
##$PPARMOD= 0
##$PSCAL= 0
##$PSIGN= 0
##$REVERSE= no
##$SF= 200.130013532006
##$SI= 16384
##$SIGF1= 3
##$SIGF2= 2
##$SINO= 400
##$SIOLD= 16384
##$SREGLST= <1H.CDCl3>
##$SSB= 0
##$STSI= 0
##$STSR= 0
##$SW_p= 3612.71676300578
##$SYMM= 0
##$S_DEV= 0
##$TDeff= 0
##$TDoff= 0
##$TI= <>
##$TILT= no
##$TM1= 0
##$TM2= 0
##$TOPLEV= 0
##$USERP1= <user>
##$USERP2= <user>
##$USERP3= <user>
##$USERP4= <user>
##$USERP5= <user>
##$WDW= 1
##$XDIM= 8192
##$YMAX_p= 0
##$YMIN_p= 0
$$ End of Bruker specific parameters
$$ ---------------------------------
##NTUPLES= NMR FID
##VAR_NAME=  TIME,          FID/REAL,        FID/IMAG
##SYMBOL=    X,             R,               I
##VAR_TYPE=  INDEPENDENT,   DEPENDENT,       DEPENDENT
##VAR_FORM=  AFFN,          ASDF,            ASDF
##VAR_DIM=   8192,          8192,            8192
##UNITS=     SECONDS,       ARBITRARY UNITS, ARBITRARY UNITS
##FACTOR=    0.0002768,     1,               1
##FIRST=     0,             0,               0
##LAST=      2.2672688,     0,               0
##MIN=       0,             -747323,         0
##MAX=       2.2672688,     527868,          0
$$ Real data points
##PAGE= N=1
##DATA TABLE= (X++(R..R)), XYDATA
0 0 0 0 0 0 0 0 0 8 0 0 -8 8 -16 16 -24 24 -32 40 -48 56 -72 85 -98 117 -136 160 -186 216 -250 286 -329 376
32 376 -428 485 -547 616 -693 776 -869 973 -1079 1200 -1333 1477 -1633 1804 -1992 2198
48 2198 -2421 2668 -2939 3237 -3570 3936 -4348 4810 -5336 5936 -6632 7450 -8427 9614
62 9614 -11096 13012 -15589 19254 -24924 34900 -57526 219952 -309915 -673654 283190 460071
74 460071 -167228 -340791 194403 288768 -1177 -147048 -131681 -141633 99158 279418 4060
85 4060 -302467 -24744 252394 -57589 -363303 -33573 303338 108132 -165861 -115169 -45073
96 -45073 -44658 49877 68512 -94882 -45377 186115 55425 -288830 -162806 220360 173877
107 173877 -106509 -64322 80649 -9405 -85331 -4980 1187 -3131 129584 112332 -150417
118 -150417 -176059 109162 126564 -131165 -50354 232800 73204 -249687 -75556 209311
128 209311 1133 -193211 117468 279827 -102261 -276216 77999 211763 -84753 -126957
138 -126957 154464 147520 -108430 -113730 31836 11462 -8407 86703 48263 -91962 -39851
149 -39851 67172 -45339 -129104 54757 161463 -26539 -135801 3914 43448 -81523
159 -81523 -44928 103800 52218 -71590 -15091 37602 -64948 -73222 75933 92906 -29960
170 -29960 -32901 31869 -24973 -70985 21486 68955 -464 -4244 41603 -29299 -96288 5304
182 5304 80085 -12568 -37955 73693 40037 -122835 -74696 106663 57303 -93445 -2090
193 -2090 135110 -1021 -156901 -27937 124330 37654 -58444 14292 58994 -15843 -49457
204 -49457 -11669 3983 30276 70559 11398 -84006 -33862 63957 4004 -82792 9815 110477
216 110477 9494 -106230 -38750 43882 -1862 -26476 33265 30996 -31710 -20816 11056 -31645
228 -31645 -36058 55715 73093 -26706 -57274 13752 23714 -29485 -12588 42038 30612 -1976
240 -1976 -6421 -28842 -42877 16030 60751 -1531 -48119 18927 45748 -49683 -81305 28924
252 28924 81373 -4065 -48574 9129 20554 -33367 -26705 25234 27596 9011 14133 -3599 -37557
265 -37557 -12978 33483 15999 -11369 19402 30397 -23360 -42634 5148 23429 -3414 5466
277 5466 28473 -9295 -46489 -10122 22253 -8842 -17737 30324 30494 -34569 -46147 8183 21264
290 21264 -6930 1418 24690 6452 -18454 -11817 -5500 -3591 22829 33878 -3960 -24888 4290
303 4290 11372 -22402 -16380 33661 33304 -17808 -27794 538 -1240 -17112 1559 23052 5428
316 5428 -13053 -4732 -8343 -22408 -1985 27911 14808 -10743 -3105 6144 -12090 -14747 12985
329 12985 22380 7332 3368 2194 -13647 -15069 9077 17449 78 65 13773 -2282 -28721 -15279
343 -15279 15262 12815 -5770 -1478 6164 -10154 -21638 -5993 9045 7740 6684 5097 -6887
356 -6887 -12861 -1145 4697 -206 8527 20534 5411 -16424 -10366 6649 5649 477 9029 11595
370 11595 -2857 -12116 -7819 -4176 -1939 7666 12413 -1713 -15719 -9847 -55 -3103 -4999 5033
384 5033 11413 3792 -8118 -13612 -8570 8176 18606 6016 -8674 1289 13656 -1717 -19898
397 -19898 -3730 25396 21745 -7817 -18906 -3991 9080 2575 -8987 -5370 10113 14044 -5937
410 -5937 -26813 -17470 13415 21332 -3938 -19447 -922 16104 225 -21970 -10930 19852 26602
423 26602 219 -21246 -9750 14000 13836 -5359 -8770 10030 19464 1256 -20261 -15401 8737
436 8737 19661 3939 -14693 -9542 7717 4386 -14832 -15737 7665 18629 262 -16071 -8802
449 -8802 1879 522 1120 7720 4105 -5657 528 10508 -2582 -16832 3312 28989 13375 -20568
463 -20568 -16498 13454 14955 -8636 -13068 5363 14999 3027 -13083 -18545 -6554 14712 17345
476 17345 -9535 -25241 -438 24162 805 -32953 -11977 34779 27128 -22546 -32528 9217
488 9217 31233 2972 -22196 -4101 24066 17586 -11918 -23273 -2796 20758 18252 -7179 -23065
501 -23065 -3761 22642 6217 -30350 -19928 28488 30074 -23770 -40134 8691 33123 -6649
513 -6649 -30806 4813 29845 -1082 -24644 -1276 15618 -392 -4374 13002 8087 -12935 -4550
526 -4550 15167 1861 -13959 5224 20101 -2472 -19870 -684 11625 -6154 -11002 9820
538 9820 10181 -15206 -15980 11071 10398 -17883 -13513 20297 17607 -17610 -21229 9828 18884 -2994
552 -2994 -11775 4152 14631 4386 -9115 -8121 3840 12131 9819 -2535 -13815 -4902 16190
565 16190 9907 -21779 -20411 23020 29332 -22480 -41023 9887 38220 -6860 -39197 852 37458
578 37458 3766 -35304 -11523 25661 13759 -11560 -4768 7070 228 1363 8151 -4571 -10493
591 -10493 13963 22035 -11613 -26301 7902 26012 -5205 -24625 2022 21486 -1049 -22154
603 -22154 -7326 11589 5242 -6104 -3600 -166 -2256 -145 2296 -2774 -3494 7113 9066 -3504
617 -3504 -8230 2265 9824 2487 -4019 596 7586 3013 -6428 -3022 5524 2020 -5292 1569 7634
632 7634 -6436 -15435 1996 14563 -3709 -18471 822 17778 -1896 -22802 -4527 20235
644 20235 8638 -14786 -7148 11600 7960 -5249 -5039 2287 6628 8669 2260 -9787 -6099 10715
658 10715 10295 -8013 -10593 7581 11562 -6507 -15186 -2008 9743 3906 -7264 -7400 -172 4111
672 4111 711 -6728 -6738 5166 10834 -867 -11525 -1993 10883 5781 -5290 -2768 7302 8400
686 8400 -1082 -8305 -1067 9960 6286 -5975 -6615 4651 5501 -6087 -8400 2433 6250 -2646
700 -2646 -7486 -1323 2629 -3036 -4852 1263 3122 -679 -1697 409 -234 -460 2751 3041 886 1444
716 1444 2481 272 -507 1873 2975 1239 797 1338 -1236 -2540 -75 883 -2012 -1983 1293 829 -4588
733 -4588 -5917 170 3011 -1779 -3609 507 2409 -1204 -3296 184 3133 3587 1331 -1148 448
748 448 3198 1910 -501 1133 3604 2352 -661 -1138 -421 -504 157 837 -287 -2509 -2301 -463 -1319
765 -1319 -4037 -2185 2284 1488 -3586 -4113 612 1917 -748 -1252 1726 3326 1747 -898 -1286 2217
781 2217 4335 1842 -1051 1063 3395 426 -3380 -924 3115 1610 -2279 -2745 293 -95 -3091 -2648
797 -2648 318 654 -1328 -2174 -1210 -791 -221 34 104 884 1781 681 -546 365 2234 1862 1240 1834 1658
816 1658 217 -89 1151 689 -123 585 1071 -709 -2654 -1713 -258 -1096 -2114 -605 -132 -1987 -2885
833 -2885 -817 244 -934 -381 1173 927 -331 -161 842 1560 2062 1595 394 1186 2453 548 -1539
850 -1539 700 3564 1209 -2661 -1612 1498 87 -3322 -2364 1382 306 -2347 -2422 -1358 -1032 -372
866 -372 528 -1208 -1240 1500 1755 -1564 -1279 2885 3602 314 6 2201 1450 -250 987 1955 426 45
884 45 1925 305 -2539 -1879 1283 766 -2565 -1952 -194 -987 -2411 -943 -1442 -1965 632 2034 -1890
901 -1890 -3821 1593 4109 -781 -2408 2490 4177 475 -1455 1206 1904 1744 2587 498 -2699 135
917 135 4475 366 -6058 -2098 5458 2072 -6855 -4995 3068 2749 -3597 -4190 107 2042 460 -1721
933 -1721 -3141 -79 4604 2883 -3098 -2225 4280 4975 -885 -2625 1619 4297 2214 -1259 -2484 382
949 382 3550 1329 -4038 -3444 3128 2785 -4935 -5377 1810 2268 -3221 -2777 1583 -1120 -3635 1828 3216
966 3216 -3466 -3224 5696 4919 -4731 -3603 6474 5348 -3347 -1651 4683 1968 -2461 1139 2880
981 2880 -3692 -2427 6078 2520 -8600 -5165 7309 3671 -8608 -6051 5143 4338 -4959 -5733 114
996 114 3203 1620 -1581 -3008 -27 4714 3454 -2860 -3844 3636 7523 1286 -5280 -2142 5607 5379
1012 5379 -2246 -6280 -230 7636 2297 -9272 -5589 7078 5212 -7958 -7710 4343 3775 -4744
1026 -4744 -3268 1898 -773 -1841 3709 1937 -5508 -1343 8399 3082 -7658 -1454 9654 3283
1040 3283 -7578 -1055 8728 1404 -6641 1331 5671 -3516 -4895 4743 2747 -7455 -3780 5662
1054 5662 1055 -6628 -2763 3165 286 -3059 -112 886 -910 147 2201 -56 -1911 1846 4838
1069 4838 562 -3439 290 5067 3048 -1927 -2665 1029 4225 1558 -5121 -4361 4392 5118 -5345
1084 -5345 -7108 3131 4175 -4928 -5267 2496 1945 -2795 -579 850 -3296 -1011 5883 2094 -6057
1099 -6057 -1125 8293 2969 -6844 -1105 8530 2768 -5904 -226 5935 -494 -4228 2026 2192 -3504
1114 -3504 -1426 3537 -1589 -6172 499 4488 -3013 -5151 1791 2580 -3118 -2258 2943 1018 -2547
1129 -2547 443 3262 181 -1533 1980 2504 -605 207 2800 756 -817 1816 1060 -2432 -361 3423
1145 3423 -1044 -4805 -346 2990 -2214 -4307 754 1539 -2950 -2066 1861 -117 -3019 728 2888
1160 2888 -1580 -1992 3628 2826 -3041 -962 5041 2036 -3118 646 4131 -697 -2470 2872 2258 -3063
1176 -3063 -1326 2991 -106 -4247 141 2794 -2718 -4048 1430 1564 -3508 -2439 2748 918 -3323
1191 -3323 -13 3323 -465 -2490 2205 3423 -867 -728 3200 1192 -1916 1806 3294 -1300 -1808
1206 -1808 2667 1717 -3001 -1475 2307 -219 -3402 -356 1224 -1881 -2589 706 331 -2535 -588 2103
1222 2103 -660 -2632 1144 2673 -833 -1048 2530 2153 -1277 443 3385 241 -1674 2356 2627 -2168
1238 -2168 -1684 2986 1211 -3870 -1322 2512 -663 -3280 -507 1279 -1971 -2303 1107 123 -3073 -444
1254 -444 2542 -583 -2536 1405 3103 -877 -1748 2480 2288 -1143 271 2580 597 -1149 1619 1804
1270 1804 -1877 -1017 2375 514 -2890 -850 1904 -712 -3112 -260 1196 -1636 -1983 627 19 -1928
1286 -1928 -221 1533 -530 -1458 1609 1736 -901 -17 2899 1177 -947 1125 2488 -159 -911 1388
1302 1388 1458 -1628 -934 1483 -337 -2049 -706 859 -1325 -2037 381 185 -2368 -1291 1395 -417
1318 -417 -2202 456 2029 -851 -1110 1874 1821 -820 -37 2767 1285 -1017 971 2093 153 -1108
1334 -1108 1041 1528 -1152 -1184 918 81 -2043 -715 651 -1019 -2209 -456 602 -1075 -1637 374
1350 374 234 -635 -231 377 0 406 1045 482 57 990 1662 347 -422 1302 1477 -198 -455 610 294
1369 294 -746 -294 80 -944 -1096 87 -385 -2153 -1450 597 -159 -2066 -805 1085 94 -1367 -149
1386 -149 1158 320 -92 1217 1193 364 530 1377 898 -470 71 1545 533 -712 -360 388 387 -803 -817
1405 -817 -542 -376 -807 -698 -1062 -407 -107 -406 -740 -656 -26 389 23 174 9 445 1049 846 -21 156
1425 156 1669 1450 -15 -564 892 1392 -224 -967 -130 790 -454 -1057 -640 -365 -945 -417 -516 -1093 -1146
1444 -1146 -261 586 -1032 -1614 271 1236 13 -963 586 1966 548 -598 590 1670 658 300
1460 300 836 850 -424 -95 1136 85 -1107 -305 708 -529 -1768 -1314 352 -312 -1558 -1118 211
1477 211 186 -752 -323 183 -63 -318 583 1006 -103 -75 1333 1238 152 -25 1180 1325 354 -1009 397
1496 397 1432 274 -1558 -423 804 -655 -1511 -150 247 -1409 -862 336 -433 -1746 -247 1050
1512 1050 -303 -1539 246 1774 4 -1143 618 2364 962 -1094 580 2190 -98 -610 1295
1527 1295 807 -1086 -327 798 -250 -1092 -44 459 -879 -1270 -482 268 -449 -1255 -662 416 -208 -735
1545 -735 -137 832 -205 -245 1116 982 216 19 775 676 730 394 328 410 650 -304 -76 777 -413 -1226 -6
1566 -6 214 -1118 -1314 92 -276 -1800 -677 607 -210 -1239 -289 652 249 -596 54 1464 623 -535
1584 -535 689 1830 336 -189 1015 1342 -409 -410 1372 39 -1114 14 868 -598 -1133 -292 -264 -914
1602 -914 -776 -233 -241 -869 -1004 -275 327 -159 -267 732 326 -37 615 1010 632 328 820 224 205 950 481
1623 481 -417 437 646 -332 -569 416 -488 -1063 -252 190 -676 -1342 -174 -178 -941 -904 464 234 -654 -740 808
1644 808 646 -402 264 1148 581 121 746 1460 -296 -181 1113 636 -440 -73 816 -346 -961 -419
1662 -419 98 -450 -930 -411 -419 -843 -558 -167 -461 -711 -189 239 -316 -172 550 362 35 678 916 428 490
1683 490 826 516 -213 495 808 13 -501 266 242 -649 -1110 207 -162 -1052 -540 -94 -559 -1217 -516 123
1703 123 -333 -743 347 886 -630 -346 1165 889 -400 459 1304 444 169 684 1041 -85 143 738
1721 738 387 -327 -156 29 -80 -545 -411 -161 -566 -963 -656 -311 -659 -670 -269 -444 -284 55 186 -59
1741 -59 168 694 336 -30 653 914 11 688 914 344 -115 649 498 -133 -563 157 218 -604 -821 -236 -268
1762 -268 -649 -523 -24 -412 -880 -579 195 -252 -463 348 633 -373 73 728 875 228 466 806 617 484
1782 484 515 510 192 -7 180 -19 -272 -87 -303 -681 -685 -414 -596 -808 -414 -274 -423 -446 -143 151 -283 -45
1804 -45 499 -73 -359 441 1060 334 -111 703 890 307 139 374 596 -121 -106 446 50 -890 -358 152 -468
1825 -468 -534 -643 41 -730 -808 -301 -38 -181 -227 -333 10 -113 32 492 167 238 441 566 553 576 355 279
1847 279 399 578 -37 32 364 114 -719 -515 3 -314 -1067 -590 135 -590 -923 -485 234 -581 -749 169
1867 169 568 -345 -193 772 427 -246 283 1165 542 15 402 795 371 -678 244 810 -192 -219 -6 140
1887 140 -616 -663 -231 -290 -825 -888 -299 -427 -467 -501 -303 67 -136 -185 -16 450 24 64 462 560 402 192 594
1910 594 806 293 42 462 447 -186 -475 213 288 -809 -726 255 -339 -1198 -536 -6 -229 -828 -471 270 47
1931 47 -663 187 731 34 -262 224 805 224 -117 889 981 115 39 586 626 -164 -208 183 59 -597 -577 -166
1953 -166 -211 -538 -794 -95 -103 -524 -857 166 175 -586 -514 479 469 -232 163 600 761 142 221 910 606 -4
1975 -4 341 886 142 -332 217 418 -52 -693 34 104 -576 -919 -168 -83 -714 -671 -88 63 -497 -232 300 176
1997 176 -117 -251 517 669 -34 143 794 764 -152 114 803 477 -155 24 398 129 -669 -283 279 -357
2017 -357 -610 -104 -195 -573 -858 -226 106 -810 -601 229 382 -389 -134 422 213 -176 535 547 242 187 321
2038 321 765 473 -3 208 408 -13 238 -227 32 6 -491 -509 -327 -293 -255 -638 -461 -177 -657 -491 48
2059 48 80 -557 -277 602 412 -504 437 685 -146 21 775 623 -150 239 869 392 13 -83 286 -47 -685
2080 -685 27 239 -419 -993 -264 -26 -773 -770 206 -111 -634 -196 451 -112 -175 464 383 268 409 625 30
2101 30 171 609 437 12 434 563 138 -189 180 162 -436 -212 -83 -56 -719 -331 36 -259 -1011 -345 441
2122 441 -334 -656 368 589 -612 -269 968 574 -533 338 998 100 37 519 621 -62 149 609 427
2141 427 -456 -34 530 -265 -671 -191 56 -583 -660 -180 -174 -663 -474 14 -416 -370 481 461 -226 28 407 109
2163 109 -112 599 637 -160 37 721 281 -91 279 568 -280 -470 198 214 -726 -790 117 3 -938 -411 518
2184 518 -413 -959 130 469 -405 -342 662 391 -424 140 871 351 -231 455 706 108 -214 369 369 -216
2204 -216 -135 492 59 -484 -133 252 -224 -558 122 -72 -1020 -505 -27 -372 -569 119 194 -352 90 738 -84
2225 -84 -92 369 759 142 51 689 682 -75 103 648 292 -322 23 441 -264 -669 54 119 -665 -694 -18 -222 -769
2248 -769 -128 373 -523 -646 255 115 -442 22 629 383 -175 513 886 175 220 644 596 67 12 397 323
2269 323 -273 17 398 -120 -525 32 79 -637 -271 -118 -438 -812 8 246 -410 -381 177 170 -452 -164 627
2290 627 119 -123 572 681 -68 20 461 455 -120 272 546 174 -293 88 301 -460 -361 -54 -78 -588 -606 54
2312 54 -408 -753 -207 63 -535 -314 364 162 -54 93 871 67 157 347 793 10 126 715 448 -51 239
2333 239 526 -166 -205 117 19 -410 -551 -202 -133 -823 -173 -17 -412 -317 122 -104 -504 -80 275 7 -154
2354 -154 311 569 238 -149 493 690 15 271 522 543 -145 54 329 212 -513 121 83 -441 -405 -125 -193
2375 -193 -590 -364 -82 -361 -289 -142 154 -201 -190 326 -38 138 384 511 246 85 573 203 233 292 372 281
2397 281 -129 40 111 -370 -115 118 -24 -463 45 196 -469 -753 49 110 -354 -524 233 35 -491 -127 530
2418 530 177 -238 413 482 290 69 472 343 -30 68 367 260 -191 -80 132 -51 -344 -298 -12 -415 -456
2439 -456 -251 -224 -235 -197 -411 -28 -310 -58 6 94 27 45 190 211 338 306 202 460 531 253 220 427 380 -118
2463 -118 -8 254 234 -409 -211 138 -438 -767 -128 -141 -505 -348 14 -108 -339 -219 150 482 13 -148 317
2484 317 293 156 366 687 371 -101 455 465 -50 78 320 56 99 -171 -73 -39 -226 -381 -489 -97 -129 -321
2506 -321 -341 -37 -395 -283 -167 34 -154 -74 278 255 -32 140 376 87 369 284 251 260 149 242 394 133 160
2529 160 260 -8 -158 -308 -182 -105 -407 -126 -284 -407 -189 -367 -85 -222 39 -24 -25 47 158 148 14 295
2551 295 207 284 357 254 186 265 155 237 257 104 -136 -30 -340 -61 -234 -395 -486 -351 -306 -530 -610 -227 42
2574 42 -110 4 -54 -111 33 209 252 341 291 535 169 -137 331 409 176 156 262 41 67 -131 58 76 -392
2597 -392 -312 -41 -209 -373 -213 30 -329 -445 -94 150 -125 -183 230 183 -145 193 350 185 -22 135 425
2618 425 164 -68 341 315 40 -21 -19 208 -94 14 -183 -205 -395 -234 -265 -529 -129 -88 -426 -326 -137 -217 -298
2641 -298 56 135 -105 -26 174 337 157 290 447 297 -17 327 381 318 67 8 102 -208 -429 48 -54 -705
2663 -705 -353 14 -495 -542 14 1 -244 -376 229 122 -156 -192 218 33 -81 -96 394 228 99 348 563
2684 563 148 122 120 75 -70 171 124 -199 -223 -98 -166 -307 -127 -184 -426 -337 -109 -188 -122 -56 -5 116 8 138
2708 138 255 81 216 510 230 194 1 346 274 70 138 418 168 -533 125 266 -389 -262 115 21 -241
2729 -241 -355 41 -356 -551 -138 39 -294 -349 -62 284 198 -34 605 164 61 243 454 303 -118 417 556
2750 556 -116 21 428 15 -127 104 -128 -159 -53 43 -160 -259 -188 -54 -203 -273 -113 -47 -187 115 80 -79
2772 -79 -9 197 237 158 -16 397 511 97 135 478 193 -279 281 155 -50 -285 -23 34 -242 -197 107 0
2794 0 -414 -157 -8 -182 -305 -297 -99 -77 -213 159 199 -127 310 364 17 94 296 390 66 245 268 161 72 112
2818 112 170 98 -211 -57 -83 -136 -301 64 -360 -272 -165 -18 -229 -161 -19 54 17 97 450 63 -7 98 445
2841 445 152 238 404 211 47 188 451 23 -26 29 -19 -34 -229 29 -284 -365 -221 -79 -409 -439 -367 36 88
2864 88 -383 -23 361 -24 96 182 209 -45 486 278 356 294 170 243 189 229 204 58 175 91 47 -196 -64 -61
2888 -61 -170 -153 -135 50 -89 -158 -57 -262 -87 -92 59 -167 -164 88 65 -52 -61 157 113 56 132 618 323 -177 -108
2913 -108 69 37 -160 111 125 -148 -141 -144 254 -373 -226 -32 -251 -435 -95 -96 -57 -307 -85 127 270 113 83
2936 83 445 230 199 183 279 29 144 96 381 -25 -158 18 -9 119 -56 -240 -223 -102 -224 -281 56 -171 -166
2959 -166 -278 15 -18 -240 -142 120 -26 96 161 212 60 71 207 142 249 88 415 110 55 104 280 11 -246
2982 -246 -127 102 -231 -309 -293 -7 -88 -263 -6 -129 -101 -93 91 13 -3 152 249 79 231 145 215 130 146 351
3006 351 212 30 147 128 108 -17 -124 -110 -117 -243 -81 -250 -107 -6 -218 -1 -225 -98 -195 16 -55 -102 -175
3029 -175 47 108 182 182 342 182 130 247 115 255 26 23 174 201 129 16 5 -26 -164 -48 -200 -51 -283 -171
3053 -171 -29 -210 -223 -125 -231 -75 44 -28 -61 33 59 -38 276 254 -12 246 191 381 -94 164 200 16 -149
3076 -149 221 -106 82 -304 -408 -200 313 -133 -112 -11 -264 15 -170 -263 -109 -39 -56 -13 -51 180 45 141
3098 141 135 198 263 190 14 69 55 304 -22 -55 34 -15 112 108 -104 -252 -79 64 -291 -175 -218 -283 -7 73 -82
3123 -82 -306 32 277 197 -194 173 -117 63 83 172 98 45 313 39 189 90 185 -49 -31 -89 -362 -223 110
3146 110 -104 -263 -397 -128 -380 -125 -115 -225 -167 -171 63 -59 -33 150 155 54 8 84 336 97 247 266 195 52
3170 52 160 189 276 55 -13 -36 -15 -50 -6 -81 20 -194 -261 -227 -58 -100 -174 46 -117 190 -7 31 -93 72 183
3195 183 126 122 295 265 266 87 148 132 102 28 26 -47 -48 -102 -156 -81 -89 -211 -196 -59 -113 -259 -63 10 51 -80 -339 67
3223 67 -57 132 14 194 264 -64 32 101 17 278 112 70 211 366 -120 -131 -180 119 63 -175 -329 -92 52
3246 52 37 -367 -194 -63 -112 182 -34 -152 20 293 -65 222 75 230 191 235 41 219 4 110 234 43
3268 43 71 208 -150 -163 181 66 19 -242 -145 -186 -28 -177 -315 -138 -137 -98 64 -177 -197 43 167 100 134 367
3292 367 141 62 -46 290 68 215 161 -4 62 131 220 -199 -80 -2 -5 -175 -291 -119 -54 -39 -295 -85 -179 -243
3316 -243 -133 -30 -27 161 -172 96 197 -60 91 -68 98 230 216 -94 202 161 124 -156 -24 -29 -280 -117
3338 -117 -234 -115 -149 -197 -26 -60 -150 -292 43 -98 16 -143 35 126 117 137 152 7 48 209 63 -9 157 230
3362 230 342 90 67 82 142 49 -240 -29 -67 9 17 -251 -71 -85 -57 -176 -19 -182 -29 -50 -77 64 53 -19 101
3387 101 120 252 -90 230 206 69 174 223 135 -62 101 72 -108 -122 59 -151 -111 -111 -261 -180 -415 -293 -126
3410 -126 -250 -272 -137 -91 -76 196 37 29 -58 63 198 239 -6 337 219 175 108 -71 234 178 6 21 12 42 -118
3435 -118 -99 -65 -103 2 -290 -347 -202 -94 -237 7 87 45 -104 139 -73 127 109 171 -171 -36 165 279 36
3458 36 -39 236 215 174 124 34 -13 -143 16 55 -59 -77 -87 -123 -174 50 -112 -144 -216 1 64 122 -73 -23 52 -39
3484 -39 131 18 -38 208 115 185 -56 160 48 270 -6 -8 -69 -266 113 -83 -184 -436 -218 -65 -49 -182 -76
3507 -76 -19 -274 276 231 -144 -83 272 63 67 306 -45 383 285 -156 246 134 -101 157 187 173 72 29 -107
3530 -107 138 -234 -164 -118 -148 -189 -15 -192 -227 -147 -286 -163 -33 109 183 178 -37 -86 139 111 2 -99 140 120
3554 120 96 218 185 -38 316 -153 -30 -18 -103 -48 -17 27 -228 -127 -63 78 -239 51 -340 30 -179 48 78
3577 78 202 -48 -35 140 118 -132 64 55 94 200 -99 -30 -92 198 47 -124 22 -156 -23 -6 -148 19 -87
3600 -87 -30 -400 -287 -138 -201 -240 -146 59 -55 97 107 209 336 135 266 53 -25 11 -16 164 -194 55 59 123
3624 123 64 192 -272 -226 -91 -293 -74 -16 -220 -178 -260 -34 97 63 46 -117 166 27 101 106 128 64 47 -43 277
3649 277 378 128 192 -163 8 129 -96 212 -57 -136 -327 -240 -116 -96 -120 -81 -136 -211 -128 -119 15 -346 10 57
3673 57 45 -99 -211 216 175 113 -7 54 143 32 141 148 335 197 52 164 131 -5 103 184 7 33 -33 -88
3697 -88 30 -87 -65 -157 -121 -315 62 -203 -174 -45 62 45 173 -112 -14 54 28 51 101 279 217 33 39 188 137
3722 137 -34 155 56 -108 -294 -249 -147 -115 -163 -51 96 -27 -227 85 7 27 300 -85 -18 191 28 -16 27
3745 27 213 103 -31 220 168 -24 41 -90 -18 -32 48 -38 72 -152 -143 -114 -23 -234 49 -94 -89 -38 12 -28 -151
3770 -151 -99 144 157 91 177 134 -146 -188 -129 -98 129 46 -110 285 76 94 161 5 84 -9 52 -151 -77 -263 -111
3795 -111 -284 -44 90 125 -144 -33 204 -83 89 238 5 142 -5 -50 117 28 145 152 -50 57 8 89
3817 89 86 59 -97 35 -54 -123 -27 -150 -75 147 41 37 -125 50 -193 -225 145 -25 -49 157 100 46 200 87 24
3842 24 217 -35 56 176 2 101 -74 -64 192 71 -30 -369 -57 -126 -9 -262 -176 24 -209 -100 -185 -254 -75
3865 -75 -238 16 -56 -105 -76 -14 105 125 4 78 263 411 46 -35 58 125 151 140 -20 -23 296 -231 42 76 -270
3890 -270 39 -116 -21 -42 36 -38 138 -121 11 53 -25 195 27 233 69 19 142 232 50 3 -84 54 -30 -8
3914 -8 53 -42 -53 74 9 -207 95 54 -173 -54 -133 -29 -56 -11 65 -135 -189 -28 116 14 -124 159 316 34
3938 34 96 117 54 -45 148 161 188 172 -90 18 28 -9 -61 -74 -299 -369 -166 146 -215 -301 -168 89 142 -74 70
3963 70 -34 -29 49 91 189 43 -6 26 176 108 22 222 -5 9 245 60 170 282 -219 -8 40 -74 -63 -159 32
3988 32 -105 -82 31 -40 -160 -124 133 46 90 16 -156 131 2 103 207 249 68 70 290 12 121 -30 7 -90
4012 -90 -46 137 70 -123 -79 -195 -42 -186 240 -6 -163 -11 61 25 95 6 223 85 2 35 227 93 156 -50
4036 -50 -23 -164 -166 104 341 324 46 199 42 71 68 28 -137 -88 -7 -146 7 -149 -3 34 46 -286 34 25 125
4061 125 35 -92 -40 -42 80 177 -42 22 -68 71 42 136 287 81 10 51 -168 68 -184 123 -30 -23 -79 -107 -29
4086 -29 -104 2 35 26 -67 142 -15 -156 18 118 -71 114 68 84 157 113 85 83 98 -25 156 -131 -151 -110 -18 100
4112 100 11 -255 -144 -118 -152 -189 -66 -51 -149 -209 -192 -317 139 -219 54 1 -93 124 53 239 -199 26 252 220
4136 220 53 235 -1 125 -189 -85 -143 39 -123 103 40 -99 100 90 92 -128 -174 145 -156 33 -42 -251
4158 -251 -54 -23 61 -123 123 20 50 144 -13 220 51 33 141 -60 239 58 54 67 67 -53 79 -34 -122 -14
4182 -14 -95 -7 -175 -73 -180 40 -1 -86 72 63 47 95 -188 94 87 -8 226 94 17 159 -173 -89 0 225 14
4207 14 -158 104 -127 -110 135 106 -98 164 -72 83 -242 83 79 -119 -219 -47 30 -46 -69 -71 -76 113 171 105 69
4232 69 213 -69 183 -101 123 33 -72 201 267 148 19 19 18 55 -173 -18 66 -255 -118 -55 -126 64 -97 -13
4256 -13 169 192 121 -87 117 -7 -91 307 214 48 -209 8 94 -32 -18 -72 57 -288 38 -147 -140 -139 78 -81
4280 -81 -142 83 75 57 -219 -36 -53 26 8 128 55 243 16 190 79 117 -68 14 45 -12 2 146 -99 45 227
4305 227 -50 51 -14 -68 125 -35 -18 -264 -158 -73 -131 -59 -104 -72 42 -14 207 59 207 36 -117 24 52
4328 52 215 42 89 18 173 49 -23 12 -51 114 -147 -65 -55 -139 34 2 9 -99 -54 -290 -38 -99 -95 -27 -98 133
4354 133 11 58 56 137 165 223 -12 -28 256 125 137 34 148 29 71 57 64 -149 -96 42 -233 -103 -36 -171 93
4379 93 0 -109 -70 -59 -227 -114 3 113 -23 65 129 127 91 112 -110 265 236 -48 -62 240 -116 -42 -68 60 234
4404 234 -144 -185 63 123 -151 -8 -84 8 47 55 -72 -224 -38 -58 52 -178 114 91 9 -21 128 54 175 36
4428 36 114 59 223 65 161 238 -78 13 169 -128 -119 -10 74 -100 -180 -74 166 -85 5 193 -49 -27 -83 76
4452 76 -5 300 74 15 -45 -60 -67 280 75 93 36 4 163 119 -83 -54 -89 -274 95 -247 53 -66 -71 117 160
4477 160 -97 -188 250 146 -206 -37 -69 -26 113 88 -50 67 -19 126 279 -95 -124 102 36 24 -14 -40 -176
4500 -176 -44 -180 -152 -103 -41 -11 -41 -171 96 -105 -70 -57 -78 8 42 42 112 18 57 -22 47 125 2 -62 75 39 30
4527 30 24 -36 -103 -211 163 258 153 10 49 118 -31 -144 -30 -37 19 -234 -32 300 -90 30 -382 -89 54 -28
4551 -28 110 -90 167 164 186 -2 151 -10 -59 -81 13 -152 -70 160 -89 -118 -62 -17 -50 166 55 81 65 210 -139
4576 -139 46 -202 16 45 -7 -147 -44 199 -181 1 110 58 -17 70 -41 178 205 303 110 162 54 -149 -110
4599 -110 -40 7 -13 -176 28 -139 19 -166 -94 -1 -148 11 203 227 144 -2 -50 -73 -24 109 58 -221 30 22
4623 22 -89 56 54 62 -49 -31 7 -157 -153 -56 -86 20 -364 -168 -113 -175 62 -219 -128 36 -73 -170 -200 349 -65
4648 -65 136 -85 -160 -23 131 127 -84 67 -77 -268 71 -105 -145 -38 15 91 -96 -61 34 -80 45 -100 -141
4671 -141 -238 -133 -155 225 59 140 23 -88 -312 122 86 92 197 96 108 -115 75 5 90 -34 -12 7 -169 -77
4695 -77 104 -144 202 -23 -111 -21 -124 -64 -73 -23 49 -72 -68 81 -149 -170 147 -11 -241 -61 197 35 50 19
4719 19 66 46 -20 -47 52 146 -58 -1 29 -3 -201 -201 -27 179 -100 -125 70 -62 -52 112 -190 99 139 54 127 -63
4745 -63 213 -10 39 11 155 82 77 -25 -72 293 -158 53 130 93 -214 -116 56 -56 -12 -76 -116 -205 128 -63 36
4770 36 -60 64 -219 -68 195 -44 86 305 50 -137 14 127 -59 21 -4 248 39 19 120 -5 225 273
4792 273 -2 37 133 56 -56 -244 -77 134 42 -264 -16 -106 256 39 50 195 -119 40 6 38 181 14 -89
4815 -89 -268 77 -23 119 41 27 4 290 156 -60 41 85 15 82 -113 -156 91 -101 -37 -120 -7 -93 139 -9
4839 -9 24 -80 86 -53 -4 52 -150 80 191 57 -29 79 16 127 117 -49 124 58 -187 -87 18 -19 42 -157
4863 -157 2 -166 53 103 102 -232 45 64 -45 92 9 -106 -170 98 -9 47 149 57 63 -24 44 132 24 -47 90
4888 90 -30 92 -48 -76 -7 -78 -151 157 -88 20 158 96 -163 188 -196 -15 87 50 234 -84 119 188 137
4911 137 -86 159 -76 108 -130 10 87 -99 43 -179 -136 25 -34 -251 -143 135 0 -60 119 236 22
4932 22 -94 31 -224 -26 -84 60 207 313 -105 28 358 77 13 -15 119 -64 -45 75 -45 -275 -73 -20
4954 -20 190 -74 -26 3 -12 -70 -187 56 -102 -13 -122 14 -153 10 -152 306 -3 166 166 -36 117 20 8
4977 8 218 153 -23 -12 -230 -56 68 57 -62 63 -53 -176 88 -50 -246 -215 25 -4 123 156 36 -43 147
5000 147 7 66 16 106 63 -26 333 39 56 123 42 225 -22 2 81 58 -225 117 -89 53 -4 -148 -157 122 -101
5025 -101 247 -75 155 -75 -76 -155 263 12 44 125 117 204 38 150 109 -143 7 206 -6 8 74 23 -117 -28
5049 -28 -211 -177 -12 -45 145 -125 16 159 -102 -9 111 -116 -45 37 -29 -34 -76 -77 180 107 192 229 -98 -103 122 37
5075 37 138 304 -22 121 10 6 -75 23 -404 154 17 -133 199 -38 -27 115 184 -5 -69 -159 76 97 26 15
5099 15 233 231 51 -266 15 107 -29 91 85 142 64 137 196 62 86 -1 -21 -118 12 79 17 -162 -189 176 -209 -164
5125 -164 -145 54 8 -139 85 136 -102 29 146 52 116 157 156 29 9 -82 157 27 41 51 -75 123 -164 -150
5149 -150 -78 -104 -6 -151 -37 82 -163 22 10 -218 -149 -74 130 5 109 9 94 94 32 208 129 40 -113 -113 214
5174 214 -1 24 163 105 117 -148 172 -37 -89 32 -24 -227 -267 44 65 -123 -172 -93 80 -10 42 24 84 127 -35
5199 -35 -24 -88 -156 87 85 -100 57 81 -60 29 -80 -85 -159 115 41 -138 -110 -110 -128 142 313 0 79 145 95 -239
5225 -239 89 -93 52 160 -14 -207 69 236 68 -21 46 -130 43 60 -176 101 -95 123 -123 -114 -156 -91
5247 -91 10 -173 161 62 79 108 96 -188 -38 -98 50 -221 60 187 -12 61 172 89 18 42 -12 149 37 195
5271 195 -29 87 122 -22 82 61 15 133 54 -29 135 -33 22 -50 -250 258 14 -177 167 -127 -106 65 63
5294 63 -136 200 102 -177 327 9 118 243 125 82 73 46 56 8 -74 142 -159 -231 41 103 20 -97 62 104
5318 104 -103 20 -97 117 -33 -160 -68 -14 14 -45 -156 59 254 -83 50 -32 -73 -85 72 -98 28 -66 -197
5341 -197 -113 -147 -80 -169 -45 56 -254 -32 24 -79 108 -71 -82 -97 157 -121 -40 49 173 16 26 -139 -6
5364 -6 -14 111 221 154 6 -49 37 125 -242 -74 22 -105 -144 218 -117 -93 -268 109 9 -38 -17 -272 30 83 -64
5389 -64 -202 88 -108 -16 52 -61 186 17 66 55 34 116 -26 296 63 145 -28 -57 -49 -71 115 109 -112 -88 -33
5414 -33 -91 -113 -177 23 -194 149 -12 207 120 95 53 -29 -99 9 177 161 48 66 -63 163 243 -73 -67 -131 15
5439 15 75 -118 -17 -15 -147 -34 -167 -23 -18 -54 -103 25 -67 52 70 -36 -34 165 -91 115 72 -105 86 34 33
5464 33 53 -312 -49 118 -101 146 -97 -207 8 30 -161 -80 -1 -133 -123 -72 29 162 -158 -193 -109 -71 -122 177
5488 177 -60 145 160 13 158 89 -71 -167 149 36 238 -1 -103 185 -72 105 -9 -52 -102 -71 131 -16
5510 -16 57 -101 169 -221 51 27 128 192 72 133 161 62 -48 6 100 161 474 27 58 242 129 145 206 -7
5534 -7 -212 -198 -41 -26 -148 -69 -69 52 49 -122 -95 -56 -20 -4 -48 -30 -250 -92 147 41 147 -9 127 108 -148
5559 -148 167 160 217 -133 -56 -72 69 -17 -225 97 -220 -125 -34 -7 -62 21 -21 -78 105 53 24 -27 221 218 -15 124
5585 124 191 -15 -68 76 59 -207 -91 31 -113 -75 20 50 -176 -215 -108 62 -79 121 64 3 -176 21 69
5608 69 114 43 32 -72 -248 100 -71 -64 -40 56 28 347 135 -16 51 -170 209 13 -173 47 239 165 -1 20
5632 20 -87 -157 -20 66 -94 -29 -54 -69 -26 -30 -343 -100 145 -51 127 -133 -22 -29 59 -200 -62 -70 -241 106 195
5657 195 -15 40 107 -50 -64 -39 31 -79 -38 -102 -56 13 -5 -208 -43 -146 -66 -102 41 -195 -11 -106 80 10 164
5682 164 -97 246 100 -4 338 213 -102 111 77 52 23 50 72 -61 7 108 -275 159 -35 -133 151 58 35
5705 35 -63 49 75 -83 -187 29 81 22 62 14 -104 5 -69 160 -16 53 -125 19 -113 -130 -50 37 -124 -9
5729 -9 -36 -15 98 -80 -93 45 52 -123 -146 -170 -148 -174 4 22 -151 -10 96 -20 -41 131 111 31 -20 322 -50
5754 -50 34 20 -40 87 122 99 95 -63 111 80 -25 -44 -143 -59 -1 -254 60 -72 -22 106 -167 -67 -51 -27 -67 170
5780 170 172 171 165 -206 118 31 -112 273 -126 -203 112 -228 -41 140 -62 25 62 -179 26 -63 -86 49 94 -210
5804 -210 -194 -275 -102 154 -78 288 70 -32 -31 67 95 51 -13 104 173 -13 -291 -62 -143 -179 -158 -31 -6 81 32
5829 32 0 -279 28 -206 -85 -62 -141 -10 78 -41 5 -90 9 73 -5 21 -82 217 33 154 15 134 16 100
5853 100 -108 178 -42 31 -197 -57 125 -229 -174 -269 39 -19 -51 -39 -104 -157 77 -28 149 -30 -45 68 38
5876 38 -114 -7 -2 -7 37 -163 269 22 73 -68 112 -93 -44 234 -91 -5 -166 -2 -89 131 55 27 -1 -16 54
5901 54 197 -186 -67 82 -15 92 -126 -158 -25 -67 88 -184 185 21 10 179 98 118 -135 81 3 -124 -94
5924 -94 -86 -148 -8 51 113 95 -171 -64 -113 71 -87 -82 -108 149 101 -78 157 -85 3 -95 -137 49 -17 -134 20
5949 20 -24 -94 -143 -27 -94 142 -146 -181 -235 92 -152 -87 -62 1 -18 -157 17 -47 132 -27 -72 108 -40 -140
5973 -140 -50 46 13 260 8 164 -36 28 133 -86 2 -95 -61 -150 -3 24 -118 -54 -59 -18 -99 -199 -98 -13 106
5998 106 -91 -49 0 95 265 25 0 62 27 185 26 -73 172 -86 -162 218 123 308 -133 -3 -263 -6 163
6021 163 -69 46 -223 -5 -89 15 62 157 -3 -39 -201 -36 60 115 141 73 -95 -44 188 -243 -116 -209 -194 31
6045 31 -70 82 113 29 -18 -22 -31 -70 -388 -126 38 37 -5 -133 -225 107 19 -107 192 -80 214 -56 -5 161 -161
6070 -161 52 -152 142 182 -19 -31 -108 -65 -80 16 20 211 -59 -53 -74 -54 -166 -96 -93 34 216 41 44 -172 58 42
6096 42 147 51 -184 73 72 -172 188 242 244 131 -58 17 111 39 8 96 195 -126 29 153 -66 -101 -64 -96 38
6121 38 145 39 -150 -32 148 32 -159 93 -2 -6 -60 68 58 75 134 -13 -118 7 220 97 -3 -84 141
6144 141 -146 -33 88 137 -222 -53 0 -137 227 79 -166 27 -64 -124 -77 29 37 77 -91 91 -31 204 -65
6167 -65 68 -162 105 -19 -57 -118 -36 -45 -29 105 2 -34 -58 -2 -180 20 -51 118 -2 125 90 95 119 -12 -160
6192 -160 13 64 85 106 -105 150 146 -31 40 145 11 80 -30 129 -99 -60 -85 -50 -43 26 4 -80 -11 143 99 -91
6218 -91 -343 -128 33 -35 3 -100 -45 27 161 14 280 3 -130 163 14 89 -75 -20 -122 185 72 25 159
6241 159 63 -80 -12 -266 -146 -9 42 -99 -48 -157 83 135 -4 16 -43 -21 34 0 -229 -6 205 9 -148
6264 -148 -100 170 54 65 -246 66 78 91 138 70 17 51 -39 -52 111 -6 -213 -46 35 -70 84 -22 -163 103
6288 103 103 74 -257 -18 182 -71 170 76 71 151 235 -109 5 110 -194 79 -21 123 -269 126 60 -107 -114 -8
6312 -8 52 -169 -195 212 -82 2 205 -67 -80 47 144 -24 15 85 42 108 7 8 207 118 -245 71 31 71 147 -60
6338 -60 -136 -1 50 89 -26 -14 -170 95 -90 -75 283 -12 27 -281 44 194 66 31 5 -52 -21 73 135 -201
6362 -201 -13 134 191 -128 41 87 -64 -87 98 41 5 151 -224 -274 11 -163 53 108 57 -49 -103 83 77 170
6386 170 -54 10 -28 48 -28 -14 -112 14 -216 97 -30 275 -38 -96 33 -35 20 85 15 -35 78 -216 -34 -20
6410 -20 -55 -17 -87 -76 -5 41 26 114 -45 151 77 212 79 141 53 346 88 -141 142 186 51 -75 104 20 5
6435 5 225 -168 -89 -27 101 20 -45 130 88 37 -1 93 15 -158 -100 -165 85 37 56 300 1 -54 -96 110 -126 -192
6461 -192 32 -12 58 -84 132 -20 -1 -48 -139 76 -31 -8 -20 -207 6 -134 182 140 -67 188 100 -48 -57 77
6485 77 -127 414 12 6 52 36 156 -14 -27 104 105 82 11 5 103 109 -68 324 -31 140 -12 32 -36 11 -70 142
6511 142 -32 -11 -47 -104 73 -60 52 -127 -82 66 143 101 125 16 151 -81 83 47 -15 113 -149 47 -11
6534 -11 -157 39 124 -8 28 -27 -3 -39 -50 42 -47 74 -47 -184 164 -81 -72 -164 85 -50 146 165 22 66 -41
6559 -41 23 -146 -71 18 -71 84 268 -58 -152 71 22 46 40 -109 -112 -38 -5 -68 -106 -240 55 134 -56 2 -37 -33 38
6586 38 103 -395 96 26 118 185 -41 114 83 90 -66 -65 43 -97 121 -125 -65 93 35 -19 -95 -46 -6 86 151 -36
6612 -36 13 -10 127 97 -77 -17 -49 106 254 -290 -152 25 -1 -49 -109 138 6 -52 -96 94 0 -262 -137 -108
6636 -108 67 99 -195 -113 -15 155 -68 23 -41 196 -80 87 103 -178 53 252 186 203 -91 -280 -100 -266 -165
6659 -165 -125 64 277 71 93 74 -232 -91 -98 24 161 84 -144 28 232 -115 167 10 -147 104 63 -155
6681 -155 79 -98 24 31 -102 156 52 71 45 59 138 102 27 39 137 146 -96 -149 109 24 -118 -153 -184 -193 33 -217
6707 -217 -24 9 57 48 -95 -126 84 166 -66 57 145 -96 14 -8 -7 47 -79 -26 -192 77 -197 -58 0 -126
6731 -126 -97 172 -17 5 -84 -165 -5 -75 207 21 30 -49 94 -49 264 183 46 114 125 -31 20 -29 -54 -119 -262
6756 -262 66 -121 -27 -29 29 164 135 46 -136 -24 187 37 -49 48 -74 -83 -44 -244 -91 37 259 -66 -102 -101 93
6781 93 194 134 -97 -199 -212 5 -2 143 -250 -59 -132 -6 7 -80 -257 2 -134 181 -24 -117 8 -226 44
6804 44 -174 135 130 26 30 -76 145 142 -3 131 -53 -101 -6 -42 -22 241 70 -59 86 -79 226 42 126 -328
6828 -328 -49 -56 -72 -16 -228 -12 142 51 -196 -53 -100 -53 125 -5 2 -37 169 -146 -62 -46 -181 -26 -19 -58 62
6853 62 -337 -152 -176 -105 -72 -15 62 -41 -187 96 98 -28 -57 -117 -204 78 -32 -27 15 49 12 -204 94 -18 3 95
6879 95 124 1 15 -106 29 61 -56 -63 -72 -197 -170 -111 -146 -13 -100 -75 -188 -69 -133 -41 25 -135 -136 -22 -10 -92 44
6906 44 -185 -39 -27 53 12 -7 -50 75 -32 100 103 -86 41 -75 -73 61 147 120 -110 -184 -120 -310 -114 -171 -259
6931 -259 17 -67 27 -23 88 -5 -145 -24 154 49 20 70 36 22 81 46 -65 106 -69 0 -72 15 217 66
6955 66 -10 15 -129 -105 103 102 -40 25 -214 117 -36 133 -73 21 219 -53 125 -27 73 158 135 184 3 -69
6979 -69 49 75 -28 2 -105 190 36 -102 99 -60 -157 -17 129 -16 -167 -35 -84 -186 85 -70 85 164
7001 164 -266 -108 11 139 22 -131 -145 -20 60 98 21 114 75 27 -124 -302 -10 47 -116 -46 13 -109 -251
7024 -251 -127 80 -56 -43 -19 -40 75 -129 -180 115 52 -16 276 59 188 125 -160 -80 -103 -223 54 130 -23
7047 -23 75 -26 -125 -64 -10 17 -19 -98 126 126 90 53 -93 -68 330 132 21 -183 191 192 7 52 292 258 -83 189
7073 189 -97 -5 -62 51 -31 -71 131 -76 55 -24 -45 142 -10 -315 -78 -115 -4 4 -185 -76 23 38 -72 20
7097 20 -83 -182 -113 232 57 118 -7 80 258 -149 -148 -31 -157 -30 204 28 -132 36 -4 -56 -115 108 -10
7120 -10 74 156 82 -322 14 -23 -33 16 7 -101 -111 -161 57 -4 -5 30 59 9 -62 130 -45 -89 202 -271 111 244
7146 244 248 -241 -190 -143 66 63 -134 102 -11 108 -174 90 112 23 -119 191 -72 49 90 40 112 154 101 -53
7170 -53 -32 110 104 77 -112 -104 -215 61 82 8 154 -53 10 -74 55 166 -66 -117 -32 -241 61 -75 38 158
7194 158 231 -17 3 180 87 50 140 119 -104 -61 -76 100 23 -12 144 187 -203 -241 15 40 4 -127 71 -89 -152
7219 -152 52 192 -181 70 -57 -46 26 -105 14 -91 -1 29 134 -6 -51 35 204 50 -69 -142 -186 -157 38
7242 38 -129 -234 -82 -303 -60 287 -23 39 -266 -39 -14 -141 -69 74 165 -65 -189 9 102 174 9 -66 -127
7265 -127 -71 148 23 -126 -27 270 -41 240 -56 -4 -23 29 -117 106 17 -95 -164 -201 -170 52 -30 -77 -1 -168
7289 -168 17 -94 25 -147 64 21 -39 75 -45 126 -196 -96 21 -117 -4 -11 -173 226 150 -184 -104 5
7311 5 -185 55 21 -238 -38 -56 -143 -174 -1 35 -29 -118 174 27 -338 244 -143 -103 152 -27 97 38 -5 -196
7335 -196 86 23 8 -4 -111 -221 267 -213 -107 44 -239 84 56 -177 -249 10 -174 -72 80 -106 46 36
7357 36 -125 238 -32 -72 163 67 71 -80 -259 -90 -161 51 -17 -183 -53 -113 65 30 -85 165 33 100 -208
7380 -208 -1 -242 35 53 -21 -166 -73 -72 7 60 -92 -27 32 76 -5 84 130 185 -130 9 -13 17 -42 171 -15 -156
7406 -156 -85 -168 133 71 -61 99 75 14 61 -17 -125 198 133 85 -130 17 -114 66 -193 214 -76 -52 -43 55
7430 55 -176 -53 60 92 -220 -34 263 82 -167 -84 -89 -34 -179 -1 -143 -53 137 168 154 -217 24 201 -113
7453 -113 -148 -67 116 -42 -142 226 105 34 23 -81 105 -22 38 177 -29 108 7 81 30 174 115 38 -56
7476 -56 -242 103 61 -153 -32 -106 35 -15 -38 -88 164 -42 -167 11 63 114 -161 -49 154 26 -188 -189 -79
7499 -79 96 -167 233 42 -144 111 -114 39 -138 -105 57 -14 -146 -154 -68 37 99 21 -1 -36 -61 44 248 90
7523 90 1 93 -61 69 -187 146 111 -246 -111 -80 7 -21 -56 -35 126 94 -254 -57 10 -72 97 -56 32 76 91
7548 91 -180 -11 -30 60 63 101 -62 -136 -125 -174 115 -52 2 -2 -28 190 -101 -195 -68 -38 59 -70 57 -35 20 -230
7574 -230 21 17 -6 -7 -181 -4 -219 208 15 16 -3 153 100 -41 25 70 34 -18 320 -143 -70 -71 -30 -214 -93 18
7600 18 -138 -123 218 5 -86 100 33 -42 17 -187 -159 106 -55 204 136 27 -79 -65 127 33 90 -150 209 -142
7624 -142 62 -86 36 77 31 -160 -17 -17 107 129 -180 -3 91 154 158 99 -208 -53 2 57 74 62 -105 219 -356
7649 -356 95 -32 54 97 -21 373 47 -102 197 49 26 -11 -7 56 50 -13 -144 22 72 36 -39 -78 -211 -184 -168
7674 -168 4 71 37 21 -71 2 44 73 -65 -34 66 -137 -32 290 -199 -75 -82 35 8 -59 65 -56 32 -155
7698 -155 2 -95 49 -79 157 66 152 -6 -12 -62 -31 -91 27 143 136 63 -122 -85 -216 15 77 107 110 141 -49 33
7724 33 -59 40 80 24 33 -19 -34 -88 0 69 20 88 66 7 50 -19 -137 -34 -88 -109 -67 157 106 106 -10 175 177 -141 77
7753 77 -130 74 216 -80 -53 69 -122 -71 -267 187 -218 -110 47 -96 -30 91 -49 -119 69 286 -68 -62
7775 -62 -219 -266 8 24 -10 208 -189 188 2 20 -100 -65 47 -35 -3 84 185 -14 -10 -34 -37 -7 7 -35 151 -96
7801 -96 49 48 -128 23 -11 -172 58 9 112 65 129 1 41 0 77 -5 111 45 -135 188 65 -117 150 -13
7825 -13 -14 83 7 -282 15 -30 -161 67 4 35 -101 27 110 -24 -95 112 -132 -25 -218 -272 35 32 -50 72 24
7850 24 133 -175 -101 -123 -18 -201 51 163 82 34 113 42 -276 -289 -109 -76 2 -204 -90 308 18 -65 -91 -53
7874 -53 247 173 83 -50 -53 49 -93 94 -7 155 -38 -105 13 -149 96 -25 8 -12 106 -102 68 113 -85
7897 -85 12 12 -24 -239 115 106 -122 143 -123 136 -20 75 6 95 148 -122 -82 -216 120 71 37 22 57 120 -90 -109
7923 -109 -163 64 81 85 67 10 -49 -131 -26 68 68 9 23 270 58 240 -66 -154 23 9 169 109 -190 -177 90 160
7949 160 332 -39 113 -229 55 -132 -89 -140 -49 -3 -16 -260 53 -116 2 224 -91 -76 227 -13 58 -51
7971 -51 43 -65 -65 83 -66 31 -110 -1 83 42 34 -89 164 -85 117 143 214 71 -54 -56 -30 -101 -107 24 -101 2
7997 2 -40 187 -65 90 -113 137 1 -21 -213 -26 -24 29 -79 -110 49 -92 -20 120 25 -21 21 -50 10 9 3 -115
8023 -115 -19 79 7 97 161 38 32 170 12 198 -27 203 -100 -45 -73 232 8 27 -197 31 11 -19 49 7 -50
8048 -50 96 -29 -236 -149 117 21 120 -294 -10 -108 44 27 49 -46 -112 -116 -110 121 8 52 102 166 80 -32 -321 3
8074 3 -6 -54 191 -94 211 -142 183 -208 -86 -232 18 172 67 -19 61 50 1 62 24 112 2 111 -122 44
8098 44 129 -449 45 -39 -105 51 -21 255 14 -2 -35 -89 -37 57 88 8 20 -29 101 26 141 -128 210 -56 -52 106
8124 106 -8 46 104 80 -137 129 -84 -38 277 -54 -29 -39 15 -110 -48 40 -36 -73 121 123 18 -75 116 50 -98
8149 -98 7 -142 -8 -24 -44 61 172 108 -101 90 116 -76 -42 -40 -19 115 -190 54 -19 -5 49 -124 209 -48
8173 -48 24 19 -48 -153 106 -88 228 -153 -15 100 274 136 -81 66 81 28 133 -79
8191g9
$$ Imaginary data points
##PAGE= N=2
##DATA TABLE= (X++(I..I)), XYDATA
0 0 0 0 0 0 0 0 8 0 0 -8 8 -8 8 -16 19 -24 32 -40 42 -56 64 -74 88 -104 125 -144 168 -194 223 -253 290 -331
32 -331 375 -424 479 -537 605 -678 756 -840 935 -1039 1150 -1272 1408 -1555 1716 -1890
48 -1890 2082 -2294 2526 -2784 3071 -3388 3747 -4156 4617 -5153 5781 -6525 7424 -8539
62 -8539 9964 -11853 14485 -18410 24892 -37471 70743 -344497 -747323 316389 527868
73 527868 -204603 -414458 192040 291440 -115073 -258508 -84953 -10238 135251 221861 -46819
84 -46819 -317289 -36226 254769 -26895 -315217 23658 345081 71757 -257664 -138595
94 -138595 39019 32995 56523 71783 -66674 -58848 131624 38899 -247910 -101555 279914
105 279914 196893 -148302 -114586 93364 29098 -73871 24451 72128 28592 83770 65240
116 65240 -143585 -146764 139576 171789 -99782 -75987 184261 54135 -255512 -85424 229036
127 229036 45515 -194369 59062 226942 -130637 -299457 79922 244222 -77356 -165881
137 -165881 118808 127339 -148383 -144033 66898 68748 -8754 46631 27663 -99759 -55629 73528
149 73528 -2214 -91803 60056 150970 -46445 -163168 844 82135 -43199 -39475 97283
160 97283 46503 -98163 -47217 43715 -30179 -51464 81246 92271 -52095 -67571 26133
171 26133 2484 -45332 37385 86783 855 -31908 21085 -13713 -66785 26612 102862 4095
183 4095 -53361 41765 32920 -105093 -59566 119325 72306 -97369 -32553 105858 -11955
194 -11955 -157257 -17126 143633 36487 -91514 -16382 50487 -24097 -58955 4398 34042
205 34042 29068 38307 -10806 -83160 -26215 76047 25537 -65726 9588 99723 -3623 -116598
217 -116598 -30161 74626 22116 -31200 18340 24023 -41726 -35970 14738 -7864 -21546 47715
229 47715 55257 -46536 -73090 15347 40266 -17948 -10749 44121 26042 -22053 -20287 -13279 -13535
242 -13535 31732 62545 -1314 -51725 8993 44532 -35939 -62306 44444 86398 -15923 -69957
254 -69957 -1076 26900 -26396 -24712 30845 27940 -10409 -12317 -14151 -32001 -6226 38826 19315
267 19315 -19142 2509 19129 -23967 -36807 18165 40257 3338 -4219 16611 -9320 -39699
279 -39699 -324 37556 4810 -16692 19689 20284 -39115 -44581 18373 33613 -7005 -10380 12581
292 12581 -3307 -28177 -13708 5649 6685 17706 21117 -13586 -31550 2690 19583 -8775
304 -8775 -7125 35101 29471 -24147 -31363 8850 15553 -4301 6291 23429 1753 -21422 -10021
317 -10021 -1507 -10950 3296 25984 6967 -23868 -15170 2702 -8249 -11601 14006 20536 -2490
330 -2490 -11161 -5379 -10266 -7495 15545 22317 462 -5722 7945 -1310 -20534 -3547 26389 18620
344 18620 -7705 -7260 3665 -7876 -16393 1288 15765 6750 -3084 -5625 -12534 -14391 -439 7962
358 7962 964 2442 9572 -3874 -21103 -9058 12778 11635 1488 5297 8033 -5167 -11055 -690
372 -690 7444 7534 10245 9674 -4558 -15627 -5813 7061 3496 -1942 3820 6278 -4903 -14982 -13325
387 -13325 -2832 9930 13107 -1957 -15700 -4844 8720 -2721 -16004 1911 26790 15335
399 15335 -15121 -20072 2845 16599 6949 -4636 -369 11888 10264 -8591 -21354 -5734 21575
412 21575 20588 -9282 -22763 -2027 13704 -2897 -21511 -6878 20644 17637 -12708 -27682 -8008
425 -8008 16862 12696 -8073 -9529 9571 15296 -3643 -19192 -6012 18609 22329 985 -15433
438 -15433 -5993 11527 7556 -10509 -9085 12157 17371 -5383 -20842 -8117 6153 3155 -1638
451 -1638 1798 -745 -9702 -4882 5479 -2918 -13660 4419 24501 5915 -25204 -14985 18738
464 18738 18691 -7817 -10712 10303 16342 89 -13632 -10167 5402 19169 13282 -12769 -23220
477 -23220 2824 22692 -1808 -30502 -7721 32957 17185 -32512 -33652 13539 31160 -3138
489 -3138 -26818 -3426 23616 10990 -17990 -19827 7401 26088 13830 -12008 -19435 3316 24815
502 24815 6486 -24664 -11080 31201 25882 -27365 -37140 14744 35783 -8405 -33380 3596
514 3596 27826 -6128 -30657 -2641 18435 -580 -10381 6143 5126 -13926 -6385 15080 4833
527 4833 -12228 4328 19445 -2267 -18603 2803 18028 -361 -9057 9753 11007 -12818 -13721
540 -13721 12311 12582 -15420 -13111 17554 13285 -22153 -22565 11359 18817 -7582 -16471 2438 12010
554 12010 -1166 -12562 -6382 7973 12600 4933 -5938 -10624 774 17062 9828 -16685 -12646
567 -12646 24568 26107 -22942 -35625 16417 39948 -8812 -39624 2344 36398 -1177 -39435
579 -39435 -10238 29181 11741 -20268 -11405 7228 1087 -3266 4062 -2414 -8262 10847 17505
592 17505 -11932 -22814 11913 28785 -4136 -23348 5556 24463 -815 -21475 -3047 17529
604 17529 6583 -9058 -5717 737 -1363 -1900 484 -3147 -4361 3315 4319 -7521 -10596 2048
618 2048 8951 499 -6406 -377 6544 2031 -5264 -1178 8007 5193 -3046 1661 7757 -2824 -10489
633 -10489 5362 16240 -2425 -16520 1755 16689 -3059 -22149 -3015 20270 4756 -19894
645 -19894 -10068 11113 5860 -10120 -7389 3346 6041 3511 -2227 -9205 -3290 12236 10369 -7128
659 -7128 -8324 9795 12977 -5632 -12290 3580 14126 4048 -8527 -6387 2693 4880 -914 -6824
673 -6824 -4983 4713 7097 -5338 -13595 -2531 9681 3147 -8867 -4876 5859 5548 -3937 -7717
687 -7717 1218 10946 5741 -5971 -4692 6833 7658 -3559 -5261 5721 8802 -1871 -6919 350
701 350 4746 -1569 -4713 1014 2568 -2782 -4604 -1569 -1131 -1660 49 815 -1792 -1847 379 -877 -951
718 -951 1881 3146 860 619 1725 525 -212 2479 3639 667 114 2746 2045 -2853 -3495 2166 4099
735 4099 -1964 -4486 -492 1165 -3010 -4728 -1198 2036 292 -2316 -3378 -1424 1574 652 -1363
750 -1363 410 3034 1966 -883 -325 1955 2136 2291 2712 1543 -598 -26 1553 897 -1872 -486 2961
767 2961 1020 -4462 -4259 570 1382 -2199 -3242 -333 523 -1396 -3290 -2440 1028 3134 103 -2185
783 -2185 541 3548 996 -1943 1203 4772 2966 -1022 -879 2125 2255 -839 -609 2070 1562 -1110
799 -1110 -2480 -1281 -471 -857 -1157 -1308 -1163 -972 -1651 -2714 -944 741 314 -398 120 706 -246 22
817 22 1586 1849 1414 1756 2501 969 -474 711 2385 1660 -82 406 879 -1343 -2359 -639 335 -1325
835 -1325 -1555 -675 -1391 -2563 -2039 -576 87 -17 -778 -876 -228 1096 109 -962 1429 3952 1857 -1719
853 -1719 219 3754 2156 -1200 -108 3042 1947 -1629 -1646 183 66 -310 -330 -1376 -2350 -681 -169
870 -169 -3013 -3121 1113 1743 -2199 -2455 668 1046 -746 435 2201 794 289 2241 1400 -719 247
887 247 3162 2539 -782 -499 1483 672 -946 -170 -18 -1021 187 353 -2985 -4339 206 2730 -2670
904 -2670 -4469 401 2578 -1635 -3459 157 1928 1158 1266 164 -1508 1083 5228 1543 -3485 19
920 19 6962 3196 -5807 -2911 5198 4055 -3475 -3904 1033 2063 -1296 -3058 -3256 -689 2594 -77
936 -77 -5219 -3890 2673 3060 -2876 -3795 1811 4083 904 -2058 -1524 2399 4611 1926 -2313 -1117
952 -1117 4954 4292 -3414 -3746 3715 4076 -2924 -3189 1841 -150 -3766 187 2311 -4045 -4639 3207
968 3207 2880 -6355 -5108 5066 4256 -4905 -3161 4492 2348 -2572 211 3758 -878 -1011 6018 3802
984 3802 -6360 -2936 8897 5199 -7369 -4578 6937 4873 -5464 -5830 1227 3491 -298 -3785
998 -3785 -3879 -533 2698 586 -4848 -4360 2819 5385 -1326 -6122 -1064 6486 4840 -2650 -4756 2434
1014 2434 8141 2036 -7335 -3048 9069 6748 -7401 -6541 6023 5551 -5260 -4468 2422 218 -3002
1029 -3002 861 820 -5944 -2558 5974 1375 -8709 -2649 8549 2272 -8523 -1798 9054 2144
1043 2144 -6758 1247 7628 -1064 -3891 5131 4862 -5034 -2581 7159 2672 -6388 -2203 4686 790
1058 790 -3949 -1219 789 -1741 -1625 243 -1285 -3144 246 2592 -1207 -4411 -285 4674 2002
1073 2002 -2762 -1774 2392 4716 1691 -3733 -2038 5848 5899 -4107 -5666 4542 5915 -3840 -4806
1088 -4806 3333 3230 -3541 -2462 513 -2681 -2270 3587 809 -7027 -2750 6483 1790 -7990 -2208
1103 -2208 7911 2546 -6472 -764 6754 811 -3964 2577 4751 -1766 -936 4266 451 -4274 1420
1118 1420 5377 -1830 -5142 1719 3051 -3390 -3471 1904 477 -3920 -1470 1882 -1198 -3342 307
1133 307 1415 -1305 -835 1983 824 -1111 1570 2190 -1027 438 4076 995 -3209 975 4689 -550
1149 -550 -3621 1623 2630 -2097 -2198 1645 -10 -3404 -544 1848 -2490 -3389 1665 1567 -4027 -2157
1165 -2157 3820 1476 -4179 -503 4053 -193 -2504 2804 3499 -2065 -959 3966 1484 -2823 1229
1180 1229 4331 -1110 -3224 1710 2430 -2874 -2514 2368 913 -3940 -1735 2501 -1361 -3892 466
1195 466 2110 -2151 -2440 1829 976 -2421 679 3265 -646 -1784 3005 2920 -1769 -634 3914 1566
1211 1566 -2228 355 2990 -562 -2117 1090 956 -2176 -1330 1561 -727 -3638 -324 1698 -1906
1226 -1906 -2869 1002 997 -2289 -964 2207 -134 -1892 1712 2907 -1552 -1252 3620 2375 -2299 48
1242 48 4092 987 -2525 492 2775 -940 -1851 1330 785 -2864 -1196 1638 -1254 -3457 -34 1873
1258 1873 -1969 -3171 862 1450 -2173 -1215 2150 427 -1500 1386 2160 -870 -515 2913 1913 -1547
1274 -1547 203 3157 824 -2101 506 2485 -805 -1971 627 267 -2132 -1029 941 -1201 -2414
1289 -2414 17 706 -1974 -1714 1489 478 -1691 28 2122 -140 -859 1813 2113 -471 -205 2584
1305 2584 1400 -963 401 2038 65 -1061 958 925 -1622 -1027 1291 -223 -2677 -521 1251 -1452
1321 -1452 -2699 339 878 -1985 -1325 1426 504 -1846 2 2178 255 -941 1369 2079 -231 -293
1337 -293 1929 1547 -678 237 1717 209 -1108 -8 1069 -790 -1443 146 255 -1491 -1462 -432 -757
1354 -757 -635 -241 -564 -832 -103 931 -385 -961 890 1451 61 -63 1082 1358 281 663 1310 270
1372 270 280 1172 776 -964 -413 1272 364 -2034 -964 697 -475 -1950 -1249 299 -424 -1418 -418
1389 -418 -86 -513 -461 716 497 -382 216 1587 973 -471 406 1571 1246 120 206 944 875 457 -223
1408 -223 -209 94 103 -415 -792 -887 -366 -454 -779 -1069 -923 -594 -9 -240 -1181 -271 1023 906 -597 -742 1001
1429 1001 1719 242 -412 1062 1748 674 -154 456 829 226 147 377 -540 -706 239 133 -1304 -1508 38
1448 38 652 -1320 -2353 -311 795 -461 -1664 -297 1163 131 -609 584 1113 64 214 1514
1464 1514 932 -185 585 1755 557 -573 128 1129 452 -1044 -671 290 -159 -1191 -735 -137 -638
1481 -638 -1369 -546 -56 -966 -1083 325 585 -700 -745 872 1082 203 -680 788 1864 528 -617 298
1499 298 1958 518 -504 445 860 -595 -689 763 38 -1473 -595 796 -761 -2018 -447 838 -542
1516 -542 -2051 -402 1400 -65 -1713 -62 1602 184 -778 1059 1314 -485 141 1682 1066 -241
1532 -241 688 1381 189 -514 421 920 -165 -892 -399 267 -454 -1318 -733 -60 -789 -1216 -231 135 -919
1551 -919 -972 -4 222 109 190 80 635 706 189 623 1332 823 -437 595 1503 -25 -258 687 374 -830
1571 -830 -435 959 -402 -1523 -883 229 -423 -1527 -852 266 -398 -1305 -263 953 -402 -1008 690
1588 690 1154 -261 -197 1455 846 -565 668 1884 280 -614 572 794 -184 -1 192 288 -484 -693
1606 -693 -238 153 -599 -890 -373 -475 -823 -459 -60 -279 -335 120 -152 84 531 694 -295 618 1201 272
1626 272 227 996 580 -238 621 1139 15 -927 144 321 -510 -723 511 -69 -1209 -1228 67 -26 -1011
1645 -1011 -745 422 -201 -780 21 560 -251 -531 986 947 -247 329 1187 578 -188 707 1151 535 -297
1664 -297 327 521 -265 -330 -63 -157 -619 -545 -122 -740 -799 -191 -352 -804 -192 211 -321 -377 103 296 -95 413
1686 413 1031 314 -104 748 1306 381 155 872 800 91 -45 600 234 -703 -251 364 -459 -1014 -103 -91 -978
1707 -978 -967 144 40 -1066 -666 538 -59 -939 328 811 -18 -75 742 686 322 331 873 395 142 314
1727 314 717 122 -165 10 143 -162 -332 -220 -353 -712 -446 -288 -822 -845 -214 -542 -461 -84 -17 -429 13
1748 13 437 407 -58 326 928 213 120 783 1108 78 112 344 784 -304 -147 306 -120 -556 -281 -16 -478
1769 -478 -1177 -389 -166 -655 -755 -39 1 -720 -224 276 6 -315 497 432 327 465 681 443 469 540 295
1790 295 194 238 543 -12 -97 -69 180 -304 -381 -226 -283 -830 -661 -90 -441 -928 -445 289 -172 -575 0 621
1812 621 -258 12 454 673 184 212 801 637 72 444 928 272 -208 241 487 -149 -523 -164 -47 -323
1832 -323 -663 -460 -420 -838 -542 -536 -264 -445 -237 -228 -135 152 180 60 429 550 337 158 770 697 -10 454 865
1855 865 438 -288 99 609 101 -707 -22 342 -562 -718 -74 242 -934 -946 347 -188 -990 -621 509
1874 509 -94 -527 -19 716 8 -219 548 932 483 37 734 738 34 128 523 430 -35 -109 90 81 -426 -479 -111
1897 -111 -222 -471 -747 -335 -219 -488 -724 -367 182 -66 -262 111 633 283 -286 750 952 197 193 829
1917 829 997 155 141 847 722 -407 -227 757 43 -767 -253 131 -391 -1229 -287 388 -741 -1100 -125 335
1937 335 -784 -580 161 485 -135 -173 476 669 205 129 771 720 383 217 805 606 -66 190 313 307 -344
1958 -344 -461 62 49 -772 -721 49 -309 -771 -666 94 -250 -652 -536 286 71 -297 347 686 161 -123 633
1979 633 896 461 -75 363 1019 170 -94 200 359 -117 -715 -13 147 -663 -620 -327 -384 -807 -641 -42 98
2000 98 -544 -459 188 90 -387 -150 532 458 -116 309 884 498 -74 514 1086 386 49 314 689 -30 -537
2021 -537 217 125 -446 -833 -58 -42 -845 -861 -178 -376 -835 -147 16 -333 -285 -157 273 -63 85 200 567
2042 567 334 603 375 579 272 53 305 434 278 30 -62 -84 278 -623 -718 21 40 -808 -691 36 -175
2063 -175 -1119 -383 387 -298 -521 94 363 -316 -189 774 667 174 139 644 316 -34 477 872 193 -356
2083 -356 93 694 -189 -495 169 77 -616 -582 -31 -471 -877 -250 -111 -791 -280 51 -263 -395 203 271 -189
2104 -189 132 433 339 236 574 474 320 -152 561 337 -73 43 572 222 -568 -190 284 -235 -1105 -79
2124 -79 7 -1063 -678 297 7 -1019 -272 350 -377 -602 51 577 -227 163 686 535 -123 66 759 435
2144 435 -30 413 513 -8 -497 211 271 -396 -325 86 -174 -748 24 -148 -739 -669 -200 84 -439 -82 216
2165 216 -257 -126 681 374 -73 382 708 461 -79 394 668 -132 -134 460 564 -511 -80 599 -125 -981
2185 -981 -98 317 -616 -932 149 126 -911 -416 301 -229 -892 -14 338 -177 -133 369 492 221 142 656
2205 656 575 -41 598 786 128 -254 517 367 -242 -82 419 -324 -660 -281 19 -786 -645 21 -288 -692
2225 -692 -275 133 -338 -335 251 422 -432 -214 420 352 -193 106 900 351 -28 491 797 -320 -150 564 444
2246 444 -334 -114 492 -456 -746 49 51 -736 -626 89 -117 -623 -283 280 -271 -412 101 539 -202 -122 338
2267 338 381 141 198 845 326 -139 567 474 -51 -87 459 174 -411 -79 283 -405 -579 124 -68 -852 -372
2288 -372 68 -395 -608 -89 379 -342 -283 328 221 -265 104 582 180 -224 428 973 48 -117 528 422
2308 422 -197 -262 454 184 -570 -76 211 -426 -538 66 -45 -825 -564 184 -72 -484 4 109 -205 -187 415
2329 415 450 -195 207 445 265 -25 736 699 -81 105 586 456 -168 -96 356 -368 -318 33 91 -634 -632 17
2351 17 -9 -820 -334 87 -397 -411 9 213 -400 -48 405 320 -123 -39 505 318 49 220 787 351 -142 466
2373 466 291 2 -141 375 280 -521 -150 -167 -430 -468 -132 -375 -278 -444 -158 -335 -181 32 237 -110 179
2394 179 311 244 197 362 522 155 286 825 205 -71 205 370 141 -272 171 62 -341 -467 -47 47 -651
2415 -651 -255 145 -241 -545 -131 264 -105 -407 206 166 -126 24 350 447 68 181 429 334 26 398 338
2436 338 146 -50 146 87 138 -104 -362 -74 -238 -352 -595 45 -61 -193 -331 -141 -12 -348 -253 -32 91
2457 91 -83 141 199 289 33 231 540 114 -130 133 448 291 -121 -27 150 -286 -76 244 -149 -285 -465
2478 -465 56 -53 -209 -295 -295 -124 -437 -63 114 -103 -173 44 298 15 -113 135 339 274 197 276 342 248 111
2501 111 127 238 188 -48 -27 -86 -335 -170 -58 -49 -265 -352 -263 -243 -435 -165 -45 -94 -78 -89 34 137 243 332
2525 332 280 175 17 295 404 183 183 379 312 379 163 -19 -223 -88 -146 -391 -421 -174 -434 -468 -230 -193 -336
2548 -336 -288 17 -92 -40 -85 2 -85 124 121 199 224 439 339 374 271 297 106 295 90 -102 188 -69 -78 -37 -267
2573 -267 -243 -357 -134 -141 -481 -285 -78 -371 -264 72 -86 -165 -97 140 208 61 340 456 203 120 361 692
2595 692 -62 -20 505 279 77 131 -4 -309 -548 26 64 -292 -610 -102 -268 -458 -174 0 -500 -234 31
2616 31 -10 32 -36 281 208 167 35 206 468 116 -133 188 -4 71 96 69 -242 163 188 -51 -206 -110 -300 -330
2640 -330 -169 -200 -284 -476 -2 141 -362 80 31 -2 -24 -55 235 172 -56 356 406 17 51 478 448 -69 62
2663 62 354 154 -270 -84 241 -226 -419 167 4 -358 -389 95 -57 -503 -356 -237 -11 -253 171 291 10
2684 10 88 74 406 180 212 360 228 263 286 296 179 21 205 112 -253 115 -196 -368 -433 -142 -46 -420 -353 -69
2708 -69 -108 -267 -64 109 -468 -93 355 73 -266 73 338 239 68 531 594 121 -111 130 310 -98 -153 346
2730 346 -192 -255 -215 80 -175 -558 -184 -133 -474 -565 -64 14 -361 -245 356 2 -91 192 254 329 211 284 275 32
2754 32 263 480 53 146 355 177 -7 57 20 -141 -40 -180 -151 -218 -88 -69 -143 -305 -91 175 -284 -425 -3
2777 -3 234 -293 -206 310 -85 -151 70 409 313 47 328 538 101 -94 284 259 -144 35 199 -54 -318 -40
2799 -40 76 -210 -534 -86 -21 -255 -148 -128 -222 -296 -93 144 63 274 198 340 119 323 281 255 186 172 254 116
2823 116 335 314 109 -269 42 -209 -226 0 -29 -118 -363 -243 198 -225 -361 -361 178 -202 -64 91 25 -128
2845 -128 189 293 62 -47 246 330 155 -27 256 342 -110 -120 111 48 -168 6 121 49 -202 168 -168 -97
2867 -97 -253 -1 -44 -380 -51 -87 53 -196 18 156 268 62 -18 281 161 460 382 187 96 267 102 92
2889 92 309 -224 -141 -152 -208 -77 -596 -342 -94 -209 -314 -145 -32 -241 -323 -66 268 11 -311 218 20 -14
2911 -14 30 322 313 -91 165 497 216 118 371 363 95 -328 94 84 -249 -198 -36 -87 -316 -407 -298 -491 -406 -194
2935 -194 -36 -130 -96 239 -49 -62 243 245 407 101 102 52 184 291 180 230 131 240 -66 77 100 -66 -91 -74
2959 -74 34 -223 -159 -296 -125 -339 -288 -57 -60 -249 -389 -111 42 38 -63 328 255 -72 96 530 133 156 309
2982 309 454 143 11 111 143 48 -361 -74 -55 -87 -234 -20 -97 -246 -261 -76 -82 -133 -369 -8 -54 45 -28 159
3006 159 155 72 -68 244 126 240 142 232 72 158 70 162 111 -23 -44 -124 -48 90 -350 -235 -336 -283 -176 -126 -103
3031 -103 -372 68 -88 -192 0 305 -186 103 87 279 247 121 218 219 495 281 170 275 127 -107 -144 161
3053 161 -89 -87 -236 -81 -42 -133 177 -110 -81 -135 -187 -318 -10 -182 -250 -87 -98 27 293 160 46 40 251 22
3077 22 293 240 49 282 45 -113 -128 -91 113 -27 86 -154 58 -62 -238 -380 -63 25 -59 -15 -95 -44 -218
3100 -218 -15 93 27 -64 142 138 240 376 282 173 137 197 123 16 28 203 -46 18 -177 -8 -209 35 -145
3123 -145 -71 36 -281 -182 -233 -29 120 -95 -52 119 59 150 273 -74 245 22 143 323 -77 144 40 37 -22
3146 -22 1 255 -251 -122 5 60 29 -162 -281 -284 -189 -163 -72 -30 -45 -148 -51 -33 86 56 177 -43 -79 165 308
3171 308 198 215 -123 97 112 166 -70 202 -219 -79 -3 -47 126 -67 -166 -174 -63 -12 -69 -237 -122 -119 -187 80
3195 80 -135 20 107 -148 -117 34 137 187 260 152 90 375 205 60 202 69 -121 124 100 -5 -179 -74
3217 -74 -298 -272 -225 -9 -249 103 -220 -119 55 -185 -132 -245 -68 -28 80 55 230 90 142 283 289 425 6
3240 6 100 152 256 121 49 151 7 228 243 -250 -229 -196 -222 -113 -129 -259 -370 -77 -108 -130 129 125 -185 40 164
3265 164 149 -23 -43 184 339 256 401 208 260 -22 285 238 274 -6 -97 -22 -272 -46 -181 -36 -383 -289 -44
3288 -44 -171 -159 -121 -55 175 -242 164 176 155 -20 62 -111 239 324 319 259 120 307 -52 27 258 -34 64 74 -92
3313 -92 -45 -64 -77 136 -157 -252 -39 14 -137 -59 -102 -78 33 -120 -10 23 -52 25 345 73 -188 243 213 86
3337 86 188 93 -26 9 107 -51 -72 -85 -118 -25 -83 -32 -38 -110 -152 -175 -123 13 -146 -124 88 -79 10 157 121 -9
3363 -9 -162 258 278 2 216 174 115 97 121 141 -109 185 118 62 34 -33 -134 -92 -2 -126 -170 -103 97 8 102 -117
3389 -117 -139 104 -41 -91 26 -70 -12 168 327 -72 153 135 122 49 174 143 -18 27 91 301 -134 -165 -158 5
3413 5 -116 -210 58 -273 -102 -91 -106 -160 -118 51 3 -104 -155 -84 55 171 219 130 190 14 265 -66 149 67 163
3438 163 10 101 -24 -12 -33 -328 2 -20 -108 205 -278 -166 -113 -143 -133 -236 100 79 -23 -11 175 491 10
3461 10 -53 36 138 138 165 302 130 193 93 54 92 141 -14 148 14 -238 -101 -117 -184 -259 -194 -49 -16 -301 -80
3486 -80 98 60 20 205 -54 115 126 142 181 -83 169 150 312 -120 77 -51 259 -27 -2 89 -8 -26 -231 -55
3510 -55 -130 -146 -99 -103 -61 -65 -56 -167 -131 -68 -132 -25 22 54 61 166 106 30 273 198 -1 46 64 10 51 -121 149 27
3538 27 -76 108 -110 69 -18 -18 -11 -37 -138 -96 27 127 -61 -190 92 22 -36 168 -126 -19 183 131 -8 85
3562 85 163 -9 170 -39 207 55 184 162 -13 -122 1 -183 -114 -49 -107 -2 -81 -143 -48 -115 -103 -91 65 -83
3586 -83 81 212 46 58 27 -14 207 156 25 -65 -40 139 85 159 69 68 -204 -67 -62 -353 -161 2 -208 -170 166
3611 166 -207 -226 -70 -225 -21 -158 59 90 182 314 -19 -199 200 129 352 233 88 78 22 191 114 -83
3633 -83 -119 41 -60 -121 -178 -304 -171 -23 -38 -82 -67 -32 -122 -191 -109 -160 270 138 82 88 9 10 36 128 106 164 95 334
3661 334 51 161 183 -18 194 64 -226 32 -41 165 -28 -119 3 -110 -47 101 -194 14 -143 -171 -79 -181
3683 -181 122 -21 267 97 -125 192 84 89 219 72 -1 40 159 -41 299 139 -111 -106 2 -84 -72 -84 -158
3706 -158 -21 -53 -49 14 -37 -134 13 12 -65 -21 175 137 -39 240 188 -39 -100 31 116 -105 69 142 135 -198 63 -16
3732 -16 -257 -166 -110 -223 -32 29 -150 -274 -203 -121 -93 -101 19 -2 143 47 9 239 -108 157 85 164 225 84 199
3757 199 412 124 42 104 253 -61 -74 202 24 -65 51 -14 -149 -150 -36 -193 13 -118 -78 -214 -225 -252 -84
3780 -84 19 -61 -5 110 121 291 176 108 35 138 208 -93 -117 74 95 -80 -47 -42 -170 -27 -289 33 30 -96 -51
3805 -51 -184 -82 131 50 -59 -106 -17 29 -50 -33 -2 67 15 2 179 257 126 75 181 60 -8 -39 97 -143 -71
3830 -71 -4 -170 4 108 -148 -159 -87 177 -39 -47 -170 33 -150 -221 -178 -39 -28 172 152 144 129 33 146 153 134 293
3856 293 173 58 -108 144 -83 -99 30 -220 -195 88 231 93 41 -7 21 -262 -106 -40 9 -41 46 -59 158
3879 158 70 65 129 -14 54 71 177 87 -137 24 -91 152 195 -130 54 1 39 -136 30 -101 -97 -63 -190 -163 -234
3904 -234 -83 0 -226 -12 53 59 45 258 345 13 77 -65 50 222 -133 -124 3 -25 -86 -49 -64 96 -104 -20 20
3929 20 -226 -58 -90 -35 -126 -131 23 -21 -141 -144 -167 62 0 106 77 17 58 128 126 66 78 37 -2 337 32 58 43 7
3957 7 -37 -119 64 -68 -49 -53 -102 139 109 -216 -88 -101 -174 -239 -172 35 -34 -91 -75 -67 70 2 -124 52 125 273 -96
3984 -96 8 188 134 105 54 63 -35 -26 -69 -170 -182 -257 -32 -199 160 -102 140 -48 144 -46 27 113 -114 4 111
4009 111 -120 -3 69 27 303 19 139 135 32 25 -57 -146 66 -103 -15 42 -168 -152 -86 -165 -63 -180 -165 118 -110
4034 -110 -52 225 -2 7 19 -32 12 70 22 -295 180 52 -275 102 -70 88 -16 18 145 -92 -23 -235 -62
4057 -62 -52 -15 -56 113 85 -45 -59 7 -242 76 -84 -102 -38 106 22 31 -95 152 91 139 161 -35 112 145 4
4082 4 210 133 24 -39 -32 -22 25 42 4 89 6 -170 170 -174 14 -29 20 46 -41 -162 66 58 -10 203 112 99 96 272
4110 272 -98 -63 45 293 -96 -123 -137 265 -218 -215 28 -20 -119 -220 -62 -65 4 47 -212 73 60 -138 -32 -123
4134 -123 -59 -170 133 59 107 -32 191 162 135 85 172 -7 7 -23 70 254 -80 -164 155 -74 -5 -124 64 -127
4158 -127 -101 -80 60 -9 -256 -142 246 -40 -54 58 64 -89 128 154 116 13 -152 -184 -55 -70 143 -46 153
4181 153 -41 -150 27 55 29 -30 -244 25 -129 -60 -103 -175 80 -25 -46 65 -160 102 84 86 224 16 151
4204 151 183 -71 -172 156 -98 -90 -45 224 -58 142 18 86 -51 -178 -23 50 47 -100 -167 -246 111 32 109 27
4228 27 -160 -10 70 88 -104 22 4 28 -72 44 158 -61 269 163 -46 -53 145 -60 -186 129 109 -150 -15
4251 -15 -143 7 -25 -23 -272 184 -12 -82 -44 11 74 -118 82 78 -33 -11 -35 -119 80 -46 -187 -251 10 61 154
4276 154 19 131 -34 -232 -48 -6 80 -191 -159 -164 -25 -11 -117 -13 20 -48 -38 -29 -71 -84 -14 0 -103 -126 -65 -66
4302 -66 121 80 -91 100 44 151 66 53 401 90 -167 -137 -18 -106 -164 91 -11 -217 -12 -86 90 80 46 -113
4326 -113 70 1 53 -153 -44 73 72 175 -7 215 289 89 8 17 -1 29 136 90 -30 -24 -11 -21 -114 6 -45 -54
4352 -54 -349 -184 -99 -61 27 -245 134 -253 -301 -60 102 18 23 150 -10 -35 179 171 177 158 111 12 57 103 34 114 -103
4379 -103 -34 74 29 -60 -251 -33 -69 23 115 -1 -73 -53 -194 -102 107 119 229 123 50 205 116 130 -14 177
4403 177 61 -293 62 113 -76 217 30 -70 -90 60 -13 -78 -55 -11 -20 -123 82 -138 12 82 -285 -182 -139
4426 -139 16 37 92 137 -246 -21 67 121 138 79 -83 30 130 162 -172 -148 99 -38 80 155 -102 -212 200
4449 200 5 -257 -182 53 -34 -61 14 44 0 120 -169 22 222 197 -96 80 264 16 18 -53 -70 -194 96 -140
4473 -140 -80 -17 165 -195 -325 -173 -105 -108 -166 -58 -61 -159 164 -114 -207 -236 -31 -3 -29 183 101 125 91 55 -24 228
4499 228 253 157 -26 33 243 92 49 95 86 -67 -192 141 -16 -109 -226 -35 -20 -19 -33 38 25 -60 216 -212 -14
4524 -14 -82 159 165 208 -224 -141 153 -99 -94 -69 122 -82 163 -199 202 57 46 13 -35 273 79 76 -146 -250 32
4549 32 144 -56 -85 93 81 -132 -8 -45 263 -53 -191 206 -175 41 66 6 427 0 -69 44 6 99 32
4572 32 29 19 133 -71 -94 -221 -228 160 38 65 -184 78 79 119 -42 142 4 -86 22 182 88 -124 27 10 22
4597 22 218 -21 142 296 -146 -90 -158 53 -11 246 106 131 -79 -93 72 -66 -70 239 -147 -255 -19 19 -54
4620 -54 36 252 152 174 17 67 119 89 121 -90 160 74 -85 209 -124 -72 46 -76 101 -108 33 -26 -162
4643 -162 133 9 81 -102 -89 -214 -65 63 146 -183 -45 44 51 -64 -137 31 208 163 75 105 151 142 -124 402
4667 402 -35 127 -82 19 -7 -63 -15 -162 -152 -149 23 41 22 -11 10 -176 -37 19 66 110 21 355 132 223 63
4692 63 13 21 -127 133 -94 -60 175 151 99 -102 -113 100 359 -106 -107 -209 -29 107 -26 -180 101 40 -131 111
4716 111 -32 19 -56 9 3 -145 -33 -92 79 58 -157 -16 29 -37 262 -77 107 -88 -3 -45 124 -160 -102 -19
4740 -19 -147 -56 -322 -238 6 -243 -180 -177 66 -42 -48 -117 20 -16 -53 9 62 -107 420 173 71 136 -9 38 88
4765 88 -42 -113 -45 -58 -122 3 -20 -82 1 -43 -97 -151 22 -221 -115 96 71 -108 188 153 -57 54 -77 51
4789 51 -82 165 84 161 -6 72 66 -20 -111 -66 96 -275 -156 2 99 -231 -49 57 -139 3 -500 135 -52
4812 -52 -47 -107 135 55 163 -78 38 116 104 -95 -93 78 -76 -231 -67 86 -209 135 -93 53 -250 -51 -139
4835 -139 279 93 65 -107 -144 94 -125 73 74 -80 77 -185 -153 -175 11 -76 -71 14 118 169 22 142 207 -149
4859 -149 -152 89 -76 -165 164 88 -104 46 -220 138 -47 -178 -50 -135 -19 -37 142 70 -52 -36 -214 15 89
4882 89 54 142 77 149 60 -79 -91 -56 153 46 47 26 36 -111 40 -136 -23 12 -225 -209 -89 11 -2 35 -213
4907 -213 -38 79 255 -29 86 101 131 13 96 128 -143 -46 -235 222 -69 43 84 -143 107 -92 82 -65
4929 -65 -59 122 -83 -73 -120 -61 -65 -80 -9 19 -59 -149 206 239 -84 -41 83 143 73 52 -43 107 47 47 149 -122 18
4956 18 59 123 134 -39 47 -120 -7 -223 204 -94 -107 88 -120 -132 41 -164 110 -92 78 105 -144 106 115
4979 115 162 387 233 128 20 4 -208 -252 -173 136 161 -201 -61 33 -108 -59 185 -118 -59 171 69 275 -67
5002 -67 -188 -68 -212 -2 -147 258 30 263 -211 56 -138 153 155 88 -150 -18 32 278 -38 181 135 133 -125
5025 -125 166 -209 140 -102 -110 50 14 -109 -82 -128 -121 118 47 94 69 -117 167 36 -260 -19 -98 49 248 -22
5049 -22 46 26 -79 167 57 118 -88 -192 274 90 -77 -32 -29 -46 74 -60 258 -107 156 23 -22 -9 -267
5072 -267 -283 -55 -173 -89 -135 -119 145 -116 39 27 95 117 -49 178 -13 -163 -185 128 -155 -94 -69 -141 -49 149
5096 149 -75 -164 -130 -92 -303 69 -162 118 103 -89 89 -107 -58 125 77 -7 24 4 43 46 -151 -32 -10 -39 -161
5121 -161 48 -40 -97 -124 -107 62 93 -182 -66 59 -85 1 -35 -230 77 -29 133 23 130 394 41 58 92
5144 92 78 19 6 -79 82 -13 -6 -16 -22 -37 90 -12 37 -112 52 51 0 -118 44 59 -74 -81 -74 48 -109 -8 -106
5171 -106 -39 246 219 217 139 184 -35 155 -41 123 369 -208 85 64 79 -105 -65 70 118 -107 26 -85 -155 -44
5195 -44 -36 258 -5 -38 80 -79 31 -29 -205 146 106 9 103 -79 7 198 -5 58 -18 -91 196 -61 20 177
5219 177 -230 106 -87 -148 -150 -128 -39 -166 142 -101 -128 -53 -184 -59 -40 3 11 138 217 166 211 67 -336 71 -148
5244 -148 124 -112 76 9 38 -227 -75 -39 103 306 -171 0 27 76 -35 5 62 -154 174 -56 58 155 156
5267 156 160 -195 0 271 80 123 -86 -105 54 281 -53 117 2 -129 -39 -93 13 35 -31 157 -100 -10 -202
5290 -202 21 133 9 45 -13 -50 -102 79 106 -123 -109 108 -84 -165 55 84 76 -4 -34 8 60 -17 59 148 176 119
5316 119 -93 -340 -56 220 35 59 -158 -20 94 91 77 -50 64 -76 35 57 14 -59 39 31 148 44 -20 263
5340 263 259 19 -26 -97 -75 -18 -55 94 49 -122 30 -176 53 51 -62 -62 173 -90 -226 132 -18 -39 54 -99 82
5365 82 -122 44 307 -5 100 250 -80 216 218 -50 -75 -237 -46 144 45 -204 213 -34 -200 -17 -109 -26
5387 -26 -89 -107 -106 -229 24 120 -10 25 -89 137 29 113 170 37 156 -113 -74 50 65 -103 -200 96 -60 38
5411 38 139 -68 94 138 -132 -259 -3 46 -13 -158 -2 24 -50 89 -8 25 226 74 34 252 29 184 177 18
5435 18 176 -140 -20 33 156 -14 31 40 76 -106 9 -219 -72 -7 72 -15 -82 -11 -62 -144 37 -91 -182 -56 -173
5460 -173 -14 104 164 127 63 99 164 -1 13 225 -189 -21 -79 95 101 -62 -9 -66 -78 -122 -161 8 94 101 -46 -149
5486 -149 9 -124 -36 8 -7 85 88 29 -225 29 -119 -103 -150 123 4 70 101 37 -67 32 104 -63 161 104 -37
5511 -37 -159 102 -130 -132 -17 -2 254 -118 43 -8 3 -69 117 149 -3 92 244 -82 65 -13 141 99 142 64
5535 64 -162 7 -194 72 -12 -84 -163 -22 195 46 -43 -160 -312 -16 -86 -60 -192 36 5 -144 194 28 -28
5558 -28 -30 22 -42 51 -70 117 95 194 -106 -94 33 -227 31 132 138 22 76 105 -158 0 -57 -203 -79 3 -67
5583 -67 -136 -18 -79 -203 -92 188 -175 -11 100 207 -16 124 41 -42 130 -93 -58 -18 7 61 -66 -60 267 -149
5607 -149 -228 -72 23 137 -5 -5 27 -64 -117 79 -214 47 -206 1 45 31 176 45 14 78 -28 -145 52 -80
5631 -80 57 66 150 -206 126 195 84 142 -112 117 -236 17 -55 -250 4 -107 -340 -114 64 62 54 -43 32 82 122
5656 122 20 83 -93 -96 42 142 -49 176 11 -10 -23 47 40 -22 53 -71 -179 -166 -17 -12 12 -88 -111 -252 -36
5681 -36 52 -72 -80 -69 189 -128 -41 -75 115 64 94 -126 172 248 154 -148 -95 215 -66 -127 -9 -73 3 -3 -191 -25
5707 -25 -226 142 -73 -120 -52 -215 -17 13 -86 -55 -182 81 -23 131 -117 121 32 159 192 -104 23 -80 -1
5730 -1 88 74 183 111 52 -1 38 27 -177 -23 -164 -106 -21 18 28 184 49 35 -315 -53 -54 60 22 46 51 36 9
5757 9 23 -29 3 -31 -3 119 -25 -42 -202 250 41 -132 -100 138 -7 -98 -57 -101 140 136 -109 -93 163 136 -124
5782 -124 64 314 19 44 135 -63 133 -71 -120 28 -34 -207 -107 108 164 5 -77 81 71 111 -29 3 34
5805 34 -98 -116 63 62 7 -112 2 -148 -22 86 102 -85 -18 35 78 109 50 37 88 47 21 29 -73 85 84 -114
5831 -114 -229 -84 133 -55 54 167 44 -71 151 -101 -4 178 -134 -171 29 -33 -96 31 -20 5 63 98 21
5854 21 -25 -85 -186 184 198 -146 155 231 205 -34 -65 20 -128 -29 -103 -205 -14 -146 -204 -69 282 -127 -295 -7
5878 -7 94 -96 26 -34 34 -89 113 -66 49 206 53 291 152 301 12 69 147 -44 111 199 -194 -15
5900 -15 42 -102 -107 147 -4 -232 -63 -51 -81 106 29 65 -105 -19 -91 -70 96 -5 -141 -154 -122 -57 52 78 -106
5925 -106 141 63 -94 35 21 4 -43 -30 -196 3 -42 -165 0 -20 59 -116 -61 -98 -158 80 90 -96 0 -7 110
5950 110 -6 168 29 122 55 351 221 -105 23 -19 -186 -121 -44 -42 -12 -180 -60 151 -195 129 -120 166 -148
5973 -148 -268 239 72 10 -66 27 80 -24 65 139 113 176 -52 -113 -33 31 259 188 247 -231 151 75 -148 -158 186
5998 186 243 -150 -36 15 69 -25 46 38 -29 -199 33 149 167 -10 30 36 321 -90 -124 -101 29 192 80 -58 -26
6023 -26 83 -137 163 92 -157 69 -62 -73 -203 77 -38 14 -12 30 -96 -63 -131 -10 28 102 94 116 -78 -172 169
6048 169 168 -23 8 188 99 -62 -19 -63 76 -52 36 188 -90 -184 -66 -72 -59 -11 129 -97 122 5 -12 -20 19
6073 19 -131 -88 45 -12 -159 -117 121 -97 -95 155 32 -196 7 418 68 -127 -124 13 -115 -65 -13 -158 25
6096 25 22 19 92 -199 97 -178 -173 73 156 151 -296 96 216 -91 44 28 -56 143 284 61 -89 57 8 14 255
6121 255 153 -43 130 -37 -36 -110 202 -118 17 99 -89 25 8 -117 76 -185 -100 11 -96 -123 29 144
6143 144 82 94 96 134 -221 92 16 69 -83 113 97 158 -57 -96 -497 20 3 -315 -143 -30 -107 101 -21 63
6167 63 71 -205 169 -32 96 205 110 -20 -85 -6 43 20 49 43 -110 28 84 113 246 96 28 -26 -90 -184 5 -35
6193 -35 -224 -189 34 71 25 166 194 28 226 121 -57 -85 113 55 265 13 -59 150 -35 -132 7 52 85 -63
6217 -63 35 94 280 -122 -22 -27 -86 136 -177 14 -301 -6 40 -19 -42 133 -217 76 100 58 -49 173 -140 -132
6241 -132 80 48 -57 55 30 -124 271 285 -100 25 -9 60 -4 48 15 -1 -264 -143 79 113 54 -49 -53 60
6265 60 -119 -98 -5 -190 168 19 40 -128 -4 109 -28 -40 161 -42 136 93 114 329 160 -81 -98 -371 22
6288 22 29 -181 45 5 -89 -118 -93 100 -106 -161 -50 -65 150 243 -16 226 -32 128 8 -3 -278 122 -10 149
6312 149 30 -101 -181 110 -36 -176 -103 -5 -90 -134 -63 -105 154 59 -71 -83 27 30 -227 30 166 75 16 -97
6336 -97 226 -4 283 60 136 -26 -102 -101 37 -134 112 208 -170 -50 71 154 80 55 -233 83 -64 -76 137
6359 137 96 -7 34 -30 -60 33 246 -252 166 152 125 317 18 45 -20 55 64 -23 15 162 -188 140 -11 -126 79
6384 79 71 133 -54 -29 -174 -3 -18 -64 -120 73 -97 55 210 115 98 -69 104 92 -28 76 190 -144 222 15
6408 15 -191 17 164 94 -165 -38 -107 -189 -275 -42 8 174 -10 101 -106 -61 -74 41 -99 57 88 -206 -71
6431 -71 290 39 -61 132 206 183 -181 -19 -34 133 -25 -179 -47 37 -104 -133 182 47 24 -87 10 83 108
6454 108 -19 -164 -2 -162 66 52 -162 -41 123 -136 17 -15 13 -73 80 51 -135 80 -153 -58 6 141
6476 141 5 -167 -49 -59 76 105 -51 -28 -6 -63 -4 47 -16 -56 92 -68 127 83 -25 -69 149 55 25 51 50
6501 50 101 0 -111 100 -67 -19 -126 69 -151 -3 38 -63 -158 209 -314 151 92 203 96 -225 24 68
6523 68 52 -78 -19 227 70 -57 -56 -133 307 110 121 -93 109 -191 152 41 182 -50 -108 64 61 -140 -14
6546 -14 112 -9 -20 -144 -3 81 159 -50 222 -54 -84 88 16 -97 -22 -42 126 -181 -160 109 -166 163 -175
6569 -175 -5 108 -214 104 320 250 131 140 154 -2 64 72 186 -69 38 12 10 36 -63 159 -136 314 88 -25
6593 -25 -16 88 187 -93 93 -306 78 25 -63 37 133 -18 9 -35 -109 -71 -151 -65 71 128 32 35 -62 -129 -227 21 8
6620 8 121 98 -97 -125 -35 30 81 31 -68 52 132 109 -183 -32 -182 -204 156 116 -124 -15 -50 9 -102 22 -65
6645 -65 -117 15 -301 -44 -118 -42 115 -96 72 -110 83 -187 -90 -14 257 22 -247 -47 -78 -9 150 -97 -163
6668 -163 108 -77 57 -96 4 338 -271 104 -112 18 50 26 -14 21 74 -155 6 72 148 -6 -50 -56 47
6691 47 -36 39 -11 192 -148 9 -63 184 -217 -15 68 -112 229 1 37 143 -76 -118 1 -83 84 -31 167
6714 167 220 -34 -106 151 -32 -92 169 -130 22 -73 50 -74 27 23 83 -46 -161 -211 -32 -137 -206 -157 64
6737 64 -43 -228 -103 -109 -169 -117 86 43 142 2 -20 34 -82 117 103 69 -105 88 -6 130 55 -165 -56 86
6761 86 27 -75 -110 27 10 -184 45 -50 -173 -319 -1 -123 -131 -32 -60 -1 -17 -36 -101 -6 219 -66 92 10 -17
6786 -17 41 3 -102 75 22 -16 -46 -54 7 159 143 -34 103 8 -143 206 131 -229 6 12 -165 -98 49 -149 104
6811 104 -175 109 -147 106 -163 126 100 -37 -29 -12 -10 -140 23 -54 -196 -21 -65 -32 207 78 -18 -161 88
6834 88 -17 -21 29 -252 -166 -8 -60 104 -181 6 -42 37 -11 -207 -92 96 63 150 5 268 -15 30 66 167
6858 167 36 -39 116 -76 131 170 159 109 15 34 -13 -21 149 -197 41 -255 -233 129 -47 -173 -212 -6 11 32
6882 32 43 -68 16 54 118 36 -56 94 -85 27 190 -46 56 -106 -98 -47 -86 -78 -189 -225 -169 73 60 5 -11 -177
6908 -177 32 -60 10 98 172 285 -86 151 86 149 -31 -171 103 -196 92 132 48 117 54 -105 142 -118 157
6931 157 -169 48 -13 -210 -88 207 33 -14 55 -127 67 -3 171 -22 74 -43 -8 228 193 -26 -183 -19
6953 -19 -165 6 281 82 -201 102 -21 1 198 164 117 -20 -33 -30 -76 -66 113 57 28 -103 161 121 59 -35 113
6978 113 117 177 208 -71 -31 -85 64 -15 -116 258 31 12 100 -374 2 148 50 -37 34 -6 -96 79 -59 -83 -78 -45
7004 -45 -417 19 -11 81 -93 132 100 141 145 -138 121 -62 -9 114 232 -233 67 19 159 -83 35 39 -60 -199
7028 -199 -77 -230 -167 -193 -221 106 -112 -98 128 -108 43 -15 160 102 -164 -76 26 207 -23 260 -49 -48 -1
7051 -1 -27 24 -193 82 -221 -113 -156 45 -24 -92 -160 204 -42 -68 -175 34 126 -54 -115 3 -102 181 -84 128
7075 128 158 47 51 31 61 38 357 27 235 -2 53 -15 -318 95 243 -1 -67 -140 -167 -39 -216 -121 96 10
7099 10 23 -71 -238 8 153 339 176 -36 108 103 213 258 -60 -34 9 -114 -103 44 21 -100 -63 177 51 -198
7123 -198 132 110 -40 -35 -51 17 16 51 90 -120 164 -35 -125 251 19 -23 42 1 -69 184 -20 101 161 -112 -85
7148 -85 100 -99 129 74 84 148 -52 -77 -50 41 -201 120 -26 -25 -230 -2 206 -152 -126 -177 283 143 -82 -75
7172 -75 -66 41 135 -105 211 -207 96 169 -2 -61 89 15 -59 160 -36 58 -75 -128 -22 -174 -13 -112 -13 -150
7196 -150 37 85 135 101 -71 -61 -101 -96 -71 -259 -30 -119 65 92 56 68 105 164 -91 196 -29 -36 86 -34 98
7221 98 -96 135 74 -259 -33 -140 81 28 11 80 -34 -140 14 120 51 130 83 41 -47 -29 47 259 -111 237
7245 237 -47 199 134 23 -65 -88 -84 177 127 151 3 -108 75 -121 115 -20 -25 -94 -94 -104 -38 87 104 -71 -131
7270 -131 87 145 64 80 -15 79 51 -222 6 -243 30 20 -3 9 -159 -87 -200 -177 -149 46 -27 -56 -65 67 130 30
7296 30 -135 -76 198 26 -123 -7 154 271 -105 -58 58 207 -42 -225 -176 -58 100 161 24 -65 -265 -5
7318 -5 -182 -156 -139 -53 -169 37 14 -119 -125 -14 24 198 157 -200 17 -49 46 86 176 326 -27 -111 14 88 14 -103
7344 -103 -176 -32 -139 -118 -89 13 -143 175 77 -92 101 -193 4 -31 109 -107 -27 10 -46 19 -54 -83 88 -120
7368 -120 -20 -61 -79 -119 14 -10 51 114 -110 -44 -79 -46 -112 35 4 47 -31 173 18 -144 -22 150 65 -22 140
7393 140 -110 219 -7 66 15 40 211 31 -81 41 -69 37 0 -116 196 145 -11 74 -42 -166 6 2 -178
7416 -178 -143 70 86 41 -65 -18 -32 93 -71 43 -12 -17 -58 66 -50 192 97 243 144 27 83 119 -227 -98
7440 -98 -21 -224 41 -84 -84 46 -138 -36 27 -192 -23 33 -51 245 -87 -61 -13 -38 -95 176 2 -19 30 -89
7464 -89 6 341 183 102 227 27 82 -9 -17 130 5 25 59 181 186 115 145 151 65 -14 -144 -68 34 68 7 -20 131
7491 131 268 80 29 110 45 171 41 -30 124 -3 -152 118 55 -92 -23 118 -26 -14 0 -25 -3 -192 -199 -16
7515 -16 -11 207 -34 32 83 -146 -118 24 -123 68 -10 -13 213 84 -80 16 132 -130 307 -83 311 162 263
7538 263 -274 63 198 -86 -77 -230 -32 -135 -38 135 122 -92 45 -91 65 -92 50 87 35 55 263 220 17
7561 17 63 -113 60 404 -38 211 81 -6 8 -69 164 -98 -11 -120 -72 -122 -19 46 -148 58 -10 0 68 3
7585 3 35 -170 87 67 149 59 13 -82 172 99 192 9 -128 278 -87 -9 -114 -144 -112 -22 -10 -338 50 -52 115
7610 115 52 18 -18 -330 26 -298 -107 -194 142 -233 -117 42 64 6 -77 -4 -35 72 -36 125 -11 -3 4 81 -45
7635 -45 -270 24 -225 -78 -171 130 -87 8 76 -180 -188 -180 -88 -111 -14 -103 57 72 6 -87 -83 11 142 22 80 125 176
7662 176 47 5 -98 172 -52 -40 69 -114 27 -68 65 27 194 -70 41 131 -160 -37 116 -84 -86 -113 -26
7685 -26 -3 39 74 -120 42 167 149 5 144 -28 -119 -103 -45 132 -183 92 47 1 -83 -163 -103 -41 0 -74 -105 120
7711 120 -64 129 132 -93 87 -150 331 -116 7 74 39 92 169 134 -81 25 -116 28 13 -266 6 -18 57
7734 57 -52 2 -33 -51 130 -80 10 19 -132 62 -50 -125 -39 -277 81 94 -18 170 58 -87 140 -130 25
7757 25 1 -77 59 201 -98 -53 20 5 -157 -153 -204 -125 -45 -143 -138 -121 -31 -75 80 30 88 -115 109 71 -89 9 -37
7784 -37 52 -103 60 322 75 266 84 175 -95 -22 73 -178 70 86 -165 93 -161 153 66 -116 -25 43 -97
7807 -97 165 -125 52 -47 12 -94 50 18 -131 232 -19 91 75 -26 52 108 -85 -194 -63 -139 17 -43 76
7830 76 391 -85 68 123 -110 -21 215 127 -141 -66 85 -104 99 -66 227 21 -47 25 -203 28 62 134 171
7853 171 98 30 130 -76 -39 104 112 -3 -139 -192 77 44 -215 -176 70 9 2 47 69 -33 163 -17 -90 -27 74
7878 74 -1 -40 78 -15 -186 132 184 -6 -17 -147 66 154 82 4 70 52 -159 222 61 -79 -23 -186 11 -5
7902 -5 26 290 -63 124 41 47 180 31 87 -219 -144 47 -103 203 -46 -234 19 -105 87 153 -75 112 -28
7925 -28 117 -13 -40 -175 22 -14 47 50 100 -61 -158 -68 134 187 -222 -264 -167 -1 72 -178 5 179 52 208
7949 208 -212 -36 51 -16 59 0 -15 -71 30 -58 -135 153 -2 36 -211 -243 -102 -3 318 16 198 66 -141 99
7973 99 -46 -7 88 145 74 -15 111 182 -56 -206 -67 185 -70 -42 43 81 -14 73 11 -39 -116 -90 -225 -5 38 -155
7999 -155 -96 285 72 102 -31 30 147 -68 -12 -49 -197 111 -75 -120 6 -116 4 90 -140 55 -271 -162
8021 -162 -8 -101 -168 108 248 -321 123 130 86 -157 19 -173 -82 103 18 39 208 -42 20 51 -22 128 -81 30
8045 30 297 73 -13 -57 176 59 267 -78 -51 -91 1 -76 67 -121 -106 -92 -33 59 -53 29 -70 113 -100 -41 228
8070 228 25 41 49 7 85 -39 -74 -40 69 135 -16 -273 -150 74 336 -162 153 17 151 57 -152 -231 95
8093 95 66 208 -69 145 19 -57 92 -155 -45 6 -214 36 25 -109 -141 -293 152 15 131 59 34 -166 -71
8116 -71 24 34 66 178 -69 69 108 105 244 -128 -56 116 152 5 -225 114 -116 -69 107 71 113 -61 24 -68 84
8141 84 114 -121 196 -114 -73 -77 -70 110 -135 -138 -63 -260 -60 -149 -159 -64 -54 88 60 -181 -29 160 -155 179 -3
8166 -3 -118 -79 -144 18 74 263 -108 -77 62 -162 -12 -99 -55 -240 23 -82 -246 63 82 2 -234 -39 -76 -6
8190fl
8191i
##END NTUPLES=NMR FID
##END=
