##TITLE=1H_Pr NCS-111
 CDCl3
 8 sc, 
 2.06.2022
##JCAMPDX= 6.0         $$ Bruker NMR JCAMP-DX V2.0
##DATA TYPE= NMR FID
##DATA CLASS= NTUPLES
##ORIGIN= UXNMR, Bruker Analytische Messtechnik GmbH
##OWNER= root
$$ XWIN-NMR		Version 3.5
$$ Thu Jun  2 14:07:57 2022 Russian Standard Time (UT+4h)  she@DPX200
##.OBSERVE FREQUENCY= 200.13135
##.OBSERVE NUCLEUS= ^1H
##.DELAY= (6, 6)
##.ACQUISITION MODE= SIMULTANEOUS
##.ACQUISITION SCHEME= undefined
##.AVERAGES= 8
##.DIGITISER RES= 18
##SPECTROMETER/DATA SYSTEM= spect
##.PULSE SEQUENCE= zg30
##.SOLVENT NAME= DMSO
##.SHIFT REFERENCE= (INTERNAL, DMSO, 0, 15.7039)
##AUDIT TRAIL= $$ (NUMBER, WHEN, WHO, WHERE, WHAT)
$$ ##TITLE= Audit trail, XWIN-NMR		Version 3.5
$$ ##JCAMPDX= 5.01
$$ ##ORIGIN= Bruker BioSpin GmbH
$$ ##OWNER= she
$$ F:/spectra/data/she/nmr/H-F/1/audita.txt
$$ ##AUDIT TRAIL=  $$ (NUMBER, WHEN, WHO, WHERE, WHAT)
(   1,<2022-06-02 14:06:28.06 +0400>,<she>,<DPX200>,
      <created by zg, POWCHK disabled, PULCHK disabled
       configuration hash MD5:
       00 E9 B6 7A A2 85 ED C7 34 08 36 98 17 FE 4E 26
       data hash MD5: 16K
       1C 8D 31 66 59 14 E7 B3 C4 8F 78 C8 5D 92 33 01>)
$$ ##END=
$$ 
$$ hash MD5
$$ B6 62 6A 10 08 85 8B 22 7A 82 40 85 F5 21 A8 33
##$RELAX= 
##$RELAX= 
##$RELAX= 
##$RELAX= 
##$RELAX= 
##$RELAX= 
$$ Bruker specific parameters
$$ --------------------------
##$DU= <F:/spectra>
##$EXPNO= 1
##$NAME= <H-F>
##$PROCNO= 1
##$TYPE= <nmr>
##$USER= <she>
##$AMP= (0..31)
100 100 100 100 100 100 100 100 100 100 100 100 100 100 100 100 100 100 
100 100 100 100 100 100 100 100 100 100 100 100 100 100 
##$AQSEQ= 0
##$AQ_mod= 1
##$AUNM= <au_zg>
##$AUTOPOS= <>
##$BF1= 200.13
##$BF2= 200.13
##$BF3= 200.13
##$BF4= 200.13
##$BF5= 200.13
##$BF6= 200.13
##$BF7= 200.13
##$BF8= 200.13
##$BYTORDA= 1
##$CFDGTYP= 0
##$CFRGTYP= 5
##$CHEMSTR= <none>
##$CNST= (0..31)
1 1 145 1 1 1 1 1 1 1 1 1 1 1 1 1 1 1 1 1 1 1 1 1 1 1 1 1 1 1 1 1 
##$CPDPRG= <>
##$CPDPRG1= <>
##$CPDPRG2= <>
##$CPDPRG3= <>
##$CPDPRG4= <mlev>
##$CPDPRG5= <mlev>
##$CPDPRG6= <mlev>
##$CPDPRG7= <mlev>
##$CPDPRG8= <mlev>
##$CPDPRGB= <>
##$CPDPRGT= <>
##$D= (0..31)
0 1.2 0 0 0 0 0 0 0 0.06 0 0.03 0 0 0 0 0.0002 0 0 0 0 0 0 0 0 0 0 0 0 
0 0 0 
##$DATE= 1654164387
##$DBL= (0..7)
120 120 120 120 120 120 120 120 
##$DBP= (0..7)
150 150 150 150 150 150 150 150 
##$DBP07= 0
##$DBPNAM0= <>
##$DBPNAM1= <>
##$DBPNAM2= <>
##$DBPNAM3= <>
##$DBPNAM4= <>
##$DBPNAM5= <>
##$DBPNAM6= <>
##$DBPNAM7= <>
##$DBPOAL= (0..7)
0.5 0.5 0.5 0.5 0.5 0.5 0.5 0.5 
##$DBPOFFS= (0..7)
0 0 0 0 0 0 0 0 
##$DE= 6
##$DECBNUC= <off>
##$DECIM= 32
##$DECNUC= <off>
##$DECSTAT= 4
##$DIGMOD= 1
##$DIGTYP= 9
##$DL= (0..7)
0 120 120 120 120 120 120 120 
##$DP= (0..7)
150 150 150 150 150 150 150 150 
##$DP07= 0
##$DPNAME0= <>
##$DPNAME1= <>
##$DPNAME2= <>
##$DPNAME3= <>
##$DPNAME4= <>
##$DPNAME5= <>
##$DPNAME6= <>
##$DPNAME7= <>
##$DPOAL= (0..7)
0.5 0.5 0.5 0.5 0.5 0.5 0.5 0.5 
##$DPOFFS= (0..7)
0 0 0 0 0 0 0 0 
##$DQDMODE= 0
##$DR= 18
##$DS= 0
##$DSLIST= <SSSSSSSSSSSSSSS>
$$ [...]
##$SUBNAM2= <"">
##$SUBNAM3= <"">
##$SUBNAM4= <"">
##$SUBNAM5= <"">
##$SUBNAM6= <"">
##$SUBNAM7= <"">
##$SUBNAM8= <"">
##$SUBNAM9= <"">
##$SW= 18.05172834244
##$SWIBOX= (0..15)
0 0 2 0 0 0 0 0 0 0 0 0 0 0 0 0 
##$SW_h= 3612.71676300578
##$TD= 16384
##$TD0= 1
##$TE= 0
##$TE2= 300
##$TE3= 300
##$TEG= 300
##$TL= (0..7)
0 120 120 120 120 120 120 120 
##$TP= (0..7)
150 150 150 150 150 150 150 150 
##$TP07= 0
##$TPNAME0= <>
##$TPNAME1= <>
##$TPNAME2= <>
##$TPNAME3= <>
##$TPNAME4= <>
##$TPNAME5= <>
##$TPNAME6= <>
##$TPNAME7= <>
##$TPOAL= (0..7)
0.5 0.5 0.5 0.5 0.5 0.5 0.5 0.5 
##$TPOFFS= (0..7)
0 0 0 0 0 0 0 0 
##$TUNHIN= 0
##$TUNHOUT= 0
##$TUNXOUT= 0
##$USERA1= <user>
##$USERA2= <user>
##$USERA3= <user>
##$USERA4= <user>
##$USERA5= <user>
##$V9= 5
##$VALIST= <valist>
##$VCLIST= <CCCCCCCCCCCCCCC>
##$VD= 0
##$VDLIST= <DDDDDDDDDDDDDDD>
##$VPLIST= <PPPPPPPPPPPPPPP>
##$VTLIST= <TTTTTTTTTTTTTTT>
##$WBST= 1024
##$WBSW= 4
##$XGAIN= (0..3)
0 0 0 0 
##$XL= 0
##$YL= 0
##$YMAX_a= 50448
##$YMIN_a= -79513
##$ZGOPTNS= <>
##$ZL1= 120
##$ZL2= 120
##$ZL3= 120
##$ZL4= 120
##$ABSF1= 10
##$ABSF2= 0
##$ABSG= 5
##$ABSL= 3
##$ALPHA= 0
##$AQORDER= 0
##$ASSFAC= 0
##$ASSFACI= 0
##$ASSFACX= 0
##$ASSWID= 0
##$AUNMP= <proc_1d>
##$AZFE= 0.1
##$AZFW= 0.1
##$BCFW= 1
##$BC_mod= 2
##$BYTORDP= 1
##$COROFFS= 0
##$CY= 11.3945322036743
##$DATMOD= 1
##$DC= 2
##$DFILT= <>
##$DTYPP= 0
##$F1P= 2.36226072786647
##$F2P= -0.459571619588291
##$FCOR= 0.5
##$FTSIZE= 0
##$FT_mod= 4
##$GAMMA= 1
##$GB= 0.15
##$INTBC= 1
##$INTSCL= 1
##$ISEN= 128
##$LB= 0.24
##$LEV0= 0
##$LPBIN= 0
##$MAXI= 10000
##$MC2= 0
##$MEAN= 0
##$ME_mod= 0
##$MI= 1.114404
##$NCOEF= 0
##$NC_proc= 0
##$NLEV= 6
##$NOISF1= 3.799351
##$NOISF2= 2.8
##$NSP= 1
##$NTH_PI= 0
##$NZP= 0
##$OFFSET= 15.70392
##$PC= 1
##$PHC0= -18040.32
##$PHC1= 13.60074
##$PH_mod= 1
##$PKNL= yes
##$PPARMOD= 0
##$PSCAL= 0
##$PSIGN= 0
##$REVERSE= no
##$SF= 200.130013532006
##$SI= 16384
##$SIGF1= 3
##$SIGF2= 2
##$SINO= 400
##$SIOLD= 16384
##$SREGLST= <1H.CDCl3>
##$SSB= 0
##$STSI= 0
##$STSR= 0
##$SW_p= 3612.71676300578
##$SYMM= 0
##$S_DEV= 0
##$TDeff= 0
##$TDoff= 0
##$TI= <>
##$TILT= no
##$TM1= 0
##$TM2= 0
##$TOPLEV= 0
##$USERP1= <user>
##$USERP2= <user>
##$USERP3= <user>
##$USERP4= <user>
##$USERP5= <user>
##$WDW= 1
##$XDIM= 8192
##$YMAX_p= 0
##$YMIN_p= 0
$$ End of Bruker specific parameters
$$ ---------------------------------
##NTUPLES= NMR FID
##VAR_NAME=  TIME,          FID/REAL,        FID/IMAG
##SYMBOL=    X,             R,               I
##VAR_TYPE=  INDEPENDENT,   DEPENDENT,       DEPENDENT
##VAR_FORM=  AFFN,          ASDF,            ASDF
##VAR_DIM=   8192,          8192,            8192
##UNITS=     SECONDS,       ARBITRARY UNITS, ARBITRARY UNITS
##FACTOR=    0.0002768,     1,               1
##FIRST=     0,             0,               0
##LAST=      2.2672688,     0,               0
##MIN=       0,             -79513,          0
##MAX=       2.2672688,     50448,           0
$$ Real data points
##PAGE= N=1
##DATA TABLE= (X++(R..R)), XYDATA
0@%%%%%%%%%%%%%%%%qJ6j6J6j6J7k5L2l2M0m8N6o4P2q8J02j14J28j46J65j83K06
$$ 0 0 0 0 0 0 0 0 0 0 0 0 0 0 0 0 0 -8 8 -8 8 -8 9 -16 16 -16 24 -24 32 -32 40 -48 54 -60 68 -78 87 -96 110
38A10k33K58k86L19l54L92m33M78n31N86o44P12p86Q64r52J051j160J281j418
$$ 110 -123 135 -151 168 -186 206 -227 251 -280 306 -338 374 -412 452 -500 551 -609 672 -746
57g46J578j761J973k225K532k913L398m041M943o313Q652j3751M8751m9664n4736
$$ -746 832 -929 1044 -1181 1351 -1562 1836 -2205 2738 -3575 5077 -8674 40077 -9587 -64323
72f4323P7838K6097k5727k7563J1455k296N100J4562l800k9081O56K0910J1253
$$ -64323 13515 39612 13885 -13678 -2223 -4519 581 15143 11343 -17738 -17082 3828 15081
85A5081j2112j8672L651J3089o962K060O360m692j0266Q027J4371q060j1886J6063
$$ 15081 2969 -15703 -12052 1037 -5925 -3865 2495 -2197 -12463 -4436 9935 1875 -10011 6052
99F052M936j9417R761J9324j8534j8489K1359K0947k6032j8421K6820J1337k6968
$$ 6052 10988 -8429 1332 20656 2122 -16367 4992 25939 -93 -18514 8306 19643 -7325
112g325q598K0350J0101j5423j5281J2427Q941j0027j145N154n318m121J2486
$$ -7325 -15923 4427 14528 -895 -16176 -3749 5192 -4835 -5980 -826 -6144 -10265 2221
125B221P856j7438j0321K2987J0633j8953m478J3484L177r437p04Q074k828l854
$$ 2221 10077 -7361 -17682 5305 15938 -3015 -7493 5991 9168 -269 -973 7101 4273 419
139D19P094l902j1197Q948J2018j0119j7367N604K1672m753k2156M55J4776J398
$$ 419 7513 3611 -7586 1362 13380 3261 -14106 -8502 13170 8417 -13739 -13284 1492 2890
153B890p085J300O72p616L324J6860l066j8009K796J5386J304q187j636L741k615
$$ 2890 -4195 -2895 -2223 -9839 -6515 10345 7279 -10730 -7934 7452 8756 569 -1067 2674 59
168E9m60R621R56j3690m893J1832Q845q557j0175K876L101Q00M160m021j2641
$$ 59 -401 9220 10176 -3514 -8407 3425 12270 3713 -6462 -3586 -485 315 4475 454 -12187
183a2187K166J5993J656j6302n197J4923M801r229j180N583L15j933K389K482
$$ -12187 -10021 5972 7628 -8674 -13871 1052 5853 -3376 -4556 1027 1342 -591 1798 4280
197D280l549k123O044K015o226j645O491J428p830k328Q094N44r769J253N963
$$ 4280 731 -1392 4652 6667 441 -1204 5287 6715 -1115 -3443 4651 5195 -4574 -3321 2642
212B642l556l182K554K71l194J052L881k825m011N837L213m473k406L946M687
$$ 2642 -914 -4096 -1542 -1271 -4465 -3413 468 -2357 -6368 -531 2682 -1791 -4197 -251 4436
227D436k240m959L583M743l032j886J874J453k819r31M304j488n593L001K685
$$ 4436 2196 -2763 820 5563 2531 645 2519 3972 1153 222 4526 3038 -2555 446 3131
242C131n030j039L279l49m198l24N265o85n342J507K790O09k65j471R95J168k60
$$ 3131 -1899 -2938 341 -8 -4206 -4530 735 50 -5292 -3785 -995 -386 -651 -2122 -1127 41 -219
259b19L173l74m250J716M683J104n488j964O090J98m899J406O83k272M42L54l61
$$ -219 2954 2580 -1670 46 4729 5833 345 -1619 4471 4669 -230 1176 1859 -413 29 383 22
276B2k304p64L035j844k199K239r8m12O8j90K931j135k654L321J938j158p63P72
$$ 22 -2282 -3046 -11 -1855 -4054 -1815 -1913 -2325 -2257 -2447 484 -651 -3305 16 1954 796 33 805
294H05J814o86n80K596k337j972L856j40l032o32R66J141k062j499J331j056o82
$$ 805 2619 1933 1353 3949 1612 -360 3496 3356 324 -308 658 1799 -263 -1762 -431 -1487 -2169
311b169Q35q16K27n69p75K749q23j575K610K70p03O27J587M87k152L95L966k038
$$ -2169 -1334 -2150 -1923 -2492 -3267 -518 -1341 -2916 -306 -36 -739 -112 1475 1962 -190 205 4171 2133
329B133j621K063l68N6k26r81J39j015L6Q23j856p84N45k82O16j772j051K754
$$ 2133 512 2575 2207 2263 2037 1056 1195 180 216 1039 -817 -1601 -1056 -1338 -722 -2494 -3545 -791
347g91o81j225J328J30j13K37J127R90j569P65J907j430O28J544j174nK25l7O16
$$ -791 -1472 -2697 -1369 -1239 -1352 -1115 12 1002 -567 198 2105 675 1303 2847 1673 1668 1893 1856 2472
366B472j590o23N80k72J26j249r54Q58j269L69Q73j964m24J507P45q44m16P93
$$ 2472 882 259 839 567 693 -556 -1510 -652 -1921 -1552 -679 -2643 -3067 -1560 -815 -1659 -2075 -1282
384a282R94k94R00P40j213J042Q18l42P11l12l69P90k87k2l93k18m18q80K10N46
$$ -1282 -288 -582 318 1058 -155 887 1705 1363 2074 1762 1393 2183 1896 1874 1481 1263 845 -35 175 721
404G21j736j85M32j164l11J401k22j373j36J215O96J52p3r43P57J871R42j655
$$ 721 -1015 -1200 -768 -1932 -2243 -842 -1064 -2437 -2573 -1358 -662 -510 -583 -1526 -769 1102 2044 389
422C89O6M66N76J136O6j656p79J347J010o56j752n93L09O05L03j995j228J551
$$ 389 455 921 1497 2633 2699 1043 264 1611 2621 1965 213 -380 -71 534 837 -1158 -2386 -835
440h35l27p64N65J5o09l92J128P44m90J76M47J51O97M37l9J109n32r95J129J529
$$ -835 -1162 -1926 -1361 -1346 -1955 -2347 -1219 -475 -965 -789 -342 -191 506 943 904 2013 1481 486 1615 3144
460C144o31j739j044J592N09k78j296j604N34R69n11k19j096j682J229K515m41
$$ 3144 2513 774 -270 1322 1831 1553 257 -1347 -813 156 -355 -574 -1670 -3352 -2123 392 -49
477d9k276j315K061K523l37j625q61J526K308m44j066Q91j27L0P79K98p70j296
$$ -49 -2325 -3640 -1579 944 607 -1018 -1879 -353 1955 1511 445 1336 1209 1239 2018 2316 1546 250
495B50L72J541r64j084N4p48L08l44j011J215N26k133r73J642J782j547j732J539
$$ 250 622 2163 1199 115 169 -579 -271 -615 -1626 -411 115 -2018 -2991 -1349 433 -1114 -2846 -1307
513a307P66P10O86j307j67J336N1J611L34j804r59O32K948q8m100l02K043N40
$$ -1307 -541 169 855 -452 -619 717 768 2379 2713 909 -50 582 3530 3442 -658 -960 1083 1623
531A623n43j766q40O10lO86o85j161J78k03J041J689k198p18K093K50m08j34P50
$$ 1623 1080 -686 -1526 -916 -919 -233 -918 -2079 -1901 -2104 -1063 626 -1572 -2290 -197 53 -355 -489 261
550B61J218p53o3P18N03N59j511j584K395N49r75r73p68L48K00K02j17j020j636
$$ 261 1479 726 663 1381 1884 2443 932 -652 1743 2292 1317 344 -424 -76 124 326 209 -811 -2447
569b447J324J066k66j993j309K349J872q38j254k77J263J650l76k61K37p71J043
$$ -2447 -1123 -57 -323 -2316 -3625 -1276 596 -242 -1496 -1773 -510 1140 764 503 740 -31 1012
586A012R03R2j015j181J527J374j425j168l09M05Q14p78j137K75o0l99p52j15
$$ 1012 1915 2007 992 -189 1338 2712 1287 119 -190 215 1029 251 -886 -611 -671 -1070 -1822 -1937
604a937J759j021q26J057K69k88M40M13L80o84Q10J062j28o38l01N90J690j93
$$ -1937 -178 -1199 -2025 -968 -699 -987 -547 -134 246 -438 372 1434 1306 668 367 957 2647 2454
622B454k140L7J033j06n90n07j34p88L91L99r03o82L88m67O3Q88m05p68O96J018
$$ 2454 314 351 1384 1278 688 181 47 -741 -350 49 -854 -1536 -1148 -1615 -1552 -664 -1069 -1837 -1141 -123
642a23k27n38Q54N17l29L13M36R0M36n7n20M50K76p99j05M79j32r90L94Rj381
$$ -123 -350 -888 -34 483 154 467 903 993 1429 1372 852 1302 1578 779 674 1153 1021 31 425 434 -947
663i47l37R82k14n06o51K68K04M34J08m68l09P04P96k01K4O9K96P68J95Jo14P62
$$ -947 -1284 -302 -516 -1022 -1673 -1405 -1201 -767 -659 -1127 -1436 -732 64 -137 -113 -44 252 1020 1215 1216 602 1364
685A364L9m0L21p88l78L08M6j061k44J09J62q16L68j72m92m8L29j89J57J49K73
$$ 1364 1403 1363 1684 896 518 826 872 -189 -433 -324 -162 -978 -610 -782 -1274 -1322 -993 -1182 -1025 -876 -603
706f03K36j84K56M13L63o3j01P80L37q77O85L06m77k06J47K74n61m31J81l98j45
$$ -603 -367 -551 -295 118 481 418 317 1097 1434 557 1242 1548 1071 865 1012 1286 725 294 475 77 -68
727f8r6m09k58J25k58N1j99l28N58O3j46M3J74M22K52k35J064j07k99Q59j57k66
$$ -68 -164 -573 -831 -706 -964 -913 -1112 -1440 -882 -819 -965 -922 -748 -326 -74 -309 755 648 349 1208 1051 785
749G85K01M79j17m31k77M98m51p87K16l95J18r4o47K11k97k37K98j69l2K87OM94
$$ 785 986 1465 1348 917 640 1138 687 -100 116 -279 -161 -255 -902 -691 -988 -1225 -927 -1096 -1128 -841 -835 -341
771c41l71J74O10J4l44R23p0r6N69m1Q3q6j35M04n74k1j41l68K46m68l77K25m09
$$ -341 -712 -538 72 86 -258 665 595 499 1068 1027 1110 1024 889 1293 719 698 557 189 435 -33 -410 -185 -594
794e94l22N57o31m7j97m6O10n26L81M89m28L92O69l90M32P3M89J03l27L25K67
$$ -594 -916 -359 -990 -1037 -1234 -1280 -670 -1196 -815 -326 -754 -362 307 -83 349 422 911 1014 687 1012 1279
815A279l16n6J24n64N55p70j87K88o03l34L83n67j97k51K63j0m80M21N11m82L68
$$ 1279 963 907 1031 467 1022 252 65 353 -250 -584 -201 -768 -965 -1216 -953 -963 -1443 -1022 -511 -993 -625
836f25L88P2M58m13J62O50l16N64J24n31O06k77j01M09n92l60M31l67k24J13l45
$$ -625 -237 -165 293 -120 42 692 376 940 1064 533 1139 862 761 1170 578 218 649 282 58 171 -174
857a74l55k17L5J22n40M10j24l81O63j82j89J32M50O18J68m59L61M4M52M94n25
$$ -174 -529 -746 -711 -589 -1129 -719 -843 -1224 -561 -743 -932 -800 -350 268 436 -23 338 382 834 1328 803
878H03J38j91J78l5L03o34p8j94R6m48r9%n34o3M8n2n09J70J95j44L78j40K42
$$ 803 941 750 928 893 1196 562 484 290 386 -62 -161 -161 -695 -758 -710 -762 -1271 -1101 -906 -1050 -672 -812 -570
901e70L00J41J29K06K63N9O0N02m6p6Q9j9l70l31N73m45l52j70k58l9J87j36m76
$$ -570 -270 -129 0 206 469 528 588 1090 1044 968 1057 1038 668 337 910 465 113 -57 -315 -354 -167 -303 -779
924g79n5J28j45J53k65Q7L1J38L10L4J67o6K96P17P6n02j69Q20M09o84J16K28
$$ -779 -834 -706 -851 -698 -963 -876 -845 -707 -397 -363 -196 -262 34 751 827 325 156 976 1385 701 817 1045
946A045m13l54P09m36k24m51J3J6k66m06L3l20N61n36K01K61K12p52M56M09j3
$$ 1045 632 278 987 551 327 -124 -111 -95 -361 -767 -734 -1054 -493 -1029 -828 -567 -355 -1107 -651 -242 -255
967b55J11j84N34J58M08L20o82M24K01k23K9J01m09m06K12K99l39j002K10J33
$$ -255 -144 -328 206 364 772 1092 410 834 1035 812 841 942 533 127 339 638 299 -703 -493 -360
987c60O2j12o58pN68l92R0L50j61j14K13L69N48p61N16N96m47M48Q9k47K28j41
$$ -360 -298 -410 -1068 -1075 -507 -899 -809 -459 -620 -734 -521 -152 396 -365 151 747 300 748 837 590 818 677
1009F77N0l9r5J33k19n08J92J87o46j38j33J8j66l30L12j48N5j4J53K99l07m38
$$ 677 727 688 593 726 507 -1 191 378 -268 -406 -539 -521 -687 -1017 -705 -853 -798 -812 -659 -360 -667 -1105
1031a105J310L81m12k30M23L77l41K15L88p5o75O21o8m71K37m51K86k65m83M66
$$ -1105 205 586 174 -56 367 744 403 618 1006 931 256 877 809 338 575 124 410 145 -338 128
1051A28n71k52K99k94j88L80j93M5j34K16N84o34j27P75J29J23K3j34Q73o01J55
$$ 128 -443 -695 -396 -690 -878 -498 -691 -646 -780 -564 20 -614 -741 34 163 286 309 175 1048 447 602
1072F02N17n2p06K50K82P4n42p35K81m5l15M2P0l62k56l0N81o54j28O83j4j3L02
$$ 602 1119 1067 361 611 893 967 425 -310 -29 -74 -389 -347 -277 -639 -895 -925 -344 -998 -1126 -443 -457 -470 -168
1095a68j81J74K7L38L38l69J70N84p5k80K46J1O7m93l0L21l84m95K45l15k30n0
$$ -168 -349 -175 -148 190 528 159 329 913 838 558 804 815 882 389 359 680 296 -199 46 -269 -499 -549
1117e49K90l37m35K43J3L5N0R5Q8L85l08M33K94l10N0M25J10q6j94P31j95m84
$$ -549 -259 -596 -1031 -788 -775 -740 -690 -595 -507 -122 -430 3 297 -13 37 462 572 486 292 1023 828 344
1139C44M56n7l14k8K51l45k47k67J87l37l24J90j92o0k09L17K46m56J2N19l4R5
$$ 344 800 743 429 401 652 307 60 -207 -20 -357 -681 -491 -683 -743 -952 -635 -389 -845 -833 -314 -348 -253
1161b53N9K80L28j43N6M07l66J4L33rL4k99K5L26o32j8J14q7k13m7m20j9j81J32
$$ -253 -194 86 414 271 327 734 368 382 715 706 740 441 466 792 160 142 256 169 -44 -91 -511 -530 -711 -579
1185e79j24j37m2K88J51n6m0O59j64K3m3L38P3R9J34M89l68o8M08k12n97M0Q1
$$ -579 -703 -840 -882 -594 -443 -499 -539 120 -44 -21 -64 274 347 446 580 1069 701 633 1041 829 232 272 353
1208C53J87k42j81r1l38r6j19Q7l06j65J60L90l62J81J94K10n8J29J50o9M6M35
$$ 353 540 298 117 26 -312 -408 -527 -440 -746 -911 -751 -361 -723 -542 -348 -138 -196 -67 83 14 60 495
1230D95R3n0l8K79j04k70J98k51L21m28o0J09l29k60J96l5o13N2N4K81n24J82
$$ 495 588 538 500 779 675 405 603 352 673 245 185 294 -35 -295 -99 -134 -747 -695 -641 -360 -884 -702
1252g02J01J9l06M51j30J35M50j25M79l33K51N53j55j99K67q7Q2l34J2m5j46n2
$$ -702 -601 -582 -888 -437 -567 -432 18 -107 372 39 290 843 688 489 756 669 751 417 429 384 238 186
1274A86M6j50k71j58l41O21p27J48K10l57k4K32J29L41k60L62MJ14n5P3J41L39
$$ 186 232 82 -189 -347 -688 -67 -794 -646 -436 -793 -817 -585 -456 -115 -375 -13 -9 105 50 123 264 603
1296F03P1j89L69l12J3R7k35j50K75j87k72l78J79M2n18k2K55l92J1J8J45J6k76
$$ 603 674 485 854 542 555 652 417 267 542 355 83 -295 -116 -74 -592 -614 -359 -751 -740 -722 -577 -561 -837
1319h37J95M72j85J90K68K43l63M06J28Qk23K98n0J68j62J97k75K0k63J73k92
$$ -837 -642 -170 -355 -165 103 346 -17 389 517 525 302 600 550 718 556 753 478 498 235 408 116
1340A16k68J05k53j94kK2k04J16k46J53K21n0q8L30Q7J3K12m3K77J04K75r1q6
$$ 116 -152 -47 -300 -494 -496 -474 -678 -562 -808 -655 -434 -484 -572 -242 -155 -142 70 27 304 408 683 592 506
1363E06j40L6L69l95K56k51j0j53j81Q5l05j76J50M5m05M7o5k1K94l94K38L43
$$ 506 366 402 771 376 632 381 371 218 37 122 -183 -359 -209 -164 -569 -522 -587 -608 -314 -708 -470 -127
1385a27o00N61j18J51L8J99L27p8m0L66N9j5P1l05k59K50k64L3j58k18R6j61k36
$$ -127 -727 -166 -284 -133 -95 104 431 353 313 679 738 723 794 489 230 480 216 249 91 -127 -31 -192 -428
1408d28j25P7l6K17k51j03L77k98J54J42M45k14k54N15R6j5J50k8j86J20L83k78
$$ -428 -553 -476 -512 -295 -546 -649 -272 -570 -416 -274 171 -43 -297 218 314 299 449 421 235 355 738 460
1430D60j92m8L77n36K24j60J5k28N7l37K77o12J09J37K20j85m3n7K01O8Q2J74
$$ 460 268 220 597 61 285 125 140 -88 -31 -368 -91 -703 -594 -457 -237 -422 -465 -522 -321 -253 -171 3
1452CJ13j55L0J82Q5k2L94J55k38N5j8R6m68Q2j81K24l36j64l6j00j42J73k36
$$ 3 116 -39 -9 173 258 236 630 785 547 602 584 680 212 294 113 337 1 -163 -199 -299 -441 -268 -504
1475e04m5kj88K8K16J20p8J86J61%J7J8J09M24n6R0k27K86j9P3l78L66j4m34K52
$$ -504 -549 -551 -739 -711 -495 -375 -453 -267 -106 -106 -89 -71 38 462 406 496 269 555 536 609 231 597 583 149 401
1500D01j26l50k88K46j72j15p2K10l42l3J85J19k88L43j09K71o5L46L6N8n5J17
$$ 401 275 -75 -363 -117 -289 -404 -476 -266 -608 -641 -456 -337 -625 -282 -391 -120 -185 161 197 255 200 317
1522C17j38K62r0K0K53l88L53k64j26pN6l48J68k28k43K06j19j63O0o3K79l68
$$ 317 179 441 351 371 624 236 589 325 199 192 248 -100 68 -160 -403 -197 -316 -479 -419 -482 -203 -571
1544e71K0K17%j8M45m19L79nM0K54j54K34l9J66p2j10J93m16J6K16k15j72P0j04
$$ -571 -551 -334 -334 -352 93 -326 53 48 88 342 188 422 383 549 477 367 560 144 160 376 161 -11 59 -45
1568d5l84L34j27l26J77k77L58j23L3Q7J87k87L02j8J14J12k4K84k33K31J65K9
$$ -45 -429 -95 -222 -548 -371 -648 -290 -413 -380 -293 -106 -393 -91 -109 5 117 93 377 144 375 540 569
1590E69o5J94l82m6Q8k35lJ95m30k35J61j82K2mj3j28K79m7k39J7j26N13k44L42
$$ 569 504 698 316 270 358 123 120 315 -115 -350 -189 -371 -349 -353 -366 -494 -215 -262 -501 -484 -610 -97 -341 1
1614Aj44L72J88j76r8K02K81L8k46k1j68K28N3k22q7k68k88N03k70k92J17q2r3
$$ 1 -143 229 417 241 143 345 626 664 418 397 229 457 510 288 201 -67 -355 148 -122 -414 -297 -379 -472
1637d72K4Q5j95K2R5J96R1PJ52k03L50%j7K26K50l53L34j69j62l1m5J56J18l22
$$ -472 -448 -363 -558 -536 -441 -245 -154 -147 5 -198 152 152 135 361 611 258 592 423 261 230 185 341 459 137
1661A37J77m74J06k5l0j42n1K27l23k33K48j12l8j0J66R6J38K10J07j59L8N3K10
$$ 137 314 -160 -54 -79 -109 -251 -302 -75 -398 -631 -383 -495 -533 -543 -377 -281 -143 67 174 15 53 106 316
1684C16K77j80M5J78j97k31K78k11q0N8q5j76O7j71j48R9k37P9k5n61L85J67J54
$$ 316 593 413 458 636 439 208 486 275 195 253 168 -8 59 -112 -260 -161 -398 -319 -344 -905 -520 -353 -199
1707a99m62L81K86j25Q9L11m3l29K19L11K6j57P3L2J07Q3k54k46Rj18o1Q6k52
$$ -199 -661 -280 6 -119 -30 281 238 -91 128 439 465 308 381 413 520 603 349 103 112 -6 -67 19 -233
1730b33R5n5k44K04m54L92l12K7J6L82m4J05j26J60l5K89J56k09N5J54M1p2J46
$$ -233 -138 -193 -437 -233 -687 -295 -607 -580 -564 -182 -226 -121 -247 -87 -122 167 323 114 169 323 364 292 438
1753D38j41K60k04l81K73J7k27M0j27J2k77J31o9j75p8K4L8K19j63K27K2J11r2
$$ 438 297 557 353 -28 245 262 35 75 -52 -40 -317 -186 -255 -430 -508 -484 -446 -227 -390 -163 -141 -30 -122
1776a22M6K87j7j64J86Q4J05n1K6Qj19J55j84j5k75o1L41m06J10m4p0k73J08k24
$$ -122 -76 211 194 30 216 300 405 354 380 388 269 424 240 225 -50 -111 230 -176 -66 -110 -180 -453 -345 -569
1800e69O5K13n3n2K5L2M51l18L54K66l82M99m56K53J68m00K97K76l00K7j60m9
$$ -569 -504 -291 -344 -396 -371 -339 112 -206 148 414 32 531 75 328 496 96 393 669 369 396 236 187
1822A87J50l15k12Q1MM4m03j14M00m47J60J80l94L68K09l93K26o2L20J88j74J68
$$ 187 337 22 -190 -109 -105 -61 -464 -578 -178 -625 -465 -285 -679 -311 -102 -495 -269 -331 -11 177 3 171
1844A71J10L0Q7j75J60lp6J63R9n24K28n04K15O1l37P6j1l4o6q7J42k9j08P9L83
$$ 171 281 311 398 223 383 380 304 467 566 42 270 -234 -19 42 -295 -219 -230 -264 -330 -417 -275 -304 -412 -333 50
1869E0m26J17J38j7K40k89K43K83l1k2jJ08l1J70l22J70K27m77j78J73n0P5k07
$$ 50 -376 -259 -121 -138 102 -187 56 339 308 286 285 393 362 532 210 380 607 130 -48 125 75 150 -57
1892e7j99k28J75J33k14K71k11k3L1K98l9lO2Ko5l6L59l8K93j89p9m9K17q0J60
$$ -57 -256 -484 -309 -176 -390 -119 -330 -353 -322 -24 -63 -66 -4 -2 -67 -103 256 218 511 322 243 194 411 331 491
1917D91j57l66L67k77R9j82L0l31K96l27q4l1K00l57J73K24o1r3L61k26L34j31
$$ 491 334 -32 335 58 157 -25 5 -326 -30 -357 -441 -472 -272 -629 -456 -232 -293 -386 -25 -251 83 -48
1939d8QJ00K31j00R1J41k67L57k13J68k23j84Q5J07k06q8k10J52k00o5K6m8m4
$$ -48 -40 60 291 191 282 423 156 513 300 468 245 61 146 253 47 -41 -251 -99 -299 -364 -338 -386 -430
1962d30k1ON7J86J64n1J51q4kJ11jK94k08L05k5k15J18j67J14j20p7j14K09K4
$$ -430 -451 -445 -388 -202 -38 -89 62 -22 -24 87 86 380 172 477 452 237 355 188 302 182 105 -9 200 224
1986B24l96k6k41K67J50l13l4L1K0LO0j98O8O2J25K76l49K24J78k4J05J84k41
$$ 224 -172 -198 -439 -172 -22 -335 -369 -338 -318 -315 -255 -453 -385 -323 -198 78 -271 -47 131 107 212 396 155
2009A55J43J18m43L21p4j46O3m6J73j29O6k22k09k66J90j63K65j5l53j0K62K57
$$ 155 298 416 -27 294 220 74 137 91 264 135 201 -21 -230 -496 -306 -469 -204 -219 -572 -582 -320 -63
2031f3j09M5j04K82R6o2K04j95J70n9k86N34pk84K14q3j22k04K83j40k27j62J53
$$ -63 -172 -127 -231 51 147 85 289 94 264 205 -81 453 446 162 376 293 171 -33 250 110 -117 -279 -126
2054a26l64J16J04J75l00M0n1l3J48J93r4n1K10j07J73J61j80j87O81j05j64j3
$$ -126 -490 -374 -270 -95 -395 -355 -406 -439 -291 -98 -192 -243 -33 -140 33 194 14 -173 508 403 239 226
2076B26K45M1l12Jr2k10J85L6j60j71L05l69R0j30J37q6j32NJ57J21K7o6K9J96
$$ 226 471 512 200 201 109 -101 84 120 -40 -211 94 -275 -185 -315 -178 -264 -396 -391 -234 -113 -86 -152 -123 73
2100G3o1J53m6J07j32K98k33L51k84k37N25l29K61l28p1M7k54l5K41m21K94k17
$$ 73 12 165 119 226 94 392 159 510 226 -11 514 185 446 118 47 94 -160 -195 46 -375 -81 -298
2122b98J21k94J29K22k15M0J04p3L09j69J52R9k6K56k51J43K13j76n1k7J80J7
$$ -298 -177 -471 -342 -120 -335 -295 -191 -264 45 -124 28 127 101 357 106 249 462 286 235 208 388 405
2144D05o1l21P5M6j50k16M52l11k81J49r4j12J34m1K55o0j97K89M1j19j48K12
$$ 405 344 23 98 144 -6 -222 230 -81 -362 -213 -307 -419 -285 -326 -71 -131 -328 -39 2 -117 -265 -53
2166e3L41j38J01P0O6O4m6j52l50L45j54j8j30L87l62J78j04j92J33k15kn8J21
$$ -53 288 150 251 321 387 451 405 253 -97 248 94 76 -54 333 -29 149 45 -147 -14 -229 -231 -289 -168
2189a68j76K17l21K63Ml71O66r2j52J05K48j80J10J53L6J17k03j49L8Q9j96K78
$$ -168 -344 -127 -448 -185 -181 -552 114 22 -130 -25 223 43 153 306 342 459 256 107 145 234 38 316
2211C16l27J55k30j1J93n7j11l80M04j75j66J05J72O5j51J43o2J44j01J61k7J38
$$ 316 -11 144 -86 -97 96 39 -72 -452 -48 -223 -389 -284 -112 -47 -198 -55 -117 27 -74 87 60 198
2233A98O8l4Q2L6J3m5Q5n16K40j7j15r7p9L22m37J22k72P1J60j39J56j20J93k22
$$ 198 266 232 314 350 363 318 403 -113 127 110 -5 -102 -181 141 -296 -174 -446 -375 -215 -354 -198 -318 -125 -347
2257c47J36OK88k24J89J6J79J21k97L18j81l5L05m86K07K32l01o5Mp9J48l29J14
$$ -347 -211 -205 83 -141 48 64 243 364 67 385 204 169 474 -12 195 427 126 61 65 -14 134 -195 -81
2280h1m6o7n0K5o9q3L06l14L0J02K68k64L69j62K39n5mJ06L6p7n0J50p9p4M8N0
$$ -81 -127 -194 -244 -219 -288 -371 -65 -379 -349 -247 21 -243 126 -36 203 148 144 250 286 209 159 309 230 156 204 254
2306B54j44j94J87n0k70R8r1N5q0r8J15Rj1n1J02j45J83o9p5J65q5J65L6R3L23
$$ 254 110 -84 103 53 -217 -119 -210 -155 -235 -333 -218 -209 -220 -271 -169 -314 -131 -200 -275 -110 -195 -30 6 99 422
2331D22j49j6j10j4l3J42j81K65j35k77K44m08L85l60N7N8o7j01P1k40K79j13
$$ 422 273 257 147 133 100 242 61 326 191 -86 158 -250 135 -225 -168 -110 -177 -278 -207 -447 -168 -281
2353b81K21r9o7mK06j26J91J54j2p3J10p1k9K30p5J82l56K88j03j62n9qm4l35
$$ -281 -60 -159 -226 -230 -24 -150 41 195 183 110 220 149 120 350 275 457 101 389 286 124 65 57 13 -322
2377c22m4K64j09J55j82J18j94j78M36k53K43k33K89p0K9Q4J25N5o5o3L90l12
$$ -322 -366 -102 -211 -56 -238 -120 -314 -492 -56 -309 -66 -299 -10 -80 -51 33 158 213 148 85 475 163
2399A63j3J07r9J67k76O8K22l8m80J60k13L29j61k83M7K13l83K60J44k99J62j3
$$ 163 150 257 158 325 49 117 339 301 -179 -19 -232 97 -64 -347 -300 -87 -470 -210 -66 -365 -203 -216
2421b16j29M22k67L02P0j60J89j9k6k69K06K66k89K42l11R1j99L6K25k50Q5k18
$$ -216 -345 77 -190 112 182 22 211 192 166 -103 103 369 80 322 11 102 -97 -61 164 -86 -1 -219
2443b19p6J74k72L21k46k20M00k6k02O20m71K51J08m58M56j37L61j31j84L25n1
$$ -219 -295 -121 -393 -72 -318 -538 -138 -164 -366 254 -217 34 142 -316 140 3 364 233 49 374 323
2464C23l7k47L00l79j3P1K18k45Rj46K0p2J34p8k08K59j89J63OP8j64K87J6k10
$$ 323 286 39 339 -40 -53 18 236 -9 0 -146 -126 -198 -64 -142 -350 -91 -280 -117 -111 -33 -197 90 106 -104
2488a04J57pL84l76K10J87j93l6q6o6J76J93l06j68J89n9k51j30J07J18m7o8j66
$$ -104 53 46 430 54 264 451 258 222 136 70 246 439 133 -35 154 95 -156 -286 -179 -61 -108 -176 -342
2511c42nJ76l3J07k25m5J58l9J52J70K17k00J79M3M6O3n2j23J22j95K5J48k98
$$ -342 -347 -171 -204 -97 -322 -367 -209 -248 -96 74 291 91 270 313 359 422 370 247 369 174 199 347 49
2534D9J1k20J52O7P9k42j65j76K29J81o1j50J81j61J6K13Mm7j76L66j32P0J21
$$ 49 60 -160 -8 59 138 -104 -269 -445 -216 -35 -96 -246 -65 -226 -210 3 7 -40 -216 150 18 88 209
2557B09l00M95k49j0J13p5Q0l03O1O4p2q6o4j79M31j30R0l63JJ39j90Rp9L25j76
$$ 209 -91 404 155 145 258 183 263 -40 21 85 13 -73 -137 -316 115 -15 75 -288 -287 -148 -338 -329 -408 -83 -259
2582b59K09k16L22J2R4j41K24J02j25J0k8L8J7j25Pj54K33o5j13j36J4Q2J07k22
$$ -259 -50 -266 56 68 162 21 245 347 222 232 204 242 259 134 141 -13 220 155 42 -94 -80 2 109 -113
2606a13p0J54l17J45q5Q5k58L65J9K95k54r1J72J76k55J68M2n2J73j98J61K07
$$ -113 -183 -29 -346 -201 -286 -201 -459 -94 -75 220 -34 -125 47 223 -32 136 178 126 299 101 262 469
2628D69k61l4j06K50m20j18K29k10Q9K98n14K48j16j96M05k54l8J06o7L01n5j07
$$ 469 208 174 68 318 -102 -220 9 -201 -112 186 -328 -80 -196 -392 13 -241 -279 -173 -240 61 6 -101
2650a01K3K6Q1j74L89k93L95l49K85j24k87J75j41M5J19j19J04l46J91L7m5p4
$$ -101 -78 -52 29 -145 244 -49 346 -3 282 158 -129 46 -95 -50 69 -50 54 -292 -101 -64 -109 -183
2672a83R1r5l35M49j20J16J29rr6M1O0l0R1j98K91j23NL8J03m8j76J38p3J56l9
$$ -183 -92 -187 -522 -73 -193 -77 52 43 -53 -12 48 18 109 -89 202 79 84 122 225 177 1 139 66 222 183
2697A83j12p9k57l2N1k8R1j89P1M5Q8j2P5j00J48j3L8J26j37O6r9L47P8k36R5
$$ 183 71 -8 -265 -297 -246 -274 -183 -372 -301 -256 -168 -180 -105 -205 -57 -70 -32 94 -43 23 -76 271 349 113 208
2722B08r2j7J43j44L02k77%q3K7j84K53l02J00j28N4j07J48j19j41J90mN14m24
$$ 208 116 99 242 98 400 123 123 40 67 -117 136 -166 -66 -194 -140 -247 -99 -218 -359 -169 -173 341 -83
2745h3J09j64N17n64L30N8k83j08M30o1j4%j85J08j41J35k45L06R6l00j01J12
$$ -83 26 -138 379 -185 145 203 -80 -188 242 181 167 167 -18 90 -51 84 -161 145 241 -59 -160 -48
2767d8k59J85j83p7K20J42Ml34J94K58k99L07J67l93M7L07j63P3K45k74L16k76
$$ -48 -307 -122 -305 -382 -162 -20 -16 -350 -156 102 -197 110 277 -116 -69 238 75 148 393 119 435 159
2789A59K47l93N6p1K06J62l04j68J05R7l50K64j48J39l71J03M86j47j44j91K65
$$ 159 406 13 69 -2 204 366 62 -106 -1 96 -254 10 -138 1 -370 -267 219 72 -72 -263 2
2810Bo0L3K0J29L17n02L06K6j93K8J5m1K23j22j17jM7q7J56l06r7J95r0JM7j64
$$ 2 -58 -25 -5 124 441 -61 245 271 78 106 121 80 303 181 64 63 110 23 179 -127 -224 -29 -119 -118 -71 -235
2836b35N8q8P0l5L2J32J3j06K02k8k8J39Kr3M0J44l1oK30k49k1p4l78L06q6R9
$$ -235 -177 -265 -195 -230 -198 -66 -53 -159 43 15 -13 126 128 35 75 219 188 182 412 163 142 68 -310 -4 -90 9
2862Ip0O2k39O0m3M5nj27NK61M7j58M98m22K11j55nn0M5J39m5O5K65k47M6O0o8
$$ 9 -61 1 -238 -178 -221 -176 -181 -308 -303 -42 5 -153 345 -77 134 -21 -26 -76 -31 108 63 128 393 146 192 252 184
2889A84l3o8k27M9n2p8q6Q2J77j64k97K69J05j25M12j95j39K52j56O1K10l00N9
$$ 184 151 83 -144 -95 -147 -225 -311 -229 -52 -216 -513 -244 -139 -264 148 -47 -186 66 -90 -29 181 -119 -60
2912f0K05j2r6J21k10J67l9m1L08j93N4o4o8P6k85r4o8K15m3l32L21k02L00j04
$$ -60 145 133 37 158 -52 115 76 35 343 150 204 140 72 148 -137 -231 -299 -84 -127 -459 -138 -340 -40 -144
2936a44n9J55l3l1J8J69J33r3K32j26N7k02J02n7J8k05oJ38j61K08j52J40j57
$$ -144 -203 -48 -81 -112 -94 75 208 115 347 221 278 76 178 121 139 -66 -72 66 -95 113 -39 101 -56
2959e6J53j31j50P2k42J73J22k40K77k84R0L82k07j42K04J07P8l27J40J74j68
$$ -56 97 -34 -184 -112 -354 -181 -59 -299 -22 -306 -216 166 -41 -183 21 128 206 -121 19 193 25
2980B5L38k37K14n7o1k86O7m3J17Mj38j70K5J89N2l28K02J13k52J98l24M65k2
$$ 25 363 126 340 283 222 -64 3 -40 77 81 -57 -227 -202 -13 39 -289 -87 26 -226 -28 -352 113 91
3003I1k77p9R5J48JK86k94j4L03j32j40J66n3L49l89o4P9j53j20K24l4J01j56
$$ 91 -186 -265 -170 -22 -21 265 -29 -43 260 128 -12 154 101 450 61 -3 76 -77 -197 27 -7 94 -62
3026f2j41J31J9p3o4J27J4j99K01J19j31k18R8n7N08l3j88J47j98K57k55K32j7
$$ -62 -203 -72 -53 -126 -190 -63 -49 -248 -47 72 -59 -277 -179 -236 272 239 51 198 0 257 2 234 217
3049B17j0J47p9k07m7j11j47K31M7j12l47L01k19J52J55p5J30j39O5k21l6K79
$$ 217 207 354 275 68 21 -90 -237 -6 41 -71 -418 -117 -336 -184 -29 -104 26 -113 -48 -269 -305 -26
3071b6k5J02K9n6k67K52N4O41m78p8M6j29J8k03J58L0k36LM4K27o8o7l45J77j22
$$ -26 -51 51 80 24 -243 9 63 704 226 148 194 65 83 -120 38 68 -168 -165 -121 106 38 -29 -374 -197 -319
3096c19j61M52j50L03l32J32m6j16M20m4K37k93o4R6k8q3L25k26N9J03n29L04
$$ -319 -480 -28 -178 125 -207 -75 -121 -237 183 139 376 83 19 115 87 4 329 103 162 265 -264 40
3118D0j7j21J07k9j02n1K22k87L05l77J62r3J00Q6J41p9k31L86j29Rm2J51J23
$$ 40 23 -98 9 -20 -122 -173 49 -238 67 -310 -148 -241 -141 -55 86 7 -224 162 33 42 0 151 274
3141B74l02K74j62J25n6j78J86j36m7r2N5K26r9j1j20K31o53M90K63j34k13q6
$$ 274 -28 246 84 209 153 -25 161 25 -22 -114 -59 167 68 57 -63 168 -485 5 268 134 -79 -165
3163a65K65r6j89J80J52k58L5J24K88k47L12r8r4j37J93k73K13j49j52K96j22
$$ -165 100 4 -185 -5 147 -111 -76 48 336 89 401 303 209 72 265 -8 205 56 -96 200 78
3184G8j63r6J28q4J35l33o1K20J30pq8K7j15J51q3K53j58o7L61l13K33j5N5O3
$$ 78 -85 -181 -53 -137 -2 -335 -396 -176 -46 -53 -141 -114 -229 -78 -161 92 -66 -133 228 -85 148 133 188 251
3208B51J12Ll20O9l10L50j84Q5j13j08OL01n5k05n7k09K86j09m1J54j26J53N4
$$ 251 363 366 46 115 -195 155 -29 56 -57 -165 -159 142 87 -118 -175 -384 -98 -207 -248 -94 -220 -67 -13
3231a3O5M0J01k34K19k98K95j96J64K9l7J66j01k53J95k23J96J04l06K4K0P2l00
$$ -13 52 92 193 -41 178 -120 175 -21 143 172 135 301 200 -53 142 -81 115 219 -87 -63 -43 29 -271
3254b71J46J25lo0k5k6k09M10l78K27J92j45J90r5J06j93K0J48k60L80l53R0J07
$$ -271 -125 0 -3 -63 -88 -114 -323 87 -291 -64 128 -17 173 78 184 -9 11 159 -101 279 -74 16 123
3277A23L1j93j38m4P7m1Q8n8L47n71M51r0j01P7L9J5j51K31j44lK06j16j0n9M43
$$ 123 154 -39 -177 -221 -144 -185 -97 -155 192 -379 72 -18 -119 -42 -3 12 -139 92 -52 -55 151 35 25 -34 409
3302D09l07p9J90n7j57J5K47k29j4J87k95j24J53M6J75l75K73j02j16J96k46J12
$$ 409 102 23 213 156 -1 14 261 32 18 205 -90 -214 -61 -15 160 -215 58 -44 -160 36 -210 -98
3324i8Q1j35j41J83K73k41J50J78m38N13l4J4j57j19K05j89K2K40l0k62J91j49
$$ -98 -17 -152 -293 -110 163 -78 72 250 -188 325 291 305 148 29 234 45 67 307 277 15 206 57
3346E7k70K78m8j51R4k68K19k49K78k25K26P2k22M47l93J84n6J49j16n3K80R6
$$ 57 -213 65 17 -134 -40 -308 -89 -338 -60 -285 -59 13 -209 238 -155 29 -27 122 6 -47 233 329
3368C29k53l2J00O2j14J59j51j90L46l57K6J6J38m7j1O4l22J20K24k6j90j9j26
$$ 329 76 44 144 206 92 251 100 -90 256 -101 -75 -59 79 32 21 85 -237 -117 107 81 -109 -128 -254
3391b54M2L58k58N4M6n9j30L15O7o2k09K08J29l13K18l9M6Pk04L2J43j73p9J21
$$ -254 -212 146 -112 -58 -12 -71 -201 114 181 119 -90 118 247 -66 152 113 159 166 -38 -6 137 -36 -115 6
3415FNj60q6P0L92l81Q5l9R6J05j94j01M33k99L3J49k78N69k59K37j49j97Q9j15
$$ 6 11 -149 -235 -165 227 -154 -69 -108 -12 93 -101 -202 231 -68 -35 114 -164 405 146 383 234 37 126 11
3439A1J97j10j04l3L8q3K33j88k60J14j76J93R9j51K20j31m7m4K60q8J92k40L03
$$ 11 208 98 -6 -39 -1 -84 149 -39 -299 -185 -361 -168 -69 -220 0 -131 -178 -222 38 -50 142 -98 205
3462B05k6nj09J58o5j01K45k32J8J07l34M13j34K7k40n4J2J42M4j17j95M0n3j97
$$ 205 179 174 65 223 158 57 302 70 88 195 -139 274 140 167 -73 -127 -115 27 71 -46 -241 -201 -254 -451
3486d51M25j91J88Q8m9N7j19j04K54j1k49J58J31j34J51o4J15n7J00m8n88L29
$$ -451 -26 -217 -29 59 10 67 -52 -156 98 87 -162 -4 127 -7 144 80 195 138 238 190 -398 -69
3508f9j84K81j69J27j30J14r2o1J16r8L3r4j7k2K29P4K33l01R4j40K59j39j6K83
$$ -69 -253 28 -141 -14 -144 -30 -122 -183 -67 -165 -132 -226 -243 -265 -36 38 271 -30 64 -76 183 44 28 311
3532C11m5k58K56j09j08r6K76k64j86K18j76J90j07P9k90K68k09J70j21J40l7
$$ 311 266 8 264 155 47 -49 227 -37 -223 -5 -181 9 -98 -19 -309 -41 -250 -80 -201 -61 -98
3553i8J92j09K29n2k03L1j13M39p0j21Q1q8q0PJ83r1j59L05l80n2J39Q1N4k35
$$ -98 94 -15 214 162 -41 -10 -123 316 246 125 206 118 38 45 228 137 -22 283 -97 -149 -10 71 125 -110
3577a10j5Q9N2j50j36n7J65N1R2k2K4J68o7j5Mn1J45o5J18K87p37M41j06j70K46
$$ -110 -125 -36 16 -134 -270 -327 -162 -111 -19 -41 -17 151 84 69 73 22 167 102 220 507 -230 211 105 -65 181
3602A81p0j34j03J25k39k2J97k0n0P7Q3j71J56L7k81J40K0J80J22k91N6K27k56
$$ 181 111 -23 -126 -1 -240 -262 -65 -85 -135 -58 25 -146 10 47 -234 -94 -74 106 228 -63 -7 220 -36
3625c6J99m9j50J48J49l79K60k2j08qn5K43j29o5m2p9o4P7k68J78K86j09P2J3
$$ -36 163 114 -36 112 261 -118 142 120 12 4 -51 192 63 -2 -44 -123 -187 -110 -378 -200 86 -23 49 62
3649F2k12J00j0J24o9L05l21K2M3J84L5m19K14L0q4J26l60L73j71K04m01P9K24
$$ 62 -150 -50 -60 64 -5 300 -21 1 44 228 263 -156 58 88 4 130 -230 143 -28 176 -225 -146 78
3672G8j96N2O9k96P1J37M1j27n3N4Q6K18j57P8k03K92R9l06L19j54j21J42j72
$$ 78 -118 -66 3 -293 -222 -85 -44 -171 -224 -170 -84 134 -23 55 -148 144 243 -63 256 102 -19 123 -49
3695d9L26j31J99j22k30M3L2j5j39j4J55l02J03Q7q1n0mR8J71j20K6j57J18K14
$$ -49 277 146 345 223 -7 36 68 53 -86 -100 55 -247 -144 -57 -138 -188 -192 -94 77 -43 -17 -174 -56 158
3719A58K27k97j72L69j54j3l9l9P0j8K2k5j01k4n4J73m5M2k62K32p0j46K85N5
$$ 158 385 88 -84 285 131 118 79 40 110 92 114 89 -12 -36 -90 83 38 80 -182 50 -20 -166 119 174
3743A74l36J90l20K71L40l60Ko1K13k27M02k92q1J01K75j47j55J77Kj36N8j67
$$ 174 -162 28 -292 -21 319 -41 -39 -100 113 -114 288 -4 -85 16 291 144 -11 166 168 32 90 -77
3765g7K27p3j16Q5rk48r5J36N6j65p8L09n5J44q3l2j50J87M2J59M7q7O3p0J66
$$ -77 150 77 -39 46 37 -211 -306 -170 -114 -279 -357 -48 -103 41 -42 -74 -224 -37 5 164 211 124 187 117 283
3790B83j0j37K03j89l05J44Jj67O7l8J66j22q7M87l22n3j03K15P9k57K81p3J2
$$ 283 273 136 339 150 -155 -11 -10 -177 -110 -148 18 -104 -191 296 -26 -79 -182 33 112 -145 136 63 75
3813G5P1k34q2L39o6k97R4J80j11K25k37Q2OP8j75l9J93K8k7l01o1L81k77J72
$$ 75 146 -88 -170 169 103 -194 -100 80 -31 194 -43 39 45 123 -52 -91 102 130 103 -198 -259 122 -155 17
3837A7j91j2J79j40j51J06n7mL21l66O0L66lJ08l1j33J37K8R2k98K5k28K57p2
$$ 17 -174 -186 -7 -147 -298 -192 -249 -253 68 -298 -238 128 125 233 202 69 206 234 326 28 53 -175 82 10
3861A0j08L25k24P0R6m08J43J15l7Q5k53K39j94k2J2J31n5J19j46K33j87J41M1
$$ 10 -98 227 3 73 169 -239 -96 19 -18 67 -186 53 -141 -163 -151 -20 -75 44 -102 131 -56 85 126
3884A26j4l3j6M4j12K91k01r0l8R2o1J48k47L74m41J9J15j87L08q9k55K50q0R1
$$ 126 112 79 63 107 -5 286 85 -5 -43 49 -12 136 -111 263 -178 -159 -44 -231 77 -12 -267 -17 -97 -6
3908fQ7r1m8Q4j53J69J9J56j28k2P9JK0P5j50P2l01K46k28O3K6J19m86M99l58
$$ -6 81 -10 -58 26 -127 42 61 217 89 67 146 147 167 242 92 164 -137 109 -119 -56 -30 89 -397 102 -256
3933b56K99k41K9K31j09j37Q4O8P7k45K16j11mK88k51Q7mJ38j7k1k05J91j28m1
$$ -256 43 -198 -169 62 -47 -184 -100 -32 45 -200 16 -95 -99 189 -62 25 21 159 142 121 -84 107 -21 -62
3957f2J66j15Q4J18r5l21J54k88N15l75J81r2J53j74K60k11o8j2O3Q7o5r8K59
$$ -62 104 -11 73 191 96 -225 -71 -359 156 -219 -38 -130 23 -151 109 -102 -170 -182 -119 -32 -97 -195 64
3980F4n7L2J15L3r6Q1K44k77j60j1J60j78J56j25k6K0j19L23l87r1M37j93l26
$$ 64 7 39 154 187 91 172 416 139 -21 -32 128 -50 106 -19 -45 -25 -144 179 -208 -299 138 -55 -381
4003c81J63p7L81k74K55j73L57j22k8l30L59j25L5R6j99R1lP8J42k22J7j29qp3
$$ -381 -218 -295 86 -188 67 -106 251 129 101 -229 130 5 40 136 -63 28 25 103 245 23 40 -89 -97 -170
4027a70O5J5r5J39J73j50J5J14k74J43jp5M3J56k26J46l29N58o6q0J31k4k58K95
$$ -170 -105 -90 -185 -46 127 -23 -8 106 -168 -25 -26 -101 -58 98 -128 18 -311 247 181 101 232 208 -50 245
4051B45j76j9L2ok47K80k02p5LL52n4k54M5J09Q7k95K7P3L2R9n2r6R7p7J81L1
$$ 245 69 50 82 76 -171 109 -93 -168 -165 187 133 -121 -76 33 120 -175 -148 -75 -43 56 4 -92 5 -72 109 140
4077A40k50J27k1K7J46l00J39P7m2k32L56l54j9J95K51l50J17j84K02j96jJ82
$$ 140 -110 17 -4 23 169 -131 8 85 43 -189 167 -187 -206 -11 240 -110 7 -177 25 -171 -172 10
4099A0NJ1j17M43m42p0K35k08J0J21L6R8p9k09K37j28J89j00o1R7k48K44j19j30
$$ 10 15 26 -91 352 -90 -160 75 -133 -123 -2 34 132 53 -156 81 -47 142 42 -19 78 -170 74 -45 -175
4123a75R0J09q5RJ09j29p2K97k75l3M0n2K45j84o8K49K5j49R6K89l62n7J59j54
$$ -175 -85 24 -61 -52 57 -72 -144 153 -122 -155 -115 -167 78 -106 -174 75 100 -49 47 336 -26 -83 76 -78
4147g8J88k39L55N1l50L2J78o0k39K22l21L07k01o2LJ44J33Kk28L51k94R7L13
$$ -78 110 -129 226 277 -73 -41 137 77 -162 60 -261 46 -155 -217 -214 -70 63 65 -163 188 -106 -9 304
4170C04k08n1k28J09J78K39r4j80J16l7j03Q4j99J93Q2j47l9J35o7j51n8J33J7
$$ 304 96 45 -183 -74 104 343 249 69 185 148 45 129 -70 123 205 58 19 154 87 -64 -122 11 28
4193B8J40j83j00MP1M2j5j12k06K92l3J20j11K34k16J49L80k81k42J47j30J67
$$ 28 168 -15 -115 -111 -40 2 -13 -125 -331 -39 -72 48 -63 171 -45 104 484 203 -39 108 -22 145
4215A45l39J91J67l0o7Q2k17rj67K41P2k17J10O2l53K14L09j24k25L5K20N4k24
$$ 145 -194 -3 164 134 67 149 -68 -77 -244 -3 69 -148 -38 24 -329 -115 194 70 -155 -120 100 154 -70
4238g0K07o3j38N5K44k79J20kj00J24J06k09q3J40j65L4O7Qj55M22k68p3p8N4
$$ -70 137 74 -64 -9 235 -44 76 74 -26 98 204 -5 -88 52 -113 -79 -12 -4 -159 263 -5 -78 -156 -102
4262a02j22J40M1M4J34k18K09lj7l4P4n1P0j42MPO3p9J11l54K05R7j43K11k81
$$ -102 -224 -84 -43 1 135 -83 126 123 106 72 146 95 165 23 27 34 97 18 129 -225 -20 77 -66 145 -136
4287a36o1J06N3J0j87K17p0j94L25Q9j62nJ12k92N02j12m09N71l39m0r0M3J59
$$ -136 -197 -91 -38 -28 -215 2 -68 -262 63 152 -10 -15 97 -195 307 195 -214 357 18 -22 -112 -69 90
4310I0K89l1k11k20o3n3K80l32R3j4K30o7k23K09q3J83j53k41J93MNj70J07J76
$$ 90 379 348 137 -83 -146 -199 81 -251 -158 -172 58 -9 -232 -23 -106 77 -76 -317 -124 -120 -115 -285 -178 -2
4334bK15j3j3j83L62j71j0L7k86J98m1Lk63K78J69k09l20N36m71RK53k08QJ43
$$ -2 213 200 187 4 366 195 185 222 -64 134 93 96 -167 111 280 71 -249 287 -184 -175 78 -130 -122 21
4358B1k18O2K41j14p7j8J38M8j14n0M1K31J2Mo9j5M7k65K44p6O1j79j07J30J4
$$ 21 -197 -135 106 -8 -85 -103 35 83 -31 -81 -40 191 203 207 138 123 170 -95 149 73 134 -45 -152 -22 -8
4383hj96p5L18k10J57Mj02J18m5J67p3l8j06M5L47j86J1k9j1K4j86K75j00j8m7
$$ -8 -204 -279 39 -171 -14 -10 -112 6 -39 128 55 17 -89 -44 303 117 128 99 88 112 -74 201 101 83 36
4408C6J23o6lk6L9j57K35m57L51j43j83J43K1j29L44j74k61L04L8j46K19j4J08
$$ 36 159 93 90 64 103 -54 181 -276 75 -68 -251 -108 -87 -216 128 -46 -307 -3 35 -111 108 94 202
4431B02q5o5mj46J77m3L61l22p0MN6q0P8L5j19J23J39k91j3j98L39j71P7O1j46
$$ 202 117 52 48 -98 79 36 397 75 5 9 65 -15 63 98 -21 102 241 -50 -63 -261 78 -93 -16 45 -101
4456a01n2J04r1Q5p9J22j49N2K06j96P2M5K7o1J80K0n4L5j98Q6l5L8k8J61l31
$$ -101 -153 -49 -140 -55 -134 -12 -161 -109 97 -99 -27 18 45 -16 164 184 130 165 -33 53 18 56 28 189 -142
4481a42O6j64j31N04k67N3J03K3l52K12K31p2K4j71K7L52j09j78O0r2L5K19j73
$$ -142 -76 -240 -371 133 -134 -81 22 45 -307 -95 136 64 88 -83 -56 296 187 9 69 -23 12 231 58
4504E8J93L8j21l37J65j28K4J35Q5k74J98M1l34K36k60K17L9Q3j72Q5j4L0mj1
$$ 58 251 289 168 -169 -4 -132 -108 27 112 -162 36 77 -257 -21 -281 -64 -25 58 -114 -29 -43 -13 -17 -28
4528b8kK07R4l06K89l34K62k2j04J41P7j06j57J8O5j20J86j4j70m8K0k04K82M8
$$ -28 -30 177 271 -35 254 -80 182 160 56 197 274 168 11 29 94 -26 160 146 -24 -72 -52 -256 26 74
4552G4j82J4J53o8LJ78o5p9j17K73q1O3Q2l57K56j6q1j30K00R4k17J13%k42K54
$$ 74 -108 -94 59 -9 -6 172 107 28 -89 184 103 166 248 -109 147 131 50 -80 120 214 -3 110 110 -132 122
4577A22j61N8p1j49jL04J84l82N0M1k09J58N1Q6o8r1J00J17k77K18k08o0L53j57
$$ 122 -39 19 -52 -201 -202 102 286 -96 -46 -5 -214 -56 -5 81 13 -78 22 139 -138 80 -128 -188 165 8
4601Hn0j60J92J60k22M0M0J08j41j57m1K47j44K72l72K8l1K50J14j30M0j01Q6
$$ 8 -42 -202 -10 150 -72 -32 8 116 -25 -182 -223 24 -120 152 -220 -192 -223 27 141 11 51 -50 36
4624C6R7p1L3r9P7k66J46J1J07R8p5n0m6R8J21k45Q4j74J74j20n8j86K24L05k42
$$ 36 133 62 95 -4 73 -193 -47 -36 71 169 94 44 -2 96 217 -28 56 -118 56 -64 -122 -308 -84 221 -21
4649b1k38L60q9k82J53rQ6J87l90J90J87j14n1k51L93M1k69K59k73L8q2K5N7R0
$$ -21 -259 101 12 -270 -117 -126 -40 147 -243 -53 134 20 -31 -282 111 152 -117 142 -131 -93 -175 -150 -93 -3
4673cP9k38J27O6k49K49j99O3K30k88L33k94LJ74j57J61L7k18Qo8O3L16j60J01
$$ -3 76 -162 -35 31 -218 31 -168 -105 125 -163 170 -124 -121 53 -104 57 94 -124 -116 -184 -121 195 35 136
4697A36l4K2j71j18J68J77m24L55k99L02j40j81q6K06j12Q7J2j08J84QP4j4k62
$$ 136 102 124 -47 -165 3 180 -244 111 -188 114 -26 -207 -293 -87 -199 -112 -100 -208 -24 -16 58 44 -218
4720b18K68J26k02j51K68K56k99K11k19J5R9M1n2l36K51J30j26o6j81lM47k73
$$ -218 50 176 -26 -177 91 347 48 259 40 55 154 195 143 -193 58 188 62 -4 -185 -188 259 -14
4742a4j02Q3j87J41J30k0Lj08R3o5J93j21r6J19r9%J09J93n15J07M77j73Q4k18
$$ -14 -116 -33 -220 -79 51 31 34 -74 19 -46 147 26 -70 49 -50 -50 59 252 -263 -156 321 148 232 14
4766A4L1pP9K1l57K39j19J68j93J30o4q8Q7k47J75l3m0M8o4J87R8r8J61k51P3
$$ 14 45 38 117 138 -219 20 -99 69 -124 6 -58 -146 -59 -306 -131 -164 -204 -156 -220 -33 65 -33 128 -123 -50
4791e0J4J89J12j42j36j5L22l74P1k20K89k28K25k32N0K9M0N9j54j24L53k55R0
$$ -50 -36 153 265 123 -13 -28 294 -80 -9 -229 60 -168 57 -175 -125 -96 -56 3 -151 -275 78 -177 -87
4814h7J02k37M14j01l28R3K50j35j8q7J27k73L37J4O2l6J62l22q9M88j93lj57
$$ -87 15 -222 192 91 -237 -144 106 -29 -47 -134 -7 -280 57 71 133 97 259 -63 -152 336 143 140 -17
4837a7k14n7P2J28P9K20l00j34R9j33L30m0j47M6J3j03J61N1lr6J21q1k32K79
$$ -17 -231 -288 -216 -88 -9 211 -89 -223 -124 -257 73 33 -114 -68 -55 -158 3 54 51 -45 76 -5 -237 42
4861D2j20M8j76L18q6j15J55j01M7K4mj21m6M0k03J25m1J47jJ51K14n16L15n4
$$ 42 -78 -30 -206 112 26 -89 66 -35 12 36 32 -89 -135 -95 -298 -173 -214 -67 -68 83 297 -219 96 42
4885D2J55j07P8J60l61K45k02j28L44l31J64Q5n3j55n1K07j93J02r2K12m2k23
$$ 42 197 90 168 328 -33 212 10 -118 226 -105 59 144 91 -64 -115 92 -101 1 -91 121 79 -144
4907a44J9n3L69j75k30O4J53j48J97j03L26l29J50m6L9j09M8L0O4rk35K06p7j55
$$ -144 -125 -178 191 16 -214 -150 3 -145 52 -51 275 -54 96 50 89 -20 28 58 122 113 -122 84 7 -148
4931a48J95j89J75O0r7J60j26K9l02L98j99m6N9L6N6q6O7J16k98J51J87j69K83
$$ -148 47 -142 33 93 -4 156 30 59 -243 155 -44 -90 -31 5 61 -25 42 158 -140 11 198 29 312
4954C12k37J46j34O1k83J09K26k24PN1j16n2j00J41Rj18l6j95L27nOk07L59m9
$$ 312 75 221 87 148 -135 -26 200 -24 -17 34 -82 -134 -234 -93 -84 -202 -238 -433 -106 -111 -105 -312 47 -2
4978bj1P8k04J71M8Q3q8J23q7l3M4j6l7p4r0O3K23j13m1J37j10l6J75l92J28m7
$$ -2 -13 65 -139 32 80 163 75 198 111 78 122 106 69 -5 -95 -32 191 78 37 174 64 28 203 -189 -61 -108
5004a08k8J17j26J61l4M8L1K5o6j88K19l9j76K26J46k25M4j86J71O2K7K22k30
$$ -108 -136 -19 -145 16 -18 30 61 86 20 -168 51 12 -164 62 208 -17 27 -159 12 74 101 323 93
5027I3j15J88Ok85K40j96j25M9J79j85K58l60J17J0J27q6J60l26K46n1k7J46J66
$$ 93 -22 166 172 -113 127 -69 -194 -145 34 -151 107 -253 -136 -126 1 -85 75 -251 -5 -56 -83 63 229
5050B29j03J04k61J36l00O6M19j91j42K01j8j20J30k82J24k14J04J59O9k86R4
$$ 229 126 230 -31 105 -195 -129 290 99 -43 158 140 20 150 -132 -8 -222 -118 41 110 -176 -82
5071h2r9M4N3r5l6J23J69l17L27k5mm6q0K38j71k7P1K0j18J7N4K28q4R3j8m27
$$ -82 -181 -137 -84 -179 -215 -92 77 -240 87 62 58 12 -68 170 -1 -28 43 63 -55 -38 16 244 160 253 235 -192
5097a92J4NJ07J27o7pL27o44R8L97j67j9J37k0K4k54K43N2m40K27J27J2R9j64
$$ -192 -178 -173 -66 61 -6 -13 314 -330 -232 165 -2 -21 116 96 120 -134 109 161 -279 -52 75 87 186 22
5121B2J28K39m17M8k15J13L4K81o6j62j29k4j15L42r0j34q0Q2R1J17j71j57L52
$$ 22 150 389 -28 20 -195 -82 -48 233 167 5 -124 -148 -263 79 -11 -145 -225 -143 -52 65 -106 -263 89
5144H9P3n9J45m32K66o4m1J72j25J11K6j96K16l75K90k33p3q2K21M3L8L9J40l89
$$ 89 162 103 248 -184 82 18 -23 149 24 135 161 -35 181 -194 96 -137 -210 -292 -71 -28 10 49 189 -200
5168b00K14P6k71K06p0J6P9n1J09j3l9J9j3j51Pq4K50j93J12j8m0rj46K41l0l15
$$ -200 14 90 -181 25 -45 -29 50 -1 108 95 56 75 62 -89 -82 -166 84 -109 3 -15 -55 -64 -210 31 1 -314
5194c14J10M40j5m62M18k98n0Q4j41K55p7J37RK7q5k4K09j03p6O3j41M6K31j18
$$ -314 -204 236 221 -241 177 -121 -171 -87 -228 27 -50 87 96 123 38 14 223 120 44 107 -34 12 243 125
5218A25j07j07J02R1j5k86PJ61O2j75k08K16J35j63O5J15m9J00k99K45m1R3k29
$$ 125 18 -89 13 104 89 -197 -190 -29 33 -142 -350 -134 1 -162 -97 18 -31 69 -230 15 -26 67 -162
5241a62J8N55n12M2J66m5L7o8Q7J03j15k1k91R2L3Q6L8j69K34j41r4l4J78j75
$$ -162 -144 411 -101 -59 107 62 99 31 118 221 106 85 -206 -114 -81 5 43 -126 108 -33 -127 -161 17 -158
5265a58J55J64j22j51K24j02j36r5M04j81j10l8K9L58k07Q3j59K22l10K03M3K6
$$ -158 -3 161 39 -112 112 10 -126 -221 183 2 -108 -146 -117 241 34 117 -42 180 -130 73 116 142
5287A42l27K66j83L35l90J79J56k35qJ82j47j60J61j9k97j37L83J34Rq1J91k50
$$ 142 -185 81 -102 233 -157 22 178 -57 -65 117 -30 -190 -29 -48 -345 -482 -99 35 44 -37 154 -96
5309i6K37j27k29L59q0m8J8L9k4k05J58j73L86m82M27m83J91m3MJ36J14p1k38
$$ -96 141 14 -215 144 64 16 34 73 49 -156 2 -171 215 -267 160 -323 -132 -175 -171 -35 79 8 -230
5332b30O4K12K4o0J04l08L55k04J13p6m1K08j79L69j45k55o1K95j91p9o7NJ32
$$ -230 -166 46 70 10 114 -194 161 -43 70 -6 -47 161 -18 351 206 -49 -110 185 -6 -85 -152 -147 -15
5355a5j35o2J55J58j74J37J84m15R4N9k9j13j07J99K6k6L12j01p4m3j06K33Kj46
$$ -15 -150 -212 -57 101 -73 64 248 -167 -73 -14 -43 -156 -263 -64 -38 -64 248 147 73 30 -76 157 159 13
5379A3O9j8jm9q9k5O6j28J84Jj58m2J39J42k12j3J16K26j30O4k63j18K79J31j02
$$ 13 82 64 63 14 -75 -100 -34 -162 22 23 -135 -177 -38 104 -108 -121 -5 221 91 155 -108 -226 53 184 82
5404H2Rj20L32l12j84M2J13N4r8k74L87k57L93O9k72m1O9r0OL6K05j84J38N2k79
$$ 82 91 -29 303 -9 -193 -151 -38 16 -82 -356 31 -226 167 236 -36 -77 -8 -98 -92 -56 149 -35 103 155 -124
5429a24J72l42M30q1k09N1J95q0J20j76J8K56q4r2K12k99J39j66j60L25l02O8
$$ -124 48 -294 136 55 -154 -103 92 12 132 -44 -26 230 146 54 266 -33 106 -60 -220 105 -197 -129
5451a29J21J75k09J0j10J19j93J05J5j04L6J20J06k08J92J2J61m31J17K33R3l04
$$ -129 -8 167 -42 -32 -142 -23 -216 -111 -96 -200 -164 -44 62 -146 46 58 219 -212 -95 138 231 -73
5473g3J90l7J27Q4n4k40j9J39j78j28K09j06k17M05k51K0K6J29L2J24l73K96j39
$$ -73 117 80 207 291 237 -3 -22 117 -61 -189 20 -86 -303 102 -149 -129 -103 26 58 182 -191 105 -34
5496c4j2N8J81k09J02j3q3J61m9K4j36Q6J08j97l4J38j67J73r2j79K72j22P6j9
$$ -34 -46 12 193 -16 86 73 -10 151 102 126 -10 76 184 -13 -47 91 -76 97 5 -174 98 -24 52 33
5520C3M7q2n9J53k52N4K39j39p6J52j10M0K06l8J50j63j93j75N28o1k80J4p5J42
$$ 33 80 -2 -61 92 -160 -106 133 -6 -82 70 -40 0 206 168 318 155 -38 -213 315 254 -26 -12 -87 55
5544E5j01j27J00oK92k52O0N9j02N9j63j4L21k33j31K11q8o4K04j00l6k5ko6J90
$$ 55 -46 -173 -73 -79 213 -39 21 80 -22 37 -126 -140 181 -52 -183 28 -60 -124 80 -20 -56 -81 -83 -149 41
5569D1q1n4nL4K00m0k0m8K78j23k06j22J33j43K61m10K27r5J23J08M5K5k71K30
$$ 41 -40 -94 -99 -65 135 95 75 27 305 182 -24 -146 -13 -156 105 -305 -78 -173 -50 58 103 128 -143 87
5593H7l3j87j2K13l6j09J86R5k60K71J3j21j23k20K01k7Qo3j67L18J22k56j65
$$ 87 54 -133 -145 68 32 -77 109 204 -56 215 228 107 -16 -236 -35 -62 -54 -117 -284 34 156 -100 -265
5616b65L28j11K7r3J01m0o6K99L4j82n5P6j6M9o7j2J41Q8j45j09j81L45P2K3l62
$$ -265 63 -48 -21 -114 -13 -53 -119 180 214 32 -23 53 37 86 19 7 148 236 91 -18 -199 146 218 241 -121
5641a21J96J45j3j01j36J18n7k9j04M36m80J38K4r3L9p0L79l09j60J86Q8k18O5
$$ -121 75 220 207 106 -30 88 31 2 -102 334 -146 -8 16 -77 -38 -108 271 -38 -198 -12 76 -142 -77
5664g7L99j42L9l8L3j32p7K04q5k48L33j01n9l5o4pK05j22J22j99L1J26j40j86
$$ -77 322 180 219 181 214 82 5 209 124 -124 209 108 49 14 -50 -57 148 26 148 -51 -20 106 -34 -220
5688b20Q0K1L4J17mj59K02q3K10k94J66k03K60J07m9o1k49K25k40q8K61j70N1
$$ -220 -140 -119 -85 32 28 -131 71 -12 198 -96 70 -133 127 234 185 124 -125 100 -140 -228 33 -137 -86
5711h6J41j20J48k50R1J18q1j84J21K60k94K20j83k1L19j6k5k80L48M4k19Q7j05
$$ -86 55 -65 83 -167 -76 42 -39 -223 -102 158 -136 84 -99 -120 199 183 158 -122 226 270 51 138 33
5734C3k56J99J39j30p4J69jk56J70k52K88j11K11m0j28p1K5NoK7J72j03j11J34
$$ 33 -223 -24 115 -15 -89 80 79 -177 -7 -259 29 -82 129 89 -39 -110 -85 -80 -86 -59 113 10 -101 33
5758C3RN1j01j28J35o9M2j54K71k31Q0j97L02j02L1kK07p9j02j01q5K22k25J07
$$ 33 42 93 -8 -136 -1 -70 -28 -182 89 -142 -62 -259 43 -59 -28 -30 177 98 -4 -105 -190 32 -193 -86
5782h6j30K06j40j4M4k11J88J14K7J23R6Q8l42J86q3Jj85J3q1L25J17P6l52Q2
$$ -86 -216 -10 -150 -164 -120 -331 -143 -29 -2 121 217 305 -37 149 66 67 -118 -105 -186 139 256 332 -20 62
5806F2k4j7J48l24J14R3r0j96K24k0MK2L8N9j02K05j59J54l7j32P3J51k88M7K2
$$ 62 38 21 169 -155 -41 52 -38 -234 -10 -30 -26 -4 34 93 -9 196 37 191 154 22 95 246 -42 5 27
5831B7r1O1J77m42J41J76M7j77J51j21M2J00j02j08Q8R7k87L42j51J36L9O0j36
$$ 27 -64 -3 174 -268 -127 49 96 -81 70 -51 -9 91 -11 -119 -31 66 -221 121 -30 106 145 205 69
5854F9l17M74j75j57Q9P7J1P1R2j92j05j8M2K97m02J03j89L81o4q6Rk42J44J51
$$ 69 -248 226 51 -106 -17 60 71 142 234 42 -63 -81 -39 258 -144 -41 -230 151 87 1 10 -232 -88 63
5878F3o5k01O6l2M3PJ90j77J5J62n6j45N4J88M6j52K95j11l64o6L26k83K35j90
$$ 63 -2 -203 -137 -169 -126 -119 71 -106 -91 71 15 -130 -76 112 158 6 301 190 -174 -240 86 -197 38 -152
5902a52M7J01P9k11l3M2J74j84J17J10l09L36l37N8P6M7J84p9J43k72J61j31P2
$$ -152 -105 -4 75 -136 -169 -127 47 -137 -20 90 -219 117 -220 -162 -86 -39 145 66 209 -63 98 -33 39
5925C9n0J62j87J64N7j25J45M4k70J52j25o7K51l05K4j40P8O5K23j62k31M06k03
$$ 39 -11 151 -36 128 185 60 205 249 -21 131 6 -61 190 -115 -91 -231 -153 -88 135 -27 -258 148 -55
5948e5j11L90j68J20q1r3K45l18L17l05L07k36j45J95j23J13k7P1m9J49o2n4j28
$$ -55 -166 224 56 176 95 2 247 -71 246 -59 248 12 -133 62 -61 52 25 96 47 196 134 80 -48
5971d8L31k57P0q2j80J93j30n3K02m1L46m06N9K29k54RKl2Q9O9j54J12J97l33
$$ -48 283 26 96 14 -166 27 -103 -156 46 5 351 -55 4 233 -21 -12 -10 -42 47 116 -38 74 271 -62
5995f2J16j63Q2K0J1o2L6M3k11J93J1j15k85K24J38P1P5l21K27j2k19L34k20J22
$$ -62 54 -109 -27 -7 4 -58 -22 21 -190 3 14 -101 -386 -162 -24 47 122 -199 28 16 -203 131 -89 33
6019C3m3k3k1K55k55K80j04j59lk95L65N1k9j77j6K23ol01J05M5l3J45k9k51N0
$$ 33 -10 -33 -54 201 -54 226 122 -37 -40 -335 30 81 52 -125 -141 82 76 -225 -120 -75 -108 37 8 -243 -193
6044a93J92M2n4K13l16L75k91k9J04J04p7r7m9J16j3j94J30Q7p7k23K23P6j41
$$ -193 -1 41 -13 200 -116 259 -32 -61 43 147 70 -27 -76 40 27 -167 -37 50 -27 -250 -27 49 -92
6067i2PJ36J77k81O1nj98J87L1n6L4q5RJ04J3q2m0K31j98N7j5j46L72q9l2k97
$$ -92 -85 51 228 -53 8 3 -195 -8 23 -33 1 -84 -75 29 42 -40 -80 151 -47 10 -5 -151 221 132 100 -197
6093a97L06k33R7R0O7k11M3L3k83J3L00k35J36j5j6K58j27l8K72m9k18Q5j06J35
$$ -197 109 -124 -27 63 130 -81 -38 -5 -288 -275 25 -210 -74 -89 -105 153 26 -12 260 211 -7 78 -28 107
6117A07o8r6J51j80K74k65lK80l60M7J57r3J99m86M69k16j7J16k3O9M2l21L6J69
$$ 107 39 -57 94 -86 188 -77 -80 200 -160 -113 44 -49 150 -336 133 -83 -100 16 -7 62 104 -217 -181 -12
6141a2j32J45R8L45k38j39O2K14m35K25Q6k64M2k3J07Lk65N24l17K17m63K97r8
$$ -12 -144 1 99 444 206 67 129 343 -92 133 219 -45 -3 -26 81 84 -181 343 26 243 -220 77 -21
6164b1k89M46k93L9K60k25j96k5N42j41l28K05J19J31l39J12N22o16K8J9J28n7
$$ -21 -310 136 -157 -118 142 -83 -279 -304 238 97 -231 -26 93 224 -115 -3 519 -97 -69 -50 78 21
6186B1K6P2l72M20J08l82J71j32K69j00n1j52R7j22M39n54K41J39l00L22o1k42
$$ 21 47 119 -253 167 275 -107 64 -68 201 101 50 -102 -5 -127 312 -242 -1 138 -162 160 99 -143
6208a43L24k50K68j10J0j49OK19J6j95P4J86j92L7k28L2j5L6J98Mk35j6l1L3Q8
$$ -143 181 -69 199 89 99 -50 -44 175 191 -4 70 256 64 101 -127 -95 -110 -74 124 128 -107 -123 -154 -121 -33
6233c3n5l1j6k8J8k2M20m91L79j67L64j58j13NJ8q7K3L3p6j2J06J83l76J40j24
$$ -33 -88 -119 -135 -163 -145 -167 253 -238 141 -26 338 180 67 72 90 3 26 59 -17 -29 77 260 -116 24 -100
6258a00J51j4R6j05M0k00L02k97M1J66j85K76j41PQ6m7L8j4Q6k72j07K77j23J02
$$ -100 51 37 133 28 68 -132 170 -127 -86 80 -105 171 30 37 123 76 114 100 186 -86 -193 84 -39 63
6282F3q7L35l01k24J01L44o2j38P4o7K8j55J64j02N4j87OJ37n4k04K08K02K5q6
$$ 63 -24 311 10 -214 -113 231 169 31 105 38 66 -89 75 -27 27 -160 -154 -17 -71 -275 -67 135 160 74
6306G4k1j51J46J41j51K01j33Q4o2l09L59j96P4q0k7r6K7K01r2Pr3j16M16m41
$$ 74 53 -98 48 189 38 239 106 190 128 -181 178 -18 56 -24 -51 -147 -120 81 -11 -4 -97 -213 203 -238
6330b38N3L09j75K79m42M03j69M7k24J63K90k54o1J0m7J33N5j95K33j50N8J29
$$ -238 -185 124 -51 228 -214 189 20 67 -157 6 296 42 -19 -9 -56 77 132 -63 170 20 78 207
6352B07j57P9k4j42j18P8M3L79l69j6r7J43k55L12j42J09j67J83p8O4J65j58J19
$$ 207 50 129 105 -37 -155 -77 -34 345 -24 -40 -137 6 -249 63 -79 30 -137 46 -32 32 197 39 158
6375A58l44K36k7J31l04J84R4mk85K05k6P9k02K2J25k23J05J56k64Q0J28J3j73
$$ 158 -186 50 23 154 -150 34 128 124 -161 44 18 97 -105 -83 42 -181 -76 80 -184 -104 24 37 -136
6398a36J12l57L55j1N4Q6j37Q7j1j35K59m0j91J43L7j92K6r0L1J64J07k53O2L
$$ -136 -24 -381 -26 -37 17 103 -34 53 42 -93 166 126 -65 78 115 -77 -51 -141 -110 54 161 -92 -30 -27
6422b7mK76m41O7O2q2J24J97m16k4P4L5j15K16kj37K81j2p4K21j73K62k70j35
$$ -27 -31 245 -196 -129 -67 -149 -25 172 -244 -268 -194 -159 -274 -58 -60 -197 84 72 -2 219 46 308 38 -97
6446i7Q5j11kK51q9p1k3J65o5J10l74L1K75l14L16o1M4L4P%j42J52Q1l28K40j12
$$ -97 -12 -123 -125 126 37 -34 -57 108 43 153 -221 -190 85 -229 87 26 70 104 111 111 -31 121 202 -126 114 2
6472BJ36k00K57j98K60n7l03K70K2j36j58K25l38J49J28O6j36M8k72K17K43l85
$$ 2 138 -62 195 -3 257 200 -103 167 189 53 -105 120 -218 -69 59 125 -11 37 -235 -18 225 -160
6494a60q5M84l14K18o0j16J59k2j50J87k24J97J19k27J4j17K31J01Pj38j24J86
$$ -160 -245 239 -75 143 83 -33 126 104 -46 141 -83 114 233 6 20 -97 134 235 242 104 -20 166
6516A66k25K05j49r6L0L4P6K25k36j57K5P1k9J22m1j04J90J01j10l85L84J62j14
$$ 166 -59 146 -3 -99 -69 -35 41 266 30 -127 -102 -31 -60 62 21 -83 107 208 98 -287 97 259 145
6539A45p4o9j09J92l02J63K39l06N7P8l5k01J46K04k26J87r1j06N36n04J66ll5
$$ 145 71 2 -107 85 -217 -54 185 -121 -64 14 -21 -222 -76 128 -98 89 -2 -108 428 -76 90 87 52
6562E2j20Q4k98L78k16M87k19J96j77j84j94jR8K37k55L27j22J9j34jr5L53j43
$$ 52 -68 16 -282 96 -120 367 148 344 167 -17 -211 -212 -114 123 -132 195 73 92 -42 -43 -138 215 72
6585G2k29K23J4q9j14J22M4l10J36J67l62N45j02k3l1j23r4K57J60l70J13j64
$$ 72 -157 66 80 -9 -123 -1 43 -267 -131 36 -326 219 117 94 63 -60 -154 103 263 -107 6 -158
6607a58K7J68k9J4LK58k59k43N28k26j50On0j17J53J77q5j5J0O0j29j43K29m2
$$ -158 -131 37 8 22 25 283 24 -219 309 83 -67 -61 -111 -228 -75 102 17 2 12 72 -57 -200 29 -13
6631a3k19L13J18k06l5J58j14M3r7P2l39L37R0k49L85k07j01R8k19P7K01j42k3
$$ -13 -232 81 199 -7 -42 116 2 45 -52 20 -319 18 108 -141 244 37 -64 34 -185 -108 93 -49 -72
6654g2Q9mO5j35J20k00R9m1J48j08L0n3K03k37J38QJ24k14M4P8l1o7J06J40k80
$$ -72 17 13 78 -57 63 -137 -38 -79 69 -39 -9 -62 141 -96 42 50 174 -40 4 82 51 -16 90 230 -50
6679e0r4K22Q0j11Q2n1k6j8j4j52l0R1j18j6J8M03k95P2j01K81j66L9R4m0m0k6
$$ -50 -144 78 158 47 129 78 52 34 20 -132 -162 -71 -189 -205 -187 216 -79 -7 -108 173 7 46 140 100 60 34
6705C4k3o9j7L15k53j38L1q8K50l8l7k36K63j00K55k81P9k2J05Q0q4L5k97L58
$$ 34 11 -58 -75 240 -13 -151 -120 -208 42 4 -33 -269 -6 -106 149 -132 -53 -75 30 110 26 61 -236 122
6729A22p6N1j1N3j78J29J3O1j39J42n8j53R2j80J67P1r5M6p4J31p8k7j97P7K00
$$ 122 46 97 86 139 -39 90 103 164 25 167 109 -44 48 -132 35 106 11 57 -17 114 36 9 -188 -111 89
6754H9n7p5p8M7p0K27J93k10Q0r7p1M2K6j75J92j02J32j17KK36l68N03k68m3j0
$$ 89 32 -43 -121 -74 -144 83 276 66 146 49 -22 20 46 -129 63 -39 93 -24 -22 214 -154 349 81 38 28
6779B8q5R2j63n2J87l21K08j35K5j07L64k56J65q1N7J25L1o2m23L81j03L31k35
$$ 28 -57 35 -128 -180 7 -314 -106 -241 -216 -323 41 -215 -50 -131 -74 51 82 20 -403 -22 -125 206 -29
6802b9P7J75l38K23np9J4O3k04r0J78p7K43m52N17j56r8J59k57J87K9Qj44J64
$$ -29 48 223 -115 108 103 24 38 101 -103 -193 -15 -92 151 -301 216 60 -38 121 -136 51 80 88 -56 108
6826A08k63L34m1j34j80K01j8o9L93j51l48K31J37p1j3j50L21R5n87J89R0l30
$$ 108 -155 179 138 4 -176 25 7 -62 331 180 -168 63 200 129 116 -34 287 382 -205 -16 74 -256
6848b56J49P4j14J89j47J62k71K63J51j30L6K0j77K12l50L35K44l00j50P7o0r
$$ -256 -107 -33 -147 42 -105 57 -214 49 200 70 106 126 -51 161 -189 146 390 90 -60 17 -43 -52
6870e2j44K70k18J68j34K44k05j3o5j9J59M29n24j5R3j74M8K27J17m34L24j85
$$ -52 -196 74 -144 24 -110 134 -71 -84 -149 -168 -9 420 -104 -119 -26 -200 -152 75 192 -242 82 -103
6892a03j77J15J14J96J5j80o8J17J25p9O5j48J26r1K11j90j8n7Q7k60J33J81r4
$$ -103 -280 -165 -51 145 160 -20 -88 29 154 75 140 -8 118 27 238 48 30 -27 60 -200 -67 114 20
6915B0j07l1m7K20R4k58j3L08k05J66p4j06j9K7o3K11l72K76N8m49M89j81J29
$$ 20 -87 -118 -165 55 149 -109 -122 186 -19 147 73 -33 -52 -25 -88 123 -249 27 85 -364 125 -56 73
6938G3j07j66K25k30j46M18jj68J90K9l4o6K1l6K15k91L2J18j25K70m9o1q4J97
$$ 73 -34 -200 25 -205 -351 67 66 -102 88 117 83 17 38 2 217 -74 -42 76 -49 221 172 111 27 224
6962B24k94J00J6K8j07K40p8q6l5J63p6j77J35l77L08J20k01q2J87j4j88K38P8
$$ 224 -70 30 46 74 -33 207 129 43 8 171 95 -82 53 -324 -16 104 -97 -179 8 -6 -194 44 122
6985A22j90j9J54%j22j15J1M84l92m1L32l9o5m01K27J61L4k23M14k82j36J59j35
$$ 122 -68 -87 67 67 -55 -170 -159 325 -67 -108 224 185 120 -281 -54 107 141 -82 332 50 -86 73 -62
7008f2J45K82j70p1m5k77J81O2q0o8J13j67M06k71n5O4q1L82j67j74J42J8N6k99
$$ -62 83 365 195 124 79 -198 -17 45 -35 -103 10 -157 249 -22 -77 -13 -94 288 121 -53 89 107 163 -136
7032a36K87J05j90R0j20J28k7j68j1J7j02R4rk18L34j29L0j04L10nk64M6k4O3
$$ -136 151 256 66 156 36 164 137 -31 -42 -25 -127 -33 -42 -260 74 -55 -25 -129 181 176 -88 -42 -66 -3
7056cK43l83J67J33n7k10L4J45o5j16k0K49k63J21k67M57m24J99mk63K89P7J57
$$ -3 240 -143 24 157 100 -110 -76 69 4 -112 -132 117 -146 -25 -292 165 -259 -60 -64 -327 -38 39 196
7079A96m04L30l38K50j16O1m8nK40m5l02L09K61n08Q6R4qJ35p9k60K21jJ84j23
$$ 196 -208 122 -216 34 -82 -21 -69 -74 166 121 -181 128 389 -119 -33 61 53 188 109 -151 70 69 253 130
7103A30l40K16J36k18Q9k67L86j61P4j12j25K26L02n10K37L7q6pJ65L2l10N01
$$ 130 -210 6 142 -76 13 -254 132 -29 45 -67 -192 34 336 -174 63 100 14 7 172 204 -106 395
7125C95k35j84j47J71j21J49J21l8Pj6N8j65O6O4Q0k53j19K51L5J5n1j82J58o2
$$ 395 160 -24 -171 0 -121 28 149 111 118 102 160 -5 61 125 205 -48 -167 84 119 134 83 -99 59 -3
7149cK18l25K84k51M9j57N12j51k32K22j65m4Q2M7j90K02j5l32L34rk92N4R5n4
$$ -3 215 -110 174 -77 -28 -185 327 176 -56 166 1 -43 39 86 -104 98 83 -249 85 76 -216 -162 -67 -121
7173a21L8L9P3j7M1j83r5K16J8k4J17Q3Lk13n0K52l0O5n5J98m20q3J4j22K66l5
$$ -121 -83 -44 29 12 53 -130 -225 -9 9 -15 102 185 188 -25 -75 177 147 212 157 355 -65 -148 -134 -256 10 -25
7199b5jN1j23r8J68K20k51P0O8p0o0J47k33N7P8n5R0P6l41M18j01j38LK83l9k1
$$ -25 -26 25 -98 -196 -28 192 -59 11 79 9 -51 96 -137 -80 -2 -57 33 109 -232 186 85 -53 -50 233 194 173
7225A73M1k93N0J8J44j4k39K49m35M53m3k39K46j83j72M10j97K12N2k81q6J24
$$ 173 214 -79 -29 -11 133 119 -120 129 -306 147 104 -135 111 -72 -244 166 -31 181 233 -48 -134 -10
7247a0M2o0j96k6K99j39k50L8K63K27j78k12O8J47O7N7k21m4J58j3l15K96R8j83
$$ -10 32 -28 -224 -250 49 -90 -340 -302 -39 188 10 -202 -134 13 80 137 -84 -128 30 17 -298 -2 96 -87
7271h7K9j11K11j04m8J59J76l90J12l0r4m9K19J32j78J84j26J49m07N23m30j05
$$ -87 -58 -169 42 -62 -110 49 225 -165 -53 -83 -177 -226 -7 125 -53 131 5 154 -253 270 -160 -265
7293b65J20mp4R8J62m7q4M26j36l92J28J14K32m02M08l25J67l0J7j57JJ52k23
$$ -265 -145 -149 -223 -125 37 -10 -94 332 196 -196 -68 46 278 -124 284 -41 126 96 113 -44 -43 109 -114
7316a14L14k68K39j41O2J3j51K13j45J05l46L15O6j8l31L19p5p5j20l22M39L9
$$ -114 200 -68 171 30 92 105 -46 167 22 127 -219 96 162 144 -187 132 57 -18 -138 -460 -21 18
7338A8K1j83K51m01L87k7M5k59J86L8J06j75R5j43J96l07J68K12j54nk51J69M4
$$ 18 39 -144 107 -294 93 66 111 -148 38 76 182 7 102 -41 155 -152 16 228 74 69 -182 -13 31
7361C1l7J55k49N6J83j10M5j22m2J97K0p5j05K84j44j8r6K80k65J57M5j70j62
$$ 31 -6 149 -100 -44 139 29 74 -48 -90 107 127 52 -53 231 87 69 -27 253 -12 145 190 20 -142
7384a42J35J94l35L71j92m7J12R0k91Q5M4j18J30O8k47J76J86j74k0Kj08K78j34
$$ -142 -7 187 -148 223 31 -16 96 186 -105 -20 24 -94 36 104 -143 33 219 45 25 27 -81 197 63
7407F3Q2k27j5K09j38K39j55j24l6J33O5M4L1l84J72k8k38K95o2M3k6J97k12Q5
$$ 63 145 -82 -97 112 -26 213 58 -66 -102 31 96 140 171 -213 -41 -69 -307 -12 -74 -31 -57 140 -72 13
7431A3q7L1kO9M7o7O1K1k49K42R8k58J73J86k64l2J3l4l1M5p9P8ML33j89k54j08
$$ 13 -74 -43 -45 24 71 4 65 86 -163 79 177 -81 92 278 14 -18 -5 -39 -70 -25 -104 -26 -22 311 122 -132 -240
7458b40J55p6J40q1J50K6k76L03K9j50j78J74O8k8p7J91L0k75K06n8j54K65M4
$$ -240 -85 -161 -21 -102 48 74 -202 101 130 -20 -198 -24 44 16 -61 130 160 -115 91 33 -121 144 188
7481A88k13J5J05l8j00R9j01N7m1r3J97k38K50k28R3l6P7k5Rj2l4J9K7J93M5k49
$$ 188 -25 -10 95 57 -43 56 -45 12 -29 -122 75 -163 87 -141 -48 -84 -7 -32 -23 -35 -69 -50 -23 170 215 -34
7507c4N1L1j61L16j96l7P5n7M8j5j45K40j13J94k91k7J73j38p6J78J25k26J07
$$ -34 17 48 -113 203 7 -30 45 -12 36 21 -124 116 3 197 -94 -121 52 -86 -162 16 141 -85 22
7530B2M2K1j2N0o5L4j11q2O1J4o8o4J40n3q6M12j08k53K94l70J28J50J40j98r8
$$ 22 64 85 73 123 58 92 -19 -101 -40 -26 -94 -158 -18 -71 -157 255 147 -106 188 -182 -54 96 236 38 -60
7555f0Q3M4j55J86j42L9lk01J24N1J1j38N1j6J9l4K56j70J42j76K37j59L2R5l58
$$ -60 23 67 -88 98 -44 -5 -8 -209 -85 -34 -23 -161 -110 -126 -107 -141 115 -55 87 -89 148 -11 21 116 -242
7580b42J23q5J22K25q0o6J01m2m6J8k30K87k80L98N5k98Q5Oj98K31p2K02l09L31
$$ -242 -119 -204 -82 143 63 -3 98 56 10 28 -202 85 -195 203 258 -40 45 51 -147 84 12 214 -95 236
7604B36p1L7p8j90J82r6j63N7R9k71K17J06l3K55m91J57N0j9J0K5j50L00p7n2
$$ 236 165 202 124 -66 116 20 -143 -86 13 -258 -41 65 32 287 -204 -47 3 -16 -6 19 -131 169 92 40
7628D0k47J60K09o9j29J58n7j46J05k6q3J09mJ42N1j97J28p0j43K5J95L0n5j63
$$ 40 -207 -47 162 93 -36 122 65 -81 24 -2 -85 24 20 162 213 16 144 74 -69 -44 151 181 126 -37
7652c7j61J35K33j22j84Q7ml7J81J72m3j71J67l55N8n7J27j06n3M11j33p6K2j94
$$ -37 -198 -63 170 48 -136 -49 -53 -90 91 263 220 49 216 -139 -81 -138 -11 -117 -170 241 108 32 54 -140
7676a40J73j47J30J07p3M5j86K3O5j13K11j51J20L7M1o1r8k07J48R7R5j65P0P6
$$ -140 33 -114 16 123 50 95 -91 -68 -3 -116 95 -56 64 101 142 81 -17 -224 -76 21 116 -49 21 97
7700I7j40Q2R2j10M4P9j61J4r2J43J4L1P9l00J87j06N0j39K68j09J03l1j26L8
$$ 97 -43 39 131 21 65 144 -17 -3 -95 48 62 93 172 -128 59 -47 3 -136 132 23 126 95 -31 7
7724Gr4K77j76o6J51q9J18l8O5j72M6J34k71L52k64j20K32K69j65mj73j36O0r8
$$ 7 -87 190 14 -52 99 10 128 90 155 -17 29 163 -108 244 -20 -140 92 361 196 192 19 -117 -57 -155
7748a55M33l66J9j09J06k0j59M31j43j15N5J4L02l17N3j4P7k77L18l74L24r6o
$$ -155 278 -88 -69 -178 -72 -92 -251 180 37 -78 -23 -9 293 -24 29 15 92 -185 133 -241 83 -13 -19
7771a9L00l05K4o7k8J74j89K13j39Q6J06l07R7J00k9K1k52K22J28j87J15Q9k27
$$ -19 281 -24 0 -67 -95 79 -110 103 -36 50 156 -151 -54 46 17 38 -214 8 136 -51 64 153 -74
7794g4K13j80k08J98k2K14m9k34j8K80k42Q9p9l3M8Qj09L5K20q2K14n15J00K42
$$ -74 139 -41 -249 -51 -73 141 92 -142 -160 120 -122 -33 -112 -145 -97 -89 -198 -163 57 -25 189 -326 -226 16
7818A6q5L5J10p2J35j12j8r4j6J82j88J45r1N0j07K47k21K03j15j07o1K11j20
$$ 16 -69 -34 76 4 139 27 9 -85 -101 81 -107 38 -53 -3 -110 137 -84 119 4 -103 -164 47 -73
7841g3J22J88k5n47N59j78N4n1Q7j11k18J58j85L03j20K03j08k40K39o8k13K80
$$ -73 49 237 212 -335 224 46 100 49 136 25 -193 -35 -220 83 -37 166 58 -182 57 -11 -224 56
7863E6J77j28j65M5R8nj05L17j36r5p4n5J52j36K38j25q9j27J19J76j26R1k21
$$ 56 233 105 -60 -15 83 78 -27 290 154 59 -15 -70 82 -54 184 59 -30 -157 -38 138 12 103 -118
7886a18n8R6Kl8J16Q3j9j49K04j17j7J58j68K16Rj72j45J37P0m3J44l56L90k44
$$ -118 -176 -80 -78 -116 0 83 64 -85 119 2 -15 143 -25 191 200 28 -117 20 90 47 191 -165 225 -19
7910a9j1J95q9r4K68j62j56l64M18m8r4R5O5J35k32q0J43K71k25P1k17J87L9q4
$$ -19 -30 165 76 -18 250 88 -68 -432 -14 -62 -156 -61 4 139 -93 -173 -30 241 16 87 -130 57 96 12
7934A2J32l7k90M2M28n40J52q3J48j88J28M5n4J79j67J58j10q1L11k26J92R3m8
$$ 12 144 107 -183 -141 287 -253 -101 -184 -36 -224 -96 -51 -105 74 -93 65 -45 -126 185 -41 151 244 196
7957A96k07J12n6J3K4J49j15r9p8J81j78J15p9J05k07K28j92n2M52k23j74N1l23
$$ 196 -11 101 45 58 82 231 116 17 -61 120 -58 57 -22 83 -124 104 -88 -140 312 89 -85 -34 -357
7980c57L36J6k18N44m93J43J09j31M2k6O2J67K9k11q5J02N3k06Q4K49m64K19J71
$$ -357 -21 -5 -223 321 -172 -29 80 -51 -9 -35 27 194 223 12 -73 29 82 -124 -40 209 -255 -36 135
8003A35K9l6k34K50j02k40J70j77J98l9q3J85K9j7j02k7j47L39o1K8k30J47l3
$$ 135 164 128 -106 144 42 -198 -28 -205 -7 -46 -129 56 85 68 -34 -61 -208 131 70 98 -132 15 -18
8026a8q6N8q3J94j95k3mM47k48j62J82J68l60n3K79k15k27L22m5J21N4N3Rl28
$$ -18 -104 -46 -129 65 -130 -153 -157 290 42 -120 62 230 -130 -183 96 -119 -346 -24 -69 52 106 159 168 -160
8050a60J64q1K2JL6o6r9J20J25j36L12k29K78j44j79L29n64K72j29K30j51J60
$$ -160 4 -77 -55 -54 -18 -84 -183 -63 62 -74 238 9 287 143 -36 293 -271 1 -128 102 -49 111
8072A11o7L9K3k93N19j88r6K1O6k61L73k77J7l2O7j37J46j2J13m24L31J64j4k73
$$ 111 44 83 106 -187 332 144 48 69 135 -126 247 -30 -13 -45 22 -115 31 19 132 -292 39 203 189 -84
8096h4K27N7k20m4N2n5K14o6q2j61N6Q0O3k35R8k44K85j69J26J69O8j77l6M8N7
$$ -84 143 200 -20 -64 -12 -67 147 81 -1 -162 -106 -26 37 -198 -100 -344 -59 -228 -102 67 135 -42 -78 -30 27
8121B7J78j20k21L30k77k81N04q8j56R4J50j01j13J2l1J04j98l5K77k1q9o9J58
$$ 27 205 85 -136 194 -83 -364 140 52 -104 -10 140 39 -74 -62 -93 11 -187 -222 55 34 -55 -124 34
8144C4o5J54j47MN4j65K06j72K77k80K21q4K87m0l21lj06L07r0M2j18K4J73k18
$$ 34 -31 123 -24 -20 34 -131 75 -97 180 -100 121 37 324 284 -37 -40 -146 161 71 113 -5 19 192 -26
8168b6R4p5k8J69k34O0q5N17m86p5J71j81J03mq9R8J72n4K40n9p6j99J
$$ -26 68 -7 -35 134 -100 -40 -125 392 -94 -169 2 -179 -76 -80 -169 -71 101 47 287 228 152 -47 -46
8191d6
$$ Imaginary data points
##PAGE= N=2
##DATA TABLE= (X++(I..I)), XYDATA
0@%%%%%%%%%%%%%%%%%%JrJ6j6J6j6J6k4L2l2L4m2M8n5O3p1P9q8J02j13J25j40
$$ 0 0 0 0 0 0 0 0 0 0 0 0 0 0 0 0 0 0 0 1 -8 8 -8 8 -8 8 -16 16 -16 18 -24 24 -31 32 -39 40 -48 54 -59 66 -74
40g4J55j72J92k13K34k58K87l17L49l83M21m64N10n64O26o92P67q55R57j078J224
$$ -74 81 -91 101 -112 122 -136 151 -166 183 -200 221 -243 267 -297 329 -363 404 -451 506 -572 652
61F52j403J627j921K326k915L859n611R904m0664m5367R3337L6624m5894k9015
$$ 652 -751 876 -1045 1281 -1634 2225 -3386 6518 -34146 -79513 13824 50448 4554 -24461
75b4461J9960J1666J617O472k620k6144N598K3938N294j7812j7442O348J5962
$$ -24461 -4501 7165 8782 15254 12634 -13510 -7912 16026 21320 3508 -13934 -7586 8376
88H376n064o781O083n059r047P538J0312o192j5555J2701R535j7934K834J9599
$$ 8376 3312 -3469 2614 -2445 -11492 -3954 6358 166 -15389 -2688 6847 -11087 -8253 11346
102A1346j3682j7972K1819K0743k2804j9491K7397J6135k7790p928K3226Q781
$$ 11346 -2336 -20308 1511 22254 -550 -20041 7356 23491 -4299 -12227 10999 19780
114A9780j7655j4059J3090J2094j1438o684P046l523m478Q028M991j5178j0297
$$ 19780 2125 -11934 1156 13250 1812 -4872 2174 -1349 -5827 2201 7192 -7986 -18283
127a8283K0753J0921k1658q016J6967M051j1130q33R395L67n940O575O86r102
$$ -18283 2470 13391 -8267 -16283 684 4735 -6395 -7228 2167 2534 -3406 3169 3855 -5247
141e247Q108J1482r090j4975Q178J9630n654k3441J952J8157M1j1262j863K902
$$ -5247 2861 14343 5253 -9722 -1544 18086 12432 -11009 -9057 9100 9141 -2121 -3984 -1082
155a082m185M98J2424l893j8509L064J7323k74j1514j674N996Q64j287P185P94
$$ -1082 -5267 -4769 7655 3762 -14747 -11683 5640 5366 -6148 -7822 -1826 -962 -2249 4936 5730
170E730j1655j909J3377P853r834j0010N979P358j422K40l088q934K904J4048
$$ 5730 -5925 -7834 5543 13396 3562 -6448 -469 6889 5467 5707 2619 -6315 -3411 10637
184A0637q21j7183m633J5444M547j2528l807P020N64l192J286J781k255k057N471
$$ 10637 9816 -7367 -12000 3444 7991 -4537 -8344 -1324 -760 -3952 -2666 -885 -3140 -5197 274
199B74L105o023j184P271J777o344j121Q070J675r175Q51P518l021m419K667J043
$$ 274 3379 -2644 -3828 3443 5220 -1124 -2245 5825 7500 -1675 -824 6694 3673 -746 1921 2964
215B964l212l99K915k543m496M160K920n786k697L854L792l179n047L541N566
$$ 2964 -248 -647 2268 -275 -4771 -611 2309 -3477 -6174 -2320 1472 -1707 -6754 -3213 2353
230B353l540k483L231K188j449r91M015O20n352K840M749m444j892L765J35l713
$$ 2353 -1187 -3670 -439 1749 300 -691 3324 3944 -1408 1432 6181 1737 -155 3610 3745 32
246C2p06M549q74o511J107L791j130j679j880K72J732j286J070J77l685J739M993
$$ 32 -674 3875 3001 -3510 -2403 1388 258 -1421 -3301 -3029 -1297 -2583 -1513 -1336 -5021 -3282 1711
263A711j04m073j619O501K022n367J259L327k205N15J500o13j492o01K645j095
$$ 1711 1607 -2466 -4085 2416 4438 -929 330 3657 1452 1967 3467 2854 1362 761 3406 2311
279B311l225J527P25k386L3o94J365n99l529K114K690k957p11J158J258m9j258
$$ 2311 -914 613 1338 -1048 -1015 -1709 -344 -943 -4472 -2358 332 -2625 -3336 -2178 -920 -969 -2227
296b227K613n23j902M172R71l360P01J707J276q35k000J784n0j356J068q90n36
$$ -2227 386 -137 -2039 2133 3104 -256 445 2152 3428 2593 593 2377 2327 971 2039 1149 613
313F13j23j367J015m4l154J538Q83k000K56P25J14j075n01L574p77k333K378J234
$$ 613 490 -877 138 94 -3060 -1522 -639 -2639 -2383 -1658 -1544 -2619 -3120 454 -323 -2656 -278 956
331I56o60J183n69M50M83j01J322j389o93J348l91j46j032j427K247n11k462P31
$$ 956 296 1479 910 1360 1843 1742 3064 1675 982 2330 1939 1793 761 -666 1581 1070 -1392 -661
349f61P7j318J07j2L53j190r2K070j120l56J900p04j57J157N80M97m67k16J511
$$ -661 -584 -1902 -1795 -1807 -1454 -2644 -2736 -666 -1786 -2142 -242 -946 -1103 54 634 1131 664 448 1959
368A959N04j28n54p03J251l17q68Q77j781j141J913m03j806n40J26O06q68r6P11
$$ 1959 2463 2335 1781 1078 2329 2012 1144 2021 240 -901 1012 609 -1197 -1737 -1611 -1005 -1873 -1969 -1258
387a258j074k7J368k49O9O71m38J102L33J10K33J02M84k72P24R08j232m67P32
$$ -1258 -2332 -2359 -991 -1240 -1171 -500 -938 164 497 607 840 942 1426 1154 1878 2786 1554 1087 1819
406A819l95j012P85n9j972j17N13M26j127j020j87L72J277K28j702p47J246Q17
$$ 1819 1424 412 1197 1138 -834 -951 -438 -12 -1139 -2159 -2346 -1974 -697 -469 -2171 -2918 -1672 -855
424h55R47k04q49K6J603J610o92j075J63J130O44J40j422q51J372K61j042m11
$$ -855 92 -112 -961 -935 668 2278 1586 511 674 1804 2448 2588 1166 315 1687 1948 906 495
442D95K6r93n00K68L10j059n06M23k23Q2n1m6N13K55q11J101J619n01j071lK002
$$ 495 521 -472 -972 -704 -394 -1453 -1959 -1536 -1759 -1677 -1728 -1774 -1261 -1006 -1817 -716 903 402 -669 -672 1330
463A330J228p02j188J57N42J190m69q20m21j228R47J815j409k386j192J621K051
$$ 1330 2558 1856 668 825 1367 2557 2088 1268 847 -381 566 2381 972 -1414 -2606 -985 1066
480A066j570k274k10J441J496n78j713Q33M76K48J062N40o06o52P54K010j22j393
$$ 1066 -504 -2778 -2988 -1547 -51 -629 -2342 -1509 -1033 -785 277 817 211 -441 313 2323 2201 808
498H08M09p4Q25n6r88Q87J59k031q44J395P86j460k277Q74J172n98K28j482n51
$$ 808 1217 1143 1968 1912 924 1811 1970 -61 -905 490 1276 -184 -2461 -1587 -415 -1013 -785 -2267 -2818
517b818J237O90M22J03j093n25J512K385K64l459O6L458O84j086r48o78J501K16
$$ -2818 -1581 -891 -469 -366 -1459 -1984 -472 1913 2177 -1282 -1216 2242 2926 1840 892 214 1715 1931
535A931k43n89j271K89o0M56M93j795j811K016R2j332k40N77R40n57r39J194L55
$$ 1931 1688 1099 -172 117 57 513 1006 -789 -2600 -584 -492 -1824 -2064 -1487 -547 -1104 -2043 -849 -494
554d94N55n10q50K307J337j577n00L37O45J000o57j14o22q75J185J350j684j844
$$ -494 61 -449 -1299 1008 2345 768 268 605 1250 2250 1593 1479 857 -18 1167 2517 833 -1011
572a011o65J653J497k041j904K20R66J235p70r85J77k00P69J272k04o23o93J546
$$ -1011 -1676 -23 1474 -567 -2471 -2251 -1285 -50 -820 -1805 -1628 -1828 -1059 213 9 -614 -1307 239
590B39K310j531j360J086J037M92l59j077L52J25k26o98j7Q97q81j568O17L91
$$ 239 2549 1018 -342 744 1781 2273 1914 837 1189 1314 1088 390 373 1270 389 -1179 -562 -171
608a71j323N38j99j79j45k34J305n48q52O80M17J392j7j824P98J769K54j81m19
$$ -171 -1494 -956 -1155 -1334 -1479 -1713 -408 -956 -1808 -1128 -711 681 664 -1160 -362 1407 1661 1480 1061
627A061J87K1Q8N35n57j173O45J17q78M89r14p40L92R45j042r49L30Q05o24l52
$$ 1061 1248 1269 1357 1892 1335 162 807 924 46 535 -379 -1119 -727 218 -824 -1773 -1443 -638 -1262 -1614
647a614Q44n31M65L43j36O24N33l59J05O62J64l46K06Q99j048k97J100p4r40k50
$$ -1614 -770 -1301 -836 -493 -629 -5 528 169 274 936 1100 754 960 1859 811 514 1614 1540 600 350
667C50p1O5Q9k97j118k22L95L52m37m99l78N47M61L29o39O7O54L83K95J53K3l94
$$ 350 279 344 433 136 -982 -1204 -809 -457 -894 -1393 -1771 -1224 -763 -434 -1073 -1006 -352 31 326 479 502 108
689A08J002M25m94n56Q17J62o87N48j67n47j12N1m33n27J39m40J20n96j50j53
$$ 108 1110 1535 1041 485 1302 1464 777 1325 1158 611 499 550 117 -410 -271 -711 -591 -1187 -1337 -1490
709a490K07J7K29M5J91R2L26N29l84K31L47M58m7N7N53J15n01M94%o39J37p8m12
$$ -1490 -1283 -1266 -1037 -992 -801 -709 -383 146 -238 -7 340 798 751 808 1361 1476 975 1469 1469 830 967 889 477
732D77o4q05K90k15m85k1K7M9j86p68M89N16p72R81Q1n71N53N67l1R8J73P35k65
$$ 477 413 -392 -102 -317 -802 -823 -796 -747 -933 -1701 -1212 -696 -1468 -487 -406 -977 -424 143 112 210 383 1118 853
755H53k83Q22j65k29L04m07o3J72n47k0l89l68J36j39j15l73n32O35j97n91O75
$$ 853 570 1392 1227 998 1302 895 832 1004 457 437 48 -320 -184 -323 -438 -811 -1343 -708 -905 -1496 -821
776h21K9m76M33J95K51J49k32J181k46l30P79k70L93P1k07M05m98j98L21j91n88
$$ -821 -792 -1268 -835 -640 -389 -240 -472 709 463 133 912 642 1035 1106 899 1304 806 608 929 738 150
797A50Q1l43k7k85n62N98l38l08K40j68j80K60j24M17m2J62O71l50O7Q89j90L80
$$ 150 231 -112 -139 -424 -986 -388 -726 -1034 -794 -962 -1142 -882 -1006 -589 -631 -469 202 -148 -81 808 618 998
819I98j7j04L36l43M9L60m43k05Pk08j7l61n21Q79j088j90K23k03j57J06l78P67
$$ 998 981 877 1213 870 919 1279 836 631 638 430 413 52 -469 410 -678 -868 -645 -848 -1005 -899 -1277 -510
841e10n94J66N05k77M18L60kL37k35J61Q14j65k2K63k73M3p7k05K61p98l4J69
$$ -510 -1104 -938 -433 -710 -292 68 66 403 168 329 1143 978 956 1219 946 989 912 707 968 170 136 305
863C05n18m9nn69m7p4K11k62j87Q7K34N6M42j29K3L77R0L45J38L2J16K33J36L6
$$ 305 -213 -262 -267 -836 -883 -957 -746 -1008 -1195 -1108 -874 -818 -376 -505 -482 -105 -15 330 468 500 616 849 985 1021
887A021j11J97k76l00K57j33o83K62R5k83n35j85L27l91j77m5N3j68M4M28K37
$$ 1021 910 1107 831 531 788 655 -28 234 329 46 -489 -674 -347 -738 -915 -960 -907 -1075 -1031 -603 -366
908c66k0j91M99M40j80j73M86M13l96J65K67P9R1l34j97j18J11j17l75k96j68
$$ -366 -386 -577 -78 362 182 9 495 908 512 677 944 1023 1114 780 583 465 576 459 84 -212 -380
929c80j22K39o4o11l0j0J92K57J49o52M4N86J71q6LP08P9l26N81L26n93K51j38
$$ -380 -502 -263 -327 -938 -968 -978 -786 -529 -380 -1032 -988 -402 -231 -317 -314 394 473 147 728 1054 461 712 574
952E74M11p6K0Qn07J08j2p37L49m88m77K07K51n72Mq3J31K2L55r0j76J51N61P8
$$ 574 985 909 929 937 430 538 526 -211 138 -350 -827 -620 -369 -941 -937 -1020 -889 -867 -512 -602 -778 -627 -66 12
976A2j72N88l31O8O01K29k1n19J04P11n04q6k90p8J07j93o76O61o78m47Q4L11
$$ 12 -160 428 97 165 766 995 974 455 559 1270 766 680 390 312 419 226 -450 211 -467 -914 -830 -519
998e19j29l17J09N66o20J49K59Q1QK68M8K99j0K60J56K6M61L99q90l0K37j98J58
$$ -519 -648 -965 -856 -290 -910 -761 -502 -421 -413 -145 -97 202 192 452 608 634 1095 1494 604 574 811 613 771
1021G71m09J92k99n25J65rk61j43p00P97L38j043l04R35k9N4j54L18Rm6J99Q79
$$ 771 362 554 255 -270 -105 -114 -375 -518 -1218 -421 -83 -1126 -1430 -495 -524 -470 -624 -306 -297 -343 -144 735
1043G35m61J35J12N61j77k08k6K10n09L82k04n80J87j04j31l75k04N12l80o84
$$ 735 274 409 521 1082 905 697 671 881 372 754 550 -30 157 53 -78 -453 -657 -145 -525 -1209
1063a209M02K29l36Pk0N36l5K3M14L3k99L71L80L41j19l45M64l1l63M36k08l18
$$ -1209 -807 -578 -914 -907 -927 -391 -426 -403 11 44 -255 116 496 837 718 373 837 806 443 879 671 353
1085C53J9M22n42l30j99L32j67l33j02k82P7k08K61J99k45kL48J78j68l0M51L18
$$ 353 372 794 252 -78 -277 55 -112 -445 -547 -829 -752 -960 -699 -500 -745 -747 -399 -221 -389 -419 32 350
1107C50n47L11O73m7k87M47l8j55l55L84j79l14j49N43o98k04J22l35nl10n2K68
$$ 350 -197 114 787 740 453 900 862 707 352 736 557 243 94 637 -61 -265 -143 -478 -483 -793 -845 -577
1129e77q6j10J30L48k43j69M19J60k93L15P21p8j90K61N71p29K76L61n21m4J30
$$ -577 -663 -773 -643 -295 -538 -707 -288 -128 -421 -106 615 537 347 608 1179 450 726 1087 566 522 652
1150F52j70k6m14J17J13l11l43p8k16K3j65L6M36m51o3L09J70m4M43J01J9J00
$$ 652 482 456 42 159 272 -39 -382 -460 -676 -653 -818 -782 -346 -797 -860 -551 -381 -425 18 119 138 238
1172B38j4L36J7m1J44n5l4K7J82m56K56Mj86k84j65p0k36pk02nl26J24j4J67k80
$$ 238 224 560 577 536 680 625 591 618 800 344 600 604 418 134 -31 -101 -337 -344 -546 -551 -877 -753 -767 -600 -880
1197h80J59K85J14J37O0L19J75l58L2O42k9j40lK22J07k64K01j60k91k90J79k74
$$ -880 -721 -436 -322 -185 -125 194 369 11 43 685 656 516 513 735 842 578 779 619 328 38 217 -57
1219e7q8m49M12j41k20j5j1k03R3k6L01K16j55Q5L01k51M44J76j48P1R7k8L47
$$ -57 -145 -594 -182 -323 -543 -558 -569 -772 -679 -705 -404 -188 -343 -258 43 -208 236 412 264 335 432 404 751
1242G51l27J32K34l68k0k06J75k93K1k0k81k76J52k13O0k24j97N88k73p9K28K54
$$ 751 424 556 790 422 402 196 371 78 99 79 -202 -478 -326 -539 -479 -703 -900 -312 -585 -664 -436 -182
1264a82o7p5J37L98l9J81o8K07M9O1J50p9l9n61O39k95l13L05k06l00j43k3k30
$$ -182 -249 -324 -187 211 172 353 285 492 541 602 752 673 634 73 712 417 104 409 203 -97 -240 -263 -493
1287d93M8k74K45q6j55K85k11J79p8M12L9J04N1l0K07N2K9K66jM0J55o6l92J24
$$ -493 -445 -719 -474 -560 -715 -430 -641 -462 -540 -128 -89 15 66 36 243 295 324 590 589 629 784 718 326 450
1311D50J24j53k15P6J30m72n64M31k97k41J9L27k38N5o8J49L47j97J68L08J46
$$ 450 574 421 206 282 412 -60 -624 -193 -490 -731 -712 -385 -623 -568 -636 -487 -140 -337 -169 139 285
1332B85n29N41J83l7n5K83m8k13L57j02M5l97J84p4k37R7j90j71l23o7j23p4l7
$$ 285 -244 297 480 443 388 671 623 410 767 665 710 313 497 423 186 283 93 -78 -401 -468 -591 -665 -702
1355g02jJ88j00o1L91Q6Oj9r3N97j23o9M41n9k43O27l45Q4O8k62R5j2l76L57m91
$$ -702 -703 -515 -615 -676 -285 -199 -193 -212 -305 292 169 100 541 482 239 866 521 605 673 411 506 494 118 475 -16
1380a6M4j43j19K52n08j89J87j56J24Q3m56M71J8J62K54k19J04L63M5k77M91j29
$$ -16 28 -115 -234 18 -490 -679 -492 -648 -524 -441 -897 -426 -408 -246 8 -211 -107 256 301 24 515 386
1402C86QK48q5K22l17K00k56j8j9k90k14l9l01l2rJ47r9j94L58rm31M81k07N2
$$ 386 394 642 557 779 462 662 406 388 369 79 -135 -174 -475 -507 -516 -369 -468 -662 -304 -313 -744 -263 -470 -418
1426d18K89N9p8K71M3K77j24J1J08K89l60N0lj26K52m84K05l6r1r7k61k15l8N3
$$ -418 -129 -70 -148 123 166 443 319 330 438 727 367 417 414 288 540 56 261 225 134 37 -224 -439 -477 -424
1450d24J61k34n0J88p8M3k24K71K90k94k17O36K12j18K43l9L03k76j86M33l13
$$ -424 -263 -497 -547 -359 -437 -394 -618 -347 -57 -351 -568 68 280 162 405 366 669 393 207 640 327
1471C27J79o8k8m69K48n01J17L1l06nN3K16k61j19J2J42r4L66m64K58K45J54J97
$$ 327 506 438 410 -59 189 -312 -195 -164 -470 -475 -422 -206 -467 -586 -574 -432 -526 -160 -624 -366 -121 33 230
1494B30l38M82j48L5L01K1r0J0K77k35o4l37K45j75k55J18j76o1o4k38q8J07M4
$$ 230 -108 374 226 261 562 583 493 503 780 545 481 144 389 214 -41 77 -99 -160 -224 -462 -550 -443 -399
1517c99k37J37j8K52j85J71J23r2L96r8j36M79J3PR5j05R6m3L4M62o11N0l77j73
$$ -399 -636 -499 -517 -265 -450 -279 -156 -248 148 50 -86 393 406 413 508 403 499 456 490 952 341 391 14 -159
1541a59L93l41j72L58m96J15q1q8O6j59R3J70j63K60M3k45M68k1K21N1K2m7N8
$$ -159 234 -107 -279 79 -417 -302 -383 -471 -405 -564 -471 -301 -464 -204 -161 -406 62 41 262 313 335 288 346
1564C46j95K82K44k79J06J10k86j79m98M47j34j33J5jk57J86k71R2J07m05K03
$$ 346 151 433 677 398 504 614 328 149 -349 98 -36 -169 -154 -155 -412 -226 -497 -405 -298 -703 -500
1585e00J00J45%K67k8J79J9J11P5k09M17Q5j23J58k04j48j09Q1K9j86j11J42l13
$$ -500 -400 -255 -255 12 -16 163 182 293 368 159 576 661 538 696 492 344 235 316 345 159 48 190 -123
1608a23o8k00k2J27j65K2l37N36l47J60Q1N4K03k5J99j67L25n2K38k23J39LJ43
$$ -123 -191 -391 -413 -286 -451 -429 -766 -230 -577 -417 -336 -282 -79 -104 95 -72 253 201 439 216 355 358 501
1631E01k2j32J04m0l29r7N6k01O2L9k9l41j78J93k15L95n16L02o3K54L9K48k52
$$ 501 479 347 451 411 82 -15 41 -160 -98 -59 -88 -429 -607 -414 -629 -234 -750 -448 -511 -257 -218 30 -222
1654b22J4M79J51l26J42J11R3r8J00j19N1K4K42n57L48m68K12n7k90k8P8j86L6
$$ -222 -208 271 422 96 238 349 442 344 444 325 376 400 642 85 433 -35 177 120 -170 -198 -120 -306 -270
1677b70J9k16J04n8j02j23L95M9J41K04l39J16K16J91P0J9qr2J61J1m7J54m50
$$ -270 -251 -467 -363 -421 -523 -646 -251 -202 -61 143 -196 -80 136 327 397 416 408 316 477 488 441 595 145
1700A45K5O4l85J26k31K52l86m7K37m9k93J97M9j74J63j13J89K28k51J46J22n1
$$ 145 170 234 -151 -25 -256 -4 -390 -437 -200 -249 -542 -345 -296 -470 -307 -420 -231 -3 -254 -108 14 -37
1722c7K12R9N7P6K84J5j20m8j57K4J1k27n1K6j11j91L9k60J05j65q9K37l07K58
$$ -37 175 274 331 407 691 706 586 538 381 405 416 189 138 164 53 -138 -99 -359 -254 -419 -508 -271 -578 -320
1746c20k01J10J80P7K20qm5K37j40k55M31J93j34j76M77k99r1J95q0j36j01nj57
$$ -320 -521 -411 -231 -154 66 58 13 250 110 -145 286 479 345 169 646 347 256 451 371 235 134 129 -28
1769b8k71P5m1J90m8l14P0N3j05L05j72J07J08j13L94j36r2mJ21L59j29Q8J32
$$ -28 -299 -224 -265 -75 -123 -437 -367 -314 -419 -114 -286 -179 -71 -184 210 74 -18 -22 99 458 329 417 549
1792E49l12M3J93p1j90N9k03R8m26K68N6l79k7L7j5k96L67l40M18j46N6n1J51
$$ 549 237 280 473 402 212 271 68 166 -260 8 64 -315 -342 -305 -320 -616 -249 -589 -171 -317 -261 -312 -161
1815a61J34J01J4J71j80K06p8K0K10j99L31j30j86J61J57l06j40R0m01Q4j15m5
$$ -161 -27 74 88 259 79 285 207 227 437 238 569 439 253 414 571 265 125 215 -186 -102 -217 -262
1837b62K39l75k56L91j89J18J42k31O4J83M5L31j64P4K79k34J16N5l9J32j40L3
$$ -262 -23 -398 -654 -263 -452 -334 -192 -423 -359 -176 -131 200 36 110 389 155 271 326 287 419 279 312
1859C12Q3l21J48J2l43L79o21M59o7l48K4nO6m92M68m8J40j81L81k51J73R4R5
$$ 312 395 74 222 234 -109 270 -351 108 41 -307 -283 -288 -222 -714 -246 -294 -154 -335 46 -205 -32 62 157
1882A57j96J52L7P8K39m3p9j06n7J42q2M9lp7j08R4m19l2N3J0k21J66l82J97J20
$$ 157 -39 113 150 228 467 424 345 239 182 324 242 291 288 211 103 197 -222 -254 -201 -191 -412 -246 -628 -431 -311
1907c11K25l21lK83q4J26L9J64n1M7lK59j08K71j91l7j91K04j09J11j7j90Q9l35
$$ -311 -86 -407 -410 -127 -211 -85 -46 118 67 114 111 370 262 533 342 305 114 318 209 320 303 113 202 -133
1931a33j2j21l4P1o1j72K42m79N25j03mj00L08M3k64M08j06J63q0L6J50oJ41j44
$$ -133 -145 -266 -300 -229 -290 -462 -220 -699 -174 -277 -281 -381 -73 -30 -294 114 8 171 91 127 277 271 412 268
1955B68J55J61l95q8K80l40r0k3J52l20M7j9j52J29l38L76j15p9J34n1O7%L33
$$ 268 423 584 189 101 381 41 -49 -72 80 -240 -193 -212 -364 -235 -573 -197 -312 -391 -257 -308 -241 -241 92
1978I2J49l7k1RK38j74k8L6L5J10k01J12k15j2M0J58j93k07M8J05k10j73N8q3
$$ 92 241 204 183 192 430 256 228 264 299 409 208 320 105 93 133 291 98 -109 -61 44 -166 -339 -281 -364
2002c64J36j02K12n4r9K76l71L06K9K08k0r9j8L55K1j88n3P5J85k92K05j15o8
$$ -364 -228 -330 -118 -172 -271 5 -366 -60 -31 177 157 58 40 395 416 228 175 250 435 143 348 233 165
2025A65j09j29j35J87n2L9l94l4J49KR3q5J87k18K57l7m9L70l56N2K54J12j05
$$ 165 56 -73 -208 -21 -73 -34 -428 -462 -313 -311 -218 -303 -116 -334 -77 -114 -163 207 -149 -97 157 269 164
2048A64kM72m05q6L69m02J42K30k29k78K0j21K29j46l43L49l71K70O0m08jJ80
$$ 164 162 634 229 143 512 110 252 482 253 -25 -5 -126 103 -43 -386 -37 -408 -138 -78 -486 -487 -307
2070c07R6pO1NL8N5j18L42k7M4L87l78j31K62K0j17k36K15qqk19K13r7k69R3j32
$$ -307 -211 -218 -157 -152 -114 -59 -177 165 138 182 569 191 60 322 342 225 -11 204 196 188 -31 182 85 -184 -91 -223
2096b23L3j80k9N8O9J57l09K28rK14K09l22K08N8J05j06NO8K35l18L94P4m98K26
$$ -223 -190 -370 -399 -341 -272 -115 -424 -196 -205 9 218 -104 104 162 267 161 166 234 469 151 545 619 121 347
2120C47k97J97l9m04n9L06q1j04j16k01K55n9J75k70O6R3K11k39j15N18j95K48
$$ 347 50 247 208 -196 -255 51 -30 -134 -250 -451 -196 -255 -80 -350 -284 -191 20 -219 -334 184 -11 237
2142B37L6q3L37j24j59J00k6L04l00l14L8j39K61k85n0K03j71k27M4J03j23p9
$$ 237 273 190 527 403 244 344 318 622 322 8 46 -93 168 -117 -167 36 -135 -362 -318 -215 -338 -417
2164d17K01J66m22L34J53k42M5K19R2J30j68j37M00k04Q8N7l1M0J30k88o8K33
$$ -417 -216 -50 -472 -138 15 -227 -182 37 129 259 91 -46 354 150 238 295 264 304 434 146 78 311
2186C11k26j5n3j91J06k0J6j81l02K81K3P2j24K4L00j29k48K31L3J69j07J64M01
$$ 311 85 70 17 -174 -68 -88 -72 -253 -555 -274 -251 -179 -303 -279 21 -108 -356 -125 -92 77 -30 134 535
2209E35l34j24K73j73j24K32m3qJ78m80K00k24j63L81m13kK04j89k3J40j31l0
$$ 535 201 77 350 177 53 285 242 234 412 -68 132 -92 -255 126 -287 -289 -85 -274 -297 -157 -288 -318
2231c18K03k56K53L5nk31L04l3L28k07K19J40q4l07R6L27k88j6J54j71J1L4k63
$$ -318 -115 -371 -118 -83 -88 -319 -15 -48 280 73 292 432 348 41 137 464 176 160 314 143 154 188 -75
2254g5L5j06np8j36R2k03l7K01m6K37j44K55j8j92K05p5K01Q0m5K32o0q0O2j48
$$ -75 -40 -146 -151 -229 -365 -273 -476 -513 -312 -358 -121 -265 -10 -28 -220 -15 -90 111 191 146 378 318 238 300 152
2279A52K65m69L64o0k93N9o8K2j29Q7k37qJ31N1k47L03j34Q3r3j4K02K9k64K93
$$ 152 417 -52 312 252 -41 18 -50 -28 -157 -70 -307 -315 -184 -133 -380 -77 -211 -128 -221 -235 -33 -4 -268 25
2303B5K35k10K98j5k63K16l20K34K07m57L39J3j42J3l85Q2J44k58O7J33O0l32
$$ 25 260 50 348 333 70 286 -34 200 407 -50 289 302 160 173 -212 -130 14 -244 -177 -44 16 -316
2325c16j15M11k49N8K19k42J68J75k80J48J90J19j34%O2J59j05o2J38r1J47j14
$$ -316 -431 -20 -269 -211 8 -234 -66 109 -171 -23 167 286 152 152 214 373 268 206 344 253 400 286
2347B86k53K80j09k84J2J01j62r7M1j2k46L69O2k13k55N30n25K08K03L3J54r0
$$ 286 33 313 204 -80 -68 33 -129 -226 -185 -197 -443 -74 -12 -225 -480 50 -475 -267 -64 -31 123 33
2369C3R7n3k0K70n8q4J6j78n2J93J81k76q1J91l57M3j19j12J87k63J86L6l0N2
$$ 33 130 77 57 327 269 185 201 23 -29 164 345 69 -12 179 -178 -135 -254 -366 -179 -442 -256 -220 -250 -198
2393a98j87J39ML61j07mJ57l50K33K61J0L8q6j43L3j60J96M6o9o0Q2j37j39J99
$$ -198 -385 -246 -242 119 12 8 165 -185 48 309 319 357 271 128 161 1 197 243 174 114 196 59 -80 119
2417A19k21m5j02J64m64L05R8R0j85P3p5Q5Q6P2N4r3J59J40j34k37N16J73l72
$$ 119 -102 -147 -249 -85 -549 -244 -146 -56 -241 -168 -243 -158 -72 0 54 -39 120 260 126 -111 405 578 206
2440B06J60p3L1j54m3k03K09k96j8j5K9jl7n5j0J13j83J62n3K97j30q9K65PM7
$$ 206 366 293 324 170 127 -76 133 -163 -181 -196 -167 -168 -205 -260 -270 -157 -340 -178 -231 66 -64 -153 112 119 166
2465A66o7K3n8M3K67k90J09q3k12K52L04j65j28jk76J34k83J47R3j0Q0l00l33
$$ 166 99 122 64 107 374 84 193 110 -102 150 454 289 161 160 -116 18 -265 -118 -25 -35 45 -255 -588
2488e88L43l3J55J02OJ4k23K79N4j30L89l49J55J05L8k1J38k5r3k50R1R4k31K37
$$ -588 -245 -278 -123 -21 -15 -1 -224 55 109 -21 368 19 174 279 317 296 434 409 316 66 157 251 20 257
2512B57k24k12J62j94j04M6K00j1k18K55p6j89L29J24k51O1K29j10m4K25J58j74
$$ 257 33 -179 -17 -211 -315 -269 -69 -80 -298 -43 -119 -308 21 145 -106 -45 184 74 30 255 413 239
2534B39j50O7n9K90k73J54k48k3J17n0k03K23j90O6l93J02J10p3K52j1k36P4R2
$$ 239 89 156 97 387 114 268 20 -3 114 64 -139 84 -106 -40 -433 -331 -221 -294 -42 -53 -289 -215 -123
2557a23k4P1N3K07j35O2J88j98K13J4o0R5oj58K70l33j61J10k73K54J22k50l22
$$ -123 -147 -76 -23 184 49 111 299 101 314 328 268 363 357 199 469 136 -25 85 -188 66 188 -62 -384
2580c84L90k10R1kj31K2J9J6j33K00N1J21J40J99l58J05J41j17J68j63L7L02m44
$$ -384 6 -204 -113 -115 -246 -224 -205 -189 -322 -122 -71 50 190 389 31 136 277 160 328 165 202 504 60
2603F0qK10j21K2j14K08k76n6LJ06j45k0J83l08j76K76o6j0R4O5n6N65m77J5k6
$$ 60 52 262 141 163 49 257 -19 -75 -72 34 -111 -131 52 -256 -432 -156 -222 -232 -138 -73 -129 436 -41 -26 -52
2628e2j9L50j16P2j78L07j26j52J54J15k28j91K61k24l3O5j64J22l0n3j54J10
$$ -52 -71 279 163 235 57 364 238 86 240 355 127 -64 197 -27 -60 5 -159 -37 -67 -120 -274 -164
2650a64QM8k0n3L17l24J6R8K32k57M02k92J19K73J4l32K43k43j03K11m1M8l91
$$ -164 -156 -108 -128 -181 136 -188 -172 -74 158 -99 303 11 130 403 417 85 328 85 -18 193 152 200 -191
2673a91k7K04J33l62J08j81ml7K03J51l89R0N5J51J07M0q3M3r6Q9l1LJ49j87J56
$$ -191 -218 -14 119 -243 -135 -316 -320 -357 -154 -3 -392 -302 -247 -96 11 51 -32 11 -85 4 -27 -24 125 -62 94
2698I4J03M9m4P2n9J94p9m16K05N9n56M16l19K69k29r4M13j77k8L4J08p7j49L17
$$ 94 197 246 202 274 215 409 330 -86 119 178 -378 38 -281 -12 -241 -335 78 -99 -127 -93 15 -62 -211 106
2722A06Q5P3k06o4J08j4M35j42k11J55r1j98K04K8k57J64k61p5M17n04KK6Q6L8
$$ 106 191 264 58 -6 102 88 523 381 170 325 234 36 240 268 11 175 -86 -161 256 -248 -246 -220 -134 -96
2746i6k02m8M6R6K08l84L38J33j61J7K98k3L8q1j07K6L28m56L39j40N7J90l27
$$ -96 -298 -346 -300 -204 4 -380 -42 91 -70 -53 245 222 260 179 72 98 426 -30 309 169 226 416 89
2769H9K39k89J2j18R8rj01k08k35J92o4L55k11n6K95j98J81o4J99Q2J26j28j21
$$ 89 328 39 51 -67 31 22 -79 -287 -522 -330 -394 -39 -250 -306 -11 -209 -28 -92 107 189 315 187 66
2792F6K70J01l03J32m38J20P5L00k45j41J58N4j99n2o2M3j85K72l5Q1j56J27j21
$$ 66 336 437 134 266 -172 -52 23 323 78 -63 95 149 -50 -102 -164 -121 -306 -34 -69 12 -144 -17 -138
2815a38K6r7J79J48n0M8J8K43k02k33L32l26L19j74M2K19l18OJ58k57j34J10J08
$$ -138 -112 -209 -30 118 68 116 134 377 175 -58 274 -52 267 93 135 354 36 42 200 -57 -191 -81 27
2838B7j74Q9o2nk00l4Q8L3N1o2M9O9M5J38n6j6J12m5J62K07j51j1j02J67L9l19
$$ 27 -147 -58 -120 -125 -325 -359 -271 -238 -187 -249 -200 -131 -86 52 -4 -20 92 47 209 416 265 254 152 319 358 39
2864C9M7J1q0r2l7Q0l09L23r8M3l46K64l44N6L10qP8k8Q9N1k5R8J19J33l22j9
$$ 39 86 97 17 -75 -112 -32 -341 -18 -116 -73 -419 -155 -499 -443 -133 -141 -63 -91 -2 49 24 122 241 374 52 33
2890C3J22J01j37O5j81K30k82R4J03k00K36j17l62K36k43J56k7J70n8j29R2J41
$$ 33 155 256 119 184 3 233 -49 45 148 -52 184 67 -295 -59 -302 -146 -173 -3 -61 -190 -98 43
2912D3q3j25J85j29L79k88J11j31K18n3M0o6Q3k49qJ26K63l14K10k19P7j01L0
$$ 43 -40 -165 20 -109 270 -18 93 -38 180 127 167 101 184 -65 -73 53 316 2 212 -7 70 -31 -1
2935al29J28J5J23j06oj49J22PL02l27K73k24K10Q6q8P0L2J2J31l27M34k87l0
$$ -1 -330 -202 -187 -64 -170 -176 -325 -203 -196 106 -221 52 -172 38 124 36 106 138 150 281 -46 388 101 71
2959G1J35l62M04k62n1M7J8L0L7m19L98p8p0r7M7N5R8m1l22l9L66M1M2K8j0K0
$$ 71 206 -156 248 -14 -65 -18 0 30 67 -352 46 -32 -102 -199 -152 -97 1 -40 -362 -401 -35 6 48 76 66 86
2985H6J13Kj39K6J61n6j1j39lK74o6j63j83J61j33K9P9j97J56k23l9n5P1K8K00
$$ 86 199 201 62 88 249 193 182 43 40 314 248 85 -98 63 -70 -41 38 -159 -3 -226 -265 -320 -249 -221 -21
3010b1J61k79K26j01j5K85p0k00N5j5K5J57K0o5j17P4J20k85J26j19n0J43K4k89
$$ -21 140 -139 87 -14 -29 256 186 -14 41 26 51 208 228 163 46 120 240 -45 81 -38 -88 55 79 -210
3034b10Q9k65K47j37J2K16m5j76M52o7p0lo1j53M50K0j01j28J44K24l41j35J9
$$ -210 -121 -386 -139 -276 -264 -48 -93 -269 183 116 46 43 -18 -171 279 299 198 70 214 438 97 -38 -19
3057a9K02n6j12L56j81o05L75o5J32k26o0J62m50L30J27k31M7M63l20Q4j5J35
$$ -19 183 127 15 371 190 -415 -40 -105 27 -199 -259 -97 -547 -217 -90 -321 -274 189 -131 -47 -62 73
3079G3L9N6j8n6J64L0j70l0j15K88j28m04N39k57J0J95q7j56j37J37k00j71K80
$$ 73 112 168 150 94 258 288 118 88 -27 261 133 -271 268 11 21 216 129 -27 -164 -27 -227 -398 -118
3102a18p3q6P3J58j17j15L93j29p5qL45k53J50J39k96K56j10j46J63J51l22m7
$$ -118 -191 -277 -204 -46 -163 -278 115 -14 -89 -97 248 -5 145 284 -12 244 134 -12 151 302 -20 -67
3124f7Q8j13N1R4K4l0k26j12K27j49q4K11l3j49J66J0k7N5J03L2k42j8K38M1q9
$$ -67 21 -92 -41 53 77 47 -179 -291 -64 -213 -297 -86 -119 -268 -102 -92 -119 -64 39 71 -171 -189 49 90 1
3149AmJ40Q7k86J16R9L37m99j23q2R8J66l28N1K52j51j40N3N8j82L71j92N4K62
$$ 1 -3 137 224 -62 54 153 490 -9 -132 -214 -116 50 -278 -227 25 -126 -266 -213 -155 -337 34 -158 -104 158
3173A58k83M8R5m2l3K52j94J98J07k12k79J77J73j03M6p9K77k91l08L42k64k02
$$ 158 -125 -77 18 -24 -57 195 1 199 306 94 -185 -8 165 62 108 29 306 15 -293 49 -215 -417
3195d17L86o9k28L14k96R4J14k6o4J34J1L1j03J29J30L3j26kK05j5l4j85J13k97
$$ -417 -31 -100 -328 -14 -310 -216 -102 -128 -192 -58 -47 -16 -119 10 140 173 47 45 250 235 201 16 129 -168
3219a68O4J50p1J62j07k2m8j4j08R8jk62K11O9J51j32q3k66R1K28L4J57Oj23r3
$$ -168 -104 46 -25 137 30 8 -40 -54 -162 -64 -65 -327 -116 -47 104 -28 -111 -377 -286 -58 -24 133 139 16 -77
3244g7L99J7l07l8J03j54K54j01m7r5K83k43q1k6q2K11Q9j48k01K30r2J64j82
$$ -77 322 339 32 -6 97 -57 197 96 49 -46 237 -6 -87 -113 -195 16 105 -43 -244 -14 -106 58 -124
3267a24k01J35K37k09l1J33J9K68m29J03K23J25j66P5j6k11K12n3J23n9k97J76
$$ -124 -325 -190 47 -162 -193 -60 -41 227 -202 -99 124 249 83 158 142 -69 143 90 213 154 -143 33
3289C3j54L2J90j3m45Q3J42j23K04l9J29m02K31J58J4N3j32r7M2o2L07n9k7J49
$$ 33 -121 -89 101 88 -357 -274 -132 -255 -51 -90 39 -363 -132 26 40 93 -39 -136 -94 -156 151 92 65 214
3313B14k7N8m4j36P4k04J6K6j1q0m3J25j7m93L77J54j08Kp2K78j21Nl6K23l86
$$ 214 187 245 201 65 139 -65 -49 -23 -34 -114 -157 -32 -49 -542 -165 -11 -119 -117 -189 89 -32 -27 -63 160 -226
3338b26M00j39k7J77k22j80L44K8Mj54oR2j82m4N18m19N0l45J75n1K11j7p5J1
$$ -226 174 35 8 185 -37 -217 127 155 159 5 -1 91 -91 -135 383 -36 14 -331 -156 -207 4 -13 -88 -77
3362g7j52J13j36J08K21j56N5j8O8K31k75J86k45M8K56j80J25l5J88l6k16K93
$$ -77 -229 -116 -252 -144 77 -79 -24 -42 26 257 -18 168 -77 -29 227 47 172 137 325 289 73 366
3384C66l33P1lo2l66P3K07m3m3j18J13j2O5j08J02J28L4k68M33j66J07k35R3M09
$$ 366 33 104 101 39 -327 -254 -47 -90 -133 -251 -138 -150 -85 -193 -91 37 71 -197 236 70 177 -58 35 444
3408D44k53kj55P3j53k2J96j64K11J9l42J45j96K83r2j33J28P7k35K50k81J92
$$ 444 191 189 34 107 -46 -68 128 -36 175 194 -148 -3 -199 84 -8 -141 -13 64 -171 79 -202 -10
3430a0M8k03K28k73J3K91j81K82N7l47K55o2Q8k19Q9K65k85n9R5k83M9P5o1K86
$$ -10 38 -165 63 -210 -197 94 -87 195 252 -95 160 98 186 -33 56 321 36 -23 72 -211 -162 -87 -148 138
3454A38j57j76Q3N0kK59l62M8K37j39K37j27J6k23J39J2J25J36k04m1qJ23j61
$$ 138 -19 -195 -112 -62 -64 195 -167 -119 118 -21 216 89 105 -118 21 33 158 294 90 49 41 164 3
3477COJ23Q5j82K9n6l98L29M1l4jJ07l99o3J55j2O3K11n09L25K53k84K63J2L7
$$ 3 9 132 217 35 64 8 -390 -61 -20 -54 -55 52 -347 -410 -255 -267 -204 7 -502 -177 76 -208 55 67 104
3502A04K04n5j2N4q9j9l9p7J9q8j49J68M4J39l39N8N4j20K10k41n1K8n8J35K1
$$ 104 308 253 241 295 206 187 148 71 90 2 -147 21 65 204 -135 -77 -23 -143 67 -174 -225 -197 -255 -120 -99
3527i9J10o6J67j18O8q4n7M0J94m5j03J34n6o3l7k7J58n5j24p3n2K17j1P2j78
$$ -99 11 -55 112 -6 62 -22 -79 -39 155 110 7 141 85 22 -15 -42 116 61 -63 -136 -188 29 18 90 -88
3552h8K2m4L6K22k12j67N7J09j60P0mp0K29j8R3M7LJJ25k0k11J62K12j23l49J16
$$ -88 -66 -110 -74 148 -64 -231 -174 -65 -225 -155 -159 -229 0 -18 75 122 125 126 251 231 20 182 394 271 -78 38
3578C8q6k56L45j03J68k43J48J52n26J7J41n3J76Q0q2n4J81J01n1R4j2j82J78
$$ 38 -48 -304 41 -62 106 -137 11 163 -363 -346 -205 -258 -82 -2 -84 -138 43 144 93 187 175 -7 171
3601A71O3k21J22J02m5J07j47j79K2q4J42n1k0J8j30l05M34o6M4j96J54N9o4o
$$ 171 234 13 135 237 192 299 152 -27 -5 -89 53 2 -18 0 -130 -435 -1 -67 -23 -219 -65 -6 -70 -76
3625g6l5J86q6j45N23l63j61J49L1K21J23k18j5j78P7q6Q5j30J67j03J59k60K30
$$ -76 -111 75 -11 -156 367 4 -157 -8 23 244 367 149 134 -44 33 -53 32 -98 69 -34 125 -135 95
3648I5k74K29J27j75Lj13Nj0J55P5N7m40L13l1J5K46l72L04l0k84J86n9M5j05
$$ 95 -179 50 177 2 5 -108 -103 -113 42 117 174 -266 47 16 31 277 -95 209 179 -105 81 22 67 -38
3672c8K11p1o0j29J98j8kJ7k12P1j57J7J0K8K3j17O3J98k14R9L58l14J26J87j58
$$ -38 173 102 42 -87 111 93 91 108 -104 -33 -190 -173 -163 -135 -112 -229 -166 32 -182 -83 275 -39 87 274 116
3697A16K11j28j61P3qq1o0K43m53K54R2j69l2J3J93l18J19J47j84P1j32j88K12
$$ 116 327 199 38 111 103 22 -38 205 -248 6 98 -71 -103 -90 103 -215 -96 51 -133 -62 -194 -382 -170
3720a70n7J82j7K1m8J31j28K50L4k0J3o1p8Q5r5O4Q5k07l2pQ4M6k93K93l47q8
$$ -170 -227 -45 -62 -41 -89 42 -86 164 198 178 191 130 52 137 42 106 191 -16 -48 -55 29 75 -218 75 -272 -360
3746c60J80M8L32k94J05j75mNO6M3P1Op4q2K59r9o9L4J81r6k0J44q2l3l04Q5R8
$$ -360 -180 -132 200 -94 11 -164 -168 -163 -97 -54 17 23 -51 -133 126 27 -42 -8 173 77 57 201 119 86 -218 -133 -35
3773c5q0O7l1J36k01K4KJ73k99K34Mm3J20j59J04l5q5M1K13L1j01J2j66L4J96
$$ -35 -115 -48 -79 57 -144 -120 -118 55 -244 -10 -6 -49 71 -88 16 -19 -104 -63 150 181 80 92 -74 -40 156
3798A56O2k44J01R7l54L13r0j6Oj34J34j59J73K0k13R7M3j14J55j48m5J82mO9
$$ 156 218 -26 75 172 -182 131 41 25 31 -103 31 -128 45 65 -148 -51 -8 -122 33 -115 -160 22 18 87
3822H7k16k2J20P9L37l76K49l01J88k4k39R5K44k68J95k39J19j82J07N0k86N82
$$ 87 -129 -151 -31 48 385 9 258 -43 145 121 -118 -23 221 -47 148 -91 28 -154 -47 3 -283 299
3844B99l92o9L54l24M5k48LL45n8j9o9K24Q9q2o0J89l4p5m7K36q2J23k76J76l4
$$ 299 -93 -162 192 -132 -87 -335 -332 13 -45 -64 -133 91 180 98 38 227 193 118 71 307 225 348 72 248 214
3869B14l09O7p2n7J46J3p7j79J30M5j90M6K69j72j02K58j29oM8J61p8M9j02K52
$$ 214 -95 -28 -100 -157 -11 2 -75 -254 -124 -79 -269 -223 46 -126 -228 30 -99 -105 -57 104 26 75 -27 225
3893B25n7m0j30K47j06l81K61j07K00lm4k46L94l41k75N32p7k84J25O4J1k02J99
$$ 225 168 128 -2 245 139 -242 19 -88 112 109 65 -181 213 -128 -403 129 52 -232 -107 -43 -32 -234 -35
3916c5m2K55l8k00K56l0j1k31J9M6K45j6O6r3j87J9j1J35j10K10l05K7q7k65N22
$$ -35 -77 178 140 -60 196 166 155 -76 -57 -11 234 218 284 191 4 23 12 147 37 247 -58 -31 -118 -383 139
3941A39j91q3j53Q8L5J85l30K20J02n1J3K44J3n0j34K12m00J40O1j36L21K9j52
$$ 139 -52 -135 -288 -200 -165 20 -310 -90 12 -39 -26 218 231 181 47 259 -141 -1 60 -76 245 274 122
3964A22N9k67J40L9j34%Q4P0j46J36j69j3K52k80m2J96o5R5k46J66Q1j59J01K4
$$ 122 181 -86 54 93 -41 -41 43 113 -33 103 -66 -79 173 -107 -149 47 -18 77 -169 -3 78 -81 20 44
3988D4Q1k93J44J15Q7p9j89J44n3j5J12n1k86M56jl48n2K50k49J44J9m2J18k24
$$ 44 125 -168 -24 91 178 99 -90 54 1 -14 98 47 -239 217 216 -132 -184 66 -183 -39 -20 -62 56 -168
4012a68J47j67L4J25M7J08R9pm51L96j89J02j25J5K40O2j06Q6P2k10j94p5K74
$$ -168 -21 -188 -154 -29 18 126 225 218 -233 163 -26 76 -49 -34 206 268 162 248 320 110 -84 -159 115
4035A15l50K40j51J65k05p3J44N0M9l0R3k33L00J8k0p0R7K0q6n3J49J22n02L11
$$ 115 -235 5 -146 19 -186 -259 -115 -65 -16 -46 47 -186 114 132 112 42 139 159 73 20 169 291 -211 100
4059A00k13K49K8j45kk04L38l87L40p4j79L21O4o82K21K30j78O4j00J35J72k40
$$ 100 -113 136 164 19 17 -187 151 -236 104 30 -149 172 236 -446 -225 5 -173 -109 -209 -74 98 -142
4081a42K34n3j22N40n07P1J09m9J19j24N1k61J91o0MM5k76J69Q3J00M9m15O6Q3
$$ -142 92 39 -83 457 -50 21 130 81 200 76 127 -134 57 -3 1 46 -230 -61 22 122 171 -244 -178 -95
4105i5q7J48J03l07O9K3J78j27N8M7n4J41m8k74K45K16Jj92R0j59J37K8o5K33
$$ -95 -182 -34 69 -238 -169 -146 32 -95 -37 10 -44 97 49 -225 20 236 237 45 135 -24 113 141 76 309
4129C09l33l3Q9j01J37N5j41n5k49L6m6K87J57q8p4j2k6k4k10L53m0O2j19J4O8
$$ 309 -24 -57 32 -69 68 123 -18 -73 -322 -286 -332 -45 112 24 -50 -62 -88 -112 -322 31 -9 53 -66 -52 16
$$ [...]
8191b89
##END NTUPLES=NMR FID
##END=
