##TITLE=1H_Pr NCS-11
 200.13MHz,CDCl3,
 8 sc
 
 8.7.2025
##JCAMPDX= 6.0         $$ Bruker NMR JCAMP-DX V2.0
##DATA TYPE= NMR FID
##DATA CLASS= NTUPLES
##ORIGIN= UXNMR, Bruker Analytische Messtechnik GmbH
##OWNER= pz
$$ XWIN-NMR		Version 3.5
$$ Tue Jul  8 16:04:15 2025 Russian Standard Time (UT+4h)  she@DPX200
##.OBSERVE FREQUENCY= 200.1313
##.OBSERVE NUCLEUS= ^1H
##.DELAY= (6, 6)
##.ACQUISITION MODE= SIMULTANEOUS
##.ACQUISITION SCHEME= undefined
##.AVERAGES= 8
##.DIGITISER RES= 18
##SPECTROMETER/DATA SYSTEM= spect
##.PULSE SEQUENCE= zg30
##.SOLVENT NAME= CDCl3
##.SHIFT REFERENCE= (INTERNAL, CDCl3, 0, 14.3821)
##AUDIT TRAIL= $$ (NUMBER, WHEN, WHO, WHERE, WHAT)
$$ ##TITLE= Audit trail, XWIN-NMR		Version 3.5
$$ ##JCAMPDX= 5.01
$$ ##ORIGIN= Bruker BioSpin GmbH
$$ ##OWNER= she
$$ F:/spectra/data/she/nmr/H-C/1/audita.txt
$$ ##AUDIT TRAIL=  $$ (NUMBER, WHEN, WHO, WHERE, WHAT)
(   1,<2025-07-08 16:03:20.21 +0400>,<she>,<DPX200>,
      <created by zg, POWCHK disabled, PULCHK disabled
       configuration hash MD5:
       00 E9 B6 7A A2 85 ED C7 34 08 36 98 17 FE 4E 26
       data hash MD5: 16K
       37 91 3F A3 FE 73 16 20 0F 1D 0D 59 AC 98 64 19>)
$$ ##END=
$$ 
$$ hash MD5
$$ AA A1 C9 DC 2C 7C 48 02 3D E7 F1 86 93 07 5F 13
##$RELAX= 
##$RELAX= 
##$RELAX= 
##$RELAX= 
##$RELAX= 
##$RELAX= 
$$ Bruker specific parameters
$$ --------------------------
##$DU= <F:/spectra>
##$EXPNO= 1
##$NAME= <H-C>
##$PROCNO= 1
##$TYPE= <nmr>
##$USER= <she>
##$AMP= (0..31)
100 100 100 100 100 100 100 100 100 100 100 100 100 100 100 100 100 100 
100 100 100 100 100 100 100 100 100 100 100 100 100 100 
##$AQSEQ= 0
##$AQ_mod= 1
##$AUNM= <au_zg>
##$AUTOPOS= <>
##$BF1= 200.13
##$BF2= 200.13
##$BF3= 200.13
##$BF4= 200.13
##$BF5= 200.13
##$BF6= 200.13
##$BF7= 200.13
##$BF8= 200.13
##$BYTORDA= 1
##$CFDGTYP= 0
##$CFRGTYP= 5
##$CHEMSTR= <none>
##$CNST= (0..31)
1 1 145 1 1 1 1 1 1 1 1 1 1 1 1 1 1 1 1 1 1 1 1 1 1 1 1 1 1 1 1 1 
##$CPDPRG= <>
##$CPDPRG1= <>
##$CPDPRG2= <>
##$CPDPRG3= <>
##$CPDPRG4= <mlev>
##$CPDPRG5= <mlev>
##$CPDPRG6= <mlev>
##$CPDPRG7= <mlev>
##$CPDPRG8= <mlev>
##$CPDPRGB= <>
##$CPDPRGT= <>
##$D= (0..31)
0 0.7 0 0 0 0 0 0 0 0 0 0.03 0 0 0 0 0 0 0 0 0 0 0 0 0 0 0 0 0 0 0 0 
##$DATE= 1751976199
##$DBL= (0..7)
120 120 120 120 120 120 120 120 
##$DBP= (0..7)
150 150 150 150 150 150 150 150 
##$DBP07= 0
##$DBPNAM0= <>
##$DBPNAM1= <>
##$DBPNAM2= <>
##$DBPNAM3= <>
##$DBPNAM4= <>
##$DBPNAM5= <>
##$DBPNAM6= <>
##$DBPNAM7= <>
##$DBPOAL= (0..7)
0.5 0.5 0.5 0.5 0.5 0.5 0.5 0.5 
##$DBPOFFS= (0..7)
0 0 0 0 0 0 0 0 
##$DE= 6
##$DECBNUC= <off>
##$DECIM= 32
##$DECNUC= <off>
##$DECSTAT= 4
##$DIGMOD= 1
##$DIGTYP= 9
##$DL= (0..7)
0 120 120 120 120 120 120 120 
##$DP= (0..7)
150 150 150 150 150 150 150 150 
##$DP07= 0
##$DPNAME0= <>
##$DPNAME1= <>
##$DPNAME2= <>
##$DPNAME3= <>
##$DPNAME4= <>
##$DPNAME5= <>
##$DPNAME6= <>
##$DPNAME7= <>
##$DPOAL= (0..7)
0.5 0.5 0.5 0.5 0.5 0.5 0.5 0.5 
##$DPOFFS= (0..7)
0 0 0 0 0 0 0 0 
##$DQDMODE= 0
##$DR= 18
##$DS= 0
##$DSLIST= <SSSSSSSSSSSSSSS>
$$ [...]
##$SUBNAM0= <"">
##$SUBNAM1= <"">
##$SUBNAM2= <"">
##$SUBNAM3= <"">
##$SUBNAM4= <"">
##$SUBNAM5= <"">
##$SUBNAM6= <"">
##$SUBNAM7= <"">
##$SUBNAM8= <"">
##$SUBNAM9= <"">
##$SW= 18.0517328524113
##$SWIBOX= (0..15)
0 0 2 0 0 0 0 0 0 0 0 0 0 0 0 0 
##$SW_h= 3612.71676300578
##$TD= 16384
##$TD0= 1
##$TE= 0
##$TE2= 300
##$TE3= 300
##$TEG= 300
##$TL= (0..7)
0 120 120 120 120 120 120 120 
##$TP= (0..7)
150 150 150 150 150 150 150 150 
##$TP07= 0
##$TPNAME0= <>
##$TPNAME1= <>
##$TPNAME2= <>
##$TPNAME3= <>
##$TPNAME4= <>
##$TPNAME5= <>
##$TPNAME6= <>
##$TPNAME7= <>
##$TPOAL= (0..7)
0.5 0.5 0.5 0.5 0.5 0.5 0.5 0.5 
##$TPOFFS= (0..7)
0 0 0 0 0 0 0 0 
##$TUNHIN= 0
##$TUNHOUT= 0
##$TUNXOUT= 0
##$USERA1= <user>
##$USERA2= <user>
##$USERA3= <user>
##$USERA4= <user>
##$USERA5= <user>
##$V9= 5
##$VALIST= <valist>
##$VCLIST= <CCCCCCCCCCCCCCC>
##$VD= 0
##$VDLIST= <DDDDDDDDDDDDDDD>
##$VPLIST= <PPPPPPPPPPPPPPP>
##$VTLIST= <TTTTTTTTTTTTTTT>
##$WBST= 1024
##$WBSW= 4
##$XGAIN= (0..3)
0 0 0 0 
##$XL= 0
##$YL= 0
##$YMAX_a= 75273
##$YMIN_a= -63886
##$ZGOPTNS= <>
##$ZL1= 120
##$ZL2= 120
##$ZL3= 120
##$ZL4= 120
##$ABSF1= 10
##$ABSF2= 0
##$ABSG= 5
##$ABSL= 3
##$ALPHA= 0
##$AQORDER= 0
##$ASSFAC= 0
##$ASSFACI= 0
##$ASSFACX= 0
##$ASSWID= 0
##$AUNMP= <proc_1d>
##$AZFE= 0.1
##$AZFW= 0.1
##$BCFW= 1
##$BC_mod= 2
##$BYTORDP= 1
##$COROFFS= 0
##$CY= -3
##$DATMOD= 1
##$DC= 2
##$DFILT= <>
##$DTYPP= 0
##$F1P= 0
##$F2P= 0
##$FCOR= 0.5
##$FTSIZE= 0
##$FT_mod= 4
##$GAMMA= 1
##$GB= 0.15
##$INTBC= 1
##$INTSCL= 1
##$ISEN= 128
##$LB= 0.25
##$LEV0= 0
##$LPBIN= 0
##$MAXI= 10000
##$MC2= 0
##$MEAN= 0
##$ME_mod= 0
##$MI= 1.114404
##$NCOEF= 0
##$NC_proc= 0
##$NLEV= 6
##$NOISF1= 3.799351
##$NOISF2= 2.8
##$NSP= 1
##$NTH_PI= 0
##$NZP= 0
##$OFFSET= 14.38212
##$PC= 1
##$PHC0= -1360.214
##$PHC1= 13.79247
##$PH_mod= 1
##$PKNL= yes
##$PPARMOD= 0
##$PSCAL= 0
##$PSIGN= 0
##$REVERSE= no
##$SF= 200.129724274929
##$SI= 16384
##$SIGF1= 3
##$SIGF2= 2
##$SINO= 400
##$SIOLD= 16384
##$SREGLST= <1H.CDCl3>
##$SSB= 0
##$STSI= 0
##$STSR= 0
##$SW_p= 3205.1282051282
##$SYMM= 0
##$S_DEV= 0
##$TDeff= 0
##$TDoff= 0
##$TI= <>
##$TILT= no
##$TM1= 0
##$TM2= 0
##$TOPLEV= 0
##$USERP1= <user>
##$USERP2= <user>
##$USERP3= <user>
##$USERP4= <user>
##$USERP5= <user>
##$WDW= 1
##$XDIM= 8192
##$YMAX_p= 0
##$YMIN_p= 0
$$ End of Bruker specific parameters
$$ ---------------------------------
##NTUPLES= NMR FID
##VAR_NAME=  TIME,          FID/REAL,        FID/IMAG
##SYMBOL=    X,             R,               I
##VAR_TYPE=  INDEPENDENT,   DEPENDENT,       DEPENDENT
##VAR_FORM=  AFFN,          ASDF,            ASDF
##VAR_DIM=   8192,          8192,            8192
##UNITS=     SECONDS,       ARBITRARY UNITS, ARBITRARY UNITS
##FACTOR=    0.0002768,     1,               1
##FIRST=     0,             0,               0
##LAST=      2.2672688,     0,               0
##MIN=       0,             -63886,          0
##MAX=       2.2672688,     75273,           0
$$ Real data points
##PAGE= N=1
##DATA TABLE= (X++(R..R)), XYDATA
$$ plain form
0 0 0 0 0 0 0 0 0 0 0 0 0 0 0 0 0 0 0 0 0 0 0 0 0 0 0 0 0 0 0 0 0 0 0 0 0 0 0 0 0 -1 2 -2 3 -3 3 -4 4 -5 5 -6 8 -8 8 -9 9 -11
56 -11 10 -10 9 -7 6 -2 -4 19 -42 86 -185 442 -1361 10597 75273 37426 -37423 -42529 -5482 24338
76 24338 14592 -4947 -3757 -2865 -5817 2359 6028 784 -2462 -379 1879 -638 -3151 509 2976
91 2976 1040 -886 -1474 -735 546 473 354 -34 -704 -28 620 -237 -626 -31 515 429 -330 -144 443 -424
111 -424 -582 674 803 -260 -777 -502 229 542 70 -214 -111 23 51 53 -80 -174 202 655 58 -916 -556
132 -556 753 905 44 -743 -700 274 616 -12 -225 124 26 -311 -149 202 321 140 -322 -385 12 325 134
153 134 -78 -100 -12 41 68 -33 20 8 -53 19 103 11 -42 -5 56 49 -31 9 39 58 -53 -34 39 15 -18 -68 -20 -6 40
182 40 12 -17 -28 35 17 -62 -5 9 57 -22 -73 4 50 52 37 19 22 -4 12 -11 -25 -14 28 39 45 33 -15 29 -32 -18 19 12 -20
$$ packed form
0@%%%%%%%%%%%%%%%%%%%%%%%%%%%%%%%%%%%%%%%jLmNoOpQrJ0j1J4j6J6j7J8k0
56a1K1k0J9j6J3qkK3o1J28k71O27j803J1958O4676l7847p4849n106L7047K9820
76B4338r746j9539J190Q92k952Q176L669n244l246K083K258k517k513L660K467
91B976j936j926n88P39J281p3j19l88o70O76O48q57l89N95N46q6p59J86N87q67
111d24j58J256J29j063n17K75P31L13m72k84J03J34K8Kj33r4L76M53n97r74L60
132e56J309J52q61p87M3R74L42o28k13L49r8l37J62L51J19j81m62o3L97L13j91
153A34k12k2Q8N3K7j01N3j2o1P2Q4r2n3L7O1pq0M0L0J9j11J9P3k4l3n0M8J4M6
182D0k8k9j1O3j8p9N7J4M8p9n1P7M6Kj5j8Lk6J6k3j4J1M2J1Oj2m8M4o1J4L7pl2
$$ plain form
215 -20 -6 18 -15 -1 44 43 29 -7 9 80 60 -11 -90 -17 19 67 -4 -47 -4 26 -40 30 31 -28 -6 -40 36 14 -32 -19 26 41
247 41 18 1 3 -35 74 39 -4 -2 21 38 -33 5 25 -3 39 -6 1 47 6 -32 -9 -16 36 -28 -41 -52 57 -5 -45 -52 22 -1
279 -1 -30 -43 -26 46 -37 6 43 12 23 52 -25 -18 48 73 4 -61 -69 -31 12 6 80 13 1 53 45 -17 -38 66 -25 18 1 -40 39
312 39 32 9 -95 -3 -3 -5 34 4 -14 15 -53 9 7 11 -7 6 -16 -30 40 45 55 -5 -7 7 69 13 -30 14 42 41 -52 14 3 65
346 65 -2 0 75 -4 -64 19 -19 38 21 -62 19 -45 -34 7 -20 -37 -24 4 -58 -14 -9 0 17 -12 12 -54 25 -7 -62 16 17 -65 43
379 43 -14 -43 6 -24 13 25 -13 32 -4 17 -26 -51 -7 -19 42 -30 -12 8 11 0 7 39 -51 -66 -24 -56 3 -85 -28 -14 -28 -23
411 -23 -9 58 32 -16 12 10 -11 -72 20 -43 -17 -40 -19 26 -16 109 -1 -20 37 43 23 -1 39 40 -7 27 8 -27 9 80 51
442 51 21 31 -19 26 -39 -12 34 -7 -34 -5 -20 -36 25 67 37 -28 -1 21 2 47 12 -17 39 26 -44 20 21 -1 39 -22 6
$$ packed form
215b0J4K4l3J4M5jj4l6J6P1k0p1p9P3L6M8p1m3M3L0o6P0Jn9K2l4P6k2m6J3M5J5
247D1k3j7Kl8J09l5m3KK3J7p1L8K0k8M2m5PM6m1l8K3pN2o4j3j1J09o2m0pP4k3
279ak9j3J7P2q3M3L7l1J1K9p7PO6K5o9o5qL8M3oP4o7j2N2qo2k1J04r1M3j7m1P9
312C9pk3j04R2%kL9l0j8K9o8O2kMj8J3k2j4P0NJ0o0kJ4O2n6m3M4K8jr3O6j1O2
346F5o7KP5p9o0Q3l8N7j7q3Q1o4J1M1k7j7J3K8o2M4NRJ7k9K4o6P9l2n5P8Jq2J08
379D3n7k9M9l0L7J2l8M5l6K1m3k5M4j2O1p2J8K0Lj1PL2r0j5M2l2N9q8N7J4j4N
411b3J4O7k6m8K8kk1o1R2o3K6k3K1M5m2J25j10j9N7Ok0k4M0Jm7L4j9l5L6P1k9
442E1l0J0n0M5o5K7M6m1k7K9j5j6O1M2l0o5K7K2j9M5l5k9N6j3p0O4Jk2M0o1K8
$$ plain form
473 6 -31 9 11 21 -9 -11 68 -33 36 -3 26 -26 5 -30 -5 -9 19 -10 45 -46 3 -5 -35 -13 -20 -44 -4 51 45 38 -9 40 -8 -49
507 -49 20 8 9 -5 14 21 62 33 9 23 40 -18 8 38 -28 -35 4 23 6 -10 23 -12 -1 5 -6 -7 -3 -11 86 -61 -40 -25 -22 6
541 6 -45 -6 -7 -12 21 0 -35 -8 13 30 78 32 -15 -14 1 -18 -4 -62 33 -11 -2 -46 -12 -51 -6 33 30 56 15 -6 -7 -20 -16 -17 -11 34
577 34 -5 94 -37 -20 -26 -8 81 15 -16 19 50 56 76 32 -25 5 -22 -4 32 50 3 22 6 12 -63 18 14 -19 -10 16 -31 -13 17
610 17 -16 -11 -10 62 -35 34 21 -12 -51 40 17 -3 -46 -22 1 45 -6 -14 7 -15 70 -45 -2 29 58 -3 -15 -14 0 30 39 -7 29
643 29 -22 -33 12 -71 41 -38 -8 5 -38 9 3 -30 -29 -39 -23 13 30 38 -11 14 -8 -32 81 0 -20 75 -17 41 56 -4 -13 -12
675 -12 0 -14 8 6 39 15 7 -25 18 18 36 40 -12 -57 13 3 -12 -61 -60 22 -47 0 -17 55 26 7 -33 25 23 -4 -29 18 -4 -10
709 -10 46 69 38 -1 26 7 18 113 26 -19 -84 42 -20 39 3 44 24 36 -1 15 -1 -26 13 28 -34 -51 24 -34 -20 39
$$ packed form
473Fl7M0KJ0l0kP9j01O9l9K9n2L1l5K5mK8k9N5r1M9ql0K2pk4M0N5opm7M9m8m1
507d9O9j2Jj4J9PM1k9k4J4J7n8K6L0o6pL9J9j7j6L3l5J1Oj1jMqR7j47K1J5LK8
541Fn1L9jnL3k1l5K7K1J7M8m6m7JJ5j9J4n8R5m4Rm4L4l9M5L9lK6m1k1jj3MjOM5
577C4l9R9j31J7oJ8Q9o6l1L5L1OK0m4n7L0k7J8L6J8m7J9j6Op5Q1ml3RK6m7J8L0
610A7l3NJP2r7O9j3l3l9R1k3k0m3K4K3M4n1qK1k2Q5j15M3L1K9o1j2JJ4L0Rm6L6
643B9n1j1M5q3J12p9L0J3m3M7ol3Jj0J6L6J7Qm9K5k2k4J13q1k0R5r2N8J5o0rJ
675a2J2j4K2kL3k4ql2M3%J8Mn2m5P0j0j5m9JQ2o9M7j7P2k9j9m0N8kk7k5M7k2o
709a0N6K3l1l9K7j9J1R5q7m5o5J26o2N9l6M1k0J2l7J6j6k5L9J5o2j7P5n8J4N9
$$ plain form
739 39 -10 -12 44 40 -18 35 -35 2 42 14 -50 0 -20 -8 34 34 -22 17 -19 -8 23 3 8 66 51 -26 22 -1 14 25 -8 18 -22
772 -22 3 58 9 -8 -18 49 -18 35 29 13 5 -43 -21 0 -2 -21 -23 -57 -24 -56 -38 -14 -68 -31 23 0 52 -9 13 0 -10 -45 -49
805 -49 54 46 1 41 51 19 -23 -3 -56 2 7 -68 57 -4 -33 -77 -20 1 -15 -25 0 21 -56 -20 5 -2 43 25 -1 58 -28
836 -28 14 28 -9 -11 44 0 6 -45 2 54 -43 0 -12 -22 9 -10 -16 44 4 26 -29 18 -7 -66 -5 17 -22 18 24 -1 -7 -32 -20
869 -20 -9 9 1 -59 41 -23 73 26 1 -11 -7 -4 55 10 -28 18 14 5 56 31 1 20 -50 17 65 15 66 -3 -20 43 -4 43 13
902 13 46 -42 39 28 8 5 60 -10 9 21 1 -2 2 43 25 -11 24 26 44 6 20 25 -7 -16 -21 -4 8 33 -2 -19 -92 -42 77 -16
936 -16 3 -40 58 -18 19 15 -30 3 -45 -47 -24 13 37 -59 -26 24 15 -13 7 -22 21 -27 0 44 0 -2 22 -17 36 39 -6 -36 23
969 23 -63 -11 -47 30 23 -65 -15 30 4 -20 -35 16 -12 24 -52 -3 -20 -59 22 51 -17 -41 25 -52 16 -35 -48 40 29 -27 38
$$ packed form
739C9m9kN6mn8N3p0L7M0k8o4N0k0J2M2%n6L9l6J1L1k0NN8j5p7M8k3J5J1l3K6m0
772b2K5N5m9j7j0O7o7N3oj6qm8K2K1kj9kl4L3l2J8K4n4L7N4k3N2o1K2j3j0l5m
805d9J03qm5M0J0l2m2K0n3N8Np5J25o1k9m4N7K1j6j0K5K1p7L6K5pM5j8k6N9q6
836b8M2J4l7kN5m4On1M7N2r7M3j2j0L1j9oO0m0K2n5M7k5n9O1K2l9M0Ok5ok5J2
869b0J1J8qo0J00o4R6m7k5j2MLN9m5l8M6mrN1k5l0J9p0O7M8n0N1o9j7O3m7M7l0
902A3L3q8Q1j1k0lN5p0J9J2k0lMM1j8l6L5KJ8l8J4Nl2rnJ7J2K5l5j7p3N0J19r3
936a6J9m3R8p6L7mm5L3m8kK3L7K4r6L3N0rk8K0k9M3m8K7M4m4kK4l9N3Lm5l0N9
969B3q6N2l6P7pq8N0M5k6k4j5N1k8L6p6M9j7l9Q1K9o8k4O6p7O8n1j3Q8j1n6O5
$$ plain form
1000 38 -9 -28 -19 28 40 -8 -2 -10 1 19 50 -18 -3 -3 25 6 26 2 22 5 9 -14 -8 -20 -7 -25 57 -23 -9 21 2 -24 -32 -9
1034 -9 -66 16 -28 -17 12 -21 27 -19 -58 -19 -57 -14 -3 -16 26 5 19 21 43 -37 30 71 9 10 7 29 20 34 24 35 61 31 0
1067 0 6 -57 -32 -19 79 -20 -21 13 -15 -44 -41 -1 32 0 -40 -3 16 -36 -4 48 21 -2 -29 63 -21 37 -18 66 3 -2 79 11 26
1100 26 22 -54 19 -26 37 28 -42 -27 43 9 3 -2 -33 -10 43 5 -7 22 4 9 -6 10 30 -34 39 18 -26 -3 -14 8 29 35 -60
1133 -60 -8 54 53 -31 -30 -16 28 48 -26 -6 34 -2 -3 63 9 -55 -15 -85 39 -26 0 -17 47 -36 -20 -32 36 -1 -29 -6 10
1164 10 -20 -30 -33 41 -33 -7 3 -66 1 -25 -22 13 53 -11 15 -24 16 15 2 -53 33 20 48 -24 17 -7 28 -14 -3 -5 -24 -24 0
1197 0 -42 -64 -35 -49 5 -14 10 47 -18 -4 47 33 -10 -39 35 1 12 -8 10 61 -15 27 3 63 42 2 22 -20 46 -7 5
1228 5 54 11 37 -62 -34 3 -3 37 -7 2 22 -48 47 3 -25 -13 -36 -12 17 27 -29 39 -35 11 -30 -40 33 -24 -8 52 52 -25
$$ packed form
1000C8m7j9RM7J2m8OqJ1J8L1o8J5%K8j9K0k4K0j7Mk3Oj2J3j8Q2q0J4L0j9k6qK3
1034in7Q2m4J1K9l3M8m6l9L9l8M3J1j3M2k1J4KK2q0O7M1o2JlK2rJ4j0J1K6l0l1
1067@Oo3K5J3R8r9jL4k8k9LM0L3l2m0L7J9n2L2N2k7k3k7R2q4N8n5Q4o3nQ1o8J5
1100B6mp6P3m5O3rp0J5P0l4onl1K3N3l8j2K9j8Nj5J6K0o4P3k1m4K3j1K2K1Or5
1133f0N2O2jq4JJ4M4K0p4K0M0l6jO6n4o4M0p0J24o5K6j7O4q3J6j2O8l7k8K3J6
1164A0l0j0lP4p4K6J0o9O7k6LL5M0o4K6l9M0jj3n5Q6j3K8p2M1k4L5m2J1kj9%K4
1197@m2k2K9j4N4j9K4L7o5J4N1j4m3k9P4l4J1k0J8N1p6M2k4O0k1m0K0m2O6n3J2
1228EM9m3K6r9K8L7oM0m4RK0p0R5m4k8J2k3K4K9J0n6O8p4M6m1j0P3n7J6O0%p7
$$ plain form
1260 -25 23 21 -31 7 -14 -17 -19 -42 -6 41 -76 6 -28 -9 -15 37 17 -5 40 5 33 -9 -54 -62 -10 -9 -20 7 32 24 -3 30 -29
1293 -29 -102 15 -50 -20 -24 21 0 60 27 -7 -24 48 -13 -23 53 41 31 44 -32 45 -3 -44 24 -36 52 -21 -10 35 -2 -47
1323 -47 22 -26 -11 9 0 -12 12 -51 -25 28 -43 -35 9 19 -27 -18 26 35 -13 -11 -31 15 26 71 18 -21 -22 49 45 42 25 -24 18 25 4
1358 4 6 33 13 -26 -4 -47 -21 52 -11 14 -6 -40 14 -30 -19 -28 -34 -40 29 -41 -16 -39 -59 -26 28 41 18 1 56 19 -41 -84 -4
1391 -4 -41 -34 -9 46 -13 31 21 -43 51 -71 -14 43 69 -6 7 42 18 -45 2 21 5 -44 19 40 31 46 -3 -4 -32 14 -14 -7
1423 -7 -17 -16 51 -26 26 29 15 -33 29 -50 84 115 14 -3 18 7 2 14 -7 -7 -34 18 11 -15 2 11 56 -22 -24 26 6 21 -14
1456 -14 -14 -52 -47 2 13 14 10 -53 7 -7 6 54 16 23 7 -6 19 32 -24 -12 -25 37 58 0 23 77 29 6 1 24 -8 -1 -11 25
1490 25 -15 8 -33 23 42 0 28 -15 44 -23 -28 4 -6 -22 -41 42 2 -3 24 1 27 -7 1 -2 15 17 38 -14 -37 42 -16 -42 82
$$ packed form
1260b5M8kn2L8k1lkk3L6M7j17Q2l4J9oN2k0k2M5l5K8m2m5qN2Jj1K7K5qk7L3n9
1293b9p3J17o5L0mM5k1O0l3l4j7P2o1j0P6j2j0J3p6P7m8m1O8o0Q8p3J1M5l7m5
1323d7O9m8J5K0rj2K4o3K6N3p1QM4J0m6RM4Rm8Kk0M6J1M5n3l9jP1mlj7m9M2Pk1
1358DKK7k0l9K2m3K6P3o3K5k0l4N4m4J1rooO9p0K5k3k0L3N4J3k3j7N5l7o0m3Q0
1391dl7PK5N5n9M4j0o4R4j22N7N7K6p5J3L5k4o3M7J9j6m9O3K1rJ5m9jk8M6k8P
1423gj0JO7p7N2Lj4m8O2p9J34L1j01j7K1j1nJ2k1%k7N2pk6J7RM5p8kN0k0J5l5
1456a4%l8NM9J1Jmo3O0j4J3M8l8Pj6j3K5J3n6J2j3O2K1n8K3N4m8k3nK3l2Pj0L6
1490B5m0K3m1N6J9m2K8m3N9o7nL2j0j6j9Q3m0nK7k3K6l4QlJ7KK1n2k3P9n8k6J24
$$ plain form
1523 82 57 8 -3 3 -1 72 81 -35 10 28 -53 -4 -51 -41 36 59 68 5 -9 -20 25 44 6 39 -45 27 24 -8 2 -42 53 16
1555 16 1 24 5 17 -3 41 37 -14 7 -28 -12 -34 -20 -21 19 -8 2 -8 20 -15 20 30 -14 -2 -23 0 -1 -53 -22 -13 13 10 31
1588 31 -12 -31 -5 22 -8 -30 34 -37 10 -17 30 3 2 -34 -59 69 8 16 -5 -22 24 -18 27 -52 -23 50 -28 23 -37 11 -62
1619 -62 16 -22 -23 -3 15 2 -5 14 26 -1 4 20 -15 45 14 -50 -1 -34 36 -15 -7 42 -21 16 -43 -43 9 -35 -35 41 35 13 4 -23
1653 -23 5 -10 -52 -13 -21 -61 -4 12 -26 -7 -4 -13 28 -7 3 14 -23 -7 -14 4 -40 -1 -11 -22 11 -7 24 6 38 -26 -43 51
1685 51 44 -1 13 16 20 -8 -34 16 4 -44 -14 3 1 -40 -7 54 27 -29 1 8 -25 16 6 -13 -33 -37 -30 6 5 11 44 -3 -1 20 -21
1720 -21 -34 3 47 -5 9 22 34 10 20 -21 37 -21 -5 36 10 -2 -23 2 44 18 44 11 12 36 27 34 -25 -1 5 17 10 21 6
1753 6 31 4 13 10 -29 -2 -16 17 -13 -12 -56 3 28 -13 -3 15 -9 19 26 41 14 22 -3 16 -26 -6 64 -55 1 26 -16 -19 10
$$ packed form
1523H2k5m9j1OmP3Rj16M5J8q1M9m7J0P7K3Ro3j4j1M5J9l8L3q4P2ll2J0m4R5l7
1555A6j5K3j9J2k0M4mn1K1l5J6k2J4jM0k7J0j0K8l5L5J0m4J2k1K3jn2L1RK6lK1
1588C1m3j9K6K7l0k2O4p1M7k7M7k7jl6k5J28o1Qk1j7M6m2M5p9K9P3p8N1o0M8p3
1619f2P8l8jK0J8j3pJ9J2k7NJ6l5O0l1o4M9l3P0n1QM9o3L7n9%N2m4%P6ok2rk7
1653b3K8j5m2L9qm0N7J6l8J9LrM1l5J0J1l7J6pJ8m4L9j0j1L3j8L1j8L2o4j7R4
1685E1pm5J4LMk8k6N0j2m8L0J7km1L3O1k7n6L0Pl3M1j0j9k0mPL6jOL3m7KK1m1
1720b1j3L7M4n2J4J3J2k4J0m1N8n8J6M1k6j2k1K5M2k6K6l3JK4rPn9K4OJ2pJ1j5
1753FK5k7Rll9K7j4L3l0Jm4N9K5m1J0J8k4K8PJ5k7Qk5J9m2K0P0j19N6K5m2lK9
$$ plain form
1786 10 -43 -30 -29 -41 -25 34 -3 26 -9 8 29 -3 54 1 -34 2 -9 22 -16 36 40 -63 2 8 -2 -37 -26 -6 66 -8 21
1817 21 67 21 -18 26 -31 67 -19 36 -13 19 20 -37 -10 -20 44 -2 -8 15 4 -44 17 0 6 40 -3 24 -54 -1 36 22 -9 12
1849 12 8 -2 -8 -58 14 64 28 15 -18 54 31 31 -34 9 14 27 20 58 45 -38 41 0 -38 9 -34 17 13 -8 35 1 -31 60 28
1882 28 1 -12 15 72 37 -43 61 5 -5 -30 8 -9 5 -19 -11 -11 58 42 37 14 2 30 -10 -36 28 -34 -34 20 51 -1 23 -8
1914 -8 12 6 -7 -1 -25 27 6 22 47 -30 -5 60 -18 25 46 -4 9 68 -7 35 -25 17 15 -48 5 60 -19 -37 93 78 50 17
1946 17 42 4 -23 40 -69 -4 22 32 -34 -45 16 -54 2 19 -34 3 -13 -9 -14 -5 24 -22 -53 -17 36 -29 22 13 54 -25 -33 70
1978 70 19 11 -14 -32 -12 -3 7 41 -16 1 39 8 -19 5 -36 -15 -3 38 23 8 7 8 41 34 -7 42 -39 3 14 -42 -13 31 6
2011 6 13 57 -27 10 31 7 -13 32 -27 22 11 39 39 -21 11 2 -27 1 50 3 21 13 -29 44 -28 6 69 -29 17 43 0 59 -2
$$ packed form
1786A0n3J3Jj2J6N9l7K9l5J7K1l2N7n3l5L6j1L1l8N2Mj03O5Oj0l5J1K0P2p4K9
1817B1M6m6l9M4n7R8q6N5m9L2Jn7K7j0O4m6oK3j1m8O1j7OL4m3K7p8N3L7j4l1K1
1849A2mj0on0P2N0l6j3l3P2k3%o5M3NJ3pL8j3q3P9m1l8M7m3N1mk1M3l4l2R1l2
1882B8k7j3K7N7l5q0J04n6j0k5L8j7J4k4Q%O9j6nk3j2K8m0k6O4o2%N4L1n2K4l1
1914hK0oj3Ok4N2k1J6K5p7K5O5p8M3K1n0J3N9p5M2o0M2ko3N3N5p9j8J30j5k8l3
1946A7K5l8k7O3j09O5K6J0o6j1O1p0N6J7n3L7j6MnRK9m6l1L6N3o5N1rM1p9qJ03
1978G0n1qk5j8K0RJ0L4n7J7L8l1k7K4m1K1J2M1j5j5jJL3pm1M9q1M2J1n6K9M4k5
2011FPM4q4L7K1k4k0M5n9M9j1K8%o0L2rk9K8M9m7J8qm2P3p2L4O3r8M6K6m3N9o1
$$ plain form
2044 -2 -32 16 -29 -3 24 -12 -6 -48 12 -27 15 23 25 18 7 -12 21 11 -34 -81 -2 -3 -5 -18 -22 8 -41 41 15 39 14 0 19 -35
2078 -35 -5 23 -21 -20 -39 24 -18 21 16 -24 -47 43 17 -33 -3 34 -27 -3 5 -54 17 -6 -13 26 26 -5 26 55 7 5 28 -28 -4
2111 -4 -55 36 -28 -15 -5 10 7 -58 6 31 20 3 -1 32 59 -29 54 -26 -12 -1 13 7 -51 43 -31 -11 -16 -16 70 8 18 20 -49 21
2145 21 -7 -34 -6 58 20 -33 -4 44 -4 2 -23 2 24 -40 49 15 1 -81 74 -50 -27 -26 41 -14 -28 -28 -52 -30 0 36 -4
2176 -4 -18 -7 17 86 63 24 -2 40 9 -8 20 -9 55 11 -30 61 24 22 8 -9 41 52 4 -19 1 32 14 6 -26 -59 -46 26
2208 26 -31 15 6 -22 59 -50 -12 -22 -70 53 43 53 33 -6 -9 -24 38 28 -15 -11 -18 -22 -12 66 46 18 -16 0 -40 -6 34 7
2240 7 26 10 -10 9 57 -22 -22 -14 10 -15 -9 -33 -10 17 36 -3 -17 45 -41 -9 91 -13 -32 34 33 -1 -38 0 -18 50 13 10
2272 10 17 -19 -19 -28 13 45 22 -17 1 18 -15 16 49 -28 25 36 0 -81 -18 44 27 -38 -49 -11 -25 4 -31 0 -30 -5 -3 -22
$$ packed form
2044bl0M8m5K6K7l6Om2O0l9M2QKpj1j9L3j0m5m7P9jkj3mL0m9Q2k6K4k5j4J9n4
2078c5L0K8m4Jj9O3m2L9nm0k3R0k6n0L0L7o1K4Qn9P1k3pL9%l1L1K9m8kK3n6K4
2111dn1R1o4J3J0J5lo5O4K5j1j7mL3K7q8Q3q0J4J1J4on8R4p4K0n%Q6o2J0Ko9P0
2145B1k8k7K8O4l8n3K9M8m8Ok5K5K2o4Q9l4j4q2J55j24K3JO7n5j4%k4K2L0L6m0
2176dj4J1K4O9k3l9k6M2l1j7K8k9O4m4m1R1l7kj4j7N0J1m8k3K0L1j8ql2l3J3P2
2208B6n7M6rk8Q1j09L8j0m8J23j0J0k0l9lj5O2j0m3MpmJ0P8k0k8l4J6m0L4M0k7
2240GJ9j6k0J9M8p9%QK4k5Ok4K3K7J9l9j4O2q6L2J00j04j9O6jl4l7L8j8O8l7l
2272A0Pl6%rM1L2k3l9J8J7l3L1L3p7N3J1l6q1O3O2j7o5j1L8j4K9l5L1l0K5Kj9
$$ plain form
2304 -22 32 20 -51 -5 61 -4 46 -30 6 4 -21 -1 31 10 -4 -5 -1 -22 13 -2 25 9 25 -24 -33 -71 18 41 -25 -24 2 4 -26
2337 -26 1 -69 8 -15 2 -19 21 -4 47 24 -11 7 -13 43 14 -13 5 -17 17 42 8 60 23 30 -37 -46 33 -8 -23 40 39 9
2369 9 6 52 28 -21 -10 60 14 -8 11 4 40 -13 -4 -19 -23 -26 -17 11 10 18 -12 -1 -1 8 70 19 4 40 26 -33 17 38 26 13 -20 25
2405 25 13 -13 8 -18 -18 51 0 -60 3 33 -8 22 12 33 -2 -81 12 37 -17 24 15 29 -4 -5 -7 -36 -30 -3 -15 2 33 -44 0
2438 0 38 52 -22 7 91 57 36 -27 52 -49 -26 42 32 -28 -19 36 44 -34 26 -16 22 23 -33 14 27 -20 -18 -8 -7 -4 -14 -30 -34 46
2472 46 24 64 12 8 39 23 92 11 2 -11 55 26 -21 -14 -23 -14 -3 -16 -6 27 26 1 -14 15 60 20 -60 -17 21 -13 -44 -17 26
2505 26 2 -30 -26 4 -27 -68 -20 70 36 -53 -11 -47 35 -2 -14 31 25 39 13 -15 35 -20 -20 -10 8 51 -51 -35 -45 53 -31
2536 -31 14 14 2 -38 -44 -3 -7 -2 4 35 -18 34 3 15 -1 31 -2 34 5 -26 -26 0 10 -26 -8 -24 4 19 48 -4 32 30 -3 9
$$ packed form
2304b2N4j2p1M6O6o5N0p6L6kk5K0L2k1j4jMk1L5j5K7j6J6m9rl8Q9K3o6JK6Kl0
2337b6K7p0P7k3J7k1M0k5N1k3l5J8k0N6k9k7J8k2L4K5l4N2l7Po7rP9m1j5O3jl0
2369IlM6k4m9J1P0m6k2J9pL6n3Rj5mlRK8jQl0J1%RO2n1j5L6j4n9N0K1j2j3l3M5
2405B5j2k6K1k6%O9n1o0O3L0m1L0j0K1l5p9R3K5n4M1rJ4l3jkk9OK7j2J7L1p7M4
2438@L8J4p4K9Q4l4k1o3P9j01K3O8j0o0RN5Qp8O0m2L8Jn6M7J3m7KJ0JLj0j6mQ0
2472D6k2M0n2mL1j6O9q1rj3O6k9m7PrRJ1j3J0L3jk5j5K9M5m0q0M3L8l4l1K7M3
2505B6k4l2ML0l1m1M8R0l4q9M2l6Q2l7j2M5oJ4k6k8N0n5%J0J8M3j02J6j0R8q4
2536c1M5%j2m0oM1mNOL1n3N2l1J2j6L2l3L6k9l1%K6J0l6J8j6K8J5K9n2L6kl3J2
$$ plain form
2570 9 11 22 -6 11 -9 38 1 -24 -1 -4 -15 10 -20 17 28 19 16 -22 -37 -6 15 26 -18 -5 44 -13 -37 -28 18 -22 -50 18 -3
2603 -3 -19 14 -10 -53 -40 45 18 8 -12 46 22 -51 -14 -56 -23 -18 31 -31 -19 -2 -21 28 -80 -12 -18 3 -24 -15 -61 25 89 -41
2635 -41 46 -15 23 35 23 4 -3 4 25 36 -26 -21 48 -28 -39 42 37 -9 -3 22 -8 6 -11 43 -5 -24 28 16 -48 -51 -10 -23 -11
2668 -11 37 -15 -8 36 10 -5 -49 2 -76 -50 36 -8 49 31 57 23 -52 51 -18 52 6 0 23 -4 28 56 -17 4 50 5 -1
2699 -1 68 11 -57 -5 26 -22 -58 17 86 37 -7 -30 -9 1 -11 -66 -23 26 89 -7 -25 47 9 42 -33 38 25 47 7 51 -12
2730 -12 -5 -14 13 1 34 -7 -7 -36 6 -11 30 -10 30 32 8 -21 51 -2 -36 -39 -35 -2 -45 25 7 11 -1 -19 6 34 27 -59 -66 -9 2
2765 2 43 14 2 -9 -24 4 34 15 -26 0 -2 -13 -17 7 2 -26 3 25 -19 24 13 0 37 -1 -38 73 -64 27 -8 1 11 9
2797 9 -29 -30 10 2 -43 -75 -40 -14 -11 -35 -3 -46 11 -29 21 -46 3 8 5 -17 -6 -1 21 8 14 -18 -36 34 -5 -19 15 -16 -60 11
$$ packed form
2570IKJ1k8J7k0M7l7k5K3lj1K5l0L7J1rll8j5L1K1J1m4J3M9n7k4RM6m0k8O8k1
2603cj6L3k4m3J3Q5k7j0k0N8k4p3L7m2L3NM9o2J2J7j9M9j08O8oK1k7Rm6Q6O4j30
2635d1Q7o1L8J2j2j9pPK1J1o2NO9p6j1Q1nm6OK5l0J4j7N4m8j9N2j2o4lM1j3J2
2668a1M8n2PM4k6j5m4N1p8K6Q6m4N7j8K6l4p5J03o9P0m6oK3k7L2K8p3K1M6m5o
2699aO9n7o8N2L1m8l6P5O9m9m4k3K1J0j2n5M3M9O3r6j8P2l8L3p5P1j3K2m0M4o3
2730a2PrK7j2L3m1%k9M2j7M1m0M0Kk4k9P2n3l4lML3m3P0j8Mj2j8K5K8pq6pN7J1
2765BM1k9j2j1j5K8L0j9m1K6kj1mK4nk8K9K2m4M3j1j3L7l8l7J11j37R1l5RJ0k
2797Il8jM0qm5l2L5K6Lk4L2m3N7m0N0o7M9Nlk2J1NK2j3Ol2j8P0l9j4L4l1m4P1
$$ plain form
2831 11 -5 2 6 48 -56 19 58 16 10 -45 8 -13 -63 62 -13 17 11 26 23 19 21 -16 -51 38 -46 31 -38 27 51 39 -43 -6 58
2864 58 0 4 -37 9 -7 -52 -5 -3 -19 4 42 74 2 -8 55 -24 -67 -5 21 -24 -3 -48 -88 -32 46 -22 36 67 -14 -29 -24 -2
2896 -2 44 13 3 7 -31 -8 13 35 10 -8 37 39 -14 12 -14 -65 -44 -12 -17 -27 26 -25 -19 39 -17 -30 52 8 -8 -2 -43 -46 17 6
2930 6 -38 43 -25 -18 -8 8 -18 -11 35 -19 7 -38 34 -34 -55 24 2 54 52 31 50 21 -35 -3 30 -40 0 -5 39 -33 -41 -10 -75
2963 -75 2 -16 12 15 33 -27 25 -16 4 0 -9 32 26 25 19 36 -1 -27 14 -48 7 12 -19 -9 -4 48 25 -16 3 -15 -41 59 11 60
2997 60 -14 -15 -39 30 12 52 4 -6 -25 14 36 -16 2 -38 16 -34 2 1 0 -28 -18 66 22 -41 3 -57 7 -31 14 -5 -7 53
3029 53 -23 -36 1 15 -8 27 -20 23 21 -31 43 -30 -13 -19 54 39 33 4 19 -10 -23 -56 46 73 17 -21 20 -17 -2 14 -34
3060 -34 -5 -17 -16 9 25 9 41 -10 51 -7 -1 0 1 1 -33 7 25 21 -4 -32 56 49 -3 0 16 -1 -26 -18 -28 35 -16 2 -25 10 1
$$ packed form
2831A1j6PMM2j04P5L9m2on5N3k1n0J25p5L0oJ5lmKl7l5Q9q4P7o9O5K4j2q2L7O4
2864E8n8Mm1M6j6m5M7Kj6K3L8L2p2j0O3p9m3O2K6m5K1m5m0N6P8o8N8L1q1j5NK2
2896bM6l1j0Ml8K3K1K2k5j8M5Kn3K6k6n1K1L2nj0N3n1ON8n6j3Q2m4j6Om1lO3j1
2930Fm4Q1o8PJ0J6k6PM6n4K6m5P2o8k1P9k2N2kk1J9k9n6L2L3p0M0nM4p2qL1o5
2963g5P7j8K8LJ8o0N2m1K0mrM1ojoJ7l7k6M1o2N5Nl1J0NN2k3m1J9j8k6J00m8M9
2997F0p4jk4O9j8M0m8j0j9L9K2n2J8m0N4n0L6jjk8J0Q4m4o3M4o0O4l8M5j9kO0
3029E3p6j3L7J4k3L5m7M3kn2P4p3J7oP3j5ok9J5k9j3l3J02K7n6l8M1l7J5J6m8
3060c4K9j2JK5J6j6L2n1O1n8OJJ%l4M0J8mk5k8Q8pn2LJ6j7k5Qj0O3n1J8k7L5r
$$ plain form
3095 1 -50 32 -42 67 -6 -37 -19 -58 1 -30 28 27 36 -46 -34 -15 36 1 20 -10 -40 25 72 -1 36 55 19 -21 9 -8 41
3126 41 -16 15 -14 35 35 -46 -19 -32 -9 -15 -8 11 -7 -33 0 -25 -1 -9 14 -21 9 -28 7 12 -32 -40 27 18 21 -12 11 29 59 -64
3160 -64 7 -45 -75 -2 -42 12 -4 50 -36 33 -11 -17 8 27 -5 11 -45 -17 -40 -29 9 21 13 -13 -37 43 -13 15 -1 -3 2 -8
3192 -8 -48 2 -1 -35 19 -26 11 -37 -3 -1 33 -16 5 32 -7 26 -2 12 34 18 -1 -13 5 20 46 26 5 -11 -3 29 -21 21
3224 21 14 -33 -14 -44 -19 6 0 58 3 -62 -22 3 -9 0 -62 6 -20 11 -16 0 43 -25 14 11 -13 -10 12 29 46 15 0 -26 -27
3257 -27 -19 51 25 22 -3 -5 -47 -11 24 17 8 -30 -20 46 1 2 -22 6 -63 25 -21 21 -6 -16 86 4 45 9 51 -17 31 -23 -40
3290 -40 7 25 31 -32 -33 25 18 70 -23 -23 -30 -18 -26 28 16 8 -35 5 34 13 -25 16 34 26 0 -20 -9 -9 43 -8 8 -12 94 -42
3324 -42 16 -26 -24 22 -15 -1 10 16 -49 -18 16 -15 31 15 -39 -56 43 -1 -21 19 -21 -14 -21 24 23 63 -39 -4 -22 46 -4 -9 20
$$ packed form
3095An1Q2p4J09p3l1J8l9N9l1N8jRq2J2J9N1l5J9l0l0O5M7p3L7J9l6m0L0j7M9
3126D1n7L1k9M9%q1K7j3K3oPJ9j8k6L3k5K4qK3l5L0l7L5Nm4qO7rLl3K3J8L0j23
3160f4P1n2l0P3m0N4j6N4q6O9m4oK5J9l2J6n6K8k3J1L8J2qk6k4Q0n6K8j6kNj0
3192hm0N0ll4N4m5L7m8L4KL4m9K1K7l9L3k8J4K2j6j9j2J8J5K6k0k1j6QL2n0M2
3224B1pm7J9l0K5K5oN8n5o5M0K5j2Ro2O8k6L1k7J6M3o8L9lk4LK2J7J7l1j5k6j
3257b7QP0k6lk5km2L6L5prl8J0O6m5Jk4K8o9Q8m6M2k7j0J02q2M1l6M2o8M8n4j7
3290d0M7J8Oo3jN8pN2r3%pJ2qN4j2qm3M0K9k1l8M1J8qk6k0J1%N2n1J6k0J06j36
3324d2N8m2KM6l7J4J1Oo5L1L4l1M6j6n4j7R9m4k0M0m0PpM5jM0j02L5j8O8n0nK9
$$ plain form
3357 20 0 -25 -31 54 -38 -25 24 -54 30 87 -17 32 16 -21 20 -2 6 16 31 9 3 5 -32 15 37 -2 -11 8 -23 -10 -1 10 -31
3390 -31 -45 48 16 -16 -19 -9 8 10 17 -30 -17 3 -31 -41 -35 -49 17 -14 26 -36 11 32 12 21 -34 -19 68 17 -1 5 -22 12 -60
3423 -60 -24 0 -60 -13 -44 -11 -14 9 21 -33 30 -13 -12 -41 25 17 -37 -52 9 21 19 -14 10 27 -49 37 28 35 -28 17 -6 -2 -54 18
3457 18 32 -37 -13 12 -26 -16 -14 -18 11 -1 38 -30 -58 -39 18 -50 -12 -42 21 1 21 10 6 -7 -33 -22 -24 -59 -6 28 15 -16
3489 -16 -17 16 -2 46 41 78 -41 7 7 -8 26 -29 17 28 -27 2 -24 2 -19 -71 62 -46 -21 -35 14 -3 -22 -42 -26 -1
3519 -1 13 88 -44 -20 49 -8 24 -46 31 8 3 3 28 -54 -31 14 -19 -23 3 0 -41 22 12 10 45 -12 58 53 1 62 24 -21 16
3552 16 -32 -29 12 -13 -28 -62 3 -6 19 -58 5 -14 42 29 -71 53 6 66 -3 29 30 -20 31 -44 30 51 16 -30 5 22 7
3583 7 11 33 33 -7 -35 -40 -12 -8 31 -25 15 -48 -6 2 1 -6 44 -2 41 -16 -3 45 -16 15 -66 20 -4 -27 -67 -32 -40 3 11 -50 -6
$$ packed form
3357B0k0k5oQ5r2J3M9p8Q4N7j04M9j6l7M1k2QJ0J5k2oKl7M7K2l9rJ9l1J3RJ1m1
3390c1j4R3l2l2lJ0J7KPm7J3K0l4j0Oj4O6l1M0o2M7K1k0Rn5J5Q7n1j8Ok7L4p2
3423f0L6K4o0M7l1L3lK3J2n4O3m3Jk9O6qn4j5O1J2kl3K4J7p6Q6rPo3M5k3Mn2P2
3457A8J4o9K4K5l8J0KmK9j2L9o8k8J9N7o8L8l0O3k0K0j1mj3k6J1kl5N3L4j3l1
3489a6jL3j8M8nL7j19M8%j5L4n5M6J1n5K9k6K6k1n2J33j08K5j4M9j7j9k0J6K5
3519aJ4P5j32K4O9n7L2p0P7k3n%K5q2K3M5l3mK6lm1O3j0kL5n7P0nn2O1l8m5L7
3552A6m8LM1k5j5l4O5rK5p7O3j9N6j3j00J24m7O0o9L2Jn0N1p5P4K1l5m6L5J7j5
3583GMK2%m0k8nK8ML9n6M0o3M2QjpN0m6M3n7J3M8o1L1q1Q6k4k3m0L5qM3Qo1M4
$$ plain form
3618 -6 5 -34 14 23 9 24 5 27 25 -22 27 -17 -11 87 -20 -1 -6 40 14 6 38 27 -6 26 -13 -41 -15 -53 40 -34 -8 -15 -64
3651 -64 -12 -23 11 2 24 -10 13 -17 -20 -27 31 29 38 -15 -37 20 41 -38 -19 -21 -31 -49 27 33 -88 13 71 -75 -7 -23 -26 -36 -30
3684 -30 15 25 -14 -9 -24 16 0 -8 -29 36 -29 -8 47 0 4 -26 34 23 41 -8 22 -24 -12 15 15 14 -13 -56 -1 -24 -49 17 -26
3717 -26 7 43 -8 3 36 76 -15 -42 49 16 -29 16 -18 -10 41 -32 -54 -90 83 6 46 -13 7 -28 -30 -25 -1 13 5 1 -33 -20
3749 -20 -23 13 82 29 -47 19 15 9 45 -25 -4 -6 6 1 -52 -31 -4 -18 23 -29 -2 -25 25 12 2 -8 -7 13 22 -35 69 0 -16
3782 -16 -10 -9 -6 23 15 10 53 10 -27 -24 -19 61 -5 40 29 -44 56 6 14 5 -11 35 -48 66 -29 6 4 -50 25 26 -13 41 43 11 20 10
3818 10 34 3 -21 -34 -14 -8 -11 74 12 -15 26 16 29 61 15 0 33 44 70 -27 22 22 3 -90 -58 -70 -59 -20 11 -17 -28 -32
3850 -32 -23 9 -7 -9 -6 -7 -37 13 36 13 21 11 52 22 10 12 -5 -6 -5 23 26 -40 6 36 -12 -61 28 -20 -32 30 -11 -41 -16 -2 -15
$$ packed form
3618fJ1l9M8Rj4J5j9K2km7M9m4OR8j07J9nM6k6qL2j1l3L2l9k8K6l8R3p4K6pm9
3651f4N2j1L4rK2l4K3l0lpN8kRn3k2N7K1p9J9kj0j8P6Oj21J01N8j46O8j6lj0O
3684c0M5J0l9Nj5M0j6qk1O5o5K1N5m7Ml0O0j1J8m9L0m6J2K7%jk7m3N5k3k5O6m3
3717b6L3L6n1J1L3M0r1k7R1l3m5M5l4QN1p3k2l6J73p7M0n9K0l5kNK4J4qml4J3
3749b0lL6O9n3p6O6moL6p0K1kJ2nn3K1K7j4M1n2K7k3N0j3j0j0JK0Rn7J04o9j6
3782a6OJLK9qnM3m3l7LNQ0o6M5j1p3J00n0Qrj6M6q3J14r5L5kn4P5Jl9N4Kl2Rj0
3818A0K4l1k4j3K0OlQ5o2k7M1j0J3L2m6j5L3J1K6r7M9%j9r3L2j2J1L9L1k8j1m
3850c2RL2j6kLjl0N0K3k3Qj0M1l0j2Kj7jJK8Lo6M6L0m8m9Q9m8j2O2m1l0K5J4j3
$$ plain form
3885 -15 4 -25 11 -21 -2 20 -27 22 4 7 -3 -17 37 -24 22 16 12 27 20 19 8 39 15 21 28 48 21 11 49 34 -15 -18 -13 41 37
3920 37 -26 33 -2 -3 10 -16 -20 19 63 -16 -22 10 -14 -7 47 -86 14 -11 3 85 -56 3 -21 64 0 21 64 -14 17 22 2
3951 2 33 15 28 46 49 -28 -16 34 23 -2 34 -18 -6 -34 -15 32 23 32 60 -26 -6 25 -17 10 -44 2 -20 2 1 3 -6 11 23 17
3985 17 -29 45 -44 16 -10 -19 -8 -66 2 44 -1 -66 -1 10 -10 -32 -18 -38 35 5 52 -13 -14 4 -20 -54 -43 -17 17 10 11 -16
4017 -16 -10 0 15 6 14 4 -3 -13 -25 2 2 -29 -42 -39 47 40 14 26 -1 38 -33 -33 1 -40 -10 -20 28 -34 3 -20 0 27 54 -37
4051 -37 25 -36 -6 19 -37 33 44 78 -17 4 -11 5 -25 -2 -17 -47 -12 48 -14 -10 5 -7 -51 -35 44 -3 29 -3 4 -15 28
4082 28 23 17 47 -19 57 22 -20 -12 -14 47 14 1 30 -39 -5 -13 -42 -29 9 -4 -47 7 35 6 -8 4 12 -2 -10 -54 7 13 15 19 3
4117 3 -19 -43 6 14 9 32 21 15 38 -17 2 49 -7 9 -48 25 55 5 -18 20 -6 0 -25 -43 -10 -47 15 1 14 10 -10 -28 2
$$ packed form
3885a5J9k9L6l2J9K2m7M9j8Lj0j4N4o1M6omJ5pjj1L1k4OPK0k7j0L8j5m9lNN4m
3920C7o3N9l5jJ3k6mL9M4p9oL2k4PN4j33J00k5J4Q2j41N9k4Q5o4K1M3p8L1Nk0
3951BL1j8J3J8Lp7J2N0j1k5L6n2J2k8J9M7rRK8q6K0L1m2K7n4M6k2K2jKrJ7J2o
3985A7m6P4q9O0k6rJ1n8O8M2m5o5O5J1k0k2J4k0P3l0M7o5jJ8k4l4J1K6L4pJk7
4017a6OJ0J5rQj0pj0j2K7%l1j3LQ6pk6J2k7L9p1%L4m1L0j0M8o2L7k3K0K7K7r1
4051c7O2o1L0K5n6P0J1L4r5K1j5J6l0K3j5l0L5O0o2MJ5j2m4J6P9m7L2l2Pj9M3
4082B8noL0o6P6l5m2QkO1l3j3K9o9L4qk9J3L8j3m3N4K8k9j4J2Qj4qm4O1OKMj6
4117Ck2k4M9QnK3j1oK3n5J9M7n6J6n7P3L0n0k3L8k6Ok5j8L3l7O2j4J3mk0j8L0
$$ plain form
4150 2 -1 80 26 -34 -5 23 -57 13 -8 -18 18 20 -20 31 31 20 45 23 47 -21 -72 37 16 66 15 -20 -6 -20 -29 1 -21 -12 3
4183 3 3 1 -27 16 2 -37 -7 -24 -82 -14 2 -23 -19 35 0 -7 -11 26 -27 0 9 9 -36 -47 -24 15 45 33 29 -14 -3 0 -18 38 25
4218 25 -20 41 -22 -2 -10 30 -39 -25 45 21 -33 30 21 -17 -9 -22 24 -4 -83 -20 9 -21 28 20 20 -46 -17 20 51 -13 40 31 43
4251 43 14 -22 12 22 -3 26 6 11 -22 -19 -32 22 -23 -16 1 -26 -59 0 -26 -12 -21 25 5 -25 -14 40 9 5 -11 -47 43 21 21
4284 21 37 10 9 -24 -40 -3 -27 58 -43 12 40 10 5 21 11 13 26 17 18 40 -3 -1 10 13 25 -45 5 -29 -54 6 -34 46 -36
4317 -36 29 13 10 7 -26 -46 12 -15 32 -33 -14 34 -69 -6 14 4 -27 -10 34 64 28 -28 12 -23 14 -29 -8 -23 -4 16 -59
4348 -59 37 36 33 -50 -33 -67 -23 -1 14 -10 -44 1 46 -39 -7 105 -15 -33 -29 50 -33 -29 -36 -13 44 -5 -32 -41 -16 12 37 42 -8
4381 -8 2 -19 -41 9 59 16 35 34 -27 2 11 -22 -32 -34 -13 -13 19 8 -18 32 -1 -30 18 -17 -27 -7 -5 65 26 -30 26 38 51
$$ packed form
4150BlQ1n4o0K9K8q0P0k1j0L6Km0N1%j1K5k2K4o8n1J09k1N0n1l5J4j4rL0k2RJ5
4183C%kk8M3j4l9L0j7n8O8J6k5MN4l5pmL7n3K7R%m5j1K3L9L0j2mm3J1Lj8N6j3
4218B5m5O1o3K0qM0o9J4P0k4n4O3rl8Qj3M6k8p9O3K9l0M9q%o6K9L7L1o4N3rJ2
4251D3k9l6L4J0k5K9k0Nl3Lj3N4m5PJ7k7l3N9k6J4rM6k0l0J1N4l1mj6l6R0k2%
4284B1J6k7jl3j6L7k4Q5j01N5K8l0nJ6j0KJ3rJK2m3KJ1LJ2p0N0l4k5O0m0Q0q2
4317c6O5j6lll3k0N8k7M7o5J9M8j03O3K0j0l1J7M4L0l6n6M0l5L7m3K1j5J9K0p5
4348e9R6jlq3J7l4M4K2J5k4l4M5M5q5L2J12j20j8MP9q3MpK3N7m9k7rK5K8K5Nn0
4381hJ0k1k2N0N0m3J9jo1K9Rl3j0kK1%L2j1k6N0l3k9M8l5j0K0KP0l9n6N6J2J3
$$ plain form
4414 51 -31 -13 77 -45 -25 -4 52 31 -15 36 -6 -22 33 -1 9 20 -3 -20 14 -11 -5 -29 -6 -27 -33 -4 -34 -13 -12 7 47
4445 47 -38 2 51 8 -40 -24 2 -49 -41 -26 -14 -11 -23 14 3 -7 -36 -48 26 27 54 28 -77 -23 -8 -23 -11 -11 7 -33 4 20
4477 20 -24 28 -12 4 -27 8 -2 27 -22 34 -15 15 33 -26 -16 21 16 18 -45 -31 -21 -34 15 13 3 31 -54 8 18 13 12 -12 -14
4510 -14 12 99 31 -26 1 -35 -26 42 -14 9 17 -12 -11 -54 1 39 6 37 -30 -3 -41 -27 12 -35 11 20 37 14 20 -35 59 1 -25
4543 -25 12 66 8 26 30 25 9 44 -21 32 -16 -3 16 -40 31 -11 36 7 10 1 -3 14 41 -27 -43 -35 -16 -12 -4 -26 50 -7 31 -7
4577 -7 10 15 -41 -67 30 -6 47 1 17 58 15 0 17 32 5 55 35 2 -37 25 -13 -27 74 -39 16 41 -31 -7 -82 16
4607 16 -26 18 66 -40 32 9 -60 46 -4 56 26 42 -60 -13 8 45 13 30 -2 53 18 30 -20 -53 -25 -11 -19 4 0 49
4637 49 -18 24 -7 -34 -8 44 27 -50 33 -12 31 17 -42 5 -35 11 -38 -9 16 -31 37 -14 -5 8 -13 56 -44 -31 23 -23
$$ packed form
4414E1q2J8R0j22K0K1N6k1m6N1m2j6N5l4J0J1k3j7L4k5Ok4K3k1oK9l0K1JJ9M0
4445D7q5M0M9m3m8J6K6n1QJ5J2Lj2L7j1j0k9j2P4JK7k6j05N4J5j5J2%J8m0L7J6
4477B0m4N2m0J6l1L5j0K9m9N6m9L0J8n9J0L7nKo3J4J0j3M9kj0K8q5O2J0njk4k
4510a4K6Q7o8n7K7l6RO8n6K3Qk9Jm3N5L8l3L1o7K7l8J4L9m7M6RJ7k3On5R4n8k6
4543b5L7N4n8J8Mnj6L5o5N3m8J3J9n6P1m2M7k9LrmJ7K7o8j6QJ9MQk2P6n7L8l8
4577gJ7Nn6k6R7l6N3m6J6M1m3j5J7J5k7N0k0l3l9O2l8j4J01j13N5K5p2K4p5R8
4607A6m2M4M8j06P2k3o9J06n0O0l0J6j02M7K1L7l2J7l2N5l5J2n0l3K8J4qK3mM9
4637D9o7M2l1k7K6N2j7p7Q3m5M3j4n9M7m0M6m9K9K5m7O8n1RJ3k1O9j00J3N4m6
$$ plain form
4667 -23 34 34 -26 -68 18 38 -12 73 30 29 -14 -22 15 5 21 3 22 5 -13 7 41 -24 -40 -29 4 -21 -20 12 27 -5 7 -79
4699 -79 0 -32 -25 12 -55 35 10 28 30 -15 11 -2 -61 14 -4 18 10 -5 75 -27 -3 -38 13 32 -25 72 -8 5 0 9 33 29 10
4732 10 -54 -25 74 -15 -28 14 -23 -23 -38 48 -14 -26 0 5 60 -11 -28 -11 62 -1 -14 20 31 19 3 37 48 28 14 39 0
4763 0 84 -22 16 -48 -1 11 -22 -12 -18 8 20 8 38 -29 -8 12 5 6 22 -13 -16 -18 10 5 -30 23 22 6 -2 12 -14 27 38 62
4797 62 59 3 -21 3 1 49 -8 17 37 -12 -29 -9 -2 -4 15 -38 -12 -20 6 -20 -18 -27 70 64 58 3 -39 -33 -15 51 -51 38 -21 10 -1
4832 -1 0 -4 7 -14 -38 -28 17 -5 -8 -26 -6 -58 -10 20 0 1 2 47 -66 -18 -5 19 39 -115 15 2 -7 -2 -13 -13 -44 8 1 7
4866 7 -75 5 27 10 15 -12 19 -34 42 25 -4 37 -1 -9 -53 -19 22 28 8 -3 -47 40 39 18 -20 1 8 1 -25 -11 -34 12 11 -6
4900 -6 11 11 15 -35 -50 -45 11 3 40 14 15 -13 -11 74 -7 -10 16 -77 -39 -2 -35 21 24 36 -24 24 43 10 2 -9 21 17 35 2 1 0 -37
$$ packed form
4667b3N7%o0m2Q6K0n0Q5m3jm3qL7j0J6j8J9j7j8K0L4o5j6J1L3k5JL2J5l2J2q6
4699g9P9l2PL7o7R0k5J8Km5K6j3n9P5j8K2qj5Q0j02K4l5N1J9n7R7q0J3nRK4mj9
4732A0o4K9R9q9j3M2l7%j5Q6o2j2K6NN5p1j7J7P3o3j3L4J1j2j6L4J1k0j4K5l9
4763@Q4j06L8o4M7J2l3J0oK6J2j2L0o7K1K0pJJ6l5lkK8nl5N3jj6qJ4k6M1J1K4
4797F2ln6k4K4kM8n7K5K0m9j7K0PkJ9n3K6qK6k6KrR7oon5m2OJ8O6j02Q9n9L1j1
4832aJmJ1k1k4J0M5k2lj8K0n2M8L0k0JJM5j13M8J3K4K0j54J30j3rNj1%l1N2pO
4866Gq2Q0K2j7Nk7L1n3P6j7k9M1l8qm4L4M1Ok0j1m4Q7jk1l8K1Ppk6J4k3M6jj7
4900fJ7%Mn0j5NN6qL7k6Jk8KQ5q1lK6r3L8L7l3N6LJ2o0M8J9l3qj1L0mJ8l3jjl7
$$ plain form
4937 -37 23 -23 -40 40 0 29 -17 46 8 0 -43 57 28 33 3 -26 1 22 47 -9 -2 -9 -6 -22 -31 0 52 40 0 -18 -2 -15 14
4970 14 58 28 -10 21 33 27 63 -11 11 0 0 54 -20 16 21 -1 2 -82 -25 27 -18 -38 -20 -5 -65 23 43 14 -35 -13 -3 -29
5002 -29 44 -5 9 -5 24 0 23 -26 28 34 6 -20 0 -18 32 -15 -35 -47 -65 -39 62 -28 53 37 -33 -21 47 -4 -37 -4
5032 -4 -49 12 9 29 -25 31 9 -15 10 0 63 -16 5 49 83 1 22 12 -25 -12 8 -3 14 14 44 18 55 -30 5 52 25 40
5064 40 10 38 27 9 -4 -29 -32 -30 1 0 50 -6 -7 -41 -26 -30 -19 -27 -28 -34 5 -47 1 41 -34 50 1 -49 -33 -11 -61 20 3 7 -14
5099 -14 -17 -9 56 33 71 -32 -24 17 -43 -15 0 -8 9 -5 -22 22 -13 -8 -4 -25 8 -8 -5 -32 -52 1 -27 -61 22 -25 1 -13 33
5132 33 16 -13 20 -19 -8 -3 26 -37 -18 22 -17 60 -6 49 66 24 -14 -22 19 -53 3 -38 -1 -32 38 46 37 -19 -18 9 -54 -55 3
5165 3 21 -28 -3 -10 5 -1 -4 -43 54 -18 33 -8 -13 26 -44 -4 12 -1 4 10 12 -18 3 -6 43 8 24 -1 -12 -33 -26 14 -31 34 31 -8
$$ packed form
4937c7O0m6j7Q0m0K9m6O3l8qm3J00k9Nl0k9K7K1K5n6PpLj6rL1N2j2m0j8J6j3K9
4970A4M4l0l8L1J2oL6p4K2j1%N4p4L6Nk2Lq4N7N2m5k0J8J5o0Q8K0k9m9K2J0k6
5002b9P3m9J4j4K9k4K3m9N4Ok8k6K0j8N0m7k0j2j8K6J01r0Q1j6p0J2O8n1l3L3
5032dm5O1lK0n4N6k2k4K5j0O3p9K1M4L4q2K1j0l7J3K0j1J7%L0k6L7q5L5M7k7J5
5064D0l0K8j1j8j3k5lKL1jN0n6jl4J5mJ1qjoL9n2M8M0p5Q4m9n0J6K2n0Q1j7Mk1
5099a4lQO5k3L8j03QM1o0K8J5qJ7j4j7M4l5NMk1L3j6Lk7k0N3k8l4Q3m7K6j4M6
5132C3j7k9L3l9J1NK9o3J9M0l9P7o6N5J7m2l8qM1p2N6m1L7l1P0Qrn6JK7o3jN8
5165CJ8m9K5pJ5oll9R7p2N1m1nL9p0M0J6j3NOKl0K1rM9l5J6k5j1k1PM0m5O5ll9
$$ plain form
5201 -8 77 -5 -13 -17 16 1 -42 -14 -52 -34 3 38 -13 -8 -16 6 21 29 80 5 -31 -37 -10 36 40 47 -77 -21 31 -21 3 6 -17 3 38
5236 38 -57 -22 22 27 -40 -40 29 21 -43 6 22 16 0 42 11 -14 38 32 -26 -8 42 -42 8 7 -8 -14 27 9 41 24 -29 12 15 -21
5270 -21 -11 27 -52 4 19 -24 -5 -50 -11 19 17 45 16 8 -23 -18 -9 -92 15 16 2 15 23 25 -3 1 -13 -17 25 -1 23 -40 5 9 17
5305 17 35 29 -36 -10 37 -8 34 29 -15 23 37 -16 -13 4 39 9 62 63 -1 26 6 -7 28 7 12 -14 -9 -31 10 -3 71 31 14
5338 14 56 -26 20 4 30 49 30 -22 5 -29 4 12 37 -25 -75 17 -17 -41 6 26 -25 9 -46 32 -24 31 5 -28 3 26 -1
5369 -1 35 -30 1 -22 -14 39 -14 18 -15 -16 16 3 -16 51 -15 37 40 47 -21 48 54 41 36 -8 29 0 10 -30 -1 41 -21 8 -2 37
5403 37 21 14 -30 15 52 -20 -32 -2 -26 -30 -54 21 7 3 -34 -1 -27 10 9 -16 54 -2 21 2 50 20 38 -33 22 7 83 8
5435 8 -11 -2 -8 13 2 33 -72 -11 -23 -55 4 30 9 -22 24 20 -23 24 49 -20 -8 18 16 24 -5 65 -22 -24 8 39 -10 44 2
$$ packed form
5201hQ5q2qmL3j5m3K8l8J8L7L5n1NqK2J5QN1p5l6oK7M6MPj24N6N2n2K4Lk3K0L5
5236C8r5L5M4No7%O9qo4M9J6oj6M2l1k5N2on8J8N0q4N0jj5oM1j8L2j7n3M1Ll6
5270b1J0L8p9N6J5m3J9m5L9L0kK8k9ql1NRq3J07Jj4J3QKk8Mj4mM2k6K4o3M5MQ
5305A7J8oo5K6M7m5M2nm4L8J4n3LJ7L5l0N3Jo4K7k0j3L5k1Nk6Nk2M1j3P4m0j7
5338A4M2q2M6j6K6J9j9n2K7l4L3QK5o2n0R2l4k4M7K0n1L4n5P8n6N5k6l3L1K3k7
5369aL6o5L1k3QN3n3L2l3jL2j3j9O7o6N2LPo8O9Oj3nm4L7k9J0m0K9M2o2K9j0L9
5403C7j6pm4M5L7p2j2L0k4mk4P5j4ml7L3k6L7jk5P0n6K3j9M8l0J8p1N5j5P6p5
5435Hj9RoK1j1L1j05O1j2l2N9K6k1l1M6mm3M7K5o9J2K6kQk9P0q7kL2L1m9N4m2
$$ plain form
5468 2 23 78 66 -33 -6 2 -44 41 22 49 28 48 32 -49 6 -35 29 6 35 31 -4 29 -38 100 26 6 0 -51 -2 -29 -11 60
5500 60 -9 -39 12 -10 72 12 36 -10 22 13 -20 -14 68 43 -42 68 -38 52 11 -32 19 13 49 0 -16 40 18 51 22 -54 -27
5531 -27 48 0 20 -11 44 -30 -40 5 31 -35 44 7 0 -30 43 -11 19 19 -47 -2 44 -44 29 21 -20 62 6 34 -27 66 -7 38
5563 38 5 23 -20 7 -59 -8 -10 31 -7 26 31 24 5 20 44 1 5 -64 -38 -4 20 -42 21 20 13 20 12 -1 48 10 12 12 5 -27 4 55
5599 55 -4 31 4 43 -6 -10 17 -18 29 -6 33 -6 -18 -10 -24 24 53 32 -94 35 4 -15 19 10 18 35 16 43 49 17 28 -10
5631 -10 -11 -10 -23 17 27 -7 -15 -15 0 -21 21 -6 1 9 4 -38 -47 -19 69 39 -2 19 5 8 -1 -2 -4 17 -50 -19 0 -87 -50 3 4 8 -45
5668 -45 -22 -19 -12 -4 -7 18 -21 19 18 11 -3 -28 12 18 42 54 0 -52 -30 -17 6 58 -13 19 29 -17 -10 -22 -6 17 -28 18 -29 -26 -18
5703 -18 24 -41 -11 2 -29 -35 6 71 28 43 37 -11 -13 -4 -22 19 -14 -4 -52 -27 40 20 60 -32 46 -16 -45 20 12 40 -10 0 9
$$ packed form
5468BK1N5j2r9K7Qm6Q5j9K7k1K0j6q1N5m1O4k3K9ml5L3o7J38p4k0on1M9k7J8P1
5500F0o9l0N1k2Q2o0K4m6L2rl3OQ2k5q5J10j06R0m1m3N1oL6m9j6N6k2L3k9p6K7
5531b7P5m8K0l1N5p4j0M5K6o6P9l7pl0P3n4L0%o6M5M6q8P3qm1Q2n6K8o1R3p3M5
5563C8l3J8m3K7o6N1kM1l8L3Npj9J5K4m3Mo9K6L4K4o2O3jpPqj3M9l8K%pl2L1N1
5599E5n9L5k7L9m9mK7l5M7l5L9l9j2Qj4M8K9k1j26J29l1j9L4rQJ7j9K7Ol2J1l8
5631a0jJj3M0J0l4q%J5k1M2k7PQnm2rK8Q8l0m1K1j4LrjkK1o7L1J9q7L7N3JMn3
5668d5K3LPQlK5l9M0jpj4k5M0OK4J2n4n2K2J3K3N2p1L2J0m6Pj2J6K3m5M6m7LQ
5703a8M2o5L0J3l1oM1O5m3J5om8kRj8M1l3J0m8K5O7k0M0r2P8o2k9O5qK8n0J0R
$$ plain form
5736 9 10 -12 -23 1 23 22 30 7 -37 -10 -27 -50 -3 26 4 24 -24 -20 2 14 7 -7 1 -4 -1 9 78 39 4 28 0 19 51 -11 -22
5771 -22 -6 -34 20 -81 21 -48 -106 53 -43 6 -19 36 -48 6 -23 -12 5 -1 25 15 22 -16 -22 -21 37 -58 -33 24 55 13 -22
5802 -22 47 -58 5 7 20 -16 18 19 -1 7 30 -38 -9 -39 -28 15 -31 4 -17 20 6 -9 16 -7 -28 -8 42 -4 -44 -1 31
5833 31 -94 4 16 -31 18 6 62 14 -28 15 44 9 33 -53 -26 6 42 -72 28 -32 1 24 -33 13 15 -29 56 -33 -24 36
5863 36 41 -31 -54 9 -39 24 -36 46 -2 6 -21 52 -18 13 -88 -44 30 -28 -12 -5 -11 11 34 -1 -12 -15 67 -12 53 -6 -6 0 29
5896 29 61 1 -16 -40 21 15 35 11 6 -15 90 -26 -45 -19 12 12 -34 32 -4 27 -46 16 -9 -84 11 41 1 -4 6 64 -4
5927 -4 33 17 -1 -14 25 -6 5 -7 18 -19 -16 38 -20 65 49 13 25 -6 -8 2 -4 -12 33 -3 -20 13 -34 16 38 10 18 4 -7
5960 -7 37 10 -58 20 -25 19 -42 -28 -14 18 1 -11 19 0 53 -46 5 0 57 26 14 -9 -6 11 -21 37 27 -13 -18 46 33 12
$$ packed form
5736IJk2j1K4K2jQk3m4K7j7k3M7K9k2K0m8MK2J2pj4QnLJ0O9l9l5K4k8J9L2o2j1
5771b2J6k8N4j01J02o9n8J59r6M9k5N5q4N4k9J1J7oK6j0Pl8oJN8r5K5N7L1m2l5
5802b2O9j05O3KJ3l6L4Jk0QK3o8K9l0J1M3m6L5k1L7j4j5K5k3k1K0N0m6m0M3L2
5833C1j25R8J2m7M9j2N6m8m2M3K9l5K4q6K7L2L6j14J00o0L3K3n7M6Km4Q5q9RO0
5863C6Np2k3O3m8O3o0Q2m8Qk7P3p0L1j01M4P4n8J6PoK2K3l5j1lQ2p9O5n9%OK9
5896B9L2o0j7k4O1oK0k4nk1J05j16j9K6L1%m6O6l6L1p3O2k5p5R5L0m0nJ0N8o8
5927dL7j6j8j3L9l1J1j2K5l7LN4n8Q5j6l6J2l1kJ0oqM5l6j7L3m7N0K2k8Qj4j1
5960gM4k7o8P8m5M4o1J4J4L2j7j2L0j9N3r9N1nN7l1j2k3LJ7l2N8j0m0nO4j3k1
$$ plain form
5992 12 -39 -16 -58 -53 -11 24 17 -77 92 -16 -32 13 17 27 21 8 -9 25 -73 24 -15 38 -54 4 24 -30 13 10 5 -21 -35 40
6024 40 -22 -8 -5 -43 -13 -35 2 -7 -14 18 -37 7 -73 -13 -65 -12 6 4 16 11 -7 -17 -30 -8 -13 -71 2 13 -31 -26 -64 -16 -36 34
6058 34 21 0 -1 -59 22 -12 -18 31 -27 16 -3 -39 -49 27 -87 0 48 -20 50 -11 -12 30 -52 -1 -2 -24 -19 -39 -20 -9 13 -25
6090 -25 46 -83 -46 -66 17 21 28 19 32 -3 32 -39 19 11 -38 -10 22 -49 18 -4 14 27 -20 -19 32 2 -28 -47 -40 41 24 19 -6
6123 -6 -35 -43 16 -59 22 53 6 0 46 -27 4 19 -40 -19 37 9 53 -2 43 8 -17 82 40 -10 13 12 8 -30 -37 -2 -16 25 -17
6156 -17 11 12 23 40 52 42 13 -45 -25 -6 18 -63 -30 21 5 34 -20 -39 -47 -29 64 -21 18 11 -53 38 -6 -13 18 34 -18 -15 9
6189 9 -49 -20 -1 -2 5 30 -30 -43 22 -8 -25 -4 -23 -22 28 -33 -51 -13 -37 -36 25 -7 9 47 -40 0 44 -3 1 16 9 -2 67 -2
6223 -2 -25 0 24 -5 12 15 -3 -9 -8 2 -7 16 -15 7 5 5 -4 19 14 27 -15 -28 -6 7 -37 1 -32 -56 16 41 -31 37 -23 55 24
$$ packed form
5992A2n1K3m2NM2L5pr4J69j08j6M5MJ0oj3j7L4r8R7l9N3r2N8K0n4M3lnk6j4P5
6024D0o2J4Ll8L0k2L7rpL2n5M4q0O0n2N3J8kJ2nj8j0j3K2nn8P3J1m4Nl8M8k0P0
6058C4j3k1jn8Q1l4oM9n8M3j9l6j0P6j14Q7M8o8P0o1jM2q2N1jk2Nk0J9J1K2l8
6090b5P1j29L7k0Q3MPrJ3l5L5p1N8qm9K8L2p1O7k2J8J3m7JN1l0l0j9PQ1j7nk5
6123fk9qN9p5Q1L1m7oM6p3L1J5n9K1N6k8M4n5M5l5k5R9m2n0K3jml8pL5j4M1m2
6156a7K8JJ1J7J2j0k9n8K0J9K4q1L3N1j6K9n4j9qJ8R3q5L9po4R1m4pL1J6n2LK4
6189In8K9J9jPK5o0j3O5l0j7K1j9JN0o1j8L8k4JO1l2J6L8q7M0M4m7MJ5pj1O9o9
6223bk3K5K4k9J7Lj8oJJ0rK3l1K2k%rK3nJ3m2j3K2J3m4L8l3k4P2K5p2O8o0P8l1
$$ plain form
6258 24 4 -8 1 -35 22 -40 53 35 6 21 -44 19 30 3 -7 28 29 -9 26 3 40 -24 -8 -14 -42 13 -36 17 -31 35 10 -2
6290 -2 22 53 -76 -7 -29 -20 13 11 -2 1 54 -4 -18 -21 -22 -14 -69 -13 21 -7 48 -30 49 -17 -3 33 -27 -1 -22 19 4 30 -39
6323 -39 13 2 6 -51 29 13 48 -39 2 5 46 14 64 -15 -22 12 -11 25 10 37 9 -39 -29 27 -15 -3 4 16 31 23 -15 27 72
6356 72 37 13 -1 33 24 37 -14 -51 22 10 41 -18 31 -4 14 -24 -3 -5 34 -8 -33 -2 -23 7 19 5 -46 23 -5 -12 24 -27
6388 -27 -40 8 13 49 41 -10 30 3 40 -15 25 14 37 -56 -22 40 -13 -6 41 64 19 50 42 33 -51 -39 37 19 -39 -5 9 10 -59
6421 -59 0 50 19 -19 2 -23 -12 29 17 1 48 3 5 8 -1 -36 17 -14 34 -20 0 -31 31 51 -4 -4 11 -10 0 29 34 12 -8
6454 -8 98 7 -1 44 45 30 -4 -23 -17 -14 -54 -77 37 14 10 36 14 -39 -4 -8 52 15 12 66 -3 17 -18 -63 -6 -18 -33 23 84
6487 84 4 32 -17 18 20 42 -1 -63 45 9 -32 -43 13 -28 14 13 -10 -14 20 52 -23 16 78 21 18 30 -29 -24 49 -40 -3 -4 5
$$ packed form
6258B4k0j2Rl6N7o2R3j8k9J5o5O3J1k7j0L5Jl8L5k3L7o4J6ok8N5m9N3m8O6k5j2
6290bK4L1j29O9k2RL3kj3LN3n8j4ljQn5N6L4k8N5p8P9o6J4L6o0K6k1M1j5K6o9
6323c9N2j1Mn7Q0j6L5q7M1LM1l2N0p9pL4k3L6j5K7k8m8J0N6m2J2PJ2J5ql8M2M5
6356G2l5k4j4L4rJ3n1l7P3j2L1n9M9l5J8l8K1kL9m2k5L1k1L0J2j4n1O9k8pL6n1
6388b7j3M8NL6qn1M0k7L7n5M0j1K3r3L4O2n3PM7K3m5L1qrq4J2P6j8n8L4J4Jo9
6421e9N9N0l1l8K1k5J1M1j2j6M7m5KLrl5N3l1M8n4K0l1O2K0n5%J5k1J0K9Nk2k0
6454hJ06r1qM5Jj5l4j9OLm0k3J14k3mK6k2n3L5mO0l7lN4o9K0l5m5N7j2j5N6O1
6487H4q0K8m9L5KK2m3o2J08l6m1j1N6m1M2jk3mL4L2p5L9O2n7lJ2n9NP3q9L7jR
$$ plain form
6520 5 -58 30 57 -4 -20 -81 46 3 -18 7 51 43 11 -37 18 -7 16 11 10 -41 12 -17 -9 -37 -33 -7 3 -80 -3 -36 -21 -6 21
6553 21 -15 44 6 28 7 -7 -33 36 17 -12 -18 33 17 -37 -42 8 4 7 29 29 19 26 13 5 -27 -38 4 34 -14 -26 23 -53 -51 6
6587 6 -9 59 -63 0 23 23 -1 -6 -3 -14 -13 -63 -51 35 -20 -18 12 -19 -6 -7 4 -43 -6 50 -11 38 8 -32 32 -31 -39 34 6 22
6621 22 33 -22 -9 -59 9 -38 -17 -53 -9 -10 -6 -55 -8 -40 -27 52 6 -15 24 16 5 -19 -58 -7 -24 -8 29 4 18 -19 -41 29
6653 29 90 -16 29 9 -39 20 -48 67 -33 -25 12 5 -45 -24 -11 -41 28 -36 -35 9 14 0 -12 -4 27 -52 11 43 7 -16 -13 -30
6685 -30 -36 -7 6 -18 -9 -14 49 -21 -45 -21 -31 -16 -13 -20 4 14 -42 -9 5 -10 16 22 -6 -4 13 -24 20 -13 15 8 -61 3 -7 -24
6719 -24 1 0 38 -38 4 -23 -59 67 -3 6 -15 -9 -49 -30 25 -15 -13 17 42 49 -82 88 -37 -15 8 -45 -52 34 -10 -17 -2 -17
6751 -17 -23 49 -12 33 -31 -68 2 54 28 -37 16 -47 -10 -37 38 8 -45 -17 -26 31 -11 7 4 -15 15 30 -14 -50 32 -5 -1 31
$$ packed form
6520Eo3Q8K7o1j6o1J27m3k1K5M4ql2m8N5k5K3njn1N3k9Qk8MK6J0q3P7l3J5J5K7
6553B1l6N9l8K2k1j4k6O9j9k9oN1j6n4nN0mLK2%j0Pj3ql2j1M2L0m8j2M9p6KN7
6587Fj5O8j22O3K3%k4nLj1Jn0J2Q6n5KL0l1J3jJ1m7L7N6o1M9l0m0O4o3qP3k8J6
6621B2J1n5J3n0O8m7K1l6M4jMm9M7l2J3P9m6k1L9qj1k4l9N1j7J6L7k5J4l7k2P0
6653B9O1j06M5k0m8N9o8J15j00QL7pn0K1J3l0O9o4JM4Nj4j2QL1p9O3L2l6k3Lj7
6685c0oK9J3k4RnO3p0k4K4j0J5LpK4J0n6L3J4j5K6Ok8KJ7l7M4l3K8po9O4j0j7
6719b4K5jL8p6M2k7l6J26p0Rk1Om0J9N5m0KL0K5Pj31J70j25K2K3n3pQ6m4pJ5j5
6751a7oP2o1M5o4l7P0N2k6o5N3o3L7k7P5l0n3K8rN7m2J8lj9L0J5m4l6Q2l7ML2
$$ plain form
6783 31 15 -36 9 7 -13 23 -43 -24 4 47 -34 42 70 8 -34 24 -55 30 -13 -12 -31 0 -42 29 -10 -13 22 -42 66 25 39
6814 39 16 72 -13 14 -18 13 39 -11 51 36 34 20 -18 -17 10 -45 45 -75 -2 22 -37 3 -23 20 12 -4 12 23 -18 1 -1 -13
6846 -13 14 -6 -29 -8 26 -2 14 -11 -7 20 -23 29 13 26 -40 -32 8 -24 -61 -2 2 59 -22 -34 -35 26 25 10 14 -28 -10 12 -7
6879 -7 -8 16 -11 -19 -13 -3 41 -19 -56 35 -43 -27 54 -18 4 -1 -4 -6 10 13 42 49 50 22 -15 -33 -26 -12 10 32 -3 -46 -59 -26 -31 32
6915 32 23 -2 -9 9 12 24 14 -50 6 9 -36 -19 -21 38 56 40 -13 -20 49 -44 0 -37 53 63 -5 -8 -27 -11 -26 -83 18 30 59
6948 59 -14 48 4 46 6 -4 16 37 -14 -45 -4 -3 -15 -6 -56 -32 10 5 -11 14 -12 -17 -29 -99 -28 69 6 -63 -5 16 0 -17
6980 -17 4 3 -3 -14 38 51 -31 13 4 31 -27 18 -2 -10 -4 25 -9 -18 21 21 -11 18 42 17 -11 17 -8 12 7 7 32 -12 7 45 11
7015 11 5 -2 -54 36 30 -5 46 -6 30 3 31 27 -47 9 2 -11 21 -26 -18 -16 32 14 36 21 4 -17 17 -19 -17 21 -29 11 -34 -27 -30
$$ packed form
6783C1j6n1M5kk0L6o6J9K8M3q1P6K8o2m2N8p9Q5m3Jj9L1m2P1l9lL5o4J08m1J4
6814C9k3N6q5K7l2L1K6n0O2j5kj4l8JK7n5R0j20P3K4n9M0k6M3qj6J6J1m1J9kj2
6846a3K7k0k3K1L4k8J6k5MK7m3N2j6J3o6QM0l2l7N9MN7q1j2jO1jj5Mm2J8K2j9
6879gjK4k7qOJ0M4o0l7R1p8J6Q1p2K2nlkJ6LK9PJk8l7j8PJ4K2K2l5m3j3L3nO3
6915C2rk5pJ8LJ2j0o4N6Lm5J7kN9J8j6n3pO9r3M4l7R0J0o8lj9J6j5n7J01J2K9
6948E9p3O2m4M2m0j0K0K1n1l1M1Jj2Rn0K4M2nj6K5k6nj2p0P1R7o3o9N8K1j6j7
6980a7K1joj1N2J3q2M4rK7n8M5k0qOK9l4rL9%l2K9K4k5k8K8k5K0n%K5m4J9L8l4
7015A1opn2R0ol5N1n2L6k7K8mp4N6pj3L2m7QKM8j8K2j5j7k1L4l6KL8n0M0m5Pl
$$ plain form
7050 -30 -52 -22 38 -33 15 -6 -52 -16 -16 37 -3 65 26 14 20 60 -6 6 11 27 -31 -40 -58 -21 -21 79 -34 -22 39 -19 -7 35
7082 35 -48 15 35 -65 -22 11 -2 -1 -16 -65 -1 14 36 -41 21 -6 3 78 10 24 -26 -21 -33 -45 46 -41 56 67 -18 3 -14
7113 -14 13 41 -12 23 20 2 34 -52 54 -44 -79 47 24 2 -2 -4 -14 16 -26 43 -15 -4 5 4 22 -23 -19 -7 19 8 29 -40
7145 -40 12 -24 -8 -27 20 0 -33 35 -33 21 18 24 49 12 1 -15 -9 -17 -22 -34 -5 8 8 42 58 9 59 35 41 -10 -48 -9 -33 -22
7179 -22 24 -10 73 -55 -18 -27 5 36 31 -5 -42 -21 21 -12 9 28 60 -74 -16 -13 -14 18 -20 7 40 51 -5 -29 -28 44 -51 -69
7211 -69 -25 6 -5 -25 -57 -5 -48 26 32 -27 11 29 -28 -62 24 -11 21 -30 -31 31 -15 2 12 10 -7 -4 9 7 -13 -31 23 60 -38
7244 -38 15 -28 -7 24 -43 -62 32 -12 -17 10 9 12 70 27 51 30 -22 15 -31 16 -2 19 -11 16 -11 -60 -15 25 -19 -31 4 35
7276 35 22 -10 -8 -14 -39 -24 0 10 70 11 10 -39 22 57 28 7 -56 -17 -15 20 79 -14 -15 15 4 33 -30 -15 -28 2 3 12 -4 2
$$ packed form
7050c0k2L0O0p1M8k1m6L6%N3m0O8l9j2OM0o6J2NJ6n8rj8L7%J00j13J2O1n8J2M2
7082C5q3O3K0j00M3L3j3Jj5m9O4J5K2p7O2k7RP5o8J4n0Nj2j2R1q7R7J1q5K1j7
7113a4K7K8n3L5lj8L2q6J06r8l5J26k3k2mkj0L0m2O9n8J1RjJ8m5MJ2K6j1K1o9
7145d0N2l6J6j9M7k0l3O8o8N4lOK5l7j1j6Oqnj2K9J3%L4J6m9N0k4On1l8L9k4J1
7179b2M6l4Q3j28L7rL2L1nl6l7K1M2l3K1J9L2j34N8LjL2l8K7L3J1n6k4JP2r5j8
7211f9M4L1j1k0l2N2m3P4On9L8J8n7l4Q6l5L2n1jO2m6J7J0kj7LJ3kk0j8N4L7r8
7244c8N3m3K1L1o7j9R4m4nK7jLN8m3K4k1n2L7m6M7j8K1l0K7k7m9M5M0m4j2L5L1
7276C5j3l2Kok5J5K4J0O0n9jm9O1L5k9k1o3L9KL5N9r3jL0j1K9o3J5j3L0JRj6O
$$ plain form
7310 2 29 -13 2 1 -8 -23 -34 6 -56 14 -28 13 -25 -18 46 -26 -18 44 25 3 12 4 4 6 -11 -52 22 16 11 26 11 3 -35 0 -17 -41
7346 -41 43 -20 11 -16 3 -10 -24 -74 -20 -33 -40 -20 27 -4 34 -15 -13 33 -24 13 37 26 8 -14 9 -14 6 5 -12 -9 67 4
7378 4 4 -27 -22 -30 -43 35 -9 -26 -5 -32 -27 2 -19 15 -34 23 -26 -11 -20 2 11 -25 -27 17 -3 -49 14 -5 -16 -34 -8 12 39 -47
7412 -47 4 -47 51 -19 29 -43 12 7 1 -28 -18 15 -90 -12 -43 -28 17 -23 22 -8 -44 -46 7 2 4 -12 -37 -30 21 38 -59 -21 27
7445 27 -25 -11 -12 -58 -1 -42 7 3 26 34 -47 -39 -7 29 41 18 -29 9 15 -26 -3 -9 23 13 -5 31 -22 45 -20 -1 -7 -13 4 -69
7479 -69 1 2 4 26 -19 -46 27 41 10 -3 -24 -26 -12 -24 23 38 17 -12 -16 23 -31 7 -11 37 -20 84 -19 28 -32 13 6 74
7511 74 -9 0 57 13 14 -54 -21 -39 61 39 -32 -26 -28 23 -8 1 13 39 10 -10 26 4 20 -26 36 -11 44 38 37 33 0 -12 11 32
7545 32 6 -32 -10 -14 -34 -14 -17 38 -10 -11 -13 20 -13 24 14 6 -10 -18 -13 51 15 -2 -13 5 -11 -34 39 29 13 3 -38 24 3 -49
$$ packed form
7310BK7m2J5jrj5j1M0o2P0m2M1l8PO4p2QO2j9k2Rq%Kj7m1P4onJ5j5ql8L5j7k4
7346d1Q4o3L1k7J9j3j4n0N4j3pK0M7l1L8m9KM6n7L7K4j1j8k2K3k3K0jj7LP6o3
7378D%l1Nqj3P8m4j7K1k7NK9k1L4m9N7m9J5rK2Rl6kM4k0m6O3j9j1j8K6K0K7q6
7412d7N1n1R8p0M8p2N5nok9J0L3j05P8l1J5M5m0M5l0l6kN3nKj6k5PN1J7r7L8M8
7445B7n2J4jm6N7m1M9mK3Qq1QL2L6J2k3m7L8Om1K3oL2j0j8L6n3O7o5J9ooJ7p3
7479f9P0JKK2m5k7P3J4l1j3k1kJ4j2M7J5k1k9mL9n4L8j8M8n7J04j03M7o0M5pO8
7511G4q3RN7m4Jo8L3j8J00k2p1OkN1l1RJ2K6k9k0L6k2J6m6O2m7N5ojml3j2K3K1
7545C2k6l8K2mk0K0lN5m8jkL3l3L7j0qj6qNO4l6j7j1J8j6k3P3j0j6j0m1O2k1n2
$$ plain form
7579 -49 21 -11 42 -5 28 3 -15 31 16 52 -6 -28 -34 18 8 -38 9 28 31 -17 19 -11 -4 15 -7 17 -33 -52 -6 34 -2 11
7611 11 2 -49 25 -37 -43 14 -9 -32 2 20 17 26 -29 -7 31 17 9 99 2 25 -45 -28 -31 -11 -52 28 20 -14 -36 -20 -31 -43 -27 48
7645 48 -12 -8 52 28 41 -3 18 -31 15 44 -18 62 -18 69 14 54 -28 2 87 -4 -5 23 -29 2 8 2 -6 -12 19 20 -48 28 0 -17
7679 -17 -9 16 -63 45 29 -19 30 14 32 -14 -33 -59 7 -19 -12 -4 -39 -21 -22 -27 -1 2 -7 -1 9 37 -58 -30 52 11 35 31 -29 -61
7713 -61 -4 -62 17 -10 -11 2 -12 -27 -12 42 42 -53 -55 5 10 -11 -72 9 -57 6 33 52 -9 13 3 -56 26 13 -41 -55 4 12 -18
7746 -18 6 13 28 78 -28 3 3 -28 19 24 8 -1 27 -51 -6 -42 -25 2 -24 11 -3 -6 -39 22 61 -27 14 -9 -16 -35 19 25 -36
7779 -36 -32 80 20 15 25 -25 -17 -21 9 -11 26 -58 43 -8 24 29 -13 -19 60 -5 13 9 -13 -2 -40 2 -24 -15 -57 0 -27 24 -10
7812 -10 5 12 32 26 -13 2 -49 60 -13 19 26 -16 52 63 25 -2 31 -25 47 -5 -24 -39 51 19 54 16 16 -16 37 18 21 47
$$ packed form
7579d9P0l2N3m7L3k5j8M6j5L6n8k2oN2j0m6M7J9Lm8L6l0PJ9k2K4n0j9M6M0l6J3
7611A1rn1P4o2oN7k3k3L4J8lRn5K2L8j4qR0r7K3p0J7lK0m1Q0ql4k2J6j1j2J6P5
7645D8o0MO0k4J3m4K1m9M6K9o2Q0q0Q7n5M0q2L0Q5r1jK8n2L1OoqoL1Jo8P6k8j7
7679a7QK5p9J08j6m8M9j6J8m6j9k6O6k6PQl5J8jnK6LrOJ0K8r5K8Q2m1K4mo0l2
7713f1N7n8P9k7jJ3j4j5J5N4%r5kO0Nk1o1Q1o6O3K7J9o1K2j0n9Q2j3n4j4N9Ql0
7746a8K4PJ5N0j06L1%l1M7Nj6rK8p8M5l6J7K7k6L5j4ll3O1L9q8M1k3pj9N4Oo1
7779c6MJ12o0nJ0n0QmL0k0L7q4J01n1L2Nm2oP9o5J8mk2J1l8M2k6Rm2N7k7N1l4
7812a0J5PK0ol9J5n1J09p3L2Pm2O8J1l8k7L3n6P2n2j9j5R0l2L5l8%l2N3j9LK6
$$ plain form
7844 47 -31 -40 -81 64 3 64 38 13 -32 -32 -39 16 17 58 -44 -42 -27 -15 58 20 -10 6 7 28 -16 -47 -16 -8 -32 -9 -3 12 -27
7877 -27 17 9 14 1 -33 -11 -50 -13 29 5 -20 -12 -3 6 -15 -67 -6 14 -20 50 -43 -32 31 -19 -22 -24 -5 -5 -17 -21 25 -55 0 -12 20
7912 20 1 18 47 -9 9 38 -1 27 -37 1 11 0 9 -35 28 -26 -61 -5 -29 12 -12 30 -44 -29 -31 34 -21 -31 7 1 14 -21
7944 -21 7 -8 63 8 30 -9 1 2 19 60 27 31 38 31 17 -65 4 -1 -12 -37 -26 45 -4 8 24 -70 14 21 -5 -56 -25 -13 5
7977 5 48 -18 27 24 19 -32 -29 -8 15 -24 -13 -3 -7 -37 31 18 37 42 9 21 -63 0 -35 -22 15 67 46 -12 51 37 31 16 -4 30
8011 30 -13 -31 17 -70 -11 2 -37 -22 3 7 -13 26 33 2 25 -7 -36 -3 -37 3 51 -12 -12 37 2 17 53 9 6 -71 34 -25
8043 -25 -6 -45 -4 7 19 37 -13 -15 15 15 -54 -39 11 17 -31 -13 57 65 -1 -19 37 -13 1 -19 -42 3 -20 27 16 6 1 26 -4
8076 -4 -7 -37 -6 -13 36 2 24 -2 -43 21 14 -61 2 -28 -4 -3 8 57 13 6 104 -25 17 7 -16 17 -29 77 -33 -6 -40 89
$$ packed form
7844D7p8rm1J45o1O1k6k5m5%pN5JM1j02KJ5J2P3l8l0J6JK1m4l1L1Qk4K3OJ5l9
7877b7M4qNj3l4K2l9L7M2k4k5QRRk1n2O1K0l4P0r3J1O3n0lkJ9%j2mM6q0N5j2L2
7912B0j9J7K9n6J8K9l9K8o4L8J0j1Rm4O3n4l5N6k4M1k4M2p4J5kO5n5j0L8oJ3l5
7944b1K8j5P1n5K2l9J0JJ7M1l3MPpj4q2O9nj1k5J1P1m9J2J6r4Q4Pk6n1L1J2J8
7977EM3o6M5lnn1LK1K3l9J1J0ml0O8j3J9Nl3J2q4O3l5J3L7N2k1n8O3j4oj5k0L4
8011C0m3j8M8q7N9J3l9J5K5Mk0L9Pl1K3l2k9L3l4M0M8o3%M9l5J5L6m4lp7J05n9
8043b5J9l9M1J1J2J8n0kL0%o9J5N0Om8J8P0Qo6j8N6n0J4k0k3M5k3M7j1j0nK5l0
8076dll0L1pM9l4K2k6m1O4pp5O3l0K4JJ1M9m4pR8j29M2j0k3L3m6J06j10K7l4J29
$$ plain form
8108 89 0 -18 8 -12 -18 -21 26 71 82 35 -8 -28 12 25 37 5 -29 -26 42 1 -15 35 -30 57 3 26 16 -3 -29 24 37 15
8140 15 3 45 -11 -21 -33 10 -27 27 2 21 1 17 30 29 -9 -5 -13 -35 -42 59 14 -18 3 -37 32 -31 -20 69 -16 0 -53 5
8172 5 -9 2 -25 1 -18 3 3 -19 21 -3 36 -6 -19 -41 -10 -8 22 9 2
$$ packed form
8108H9q9j8K6k0olM7M5J1m7m3k0M0J3J2l2l4LO8m1j6N0o5Q7n4K3j0j9k6N3J3k2
8140A5j2M2n6j0j2M3l7N4k5J9k0J6J3jl8Mqk2pJ01m5l2K1m0O9o3J1Q9q5J6n3N8
8172Ej4J1k7K6j9K1%k2M0k4L9m2j3k2L1KL0j3p
8191B
$$ Imaginary data points
##PAGE= N=2
##DATA TABLE= (X++(I..I)), XYDATA
$$ plain form
0 0 0 0 0 0 0 0 0 0 0 0 0 0 0 0 0 0 -8 8 -8 8 -8 8 -16 16 -16 24 -24 32 -32 40 -48 48 -56 64 -72 81 -96 104
38 104 -118 129 -144 160 -178 200 -219 241 -267 294 -323 356 -394 434 -477 527 -582 645 -716
57 -716 798 -894 1005 -1139 1306 -1513 1786 -2159 2701 -3572 5183 -9185 41703 34281 -63886
72 -63886 -39315 10167 36682 11296 -13124 -12547 -10 -3477 4075 6232 319 -4660 -312 1188
86 1188 270 -2945 1240 3060 691 -2208 -1091 -260 1409 653 130 -443 -449 -252 822 -251 -504 67
104 67 599 134 -440 -393 423 -65 -355 634 799 -502 -799 -226 490 490 -125 -475 -116 112 94 3 -82 -73 184
127 184 369 -115 -820 -261 982 789 -254 -862 -367 550 696 -84 -427 -4 48 -198 12 338 273 26
147 26 -342 -291 179 376 50 -193 -139 -63 39 62 -63 5 -17 -85 -18 64 76 -70 -37 0 89 -4 -34 68 48 -55
$$ packed form
0@%%%%%%%%%%%%%%%%qJ6j6J6j6J6k4L2l2M0m8N6o4P2q8R6j04J20j36J53j77K00
38A04k22K47k73L04l38L78m19M60n08N61o17O79p50Q28r11J004j109J227j361
57g16J514j692J899k144K445k819L299l945M860o273Q755j4368N0888p422r8167
72f3886K4571M9482K6515k5386k4420N77J2537l467P552K157n913m979M348J500
86A188r18l215M185J820k369k899J117Q31J669p56n23n73oJ97J074j073k53N71
104F7N32m65n74M7Q16m88k90R89J65j301k97N73P16%o15l50L59K28j8r1q5RK57
127A84J85m84p05N59J243j93j043o08M95R17J46p80l43M23N2k46K10L26o5k47
147B6l68N1M70J97l26k43N4P6J02K3j25O8k2o8O7Q2J2j46L3L7Q9r3l0J02k0j03
$$ plain form
173 -55 -24 52 78 -13 -8 -9 0 89 19 22 -46 28 38 -19 -34 25 -12 -4 -103 -17 -23 50 -66 -9 25 -3 38 -28 -9 29 -49 -27 6
206 6 -36 -16 2 19 73 56 -36 10 -19 20 15 4 12 -20 -2 -31 -2 69 92 14 -77 -27 74 98 -22 -75 6 -31 -36 -6 -7 -63
238 -63 22 -64 -25 -12 -36 -26 71 -24 -27 -55 27 -27 27 -26 -14 25 10 25 -53 -17 7 -13 50 19 -32 37 21 -11 -9 52 11 -15
270 -15 74 42 0 54 -17 -3 14 -2 -62 -74 -72 26 4 -43 8 12 16 0 5 -19 28 36 -4 -11 -40 20 5 -49 49 11 22 -25 -5 -23
304 -23 -12 -63 -20 -12 2 -14 -35 47 -9 -47 21 6 -18 4 20 -11 -32 -16 45 -1 -21 15 11 9 -51 46 -47 24 0 -29 4 -22
336 -22 -56 -29 20 -9 -12 22 20 34 -33 3 8 -71 22 29 26 -36 -60 30 25 13 -25 52 -1 -16 -10 -45 -3 28 -16 2 -24 -19 -34 -53 37
371 37 30 26 40 -25 48 -9 -12 14 -11 -29 19 24 -2 29 12 4 -8 -24 10 -16 56 25 35 97 72 13 30 -17 31 0 -78 0 -72
404 -72 2 3 52 -39 -12 -11 -13 -7 -45 -14 36 2 -18 44 37 42 -43 -34 -39 -9 47 -22 27 11 -8 71 30 8 -44 21 0 30 22 46 26
$$ packed form
173e5L1P6K6r1NjRQ9p0Lo8P4J0n7j5N9l7Qr9Q6oP3j16N7L4k8M1o6J9L8p8K2L3
206Fm2K0J8J7N4j7r2M6k9L9nj1Ql2J8k9K9P1K3p8r1N0J01K4j20n3Q1l7nL0jn6
238f3Q5q6L9J3k4J0R7r5lk8Q2n4N4n3J2L9j5J5p8L6K4k0O3l1n1O9j6l2KO1m1k6
270a5Q9l2m2N4p1J4J7j6o0j2KR8k2m7N1MMj6Nk4M7Qm0pk9O0j5n4R8l8J1m7K0j8
304b3J1n1M3QJ4j6k1Q2n6l8O8j5k4K2J6l1k1J6O1m6k0L6mko0R7r3P1k4k9L3k6
336b2l4K7M9k9lL4kJ4o7L6Np9R3Plo2k4R0nj2l8P7n3j5Ol5M2L1m4J8k6Nj5j9R0
371C7pmJ4o5P3n7lK6k5j8M8Nk6L1j7qj2j6L4k6P2l1J0O2k5n9J7m7M8l1p8P8p2
404g2P4JM9r1K7JkOl8L1N0l4k0O2pNq5RnL0N6o9M9j6j9P9m1k2n2O5k1L0qK4k0
$$ plain form
439 26 -8 -19 46 -34 -24 -73 16 -11 -24 -4 9 -38 -24 -54 4 -28 -74 -29 -50 20 -32 2 -15 37 4 -41 -10 11 -6 -56 -20
470 -20 71 0 63 -34 47 16 -4 48 20 70 -7 -19 11 -60 45 -14 -24 2 43 25 10 1 -36 20 -2 -20 -10 -92 -51 -20 34
501 34 39 -22 -12 -56 31 33 45 -15 61 45 20 1 44 15 -9 8 -57 -67 18 37 28 40 -14 14 -31 -46 -18 -41 -10 -5 28 3 41
534 41 4 -51 9 20 18 -42 5 13 1 -13 -76 -24 -21 -30 -24 20 8 39 24 44 12 66 38 -21 74 -7 -4 69 9 15 43 13 -16 11
568 11 47 16 44 26 -15 -8 -31 -79 -33 -67 47 -34 -80 46 -12 -26 0 -27 48 63 3 -24 -13 -41 -29 -11 28 19 24 46 10
599 10 2 -36 -10 4 66 45 -12 -20 4 5 -6 26 11 -52 -1 -14 -20 -34 -2 23 7 -10 -10 -41 -45 28 26 -23 -57 19 -1 -24 8 35
633 35 35 5 -44 54 6 22 -20 30 11 5 -32 -27 33 10 -14 -32 -36 -10 -35 -20 21 -3 -2 -27 -6 31 -28 -18 -50 34 42 21 15 35
667 35 -24 6 -37 32 -27 5 -7 10 17 -16 -4 38 -10 61 5 42 26 33 -20 -36 37 0 2 23 14 -6 -58 -2 18 -19 -9 9 -43
$$ packed form
439B6l4j1O5q0J0m9Q9k7j3K0J3m7J4l0N8l2m6M5k1P0n2L4j7N2l3m5L1K1j7n0L6
470b0R1p1O3r7Q1l1k0N2k8N0p7j2L0p1J05n9j0K6M1j8j5rl7N6k2j8J0q2M1L1N4
501C4No1J0m4Q7KJ2o0P6j6k5j9M3k9k4J7o5j0Q5J9rJ2n4K8m5j5K8k3L1NL3k5L8
534D1l7n5O0J1ko0M7Qj2j4o3N2LrOM4j2L1j5K0l2N4k8n9R5q1LP3o0OK8l0k9K7
568A1L6l1K8j8m1Pk3m8M6l4J14q1m6J26n8j4K6k7P5J5o0k7J1k8J2J8L9rNK2l6
599A0ql8K6J4O2k1n7qK4Jj1L2j5o3N1j3oj4L2K5j6j7%l1mP3km9l4P6k0k3L2K7
633C5%l0m9R8m8J6m2N0j9ol7NO0k3k4j8mK6k5J5M1k4Jk5K1L7n9J0l2Q4Qk1oK0
667C5n9L0m3O9n9L2j2J7Pl3J2M2m8P1n6L7j6Pn3j6P3l7KK1rk0n2N6K0l7J0J8n2
$$ plain form
700 -43 -28 75 -19 6 -23 20 -40 33 -40 32 13 38 5 -8 -2 -19 26 -17 -4 28 -21 48 41 68 13 45 24 -48 21 64 40
731 40 77 20 55 -13 -51 10 -39 -1 -19 -21 16 23 -56 -17 12 34 -9 -21 -2 39 -25 10 -60 -5 -9 13 23 -58 39 2 -44 30
763 30 -2 11 26 71 31 25 -16 -16 77 -13 43 41 21 21 -10 3 -27 38 -31 11 -41 -43 -1 -24 36 5 16 -13 2 -1 -37 -4 6 -2
797 -2 -60 -10 13 -6 9 71 -24 -9 -21 39 -6 9 -10 -33 7 14 47 23 23 22 14 19 -32 17 38 14 9 15 2 12 9 18 45 -15 38 11
833 11 9 -13 0 -16 -9 -24 -40 -8 -16 -28 -11 24 -68 7 -45 17 11 -11 78 37 31 37 -9 16 42 0 -9 22 4 0 5 -8 2 -35 -42 11
869 11 21 -37 -12 8 -17 -15 -52 47 -7 -22 3 -15 17 -45 8 2 -28 3 9 47 -66 -23 14 58 64 -6 26 43 44 28 32 -16 23
902 23 32 -37 26 0 2 -43 -41 28 -22 -3 33 3 -70 24 39 12 19 -30 -18 -15 -9 -67 32 15 -1 66 38 11 45 -38 -23 -17 -13 6 -9
937 -9 -20 -47 20 -37 -19 50 -37 18 31 -50 40 16 -40 5 -13 -25 20 -13 17 -36 6 -1 0 -21 0 30 12 68 -25 -1 13 -80
$$ packed form
700d3J5J03r4K5k9M3o0P3p3P2j9K5l3j3Oj7M5m3J3L2m9O9pK7n5L2k1p2O9M3k4
731D0L7n7L5o8l8O1m9L8j8kL7Pp9L9K9K2m3j2J9M1o4L5p0N5mK2J0q1R7l7m6P4
763C0l2J3J5M5m0om1%R3r0N6kk0%l1J3l0O5o9M2n2kM2k3O0l1J1k9J5ll6L3J0q
797bn8N0K3j9J5O2r5J5j2O0m5J5j9k3M0PL3k4%jqNn1M9K1k4nOj3J0lRK7o0N3k7
833A1kk2J3j6Pj5j6L2qj2J7L5r2P5n2O2ok2Q9m1oOm6K5K6m2rL1j8mNj3J0l7pN3
869A1J0n8K5K0k5Kl7R9n4j5K5j8L2o2N3ol0L1OL8j13M3L7M4Op0L2J7Jj6Mm8L9
902B3Ro9O3k6Km5KO9n0J9L6l0p3R4J5k7Pm9J2LOn8R9j7j6O7k8k7L4q3J5OMJ9j5
937ij1k7O7n7J8O9q7N5J3q1R0k4n6M5j8j2M5l3L0n3M2pJk1K1L0j8N6r3K4J4r3
$$ plain form
969 -80 -56 23 22 20 82 39 69 7 -39 49 31 51 -104 18 26 18 81 -15 15 -11 -76 21 23 61 -43 22 -17 -23 -28 8 -37 -32 10
1002 10 -37 8 45 8 0 -3 -39 -3 -1 -12 -15 25 27 11 -6 -15 44 -20 10 -29 -23 -9 31 42 -34 39 15 -30 -33 42 -10 -32 -11 -44
1036 -44 24 -25 -87 -19 19 -41 13 -45 -11 16 21 39 18 -7 19 26 44 -38 22 33 -2 46 12 -16 9 32 5 19 -7 34 -14
1067 -14 -11 65 -1 -11 9 17 71 -13 -50 -69 -79 -18 -49 -31 -31 -39 -49 -37 -19 5 -30 7 -44 14 -13 -6 3 26 22 31 4 -48 22 47
1101 47 2 18 -21 -32 -40 -1 -3 58 26 20 38 8 -37 12 20 -47 0 -85 29 -8 20 20 -11 -12 -21 26 -76 28 -26 -24 -41 -17 5
1134 5 -15 25 -36 -12 -10 24 37 20 0 62 39 38 25 29 -49 23 -45 5 -5 -58 18 -23 -19 6 16 40 -13 -9 -23 -36 -62 22 53
1167 53 -22 -23 -23 -28 2 16 22 39 -17 -13 -16 10 -47 -8 -21 -10 -23 20 12 20 11 -19 42 -17 4 -19 -1 21 -41 13 52 45 -23 -38 -29 15
1203 15 24 -44 -24 -24 -26 21 4 25 28 6 21 -35 7 -50 -29 -44 -21 -6 -1 39 -41 -44 -30 10 -32 -7 26 1 25 17 21 9 11 -3 -42
$$ packed form
969h0K4P9jkO2m3L0o2m6Q8j8K0j55J22QqO3r6L0k6o5R7KL8j04O5l9onL6m5NM2
1002A0m7M5L7l7qll6L6Kj1lM0Kj6j7rN9o4L0l9OJ4M0J1p6P3k4m5lP5n2k2K1l3
1036d4O8m9o2O8L8o0N4n8L4K7NJ8k1k5K6PJ8q2O0J1l5M8l4k8K5K3k7J4k6M1m8
1067a4LP6o6j0K0QN4q4l7j9j0O1l1J8%qj0J2J8K4l5L7n1N8k7PRK3mRk7n2P0K5
1101D7m5J6l9j1qL9kO1l2oJ8l0m5M9Qo7M7q5J14l7K8%l1jrM7j02J04n4Kj7K4K2
1134Ek0M0o1K4KL4J3j7k0O2k3jj3Mp8P2o8N0j0n3P6m1MK5J0K4n3Mj4j3k6Q4L1
1167E3p5j%nL0J4OJ7n6MlK6n7L9j3J1j3M3qQrl0O1n9K1k3J8K2o2N4L9po8j5RM4
1203A5Ro8K0%kM7j7K1Lk2J5n6M2n7K1j5K3J5NM0q0lJ4M0m2K5L3k5K4qMj2Kj4l9
$$ plain form
1238 -42 0 -5 -51 15 -17 -15 -28 -50 10 -29 46 16 -57 -4 9 10 34 -11 24 -13 17 -23 7 -17 -32 -22 7 -43 11 9 20 22 -8
1271 -8 37 -6 30 25 -5 3 24 -27 -21 20 -45 9 5 9 19 40 1 -18 -6 24 26 15 22 -30 2 -40 -60 30 18 31 -29 -17 -12 -17 13
1306 13 -49 30 18 -6 -21 -9 6 33 -40 -2 36 -9 -26 -20 22 22 2 -5 35 -19 -20 7 -18 40 -31 51 0 -14 7 10 24 -31 -41
1339 -41 77 -3 17 4 -5 6 31 -10 -15 -1 -2 -14 7 -37 43 -24 21 32 -46 -12 49 1 12 -39 -6 -9 10 -44 40 19 -59 31
1371 31 1 -19 -15 -46 2 -54 -47 14 25 33 43 6 -4 -18 -14 41 -33 14 -9 -34 4 2 -46 22 4 -2 -13 24 15 29 52 6 -12 48
1405 48 -31 -10 -20 0 -19 0 30 -25 33 -51 1 -12 -34 45 -13 -23 15 -31 11 27 44 -34 -15 -53 -25 2 -8 31 82 -24
1435 -24 16 -35 23 8 -9 -3 22 -36 7 15 47 24 34 -12 -41 74 -1 28 -60 31 -23 1 27 -2 -11 23 -46 -15 -9 -31 -59 -18
1467 -18 -46 12 -12 -30 -29 -1 31 -28 -18 -31 14 -10 76 13 35 16 36 -57 -21 -18 24 50 54 2 4 29 -28 -45 -30 32 -73 -14
$$ packed form
1238d2M2nm6O6l2Kj3k2O0l9P5l0p3N3J3JK4m5L5l7L0m0L0k4j5J0K9n0N4kJ1Kl0
1271hM5m3L6nl0QK1n1OM1o5N4mMJ0K1l9j9J2L0Kj1Pn2L2m2k0R0j2J3o0J2NnL0
1306A3o2P9j2k4j5J2J5K7p3L8L8m5j7OM2%k0pM0n4jK7k5N8p1Q2n1j4K1LJ4n5j0
1339d1J18q0K0j3rJ1K5m1nJ4jj2K1m4Q0o7M5J1p8L4O1m8J1n1L3lJ9n4Q4k1p8R0
1371C1l0k0Ml1M8n6PO1J1QJ0l7j0j4MN5p4M7k3k5L8km8O8j8oj1L7rJ4K3m6j8O0
1405D8p9K1j0K0j9J9L0n5N8q4N2j3k2P9n8j0L8m6M2J6J7p8J9l8K8K7j0L9N1j06
1435b4M0n1N8j5j7OK5n8M3QL2k3J0m6k9J15p5K9q8R1n4K4K6k9rL4o9L1Ok2k8M1
1467a8k8N8k4j8JK8L2n9J0j3M5k4Q6o3K2j9K0r3L6LM2K6Mn2KK5n7j7J5O2j05N9
$$ plain form
1499 -14 -65 -47 -44 9 23 -24 29 -21 -41 32 -44 -6 -14 -24 -10 -2 -3 26 3 24 23 9 29 -1 38 12 -14 40 6 -2 -17 25 -23
1532 -23 8 38 8 4 -37 12 17 -44 -8 37 -6 -4 41 -21 -21 -11 -6 -29 -13 -28 7 36 -28 44 34 8 -4 -1 55 -20 -29 12 40 37
1566 37 44 17 30 24 46 30 -48 86 54 9 -1 -55 -5 -36 42 -2 -2 -31 -16 37 -15 -22 -28 -14 -24 -39 -9 -43 29 -10 23 31 -26
1599 -26 -17 -23 10 -20 45 -10 31 -6 -31 -15 -22 -6 -16 -34 -10 -46 13 8 -26 -43 29 -4 -36 -49 -46 -10 -57 -13 0 -3 45 17 -26
1632 -26 24 -42 2 -27 24 39 11 -25 5 37 18 11 -14 -5 50 42 34 14 7 27 0 -3 -64 79 25 -21 -27 5 57 4 -24 -22 1 16
1666 16 15 -7 21 44 51 2 -61 -19 8 6 14 -2 -6 -36 30 -8 37 -19 1 0 42 -15 29 -24 24 24 -20 21 8 10 40 64 -4 61
1700 61 60 31 27 -22 -66 -29 0 -93 -31 46 -21 15 29 15 0 0 26 -24 43 28 31 -1 27 31 -1 -13 3 12 -5 9 -10 49 3
1733 3 27 -18 41 37 46 91 -5 58 26 -3 20 9 5 -21 41 39 -8 -66 -17 -29 -53 -84 -22 -68 -30 1 -23 24 -2 -19 -26 -6 33
$$ packed form
1499a4n1J8LN3J4m7N3n0k0P3p6L8qj0J4QjK9k3K1jj4K0l0L9k6k6N4l4qj5M2m8
1532b3L1L0l0mm1M9No1L6M5m3KM5o2%J0Nk3J6j5L5K9o4P2j0k6j2LN6p5rM1K8l
1566C7Pk7J3oK2j6p8J34l2m5j0n4N0l1P8m4%k9J5N3n2poJ4j0j5L0l4P2l9L3Qn7
1599b6RoL3l0O5n5M1l7k5J6pJ6j0j8K4l6N9nl4j7P2l3l2j3LL6m7M4J3lM8k8m3
1632b6N0o6M4k9N1J5k8l6L0L2j9pk5RN5qqk0pK0k7lo1J43n4m6oL2N2n3k8KK3J5
1666A6jk2K8K3Pm9o3M2K7kQj6ml0O6l8M5n6K0jM2n7M4n3M8%m4M1j3KL0K4o8O5
1700F1jk9mm9m4L7K9r3O2P7o7L6J4j4j5%K6n0O7j5Ll2K8Ml2j2J6Rj7J4j9N9m6
1733CK4m5N9mRM5r6O3l2k9K3j1mk6O2km7n8M9j2k4l1O2m6L8L1k4M7k6j7pK0L9
$$ plain form
1766 33 11 -5 -35 -6 3 -19 54 12 26 4 47 25 33 26 29 -40 7 -4 59 25 -2 5 16 35 7 13 0 -85 -15 -12 -16 -36 18 8
1800 8 -56 -46 16 -11 21 -13 0 -17 5 24 39 -53 -20 18 -4 10 95 9 35 2 12 -22 -30 21 -45 -25 1 -4 49 28 20 16 -5
1833 -5 1 -20 1 8 13 -15 -19 -6 -38 -4 -18 -8 -4 -21 7 -14 -12 30 -39 -14 26 -4 13 15 90 -19 -27 -11 -3 24 15 -4 1 -5 -11 12 7
1870 7 -33 12 -6 41 -34 30 23 -23 17 20 -13 14 -41 18 -5 3 17 -23 14 44 26 3 -56 -45 8 35 -72 -39 -13 7 8 -15
1902 -15 20 61 -47 24 61 -24 14 -19 -6 -54 30 -49 -7 -34 24 22 -41 15 -20 32 1 -34 -10 -21 -13 1 41 -39 -47 19 26 -61
1934 -61 -20 -9 -9 5 -47 -18 -1 64 9 -12 -6 17 -9 2 -40 7 23 1 -55 -7 -1 9 -62 9 20 32 -26 -22 32 -16 -59 -37
1966 -37 -2 7 -40 -9 19 31 -29 12 20 -18 -5 35 -3 -7 -8 -1 20 -15 13 22 17 10 -2 18 42 -84 -85 -20 31 -7 -30 -2 -52 40
2000 40 1 -37 42 -101 39 11 5 -1 -23 -73 93 -54 16 -29 5 -4 -7 -20 -12 15 -41 53 21 -56 -26 -5 -28 2 9 -18 31
$$ packed form
1766C3k2j6l0K9Rk2P3m2J4k2M3k2QpLo9M7j1O3l4k7PJ1J9k8Oj3q5P0Lmk0N4j0
1800Ho4J0O2k7L2l4J3j7K2J9J5r2L3L8k2J4Q5q6K6l3J0l4qN1o6K0K6nN3k1qmk1
1833eOk1K1PNk8mJ3l2L4j4J0Mj7K8k1KM2o9K5M0l0J7KP5j09qJ6QK7rj9NooK3n
1870Gm0M5j8M7p5O4pm6M0Ll3K7n5N9k3QJ4m0L7L0j8k3n9J1N3K7j07L3K6K0Jk3
1902a5L5M1j08P1L7q5L8l3J3m8Q4p9M2k7N8ko3N6l5N2l1l5K4j1QJ4M0q0qO6Pq7
1934f1M1J1%J4n2K9J7O5n5k1OK3k6J1m2M7J6k2n6M8OJ0p1P1J1J2n8MN4m8m3K2
1966c7L5Rm7L1K8J2o0M1Ql8J3M0l8mjPK1l5K8Rnpj2K0K4j26jO5N1l8k3K8n0R2
2000D0l9l8P9j43J40k8ook2n0J66j47P0m5L4rlj3QK7n6R4l2p7L0K1k3L0Pk7M9
$$ plain form
2031 31 23 -6 -11 -20 32 -17 -30 -21 4 -4 9 -10 -31 74 9 -17 -21 -14 1 -19 -3 -33 -20 -35 10 4 24 -34 27 50 1 -57 -11 7
2065 7 26 26 39 4 28 21 52 4 -4 -10 28 -2 1 67 39 50 -14 63 -14 12 -21 -52 -92 -22 -41 -34 -1 45 -26 -23 17 25 -16 25 -50
2100 -50 31 52 12 49 -36 50 -12 23 30 -46 2 27 66 17 73 -33 68 -11 32 -46 24 -19 -16 3 44 40 52 18 -12 52 14
2131 14 42 -33 2 -3 -4 -4 -21 7 1 8 6 -5 62 -4 -19 62 6 44 63 52 -13 16 -21 -11 -30 -31 82 -6 57 -9 20 33 3
2164 3 -27 6 58 -6 -24 -26 -45 -58 -42 -35 -2 -65 -33 -44 25 68 -12 36 -24 25 -36 -51 11 -32 -31 5 -13 1 1 -23 23 -6 50
2197 50 -15 66 2 21 -11 7 -32 -51 26 38 26 38 20 15 58 10 -3 29 -11 -78 8 -30 -26 29 -13 22 -40 -7 26 61 41
2228 41 31 41 24 39 -45 -39 2 -44 -24 42 16 -11 -10 -62 23 -63 25 59 32 5 36 7 34 -19 46 10 18 -52 1 17 5 3
2260 3 -26 50 -9 -23 15 45 -56 -10 -50 10 85 -10 0 -25 42 1 -24 58 -27 58 25 -10 30 37 -1 48 7 2 3 -14 -5 -2 -40
$$ packed form
2031C1qk9nrN2m9j3RK5qJ3j9k1J05o5k6mPJ5k0J6l0J3j5M5oK0n8O1K3m9n8M6J8
2065GJ9%J3l5K4pL1m8qoL8l0LO6k8J1o4P7p7K6l3l1m0P0j9PL3M6p1LM0Qm1M1p5
2100e0Q1K1m0L7q5Q6o2L5Pp6M8K5L9m9N6j06J01p9M3p8P0m3LJ9M1mJ2l4l0O4l8
2131A4K8p5L5nj%j7K8oPkj1O7o6j5Q1n6L8J9j1o5K9l7J0j9jJ13q8O3o6K9J3l0
2164Cl0L3N2o4j8kj9j3J6PL3o3L2j1O9M3q0M8o0M9o1j5O2m3JL6j8J4%k4M6k9N6
2197E0o5Q1o4J9l2J8l9j9P7J2j2J2j8nM3m8j3L2m0o7Q6l8MN5m2L5o2L3L3L5k0
2228D1j0J0j7J5q4OM1m6K0O6k6k7Jn2Q5q6Q8L4k7k7L1k9K7n3O5l6Qp0N3J6j2k
2260Ck9P6n9j4L8L0j01M6m0O0P5r5J0k5O7m1k5Q2q5Q5l3l5M0Pl8M9m1nJj7RLl8
$$ plain form
2293 -40 -23 16 -42 28 19 -6 10 10 -46 17 -22 -36 -20 -23 -11 23 4 -21 3 19 -16 29 45 16 30 -36 29 37 71 -21 0 -6 24
2326 24 36 20 62 -13 -33 36 3 3 32 40 17 1 15 -44 0 -63 -3 7 -40 8 -80 -17 38 -44 -29 17 -3 -18 -22 1 9 -51
2358 -51 -6 34 -12 -11 16 20 9 -11 21 -3 -9 -14 -35 19 34 43 -35 7 -33 -36 -35 3 16 -43 -17 -30 -57 -15 -46 -54 -25 56 58 -14 -20
2393 -20 -2 5 7 49 45 -46 -8 55 -25 9 -23 1 2 37 42 19 7 47 -27 5 -53 -17 19 -11 38 -12 -2 33 -16 -12 -86 4 -35
2426 -35 -34 -15 -46 -45 -75 -6 30 9 7 44 -28 32 -15 2 26 -5 -6 22 -63 25 37 -12 4 15 41 9 -34 21 43 25 -5 -14 -48
2459 -48 24 45 -8 -25 -2 -23 27 8 6 -12 6 -34 -8 -27 5 -20 13 -8 -51 -63 -19 62 -48 10 1 0 11 -3 15 59 35
2490 35 10 65 66 106 -19 9 -12 -10 31 7 -76 50 -63 -5 -15 9 -29 -31 -6 4 4 -7 -31 -12 37 -7 -19 -12 -23 42 7
2521 7 -31 20 27 52 9 -2 -12 -30 32 61 27 12 21 -64 79 -3 -24 48 13 -47 -39 42 29 28 -26 3 -7 -50 19 -26 23 0
$$ packed form
2293d0J7L9n8P0rk5J6%n6O3l9j4J6lJ2L4j9k5K4J6l5M5J6k9J4o6O5QL4r2K1oL0
2326B4J2j6M2p5k0O9l3%K9Qk3j6J4n9M4o3O0J0m7M8q8O3N5q2J5M6k0j5mK3Qo0
2358e1M5M0m6JK7Mj1k0L2k4onk1N4J5Rp8M2m0lJL8J3n9K6j3k7M2l1qK9Q1Kp2o
2393b0J8PKM2mr1L8O3q0L4l2K4JL5Nk3j2M0p4L2n8L6L6l0M9n0J0L5m9Mp4R0l9
2426c5JJ9l1Jl0O9L6k1kL7p2O0m7J7K4l1jK8q5Q8J2m9J6J1K6l2m3N5K2j8l0rl4
2459d8P2K1n3j7K3k1N0j9kj8J8m0K6j9L2k5L3k1m3j2M4Q1j10N8rjJ1j4J8M4k4
2490C5k5N5JM0j25K8k1KM1k4q3J26j13N8j0K4l8kK5J0%j1k4J9M9m4j2Pj1O5l5
2521Gl8N1PK5m3j1j0j8O2K9l4j5Rq5J43q2k1P2l5o0QQ1j3jn4K9j0m3O9m5M9k3
$$ plain form
2553 0 16 -38 -36 -15 34 12 50 -3 -40 -27 -14 -10 7 4 -11 14 -11 19 7 -31 3 -34 -1 16 22 33 -15 -6 -13 68 44 59 -5 -16
2587 -16 -9 -16 -12 -12 -38 -50 -3 -25 -28 -20 -20 -21 31 -25 -23 -14 17 -24 -6 -6 5 15 -5 64 6 18 -33 -33 14 -19 28 -20 50 -53 -20 25
2623 25 31 13 3 58 -9 -33 8 7 -24 -17 -84 27 18 3 9 -18 -23 36 29 38 -9 -20 -7 10 -25 -13 -7 39 35 -35 62 86 28 24 15 71
2659 71 -36 52 -9 36 54 16 23 41 21 43 -29 16 4 -53 -35 3 64 37 22 48 8 0 -23 -13 17 -23 11 -29 -24 24 34
2690 34 -21 26 27 -36 -8 -42 10 30 -11 9 -20 30 66 -40 26 -20 47 16 29 -1 -3 -13 -2 30 -43 -4 -80 12 37 -13 22
2721 22 7 5 35 0 -31 38 -54 16 -2 24 -37 -33 38 13 10 3 44 -33 47 -34 -36 53 -5 27 -51 -10 -6 27 -30 -31 40 8 52 41
2755 41 21 1 5 -22 33 -34 -5 -36 -29 3 38 -35 -29 -85 50 25 16 7 -20 -18 -9 23 -14 -6 47 9 65 4 17 47 -92 38 10
2788 10 -28 23 9 96 -21 13 20 -59 -1 23 42 0 -1 26 23 -84 14 -21 15 -18 -26 -53 -42 -17 5 -1 -14 -13 -35 -36 -9 -53 -6
$$ packed form
2553@J6n4KK1M9k2L8n3l7J3J3MJ7lj5K5k5L0j2l8L4l7L3J7OJ1m8RpQ1k4J5o4j1
2587a6PpM%k6j2M7k2lQ%jN2n6KRL1m1J8%J1J0k0O9n8J2n1%M7l3M7m8P0j03L3M5
2623B5Oj8j0N5o7k4M1jl1Po7J11rj5Ok7nN9pRm7j1J3J7l5J2OM6mp0R7K4n8mrN6
2659G1j07Q8o1M5J8l8PJ8k0K2p2M5j2n7J8L8O1k7j5K6m0qk3J0L0m0L4m0NM8J0
2690C4n5M7Jo3K8l4N2K0m1K0k9N0L6j06O6m6O7l1J3l0kj0J1L2p3L9p6R2K5n0L5
2721B2j5kL0l5l1O9r2P0j8K6o1MP1k5lpM1p7Q0q1kQ9n8L2p8M1ML3n7jP1l2M4j1
2755D1k0k0Mk7N5o7K9l1PL2L5p3On6J35k5rrk7KRL2l7QN3l8N6o1J3L0j39J30k8
2788A0l8N1j4Q7j17L4Pp9N8K4J9m2jK7lj07R8l5L6l3qk7J1K5K2oj3Jk2jK7m4M7
$$ plain form
2821 -6 56 26 -4 28 17 10 -6 18 39 -32 49 27 20 -27 51 -8 14 56 43 8 -25 -9 -58 -1 -71 -15 24 22 22 23 5 -12 -35
2854 -35 -17 40 -10 -8 -3 -46 64 61 4 4 -28 1 15 -15 52 42 -56 84 11 14 9 41 55 9 61 6 20 -37 4 -5 26 -6 17
2887 17 2 -21 -35 27 12 6 -17 0 0 -77 0 27 -33 -5 7 -8 -19 0 -23 -21 37 40 17 -47 38 56 57 21 -6 25 10 2 -29
2920 -29 35 -8 -9 34 26 -8 -18 60 -5 6 -34 18 -1 16 -48 4 -28 29 53 -9 45 17 -9 -50 5 44 15 22 46 2 39 -28
2952 -28 48 22 20 49 26 68 26 27 6 38 36 -10 5 28 -39 52 21 -28 9 -68 10 0 -6 -29 -28 -28 -26 -59 33 -16 -15 -6 32 46 20
2987 20 13 -17 -5 -13 7 -16 -7 50 -11 13 11 -4 41 11 -7 13 28 76 57 29 -27 -34 -25 30 3 9 30 -41 -22 9 44 17 -29 -35
3021 -35 3 -19 15 -33 86 -54 19 -13 4 -28 -31 -23 -3 44 2 68 16 -15 -25 63 12 11 52 35 47 23 -37 19 74 -19 -28
3052 -28 -18 -20 12 -38 30 27 30 3 -21 -11 0 -11 26 2 -45 74 0 -29 10 48 -35 -19 21 -24 2 43 1 2 -21 16 25 53
$$ packed form
2821fO2l0l0L2j1pj6K4K1p1Q1k2pm7P8n9K2M2j3l5l3J6m9N7p0N6L9k%Jj8j7k3
2854c5J8N7n0KNm3J10ln7%l2K9J4l0O7j0r8J40p3LnL2J4m6N2n5J4n7M1rL1l2K3
2887A7j5k3j4O2j5ok3J7%p7P7K7o0K8J2j5j1J9k3KN8Lk3o4Q5J8Jl6k7L1j5ql1
2920b9O4m3jM3ql4j0P8o5J1m0N2j9J7o4N2l2N7K4o2N4k8k6m1N5L9k9PK4m4L7o7
2952b8P6k6kK9k3M2m2Jk1L2km6J5K3o7R1l1m9L7p7P8j0ok3J%Kl3R2m9JRL8J4k6
2987B0pl0J2qK0k3RN7o1K4kj5M5l0j8K0J5M8j9k8n6pRN5k7OK1p1J9L1L5k7m6o
3021c5L8k2L4m8J19j40P3l2J7l2lQK0M7m2O6n2l1j0Q8n1jM1j7J2k4o0N6N5r3r
3052b8J0kL2n0O8lLk7k4J0J1j1L7k4m7J19p4k9L9L8q3J6M0m5K6M1m2Jk3L7RK8
$$ plain form
3084 53 34 23 34 -10 27 -25 59 45 2 5 -10 20 6 -66 2 38 -21 -2 6 -6 -19 -5 -19 6 -3 -52 48 -31 -29 15 -16 5
3116 5 25 0 -33 -1 -24 67 13 51 29 10 -1 24 38 -59 -40 8 19 -26 11 -35 7 -9 -63 5 10 -26 -13 -2 9 -26 -18 -20
3148 -20 -15 -27 -7 64 -21 34 21 5 34 16 33 8 37 45 35 33 56 32 59 19 -54 20 7 -13 -30 -2 -28 47 -24 24 -52 -13
3180 -13 -3 -34 -24 -69 -47 -29 -23 21 26 -6 30 48 -15 -18 46 46 -37 21 21 25 16 20 33 44 -17 86 17 3 45 -5 0 11 -55 23
3214 23 44 16 2 -29 -16 -18 -23 -8 -25 -18 -36 5 -11 9 29 -24 8 12 26 -9 55 -2 15 -29 21 -8 38 3 -10 6 7 38 2
3247 2 -1 -3 21 -3 5 -61 -17 -27 19 12 -42 7 -33 4 19 4 11 -27 -17 27 11 16 -41 18 -50 20 -19 -1 -7 -23 -20 -12 23 33 4
3282 4 18 -11 12 -34 -11 3 29 39 12 16 10 -27 4 -12 -20 -13 -3 -5 -9 -24 34 9 -26 -21 42 10 -39 33 -67 22 -46 -43 -58 5
3316 5 -25 35 -9 42 -6 -18 54 -21 11 -46 26 0 -51 37 32 8 42 39 -36 -22 42 -35 49 -15 10 -18 37 -1 -24 -6 48 60
$$ packed form
3084E3j9j1J1m4L7n2Q4j4m3Lj5L0j4p2O8L6n9J9Qj2j3J4j4K5rm9J00p9KM4l1K1
3116EK0k5l3L2k3R1n4L8k2j9j1K5J4r7J9M8J1m5L7m6M2j6n4O8Nl6J3J1J1l5Qk
3148b0Nj2K0P1q5N5j3j6K9j8J7k5K9Qj0kK3k4K7m0p3P4j3k0j7K8k6P5p1M8p6L9
3180a3J0l1J0m5K2J8OM4Nl2L6J8o3lO4%q3N8%MrMJ3J1o1J03o9j4M2n0NJ1o6P8
3214B3K1k8j4l1J3knJ5j7Pj8M1j6K0K0n3L2MJ4l5O4n7J7m4N0k9M6l5j3J6JL1l6
3247BlkK4k4Qo6M4j0M6pn4M9m0L7J5j5Pl8J0M4j6Nn7N9o8P0l9J8oj6LQL5J0k9
3282DJ4k9K3m6K3J4K6J0k7Mol7L1j6qPJ0kmj5N8k5l5NO3l2m9P2j00Q9o8Lj5O3
3316El0O0m4N1m8j2P2p5L2n7P2k6n1Q8nk4L4lp5J4O4p7Q4o4K5k8N5l8k3J8N4J2
$$ plain form
3348 60 -44 -63 2 -5 38 -37 -3 -21 31 -59 -30 8 15 45 28 30 31 -53 18 -32 -53 11 60 14 7 28 28 17 16 -16 71 0 21
3381 21 49 42 -6 -13 -14 20 19 9 14 9 -42 21 43 1 11 -8 -37 41 2 -24 32 -33 44 35 -24 45 -14 43 -3 9 77 23 -7 -62
3415 -62 8 34 -8 54 -52 -25 1 -21 33 11 -2 -43 66 8 25 -17 7 -50 4 -45 -12 -76 -33 -13 -8 -19 9 19 -28 -1
3445 -1 -10 48 -23 6 8 -32 45 47 -10 -12 41 35 -35 62 32 17 10 31 4 -8 -36 -2 -26 -19 -1 -9 11 21 -3 -28 -50 16 -3 -39 -46
3480 -46 -48 16 14 -15 -55 -35 -32 -64 -45 -29 35 -32 30 -20 88 56 37 21 2 50 -5 42 -15 39 6 23 -15 -51 -13 2 -4 2
3512 2 -11 -20 -8 -11 5 -78 -7 6 -9 -49 18 40 -41 -52 -3 42 -25 3 -59 -40 51 11 7 7 19 -37 -9 26 -4 38 -36 25 -18
3545 -18 3 29 17 20 -4 41 -8 21 39 3 -24 -1 -15 49 19 14 -13 -13 -48 -47 -43 38 59 -22 8 20 12 -19 40 -8 -16 7 -19 46
3579 46 -55 57 0 10 22 2 38 5 3 -22 41 0 7 43 28 3 -12 66 -34 13 3 26 -28 27 -60 2 17 -30 -2 -37
$$ packed form
3348F0j04j9O5pM3p5L4j8N2r0K9L8PL0j7KJq4P1n0k1O4M9m6pK1%j1jl2Q7p1K1
3381B1K8pm8pjL4jj0Nnn1O3K2m2J0j9k9P8l9k6N6o5P7rn9O9n9N7m6J2O8n4l0n5
3415f2P0K6m2O2j06K7K6k2N4k2j3m1J09n8J7m2K4n7N4m9L3o4M3K0Nj1K8J0m7K7
3445arN8p1K9Km0P7Kn7kN3op0R7l0j5pK1k7j2k8L4k4PJ8qK0J0k4k5k2O6j9l6p
3480d6kO4kk9m0K0Ll2J9J6O4o7O2n0J08l2j9j6j9M8n5M7n7N4l3J7l8l6L8J5oO
3512Bj3rJ2lJ6q3P1J3j5m0O7K2q1j1M9M5o7K8o2J9R1m0m%J2n6K8L5l0M2p4O1m3
3545a8K1K6j2Lk4M5m9K9J8l6k7K3j4O4l0nk7%l5JMQ1K1q1L0J2ql1N9m8qK3k6O5
3579D6j01J12n7J0J2k0L6l3kk5O3m1PL6j5k5j5P8j00M7j0K3n4N5q7O2J5m7K8l5
$$ plain form
3609 -37 36 -44 28 -7 -27 -14 8 -26 -20 19 -16 34 -11 8 55 -17 38 51 -57 -1 -6 33 21 -30 -26 50 13 -34 -32 20 -3 -9
3641 -9 22 21 -53 -4 60 -4 -36 -84 37 18 -32 19 -58 25 -13 13 -20 14 -1 -11 -3 -26 10 -20 -33 55 24 6 -32 -1 -10 -3
3673 -3 17 -22 5 -14 46 21 -20 -25 43 -53 2 -6 33 13 -38 13 -59 39 5 -44 39 47 1 -35 10 11 20 -23 12 10 18 20 8 -28 -7
3708 -7 -19 -23 45 13 22 42 47 9 -11 0 24 49 -44 -29 -40 4 -9 -4 21 -2 -13 19 -47 -19 -50 3 -36 -49 -25 -12 -53 38 1
3741 1 -38 -20 33 2 -14 32 27 26 8 36 -35 40 -23 -8 55 10 -39 30 -8 26 79 -15 -8 -48 3 -40 27 9 -48 7 12 -22 -29
3774 -29 -45 -10 -28 -57 -21 -47 10 0 9 2 -11 -7 14 -69 45 49 -12 -18 -27 -34 -23 105 6 -9 14 27 -25 -17 -14 -9 5 4 -27 -35 22
3809 22 -62 -49 1 -30 -59 28 -28 -37 -8 12 -2 42 12 1 52 -16 25 9 -48 93 -24 8 -6 2 8 26 42 3 65 40 38
3840 38 -5 36 29 -9 32 39 2 30 -30 30 19 -6 -63 16 -10 -45 -34 48 6 99 -78 -17 49 -25 -26 -59 -55 -21 22 -20 -73 -16
$$ packed form
3609c7P3q0P2l5k0J3K2l4OL9l5N0m5J9M7p2N5J3j08N6nL9j2n1MP6l7m7KN2k3o
3641iL1jp4M9O4o4l2m8J21j9n0N1p7Q3l8K6l3L4j5j0Qk3L6l0j3Q8l1j8l8L1rP
3673cK0l9K7j9O0k5m1nO8r6N5qL9k0n1N1p2R8l4m9Q3Qm6l6M5JRm3L5kQKj2l6K1
3708gj2mO8l2RK0Nl8k0J1K4K5r3J5j1M4j3NK5k3j1L2o6K8l1N3l9j3K4J3m1R1l7
3741Al9J8N3l1j6M6njj8K8p1P5o3J5O3m5m9O9l8L4N3r4Pm0N1m3O7j8n7N5Nl4p
3774b9j6L5j8k9L6k6N7j0Rpj3MK1q3J14Mo1orpJ1J28r9j5K3J3n2QLNJ4jl1qN7
3809B2q4J3N0l1k9Q7n6rK9K0j4M4l0j1N1o8M1j6n7J41j17L2j4QOJ8J6l9O2k5k
3840C8m3M1pl8M1Pl7K8o0O0j1k5n7P9k6l5J1Q2m2R3j77O1O6p4jl3ML4M3m2n3N7
$$ plain form
3872 -16 3 -10 22 7 12 60 16 83 18 47 54 27 24 -23 14 64 -4 21 -34 16 41 15 28 12 -24 -58 -5 -32 38 29 8 -37
3904 -37 -19 -56 -12 -28 20 -37 -38 -2 16 23 30 28 0 -6 63 -35 -15 8 21 -1 -16 21 -13 50 16 20 64 1 18 -51 27 31 -58 -18
3938 -18 0 34 -1 23 14 2 -15 -53 -75 -18 -24 -26 -33 -6 -1 51 -9 -1 18 -9 -10 -6 24 68 13 -24 -12 10 12 6 52 22 -35 53 -30
3973 -30 13 20 -1 14 -26 40 79 15 -63 -35 -47 35 -17 26 4 -8 -2 -49 -30 22 -28 -16 -17 -10 21 -25 -18 45 -21 -10 41 25 27
4006 27 21 -11 -26 -34 2 53 0 10 7 -53 18 -46 -54 -13 -21 -33 -60 34 -9 -35 26 35 -21 -19 10 3 6 -31 9 36 42 -26 4 -27 25
4041 25 22 4 -10 -15 49 18 -8 45 31 12 -10 38 21 -21 -12 -9 8 -17 -5 -8 9 36 18 -30 28 29 -47 4 -20 2 41 12 -17
4074 -17 -28 41 8 -40 13 -10 -3 -15 -7 8 -23 46 -8 19 -8 69 52 32 1 27 17 42 12 28 -28 -1 25 3 23 21 16 21 3
4107 3 25 -21 21 -23 -59 -51 49 -35 -4 -44 -70 -12 34 69 22 -1 -2 36 5 29 -2 28 -31 -2 5 41 -13 35 62 -5 31 8
$$ packed form
3872a6J9j3L2j5NM8m4O7o5K9Pk7lm7L7N0o8K5n5N0K5k6J3j6l6l4N3k7P0rk1m5
3904c7J8l7M4j6M8n7jL6J8PPkk8oO9r8K0K3J3k2j5L7l4O3l4MM4o3J7o9P8Mq9M0
3938a8J8L4l5K4rj2j7l8k2N7okpK7NN2o0QJ9k7jML0M4n5l7J2K2KoM6l0n7Q8q3
3973c0M3Pk1J5m0O6L9o4p8K8j2Q2n2M3k2j2Om7J9N2n0J2jPL1m6PO3o6J1N1j6K
4006B7ol2j5qL6N1n3J0lo0P1o4qM1qj2k7R4m3k6O1Rn6KK9pLl7M0K7Oo8L0l1N2
4041B5lj8j4nO4l1k6N3j4j9k2M8j7m2RLJ7k5J2lJ7K7j8m8N8Jp6N1k4K2L9k9k9
4074a7j1O9l3m8N3k3Pj2QJ5l1O9n4K7k7P7j7k0l1K6j0K5l0J6n6K7K6k2K0knNj8
4107CK2m6M2m4l6QJ00q4L1m0k6N8M6L5m7k3jL8l1K4l1L0n9K9PL6n4M8K7o7L6k3
$$ plain form
4139 8 -33 45 -7 46 31 54 16 30 -55 -66 19 -54 -33 12 -1 -7 12 -47 -38 -16 26 -5 6 33 38 23 -54 53 61 -27 -29 2 1
4172 1 70 35 36 4 -22 8 -15 22 39 -13 44 -29 -13 -9 -42 34 -24 -8 -20 -31 26 27 -22 -3 36 -23 17 20 -35 -21 -20 -27 1 -31
4206 -31 -10 51 35 -49 52 24 53 42 -22 34 20 -33 52 7 28 4 -19 21 18 -30 -34 -59 -61 -4 -53 -41 -54 5 -39 -5 3 2
4238 2 -54 -15 -33 -34 -52 -3 -25 -8 -56 36 -53 -18 16 -9 10 -50 -67 -9 32 9 52 4 45 49 -13 4 20 -7 -10 -39 11 27
4270 27 5 -15 21 -43 -44 -35 -10 57 -30 18 -30 16 -21 -22 -42 20 -12 38 -2 -9 49 -11 20 36 14 -12 33 -12 1 30 -1 25
4302 25 32 -6 9 15 15 -24 47 -9 28 28 23 -22 -10 18 -53 -15 44 -4 -34 -7 -6 -6 -62 7 -21 -30 -1 8 24 -18 -4 58 32 -6 76
4337 76 38 11 45 26 20 -13 26 10 19 -15 14 31 11 -31 -5 -8 34 11 21 -9 -26 -34 -18 40 -6 39 -30 12 -41 -17 29 -25
4369 -25 27 -40 6 -47 -36 8 19 -32 -16 -33 12 3 -10 -9 36 12 -44 -43 -7 6 -31 6 32 6 39 3 1 -36 -8 -55 -4 33
$$ packed form
4139Hm1P8n2N3j5K3l8J4q5j1Q5p3K1M5j3oJ9n9RK2M2l1J1K7Nj5p7J07Qq8kL1j
4172AO9l5Jl2k6L0k3L7J7n2N7p3J6Ml3P6n8J6j2j1N7Jm9J9L9n9M0Ln5J4JpK8l2
4206c1K1O1j6q4J01k8K9j1o4N6j4n3Q5m5K1k4k3M0lm8mk5kN7m9J2j3N9m4L4Qj
4238Bn6L9j8jj8M9k2J7m8R2q9L5L4k5J9o0j7N8M1k3M3m8M1Mo2J7J6k7lk9N0J6
4270B7k2k0L6o4jRK5O7q7M8m8M6l7jk0O2l2N0m0pN8o0L1J6k2k6M5m5J3K9l1K6
4302B5Pl8J5O%l9P1n6L7%nm5J2K8p1L8N9m8l0K7J%n6O9k8rK9RJ6m2J4O2k6l8Q2
4337G6l8k7L4j9ol3L9j6Rl4K9J7k0m2K6lM2k3J0l0j7qJ6N8m6M5o9M2n3K4M6n4
4369b5N2o7M6n3J1M4J1n1J6j7M5rj3JM5k4n6JL6J3l7L7K6k6L3l6kl7K8m7N1L7
$$ plain form
4401 33 7 -20 52 23 24 5 3 2 10 -41 -9 40 13 13 2 -9 2 46 -30 2 -42 -77 -35 -31 6 -4 42 -10 29 18 28 40 3
4434 3 23 28 0 -16 36 0 -1 -4 -16 -14 42 26 -23 5 -15 47 -33 8 1 -71 -33 -11 -26 24 -8 22 1 21 11 39 -44 21 37
4467 37 -25 -10 21 14 11 46 -47 -34 26 5 -19 5 -29 50 -41 -17 -22 -41 -93 10 -22 -18 -18 1 -19 34 -35 -12 27 -55 -16 -2
4499 -2 42 0 24 1 33 -7 -15 28 -29 23 62 7 9 7 -21 -48 53 -5 -6 26 -13 15 -46 -12 12 26 -32 17 -27 -12 -42 16
4531 16 -24 -24 10 40 -35 -6 -10 23 54 27 -71 15 52 -16 -29 38 -6 -5 -8 -5 -29 19 9 6 46 28 20 9 58 -5 28 -17 -19 -16 -37
4566 -37 2 21 -10 -10 -38 35 7 -4 -14 44 19 47 -20 -12 13 24 -13 41 0 -6 17 16 14 -25 85 30 6 -35 -36 -44 56 -57
4598 -57 -26 -17 -42 2 24 8 -2 -5 -6 6 -71 39 0 -57 -5 19 -65 21 -8 14 -33 -27 -5 17 -37 16 -19 7 -32 34 -44 41
4630 41 1 21 25 15 73 3 5 61 17 -24 21 46 46 0 -19 4 0 -14 2 -38 20 -23 31 -43 -14 -3 -34 -67 -28 -4 8 23
$$ packed form
4401C3k6k7P2k9Jj9kjQn1L2M9k7%j1j1J1M4p6L2m4l5M2ML7j0M6n2L9j1J0J2l7
4434CK0Nk8j6N2l6jlj2KN6j6m9K8k0O2q0M1pp2L8K2j5N0l2L0k1K0j0K8q3O5J6
4467C7o2J5L1plL5r3J3O0k1k4K4l4P9r1K4nj9n2J03l2M%J9k0N3o9K3L9q2L9J4
4499bM4m2K4k3L2m0qM3n7N2L9n5Kkk8k7J01n8jL2l9K8o1L4K4J4n8M9m4J5l0N8
4531A6m0%L4L0p5K9mL3L1k7r8Q6L7o8j3O7m4JlLk4M8j0lM0j8qj1M9o3L3m5kLk1
4566c7L9J9l1%k8P3k8j1j0N8k5K8o7QK5J1l7N4m1oK3jkl9J10n5k4m1jqJ00j13
4598e7L1Rk5M4K2j6j0ljJ2p7J10l9n7N2K4q4Q6k9K2m7OK2K2n4N3l5K6l9O6p8Q5
4630D1m0K0Mj0N8p0KN6m4m1M5K5%m6j9K3mj4J6m0N8m3N4p4K9J1l1l3L9K4J2J5
$$ plain form
4662 23 19 34 12 -20 -27 -33 4 23 -9 -18 8 16 36 16 16 34 13 -18 -5 -1 22 -5 6 -13 -2 -33 -43 33 6 -11 3 -56 -24 -53
4696 -53 -22 6 49 -10 -16 10 -21 19 -5 -32 -2 13 -28 -26 -17 -21 -27 32 8 -63 32 26 -5 46 75 7 30 22 34 -5 -27 102 16
4729 16 29 -41 -20 16 46 -57 -21 -50 4 9 -30 -27 -51 6 18 18 31 29 5 -35 40 -58 -15 8 -16 2 -71 -15 -30 33 21 46
4761 46 45 56 -11 15 19 40 13 -5 3 -4 -2 11 -8 2 -2 24 -32 -53 32 -2 -1 -42 -22 -18 44 -31 -10 -5 6 -7 37 21 46 -34 36
4796 36 15 6 8 10 18 1 23 -33 30 44 -23 20 31 34 -48 -47 2 -29 36 -5 26 -47 16 15 -22 -3 -28 -2 -6 19 -17 -14 21 -68 -36
4831 -36 21 -46 -4 18 38 -9 -27 -37 13 28 14 -45 -1 59 -5 6 24 10 9 5 22 19 -23 -26 31 -32 -29 -39 21 0 -8 -17 13 40
4865 40 -16 27 -78 -40 31 12 -34 -27 5 -2 -2 -20 3 19 -5 -24 -4 -8 -19 7 -73 32 -18 13 30 -1 -6 -11 35 0 19 23 25
4898 25 12 -7 -14 -22 23 -22 3 28 -28 -25 23 -31 23 -15 -35 1 -68 16 -54 -5 -32 18 34 -9 17 -17 47 -6 2 38 -2 -34
$$ packed form
4662B3mJ5k2l2poL7J9l2rK6QK0k0%J8k1l1J3MK3k7J1j9J1l1j0P6k7j7J4n9L2k9
4696e3L1K8M3n9oK6l1M0k4k7L0J5m1KRmoN9k4p1R5ol1N1K9o8K3qJ2l9k2J29q6
4729A6J3p0K1L6L0j03L6k9N4Nl9Lk4N7J2%J3kk4m0P5r8M3K3k4J8p3N6j5O3j2K5
4761D6jJ1o7K6MK1k7j8QpKJ3j9J0mK6n6k1Q5l4Jm1K0MO2p5K1NJ1j3M4j6K5q0P0
4796C6k1rKKQj7K2n6O3J4o7M3J1Lq2JM9l1O5m1L1p3O3jl7J9k5K6mK5l6LL5q9L2
4831c6N7o7M2K2K0m7j8j0N0J5j4n9M4O0o4J1J8j4jmJ7lm2lN7o3Lj0O0k1qrL0K7
4865D0n6M3j05L8P1j9m6PL2p%j8K3J6k4j9K0mj1K6q0J05n0L1J7l1nnM6l5J9MK
4898B5j3j9pqM5m5K5K5n6LM8n4N4l8k0L6o9Q4p0M9k7N0J6m3K6l4O4n3QL6m0l2
$$ plain form
4930 -34 -25 3 -23 46 20 76 20 -32 28 70 -13 -2 0 36 -15 36 5 9 -8 -43 -54 -10 2 -8 -56 -5 5 -30 19 -22 100
4961 100 -34 -25 -12 35 16 3 -31 -26 -30 -18 22 44 23 9 16 4 -44 -16 22 -42 18 23 -52 32 0 -27 -17 -16 16 -19 8 -11
4993 -11 -38 -7 -18 -35 22 10 12 -21 -53 31 -6 -34 53 7 -43 39 -27 -12 -5 0 64 6 1 8 47 20 -17 -7 -4 -3 16 17 -34 -30 -23
5028 -23 -34 16 9 3 44 40 35 11 -44 6 -46 -20 -24 13 -58 -13 -4 -50 -38 -1 -10 10 -6 40 10 -45 -4 -6 26 3 11 8 -2 -9 5 -26
5064 -26 -8 -11 64 -1 25 55 -11 -54 -1 -43 -17 19 -27 6 -24 -3 22 16 1 -36 -44 9 14 -23 -29 18 8 -7 33 34 33 -10 -23 16
5098 16 38 -11 -30 -9 -28 52 17 -34 7 -1 46 -6 -12 -8 -19 -57 -53 -25 13 -4 46 -16 58 -32 -34 3 -32 4 -46 55 25 -17
5130 -17 -4 -47 1 33 19 -6 -17 -14 13 36 -10 20 24 -39 48 -38 -33 -7 12 -37 -3 42 10 48 -23 14 -4 -11 34 22 1 -10
5162 -10 -18 -8 -3 -15 -36 -24 -33 -3 -17 3 -45 -27 -19 -1 57 0 19 -36 24 -12 42 40 41 0 4 30 7 55 -8 7 24 8 0 2 21
$$ packed form
4930c4RK8k6O9k6N6n6n2O0M2q3J1KL6n1N1l1Mj7l5j1M4J2j0m8N1J0l5M9m1J22
4961A00j34RJ3M7j9j3l4NmJ2M0K2k1j4Pj2m8K8L8o4O0Np5Q4l2k7J0JL2l5K7j9
4993a1k7L1j1j7N7j2Kl3l2Q4l7k8Q7m6n0Q2o6J5PNO4n8nPL9k7l7J0LJJ9Jn1MP
5028b3j1N0poM1mnk4n5N0n2K6mL7p1M5Rm6J2L7rK0j6M6l0n5M1kL2k3Qlj0pJ4l1
5064b6J8lP5o5K6L0o6m3N3m2K6L6m6L3l0K1K5oj5l7qN3Nl7oM7j0j5M0Jjm3j3L9
5098A6K2m9j9K1j9Q0l5n1M1qM7n2oMj1l8MK8L8j7N0o2P4r0kL7l5L6n0J01l0m2
5130a7J3m3M8L2j4k5j1LK7K3m6L0Mo3Q7q6NK6J9m9L4M5l2L8p1L7j8pM5j2k1j1
5162a0qJ0Nj2k1J2rL0j4K0m8J8QJ8N8n7J9n5O0l6N4kJm1MK6k3M8o3J5J7j6qKJ9
$$ plain form
5197 21 -20 -27 11 -47 -27 14 1 -7 -24 53 -28 33 -26 -40 27 -19 -23 12 14 -44 -45 54 2 8 14 -25 -28 -14 13 56 28 8 33 21
5231 21 -43 34 11 -23 -47 47 8 17 49 7 3 10 -2 -48 -5 -7 -15 21 -59 -22 0 13 60 -41 13 -16 40 -6 -17 -18 3 -2 12
5264 12 49 6 35 -30 32 18 24 0 -7 6 -10 -9 4 -3 -14 -16 -11 32 13 16 -10 -34 -6 -37 -4 -77 -60 -25 -49 -42 -36 33 -11 -59 -13
5299 -13 77 48 3 20 7 30 22 48 12 40 -49 18 -15 -12 -10 20 -11 -11 13 -1 33 -16 22 31 -2 6 -35 37 6 -48 64 -28 -25
5332 -25 17 4 14 -4 13 35 4 -22 -22 9 -2 -48 3 8 -40 16 41 31 -4 3 -15 0 6 23 82 28 -36 -24 0 36 -17 -5
5364 -5 24 -24 -45 -16 -39 -10 -21 -39 -45 -32 3 -74 0 19 -20 -2 36 -23 53 -24 28 -5 40 -39 -9 25 73 -14 -9 71 18 47
5396 47 -38 5 19 29 4 -57 22 -11 -14 -19 11 19 -60 30 3 36 -28 -22 -11 10 44 -30 20 12 -59 -28 32 -23 20 -39 15 5 -15
5429 -15 25 -43 13 -3 38 -18 34 -23 19 -41 -5 -6 37 -63 34 48 47 -32 -5 1 -39 19 -20 -10 -6 -3 -11 -35 18 -14 -1 1 -33
$$ packed form
5197B1m1pL8n8K0M1j3qj7P7q1O1n9j4O7m6mL5Kn8jR9n2OOl9lJ4K7M3k8k0K5j2
5231B1o4P7k3l4k4R4l9RL2m2mPj2m6M3kqL6q0L7K2J3M7j01N4k9N6m6j1jK1nJ4
5264A2L7m3K9o5O2j4Ok4pJ3j6JJ3pj1kNM3j9Lk6k4K8l1L3p3J7L5k4POO9m4m8M6
5299a3R0k9m5J7j3K3qK6l6K8q9O7l3LKL0l1%K4j4L4m9L8Rl3Qm1P2l1n4J12r2L
5332b5M2j3J0j8J7K2l1k6%L1j1m6N1Nm8N6K5j0l5Pj8J5OJ7N9n4o4J2K4L6n3J2
5364eK9m8k1K9k3K9j1j8oJ3L5p7P4J9l9J8L8n9P6p7N2l3M5p9L0L4M8q7NQ0n3K9
5396D7q5M3J4J0k5o1P9l3lnL0Qp9R0k7L3o4OJ1K1L4p4N0qp1L1O0n5M3n9N4j0k0
5429a5M0o8N6j6M1n6N2n7M2o0L6jM3j00R7J4jp9K7Om0N8l9J0MLqk4N3l2J3Kl4
$$ plain form
5462 -33 14 -36 -50 -17 -16 -8 26 -2 -11 -22 17 -11 41 17 -24 -14 17 17 35 6 0 -24 2 17 -45 -32 2 -14 -32 -32 31 -55 28
5495 28 -1 -22 -18 11 -25 -60 -17 -4 -12 -5 7 -16 19 -16 -14 -34 -23 -67 22 -11 12 5 -40 -13 17 31 -35 3 24 32 -24 -15 33 27
5529 27 -37 -30 -31 23 30 -41 -40 1 -16 12 5 31 25 -20 13 -69 -58 26 -9 -29 5 -2 -12 -4 7 -55 21 51 25 11 20 5 18 67 51
5564 51 -21 13 19 16 42 72 5 -20 1 16 -21 6 -53 -20 19 -10 -55 -12 -21 10 0 -45 4 -25 -92 -8 1 28 23 -30 18 -34 -27
5597 -27 2 -3 39 -42 1 5 24 11 -78 14 -9 4 53 -18 15 -1 23 -49 25 63 27 14 -34 23 -7 28 18 16 -23 44 -28 22
5629 22 -3 -54 15 -56 7 -43 -21 -16 -8 -27 14 -9 101 30 -16 -36 -58 31 0 23 24 -9 -10 -6 -28 23 16 34 -40 -12 -3 -5 10 -13
5663 -13 29 -12 26 38 -29 0 -4 -27 -6 45 -9 -30 -22 6 43 42 -59 -27 15 15 5 -24 9 3 29 12 -16 28 -18 -39 6 18
5695 18 68 9 9 -33 -20 18 28 14 -4 21 61 -16 20 10 -48 -3 -26 14 -8 62 -3 -16 -66 -14 -13 23 -33 19 32 45 -12
$$ packed form
5462c3M7n0j4L3JQL4k8rj1L9k8N2k4m1J0L1%J8k9ok4K6J5o2J3L4j6j8%O3q6Q3
5495B8k9k1MK9l6l5M3J3qPJ2k3L5l5Kk0J1m4Q9l3K3pm5K7L0J4o6L8K1Qn6RM8o
5529B7o4PjN4Pp1JM1j7K8pK6om5L3q2J1Q4l5k0L4pj0QJ1o2P6L0k6j4Rj5J3M9j6
5564E1p2L4OlK6L0o7k5K1J5l7K7n9L3L9k9m5M3rL1j0m5M9k9o7Q4RK7nn3M8n2P
5597b7K9nM2q1M3MJ9j3q9R2k3J3M9p1L3j6K4p2P4L8l6j3m8N7l0L5j0kl9O7p2N0
5629B2k5n1O9p1O3n0K2NQj9M1k3J10p1m6k0k2Q9l1K3Jl3jMk2N1pJ8p4K8RkJ5k3
5663a3M2m1L8J2o7K9mk3K1N1n4k1QK8L7jj01L2M2%j0k9L3oK6j7k8M4m6k1M5J2
5695A8N0n9%m2J3L8J0j4j8K5M0p7L6j0n8M5k3M0k2P0o5j3n0N2JL6n6N2J3J3n7
$$ plain form
5726 -12 6 42 -16 -4 48 60 45 16 -12 10 23 67 -3 43 44 16 6 5 -3 52 -7 6 -6 -17 -21 -15 27 -22 31 35 -27 3 -15
5759 -15 3 -5 -19 -26 -17 21 65 -12 -13 6 18 22 23 4 7 -12 -6 18 41 11 51 -7 27 48 31 -8 21 -48 -21 45 -11 -15 -81 -36 18
5794 18 -15 -46 -30 -11 -36 -49 -28 -37 14 -14 -2 -26 13 19 40 -23 34 6 54 -10 13 1 -18 5 36 30 6 19 7 62 -17 -11
5826 -11 8 -43 75 43 -5 36 -1 -21 -6 4 -8 -13 4 58 29 10 -43 -30 19 34 -9 -13 -27 -6 25 -12 27 48 7 35 1
5857 1 60 42 10 10 18 76 -28 62 12 -11 -43 -21 11 20 50 -10 -21 -56 6 7 -22 -31 6 9 15 -9 -20 -6 10 70 -14 16 41 19
5891 19 21 16 0 33 29 -7 -4 58 -16 43 32 6 19 10 -2 35 -14 22 0 -36 66 -21 -21 -24 17 -7 18 -8 28 -38 -13 -46 30
5924 30 -58 -16 13 -16 4 6 -38 31 -43 33 3 5 16 -10 -62 25 7 -18 20 7 23 22 -12 -22 1 26 74 29 34 -32 91 3
5956 3 -44 -33 30 -27 2 -20 50 -3 8 -65 -32 -10 1 39 34 38 -26 -33 -13 -44 20 -6 38 2 -39 19 -9 -37 -13 25 -29 15
$$ packed form
5726a2J8L6n8J2N2J2j5k9k8K2J3M4p0M6Jk8j0jqN5n9J3j2j1mOM2m9N3Mo2L0j8
5759a5J8qj4pRL8M4p7jJ9J2MJj9Lj9OK4K3l0M0n8L4K1j7l9K9o9K7O6n6mo6M5N4
5794A8l3l1J6J9k5j3K1rN1k8J2k4L9OK1o3N7k8M8o4K3j2j9K3L1ok4J3j2N5p9O
5826a1J9n1J18l2m8M1l7k0J5J0j2nJ7N4k9j9n3J3M9J5m3mj4K1L1l7L9K1m1K8l4
5857AN9j8l2%QN8j04R0n0k3l2K2L2RL0o0j1l5O2Jk9rL7LOk4j1J4J6O0q4L0K5k2
5891A9Knj6L3ml6LO2p4N9j1k6J3rj2L7m9L6k2l6J02q7%lM1k4K5k6L6o6K5l3P6
5924C0q8M2K9k9K0Km4O9p4P6l0KJ1k6n2Q7j8k5L8j3J6jl4j0K3K5M8m5No6J23q8
5956Cm7J1O3n7K9k2P0n3J1p3L3K2J1L8nMo4pK0l1O4k6M4l6m1N8k8k8K4L8n4M4
$$ plain form
5988 15 30 2 -5 -48 -23 -38 -29 50 -36 -9 -43 27 8 -7 -4 -40 15 20 -26 -44 -50 5 71 -8 -37 -5 -10 -18 -8 -2 6 -2 -38 -53 39
6023 39 22 -59 -14 20 -3 13 13 39 -7 -18 18 18 -18 25 -49 1 -17 -33 19 2 -7 -38 -37 10 -48 -43 -16 -35 -2 5 -56 -10 64
6056 64 0 -5 -11 48 -14 -51 57 12 1 21 5 50 13 0 50 -30 -20 -50 2 9 -6 -27 -20 23 -11 5 39 3 -10 -7 8 23
6088 23 -10 5 -53 -38 -9 -26 -75 -28 21 9 7 47 19 59 23 4 18 38 -75 -11 26 12 38 -20 1 -12 82 10 -20 -9
6118 -9 16 -9 -6 -45 -12 -17 -8 24 -14 -1 -28 -23 -9 -23 -27 -24 16 -11 6 -21 25 19 -14 -30 10 -42 37 13 0 -11 62 16 26 2
6152 2 -15 49 12 -25 27 6 -42 -5 -12 27 -23 -46 29 -22 -2 14 -14 -11 -63 -53 15 -33 -38 -16 -60 8 49 -37 -12 26 -3 39
6184 39 -9 -42 -43 -18 25 -9 45 15 25 27 3 -26 -26 24 56 -7 -40 29 -16 4 -18 31 -34 3 13 -32 -8 11 -46 17 7 3
6216 3 9 -40 -16 -42 -8 -39 41 -13 19 -22 -21 8 -6 2 -98 -2 -18 -27 7 7 -15 25 16 48 3 60 -18 19 8 -24 8 -30 9
$$ packed form
5988A5J5k8pm3K5j5RP9q6K7l4P0j9j5Ll6N5Nm6j8oN5O6p9k9L2nqJ0OQql6j5R2
6023C9j7q1M5L4k3J6%K6m6j1L6%l6M3p4N0j8j6N2j7rl1JM7n8NK7j9L3Po1M6P4
6056F4o4noN9o2l7J08m5j1K0j6M5l7j3N0q0J0l0N2Pj5k1PM3l4J6L4l6j3LJ5J5
6088B3l3J5n8J5K9j7m9M7M9j2kM0k8M0l6j9J4K0j13O4L7j4K6n8K1j3R4p2l0J1
6118iK5k5Ll9L3nRL2l8J3k7NJ4j4mLM0k7J7k7M6ol3j6M0n2P9k4j3j1P3m6J0k4
6152Bj7O4l7l7N2k1m8L7pL9n0k3P5n1K0J6k8Ln2J0O8m8nK2m4O8M1q6K5L8k9M2
6184C9m8l3jK5M3l4N4l0J0Kk4k9%N0L2o3l3O9m5K0k2M9o5L7J0m5K4J9n7O3j0m
6216COm9K4k6L4l1Q0n4L2m1JK9j4Qj00R6j6rL4%k2M0rL2m5N7p8L7j1l2L2l8L9
$$ plain form
6249 9 4 -64 -4 34 -31 -22 -22 25 -82 8 32 3 15 -4 -24 13 -3 55 -14 42 -8 -10 -41 24 32 -13 -53 -47 -11 33 41 -15 -14 17
6283 17 -33 -30 18 -2 -4 -52 -42 -18 20 -72 -2 17 -44 22 -4 -12 -7 -17 -21 -53 -10 -38 5 18 -27 29 -55 34 -57 -1 -37 -1 -29
6316 -29 35 23 -23 35 43 -4 30 9 -2 50 -18 -72 28 21 61 35 3 49 12 5 -34 -55 -39 41 -23 41 -18 -59 3 -8 -53
6347 -53 -5 14 -45 -3 26 -51 -18 71 0 34 2 32 -49 106 -9 0 -5 16 21 0 -6 33 -38 -24 13 25 22 18 -34 -34 -72 12 14
6380 14 -25 6 7 -17 48 9 -37 -33 21 7 -10 5 -24 -5 20 -19 15 -54 -4 -5 -6 54 -29 -31 -29 -7 -34 1 44 26 13 -25 10
6413 10 -20 17 -25 -14 -23 18 -47 -12 -42 -8 -51 -11 -22 11 0 -11 66 -1 -47 5 31 20 -30 28 30 -38 26 28 14 11 7 36 47
6446 47 58 29 6 16 2 72 -19 -14 59 -18 -12 3 24 -27 18 14 -1 -3 -18 -23 -51 -15 -50 23 1 12 0 -13 30 6 -7 -46 -37
6479 -37 15 21 -23 -34 14 11 -7 28 17 -5 1 42 66 42 -60 29 0 31 -27 6 -8 6 -42 -23 -44 -62 75 8 -1 62 93
$$ packed form
6249Ino8O0L8o5R%M7j07R0K4k9J2j9k0L7j6N8o9N6n0kl1O5Qm5m0OL6M4Qn6JL1
6283A7n0LM8k0km8J0K4L8r2P0J9o1O6k6qNj0ml2M3k8M3J3m5N6q4Q9r1N6l6L6k8
6316b9O4j2m6N8Qm7L4k1j1N2o8n4J00pM0k6l2M6l7pl9k1J6Q0o4O4n9m1O2j1m5
6347e3M8J9n9M2K9p7L3Q9p1L4l2L0q1J55j15RnK1Nk1oL9p1J4L7J2lmn2%l8Q4K
6380A4l9L1Jk4O5l9m6MN4j4j7J5k9J9K5l9L4o9N0jjO0q3kKK2k7L5M3j8j3l8L5
6413A0l0L7m2J1rM1o5L5l0L4m3M0j1L3j1j1P7o7m6N2K6j1n0N8Ko8O4Kj4lmK9J1
6446D7J1k9k3J0j4P0r1NP3p7OJ5K1n1M5mj5kj5nk8L6l5P3k2J1j2j3M3k4j3l9R
6479c7N2Om4j1M8lj8L5j1k2OM1K4k4j02Q9k9L1n8L3j4J4m8J9k1j8J37o7rO3L1
$$ plain form
6510 93 30 3 14 14 4 -14 -34 -44 -44 14 22 52 8 -9 13 7 -23 19 43 -50 35 11 -19 2 79 -11 -60 32 -31 0 -1 -2 -82
6543 -82 8 -15 -42 15 -6 -35 4 -33 38 5 5 15 -11 -21 -33 48 -25 6 -1 -32 21 41 14 -38 33 46 -3 4 35 -62 58
6574 58 -15 -55 5 -9 -43 1 -17 -10 13 33 -31 48 76 13 38 11 -11 -23 -6 -45 -22 41 47 10 -33 -42 22 -3 0 22 -2 -24
6606 -24 30 -16 -10 36 28 11 24 -18 -15 -10 -28 25 -15 -2 2 32 -8 -26 -21 -26 24 15 -37 -56 -58 -1 6 -1 -60 23 -12 29 1 -15 -49 -54
6642 -54 32 24 -2 -18 -4 -1 -8 -18 -6 78 65 59 57 37 12 -14 19 -27 -38 12 -7 -4 28 -10 -9 -11 -1 -2 -12 7 23 22 0 -10 -31
6677 -31 3 -30 -20 -13 -33 -43 22 -16 -20 -28 -10 -15 -20 -21 -39 52 -11 47 -13 17 -65 13 -15 -44 28 23 -15 -35 11 -59 7 38 -15 -23
6711 -23 11 -29 13 -32 -72 -22 -10 10 38 15 -17 13 -50 15 -38 12 20 28 -21 -39 10 44 2 -1 21 2 18 -84 13 -36 42
6742 42 20 29 24 -32 -39 24 11 26 -46 -4 24 -27 -24 24 11 -4 -26 -11 52 18 17 -23 -66 -63 0 -59 -35 15 -58 -36 -36 -23 -9 -15
$$ packed form
6510I3o3k7J1%j0j8k0j0%N8QL0m4j7K2ol0M2K4r3Q5k4l0K1P7r0m9R2o3L1jjq0
6543h2R0k3k7N7k1k9L9l7P1l3%J0k6j0j2Q1p3L1pl1N3K0k7n2P1J3m9PL1r7J20
6574E8p3m0O0j4l4M4j8PK3K0o4P9K8o3K5k7k2j2J7l9K3O3Ol7m3rO4k5LK2k4k2
6606b4N4m6OM6qj7J3m2LNj8N3m0J3ML0m0j8NnN0rn2j9kN7Ppn9Q3l5M1k8j6l4n
6642e4Q6qk6j6J4Lpj0J2Q4j3okk0k5k6L3m6j1N0j9LL2l8JkJ0jj0J9J6jk2j0k1
6677c1L4l3J0Pk0j0O5l8mqJ8nnjj8R1o3N8o0L0q2P8k8k9P2nl8k0M6p0O6L1n3q
6711b3L4m0M2m5m0N0J2K0K8k3l2L0o3O5n3N0QQm9j8M9L4m2lK2j9J6j02R7m9P8
6742D2k2Rnn6pO3j3J5p2M2K8n1LM8j3j5k2J5O3l4jm0m3LO3n9K4N0p3K2%J3J4o
$$ plain form
6776 -15 11 -1 -50 -16 -12 -52 -12 -42 -33 39 -19 46 67 -27 -29 -112 19 -23 -29 3 71 29 11 3 -15 15 -32 24 -19 -12 -3 -3 -15 -26
6810 -26 -8 43 -24 -8 3 -4 17 -21 -1 8 -3 -19 32 49 28 -4 6 -38 -29 -34 51 79 -14 1 -5 -17 -13 12 25 -23 1 15 -6
6843 -6 -35 -5 13 7 -2 -12 -4 17 -30 19 -33 6 33 42 17 61 -32 11 1 37 -8 27 44 -2 -13 -11 37 18 33 23 -3 29 22 24
6877 24 50 1 29 -4 -8 27 -53 -53 -60 -31 -52 -46 -10 41 5 -12 71 -1 30 50 -29 9 -23 -7 -18 0 -14 -24 14 12 3 -14 25
6910 25 -51 46 5 8 -43 6 -6 62 29 -37 18 -16 42 1 19 9 -21 -26 -16 -7 -10 -39 -19 24 19 -5 -8 -60 -33 -1 -26 20 -1
6943 -1 5 22 -49 38 40 17 50 -6 -28 -50 5 -5 -20 30 12 47 -34 -57 57 16 -60 8 35 -9 -2 -62 26 35 13 13 -14 -41 -31
6976 -31 -77 -35 -80 -33 10 -30 4 2 -36 -51 21 -22 83 5 22 10 -9 36 34 9 29 -18 12 8 15 48 -16 2 -8 -39 17 11
7008 11 -45 -12 -18 -15 -58 8 -46 25 -25 37 -52 -47 -21 -9 1 10 -27 -1 3 17 56 -18 1 17 -62 -24 20 26 35 35 41 24 32 -17 -16 23
$$ packed form
6776a5K6j2m9L4Mm0M0l0RP2n8O5K1r4kq3J31m2oL2O8m2j8qj8L0m7N6m3PR%j2j1
6810b6J8N1o7J6J1pK1l8K0Rj1j6N1J7k1l2J0m4RnQ5K8r3J5oj2MK5J3m8K4J4k1
6843fk9L0J8orj0QK1m7M9n2L9K7Rk5M4r3M3j0L6m5L5J7m6j1KM8j9J5j0k6L2pK
6877B4K6m9K8l3mL5q0%pK9k1OL6N1l6j7Q3p2L1K0p9L8l2J6j1J8j4j0L8krj7L9
6910B5p6R7m1Ln1M9j2O8l3o6N5l4N8m1J8j0l0nJ0Rlk9K0M3nk4ln2K7L2k5M6k1
6943aOJ7p1Q7Kk3L3n6k2k2N5j0j5N0j8L5q1k3J14m1p6O8K7m4Po0Q8Rk2%k7k7J0
6976c1m6M2m5M7M3m0L4kl8j5P2m3J05p8J7j2j9M5kk5K0m7L0mPL3o4J8j0l1N6o
7008A1n6L3oLm3O6n4P1n0O2q9NK6J2J0Rl7K6MJ4L9p4J9J6p9L8M4OR%Oj7Qm9JL9
$$ plain form
7044 23 -30 -3 -13 -27 46 5 -6 -6 -28 -1 -42 9 -53 2 3 10 -27 15 19 -30 16 -2 12 16 50 -2 31 -4 35 10 0 61 17
7077 17 6 1 19 37 2 22 26 -27 -46 -46 15 8 11 27 -8 -19 -2 -7 23 -25 -32 -20 13 35 -11 -19 0 54 -13 -2 -24 11 -2 -5 -7
7112 -7 -32 1 -23 85 36 1 26 18 4 19 -11 39 2 11 -33 -17 -20 -19 23 -10 -49 17 49 54 -30 -17 -17 -6 20 1 -17 -46 -1
7145 -1 43 5 -42 5 -16 -23 -19 15 12 15 31 3 -4 2 -29 -5 60 3 27 21 58 2 42 55 35 -39 18 -11 23 22 8 -24 -25 3 2 12
7181 12 5 3 17 -10 56 35 -5 -5 -31 -4 -20 16 12 -11 36 18 -13 -36 -15 4 14 36 30 -3 8 -29 39 56 20 2 -19 -10 71
7214 71 47 -21 -14 -13 57 -49 6 -46 7 -65 -19 -12 -27 -4 42 -22 2 7 -78 12 -27 -36 -13 -6 -30 41 -28 2 71 18 60 9 12
7247 12 -16 25 -2 -3 6 33 -40 -8 -6 38 1 5 43 -3 68 2 39 20 -4 -29 -69 7 -11 -18 -41 14 1 -49 -23 -13 2 12 -6
7280 -6 35 39 3 22 -14 46 69 20 -16 23 31 1 45 75 19 15 23 13 -14 46 11 38 -15 -20 92 -5 3 -13 -37 -25 -13 3 -6 64
$$ packed form
7044B3n3K7j0j4P3m1j1%k2K7m1N1o2N5JPl7M2Mm9M6j8J4ML4n2L3l5L9k5j0O1m4
7077A7j1nJ8J8l5K0Mn3j9%O1pLJ6l5j1J7nL0m8pJ2L3K2m6qJ9N4o7J1k2L5j3lk
7112gk5L3k4J08m9l5K5qj4J5l0N0l7Rm4J6lJM2l3l9O6L2Nq4J3%J1K6j9j8k9M5
7145aM4l8m7M7k1pML4lLJ6k8pOl1K4O5n7K4oL7n6M0J3k0p4N7k9L4jj4l2jK8jJ0
7181A2pkJ4k7O6k1m0%k6K7j6L6mk3M7j8l1k3K1J9J0K2ol3J1l7O8J7l6j8k1RQ1
7214G1k4o8PJP0j06N5n2N3p2M6Pj5K3M6o4K4Nq5R0l9rK3Pk4P1o9L0O9n3M2n1L
7247A2k8M1k7jRK7p3L2KM4l7ML8m6P1o6L7j9k4k5m0P6j8pk3N5j3n0K6J0J5J0j8
7280fM1Ml6J9l6O0K3m9l6L9Ql0M4L0n6mQj0k7O0l5K7n3nJ12r7Qj6k4J2J2J6rP0
$$ plain form
7314 64 -14 6 -27 -10 -19 46 7 22 64 0 -18 -24 -1 -30 -3 5 18 50 35 52 -8 -22 -18 1 -1 -6 -16 29 -8 11 24 18 50 15
7348 15 17 -14 -69 52 -21 0 -4 -35 6 -63 13 -4 -47 15 -48 -4 -8 -20 29 -24 -29 -16 -5 -21 -1 22 12 -3 -6 -1 -38 -32 13
7381 13 -7 -3 4 -38 5 -17 8 15 0 16 30 -41 -35 -9 -10 -64 -35 -19 40 -42 -3 11 -39 0 -46 -30 -35 8 -12 -56 59 -1 14
7414 14 58 37 -7 -25 34 -6 6 -15 22 -7 0 -3 -5 -55 -34 -4 20 25 -11 -54 -2 -16 -5 -76 -14 19 -2 -25 -49 -54 -15 12 48
7447 48 38 -19 11 26 33 4 43 37 5 -10 -31 -31 -69 25 -3 80 -84 23 6 -42 24 -25 4 -27 -9 -28 -62 -47 -4 -25 3
7478 3 30 -6 -19 -29 23 -16 15 -12 -17 13 12 26 32 0 14 -3 49 2 40 5 -1 20 -47 29 23 65 49 24 30 -23 -26 11 -70 27
7512 27 6 -3 28 5 -25 -86 -58 22 38 -3 -27 -13 28 8 -1 -12 19 14 -3 -9 -34 37 -6 16 1 -10 42 28 -1 -55 23 38
7544 38 57 -4 -43 -43 -25 8 -59 -4 -4 -14 14 7 -41 -33 -73 -51 -9 39 -80 -9 -50 2 41 -39 36 -24 11 -45 -12 -37 -22 -10
$$ packed form
7314F4p8K0l3J7rO5l9J5M2o4j8oK3k9K7QJ3L2j5J7o0j4MJ9knj0M5l7J9J3oL2l5
7348A5Kl1n5J21p3K1ml1M1o9P6j7m3O2o3M4mj2M9n3nJ3J1j6K0K3j0j5lNl7OM5
7381A3k0MPm2M3k2K5Pj5J6J4p1OK6jn4K9J6N9q2L9J4n0L9m6J6nM3k0m4J15o0J5
7414A4M4k1m4j8N9m0J2k1L7k9Plkn0K1L0K4Nl6m3N2j4J1p1O2L3k1k3k4nL9K7L6
7447D8j0n7L0J5Pk9L9ol2j5k1%l8R4k8Q3j64J07j7m8O6m9K9l1J8j9l4J5M3k1K8
7478CK7l6j3j0N2l9L1k7nL0jJ4Ol2J4j7N2m7L8l5oK1o7P6oM2j6k5On3lL7q1R7
7512B7k1rL1k3l0o1K8Q0J6m1k4J4M1k0rj1L1nj7ok5P1m3K2j5j1N2j4k9n4P8J5
7544C8J9o1l9%J8L3o7N5%j0K8pm8Qm0K2M2M8j19P1m1N2L9q0P5o0L5n6L3k5J5J2
$$ plain form
7576 -10 8 17 73 -5 14 -3 42 -24 16 60 -25 -5 -27 -34 -70 -2 41 23 1 -40 38 -27 13 35 12 15 20 -2 0 -8 -43 61 7
7609 7 3 5 -3 5 14 -12 38 3 31 19 -12 7 -30 33 -26 3 11 -15 -11 14 56 -14 -27 -41 -42 36 -23 18 -47 -7 -57 15 -45 -11 27
7644 27 -15 13 -24 40 67 -30 -11 26 -28 45 0 -5 17 -30 -11 10 13 3 4 -7 -51 93 15 9 -30 20 6 -56 2 -55 1 -48
7676 -48 -18 -23 20 -48 -5 -39 12 47 -29 27 -33 -22 7 -91 -36 -5 0 -21 -72 1 -37 15 -11 -22 -53 45 -33 -9 51 31 -19
7707 -19 -39 -29 -40 10 60 -37 50 14 -27 45 -56 -27 -14 31 83 -40 -58 -15 15 1 -30 -49 1 -23 -34 43 29 -22 -33
7736 -33 -43 -25 45 -14 27 -32 28 -4 -33 -7 -16 -1 -4 3 -12 -23 -54 -25 -50 46 14 26 3 15 43 -22 3 32 -25 -34 -21 -10
7768 -10 -90 -2 -46 -25 -4 -8 -29 -39 3 -52 -36 -22 -14 11 3 -12 11 1 -68 -32 7 29 -21 -40 -34 -41 -16 -45 -10 1 -11 -26 -39
7801 -39 0 20 40 -19 59 -8 -30 18 12 27 -7 36 -34 -7 27 10 -32 -75 -47 -28 -7 7 -27 -26 -38 -18 -14 -5 -15 25 7 -13
$$ packed form
7576a0J8RN6p8J9j7M5o6M0M4q5K0k2pl6O8M3j8k2m1P8o5M0K2k3LNk2Kql5J04n4
7609GmKqQRk6N0l5K8j2l1J9l7O3n9K9Qk6MK5M2p0j3j4jP8n9M1o5M0n0P2o0L4L8
7644B7m2K8l7O4K7r7J9L7n4P3m5nK2m7J9K1Lj0Jj1m4J44p8ol9N0j4o2N8n7N6m9
7676d8L0nM3o8M3l4N1L5p6N6o0J1K9r8N5L1Nk1n1P3l8N2k6j1l1R8p8K4O0k0n0
7707a9k0J0j1N0N0r7Q7l6m1P2j01K9J3M5N2j23j8M3L0j4l1j9N0k4j1P7j4n1j1
7736c3j0J8P0n9M1n9O0l2k9K6rJ5lPj5j1l1K9k5R6l2J2k3J2K8o5K5K9n7rJ3J1
7768a0q0Q8m4K1K1mk1j0M2n5J6J4QK5qj5K3j0o9L6L9K2n0j9OpK5k9L5J1j2j5j3
7801c9L9K0K0n9P8o7k2M8oJ5l4M3p0K7L4j7m2m3K8J9K1J4l4Jj2K0MRj0M0j8k0
$$ plain form
7833 -13 11 -11 16 -13 56 -25 -20 -29 -5 -61 2 16 -27 7 42 13 12 -35 -76 -58 4 -6 -20 -32 -16 -38 -1 71 9 -26 6 -67
7865 -67 -9 -1 -56 -12 -116 9 -19 -44 68 -10 0 -37 24 -29 -7 -10 -35 32 -23 5 -29 -4 -38 43 62 -10 16 16 -70 23
7895 23 1 2 -6 -23 -53 -26 -2 13 52 0 -54 -25 -18 17 65 9 24 -40 -20 -26 -24 50 6 -68 3 33 39 10 -20 -8 35 -1 27
7928 27 -6 54 37 0 -20 5 -37 -18 -94 -17 -23 -20 -63 -32 12 -9 53 -18 15 -37 -1 14 -17 -65 5 37 -9 24 40 -14 -23 -7
7960 -7 -47 -54 -13 -1 -14 -32 37 -20 19 5 22 14 31 -19 -24 78 -9 -17 26 8 -27 19 2 -27 17 32 -12 -10 1 -21 0 3 4 -25
7994 -25 50 -9 45 -32 11 25 7 3 17 -22 5 -7 17 0 94 8 -11 -39 39 21 -10 -49 3 40 -27 16 -20 14 -31 -29 22
8025 22 -12 -61 22 14 -55 -14 -31 -16 20 15 -10 21 -27 55 -3 30 -8 -25 10 -19 -4 10 -14 -5 -26 -5 20 6 -31 -27 -41 21
8057 21 -20 -30 30 26 -115 9 -7 -4 -58 17 0 9 18 -68 -17 20 8 -57 -4 38 31 -38 -20 -37 46 2 -32 -31 31 -9 -23 6
$$ packed form
7833a3K4k2K7k9O9q1NrK4n6O3J4m3L4L5k9jm7m1J8O2j0j4j2J6k2L7P2o2l5L2p3
7865f7N8Qn5M4j04J25k8k5J12p8J0l7O1n3K2lk5O7n5K8l4K5l4Q1J9p2K6%q6R3
7895B3k2Jqj7l0K7K4J5L9n2n4K9PL5M8n6J5o4K0oKP4m4p4P1L0Ok9l0J2M3l6K8
7928B7l3O0j7l7k0K5m2J9p6P7oLm3L1M4k1O2p1L3n2L6J5l1m8P0L2m6L3J6n4rJ6
7960gm0pM1J2j3j8O9n7L9j4J7qJ7n0nJ02q7qM3j8l5M6j7k9M4J5m4KJ1k2K1LJk9
7994b5P5n9N4p7M3J4j8mJ4l9K7j2K4j7R4q6j9k8P8j8l1l9N2L7o7M3l6L4m5KN1
8025B2l4m9Q3qo9M1j7J5L6nk5L1m8Q2n8L3l8j7L5k9J5J4k4Rk1K1K5j4l7Mj4O2
8057B1m1j0O0mj41J24j6Ln4P5j7RRq6N1L7j2o5N3M2po9J8j7Q3m4l4JO2m0j4K9
$$ plain form
8089 6 6 -1 24 33 4 -44 -18 -55 23 33 -69 41 7 -28 34 11 -26 32 -22 49 -38 -48 -51 -67 -65 -21 49 22 37 70 7 13 4
8122 4 -24 34 -21 -6 -4 12 -64 -4 8 -5 3 46 -17 8 -6 -26 56 27 -5 -1 -11 19 -13 26 -27 -12 -3 -33 4 -17 26 -7 16
8155 16 -27 -11 -22 -30 13 22 -67 -35 -27 54 -12 14 -58 0 71 46 16 -68 -3 -13 -42 -12 -26 -4 -46 3 -23 21 22 37 -38 -19
8187 -19 23 -9 -53 -45
$$ packed form
8089F%pK5Rk9m8K6l7P8J0j02J10l4l5O2k3l7N8n4P1q7j0lj6KM4P0k7J5L3o3Or
8122Dk8N8n5J5KJ6p6O0J2j3QM3o3K5j4k0Q2k9l2Mj0L0l2L9n3J5Rl0L7k1M3l3K3
8155A6m3J6j1qM3Rq9L2QQ1o6K6p2N8P1k5l0q4O5j0k9L0j4K2m2M9k6M4JJ5p5J9
8187a9M2l2m4Q
8191d5
##END NTUPLES=NMR FID
##END=
