##TITLE=1H_Pr NCS-1
 200.13MHz, CDCl3,
 8 sc
 
 12.8.2025
##JCAMPDX= 6.0         $$ Bruker NMR JCAMP-DX V2.0
##DATA TYPE= NMR FID
##DATA CLASS= NTUPLES
##ORIGIN= UXNMR, Bruker Analytische Messtechnik GmbH
##OWNER= pz
$$ XWIN-NMR		Version 3.5
$$ Tue Aug 12 14:45:13 2025 Russian Standard Time (UT+4h)  she@DPX200
##.OBSERVE FREQUENCY= 200.1313
##.OBSERVE NUCLEUS= ^1H
##.DELAY= (6, 6)
##.ACQUISITION MODE= SIMULTANEOUS
##.ACQUISITION SCHEME= undefined
##.AVERAGES= 8
##.DIGITISER RES= 18
##SPECTROMETER/DATA SYSTEM= spect
##.PULSE SEQUENCE= zg30
##.SOLVENT NAME= CDCl3
##.SHIFT REFERENCE= (INTERNAL, CDCl3, 0, 14.3821)
##AUDIT TRAIL= $$ (NUMBER, WHEN, WHO, WHERE, WHAT)
$$ ##TITLE= Audit trail, XWIN-NMR		Version 3.5
$$ ##JCAMPDX= 5.01
$$ ##ORIGIN= Bruker BioSpin GmbH
$$ ##OWNER= she
$$ F:/spectra/data/she/nmr/H-C/1/audita.txt
$$ ##AUDIT TRAIL=  $$ (NUMBER, WHEN, WHO, WHERE, WHAT)
(   1,<2025-08-12 14:44:08.67 +0400>,<she>,<DPX200>,
      <created by zg, POWCHK disabled, PULCHK disabled
       configuration hash MD5:
       00 E9 B6 7A A2 85 ED C7 34 08 36 98 17 FE 4E 26
       data hash MD5: 16K
       DD CD FB AF A4 EE 94 14 DD A8 0F E5 9E 3A DF 15>)
$$ ##END=
$$ 
$$ hash MD5
$$ 59 3E B1 2C 7C DE 27 73 CE 3C 9F 72 6D 56 6B 13
##$RELAX= 
##$RELAX= 
##$RELAX= 
##$RELAX= 
##$RELAX= 
##$RELAX= 
$$ Bruker specific parameters
$$ --------------------------
##$DU= <F:/spectra>
##$EXPNO= 1
##$NAME= <H-C>
##$PROCNO= 1
##$TYPE= <nmr>
##$USER= <she>
##$AMP= (0..31)
100 100 100 100 100 100 100 100 100 100 100 100 100 100 100 100 100 100 
100 100 100 100 100 100 100 100 100 100 100 100 100 100 
##$AQSEQ= 0
##$AQ_mod= 1
##$AUNM= <au_zg>
##$AUTOPOS= <>
##$BF1= 200.13
##$BF2= 200.13
##$BF3= 200.13
##$BF4= 200.13
##$BF5= 200.13
##$BF6= 200.13
##$BF7= 200.13
##$BF8= 200.13
##$BYTORDA= 1
##$CFDGTYP= 0
##$CFRGTYP= 5
##$CHEMSTR= <none>
##$CNST= (0..31)
1 1 145 1 1 1 1 1 1 1 1 1 1 1 1 1 1 1 1 1 1 1 1 1 1 1 1 1 1 1 1 1 
##$CPDPRG= <>
##$CPDPRG1= <>
##$CPDPRG2= <>
##$CPDPRG3= <>
##$CPDPRG4= <mlev>
##$CPDPRG5= <mlev>
##$CPDPRG6= <mlev>
##$CPDPRG7= <mlev>
##$CPDPRG8= <mlev>
##$CPDPRGB= <>
##$CPDPRGT= <>
##$D= (0..31)
0 0.7 0 0 0 0 0 0 0 0 0 0.03 0 0 0 0 0 0 0 0 0 0 0 0 0 0 0 0 0 0 0 0 
##$DATE= 1754995448
##$DBL= (0..7)
120 120 120 120 120 120 120 120 
##$DBP= (0..7)
150 150 150 150 150 150 150 150 
##$DBP07= 0
##$DBPNAM0= <>
##$DBPNAM1= <>
##$DBPNAM2= <>
##$DBPNAM3= <>
##$DBPNAM4= <>
##$DBPNAM5= <>
##$DBPNAM6= <>
##$DBPNAM7= <>
##$DBPOAL= (0..7)
0.5 0.5 0.5 0.5 0.5 0.5 0.5 0.5 
##$DBPOFFS= (0..7)
0 0 0 0 0 0 0 0 
##$DE= 6
##$DECBNUC= <off>
##$DECIM= 32
##$DECNUC= <off>
##$DECSTAT= 4
##$DIGMOD= 1
##$DIGTYP= 9
##$DL= (0..7)
0 120 120 120 120 120 120 120 
##$DP= (0..7)
150 150 150 150 150 150 150 150 
##$DP07= 0
##$DPNAME0= <>
##$DPNAME1= <>
##$DPNAME2= <>
##$DPNAME3= <>
##$DPNAME4= <>
##$DPNAME5= <>
##$DPNAME6= <>
##$DPNAME7= <>
##$DPOAL= (0..7)
0.5 0.5 0.5 0.5 0.5 0.5 0.5 0.5 
##$DPOFFS= (0..7)
0 0 0 0 0 0 0 0 
##$DQDMODE= 0
##$DR= 18
##$DS= 0
##$DSLIST= <SSSSSSSSSSSSSSS>
$$ [...]
##$SUBNAM0= <"">
##$SUBNAM1= <"">
##$SUBNAM2= <"">
##$SUBNAM3= <"">
##$SUBNAM4= <"">
##$SUBNAM5= <"">
##$SUBNAM6= <"">
##$SUBNAM7= <"">
##$SUBNAM8= <"">
##$SUBNAM9= <"">
##$SW= 18.0517328524113
##$SWIBOX= (0..15)
0 0 2 0 0 0 0 0 0 0 0 0 0 0 0 0 
##$SW_h= 3612.71676300578
##$TD= 16384
##$TD0= 1
##$TE= 0
##$TE2= 300
##$TE3= 300
##$TEG= 300
##$TL= (0..7)
0 120 120 120 120 120 120 120 
##$TP= (0..7)
150 150 150 150 150 150 150 150 
##$TP07= 0
##$TPNAME0= <>
##$TPNAME1= <>
##$TPNAME2= <>
##$TPNAME3= <>
##$TPNAME4= <>
##$TPNAME5= <>
##$TPNAME6= <>
##$TPNAME7= <>
##$TPOAL= (0..7)
0.5 0.5 0.5 0.5 0.5 0.5 0.5 0.5 
##$TPOFFS= (0..7)
0 0 0 0 0 0 0 0 
##$TUNHIN= 0
##$TUNHOUT= 0
##$TUNXOUT= 0
##$USERA1= <user>
##$USERA2= <user>
##$USERA3= <user>
##$USERA4= <user>
##$USERA5= <user>
##$V9= 5
##$VALIST= <valist>
##$VCLIST= <CCCCCCCCCCCCCCC>
##$VD= 0
##$VDLIST= <DDDDDDDDDDDDDDD>
##$VPLIST= <PPPPPPPPPPPPPPP>
##$VTLIST= <TTTTTTTTTTTTTTT>
##$WBST= 1024
##$WBSW= 4
##$XGAIN= (0..3)
0 0 0 0 
##$XL= 0
##$YL= 0
##$YMAX_a= 190593
##$YMIN_a= -208592
##$ZGOPTNS= <>
##$ZL1= 120
##$ZL2= 120
##$ZL3= 120
##$ZL4= 120
##$ABSF1= 10
##$ABSF2= 0
##$ABSG= 5
##$ABSL= 3
##$ALPHA= 0
##$AQORDER= 0
##$ASSFAC= 0
##$ASSFACI= 0
##$ASSFACX= 0
##$ASSWID= 0
##$AUNMP= <proc_1d>
##$AZFE= 0.1
##$AZFW= 0.1
##$BCFW= 1
##$BC_mod= 2
##$BYTORDP= 1
##$COROFFS= 0
##$CY= -3
##$DATMOD= 1
##$DC= 2
##$DFILT= <>
##$DTYPP= 0
##$F1P= 0
##$F2P= 0
##$FCOR= 0.5
##$FTSIZE= 0
##$FT_mod= 4
##$GAMMA= 1
##$GB= 0.15
##$INTBC= 1
##$INTSCL= 1
##$ISEN= 128
##$LB= 0.25
##$LEV0= 0
##$LPBIN= 0
##$MAXI= 10000
##$MC2= 0
##$MEAN= 0
##$ME_mod= 0
##$MI= 1.114404
##$NCOEF= 0
##$NC_proc= 0
##$NLEV= 6
##$NOISF1= 3.799351
##$NOISF2= 2.8
##$NSP= 1
##$NTH_PI= 0
##$NZP= 0
##$OFFSET= 14.38212
##$PC= 1
##$PHC0= -1566.798
##$PHC1= 20.39228
##$PH_mod= 1
##$PKNL= yes
##$PPARMOD= 0
##$PSCAL= 0
##$PSIGN= 0
##$REVERSE= no
##$SF= 200.129724274929
##$SI= 16384
##$SIGF1= 3
##$SIGF2= 2
##$SINO= 400
##$SIOLD= 16384
##$SREGLST= <1H.CDCl3>
##$SSB= 0
##$STSI= 0
##$STSR= 0
##$SW_p= 3205.1282051282
##$SYMM= 0
##$S_DEV= 0
##$TDeff= 0
##$TDoff= 0
##$TI= <>
##$TILT= no
##$TM1= 0
##$TM2= 0
##$TOPLEV= 0
##$USERP1= <user>
##$USERP2= <user>
##$USERP3= <user>
##$USERP4= <user>
##$USERP5= <user>
##$WDW= 1
##$XDIM= 8192
##$YMAX_p= 0
##$YMIN_p= 0
$$ End of Bruker specific parameters
$$ ---------------------------------
##NTUPLES= NMR FID
##VAR_NAME=  TIME,          FID/REAL,        FID/IMAG
##SYMBOL=    X,             R,               I
##VAR_TYPE=  INDEPENDENT,   DEPENDENT,       DEPENDENT
##VAR_FORM=  AFFN,          ASDF,            ASDF
##VAR_DIM=   8192,          8192,            8192
##UNITS=     SECONDS,       ARBITRARY UNITS, ARBITRARY UNITS
##FACTOR=    0.0002768,     1,               1
##FIRST=     0,             0,               0
##LAST=      2.2672688,     0,               0
##MIN=       0,             -208592,         0
##MAX=       2.2672688,     190593,          0
$$ Real data points
##PAGE= N=1
##DATA TABLE= (X++(R..R)), XYDATA
$$ plain form
0 0 0 0 0 0 0 0 0 0 0 0 0 0 0 0 0 0 8 -8 8 -8 8 -8 16 -16 16 -24 24 -29 32 -39 40 -48 56 -63 69 -79 88 -98
38 -98 109 -122 136 -149 166 -185 204 -224 247 -272 302 -333 366 -402 444 -491 543 -602 671 -750
58 -750 840 -949 1084 -1251 1464 -1751 2157 -2772 3817 -5917 11808 -64720 -208592 -16159
72 -16159 158823 71814 -85218 -80299 17223 41713 21730 29104 -26554 -76494 -12436 91723
84 91723 49807 -78823 -92213 39057 88590 -11103 -61609 -15458 27411 25335 13123 4010
96 4010 -18652 -18101 37719 57488 -21929 -50573 13179 46519 -710 -38398 -4845 13196 -25243
109 -25243 -21015 31002 964 -59920 -26414 50229 38060 -49793 -47793 43365 50391 -22316 -19992
122 -19992 29672 17772 -23833 1616 55663 5991 -71197 -14117 74922 27864 -68165 -52215
$$ packed form
0@%%%%%%%%%%%%%%%%Qj6J6j6J6j6K4l2L2m0M8n3O1p1P9q8J04j19J32j48J67j86
38i8K07k31K58k85L15l51L89m28M71n19N74o35O99p68Q46r35J034j145J273j421
58g50J590j789K033k335K715l215L908m929O589r734J7725p6528j43872J92433
72a6159J74982q7009j57032M919R7522K4490j9983P374n5658m9940O4058J04159
84I1723m1916j28630j3390J31270M9533r9693n0506M6151M2869k076j2212r113
96D010k2662N51N5820J9769p9417k8644O3752L3340m7229l7688L3553J8041l8439
109b5243M228N2017l0038o0884L3506P6643j2169q7853K000R1158P026p2707K324
122a9992M9664j1900m1605K5449N4047m9672p7188N7080Q9039m7058r6029J5950
$$ plain form
134 -52215 38248 49966 -24778 -40147 3401 10353 2942 14180 5637 -22424 -19406 26843 40559
147 40559 -19817 -44515 9256 33823 -2018 -26486 -7441 10904 -5622 -11354 14735 4920
159 4920 -23346 -1062 27656 9812 -17375 -1617 29702 9086 -24237 6403 33971 -4364
171 -4364 -32572 -3016 28139 3553 -35780 -15797 17200 -2288 -18915 535 4544 -13627
183 -13627 -12252 20205 26671 -19750 -28061 26078 40590 -5279 -27991 1268 29104 8246 -17192
196 -17192 -3663 1933 -7538 2366 7565 -10014 -19899 -1849 21634 4873 -25477 -6281 23307
209 23307 9970 -10768 -5624 10984 8600 -8111 -818 10696 -6998 -13639 5189 7775 -8541
222 -8541 -15483 383 12535 -5929 -12409 9143 8861 -6445 -1141 12729 11410 -5946 -7166 15709
$$ packed form
134e2215R0463J1718p4744j5369M3548O952p411J1238q543k8061L018M6249J3716
147D0559o0376k4698N3771K4567l5841k4468J9045J8345j6526n732K6089r815
159D920k8266K2284K8718j7844k7187J5758L1319k0616l3323L0640K7568l8335
171d364k8208K9556L1155k4586l9333J9983L2997j9488j6627J9450M009j8171
183a3627J375L2457O466m6421q311N4139J4512m5869k2712K9259K7836k0858k5438
196a7192J3529N596r471R904N199j7579r885J8050K3483j6761l0350J9196K9588
209B3307j3337k0738N144J6608k384j6711P293J1514j7694o641J8828K586j6316
222h541o942J5866J2152j8464o480K1552k82j5306N304J3870j319j7356j220K2875
$$ plain form
236 15709 13037 -10471 -7486 5398 3202 -5891 -8884 211 -2553 -14148 -1490 9918 -6198
249 -6198 -14122 561 14185 7253 -10810 -2480 16057 6716 -2531 2653 2864 -13 64 3045 1832
264 1832 -10943 -9004 9390 3394 -13896 -10145 4258 9492 -2690 -11174 4232 10784 200
277 200 57 3428 1670 1576 2321 5269 -921 -10508 78 8859 -5059 -12059 -3679 4132 1786 -8270
293 -8270 -4338 6276 1321 -1620 4899 3468 899 1987 4647 7366 -1521 -5329 5652 4235 -5908
308 -5908 -5624 -1275 916 -3820 -8159 388 1223 -6038 -933 4066 153 -497 1534 5535 5383 -2014
324 -2014 2328 7085 -227 -1960 1321 841 -468 -5708 -3871 2493 -3525 -6970 -716 153 -612 -1324
340 -1324 -918 4206 2114 -321 5603 3597 -1094 2939 4152 1432 -1866 -4198 2168 1994 -6652 -4210
$$ packed form
236A5709k672k3508K985J2884k196r093k993R095k764j1595J2658J1408j6116
249f198p924J4683J3624o932j8063Q330J8537r341r247N184K11k877P7K981j213
264A832j2775J939J8394n996j7290L751J4403N234j2182q484J5406O552j0584
277B00j43L371j758r4P45K948o190r587J0586Q781j3918p000Q380P811k346j0056
293h270L932J0614m955k941O519j431k569J088K660K719q887l808J0981j417j0143
308e908K84M349K191m736m339Q547Q35p261N105M999l913o50K031M001j52p397
324b014M342M757p312j733L281m80j309n240J837O364o018l445O254Q69p65p12
340a324M06N124k092k435N924k006m691M033J213k720l298k332O366j74q646K442
$$ plain form
356 -4210 -1119 -1609 -710 -2609 -2669 1176 -612 2621 4611 -1457 86 4482 4492 3187 -1828 -1903 4136
373 4136 1003 -3014 -1453 -3125 -2816 -690 -2200 -1377 -3392 -3898 2972 2468 -1048 419 782 2969
389 2969 5270 1517 781 1274 37 3207 1987 -3596 -3078 -2025 -482 512 -5163 -5022 -350 -742 624
406 624 993 -2591 84 2942 4840 4974 -1578 -2376 5652 6212 1141 -3251 -4788 1965 3592 -2686
422 -2686 -5002 -4889 -2414 2840 588 -3217 -3339 -2677 4407 7559 -442 -4079 -447 5392 9095 828
438 828 -6597 -2052 3211 4709 -50 -7943 -5348 1010 1158 701 -2973 -6073 -1619 3022 5842 3169
454 3169 -5646 -3384 7150 9115 2354 -5442 -4869 6079 6408 -2317 -5030 -4419 -1790 1092 -109
469 -109 -1333 -4388 -7418 1230 8611 2061 -5715 -5340 5512 12654 2694 -6843 -2230 4988 7548
$$ packed form
356d210L091m90Q99j899o0L845j788L233J990o068J543M396J0j305n015p5O039
373D136l133m017J561j672L09K126j510Q23k015n06O870n04l516J467L63K187
389B969K301l753p36M93j237L170j220n583N18J053J543R94n675J41M672l92J366
406F24L69l584K675K858J898J34o552p98Q028N60n071m392j537O753J627o278
422b686k316J13K475N254k252l805j22O62P084L152q001l637L632N839L703q267
438H28p425M545N263J498m759p893K595O358J48m57l674l100M454M641K820k673
454C169q815K262J0534J965o761p796N73J0948L29q725k713O11K629K882j201
469a09j224l055l030Q648P381o550p776L75J0852P142r960r537M613P218K560
$$ plain form
484 7548 1455 -6398 -3520 154 750 2527 -2422 -8296 -4323 2420 6490 907 -9777 -4534 8766
499 8766 10175 705 -8706 -3662 10494 9327 -3013 -7239 -2747 4156 4504 -2269 -4860 -5393 -3863
514 -3863 4171 5764 -3973 -9476 -3737 9818 11886 -4642 -10921 1913 12203 8004 -4553 -7898
528 -7898 2003 5228 1102 -560 -4227 -6089 -1811 2474 4265 -3202 -10683 -2352 8620 6313 -2890
543 -2890 -7758 195 10150 5735 -1905 -2867 -296 3901 3834 -629 -2279 -4128 -3277 3180 2763 -3782
559 -3782 -6954 -4311 5177 6924 -4044 -6923 1216 7527 5311 -2913 -3853 3814 4208 690 150 -1582
575 -1582 -2546 -1137 700 2601 -3200 -8433 -939 5998 1837 -5673 -5853 3369 8638 292 -4294 308
591 308 3788 4403 811 -1479 236 -805 -265 2165 -1061 -4531 -3068 -640 2164 -149 -5188 -2578
$$ packed form
484G548o093p853K878L674N96J777m949n874L973O743M070n583j0684N243J3300
499H766J409r470r411N044J4156j167j2340m226M492O903L48o773k591n33J530
514c863Q034J593r737n503N739J3555K068j6528o279J2834J0290m199j2557l345
528g898R901L225m126j662l667j862M278M285J791p467p481Q331J0972k307r203
543b890m868P953R955m415p640r62K571M197o7m463j650j849Q51O457m17o545
559c782l172K643R488J747j0968k879Q139O311k216q224r40P667L94l518n40j732
575a582r64J409J837J901n801n233P494O937m161p510j80R222N269q346m586M602
591C08L480O15l592k290J715j041N40K430l226l470J463K428K804k313n039K610
$$ plain form
607 -2578 2301 2781 1223 -1867 -676 3764 2876 1111 928 -127 728 686 -323 1465 -1367 -4312 -1041
624 -1041 1325 215 -2890 -4406 468 3287 -885 -1380 1169 1272 1871 1014 1243 2578 -426 -1152 2559
641 2559 1397 -1614 -2524 -1612 1657 -230 -4301 -1586 451 -376 -241 -1038 298 1697 444 1026 1899
658 1899 639 1567 1286 6 1030 -157 -895 329 -1483 -1395 -737 -2266 -1361 -437 -1666 -234 560
675 560 -215 1026 563 1108 2338 388 597 1859 1171 748 -582 -1308 1342 -117 -2609 -1276 -1171
692 -1171 -618 -461 -1974 -1156 318 -222 1413 1290 -479 1239 1580 1665 1805 -373 -18 1822 174 -760
710 -760 -1016 -1936 30 159 -1910 -1605 -1596 -467 1045 -655 -996 1263 1109 1921 1432 -274 1273 1851
728 1851 660 682 -765 -992 391 -994 -1358 -1095 -1809 -615 -129 -1545 -353 -30 -39 1045 255 729
$$ packed form
607b578M879M80j558l090J191M440q88j765j83j055Q55m2j009J788k832k945L271
624a041K366j110l105j516M874K819m172m95K549J03N99q57K29J335l004p26L711
641B559j162l011r10R12L269j887m071K715K037q27J35p97J336J399j253N82Q73
658A899j260R28k81j280J024j187p38J224j812Q8O58j529R05R24j229J432P94
675E60p75J241m63N45J230j950K09J262o88m23j330p26K650j459k492J333J05
692a171N53J57j513Q18J474n40J635j23j769J718L41Q5J40k178L55J840j648r34
710g60k56r20J966J29k069L05RJ129J512j700l41K259j54Q12m89j706J547N78
728A851j191K2j447k27J383j385l64K63p14J194M86j416J192L23rJ084p90M74
$$ plain form
746 729 1577 649 1053 1621 363 849 703 -785 -50 -850 -1501 -269 -1423 -1403 -261 -1041 -522 277 -632
765 -632 776 989 57 1798 1156 634 1743 572 517 612 -816 -165 -220 -1696 -813 -636 -1456 -536 -1087
784 -1087 -745 567 -323 277 962 246 1640 1351 217 1407 1083 548 942 -239 -651 242 -928 -1148
802 -1148 -735 -1364 -508 -342 -1599 80 47 -140 958 103 567 1547 806 1201 1255 -102 791 963 -409
821 -409 -296 -1146 -1154 -75 -1316 -1539 -397 -1216 -301 183 -633 736 611 69 1759 1086 427 1069 547
840 547 608 634 -831 20 -395 -1552 -413 -368 -1456 -682 -1138 -274 519 -625 -29 1148 554 1377 1432 238
860 238 911 475 427 1492 -563 -980 445 -472 -689 -1360 -1682 -238 -506 -946 0 73 -179 650 769 512
880 512 523 -107 1496 1949 -158 -230 93 -203 612 -797 -1715 -736 -1331 -372 63 -1675 -1027 -2 483
$$ packed form
746G29Q48r28M04N68j258M86j46j488P35q00o51J232j154K0J142p80N19P99r09
765f32J408K13r32J741o42n22J109j171n5R5j428O51n5j476Q83J77q20R20n51
784a087L42J312q90O00O85p16J394k89j134J190l24n35L94j181m12Q93j170k20
802a148M13o29Q56J66j257J679l3j87J098q55M64R80p41L95N4j357Q93J72j372
821d09J13q50qJ079j241k23J142q19R15M84q16J369j25n42J690o73o59O42n22
840E47O1K6j465Q51m15j157J139M5j088P74m56Q64P93j144N96J177n94Q23N5j194
860B38O73m36m8J065k055m17J425r17k17o71l22J444k68m40R46P3k52Q29J19k57
880E12J1o30J603M53k107p2L23k96Q15j409r18R79n95R59M35j738O48J025M85
$$ plain form
899 483 1003 -102 -129 1289 801 949 1654 -21 -579 732 881 490 -1366 -2102 139 176 -1052 -1270 -1092
918 -1092 -459 18 -215 511 480 -1071 1129 2559 756 -393 -555 1473 2331 -657 -1685 -12 -41 103
936 103 -436 -1369 -908 -853 -718 1233 -338 -1213 81 755 1715 762 -593 531 1601 761 552 -908
954 -908 -600 1102 402 -1038 -1100 -1067 12 -68 -1550 -312 246 -767 413 1508 1067 -122 -648 1647
972 1647 2802 -104 -1752 637 1595 506 -1765 -1476 867 -471 -1878 79 457 -1102 -1486 233
988 233 2259 223 -2084 631 2863 1237 -290 -493 727 1638 -299 -550 52 -827 -918 -528 -654 -392
1006 -392 -1020 -1267 673 593 -177 -322 -460 1322 2390 -93 -454 487 1196 1388 -970 -1042 966 -3 -1645
1025 -1645 -710 212 -607 -1883 -1267 1498 650 -2649 -564 2080 1785 -631 -872 1845 2545 -1070 -1073 1415
$$ packed form
899D83N20j105k7J418m88J48P05j675n58J311J49l91j856p36K241L7j228k18J78
918a092O33M77k33P26l1j551K200J430j803j149j62K028Q58k988j028J673k9J44
936A03n39r33M61N5J35J951j571q75J294O74R60r53j355J124J070q40k09j460
954i08L08J702p00j440o2L3J079q0j482J238N58j013J180J095m41j189n26K295
972A647J155k906j648K389R58j089k271K89K343j338j407J957L78j559l84J719
988B33K026k036k307K715K232j626j527k03J220R11j937k51O02q79r1L90j26K62
1006c92o28k47J940q0p70j45j38J782J068k483l61R41P09J92k358p2K008r69j642
1025a645R35R22q19j276O16K765q48l299K085K644k95k416k41K717P00l615lK488
$$ plain form
1043 1415 871 -787 -1239 87 545 -1745 -1978 806 166 -1268 -1075 120 1420 320 -829 958
1059 958 1256 838 719 332 225 987 10 -122 -94 -773 -132 -380 -1348 -263 -73 -1138 -416 -106 1040
1078 1040 433 -1033 419 1821 -228 -126 714 1003 417 -1116 -163 1348 -664 -1660 -227 384 -474
1095 -474 -1484 -939 1125 -86 -1217 510 1251 124 -254 412 1624 841 -544 822 1216 -384 -383
1112 -383 -257 -108 -257 -1201 -213 234 -1151 -620 470 -276 -149 158 359 1250 73 305 1464 132
1130 132 -62 844 274 -416 -785 -162 162 -525 -1470 -4 316 -1067 -580 189 562 59 -567 1040 1134
1149 1134 -458 297 1058 674 213 -456 472 519 -1252 -928 372 -674 -974 -182 0 192 -703 -430 964
1168 964 192 -472 597 796 438 116 289 1034 286 -832 265 693 -647 -555 -529 -390 -479 -1114 141
$$ packed form
1043A415n44j658m52J326M58k290k33K784o40j434J93J195J300j100j149J787
1059I58K98m18j19l87j07P62r77j32K8o79O41k48r68J085J90j065P22L10J146
1078A040o07j466J452J402k049J02Q40K89n86j533R53J511k012r96J433O11q58
1095d74j010N45K064j211j131J727P41j127l78O66J212p83j385J366L94j600J
1112c83J26J49j49r44R88M47j385N31J090p46J27L07K01Q91j177K32J159j332
1130A32j94R06n70o90l69O23L24o87r45J466L20j383M87P69L73n03o26J607R4
1149A134j592P55P61l84m61o69R28M7j771L24J300j046l00P92J82J92q95K73J394
1168I64p72o64J069J99l58l22J73P45p48j118J097M28j340R2K6J39q9o35J255
$$ plain form
1187 141 640 -731 -164 781 414 468 122 624 1232 -261 155 849 136 -537 -287 -224 -277 -1061 -662 275
1207 275 -662 -810 -107 304 -228 101 133 934 595 -155 937 829 -43 -207 285 453 -236 -823 -22 277
1227 277 -1195 -776 -201 -259 -336 -604 93 608 -688 125 1045 609 246 379 453 516 -141 -240 659 -348 -893
1248 -893 -65 -81 -524 -610 -608 152 106 -585 177 650 -205 443 419 373 357 -137 513 530 -395 -273 384 -94 -572
1271 -572 -746 -411 179 -816 -664 226 -300 -544 389 142 149 84 1 899 360 -140 836 476 -68 12 -337 -66
1293 -66 -468 -1108 51 138 -911 -512 -320 220 284 -165 287 752 298 210 667 355 177 108 128 366 -421
1314 -421 -862 56 -437 -429 -59 -522 -200 -152 -351 467 89 116 709 231 169 329 133 613 349 -246 110 161
1336 161 -695 -326 -220 -532 -158 -466 -51 221 -377 11 494 92 182 128 523 831 232 -330 530 281 -317
$$ packed form
1187A41M99j371N67R45l67N4l46N02O08j493M16O94p13o73K50O3n3p84L99R37
1207B75r37j48P03M11n32L29L2Q01l39p50J092j08q72j64M92J68o89n87Q01K99
1227B77j472M19N75n8p7k68O97N15j296Q13R20m36l63J33P4O3o57r9Q99j007n45
1248h93Q28j6m43q6KP60m6o91P62M73q55O48k4m6j6m94O50J7r25J22O57m78m78
1271e72j74L35N90r95J52Q90n26k44R33k47Po5q3Q98n39n00R76l60n44Q0l49K71
1293f6m02o40J159Q7j049L99J92N40O4m49M52M65m54q8M57l12j78o9K0K38p87
1314d21m41R18m93QL70m63L22M8j99Q18l78K7N93m78o2J60j96M80k64n95L56N1
1336A61q56L69J06l12L74l08M15K72n98L88M83m02R0n4L95L08n99n62Q60k49n98
$$ plain form
1357 -317 -221 -383 -101 -321 -522 -115 -444 -758 78 90 62 210 -176 250 454 -121 531 450 -97 256 480
1378 480 -54 17 -469 -507 72 -378 -472 -240 -293 -447 -222 -138 140 -17 41 557 288 390 273 525 412 400
1400 400 -48 135 -114 -295 -120 -330 -220 -61 -693 -445 53 -264 -72 158 93 302 268 65 407 497 312
1421 312 207 -7 -65 328 -642 140 -143 -340 -333 -315 -285 47 -262 -494 345 226 306 317 45 463 649 -69
1443 -69 123 165 -105 -123 -532 -262 90 -415 -425 -171 -206 -192 -123 140 421 -58 -45 173 573 454 -258 -32 410
1466 410 466 -544 -183 240 -143 -296 -724 -63 136 -398 -364 137 55 -12 -290 133 814 363 -189 370 624
1487 624 23 62 -325 114 267 -521 -220 -20 -211 -325 -467 -284 138 -37 -235 -208 14 304 244 307 531
1508 531 272 -23 -255 116 306 -173 -447 36 389 -488 -410 -238 -258 93 -324 141 568 -128 -207 549 663
$$ packed form
1357c17R6j62K82k20k01M07l29l14Q36J2k8J48l86M26K04n75O52q1n47L53K24
1378D80n34P1m86l8N79m50r4K32n3j54K25Q4K78j57N8N16k69J02j17K52j13j2
1400D00m48J83k49j81J75k10J10J59o32K48M98l17J92K30o5K09l4k03L42R0j85
1421C12j05k14n8L93r70P82k83j97PJ8L0L32l09k32Q39j19Q0J1k72M18J86p18
1443f9J92M2k70j8m09K70L52n05j0K54l5J4O9K63K81m79J3K18M00j19p12K26M42
1466D10N6j010L61M23l83j53m28O61J99n34L4N01q2o7k78M23O81m51n52N59K54
1487F24o01L9l87M39J53p88L01K00j91j14j42J83M22j75j98K7K22K90o0O3K24
1508E31k59k95k32L71J90m79k74M83L53q77P8J72k0L51m17M65M27o96p9P56J14
$$ plain form
1529 663 24 46 151 405 208 -136 64 116 21 -136 -364 -139 -32 -385 -152 272 46 -134 35 45 207
1550 207 314 11 452 133 446 160 -165 79 151 -319 -9 -5 -226 -87 -605 -506 356 -118 -347 302 286 149
1572 149 140 -195 418 210 -138 217 144 258 -39 -200 -40 156 -431 -389 67 -163 -91 -139 31 381 -119 -14
1594 -14 444 485 101 162 -44 491 -74 -279 215 9 -580 -13 -411 -55 -165 -364 61 45 -191 56 31 -45
1616 -45 227 334 -25 408 191 163 85 37 341 -128 -272 -100 -236 -153 -86 -233 -440 238 59 -127 215 49
1638 49 130 -23 233 415 180 176 463 329 -77 -10 89 25 -507 -202 -84 -187 -393 -189 -39 -394 -38 -171
1660 -171 283 325 127 338 234 53 -30 415 -105 8 -44 -220 66 -333 -94 -260 -66 -226 -235 -217 77 1
1682 1 -113 378 409 -141 302 145 312 106 316 98 -43 -290 -322 118 -162 -306 -401 -89 -64 -263 -52 355
$$ packed form
1529F63o39K2J05K54j97l44K00N2r5j57k28K25J07l53K33M24k26j80J69J0J62
1550B07J07l03M41l19L13k86l25K44P2m70L10Mk21J39n18R9Q62m74k29O49j6j37
1572A49rl35O13k08l48L55p3J14k97j61J60J96n87M2M56k30P2m8J70L50n00J05
1594a4M58M1l84O1k06N35n65k05M94k06n89N67l98L56j10j99M25j6k36K47k5p6
1616d5K72J07l59M33k17k8p8m8L04m69j44J72j36Q3O7j47k07O78j79j86L42j66
1638D9Q1j53K56J82k35mK87j34m06O7R9o4n32L05J18j03k06K04J50l55L56j33
1660a71M54M2j98K11j04j81q3M45n20J13n2j76K86l99K39j66J94j60rJ8K94p6
1682Aj14M91L1n50M43j57J67k06K10k18j41k47l2M40k80j44r5L12K5j99K11M07
$$ plain form
1704 355 -44 -33 4 184 88 98 100 499 -58 132 -262 -175 -244 -158 -43 -138 -116 -177 35 -139 -67 -117 129 269 179
1729 179 -48 63 484 17 239 89 121 79 -30 193 73 -388 -115 51 -253 -142 258 -279 -87 -101 18
1750 18 179 160 -22 365 109 74 119 114 56 98 113 -4 -110 -28 -234 -86 -174 -94 210 -146 286 -74 165 225
1774 225 123 280 227 223 97 28 -25 148 -111 -268 -36 -421 239 -158 -167 -63 8 -76 231 100 106 153 -22 153
1798 153 214 47 63 -78 34 -142 -173 -85 -392 -228 -277 -327 -242 -47 -224 259 191 84 35 123 130 393 390 -137 164
1823 164 289 130 26 -165 -421 52 -215 -244 103 -102 -181 -182 -86 -19 381 -274 256 49 87 -66 226 359
1845 359 418 16 -335 173 -142 -77 -106 -96 -185 -307 40 89 -140 115 -94 85 -226 -42 -14 -92 17 320 81
1868 81 -117 -92 251 -38 -181 -216 15 -100 -270 -469 -181 77 -106 47 -42 263 227 289 198 120 168 194 193 -40
$$ packed form
1704C55l99J1L7J80r6J0KL99n57J90l94Q7o9Q6J15r5K2o1K12j74P2n0K46J40r0
1729A79k27J11M21m67K22j50L2m2j09K23j20m61K73J66l04J11M00n37J92j4J19
1750A8J61j9j82L87k56l5M5nn8M2J5j17j06Q2k06J48q8Q0L04l56M32l60K39O0
1774B25j02J57n3mj26o9n3J73k59j57K32l85O60l97rJ04P1q4L07j31OM7j75J75
1798A53O1j67J6j41J12j76l1Q8l07J64m9n0Q5J95j77M83o8j07m9Q8PK63ln27L01
1823A64J25j59j04j91k56M73k67k9L47k05p9jR6O7M00o55N30k07L8j53K92J33
1845C59N9m02l51N08l15O5k9J0q9j22L47M9k29K55k09J79l11J84K8p8J09L03k39
1868H1j98K5L43k89j43l5K31j15j70j99K88K58j83J53q9L05l6O2r1p8M8K6jk33
$$ plain form
1892 -40 -49 -106 -7 -67 -155 -323 -253 -332 -143 136 -47 199 53 -200 -35 79 201 43 166 -111 302 27 83
1915 83 -165 -68 74 -190 -733 -151 39 -202 -131 17 -50 58 -229 42 293 -97 120 49 75 252 -232 -200
1937 -200 174 62 -418 -379 83 80 36 -236 -234 -303 -189 186 -53 -58 43 100 194 276 123 149 52 -84 203 111 -37
1962 -37 218 109 -208 -114 -230 33 -240 -192 -202 -146 -73 44 82 140 172 -76 334 399 13 221 -137 -316 -59
1985 -59 -57 44 15 -4 205 16 -119 20 -160 75 244 186 134 1 84 -124 189 -54 -92 159 -48 -194 30
2008 30 -246 10 -376 -334 129 -82 53 17 64 -140 129 32 6 369 -149 -12 8 152 155 40 -58 -49 -194 -83
2032 -83 -124 -44 -130 0 -101 60 203 -107 27 186 126 56 1 -128 60 309 -178 -63 -70 87 24 -170 308
2055 308 112 271 -138 -86 -41 -31 -216 -12 15 -85 145 135 143 -35 -145 173 125 300 -58 -72 -57 317 128
$$ packed form
1892d0rn7R9o0q8j68P0p9J89K79j83K46j46k53J65J14J22j58J23k77M13k75N6
1915H3k48R7J42k64n43N82J90k41P1J48o7J08k87K71K51l90K17p1K6J77m84L2
1937b00L74j12m80L9M62lm4k72Ko9J14L75k39nJ01N7R4Q2j53K6r7j36K87r2j48
1962c7K55j09l17R4j16K63k73M8j0N6P3J17L8N8L2k48M10O5l86K08l58j79K57
1985e9KJ01k9j9K09j89j35J39j80K35J69n8n2j33Q3k08L13k43l8K51k07j46K24
2008C0k76K56l86M2M63k11J35l6M7k04K69r7k6L63n18J37K0J44Lj15r8Rj45J11
2032h3m1Q0q6J30j01J61J43l10J34J59o0p0n5j29J88K49m87J15pJ57o3j94M78
2055C08j96J59m09N2M5J0j85K04K7j00K30j0Qj78j10L18m8J75l58j4J5L74j89
$$ plain form
2078 128 -137 -152 -217 -334 142 -27 -88 307 6 82 -15 230 12 -3 36 175 -18 -131 -68 -55 -63 -225 -325 -11
2102 -11 119 -49 -83 -7 30 97 77 79 142 72 67 60 -63 66 55 -123 98 -52 -166 61 -252 -191 -31 -52 -11 -434
2128 -434 14 154 -30 29 13 -41 -36 55 -208 110 114 -216 104 -32 -198 -244 -142 95 99 122 -59 9 -162 -120 192
2153 192 4 139 -26 -79 169 -121 284 -130 -463 161 121 122 -81 -27 -13 96 46 -2 -20 -16 317 194 24 36
2177 36 259 -45 78 -22 -22 180 -5 -38 7 -181 -133 -251 -185 -54 -173 -176 100 176 -21 -21 262 66 182 12
2201 12 80 54 -50 -35 -151 -1 -136 -168 197 -200 123 35 -38 2 -118 -26 245 170 230 -108 117 232 -161 156
2225 156 -62 -213 49 35 -120 -66 -56 6 -105 -28 231 337 -264 -76 -39 -105 -22 -96 -163 -93 56 51 181 42
2249 42 -154 211 -128 -228 94 -55 30 -185 -302 36 -202 -195 88 -27 155 167 -121 192 -33 -116 17 66
$$ packed form
2078A28k65j5o5j17M76j69o1L95l01P6r7K45k18j5L9J39j93j13O3J3qj62j00L14
2102a1J30j68l4P6L7O7k0KO3p0npj23J29j1j78K21j50j14K27l13O1J60k1M1m23
2128d34M48J40j84N9j6n4NR1k63L18Ml30L20j36j66m6J02K37MK3j81O8j71M2L12
2153A92j88J35j65n3K48k90M05m14l33O24m0Jk03N4J4J09n0m8j8ML33j23j70J2
2177C6K23l04J23j00%K02j85l3M5j88M8j18O6J31j19lK76P6j97%K83j96J16j70
2201A2O8k6j04J5j16J50j35l2L65l97L23q8p3M0j20R2K71p5O0l38K25J15l93L17
2225A56k18j51K62j4j55N4J0O2j11P7K59J06o01J88L7o6Q3p4o7P0J49nJ30j39
2249D2j96L65l39j00L22j49Q5k15j17L38k38PK83j15J82J2k88L13k25q3J33M9
$$ plain form
2271 66 -266 -146 -114 83 -149 -142 -19 -204 -51 -349 168 165 -161 -74 -98 -100 -47 6 286 -85 157 21 -154 139
2295 139 -61 188 -157 -81 -198 -41 73 -114 24 -6 212 -113 -84 -194 -145 79 141 21 272 -101 126 -3
2317 -3 41 -180 -12 -165 4 -20 32 -3 -43 341 -54 189 191 117 -107 68 303 261 113 -1 -60 84 224 -80
2341 -80 122 -312 -312 160 122 225 -89 66 -116 -9 -31 120 278 -24 -25 270 52 202 17 -95 166 -202
2363 -202 -32 45 -355 -102 66 -117 -54 210 29 106 9 70 283 231 -78 14 -292 -152 355 -79 -266 -11
2385 -11 -142 -34 -130 -208 -397 0 -6 -101 -188 -144 138 151 120 5 274 149 60 77 38 -77 102 -174 49 -19 -254
2410 -254 66 -121 19 -33 360 -22 -174 -134 42 71 -289 -145 143 -100 -69 37 -239 54 100 -130 -173 -159
2432 -159 -20 -20 24 88 165 -35 -72 191 158 -39 -106 224 -186 -10 -248 227 110 29 -172 -35 84 165 -131
$$ packed form
2271F6l32J20L2J97k32PJ23j85J53k98N17ll26Q7k4kN3N3K80l71K42j36j75K93
2295A39k00K49l45P6j17J57J14j87J38l0K18l25K9j10M9K24O2j20K51l73K27j29
2317cM4k21J68j53J69k4N2l5m0L84l95K43Kp4k24J75K35m2j48j14n9J44J40l04
2341h0K02m34%M72l8J03l14J55j82J07k2J51J58l02jK95k18J50j85j12K61l68
2363b02J70P7m00K53J68j83O3K64j81P7r7O1K13n2l09R2l06J40N07m34j87K55
2385a1j31J08r6p8j89L97or5q7M4K82J3l1j15K69j25q9J7l9j15J79k76K23o8k35
2410b54L20j87J40n2L93l82j52M0J76K9l60J44K88k43L1J06k76K93M6k30m3J4
2432a59J39%M4O4P7k00l7K63l3j97o7L30m10J76k38M75j17q1k01J37J19Q1k96
$$ plain form
2455 -131 -112 130 -220 163 -240 -248 298 -41 6 -26 -36 -45 94 2 -126 1 117 72 -135 -95 -28 91 -180 -38
2479 -38 -218 -186 203 22 72 -93 267 92 26 45 226 -18 259 -352 243 177 -48 -168 -164 20 -228 -218 238
2502 238 277 -289 -95 -20 79 41 -149 -227 173 18 90 -36 109 -21 -144 -296 -157 -1 39 -65 -191 -166 29
2525 29 -34 79 84 -89 -120 93 301 -135 -128 85 -183 267 233 -112 83 -302 66 108 -214 -6 -90 -247 -64
2548 -64 61 193 -81 170 -243 -63 -2 185 2 415 -116 -36 -17 -32 113 -2 -42 -131 -83 -85 -85 -44 11 -210 204
2573 204 5 188 -9 -129 105 58 -13 40 -132 -172 102 -111 173 -71 74 -237 182 -198 67 -34 22 -101
2595 -101 -219 56 -61 38 175 -143 212 166 45 -202 -43 -189 37 -21 227 -36 81 33 197 -36 -444
2616 -444 -254 -23 -87 -232 -27 166 296 -223 219 -142 181 23 18 209 -75 -35 10 -149 -166 -183 57 283
$$ packed form
2455a31J9K42l50L83m03qN46l39M7l2j0rJ39r2j28J27J16m5k07M0O7J19k71J42
2479c8j80L2L89j81N0j65L60j75o6J9J81k44K77o11N95o6k25j20MJ84k48J0M56
2502B38L9n66J94P5R9l8j90p8M00j55P2j26J45j30j23j52J39J56M0j04j26K5J95
2525B9o3J13Nj73l1K13K08m36PK13k68M50l4l45J95l85L68M2l22K08q4j57J83
2548f4J25J32k74K51m13J80O1J87j83M13n31Q0J9j5J45j15m0q9M8k%M1N5k21M14
2573B04j99J83j97j20K34m7p1N3j72m0K74k13K84k44J45l11M19l80K65j01N6j23
2595a01j18K75j17R9J37l18L55m6j21k47J59j46K26n8K48k63J17m8J64k33m08
2616d44J90K31o4j45K05J93J30n19M42l61L23j58nJ91k84M0M5j59j7j7K40K26
$$ plain form
2638 283 -69 103 34 89 46 161 145 177 98 67 270 127 -22 159 -94 -60 199 -91 79 -13 -102 92 -160
2661 -160 -57 -123 33 -99 -179 -18 0 -3 2 128 120 32 -260 -79 -142 -170 -208 175 -33 -43 135 -231 -126 -274 -19
2686 -19 -40 244 41 77 126 66 80 23 -216 -46 139 -46 -117 -249 139 -65 -92 52 57 -154 -127 43 -181 71
2710 71 158 42 -190 -153 90 59 -116 -245 -123 -216 -176 -60 -285 -61 107 18 141 -64 9 36 76 -139 69
2733 69 424 -130 93 95 -57 216 -33 37 79 -20 -209 -165 75 60 -87 -179 -167 -69 -9 141 0 -257 202 190
2757 190 -117 -46 113 124 23 -224 91 -75 -14 -181 142 -273 122 -56 84 61 22 28 106 184 -27 209 100
2780 100 -6 -221 11 325 -61 276 -55 -283 33 -26 -15 -60 -6 -214 30 -41 109 -104 98 2 90 11 -174
2803 -174 146 -180 8 67 184 99 -118 191 195 -267 -197 136 253 -50 67 11 -150 -33 67 -205 -77 99
$$ packed form
2638B83l52J72o9N5m3J15j6L2p9l1K03j43j49J81k53L4K59k90J70r2q9J94k52
2661a60J03o6J56j32q0J61J8lNJ26qq8k92J81o3k8l8L83k08j0J78l66J05j48K55
2686a9k1K84k03L6M9o0J4n7k39J70J85j85p1j32L88k04k7J44Nk11K7J70k24K52
2710G1Q7j16k32L7K43l1j75j29J22r3M0J16k25K24J68q9J23k05P3K7M0k15K08
2733F9L55n54K23Kj52K73k49P0M2r9j89M4K40j5j47r2J2R8O0J50j41k57M59j2
2757A90l07P1J59J1j01k47L15j66O1j67L23m15L95j78J40k3l9OP8P8k11K36j09
2780A00j06k15K32L14l86L37l31k28L16n9J1m5N4k08K44p1J50k13K02r6Q8p9j85
2803a74L20l26J88N9J17q5k17L09Mm62P0L33J17l03J17n6j61J17J00k72J28J76
$$ plain form
2825 99 13 -90 -145 -41 -173 -120 -42 -217 176 89 -167 -155 -91 172 -194 -52 42 -100 -22 98 -49 203 33
2848 33 -216 169 87 20 -84 -63 -65 243 -199 30 -19 46 31 -186 143 -8 41 -75 292 123 48 109 -110 170
2872 170 135 20 181 134 -304 180 -12 82 -144 -50 -158 97 -226 -172 330 221 0 181 -109 215 355 -68
2894 -68 -97 -252 -311 -215 11 178 87 -2 -120 92 -175 -162 -158 -15 -29 153 258 106 184 -91 161 -11 130 -160
2918 -160 -110 20 -199 -125 2 -2 -20 -219 69 -70 -82 44 -334 109 46 -35 -156 96 128 29 3 -71 -61 199
2942 199 -114 220 -23 43 20 -65 -7 -405 -7 -192 -78 58 -11 205 -253 84 27 356 107 -38 -257 -15
2964 -15 62 -101 -104 -130 -33 -11 58 34 -103 41 -133 105 124 226 48 226 115 -214 233 54 10 -8 37 -155
2988 -155 -109 -22 -147 -197 -33 -164 51 72 -107 104 -125 69 283 -205 57 65 47 -109 100 -60 135 149 -83
$$ packed form
2825I9q6j03n5J04j32N3P8j75L93q7k56J2O4K63l66J42R4j42P8J20j47K52j70
2848C3k49L85q2o7j04K1kL08m42K29m9O5j5k17L29j51M9j16L67j69p5O1k19K80
2872A70l5j15J61m7m38M84j92R4k26R4j08K55l23N4N02j09k21J81k90L24J40m23
2894f8k9j55n9R6K26J67r1q9j18K12k67J3MJ43j4J82J05j52P8k75K52j72J41k90
2918a60N0J30k19P4J27mj8j99K88j39j2J26l78M43o3q1j21K52L2r9k6p4J0K60
2942A99l13L34k43O6k3q5N8l98L98j85J14J36o9K16m58L37n7L29k49j45k19K42
2964a5P7j63lk6R7K2O9k4j37J44j74K38J9J02j78J78j11l29M47j79m4j8M5j92
2988a55M6Q7j25n0J64j31K15K1j79K11k29J94K14m88K62Qj8j56K09j60J95J4k32
$$ plain form
3011 -83 -3 -71 -24 -81 -292 -159 -135 13 37 293 20 -138 -55 -238 322 -15 97 113 50 300 49 -15 -96 -104 -6
3036 -6 -56 171 -33 -134 100 -7 209 -43 42 69 -23 107 -280 33 141 66 128 247 -347 -274 -61 -208 -89
3059 -89 139 166 -251 -89 -192 42 19 140 69 97 149 85 88 -243 92 122 17 -160 -92 -58 -171 -139 129 146 116
3084 116 -214 -155 77 230 -120 -23 -152 107 95 167 162 144 62 -161 -264 -22 -22 -122 25 -181 -119 -33 175 -421
3108 -421 -68 -76 -177 -22 11 81 15 30 -143 58 166 -27 87 -209 247 95 -276 -164 2 1 -5 -77 -110 -47
3132 -47 -54 170 -181 -11 4 51 172 -85 209 30 144 -12 -208 21 -120 -185 -155 131 169 33 105 150 272
3155 272 143 305 226 -50 102 190 48 -129 438 254 -95 114 137 157 -256 -194 152 16 69 -57 -295 153
3177 153 28 6 -121 8 -140 333 45 238 72 -78 -150 91 -63 47 124 126 -184 -40 240 -232 179 -66
$$ packed form
3011h3Q0o8M7n7k11J33K4J48K4K56k73j58Q3j83N60l37J12J6o3K50k51o4q1qR8
3036fn0K27k04j01K34j07K16k52Q5K7r2J30l87L13J08p5O2J19n94P3K13j47J19
3059h9K28K7m17J62j03K34k3J21p1K8N2o4Ll31L35L0j05j77O8L4j13L2K68J7l0
3084A16l30N9K32J53l50R7j29K59j2P2nj8q2k23j03K42%j00J47k06O2Q6K08n96
3108d21L53qj01J55L3P0o6J5j73K01J08j93J14k96M56j52l71J12J66jop2l3O3
3132d7pK24l51J70J5M7J21k57K94j79J14j56j96K29j41o5L0K86L8j36P2M5J22
3155B72j29J62p9k76J52Q8j42j77N67j84l49K09K3K0m13O2L46j36N3j26k38M48
3177A53j25k2j27J29j48M73k88J93j66j50p2K41j54J10P7Kl10J44K80m72M11k45
$$ plain form
3199 -66 11 -129 273 438 88 76 22 67 -111 140 -254 -124 -130 -179 -2 -23 85 -305 -187 -223 232 130 -32
3222 -32 -183 -12 -278 -82 138 -43 133 272 136 -191 146 -166 124 115 -361 -14 148 -39 -48 294 -8 172
3244 172 6 73 -8 25 127 32 -35 44 -123 31 -23 29 -395 10 -401 1 -76 -247 -44 -168 -79 168 199 112
3268 112 -260 28 -75 204 12 -227 -144 125 -155 -136 137 -24 14 -83 -44 -29 64 216 -383 -136 84 -247
3290 -247 65 65 210 110 10 95 169 -165 -349 -172 -112 -106 -167 -221 75 57 197 19 -117 28 164 -148 144
3313 144 304 -67 21 -63 165 -183 -186 81 -124 -25 -54 109 -172 19 -140 -268 -300 64 -45 20 -164 -153 -66
3336 -66 104 283 -89 139 -281 -181 -36 -80 154 -217 164 -209 149 -100 210 -93 -125 -242 -33 221 42
3357 42 82 126 -69 27 114 -148 -131 -136 -305 58 92 -104 -223 -243 226 -124 -60 -4 -15 31 123 1 -116 -267 -114
$$ packed form
3199f6P7j40M02J65l50j2n4M5j78K51l94J30om9J77k1J08l90J18l6M55j02j62
3222c2j51J71k66J96K20j81J76J39j36l27L37l12K90rm76L47J62j87rL42l02J80
3244A72j66O7q1L3J02r5o7P9j67J54n4N2m24M05m11M02p7j71K03j24Q9K47L1q7
3268A12l72K88j03K79j92k39Q3K69k80J9K73j61L8r7L9J5R3J52n99K47K20l31
3290b47L12%J45j00j00Q5P4l34j84J77O0Oo1n4K96j8J40j78j36J45J36l12K92
3313A44J60l71Q8q4K28l48lK67k05R9k9J63k81J91j59j28l2L64j09O5j84J1Q7
3336f6J70J79l72K28m20J00J45m4K34l71L81l73L58k49L10l03l2j17K09K54j79
3357D2M0M4j95R6Q7k62J7nj69L63L4j96j19k0M69l50O4N6j1M6R2j22j17j51J53
$$ plain form
3382 -114 -6 -74 -140 -206 -170 39 154 0 -184 -164 -75 -8 -81 -98 158 63 110 -217 -357 118 -41 -85 124 194
3406 194 61 -22 114 -36 -133 163 50 28 -194 134 -110 -245 -12 72 133 334 -21 -300 73 164 46 51 96
3429 96 138 106 -24 -125 153 -28 4 -196 126 20 -121 -29 -135 178 -76 50 -198 103 25 -32 22 -30 98
3452 98 152 -115 279 -9 35 -131 -5 -89 -73 -391 -105 142 4 -333 -94 -285 -106 222 107 1 342 -12
3474 -12 71 16 42 -36 -108 -210 165 26 -107 -10 -34 -51 -59 -159 12 -75 164 85 19 -48 -182 19 -80 198 120 14
3500 14 39 -334 -17 -221 -316 234 231 178 -94 -137 46 216 -19 3 183 13 90 213 -69 170 -231 -224 -255 -142
3524 -142 69 7 -161 -25 -205 -61 118 -156 -83 2 16 143 57 -204 14 -10 -35 233 194 -84 63 -115 -74
3547 -74 -135 -48 -125 -120 -191 74 -204 -85 117 -27 -54 -24 -26 -65 93 47 14 -17 286 -9 324 -73 -172 97 -119
$$ packed form
3382a14J08o8o6o6L6K09J15j54j84K0Q9O7p3j7K56r5M7l27j40M75j59m4K09P0
3406A94j33q3J36j50r7K96j13k2k22L28k44j35K33Q4O1K01l55k79L73R1j18NM5
3429I6M2l2j30j01K78j81L2k00L22j06j41R2j06L13k54J26k48L01p8n7N4n2J28
3452I8N4k67L94k88M4j66J26q4J6l18K86K47j38l37K39j91J79L28j15j06L41l54
3474a2Q3n5K6p8p2j02L75j39j33R7k4j7qj00J71q7K39p9o6o7j34K01r9K78p8j06
3500A4K5l73L17k04r5N50ln3k72m3J83J70k35K2J80j70P7J23k82K39m01Pl1J13
3524a42K11o2j68J36j80J44J79k74P3Q5J4J27q6k61K18k4k5K68l9k78J47j78M1
3547g4o1Q7p7Np1K65k78J19K02j44k7L0kl9J58m6l3l1L03k95L33l97r9K69k16
$$ plain form
3572 -119 -15 137 -195 -190 -80 -212 137 11 12 188 -45 256 374 167 45 -249 58 -11 58 -22 -152 -158 62
3595 62 174 63 -238 -155 -163 393 49 -3 -62 22 56 192 14 63 104 -87 151 -13 -19 -84 -87 90 -102 -12 -34 83
3621 83 -64 -115 235 302 206 277 54 214 34 251 -62 -82 86 -281 -257 186 -120 -188 -41 -159 -13 28 -286
3644 -286 18 37 -51 -46 40 -197 58 -204 273 156 0 24 52 6 -203 100 -31 88 164 -22 -24 -60 -88 125
3668 125 28 173 13 17 462 379 -303 95 155 204 -47 -121 -144 -23 -315 117 83 203 -89 -105 -112 -32 155 -88
3692 -88 -11 272 -108 286 -113 88 307 -188 69 -59 -119 -51 -253 -150 43 -190 46 -126 -31 -35 -57 121 327
3715 327 123 86 22 102 -9 248 46 182 -9 -158 83 -95 20 -56 93 8 -226 -62 -198 284 69 90
3737 90 162 54 147 -54 99 11 104 50 118 201 118 50 -171 -10 110 22 24 3 98 -187 7 -48 -13 -75 72 -23
$$ packed form
3572a19J04J52l32NJ10j32L49j26JJ76k33L01J18k07j22k94L07o9O9q0j30oK20
3595F2J12j11l01Q3qN56l44n2n9Q4L4J36j78M9M1j91K38j64oo5lJ77j92R0k2J17
3621H3j47n1L50O7r6P1k23J60j80K17l13k0J68l67K4M43l06o8J47j18J46M1l14
3644b86L04J9q8NQ6k37K55k62M77j17j56K4K8m6k09L03j31J19P6j86kl6k8K13
3668A25r7J45j60MM45q3o82L98O0M9k51p4k3J21k92M32l4J20k92j6pQ0J87k43
3692h8P7K83l80L94l99K01K19m95K57j28o0O8k02J03J93k33K36j72R5mk2J78K06
3715C27k04l7o4Q0j11K57k02J36j91j49K41j78J15p6J49q5k34J64j36M82k15K1
3737I0P2j08R3k01J53q8R3n4O8Q3q3o8k21J61J20q8Kk1R5k85J94n5L5o2J47r5
$$ plain form
3763 -23 -59 200 187 -14 158 -2 -219 -256 -53 145 -206 -123 -213 -15 -110 174 -33 40 234 28 -134 -153 140
3786 140 -6 101 97 -210 214 -17 63 -53 30 -15 171 -38 56 -49 -11 128 -211 -104 43 -101 -43 -214 -123
3809 -123 -116 -23 6 -69 -22 -131 -130 -378 28 -28 -221 -202 -27 -49 -241 112 155 135 -97 78 29 73 -57 279 -87
3834 -87 149 -307 -202 -250 66 -218 -1 -212 172 235 -130 236 -139 -42 -80 177 35 54 -108 -27 255 -95
3856 -95 -98 -103 -173 -286 25 101 19 200 0 -186 20 -71 6 151 37 75 258 7 -167 95 -65 -6 19 -237
3880 -237 161 2 -120 -105 -206 -97 -247 92 74 -15 16 31 24 319 238 -142 -42 -201 -47 -88 -5 149 -71
3903 -71 56 -108 69 -227 -49 189 45 189 -122 64 209 130 107 31 148 134 247 -17 24 -31 94 -75
3925 -75 -43 -121 141 -92 -137 67 -110 53 -145 93 130 251 65 303 120 -98 -61 24 117 5 -252 -234 192
$$ packed form
3763b3l6K59j3k01J72j60k17l7K03J98l51Q3r0J98r5K84k07P3J94k06j62j9K93
3786A40j46J07ml07M24k31Q0j16Q3m5J86k09R4j05L8J39l39J07J47j44N8j71R1
3809a23PR3K9p5M7j09Jk48M06n6j93J9J75k2j92L53M3k0k32J75m9M4j30L36l66
3834h7K36m56J05m8L16k84K17k11L84O3l65L66l75R7l8K57j42J9j62Q1K82l50
3856i5lnp0j13L11P6q2J81k00j86K06r1P7J45j14L8J83k51j74K62j60N9K5k56
3880b37L98j59j22J5j01J09j50L39j8q9L1J5pK95q1l80J00j59J54m1Q3J54k20
3903g1J27j64J77k96J78K38j44J44l11J86J45p9k3p6J17j4J13k64M1n5J25j69
3925g5L2p8K62k33m5K04j77J63j98K38L7J21j86K38j83k18L7Q5R3j12k57J8M26
$$ plain form
3948 192 -159 92 168 -117 -13 -199 -142 -26 -109 -192 -38 71 36 -140 107 16 70 62 -45 -422 -172 39 36 132
3972 132 -218 -253 74 -212 18 -34 -113 -158 -39 67 30 23 -7 90 62 178 133 205 -139 181 63 24 -397 -105
3996 -105 23 -83 61 -304 -70 160 -28 129 -145 56 338 58 92 -59 -124 78 11 42 -161 -37 -80 -75
4018 -75 117 102 33 62 50 -128 5 -108 -291 60 -41 70 94 43 -71 227 36 8 -94 209 -243 -151 -32
4041 -32 -116 194 -213 41 64 -152 176 216 -52 37 -297 213 69 -241 116 -218 -120 -107 -50 3 -297 81 -176
4064 -176 -98 122 28 -52 -183 -167 225 -91 -20 24 124 4 -280 197 268 -2 268 -184 -90 -136 -44 -340 -51
4087 -51 -136 6 31 -14 -224 -25 160 -57 9 -4 222 -104 115 -83 269 210 33 -31 -83 -233 -226 -125 4 -29
4111 -29 -219 45 53 -147 59 154 -8 49 -42 15 167 -201 -103 -191 66 25 1 -240 -67 -61 -191 -183 -3 26 80 -7
$$ packed form
3948A92l51K51P6k85J04j86N7J16q3q3J54J09l5j76K47r1N4qj07l77K50K11lR6
3972A32l50l5L27k86K30n2p9m5J19J06l7pl0R7k8J16m5P2l44L20j18l9m21K92
3996a05J28j06J44l65K34K30j88J57k74K01K82k80L4j51o5K02o7L1k03J24m3N
4018g5J92j5o9K9j2j78J33j13j83L51j01J11K4n1j14K98j91k8j02L03m52R2J19
4041c2q4L10m07K54K3k16L28M0k68Q9l34N10j44l10L57l34R8J3N7N3l00L78k57
4064a76P8K20r4q0j31J6L92l16P1M4J00j20k84M77P1k70K70m52R4m6R2k96K89
4087e1q5J42K5m5k10J99J85k17O6j3K26l26K19j98L52n9j77o4n2j50PJ01J29l3
4111b9j90K64Qk00K06R5j62N7r1N7J52l68R8q8K57m1k4k41J73Oj30QJ80K9N4q7
$$ plain form
4137 -7 32 144 87 -57 -5 -145 10 340 211 74 -103 -201 -338 51 208 135 -128 -25 -31 -163 134 134 -11 -7
4161 -7 139 190 -18 105 27 49 -281 -111 21 -80 -153 -224 -337 79 6 -9 -154 -129 48 -133 30 -22 217 314
4185 314 223 -12 186 86 63 -69 -121 -163 -147 358 -136 -113 176 18 38 257 56 88 132 315 76 178 185 66
4209 66 143 -20 -6 57 165 -21 -24 172 -64 -114 146 -244 -147 75 -51 -70 -180 26 -264 114 30 76 35 2
4233 2 -174 5 -32 119 -81 -203 114 166 -144 -59 -218 -27 -155 -175 104 -71 -36 -229 -106 108 250 100
4255 100 79 54 29 35 -217 -246 136 -11 -208 -144 169 136 -206 17 -9 64 34 312 -189 -53 -181 181 57 -16
4279 -16 80 -207 45 32 40 103 43 -2 -242 -12 -153 -294 -187 -19 -9 -31 83 -30 86 -43 -147 -2 -133
4302 -133 217 -156 40 30 -37 14 105 63 -20 -14 -73 -127 -172 -191 166 359 23 -41 -123 137 65 19 -35 -99 -161 13
$$ packed form
4137gL9J12n7j44N2j40J55L30j29j37j77r8j37L89J57p3k63J03oj32K97%j45M
4161gJ46N1k08J23p8K2l30J70J32j01p3p1j13M16p3j5j45K5J77j81J63n2K39R7
4185C14r1k35J98j00k3j32n2m2J6N05m94K3K89j58K0K19k01L2M4J83k39J02Pj19
4209F6P7j63J4O3J08j86lJ96k36n0K60l90R7K22j26j9j10K06k90L78q4M6m1l3
4233Bj76J79l7J51k00j22L17N2l10Q5j59J91j28k0K79j75L5j93J23K14J42j50
4255A00k1k5k5Ok52k9L82j47j97O4L13l3l42K23k6P3l0K78n01J36j28L62j24p3
4279a6R6k87K52j3QO3o0m5k40K30j41j41J07J68J0k2J14j13J16j29j04J45j31
4302a33L50l73J96j0o7N1R1m2q3On9n4m5j9L57J93l36o4q2K60p2m6n4o4o2J74
$$ plain form
4328 13 65 109 0 4 -235 -26 -179 80 -86 -97 155 63 -13 123 -224 68 19 84 167 -118 -34 -81 -84 149 -19
4353 -19 31 -49 -94 98 80 12 -21 146 -19 -141 165 274 115 57 132 -198 -329 83 1 14 -200 23 -72 186
4377 186 33 -136 -83 -304 -68 73 -113 77 272 78 -94 -52 1 95 44 -19 278 -219 70 128 23 -6 148
4400 148 -17 67 -142 -83 -106 -34 -75 -36 -16 12 -61 125 115 130 -64 80 119 123 -136 -304 48 -107 -79 -34 37 -9
4426 -9 9 -260 312 -68 -304 -72 59 211 56 -56 -117 89 39 42 -31 -38 63 -124 46 -228 -153 -140 -149 -205 210
4451 210 -65 81 -9 -30 -25 -121 98 138 25 11 -69 133 -48 -12 -21 21 -111 5 177 -107 78 161 14 60 232
4476 232 20 64 23 143 11 -114 -2 -5 174 -27 -136 252 -79 -150 74 -98 203 10 33 -93 109 109 -77
4499 -77 216 -36 237 -258 -93 165 235 -196 -270 4 -98 77 47 -18 120 -55 -243 49 -48 131 -140 -211
$$ packed form
4328A3N2M4j09Mk39K09j53K59j66j1K52r2p6J36l47K92m9O5Q3k85Q4m7lK33j68
4353a9N0q0m5J92j8o8l3J67j65j22L06J09j59n8P5l30j31M12q2J3k14K23r5K58
4377A86j53j69N3k21K36J41j86J90J95j94j72M2N3R4n1o3K97m97K89N8j05k9J54
4400A48j65Q4k09N9k3P2m1L9K0K8p3J86j0J5j94J44L9Mk59j68L52j55K8M5P1m6
4426iJ8k69N72l80k36K32J31J52j55j12o1K06n0Lp3pJ01j87J70k74P5J3rn6M15
4451B10k75J46r0k1Nr6K19M0j13j4q0K02j81L6rM2j32J16J72k84J85Q3j47M6J72
4476B32k12M4m1J20j32j25J12lJ79k01j09L88l31p1K24j72L01j93K3j26K02%j86
4499g7K93k52K73m95J65K58P0m31p4K74j02J75l0o5J38j75j88K92r7J79k71p1
$$ plain form
4521 -211 144 -16 -2 -33 -93 -82 242 132 202 12 429 -117 -83 42 146 -150 40 83 -95 68 -89 252
4543 252 38 137 213 241 -380 -49 313 130 -3 -7 15 101 -423 -100 92 54 -227 -141 355 22 -226 46 -42
4566 -42 99 18 -127 141 -50 143 -80 118 -134 -405 56 28 -58 169 -154 -48 -16 -165 -217 -35 -19 -82 35
4589 35 -219 57 216 -50 196 -19 113 -55 -73 105 -177 1 -16 -7 134 124 124 268 -130 -24 -141 46 -57
4612 -57 100 -66 170 183 111 -162 26 -325 -335 135 88 26 222 -139 215 156 -207 -218 -100 -89 207 166 34
4635 34 164 -63 16 50 200 -90 77 -88 56 -8 -17 58 -307 -84 182 -109 -58 -219 110 79 100 -148 209
4658 209 -21 -105 -112 86 211 -303 -153 -29 87 -205 -251 -62 17 69 12 -297 -22 101 -490 204 74 4 -93
4681 -93 -16 -11 -143 66 16 65 3 64 -403 6 112 -7 149 16 -5 34 -101 44 -49 -58 65 0 -148 31 -54
$$ packed form
4521b11L55j60J4l1o0J1L24j10P0j90M17n46L4J25J04k96J90M3j78J63j57L41
4543B52k14R9P6K8o21L31L62j83j33mK2Q6n24L23J92l8k81Q6M96l33k48K72q8
4566d2J41q1j45K68j91J93k23J98k52k71M61k8q6K27l23J06L2j49n2J82J6o3J17
4589C5k54K76J59k66K46k15J32j68j8J78k82J78j7RJ41j0%J44l98J06j17J87j03
4612e7J57j66K36J3p2k73J88l51j0M70m7o2J96l61L54n9l63j1J18J1K96m1j32
4635C4J30k27P9L4J50k90J67j65J44o4rP5l65K23K66k91N1j61L29l1K1k48L57
4658B09k30q4pJ98J25n14J50J24J16k92m6J89P9N2n7l09K75J23n91O94j30p0r7
4681i3P7Nj32K09n0M9o2O1m67M09J06j19J56j33k1L9j35J45r3rJ23o5j48J79q5
$$ plain form
4706 -54 286 64 -392 77 131 -45 -102 87 309 4 182 -3 125 112 -111 89 14 45 -7 208 -237 157
4728 157 -167 136 66 -50 -22 -8 -59 -126 -251 -164 -188 -186 112 56 35 307 -261 -83 -13 37 304 80 30 -160 166
4753 166 -235 -14 -96 -76 40 21 63 99 124 0 -142 -46 -67 27 72 176 78 45 74 341 18 21 -104 -62 -131 41
4779 41 -211 20 84 71 147 207 -257 143 -144 174 -114 60 317 173 45 -134 121 -25 -120 -321 -5 -55
4801 -55 -129 14 -105 -165 18 222 -149 144 17 110 57 143 264 -73 5 -49 -74 -43 134 64 -137 37 23 -16
4825 -16 -414 -297 -93 -2 -27 -41 314 -22 169 -98 344 289 47 115 192 -52 43 22 -93 -122 -195 -202 238 13
4849 13 -163 -142 -61 61 96 -44 146 312 24 170 -246 -228 -14 -371 164 -9 146 53 -272 52 96 -68
4871 -68 -118 122 -364 -43 126 -180 -67 37 205 14 153 72 145 9 216 -121 -123 83 120 58 174 -177 -391
$$ packed form
4706e4L40k22m56M69N4j76n7J89K22l05J78j85J28j3k23K00p5L1n2K15m45L94
4728A57l24L03p0j16K8J4n1o7j25Q7k4KK98n6k1K72n68J78P0N0K67k24n0j90L26
4753A66m01K21q2K0J16j9M2L6K5j24j42R6k1R4M5J04r8l3K9K67l23Lj25M2o9J72
4779D1k52K31O4j3P6O0m64M00k87L18k88J74K57j44j28j79K55j46r5k01L16n0
4801e5p4J43j19o0J83K04l71K93j27R3n3Q6J21l37P8n4k5L1J77p0k01J74j4l9
4825a6l98J17K04R1k5j4L55l36J91k67M42n5k42O8P7k44R5k1j15k9p3pM40k25
4849A3j76K1Q1J22L5j40J90J66k88J46m16J8K14l57N35j73J55r3l25L24M4j64
4871f8n0K40m86L21J69l06J13J04J68j91J39q1P3j36K07l37kK06L7o2J16l51k14
$$ plain form
4894 -391 -107 -84 -82 18 39 -195 262 51 127 241 74 120 -79 -146 21 -77 351 -335 13 22 -110 -14 143 85
4918 85 91 -32 16 -28 -14 -81 -199 91 35 182 -5 32 134 62 113 -205 -87 -21 -147 -19 -81 245 25 -159
4942 -159 95 230 -109 -85 -79 -96 2 161 50 146 -67 42 -53 50 233 -168 66 130 7 -297 -122 -130 -118 72
4966 72 62 182 -296 161 -98 -8 353 239 -43 49 77 -121 -119 129 -47 -300 -191 -11 -139 -18 32 -200 209
4989 209 132 -127 122 -82 48 -42 17 46 243 42 -301 163 -45 -19 -42 -136 119 -207 59 -95 -355 159
5011 159 134 88 17 -122 -34 79 -40 384 56 38 218 359 -153 149 -12 -229 67 -158 -56 -171 -5 -233
5033 -233 -168 305 -145 210 66 -78 205 83 100 -115 -18 -297 1 -3 -86 101 -20 -91 -193 55 -96 8
5055 8 -140 293 -126 20 167 214 90 -126 56 16 -160 -220 -171 -100 29 -138 50 -16 234 -56 62 -114 93
$$ packed form
4894c91K84K3KJ00K1k34M57k11P6J14j67M6j99o7J67r8M28o86L48Rj32R6J57n8
4918H5Oj23M8m4J4o7j18K90n6J47j87L7J02p2N1l18J18O6j26J28o2L26k20j84
4942a59K54J35l39K4Oj7R8J59j11R6k13J09r5J03J83m01K34O4j23l04J75qJ2J90
4966G2j0J20m78M57k59R0L61j14k82R2K8j98KK48j76k53J09J80j28J21N0k32M09
4989B09p7k59K49k04J30r0N9K9J97k01l43M64k08K6k3r4K55l26K66j54k60N14
5011A59k5m6p1j39Q8J13j19M24l28j8J80J41n12L02j61k17K96k25J02j15J66k28
5033b33O5M73m50L55j44j44K83j22J7k15R7k79K98mq3J87j21p1j02K48j51J04
5055Hj48M33m19J46J47M7j24k16J82m0j76o0M9P1J29j67J88o6K50k90J18j76K07
$$ plain form
5078 93 -171 149 -216 96 39 -128 201 -122 -31 -284 49 228 -83 70 -10 -101 -129 45 -29 17 7 -132 91
5101 91 43 -183 371 -152 -138 -34 -129 -25 -40 12 -159 -30 -152 11 -96 -115 -98 74 26 -197 42 -71 310
5124 310 27 127 -107 -61 150 172 154 -90 30 120 -125 184 -272 147 -40 43 169 -124 47 138 150 -40
5146 -40 17 62 183 -53 324 34 -113 245 -83 -24 -111 81 -76 175 -27 -189 84 139 183 -91 -118 121 183
5169 183 255 -50 52 -46 -159 -244 -4 -246 -120 -58 223 4 -133 62 -164 103 19 206 -3 28 -319 23
5191 23 -98 -36 42 -60 184 47 112 -98 70 107 -279 8 -73 80 240 -204 -14 121 66 -128 -140 64 -84
5214 -84 187 -25 154 -58 8 -14 -33 -211 191 -197 -44 176 -56 -48 -175 -106 -159 79 -137 220 -31 -2 -249
5237 -249 11 155 -98 -191 210 -62 139 58 110 -248 -133 -201 -152 139 263 135 -172 -67 53 -97 110 64
$$ packed form
5078I3k64L20l65L12n7j67L29l23R1k53L33J79l11J53q0r1k8J74p4M6j0j39K23
5101I1m8k26N54n23J4J04r5J04j5N2j71J29j22J63j07j9J7J72m8k23K39j13L81
5124C10k83J00k34M6K11K2j8k44J20R0k45L09m56M19j87Q3J26k93J71R1J2j90
5146d0N7M5J21k36L77k90j47L58l28N9q7J92j57K51k02j62K73N5M4k74k7K39O2
5169A83P2l05J02r8j13q5K40k42J26O2K81k19j37J95k26K67q4J87k09L1l47L42
5191B3j21O2P8j02K44j37O5k10J68L7l86K87q1J53J60m44J90J35n5j94j2K04j48
5214h4K71k12J79k12O6k2j9j78M02l88J53K20k32Qj27O9n3K38k16L57k51K9k47
5237b49K60J44k53r3M01k72K01q1N2l58J15o8M9K91J24j28l07J05J20j50K07m6
$$ plain form
5259 64 -98 102 -36 -102 16 -68 103 397 0 -99 15 60 -12 -15 101 16 21 -85 26 65 311 -45 -30 -57 62
5284 62 103 79 87 381 89 63 6 -48 70 -38 -13 -50 -25 -17 71 171 36 -130 69 115 42 -58 -98 -197 -108 87
5310 87 9 -39 178 -129 -110 -34 41 136 52 -14 24 -319 3 -17 -79 77 -62 -195 191 -187 -188 21 -107 -155 -58
5335 -58 -143 179 -112 124 165 -75 290 -107 -128 46 123 66 139 242 -59 436 246 92 -262 45 23 -60 107
5358 107 143 344 52 -6 -100 57 -143 131 60 -200 408 131 -79 113 -6 204 0 27 -15 48 177 -123
5380 -123 174 231 73 250 -282 -253 -64 -60 -47 62 248 -151 -45 178 121 -15 -38 34 -60 85 111 -63 -126 214
5404 214 -35 89 57 144 53 -275 -6 -112 129 -266 58 -42 -16 130 -56 61 -47 495 -299 127 74 -121
5426 -121 -73 245 -45 -144 39 -28 -183 234 105 168 97 59 190 -86 61 226 174 180 250 -32 -291 228 -72
$$ packed form
5259F4j62K00j38o6J18q4J71K94l97r9J14M5p2lJ16q5Nj06J11L9K46l56J5k7J19
5284F2M1k4QK94k92k6n7n4J18j08K5l7K5QQ8J00j35j66J99M6p3j00m0r9Q9J95
5310H7p8m8K17l07J9P6P5R5q4o6L8l43L22k0o2J56j39j33L86l78jK09j28m8R7
5335e8q5L22k91K36M1k40L65l97k1J74P7n7P3J03l01M95j90j54l54L07k2q3J67
5358A07L6K01k92n8r4J57k00K74p1k60O08k77k10J92j19K10k04K7m2O3J29l00
5380a23K97N7j58J77n32K9J89MJ3J09J86l99J06K23n7j36k3P2r4J45K6j74o3L40
5404B14k49J24l2Q7r1l28K69j06K41l95L24j00K6J46j86J17j08N42p94M26n3j95
5426a21M8L18k90r9J83o7j55M17j29O3p1l8J31k76J47J65n2OP0k82k59N19l00
$$ plain form
5449 -72 14 -58 242 275 142 86 -38 -222 141 -63 -66 -259 -5 -297 -17 -47 173 201 41 8 -7 322 -53 64
5473 64 -83 119 -278 -32 133 -27 89 220 -286 192 -295 -93 -18 149 -181 18 248 99 -117 -158 -191
5494 -191 163 -6 -120 -159 -56 253 -132 -73 -337 -32 17 -174 115 79 195 5 -142 32 -18 169 11 162
5516 162 43 -142 168 -79 68 39 -168 288 -123 -198 192 -77 -36 75 28 -4 40 107 55 87 160 276 291 175
5540 175 243 226 45 -275 197 169 -226 80 126 101 239 -55 10 -151 154 -20 243 3 70 25 -105 139 -23
5563 -23 45 193 27 135 171 -62 -66 54 -224 -144 -104 383 226 -147 -57 -8 -42 -138 95 -141 -107 -135 59 6 -75
5588 -75 -56 125 -97 29 72 49 42 -162 81 -27 80 -229 13 -39 108 91 -121 -74 -8 -42 49 -151 -5 -77
5612 -77 220 -76 8 -157 -135 -5 -86 124 7 -158 -249 -161 28 226 220 11 1 42 -231 -134 -332 161 63 -70
$$ packed form
5449g2Q6p2L00L3j33n6j24j84L63k04lj93K54k92K80l0K20K8j60l3j5L29l75J17
5473F4j47K02l97K46J65j60J16J31n06M78m87K02P5J67l30J99K30j49k16m1l3
5494a91L54j69j14l9J03L09l85N9k64L05M9j91K89l6J16j90j47J74n0J87j58J51
5516A62j19j85L10k47J47k9k07M56m11p5L90k69M1J11m7l2M4O7n2L2P3J16J5j16
5540A75O8j7j81l20M72k8l95L06M6k5J38k94O5j61L05j74K63k40O7m5j30K44j62
5563b3O8J48j66J08L6k33mJ20k78Q0M0M87j57l73R0M9l4r6K33k36L4k8J94n3q1
5588g5J9J81k22J26M3k3pk04K43j08J07l09K42n2J47j7k12M7O6l4R1k00J46p2
5612g7K97k96Q4j65K2J30q1K10j17j65r1Q8J89J98ok09j0M1k73R7j98M93r8j33
$$ plain form
5636 -70 -137 -166 -22 120 23 -75 207 95 -191 157 179 -90 -78 126 -171 -125 -248 -147 164 36 44 -113 201
5659 201 0 -156 -148 29 8 -181 150 62 42 -97 96 84 63 114 39 135 -29 162 -59 -33 30 71 -24 -140 124
5684 124 79 -47 63 -250 205 233 110 -123 47 -43 270 -63 68 221 136 -61 236 -166 54 29 -81 -99
5706 -99 -86 43 33 -126 -102 237 109 150 186 -37 -49 -72 263 150 -63 -240 -93 149 -232 45 -106 -95 3
5729 3 2 -15 -84 79 101 333 -87 141 39 106 123 -23 117 -72 -53 -21 28 -185 -158 49 73 -18 -75 177 34
5754 34 -58 168 -210 394 -87 298 92 -16 -76 206 149 22 -89 8 -41 -45 45 65 -51 -24 -11 73 61 -86 133
5779 133 132 -96 -83 -100 -24 -29 -132 139 64 -55 -5 256 107 43 -79 88 12 42 -121 -113 -206 89 19 102 33 -5
5805 -5 17 23 206 71 167 75 221 121 -11 -124 243 -91 -138 80 -60 -152 -3 -85 42 154 218 -21 -147 -60
$$ packed form
5636g0o7k9J44J42r7r8K82j12k86L48K2k69J2K04k97M6j23J01L11j28Qj57L14
5659B01k01j56QJ77k1j89L31q8k0j39J93j2k1N1p5R6j64J91k21K6O3M1r5j16K64
5684A24m5j26J10l13M55K8j23k33J70r0L13l33J31J53q5j97K97m02K20k5j10j8
5706i9J3J29j0j59K4L39j28M1L6k23j2k3L35j13k13j77J47K42l81K77j51J1R8
5729Cjj7o9J63K2K32m20K28j02O7J7j46J40j89J9L2M9k13K7K07K4r1n7K52j43
5754C4r2K26l78O04m81L85k06j08o0K82n7j27j11R7m9mR0K0j16K7J3Q4j2j47K19
5779A33jk28J3j7P6nj03K71p5j19N0K61j49o4j22J67p6L0j63Qr3K95p0Q3o9l8
5805eK2OJ83j35R6r2J46j00j32j13L67l34m7K18j40r2J49q2J27J12O4k39j26Q7
$$ plain form
5829 -60 109 -37 -351 -106 202 -245 -206 229 -4 -126 -251 -34 243 82 61 -109 -220 -10 -51 190 137 367
5851 367 156 -220 69 -39 24 85 -10 -15 272 -84 -182 167 96 18 -51 106 -114 260 -211 -156 -353 122 181 -233
5875 -233 187 31 90 -51 -91 -64 11 79 30 -78 -159 -150 -10 168 40 -65 -290 66 -74 -64 -24 -56 -181 -199
5899 -199 -57 273 123 16 -185 29 -33 -129 244 41 -82 81 239 166 -60 -110 -75 85 -36 -184 -48 142
5921 142 -46 192 -109 -255 -37 -26 269 -112 -72 164 -285 163 48 -54 317 234 228 -121 64 108 327 167
5943 167 86 -95 115 -234 138 -83 40 68 -106 11 71 85 -122 127 -188 -69 -157 -87 -77 -11 202 -11 -52
5966 -52 151 355 144 -155 91 -77 -49 36 -3 91 198 -143 52 -166 170 -18 -54 15 -21 -62 31 -69 -14 -198
5990 -198 131 -158 -67 68 -174 -196 -66 -133 284 139 -22 110 -191 -61 -75 60 -4 -68 -55 115 36 227 -90
$$ packed form
5829f0J69j46l14K45L08m47L9M35k33j22j25K17K77j61k1j70j11K10m1K41n3K30
5851C67k11l76K89j08O3O1r5nK87l56r8L49p1p8o9J57k20L74m71N5j97M75N9m14
5875b33M20j56N9j41m0K7P5O8m9j08q1RJ40J78j28j05k25L56j40J0M0l2j25j8
5899a99J42L30j50j07k01K14o2r6L73k03j23J63J58p3k26n0L5J60j21j48J36J90
5921A42j88K38l01j46K18J1K95l81M0K36m49M48j15j02L71q3ol49J85M4K19j60
5943A67q1j81K10l49L72k21J23K8j74J17O0J4k07K49l15J19q8P0J0O6K13k13m1
5966e2K03K04k11k99K46j68K8Q5l9R4J07l41J95k18L36j88l6O9l6m1R3j00N5j84
5990a98L29k89R1J35k42k2J30o7M17j45j61J32l01J30j4J35o4o4J3J70p9J91l17
$$ plain form
6013 -90 180 -37 -66 40 -132 71 80 -109 -100 -63 -60 132 12 67 13 -62 246 -159 121 210 204 98 94 -270 22 -55
6039 -55 120 -53 -169 -196 -104 -29 -70 -172 -365 97 -172 31 60 -65 106 121 -174 -7 -256 -70 290 253 70
6062 70 -35 -32 47 61 -143 -102 109 30 -9 -23 -155 -171 -235 140 -135 -50 -49 120 101 79 28 -56 183 113 -197 36
6088 36 -319 -337 99 -190 -129 -128 -20 285 -96 -32 275 -247 19 40 9 -195 143 -226 -5 -146 -249 -51 -41
6111 -41 167 -18 13 -214 -62 -40 136 -39 217 105 34 78 -36 97 189 -107 -286 154 1 -244 17 91
6133 91 -29 420 -37 48 -176 -100 272 -58 9 -180 143 -56 53 42 207 171 -234 188 274 -28 164 -16
6155 -16 147 -148 -56 -193 -212 -239 75 -194 18 20 -235 262 -144 42 -41 -60 24 17 -293 -102 150 72 287 -109
6179 -109 72 -4 -242 -16 142 -190 207 31 206 -243 -123 151 -166 139 54 -107 53 -173 134 -57 -15
$$ packed form
6013i0K70k17k9J06j72K03Rj89RL7LJ92j20N5n4p5L08m05K80Q9oj06ml64K92p7
6039e5J75j73j16k7R2P5m1j02j93M62k69K03K9j25J71J5k95J67k49J86L60l7j83
6062G0j05LP9J4k04M1K11p9l9j4j32j6o4L75k75Q5JJ69j9k2n1q4K39p0l10K33
6088C6l55j8M36k89O1JJ08L05l81O4L07n22K66K1l1k04L38l69K21j41j03J98J0
6111d1K08j85L1k27J52K2J76j75K56j12p1M4j14J33R2k96j79M40j53k45K61P4
6133I1j20M49m57Q5k24P6L72l30O7j89L23j99J09j1J65l6m05M22Q6l02J92j80
6155a6J63k95R2j37j9k7L14k69K12Kk55M97m06J86q3j9Q4pl10J91K52p8K15l96
6179a09J81p6k38K26J58l32L97j76J75m49J20K74l17L05q5j61J60k26L07j91M2
$$ plain form
6200 -15 -135 -170 23 6 -133 40 130 -221 -113 -104 147 2 130 15 116 -147 -37 48 90 -220 54 -186 -135
6223 -135 74 60 99 -21 69 -190 142 -61 197 -15 -209 3 -54 -144 -77 3 249 71 -135 118 196 -260 -91
6246 -91 91 -184 -28 -236 68 -104 -11 -99 82 60 -67 171 -243 147 192 -3 108 -132 158 178 45 -202
6268 -202 -7 -39 -217 78 -146 -62 -118 50 -51 159 -79 135 -214 -75 218 175 -11 -127 -37 -6 -47 -16 180
6291 180 6 107 -115 204 -2 124 36 -157 254 76 106 -47 34 74 6 78 -158 -10 -170 -281 -130 78
6313 78 34 -70 -162 40 -66 -154 19 -168 68 72 16 -70 25 80 62 -90 -128 190 4 31 22 293 15 -57 84
6338 84 35 195 -136 310 -36 134 162 -239 -10 35 69 -15 -13 15 -58 -101 -170 -247 125 266 -3 2 76 -79 23
6363 23 -186 280 44 -29 228 79 6 -74 56 64 -9 183 -46 263 -216 -186 54 121 -86 128 -155 283 -203
$$ packed form
6200a5j20l5J93j7j39J73R0l51J08RK51j45J28j15J01k63J10Q5M2l10K74k40N1
6223a35K09j4L9j20R0k59L32k03K58k12j94K12n7r0O7Q0K46j78k06K53P8m56J69
6246i1J82k75J56k08L04j72R3q8J81k2j27K38m14L90M5j95J11k40K90K0j33k47
6268b02J95l2j78K95k24Q4n6J68j01K10k38K14l49J39K93m3j86j16R0L1m1L1J96
6291A80j74J01k22L19k06J26q8j93M11j78L0j53Q1M0o8P2k36J48j60j11J51K08
6313G8m4j04r2K02j06q8J73j87K36Mn6q6R5N5j8j52l8L18j86K7rK71k78p2J41
6338H4m9J60l31M46l46J70K8m01K29M5L4q4KK8p3m3o9p7L72J41k69NP4j55J02
6363B3k09M66k36p3K57j49p3q0J30Qp3J92k29L09m79L0K40O7k07K14k83M38m86
$$ plain form
6386 -203 -215 -42 -128 -305 181 97 -158 40 -68 -101 -21 -75 64 -51 32 128 -223 -33 67 -64 -425 -101 -91
6409 -91 -173 52 115 83 -240 -34 -99 -28 134 66 207 -302 236 -260 -35 37 -63 -136 7 -113 -10 336 19
6432 19 15 -173 -202 21 87 -142 -113 -184 33 173 169 -38 19 -119 281 -1 -81 -117 -32 218 -19 -188 79 -127
6456 -127 -27 5 145 184 17 23 62 27 -284 28 35 -156 0 291 -37 -141 220 178 -103 -211 -127 92 -240
6479 -240 17 102 -90 333 250 51 -129 156 -7 -65 14 160 -58 -126 198 171 83 -20 81 185 120 80 83 -25
6503 -25 -52 -25 126 26 -173 -30 212 -74 -99 133 -66 -90 208 -11 178 49 75 166 25 -36 20 -26 44 -79
6527 -79 -94 -44 -175 205 -1 -111 -162 -386 -35 -5 -50 -62 160 -213 150 145 -127 -106 -100 219 112 103 29 39 -27 119
6553 119 321 -259 273 -112 -67 359 -22 79 -138 -149 9 88 -209 41 -89 -58 -308 100 -13 -25 -110 116
$$ packed form
6386b03j2J73q6j77M86q4k55J98j08l3Q0n4J39j15Q3R6l51J90J00j31l61L24J0
6409i1q2K25O3l2l23K06o5P1J62o8J41n09N38m96K25P2j00p3J43j20J03L46l17
6432A9mj88k9K23O6k29K9p1K17J40mk07N7j38M00k82q0l6Q5K50k37j69K67k06
6456a27J00L2J40L9j67OL9l5l11L12Pj91J56K91l28j04L61m2k81j08Q4K19l32
6479b40K57Q5j92M23q3j99j80K85j63n8P9J46k18o8L24k7q8j03J01J04o5m0Lj08
6503b5k7K7J51j00j99J43K42k86k5K32j99k4K98k19J89j29K6R1j41o1N6m6P0j23
6527g9j5N0j31L80k06j10n1k24L51L0m5j2K22l73L63nk72K1OL19j07rp4J0o6J46
6553A19K02n80N32l85M5M26l81J01k17j1J58P9k97K50j30L1k50M08j13j2q5K26
$$ plain form
6575 116 248 -198 -107 28 92 -129 161 -136 209 169 -95 116 209 213 274 85 129 -163 64 78 292 -224 255
6598 255 -100 -147 -111 -25 -22 -111 -138 196 4 130 -166 234 -86 -163 -42 -164 -30 -21 -170 -106 97 231 38 -164
6622 -164 -258 -83 -34 138 -205 97 37 -104 18 -52 143 207 52 85 2 204 -84 367 145 -154 -38 -345
6644 -345 205 161 117 -243 179 67 19 -131 37 68 129 -185 75 63 62 -145 -138 -49 -37 -83 -35 -80 -12 431 -42
6669 -42 -97 -267 -42 176 -86 38 46 194 13 192 19 178 -48 117 -119 -232 40 21 -98 34 -19 -119
6691 -119 130 12 -92 -153 -86 39 153 -9 127 280 217 -58 -35 -62 148 -146 -122 -23 213 127 22 -157 -68
6714 -68 -331 3 69 53 -59 72 -55 -3 7 -22 106 -39 275 139 -175 -225 -184 -62 64 -105 27 -15 139
6737 139 90 -243 203 -240 47 5 -48 -16 101 193 24 -72 -15 -123 2 -204 -7 -60 -130 -280 117 147 -28
$$ packed form
6575A16J32m46R1J35O4k21K90k97L45m0k64K11R3MO1j89M4k92K27J4K14n16M79
6598B55l55m7L6Q6Lq9k7L34j92J26k96M00l20p7J21j22J34Rj49O4K03J34j93k02
6622a64r4J75M9J72l43L02o0j41J22p0J95O4j55L3q3K02k88M51k22k99J16l07
6644c45N50m4m4l60M22j12m8j50J68L1O1l14K60j2jk07PQ9J2m6M8m5O8M43m73
6669d2n5j70K25K18k62J24QJ48j81J79j73J59k26J65k36j13K72j9j19J32n3j00
6691a19K49j18j04o1O7J25J14j62J36J53o3k75K3k7K10k94K4R9K36q6j05j79Q9
6714f8k63L34O6j6j12J31j27N2J0k9J28j45L14j36l14n0M1J22J26j69J32m2J54
6737A39m9l33M46m43K87m2n3L2J17R2j69r6N7j08J25k06J97n3p0j50L97L0j75
$$ plain form
6760 -28 -89 -390 140 -36 -37 -171 46 -40 233 -313 193 -20 237 -171 -147 -39 -7 -48 -173 -177 108 -127 -9
6783 -9 17 -280 -107 115 206 290 -280 5 -135 -93 -214 207 120 247 108 -4 -203 122 29 5 57 -84 -37 -118
6807 -118 -45 -45 -4 19 -63 88 148 -187 243 2 -9 -76 47 -76 18 46 60 -162 -180 -18 -10 -71 56 41 108 194
6833 194 -30 -96 -51 64 -122 -182 -17 85 -44 58 -220 -90 79 94 58 389 -53 -196 -19 -192 24 160
6855 160 -146 37 29 -64 216 -31 -31 87 -102 -235 85 43 161 -58 -107 -23 234 80 -243 -239 -142 114 -381 -51
6879 -51 -174 41 144 12 -3 -91 141 68 -51 -155 -139 -194 -115 137 35 -33 -70 142 -155 12 6 66 -136 174
6903 174 13 57 222 -48 -270 -162 -17 -124 145 -302 108 -61 22 88 4 426 60 -135 11 -61 423 53
6925 53 -44 280 41 145 89 6 121 146 130 35 40 103 73 -208 -33 69 -115 57 36 194 -77 152 228 -28
$$ packed form
6760b8o1l01N30j76jj34K17q6K73n46N06k13K57m08K4J08L2m1j25mK85k35J18
6783iK6k97J73K22R1Q4n70K85j40M2j21M21q7J27j39j12j99L25r3k4N2j41M7q1
6807a18P3%M1K3q2J51O0l35M30k41j1o7J23j23R4K8J4k22j8J62Qo1J27j5O7Q6
6833A94k24o6M5J15j86o0J65J02j29J02k78J30J69J5l6L31m42j43J77j73K16J36
6855A60l06J83qr3K80k47%J18j89j33L20m2J18k19m9Q4K57j54l23MR7K56m95L30
6879e1j23K15J03j32j5q8K32p3j19j04J6n5P9K52j02o8l7K12k97J67oO0k02L10
6903A74j61M4J65k70k22J08J45j07K69m47M10j69Q3O6q4M22l66j95J46p2M84l70
6925E3r7L24k39J04n6q3J15K5j6r5NO3l0k81J75J02j84J72k1J58k71K29P6k56
$$ plain form
6949 -28 -15 -13 -135 153 124 -25 -5 -41 -174 -135 5 170 -80 -4 -166 -90 98 96 -49 -121 -127 112 13 -41 159 166
6975 166 19 64 -228 -68 -141 -207 -161 21 -124 -39 -7 116 182 -108 -56 35 259 -182 227 -91 -64 151 -180
6998 -180 108 -152 -253 163 56 -61 46 -65 151 45 -274 -2 211 93 107 192 -60 64 74 119 103 -69
7020 -69 43 42 190 -1 -92 -53 -179 24 144 159 59 133 -31 341 287 49 55 117 -21 -212 -121 169 -212 -79
7044 -79 112 -25 -44 -18 -143 91 -61 65 43 -42 37 -97 -151 137 220 -15 178 378 162 252 69 -132 -56
7067 -56 -58 -193 -173 99 81 -78 -11 -151 -42 -5 44 -3 -200 162 38 94 -172 3 -117 -151 119 212 32 103
7091 103 -156 -275 -156 131 11 35 107 246 10 296 187 274 79 190 -130 -41 148 122 -59 -34 -32 -216 -99
7114 -99 -84 -119 -219 -145 280 174 49 11 288 -107 84 5 -115 -45 -201 -297 -21 39 -10 -225 -202 107 49 54 -64
$$ packed form
6949b8J3Kj22K88k9j49K0l6j33L9J40J65k50P6j62P6J88kj45p2oK39r9n4K00P
6975A66j47M5k92J60p3o6M6J82j45Q5L2J23O6k90N2R1K24m41M09l18K7K15l31
6998a80K88k60j01M16j07j17J07j11K16j06l19K72K13j18J4Q5k52J24J0M5j6j72
7020f9J12jJ48j91r1L9j26K03J20J5j00P4j64L72n4k38OO2j38j91R1K90l81J33
7044g9J91j37j9K6j25K34j52J26k2q5P9j34n4K88Q3k35J93K00k16R0j83k01P6
7067e6kj35K0K72j8j59O7j40J09L7M9m7j97L62j24N6k66J75j20l4K70R3j80P1
7091A03k59j19J19K87j20K4P2J39k36K86j09Q7j95J11l20Q9J89k6j81K5Kj84J17
7114i9J5l5j00P4M25j06j25l8K77l95J91p9j20P0j56r6K76O0m9k15K3L09n8Nj18
$$ plain form
7139 -64 55 123 -349 -87 29 -104 -88 205 165 -40 -18 302 -126 -53 -117 -93 34 -7 -201 11 50 -235 -90
7162 -90 49 -60 21 12 -49 12 -111 -93 338 62 -167 185 -146 -214 -123 56 -133 20 -39 -22 -85 7 69 99 -9
7187 -9 -13 -207 -35 73 -66 -199 -57 39 63 156 105 61 -116 56 83 132 -56 -316 -43 -80 -174 -191 -62 248 37
7212 37 295 -236 177 90 224 -13 -119 134 142 112 -127 -169 4 54 -38 368 -50 -119 10 -51 237 109 1
7235 1 9 105 -22 -70 -155 -103 41 -95 259 -188 -153 -155 -124 -7 92 -147 -3 39 65 -50 112 58 -32 0 59 35 344
7262 344 52 -92 -223 67 -72 121 176 123 -46 180 -136 -16 275 -44 -105 -25 -8 -60 10 -73 135 -223 -137
7285 -137 -4 74 -177 24 137 -283 214 -140 152 107 -100 -238 54 154 274 251 -15 4 -22 65 230 276
7307 276 -184 95 194 -218 3 -175 -64 207 110 -415 -61 -306 83 22 64 -208 -60 -208 52 69 -29 -38 -140
$$ packed form
7139f4J19O8m72K62J16j33J6K93m0k05K2L20m28P3o4K4J27m1j94K12L9k85J45
7162i0J39j09Q1ro1O1j23J8M31k76k29L52l31o8R1J79j89J53n9J7o3R2O2L0j08
7187imj94J72J08j39j33J42R6K4R3n1m4j77J72K7M9j88k60K73l7r4j7J29L10k11
7212C7K58n31M13q7J34k37j06K53Ql0k39m2J73N0r2M06m18o9J29o1K88j28j08
7235AQR6j27m8q5N2J44j36L54m47L5kL1J17R9k39J44M2K6j15J62n4r0L2N9k4L09
7262C44k92j44j31K90j39J93N5n3j69K26l16J20K91l19o1Q0J7n2P0q3K08l58Q6
7285a37J33P8k51K01J13m20M97l54K92m5k07j38K92J00J20k3k66J9k6Q7J65M6
7307B76m60K79R9m12K21j78J11K71r7n25L54k45L89o1M2k72J48j48K60J7r8rj02
$$ plain form
7330 -140 -25 -84 158 -27 140 -225 -104 -51 128 4 -172 13 -118 -176 -74 -190 63 145 53 -47 -5 56
7352 56 -83 221 37 -115 -85 -195 -19 -63 82 -89 110 252 48 321 27 -140 171 116 -232 -5 75 56
7374 56 -21 152 53 -58 -141 -34 -129 -100 166 -198 -268 28 -13 -66 -82 9 40 62 -74 -242 -45 -137 -104 160 86
7399 86 231 57 30 -211 208 129 -8 127 -272 -218 22 213 421 -143 12 -160 -242 -105 -151 60 -163 251
7421 251 195 -64 46 47 -174 -206 -96 -32 -198 172 48 -73 -40 225 18 -122 27 317 -184 -26 -28 128 -227
7444 -227 -68 -202 -24 98 108 22 126 42 -66 -9 232 -35 -247 311 100 -166 -109 -17 -248 130 -208 39
7466 39 -31 -73 350 -123 64 -182 -235 3 57 -51 77 43 240 -10 -52 128 -24 -244 -148 -1 38 -99 76
7489 76 -50 193 -102 159 -39 -34 -78 81 58 -235 38 -190 -101 -51 244 295 209 115 21 151 -3 -31 0 1 -154
$$ packed form
7330a40J15n9K42j85J67l65J21N3J79j24j76J85j31n8J02j16K53Q2r2j00M2O1
7352E6j39L04j84j52L0j10J76m4J45j71J99J42k04K73k94j67L11n5l48K27Q0j9
7374E6p7J73r9j11q3J07r5K9K66l64p0K96m1n3j6R1L1K2j36j68J97r2L3K64p4
7399H6J45j74k7k41M19p9j37J35l99N4K40J91K08n64J55j72q2J37m6K11k23M14
7421B51n6k59J10Jk21l2J10O4j66L70j24j21L3K65k07j40J49K90n01J58kJ56l55
7444b27J59j34J78J22J0q6J04q4j08N7K41k67k12N58k11k66N7R2k31L78l38K47
7466C9p0m2M23m73J87k46n3K38N4j08J28l4J97k50m2J80j52k20R6J47L9j37J75
7489G6j26K43k95K61j98Nm4J59k3k93K73k28Q9N0K95N1q6r4r4J30j54k8L1Jj55
$$ plain form
7514 -154 -118 -48 -12 -26 99 -296 -152 27 23 81 -88 117 -168 10 -234 -126 91 -221 -417 16 145 -34
7536 -34 145 -40 -282 -154 100 -42 129 -134 20 -21 129 -56 131 -9 -158 -130 -7 -49 -147 1 162 298
7558 298 -139 39 307 -73 -58 63 14 -96 70 254 38 76 34 97 56 -85 52 4 245 -121 -262 56
7580 56 -127 -156 -219 124 -130 89 -162 -39 122 17 6 170 -289 -15 141 -163 43 269 41 -105 -296
7601 -296 41 -134 108 -112 -74 -226 270 99 31 -20 227 -39 -109 -16 -40 -43 -195 5 -371 -147 -112 -189 -201 -175
7625 -175 25 70 117 -63 -187 -36 70 59 -3 -149 -38 33 -269 97 183 127 65 24 38 180 -121 -147 -2 -104
7649 -104 184 -73 106 54 15 -245 127 -22 -18 -246 -124 336 82 -89 84 -43 59 60 -86 29 -75 115
7671 115 158 -163 -162 201 -81 -291 -36 87 -363 234 -90 -106 -28 103 99 -35 131 -51 -128 -26 41 99 -26
$$ packed form
7514a54L6P0L6j4J25l95J44J79mN8j69K05k85J78k44J08K17l12j96M33J29j79
7536c4J79j85k42J28K54j42J71k63J54m1J50j85J87j40j49K8J23m2r8J48J61J36
7558B98m37J78K68l80J5J21m9j10J66J84k16L8m2O3m1j41J37m8K41l66j41L18
7580E6j83k9o3L43k54K19k51J23J61j05j1J64m59K74J56l04K06K26k28j46j91
7601b96L37j75K42k20L8j52M96j71o8n1K47k66p0R3k4lj52K00l76K24L5p7j2K6
7625a75K00M5M7j80j24J51J06j1o2j46J11P1l02L66Q6n6o2m1J4J42l01k6J45j02
7649a04K88k57J79n2l9k60L72j49Mk28J22M60k54j71J73j27J02Jj46J15j04J90
7671A15M3l21JL63k82k10K55J23m50N97l24j6P8J31mj34J66j82p7J02O7N8j25
$$ plain form
7694 -26 -27 -5 61 -258 -263 15 22 -18 93 191 36 -46 -107 -121 87 -144 -350 -11 -49 25 166 -160 128 -93 109
7719 109 240 229 -136 259 239 -125 17 -7 61 -40 -310 -6 139 58 428 137 15 175 129 128 -296 -244 109
7742 109 102 -35 -68 -81 -119 46 -183 -27 156 -309 89 -49 26 71 118 22 104 50 -82 236 -10 -147 -123 -9
7766 -9 37 -87 -32 121 -193 304 1 -387 53 -135 174 -34 61 86 -27 4 -145 4 -89 42 -21 -168 -184
7789 -184 -35 -39 56 -283 -179 -153 131 -258 -117 -127 235 -57 38 -193 97 44 98 55 -203 121 -295 -47 14
7812 14 198 -222 272 177 1 73 -36 -76 -163 -16 20 -273 -34 188 48 -155 121 82 25 17 -69 -68 28 -97 -51
7837 -51 52 83 274 -120 134 83 -55 225 -84 -5 102 251 -64 69 -58 -148 -81 -156 162 -51 -274 135
7859 135 1 240 117 93 -39 74 75 113 247 -111 -100 21 82 -48 -76 32 -94 0 -12 115 -170 141 37
$$ packed form
7694b6jK2O6l19nK78Pm0J11R8j55q2o1j4K08k31k06L39l8P4J41l26K88k21K02
7719A09J31j1l65L95k0l64J42k4O8j01k70L04J45q1L70k91j22J60m6jm24N2L53
7742A09pj37l3j3l8J65k29J56J83m65L98j38P5M5M7r6Q2n4j32L18k46j37K4J14
7766iM6j24N5J53l14M97l03l88M40j88L09k08R5K5j13L1j49J49r3J31o3j47j6
7789a84J49mR5l39J04K6K84l89J41j0L62k92R5k31K90n3N4m3k58L24m16K48O1
7812A4J84m20M94r5j76P2j09m0q7J47L6k93K39K22j40k03K76l9n7qq6JR6j25M6
7837e1J03L1J91l94K54n1j38K80l09P9J07J49l15J33j27r0O7p5L18k13k23M09
7859A35j34K39j23k4j32J13JL8J34l58J1J21O1j30k8J08j26R4j2J27k85L11j04
$$ plain form
7882 37 -237 183 -117 -123 -4 72 -342 294 -28 5 -12 285 179 93 -40 -144 -82 161 67 -234 -263 -48 137
7905 137 -67 114 14 114 -386 184 255 18 -60 163 59 19 281 185 23 -96 -86 -37 -102 63 183 -100
7927 -100 19 -43 -75 -65 25 96 44 -87 0 -325 34 299 -48 49 -228 332 175 -289 -93 -103 -3 -211 40
7950 40 -20 -14 152 -236 63 46 -93 -135 27 -33 -95 -134 -52 -90 -164 151 -154 116 -98 -51 171 22 -20 -286 -58
7975 -58 159 -196 132 -53 145 7 20 -5 -179 -24 -288 128 112 86 -111 -69 -252 -90 153 -36 7 -242
7997 -242 -82 129 78 -41 188 -42 -330 -96 20 -213 85 -158 -19 91 13 145 138 78 -19 84 245 -38
8019 -38 87 60 -57 38 34 -3 -133 -141 16 35 -178 -10 -216 176 -92 230 23 -180 -40 -76 44 -135 -113 -165
8043 -165 154 182 -118 -42 76 -123 -107 -24 8 -158 159 -327 40 -31 -79 52 14 -175 -185 -51 16 -127 -90 -98
$$ packed form
7882C7k74M20l00oJ19P6m14O36l22L3j7K97j06q6j33j04O2K43r4l01k9K15J85
7905A37k04J81j00J00n00N70P1k37p8K23j04m0K62r6j62j19J0M9o5J65J20k83
7927a00J19o2l2J0R0P1n2j31Q7l25L59K65l47R7k77N60j57m64J96j0J00k08K51
7950D0o0OJ66l88K99j7j39m2J62o0o2l9Q2l8p4L15l05K70k14M7K22j49m2k66K28
7975e8K17l55L28j85J98j38J3k5j74J55k64M16j6k6j97M2j83J62K43j89M3k49
7997b42J60K11n1j19K29k30k88K34J16k33K98k43J39J10p8J32po0r7J03J61k83
8019c8J25k7j17R5ml7j30qJ57J9k13J68k06L92k68L22k07k03J40l6J20j79K2n2
8043a65L19K8l00P6J18j99J6Q3L2j66L17m86L67p1m8J31l8j89j0J34O7j43L7q
$$ plain form
8067 -98 -229 -450 60 217 -340 192 -20 -69 -271 -117 -2 -133 -155 151 186 56 -152 -51 26 -73 171 -81
8089 -81 -12 -227 87 117 -72 189 52 -108 135 -8 -253 -56 227 49 -58 -233 29 -16 198 -77 -141 137
8111 137 105 -111 33 -183 -77 298 174 60 15 -180 144 45 -52 14 133 -173 65 171 -148 100 12 -71
8133 -71 165 -54 -134 -196 4 121 -81 -56 158 15 -250 134 46 54 -83 63 85 -106 137 -153 -106 152 -65
8156 -65 47 75 -15 243 -42 -10 -267 69 29 17 -74 -15 127 -20 76 -55 -124 -89 -246 -45 177 -11 -50 -87
8180 -87 -103 175 -141 -102 31 -143 352 121 -183 -245 13
$$ packed form
8067i8j31k21N10J57n57N32k12m9k02J54J15j31k2L06L5j30k08J01P7r9K44k52
8089h1O9k15L14L0j89K61j37j60K43j43k45J97K83j78j07j75K62m5K14k75o4K78
8111A37l2k16J44k16J06L75j24j14m5j95L24r9r7O6J19l06K38J06l19K48q8q3
8133g1K36k19q0o2K00J17k02K5K14j43k65L84q8Qj37J46K2j91K43k90M7K58k17
8156f5J12K8r0K58k85L2k57L36m0j2r1N9J42j47R6j31o9L5j57K01K22j88l9l7
8180h7j6K78l16L9J33j74M95k31l04o2K58
8191A3
$$ Imaginary data points
##PAGE= N=2
##DATA TABLE= (X++(I..I)), XYDATA
$$ plain form
0 0 0 0 0 0 0 0 0 0 0 0 0 0 7 -8 8 -8 8 -16 16 -23 24 -31 32 -40 48 -56 64 -73 87 -97 112 -128 145 -167
34 -167 186 -210 238 -264 296 -330 368 -409 456 -504 557 -616 680 -750 825 -909 1002 -1103
52 -1103 1216 -1342 1482 -1640 1820 -2026 2265 -2546 2886 -3298 3816 -4487 5403 -6720 8796
67 8796 -12579 21698 -95000 -9718 190593 30198 -123440 -96206 52822 60504 15305 -6426
79 -6426 -16893 -50324 22627 98669 41219 -78225 -67497 65947 97959 -23374 -78546 -8913
91 -8913 40412 15050 -11028 -22903 -22948 -19004 25915 35127 -33218 -55851 18943 53247 -2975
104 -2975 -37353 -512 30266 -5643 -14236 30521 8676 -47692 -15852 53744 27437 -54065
116 -54065 -48773 43934 49523 -34140 -34609 26649 22847 -20164 -833 44977 7555 -58509 -4585
$$ packed form
0@%%%%%%%%%%%%Pj5J6j6J6k4L2l9M7n5O3p2Q8j04J20j37J60j84K09k40K73l12
34a67L53l96M48n02N60o26O98p77Q65r60J061j173J296j430J575j734J911k105
52a103K319k558K824l122L460l846M291m811N432o184P114q303R890j2123J5516
67H796k1375L4277j16698Q5282K00311j60395j53638K7234J49028P682m5199k1731
79f426j0467l3431P2951P6042n7450j19444J0728J33444L2012j21333n5172O9633
91h913M9325k5362k6078j1875m5L944M4919R212o8345k2633P4794L4304n6222
104b975l4378L6841L0778l5909q593M4757k1845n6368L1840O9596k6307q1502
116e4065N292R2707N589q3663m69O1258l802m3011J9331M5810l7422o6064N3924
$$ plain form
129 -4585 79516 21636 -73257 -43431 50151 47800 -38321 -55249 5050 18176 -6340 -2810 -5266
142 -5266 -22051 -11695 27592 35036 -18445 -37612 22372 48245 2009 -22603 1827 22183
154 22183 4717 -10312 9212 4856 -24089 -7725 20540 -930 -28012 -10703 18925 3669
166 3669 -28407 -690 31512 -3492 -29785 5575 34602 7564 -29092 -8655 28584 6999
178 6999 -19068 -998 7268 -11098 -11560 13184 15787 -22798 -29681 23614 35955 -14065 -30775
191 -30775 7547 33804 9691 -18998 -2385 13478 440 2114 7098 -9914 -17144 -8 15233
204 15233 -2440 -30706 -11834 20631 4520 -19213 -8520 11106 9964 -5486 -313 15478
216 15478 2459 -6976 12376 15000 -4266 -10110 4135 13226 -4981 -16731 3131 5771 -12999
$$ packed form
129d585Q4101n7880r4893K9826R3582k351q6121j6928O0299J3126k4516L530k456
142e266j6785J0356L9287P444n3481j9167N9984K5873m6236k4612K4430K0356
154B2183j7466j5029J9524m356k8945J6364K8265k1470k7082J7309K9628j5256
166C669l2076K7717L2202l5004k6293L5360K9027k7038l6656K0437L7239k1585
178F999k6067J8070Q266j8366m62K4744K603l8585o883N3295J2341n0020j6710
191c0775L8322K6257k4113k8689J6613J5863j3038J674M984j7012p230J7136J5241
204A5233j7673k8266J8872L2465j6111k3733J0693J9626j142j5450N173J5791
216A5478j3019r435J9352K624j9266n844J4245R091j8207j1750J9862K640j8770
$$ plain form
229 -12999 -8534 5707 2919 -10837 -9983 11582 12649 -10558 -6834 12039 9465 -1529 -2809 4784
243 4784 4477 -7400 -622 10306 -6041 -15903 -337 10023 -46 -15598 -7333 13056 5197
256 5197 -8145 505 5535 2454 3900 5544 4463 -3664 -3293 11740 6360 -13341 -9278 6136
270 6136 5835 -7830 -15743 -1420 7673 -4879 -6901 871 826 1322 3257 4959 3146 -3501 5073
285 5073 14326 253 -8878 2012 7912 1632 -8612 -6991 3953 -1303 -8043 -1367 -771 -4446
299 -4446 -1206 1670 3771 -948 -4229 7363 8955 -2458 -1290 5086 5003 505 -4577 362 3187
314 3187 -6170 -4239 1755 -3439 -5189 -2351 222 1422 -3895 -1226 6921 1484 -1506 4458 4433 2683
330 2683 -19 239 5883 195 -5698 244 1020 -3720 -4034 -4044 -833 -1393 -4992 256 1536 -3060 1540
$$ packed form
229a2999M465J4241k788j3756Q54K1565J067k3207L724J8873k574j0994j280P593
243D784l07j1877O778J0928j6347r862J5566J0360j0069j5552Q265K0389p859
256E197j3342Q650N030l081J446J644j081q127L71J5033n380j9701M063J5414
270F136l01j3665p913J4323R093j2552k022P772m5M96J935J702j813o647Q574
285E073R253j4073r131J0890N900o280j0244J621J0944n256o740O676N96l675
299d446L240K876K101m719l281J1592J592j1413J168O376q3m498n082M939K825
314C187r357J931N994n194j750K838K573J200n317K669Q147n437k990N964k5j750
330B683k702K58N644n688n893N942P76m740l14j0L211n60l599N248J280m596M600
$$ plain form
347 1540 4737 1765 824 460 5307 6379 -2127 -1273 3810 849 -786 -2360 -4251 -1019 -1995 -2843
363 -2843 -267 -4341 -4051 2393 2131 255 -866 -440 6395 4873 -290 2098 2196 746 2844 462
379 462 -1259 -2164 -3884 582 448 -5523 -3985 -1620 -787 1429 -1328 -2062 1734 1569 4070 4237 -920
396 -920 298 3582 3142 2968 -2136 -3740 1404 192 -2058 -1635 -4817 -3624 427 338 50 -3983 -3703
413 -3703 5199 6137 -201 -1927 -527 5797 7379 -378 -3147 -703 866 3218 -130 -5569 -4754 -2370
429 -2370 1138 3288 -5007 -7565 -713 5049 5977 -682 -6443 1385 8240 6107 1173 -4532 -1453
444 -1453 5786 3585 -809 -3029 -5922 -1860 2484 1049 -2631 -8360 -5637 6068 6277 -2415 -6418
459 -6418 -2609 8037 8852 -1805 -3743 836 3610 4518 1419 -1873 -3402 -4718 875 6192 -2573
$$ packed form
347A540L197k972r41l64M847J072q506Q54N083k961j635j574j891L232r76q48
363b843K576m074K90O444k62j876j121M26O835j522n163K388R8j450K098k382
379D62j721r05j720M466j34n971J538K365Q33K216k757p34L796j65K501J67n157
396i20J218L284m40j74n104j604N144j212k250M23l182J193M051q9k88m033K80
413c703Q902R38o338j726J400O324J582p757k769K444J569K352l348n439Q15K384
429b370L508K150q295k558O852N762R28o659n761P828O855k133m934n705L079
444a453P239k201m394k220k893M062M344j435l680n729K723J1705K09q692m003
459f418L809J0646Q15j0657j938M579K774R08l099l292j529j316N593N317q765
$$ plain form
474 -2573 -10094 -5736 3615 8373 -1770 -10074 -1315 8010 7090 578 -4862 -34 6015 4234 2545
489 2545 -1409 -6303 -1633 4029 3288 -3236 -11232 -5482 7689 5811 -5597 -10406 -2343 10760 8326
504 8326 -5176 -6487 2556 8208 6789 -1277 -3780 -806 746 5137 3964 -6228 -9917 -2042 7634
519 7634 5907 -9862 -13587 2410 11570 3749 -7655 -7240 4750 9485 2085 -624 -1167 -1853 2593
534 2593 5118 2700 -3937 -9082 -1318 8399 2242 -7907 -9061 -110 8602 2754 -6247 -3457 2230
549 2230 5147 4550 22 -1269 68 1055 5074 3698 -4033 -5869 -1503 4647 4029 -7251 -9743 903
565 903 6127 1252 -5827 -5258 3747 5371 222 49 391 409 2567 3731 3342 -1252 -5483 784 6951
582 6951 6 -7584 -6018 2324 5691 -3425 -7775 -693 3701 2246 -236 -1763 947 2345 1725
$$ packed form
474b573p521M358R351M758j0143q304Q759R325r20o512n440M828O049j781j689
489B545l954m894M670N662p41o524p996N750J3171j878j1408m809Q063J3103k434
504H326j3502j311R043N652j419q066k503K974J552M391j173j0192l689P875R676
519G634j727j5769l725J5997R160p821j1404M15J1990M735p400k709n43o86M446
534B593K525k418o637n145P764R717o157j0149j154Q951Q712n848r001K790N687
549B230K917n97m528j291J337R87M019j376p731j836M366O150o18j1280k492J0646
565I03N224m875p079N69R005J624n149j73L42J8K158J164l89m594m231O267O167
582F951o945p590J566Q342L367r116m350P082M394j455k482j527K710J398o20
$$ plain form
597 1725 3520 1193 -2405 -147 2235 2341 -17 -5013 -2738 2436 771 -2577 -3863 -2650 2244
612 2244 1441 -1381 100 185 581 2457 1504 2235 1309 -1805 1408 3430 226 -2666 -3249 206 2502
629 2502 -2706 -4104 -626 -493 -419 -631 -568 1099 -41 -455 3382 2971 -469 108 1448 3512 1666
646 1666 -2988 -919 1602 -538 -1932 -2073 -1682 -349 -1468 -1650 73 -801 32 1226 191 1504
662 1504 1746 320 1501 1510 527 1436 -356 -442 429 -1192 -1065 -782 -1973 -1088 -1185 -1648 31 -795 -1008
681 -1008 1676 1114 297 646 509 2715 2261 -1015 297 1367 24 84 -1557 -1671 -332 -1305 -1020 -553
699 -553 -2484 -1001 649 205 431 -368 52 2515 1676 618 989 633 1624 1523 -1273 -941 -353 -362 51
718 51 -1423 -2591 -639 -263 -739 -576 -1372 55 1881 294 882 847 489 2330 1492 -114 691 -242
$$ packed form
597A725J795k327l598K258K382J06k358m996K275N174j665l348j286J213M894
612B244q03k822J481Q5L96J876r53P31r26l114L213K022l204k892n83L455K296
629B502n208j398L478J33P4k12O3J667j140m14L837m11l440N77J340K064j846
646A666m654K069K521k140j394j41L91J333j119j82J723q74Q33J194j035J313
662A504K42j426J181Rr83R09j792q6Q71j621J27K83j191Q85r7m63J679q26k13
681a008K684n62q17L49j37K206m54l276J312J070j343O0j641j14J339r73K85M67
699e53j931J483J650m44K26p99M20K463q39j058L71l56R91j01k796L32N88rM13
718E1j474j168J952L76m76J63p96J427J826j587N88l5l58J841q38j606Q05r33
$$ plain form
736 -242 -40 647 -1572 -1345 -595 -1245 -657 -1100 -1676 71 -407 -467 961 148 506 1764 884 1628 1323
755 1323 175 1320 823 -559 463 -433 -1341 -120 -1746 -838 -342 -1621 -710 -26 -418 622 525 597
773 597 1432 1085 1285 1571 66 578 1017 -143 37 -447 -935 267 -763 -1628 -616 -880 -680 210 -952
792 -952 -82 1075 305 1241 826 457 1764 962 125 1115 -52 322 212 -1442 -793 -305 -1766 -773 -1285
811 -1285 -1356 224 -223 -395 556 -41 892 1638 511 1000 1047 597 1337 404 -776 8 -629 -753 -536 -1583
831 -1583 -1221 -635 -1520 -90 -21 -1054 241 794 585 1094 294 899 1391 298 697 995 -514 123 -308
850 -308 -874 296 -1155 -1558 -468 -1184 -843 -32 -995 207 416 176 1327 630 -183 1585 1347 509
868 509 480 -503 779 577 -1067 -886 -668 -1535 -681 -322 -1233 -470 -823 232 1483 -369 -265 1097 1163
$$ packed form
736b42K02O87k219K27P50o50N88m43n76J747m78o0J428q13L58J258q80P44l05
755A323j148J145m97j382J022q96r08J221j626R08M96j279R11O84l92J040r7P2
773E97Q35l47K00K86j505N12M39j160J80m84m88J202j030q65J012k64K00Q90j162
792i52Q70J157p70R36m15l69J307q02q37R90j167L74j10j654O49M88j461R93n12
811a285p1J580m47j72R51n97R33P46j127M89M7m50P40r33j180P84o37j24K17j047
831a583L62N86q85J430O9j033J295N53k09N09q00O05M92j093L99K98j509O37m31
850c08n66J170j451m03J090p16L41Q11r63J202K09k40J151o97q13J768k38q38
868E09k9r83J282k02j644J81K18q67Q54L59r11P63l53J055J251j852J04J362O6
$$ plain form
887 1163 1463 849 -385 755 246 79 535 -1213 -1422 180 -287 -826 -1064 -1558 -60 243 -287 879
905 879 5 -261 1569 1574 747 149 -371 1691 2087 -767 -900 -352 3 -220 -1018 -1164 -781 -1702 -174 1421
925 1421 -365 -1525 -634 1649 2583 -62 -1065 1515 1827 843 595 -509 -66 202 -449 347 -676
942 -676 -2266 -560 298 -71 -320 -1632 -234 1718 593 398 -224 -174 2116 1711 -240 -155 542 626 530
961 530 -1318 -744 -56 -1371 -807 29 -770 -1300 -1348 665 2286 -624 -1626 1260 2564 594 -490
978 -490 -102 2036 1046 -1096 310 664 -1254 -1469 -285 986 -634 -3565 -689 2057 302 -1750
994 -1750 -677 1033 2066 16 -327 1209 445 222 1112 305 43 -730 -840 548 384 -1329 -1252 -813
1012 -813 102 878 -786 -1504 745 1271 1116 -419 -565 2101 1587 -683 428 1065 197 -692 -769 899
$$ packed form
887A163L00o14j234J140n09j67M56j748k09J602m67n39k38m94J498L03n30J166
905H79q74k66J830Nq27n98n20K062L96k854j33N48L55k23p98j46L83r21J528J595
925A421j786j160Q91K283R34k645j003K580L12r84k48j104M43K68o51P96j023
942f76j590J706Q58l69k49j312J398J952j125j95o22N0K290m05j951Q5O97Q4r6
961E30j848N74O88j315N64Q36p99n30m8K013J621k910j002K886J304j970j084
978d90L88K138r90k142J406L54j918k15J184J271j620k931K876K746j755k052
994a750J073J710J033k050l43J536p64k23Q90q07k62p73j10J388j64j713P7M39
1012h13R15P76j664p18K249N26j55j535j46K666n14k270J111O37q68q89p7J668
$$ plain form
1030 899 323 -2709 -1254 1186 276 -1827 -1983 633 2002 -898 -1395 1862 1726 -167 -104 796 1602
1047 1602 -280 -1172 1179 759 -1595 -1034 -14 211 -573 -1954 -130 649 -272 -384 247 154 970 673
1065 673 195 713 727 556 818 -360 305 386 -706 -644 -304 -228 -738 -1617 -542 1009 -697 -1603 550
1084 550 1152 100 -517 399 2217 350 -961 658 1233 -171 -1020 -393 676 -171 -1863 -355 488
1101 488 -1183 -880 31 475 125 -963 453 1761 242 -292 948 1002 510 -199 144 523 -396 -843
1119 -843 393 -747 -1317 -408 -323 -379 -591 -542 874 82 -350 818 638 245 262 417 935 126 -504 248
1139 248 956 -672 -913 112 -307 -882 -1430 38 428 -1164 -384 1023 273 -86 260 593 1159 47
1157 47 -225 1034 552 -590 125 373 -31 -1106 -865 556 -183 -1408 27 337 -407 -285 53 990
$$ packed form
1030H99n76l032J455K440r10k103j56K616J369k900m97L257j36j893O3R00Q06
1047A602j882q92K351m20k354N61J020K25p84j381J824P79r21j12O31r3Q16k97
1065F73m78N18J4j71K62j178O65Q1j092O2L40P6n10q79J075J551j706r06K153
1084E50O02j052o17R16J818j867j311J619N75j404q49O27J069q47j692J508Q43
1101D88j671L03R11M44l50j088J416J308j519n34J240N4m92p09L43L79r19m47
1119h43J236j140n70R09Q5n6k12M9J416p92m32J168j80l93J7J55N18q09o30P52
1139B48P08j628k41J025m19n75n48J468L90j592P80J407p50l59L46L33N66j112
1157D7k72J259m82j142P15K48m04j075K41J421p39j225J435L10p44J22L38R37
$$ plain form
1175 990 630 -533 706 1307 -60 58 352 338 -148 -773 -311 521 -1023 -944 -19 -322 -646 -579 286 340
1195 340 -345 -161 1039 468 -134 793 697 537 -112 -492 892 -180 -1011 23 56 -870 -750 -614 -258
1214 -258 -42 -927 264 1099 -474 -210 915 539 388 -489 499 1276 -245 -369 580 -107 -591 -462 83
1233 83 208 -900 -825 442 -76 -683 35 178 616 -229 309 768 529 -444 671 516 -103 -373 -261 217
1253 217 -151 -1224 -483 181 -810 -676 139 -116 -122 -89 360 971 -72 -7 859 452 151 247 220 404 -455
1274 -455 -598 215 -160 -987 -143 -143 -382 -576 -345 501 173 -456 159 781 175 489 345 620 558 -440 269
1295 269 544 -380 -439 53 103 -155 -673 -194 -63 -332 -458 386 -42 -92 563 276 592 559 93 863 58
1316 58 -250 272 122 -135 -207 -360 24 -149 -834 -318 21 -396 117 337 228 503 -298 554 797 130 294
$$ packed form
1175I90l60j163J239O01j367J18K94j4m86o25M62Q32j544P9R25l03l24O7Q65N4
1195C40o85J84J200n71o02R27r6j60o49l80J384j072q31J034L3r26J20J36L56
1214b58K16q85J191Q35j573K64J125l76j51q77R88P77j521j24R49o87m84J29N45
1233H3J25j108P5J267n18o07P18J43M38q45N38M59k39r73J115j55o19k70J12M78
1253B17l68j073P41O64r91J34Q15k55oL3M49O11j043O5Q66m07l01R6k7J84q59
1274d55j43Q13l75q27Q44%k39j94K31Q46l28o29O15O22o06L14j44K75o2r98P09
1295B69K75r24n9M92N0k58n18M79J31k69j26Q44m28n0O55k87L16l3m66P70q05
1316E8l08N22j50k57p2j53L84j73o85N16L39m17N13K20j09K75q01Q52K43o67J64
$$ plain form
1337 294 707 49 293 -220 -90 -257 -528 -495 21 -491 -574 -83 -334 235 -82 -153 585 233 -153 660 419
1358 419 199 288 84 251 345 -508 -187 -243 -594 -248 -385 -403 -58 -195 -334 263 72 352 327 207 443 344
1380 344 258 660 128 -149 211 -71 20 -63 -572 104 -377 -650 -138 -283 -469 -39 199 75 554 25 213
1401 213 469 93 240 47 -206 184 -177 -462 -218 -440 -474 69 -333 -120 -14 -86 -59 201 -104 289 293 209
1423 209 548 180 16 441 217 19 36 -167 117 -355 -570 -48 -197 -315 -241 -268 150 261 -386 202 805
1444 805 235 293 307 228 608 -187 -79 229 -127 -352 -191 -404 147 142 -661 -275 91 -126 -103 -18 387 417 5
1467 5 66 517 312 -191 -29 188 384 -192 -535 135 -233 -280 -386 -288 -63 259 -458 -165 488 125 234 11
1489 11 303 619 -177 388 646 143 -165 -277 -16 151 -264 -581 154 376 -512 -265 -588 160 123 -341 225
$$ packed form
1337B94M13o58K44n13J30j67k71L3N16n12q3M91k51N69l17p1P38l52l86Q13k41
1358D19k20Q9k04J67R4q53L21n6l51L46j37j8L45j37j39N97j91K80k5j20K36r9
1380C44q6M02n32k77L60k82R1q3n09O76m81k73N12j45j86M30K38j24M79n29J88
1401B13K56l76J47j93k53L90l61k85K44k22l4N43m02K13J06p2K7K60l05L93Mq4
1423B09L39l68j64M25k24j98J7k03K84m72k15N22j49j18P4k7M18J11o47N88O03
1444H05n70N8J4p9L80p95J08L08l56k25J61k13N51nq03L86L66k17K3Q5M05L0m12
1467EO1M51k05n03J62K17J96n76l43O70l68m7j06R8K25L22p17K93O53l63J09k23
1489A1K92L16p96N65K58n03l08j12K61J67m15l17P35K22q88K47l23P48l7m64N66
$$ plain form
1510 225 451 321 114 258 366 797 86 -274 427 354 -327 -488 -261 67 -612 -830 172 98 -151 -225 -210
1531 -210 542 339 -141 301 600 429 179 216 169 274 35 -282 399 34 -126 -117 -453 -249 -95 -128 120 222
1553 222 -190 343 -74 115 631 15 55 222 243 332 32 -76 105 -109 -665 -63 152 -107 -277 -293 154
1574 154 178 -226 -22 214 247 204 -86 273 457 -157 -17 268 37 -387 -317 -286 6 -298 -155 -40 -165 -277
1596 -277 -90 166 315 217 -149 441 371 44 363 92 10 106 -34 18 -243 -405 -496 -193 -377 46 -109 -48
1618 -48 129 140 102 255 -49 53 332 -55 94 371 -34 197 24 -164 149 47 -485 -149 -188 -152 -58 -257
1640 -257 -149 -48 -98 150 289 4 322 5 328 -81 -90 243 79 -446 -198 84 -271 -134 -285 -206 213
1661 213 -297 163 232 -47 -1 164 360 125 16 48 353 83 -102 136 -92 -26 -195 -169 -100 -165 -312 -95
$$ packed form
1510B25K26j30k07J44J08M31p11l60P01p3o81j61K27L28o79k18J002p4k49p4J5
1531b10P52k03m80M42K99j71k50L7m7J05k39l17O81l65j60Rl36K04J54l3K48J02
1553B22m12N33m17J89N16o16M0J67K1Q9l00j08J81k14n56O02K15k59j70j6M47
1574A54K4m04K04K36L3m3k90L59J84o14J40K85k31m24P0L1K92l04J43J15j25j12
1596b77J87K56J49r8l66N90p0l27L19k71q2R6j40N2k61j62r1L03j84M23j55O1
1618d8J77J1l8J53l04J02K79l87J49K77m05K31j73j88L13j02n32L36l9L6R4j99
1640b57J08J01n0K48J39k85L18l17L23m09rL33j64n25K48K82l55J37j51P9M19
1661B13n10M60O9k79M6J65J96k35j09L2L05k70j85K38k28O6j69K6O9o5j47K17
$$ plain form
1683 -95 -214 -155 96 123 146 43 233 206 121 184 480 203 176 53 -164 48 97 -498 -296 61 -303 -481 175
1706 175 -21 -34 -99 -140 82 -105 -64 390 157 154 141 52 130 -27 7 -229 -310 -155 -234 -24 -270 -190 -97 -117 2
1731 2 106 -105 -19 144 154 395 268 378 -68 254 -5 -92 -270 121 -207 -90 -391 -358 -326 -193 1 79 215
1754 215 -61 54 183 54 112 22 98 229 -165 246 224 -363 66 -234 -120 102 -475 -55 -141 -136 -73 83 13
1777 13 330 122 301 388 486 -68 290 -95 179 -169 -245 -140 -158 220 -38 -22 -146 -96 47 32 0 -135 102
1800 102 492 -311 -44 400 -5 337 165 136 174 144 83 34 -431 -314 -142 90 -109 -263 -238 0 -186 -20
1822 -20 227 178 182 -99 179 145 -97 -169 -68 0 -291 -198 -151 -129 21 -138 95 78 -361 192 -4 -60 310 44
1846 44 90 56 105 -22 175 170 104 4 138 -87 -117 -193 100 -404 -272 65 -115 56 74 204 -2 125 217 306
$$ packed form
1683i5j19N9K51K7K3j03J90k7q5O3K96k77k7j23k17K12M9n95K02L57l64j78O56
1706A75j96j3o5m1K22j87M1M54k33lj3q9P8j57L4k36q1J55p9K10k46Q0R3k0J19
1731BJ04k11Q6J63J0K41j27J10m46L22k59q7j78L91l28J17l01L3L2J33J94P8J36
1754B15k76J15J29j29N8r0P6J31l94M11k2n87M29l00J14K22n77M20q6NO3J56p0
1777A3L17k08J79Q7R8n54L58l85K74l48p6J05j8L78k58J6j24N0J43j5l2j35K37
1800A02L90q03K67M44m05L42j72k9L8l0o1m9m65J17J72K32j99j54K5K38j86J66
1822b0K47m9Mk81K78l4k42p2J01O8k91R3M7K2J50j59K33j7m39N53j96n6L70k66
1846D4M6l4M9j27J97no6j00J34k25l0p6K93n04J32L37j80J71J8J30k06J27R2Q9
$$ plain form
1870 306 348 23 153 54 151 172 -14 134 -62 -93 93 -145 -159 -110 -362 -10 318 11 7 222 60 220 60
1893 60 -206 209 285 237 27 94 -130 1 -226 -195 86 167 -6 -251 -19 -180 67 -79 127 70 331 401 110
1916 110 32 -4 3 2 182 -14 -172 149 -84 -34 87 109 -56 -185 -108 75 -54 16 7 -191 231 1 -132 57
1940 57 119 75 143 -137 69 11 -228 -195 -127 -173 -184 -256 -23 78 -85 345 -152 99 -56 92 80 177 194 159 109
1965 109 61 -217 -215 -304 19 -152 -85 -175 78 -182 -214 173 15 277 -290 232 203 72 295 -11 -381 144 228
1988 228 118 -154 -70 46 134 -145 -312 -101 -269 -37 -109 110 293 -93 72 338 -96 -91 82 31 -21 73 -75
2011 -75 -72 -53 106 -216 -215 142 183 -362 -523 138 179 203 290 -55 260 126 -18 442 106 -78 92 423 201
2034 201 197 -276 -115 127 4 259 -183 -51 100 133 173 161 107 -27 147 -157 3 -202 85 81 150 95 79 102
$$ packed form
1870C06M2l25J30r9R7K1j86J48j96l1J86k38j4M9k52L52L28l07mK15j62J60j60
1893F0k66M15P6m8k10O7k24J31k27L1K81Q1j73k45K32j61K47j46K06n7K61P0k91
1916A10p8l6PjJ80j96j58L21k33N0J21K2j65j29P7J83j29P0rj98M22k30j33J89
1940E7O2m4O8k80K06n8k39L3O8m6j1p2K33J01j63M30m97K51j55J48j2R7J7l5n0
1965A09m8k78Kq9L23j71O7r0K53k60l2L87j58K62n67N22k9j31K23l06l70N25Q4
1988B28j10k72Q4J16Q8k79j67K11j68K32p2K19J83l86J65K66m34NJ73n1n2R4j48
2011g5LJ9J59l22JL57M1n45j61O61M1K4Q7l45L15j34j44M60l36j84J70L31k22
2034B01mm73J61K42j23K55m42J32J51L3M0j2n4j34J74l04J60k05K87mO9n5j6K3
$$ plain form
2058 102 27 110 -85 -110 10 23 -120 58 -22 233 89 -75 -112 259 -9 53 325 128 55 -605 28 -113 -190
2081 -190 -285 266 -58 -214 -213 -124 106 9 -113 37 -191 296 -55 -16 304 21 179 13 19 -70 227 -253 -115
2104 -115 -134 -3 -239 -234 -227 25 230 -30 157 -94 280 47 -30 208 106 -34 -5 245 -42 256 -84 -41 -62
2127 -62 -346 67 -31 64 164 143 32 68 69 208 453 8 -98 297 38 211 -55 -99 251 109 2 -162 101
2150 101 -3 -18 -247 71 -108 40 166 202 139 125 184 92 -4 -52 10 281 -44 -72 -69 -242 -60 67 98 -47
2174 -47 38 -184 84 -168 183 229 -240 -33 367 137 142 164 -3 150 7 -224 -89 -11 -101 198 -213 21 -75
2197 -75 -96 303 47 -44 -76 276 119 321 49 -137 353 323 37 -3 -57 -88 -100 -72 -66 -160 -239 61 50 -418 5
2222 5 209 -48 -89 -31 190 -162 12 117 65 207 93 49 18 80 -65 -209 -153 -162 -107 73 -102 227 -32 99
$$ packed form
2058A02p5Q3j95k5J20J3j43J78q0K55j44j64l7L71k68O2K72j97p3o60O33j41p7
2081a90r5N51l24j56JQ9K30r7j22J50k28M87l51L9L20k83J58j66Oq9K97m80J38
2104a15j9J31k36NPK52K05k60J87k51L74k33p7K38j02j40K9K50k87K98l40M3k1
2127f2k84M13r8R5J00k1j11L6JJ39K45m45j06L95k59J73k66m4L50j42j07j64K63
2150A01j04j5k29L18j79J48J26L6o3j4N9r2r6m8O2K71l25k8Lj73J82J27L1j45
2174d7Q5k22K68k52L51M6m69K07M00k30NK2j67J53j43k31J35P8r0K99m11K34r6
2197g5k1L99k56r1l2L52j57K02k72j86M90l0k86m0n4l1j2K8Or4p9L00j1m68M23
2222EK04k57m1N8K21l52J74J05n2J42j14m4l1O2j45j44N6rN5J80j75L29k59J31
$$ plain form
2246 99 128 49 -167 58 -98 305 -40 -20 329 -262 -92 -288 -22 -255 -252 -2 -9 -76 -293 153 -8 -314 157
2269 157 19 -190 130 86 96 -119 68 -89 99 -131 -33 70 -318 217 -69 68 -110 119 -270 189 49
2290 49 -102 -53 26 475 223 322 166 -97 18 -100 -175 -80 -206 -180 47 38 8 -83 -104 163 104 32 223 -45 -5
2315 -5 76 151 -14 220 258 69 -7 -328 35 28 19 -170 3 -198 -82 -180 -4 -55 -12 148 344 -144 99 517
2339 517 -87 275 -57 143 -79 -14 -88 209 391 100 108 -46 70 42 -26 52 -23 152 213 71 -338 215 118
2362 118 -46 240 37 -44 132 293 -159 49 4 -18 76 14 -121 128 11 -33 103 72 86 -82 38 345 55
2385 55 -152 58 -101 -464 46 -2 -213 112 -205 -22 102 183 41 -178 51 -122 176 -1 236 59 318
2406 318 205 90 279 193 76 -150 -131 -136 -96 76 -76 -254 -314 -188 55 -153 -221 201 -18 49 -110 -144 270
$$ packed form
2246I9K9p9k16K25j56M03l45K0L49n91J70j96K66k33LK50po7k17M46j61l06M71
2269A57j38k09L20m4J0k15J87j57J88k30R8J03l88N35k86J37j78K29l89M59j40
2290D9j51M9P9M49k52R9j56k63J15j18p5R5j26K6K27rl0r1k1K67n9p2J91k68M0
2315eQ1P5j65K34L8j89p6l21L63prj89J73k01J16r8J76n1M3J60J96m88K43M18
2339E17o04L62l32K00k22O5p4K97J82k91Qj54J16k8o8P8p5J75O1j42m09N53r7
2362A18j64K86k03q1J76J61m52K08m5k2R4o2j35K49j17m4J36l1J4j68J20L07k90
2385E5k07K10j59l63N10m8k11L25l17J83J24Q1j42k19K29j73K98j77K37j77K59
2406C18j13j15J89q6j17k26J9nM0J72j52j78o0J26K43k08o8M22k19O7j59l4M14
$$ plain form
2429 270 75 35 -13 -256 25 -184 86 -109 261 -48 -171 -148 -87 -135 -277 46 -113 310 -17 91 34 -84
2451 -84 67 72 291 -69 -53 -221 36 148 -257 107 84 31 76 -235 -5 -200 164 210 -62 55 259 286 24
2474 24 2 -1 -100 120 -2 -154 145 -90 -81 -166 -18 196 -13 115 149 -38 -56 46 126 92 188 16 68 125 -163
2499 -163 89 -40 20 -159 -246 -75 -165 108 -120 -73 243 115 -76 -1 120 173 -148 -6 -31 226 183 0 -100
2522 -100 85 3 -101 53 3 -20 -124 -487 -389 66 -124 105 180 -87 35 -235 103 -183 -80 -358 -16 318
2544 318 -57 -124 198 21 159 -99 -240 -243 -117 -152 -73 74 51 -83 -140 122 -38 100 63 151 174 -31 -65 -20
2568 -20 78 25 -97 -112 -32 -271 -15 106 -54 -49 -102 -139 -98 -91 -84 172 255 37 -136 -112 -68 149 -217 -40 75 -22
2594 -22 316 8 106 21 -48 145 167 -97 90 131 27 13 122 -47 163 -6 -46 43 -195 144 121 -111 -138 -21
$$ packed form
2429B70j95m0m8k43K81k09K70j95L70l09j23K3O1m8j42L23j59M23l27J08n7j18
2451h4J51NK19l60J6j68K57J12m05L64k3n3M5l11K30j95L64M6k72J17K04K7k62
2474B4k2lr9K20j22j52K99k35Rq5J48K14k09J28L4j87j8J02Q0l4R6j72N2N7k88
2499a63K52j29O0j79q7J71r0K73k28M7L16j28j91P5J21N3l21J42k5K57m3j83j00
2522a00J85q2j04J54n0k3j04l63R8M55j90K29P5k67J22k70L38k86J03k78L42L34
2544C18l75o7L22j77J38k58j41lJ26l5P9J47k3j34n7K62j60J38l7Q8K3k05l4M5
2568b0R8n3j22j5Q0k39K56J21j60Nn3l7M1PPK56Q3k18j73K4M4K17l66J77J15r7
2594b2L38l08R8q5o9J93K2k64J87M1j04j4J09j69K10j69m0Q9k38L39k3k32k7J17
$$ plain form
2618 -21 -178 50 16 -36 -30 -210 30 421 42 213 16 189 292 95 -119 -85 256 -203 -122 22 -36 107 -319
2641 -319 123 0 73 48 154 27 -238 -86 -42 -53 211 -30 75 39 -367 -157 197 19 -75 -114 -90 105 -55
2664 -55 -78 40 55 -7 11 56 134 309 158 138 -143 50 -223 -129 216 118 136 126 -104 -275 -98 -174 -100 -53 -41
2689 -41 -7 39 36 26 31 197 77 93 -131 -4 95 151 -28 -1 -240 -134 85 31 -188 18 3 140 -97 92 -28
2714 -28 -41 38 39 43 -349 -64 96 -4 -19 -75 185 90 -254 -167 -148 14 -104 -14 -43 18 104 63 -67 248 46 161
2740 161 157 41 -57 -92 -237 103 170 -86 -106 -60 -90 -31 -214 347 183 -10 -234 -206 173 -120 -62 -9 45 32 -183
2765 -183 -5 25 -122 -173 107 176 30 47 -220 -167 212 -55 -133 23 145 -168 -48 -180 246 -72 -188 217
2787 217 157 152 83 57 -135 74 -95 246 53 117 -180 84 -81 -164 139 121 262 93 38 -51 42 69 225 -52
$$ packed form
2618b1j57K28l4n2Oj80K40L91l79J71j97J73J03j97k14L4L41m59Q1J44n8J43m26
2641c19M42j23P3k5J06j27k65J52M4j1K64k41J05l6m06K10L54j78r4l9K4J95j60
2664e5k3J18J5o2J8M5P8J75j51k0k81J93k73R4L45r8J8j0k30j71J77p6P4M7J2
2689d1L4M6lj0NJ66j20J6k24J27R9N6j79K7k39J06K19n4k19K06j5J37k37J89j20
2714b8j3P9JMl92K85J60j00j5n6K60r5l44Q7J9J62j18R0k9O1Q6m1j30L15k02J15
2740A61mj16r8l5j45L40O7k56k0M6l0N9j83N61j64j93k24K8L79k93N8N3N4j3k15
2765a83J78L0j47n1K80O9j46J7k67N3L79k67p8J56J22l13J20j32M26l18j16M05
2787B17o0no9k6j92K09j69L41j93O4k97K64j65q3L03j8J41j69n5q9R3K7J56k77
$$ plain form
2811 -52 128 -106 -162 -143 204 -28 -302 -26 28 -47 -8 -30 58 82 74 -132 -66 189 18 71 -36 -86 157 158 -28
2836 -28 111 113 -65 -149 85 -249 -48 -202 18 -80 -123 76 41 -44 66 -21 -48 68 -9 -87 -112 294 -20 -33 -259
2861 -259 -91 -54 -92 -212 -70 12 -124 88 -17 205 51 -96 115 -47 -28 -35 44 -19 -69 4 -214 -124 45 -80
2885 -80 -131 240 -48 -84 -28 95 10 -213 59 86 113 201 113 -94 431 -223 286 -48 -288 35 -153 145 180
2908 180 -182 -97 -72 -190 -199 -198 119 36 -5 103 -250 -49 -75 -128 -128 36 375 91 -127 -263 -171 -207 -94 -170 -165 -170
2934 -170 12 112 80 155 226 222 31 -58 148 -37 12 -60 -7 -59 -124 -129 -207 -161 -4 -93 -23 5 -86 -198 -60 239
2960 239 21 59 150 250 195 236 85 45 42 -371 -230 184 28 -119 149 -119 -90 154 282 -2 -94 80 175
2983 175 154 56 -186 -55 -287 -59 146 -189 -76 -190 35 245 11 -100 -105 61 -62 -365 -31 60 181 150
$$ packed form
2811e2J80k34n6J9L47k32k74K76N4p5L9k2Q8K4qk06O6K55j71N3j07n0K43Jj86
2836b8J39Kj78q4K34l34K01j54K20r8m3J99l5q5J10q7k7J16p7p8k5M06l14j3k26
2861b59J68L7l8j20J42Q2j36K12j05K22j54j47K11j62J9pP9o3n0P3k18R0J69j25
2885h0n1L71k88l6N6J23q5k23K72K7K7Q8q8k07N25o54N09l34k40L23j88K98L5
2908A80l62Q5K5j18rJL17q3m1J08l53K01k6n3%J64L39k84k18j36R2l6J13p6Nn
2934a70J82J00l2P5P1mj91q9K06j85M9p2N3n2o5np8M6J57q9P0K8r1j12J38K99
2960B39k18L8R1J00n5M1j51m0lm13J41M14j56j47K68k68K9K44J28k84r2J74R5
2983A75k1r8k42J31k32K28K05l35J13j14K25K10k34j11nJ66j23l03L34R1J21l1
$$ plain form
3005 150 -51 81 -197 158 137 291 -194 -73 143 -27 -71 -189 -133 -87 119 35 -197 -174 -147 -257 -23 -4 -221
3028 -221 -167 -137 183 -124 -34 209 120 46 18 77 -53 156 -91 194 -229 -179 -141 -90 -26 14 166 138 63 233 -36
3053 -36 -12 199 2 -22 -50 -86 5 -5 -87 -72 67 -198 -272 -62 -3 112 -18 29 -41 -108 60 -76 170 223 58
3078 58 -241 201 41 38 -287 -37 11 63 -22 -186 156 -105 -64 21 -169 -35 244 82 -330 -128 -90 32 -110
3101 -110 -76 10 -19 81 112 39 -183 -173 -118 2 -7 -207 191 -32 147 309 64 1 31 47 11 53 182 203 -76
3126 -76 -41 -141 105 -384 -232 -92 -106 120 -68 179 3 -133 -92 189 15 -86 43 85 87 79 -279 -39 -87
3149 -87 67 149 -77 19 170 62 -322 54 136 40 270 -36 61 220 248 128 125 -254 100 48 -180 151 -103
3172 -103 12 -283 -212 -92 267 -132 34 -55 -63 11 99 102 101 104 283 97 -179 -203 -96 52 -6 -102 -182 -66 68
$$ packed form
3005A50k01J32k78L55k1J54m85J21K16j70m4j18N6M6K06q4k32K3K7j10K34J9k17
3028b21N4L0L20l07R0K43q9p4k8N9j30K09k47K85m23N0L8N1O4M0J52k8p5J70k69
3053c6K4K11j97k4k8l6R1j0q2J5J39k65p4K10N9J15j30M7p0o7J68j36K46N3j65
3078E8k99M42j60ll25K50M8N2q5j64L42k61M1Q5j90J34K79j62m12K02L8J22j42
3101a10L4Q6k9J00L1p3k22J0N5J20rk00L98k23J79J62k45o3L0J6l6M2J29K1k79
3126g6L5j00K46m89J52J40j4K26j88K47j76j36M1K81j74j01J29M2Kql58K40m8
3149h7J54Q2k26R6J51j08l84L76Q2r6K30l06R7J59K8j20ll79L54n2k28L31k54
3172a03J15k95P1J20L59l99J66q9qP4Q8LjLJ79j86k76k4J07J48n8r6q0J16J34
$$ plain form
3197 68 -156 -119 99 145 17 -140 -263 -23 -150 216 -14 -55 -199 -57 310 168 -75 -182 28 167 32
3218 32 17 -117 -349 104 -247 -144 -34 232 203 193 305 99 -160 72 33 366 -275 116 99 -69 -98 26
3240 26 16 -135 -63 -260 -132 114 -1 -22 -239 161 -118 -121 432 -57 401 51 -96 49 331 -55 -189 -21
3262 -21 45 -319 -124 -50 -124 113 -80 296 -172 -116 40 170 -9 -132 -50 121 248 19 -93 3 -281 28
3284 28 -14 -115 81 8 -60 -282 369 -160 99 76 -101 11 -118 89 -27 194 -80 98 106 -23 -48 -88 -159
3307 -159 133 -137 -252 269 13 -255 -113 -145 -229 -131 60 -42 381 -198 127 100 -2 -55 28 -61 -80 61 283
3330 283 -178 130 -187 -393 -97 -82 64 -86 375 27 44 46 -71 298 -61 -106 -74 -19 175 181 -33 -160 -242
3353 -242 -77 -391 -137 -12 92 21 -111 220 72 337 -170 247 -3 -32 63 -142 -21 -96 30 -218 95
$$ packed form
3197F8k24L7K18M6j28j57j23K40j27L66k30m1j44J42L67j42k43j07K10J39j35
3218C2j5j34k32M53l51J03J10K66k9j0J12k06k59K32l9L33o41L91j7j68k9J24
3240B6j0j51P2j97J28K46j15k1k17M00k79lN53m89M58l50j47J45K82l86j34J68
3262b1O6l64J95P4p4K37j93L76m68N6J56J30j79j23Q2J71J27k29j12R6k84L09
3284B8m2j01J96p3o8k22O51n29K59k3j77J12j29K07j16K21k74J78Qj29k5m0p1
3307a59K92k70j15N21k56k68J42l2q4R8J91j02M23n79L25k7j02n3Q3q9j9J41K22
3330B83m61L08l17k06K96J5J46j50M61l48J7Kj17L69l59m5L2N5J94Ok14j27q2
3353b42J65l14K54J25J04p1j32L31j48K65n07M17k50k9R5k05J21p5J26k48L13
$$ plain form
3374 95 -5 -435 -52 -10 105 -42 68 -236 17 77 67 307 -86 213 -40 119 195 48 -65 22 -199 -119
3396 -119 -60 126 -55 -138 -171 -226 99 -276 216 -50 -81 111 18 67 83 -132 264 114 -201 283 216 -272 -31
3419 -31 -148 -50 -227 -212 -25 260 -4 -80 -194 16 273 200 381 45 49 -10 9 318 75 226 -156 -9 55
3442 55 -171 -85 -79 114 164 139 -224 -139 40 -100 146 -150 62 68 190 174 228 16 35 71 -31 -344 -166 -263 -433
3467 -433 15 -166 55 -213 115 11 109 -61 -198 -108 206 131 110 111 -150 369 -166 -3 62 -2 -170 30 3
3490 3 -10 -39 40 199 -38 220 -51 178 92 27 159 -7 15 -135 24 39 139 20 -353 -179 -230 128 189 -50
3514 -50 -238 194 -365 -84 305 143 -25 -40 110 -11 109 -26 86 84 -101 206 -15 123 -59 29 -226 54
3536 54 -308 -42 -184 6 -58 437 -44 108 227 150 87 89 -48 79 29 126 -154 -351 -217 -196 -229 28 24 -31
$$ packed form
3374I5j00m30L83M2J15j47J10l04K53O0j0K40l93K99k53J59P6j47j13Q7k21Q0
3396a19N9J86j81q3l3n5L25l75M92k66l1J92r3M9J6k15L96j50l15M84o7m88K41
3419c1j17R8j77J5J87K85k64p6j14K10K57p3J81l36Mn9J9L09k43J51l82J47O4
3442E5k26Q6OJ93N0k5l63Q5J79j40K46k96K12OJ22j6N4k12J9L6j02l13J78r7j70
3467d33M48j81K21k68L28j04R8j70j37R0L14p5k1Jk61N19n35J63O5o4j68K00k7
3490Cj3k9P9J59k37K58k71K29q6o5J32j66K2j50J59J5J00j19l73J74n1L58O1k39
3514e0j88M32n59K81L89j62j68j5J50j21J20j35J12kj85L07k21J38j82Q8k55K80
3536E4l62K66j42J90o4M95m81J52J19p7o3Kj37J27n0R7k80j97J34K1l3K57mn5
$$ plain form
3560 -31 -227 -227 9 -138 -24 197 359 -222 355 -32 84 -40 -116 -6 196 -151 -176 -91 -12 176 126 -348 -49
3583 -49 244 186 -38 26 168 110 153 32 75 86 98 42 -315 -135 -230 -173 54 -45 -83 -227 100 -47 137 215 -55
3608 -55 128 217 -38 112 -122 176 196 79 -1 51 -123 232 1 40 124 -262 -1 -104 -106 94 42 232 16
3631 16 230 54 -25 190 -55 324 -58 -186 240 23 -165 25 52 -117 -19 88 2 -27 189 -70 56 33
3653 33 -5 165 -50 -1 54 -208 1 -69 -45 106 -201 47 -115 105 -149 -99 142 -241 248 -136 -75 -63 219
3676 219 185 6 30 -3 162 85 -169 78 162 -21 -290 -104 -158 9 34 -123 54 63 114 -84 -20 103 -27 -151
3700 -151 -64 -192 129 124 -204 100 111 -60 -204 -215 -88 17 -136 -1 -44 -82 188 71 159 166 -163 429 27
3723 27 35 78 110 -70 71 -93 68 159 27 -44 -137 11 41 -3 -9 -104 359 -107 -43 -8 -193 -65 -102 -15 174 49
$$ packed form
3560c1j96%K36j47J14K21J62n81N77l87J16j24p6J10K02l47k5Q5P9J88n0m74K99
3583d9K93n8k24O4J42n8M3j21M3J1J2n6l57J80r5N7K27r9l8j44L27j47J84P8k70
3608e5J83Q9k55J50k34K98K0j17q0N2j74L55k31L9Q4l86K61j03kK00n2J90k16
3631A6K14j76p9K15k45L79l82j28M26k17j88J90K7j69R8J07q6k9K16k59J26k3
3653C3l8J70k15M9N5k62K09p0K4J51l07K48j62K20k54N0K41l83M89l84O1J2K82
3676B19l4j79K4l3J65p7k54K47Q4j83k69J86n4J67K5j57J77RN1j98O4J23j30j24
3700a51Q7j28L21nl28L04J1j71j44j1J27J05j53J35m3l8K70j17Q8Pl29N92m02
3723B7QM3L2j80J41j64J61R1j32p1r3J48L0m4or5M63m66O4L5j85J28l7Q7J89j25
$$ plain form
3749 49 -315 37 181 173 162 -10 96 -249 -8 -176 -62 -126 184 -23 -98 -28 34 -107 -5 77 -206 4 42
3772 42 -176 235 -145 -10 -352 125 -83 61 -47 430 150 151 0 -199 -156 -93 13 128 -28 73 36 113
3794 113 183 -156 7 -243 34 -136 97 -143 -266 -136 -6 34 129 -177 83 197 115 288 43 134 245 120
3816 120 -30 -140 124 134 64 -66 83 -137 108 -14 -261 -35 7 -253 -124 -31 -221 62 5 -81 114 89
3838 89 153 -123 -30 -40 -68 -102 -162 -103 94 82 130 -44 143 85 -295 -66 -69 -48 24 120 -2 -88 -40 175 26 -101
$$ packed form
3749D9l64L52J44qj1j72J06l45K41j68J14o4L10k07p5P0O2j41J02Q2k83K10L8
3772D2k18M11l80J35l42M77k08J44j08M77k80Jj51j99M3O3J06J15j56J01l7P7
3794A13P0l39J63k50K77j70K33k40j23J30J30M0R5l06K60J14q2J73k45R1J11j25
3816A20j50j10K64J0p0j30J49k20K45j22k47K26M2k60J29R3j90K83n7q6J95k5
3838H9O4k76R3j0k8l4o0N9J97j2M8j74J87n8l80K29lK1P2R6j22q6M8K15j49j27
$$ [...]
8191a58
##END NTUPLES=NMR FID
##END=
