##TITLE=1H_Pr NCS-Fast
 200.13MHz,CDCl3,
 8 sc
 
 3.7.2025
##JCAMPDX= 6.0         $$ Bruker NMR JCAMP-DX V2.0
##DATA TYPE= NMR FID
##DATA CLASS= NTUPLES
##ORIGIN= UXNMR, Bruker Analytische Messtechnik GmbH
##OWNER= pz
$$ XWIN-NMR		Version 3.5
$$ Thu Jul  3 16:32:13 2025 Russian Standard Time (UT+4h)  she@DPX200
##.OBSERVE FREQUENCY= 200.1313
##.OBSERVE NUCLEUS= ^1H
##.DELAY= (6, 6)
##.ACQUISITION MODE= SIMULTANEOUS
##.ACQUISITION SCHEME= undefined
##.AVERAGES= 8
##.DIGITISER RES= 18
##SPECTROMETER/DATA SYSTEM= spect
##.PULSE SEQUENCE= zg30
##.SOLVENT NAME= CDCl3
##.SHIFT REFERENCE= (INTERNAL, CDCl3, 0, 14.3821)
##AUDIT TRAIL= $$ (NUMBER, WHEN, WHO, WHERE, WHAT)
$$ ##TITLE= Audit trail, XWIN-NMR		Version 3.5
$$ ##JCAMPDX= 5.01
$$ ##ORIGIN= Bruker BioSpin GmbH
$$ ##OWNER= she
$$ F:/spectra/data/she/nmr/H-C/1/audita.txt
$$ ##AUDIT TRAIL=  $$ (NUMBER, WHEN, WHO, WHERE, WHAT)
(   1,<2025-07-03 16:30:37.23 +0400>,<she>,<DPX200>,
      <created by zg, POWCHK disabled, PULCHK disabled
       configuration hash MD5:
       00 E9 B6 7A A2 85 ED C7 34 08 36 98 17 FE 4E 26
       data hash MD5: 16K
       64 06 43 BA 67 CC EF 5C 20 EF 5D E8 C1 B1 C9 92>)
$$ ##END=
$$ 
$$ hash MD5
$$ 95 D5 22 DB 01 21 5F 80 01 91 DF F9 BE C5 B4 C4
##$RELAX= 
##$RELAX= 
##$RELAX= 
##$RELAX= 
##$RELAX= 
##$RELAX= 
$$ Bruker specific parameters
$$ --------------------------
##$DU= <F:/spectra>
##$EXPNO= 1
##$NAME= <H-C>
##$PROCNO= 1
##$TYPE= <nmr>
##$USER= <she>
##$AMP= (0..31)
100 100 100 100 100 100 100 100 100 100 100 100 100 100 100 100 100 100 
100 100 100 100 100 100 100 100 100 100 100 100 100 100 
##$AQSEQ= 0
##$AQ_mod= 1
##$AUNM= <au_zg>
##$AUTOPOS= <>
##$BF1= 200.13
##$BF2= 200.13
##$BF3= 200.13
##$BF4= 200.13
##$BF5= 200.13
##$BF6= 200.13
##$BF7= 200.13
##$BF8= 200.13
##$BYTORDA= 1
##$CFDGTYP= 0
##$CFRGTYP= 5
##$CHEMSTR= <none>
##$CNST= (0..31)
1 1 145 1 1 1 1 1 1 1 1 1 1 1 1 1 1 1 1 1 1 1 1 1 1 1 1 1 1 1 1 1 
##$CPDPRG= <>
##$CPDPRG1= <>
##$CPDPRG2= <>
##$CPDPRG3= <>
##$CPDPRG4= <mlev>
##$CPDPRG5= <mlev>
##$CPDPRG6= <mlev>
##$CPDPRG7= <mlev>
##$CPDPRG8= <mlev>
##$CPDPRGB= <>
##$CPDPRGT= <>
##$D= (0..31)
0 0.7 0 0 0 0 0 0 0 0 0 0.03 0 0 0 0 0 0 0 0 0 0 0 0 0 0 0 0 0 0 0 0 
##$DATE= 1751545836
##$DBL= (0..7)
120 120 120 120 120 120 120 120 
##$DBP= (0..7)
150 150 150 150 150 150 150 150 
##$DBP07= 0
##$DBPNAM0= <>
##$DBPNAM1= <>
##$DBPNAM2= <>
##$DBPNAM3= <>
##$DBPNAM4= <>
##$DBPNAM5= <>
##$DBPNAM6= <>
##$DBPNAM7= <>
##$DBPOAL= (0..7)
0.5 0.5 0.5 0.5 0.5 0.5 0.5 0.5 
##$DBPOFFS= (0..7)
0 0 0 0 0 0 0 0 
##$DE= 6
##$DECBNUC= <off>
##$DECIM= 32
##$DECNUC= <off>
##$DECSTAT= 4
##$DIGMOD= 1
##$DIGTYP= 9
##$DL= (0..7)
0 120 120 120 120 120 120 120 
##$DP= (0..7)
150 150 150 150 150 150 150 150 
##$DP07= 0
##$DPNAME0= <>
##$DPNAME1= <>
##$DPNAME2= <>
##$DPNAME3= <>
##$DPNAME4= <>
##$DPNAME5= <>
##$DPNAME6= <>
##$DPNAME7= <>
##$DPOAL= (0..7)
0.5 0.5 0.5 0.5 0.5 0.5 0.5 0.5 
##$DPOFFS= (0..7)
0 0 0 0 0 0 0 0 
##$DQDMODE= 0
##$DR= 18
##$DS= 0
##$DSLIST= <SSSSSSSSSSSSSSS>
$$ [...]
##$SUBNAM0= <"">
##$SUBNAM1= <"">
##$SUBNAM2= <"">
##$SUBNAM3= <"">
##$SUBNAM4= <"">
##$SUBNAM5= <"">
##$SUBNAM6= <"">
##$SUBNAM7= <"">
##$SUBNAM8= <"">
##$SUBNAM9= <"">
##$SW= 18.0517328524113
##$SWIBOX= (0..15)
0 0 2 0 0 0 0 0 0 0 0 0 0 0 0 0 
##$SW_h= 3612.71676300578
##$TD= 16384
##$TD0= 1
##$TE= 0
##$TE2= 300
##$TE3= 300
##$TEG= 300
##$TL= (0..7)
0 120 120 120 120 120 120 120 
##$TP= (0..7)
150 150 150 150 150 150 150 150 
##$TP07= 0
##$TPNAME0= <>
##$TPNAME1= <>
##$TPNAME2= <>
##$TPNAME3= <>
##$TPNAME4= <>
##$TPNAME5= <>
##$TPNAME6= <>
##$TPNAME7= <>
##$TPOAL= (0..7)
0.5 0.5 0.5 0.5 0.5 0.5 0.5 0.5 
##$TPOFFS= (0..7)
0 0 0 0 0 0 0 0 
##$TUNHIN= 0
##$TUNHOUT= 0
##$TUNXOUT= 0
##$USERA1= <user>
##$USERA2= <user>
##$USERA3= <user>
##$USERA4= <user>
##$USERA5= <user>
##$V9= 5
##$VALIST= <valist>
##$VCLIST= <CCCCCCCCCCCCCCC>
##$VD= 0
##$VDLIST= <DDDDDDDDDDDDDDD>
##$VPLIST= <PPPPPPPPPPPPPPP>
##$VTLIST= <TTTTTTTTTTTTTTT>
##$WBST= 1024
##$WBSW= 4
##$XGAIN= (0..3)
0 0 0 0 
##$XL= 0
##$YL= 0
##$YMAX_a= 221908
##$YMIN_a= -257828
##$ZGOPTNS= <>
##$ZL1= 120
##$ZL2= 120
##$ZL3= 120
##$ZL4= 120
##$ABSF1= 10
##$ABSF2= 0
##$ABSG= 5
##$ABSL= 3
##$ALPHA= 0
##$AQORDER= 0
##$ASSFAC= 0
##$ASSFACI= 0
##$ASSFACX= 0
##$ASSWID= 0
##$AUNMP= <proc_1d>
##$AZFE= 0.1
##$AZFW= 0.1
##$BCFW= 1
##$BC_mod= 2
##$BYTORDP= 1
##$COROFFS= 0
##$CY= -3
##$DATMOD= 1
##$DC= 2
##$DFILT= <>
##$DTYPP= 0
##$F1P= 0
##$F2P= 0
##$FCOR= 0.5
##$FTSIZE= 0
##$FT_mod= 4
##$GAMMA= 1
##$GB= 0.15
##$INTBC= 1
##$INTSCL= 1
##$ISEN= 128
##$LB= 0.25
##$LEV0= 0
##$LPBIN= 0
##$MAXI= 10000
##$MC2= 0
##$MEAN= 0
##$ME_mod= 0
##$MI= 1.114404
##$NCOEF= 0
##$NC_proc= 0
##$NLEV= 6
##$NOISF1= 3.799351
##$NOISF2= 2.8
##$NSP= 1
##$NTH_PI= 0
##$NZP= 0
##$OFFSET= 14.38212
##$PC= 1
##$PHC0= -1205.215
##$PHC1= 14.19223
##$PH_mod= 1
##$PKNL= yes
##$PPARMOD= 0
##$PSCAL= 0
##$PSIGN= 0
##$REVERSE= no
##$SF= 200.129724274929
##$SI= 16384
##$SIGF1= 3
##$SIGF2= 2
##$SINO= 400
##$SIOLD= 16384
##$SREGLST= <1H.CDCl3>
##$SSB= 0
##$STSI= 0
##$STSR= 0
##$SW_p= 3205.1282051282
##$SYMM= 0
##$S_DEV= 0
##$TDeff= 0
##$TDoff= 0
##$TI= <>
##$TILT= no
##$TM1= 0
##$TM2= 0
##$TOPLEV= 0
##$USERP1= <user>
##$USERP2= <user>
##$USERP3= <user>
##$USERP4= <user>
##$USERP5= <user>
##$WDW= 1
##$XDIM= 8192
##$YMAX_p= 0
##$YMIN_p= 0
$$ End of Bruker specific parameters
$$ ---------------------------------
##NTUPLES= NMR FID
##VAR_NAME=  TIME,          FID/REAL,        FID/IMAG
##SYMBOL=    X,             R,               I
##VAR_TYPE=  INDEPENDENT,   DEPENDENT,       DEPENDENT
##VAR_FORM=  AFFN,          ASDF,            ASDF
##VAR_DIM=   8192,          8192,            8192
##UNITS=     SECONDS,       ARBITRARY UNITS, ARBITRARY UNITS
##FACTOR=    0.0002768,     1,               1
##FIRST=     0,             0,               0
##LAST=      2.2672688,     0,               0
##MIN=       0,             -257828,         0
##MAX=       2.2672688,     221908,          0
$$ Real data points
##PAGE= N=1
##DATA TABLE= (X++(R..R)), XYDATA
0@%%%%%%%%%%%%%%Nj3J6j6J6j7K5l2L4m2M8n6O9p7Q8j04J19j34J51j70J91k17
36a16K44k70L02l39L77m19M66n15N68o27O94p67Q44r29J023j128J247j375J517
55G97j680J866k080K328k621K976l413L964m687N682p144R502j3921K4967j04709
70h8173j69655K59116J88364j22956j72926J8534J21742K1878n2516K6093o5637
81c6136n4299Q6324Q5378m8404j30948j1018J43845M4339j19674l3999O1614J9429
93F451J2588j1547l564j7418j7268P5766K6923r6077k4866Q2244K0262n2861l4185
106c3552L6260L3549o1081M013O4591m4134m9387M9563N6018k8178p5830K2129
118b6039J04293k8008r7154L7334O6068k3576n9381R865P1275l7628q7827N8370
$$ y = [0, 0, 0, 0, 0, 0, 0, 0, 0, 0, 0, 0, 0, 0, 0, 5, -8, 8, -8, 8, -9, 16, -16, 18, -24, 24, -32, 37, -40, 48, -56, 63, -71, 80, -90, 101, -116, 128, -142, 160, -179, 198, -221, 245, -270, 298, -329, 365, -402, 442, -487, 536, -592, 655, -720, 797, -883, 983, -1097, 1231, -1390, 1586, -1827, 2137, -2550, 3132, -4012, 5490, -8431, 16536, -88173, -257828, 1288, 189652, 66696, -106230, -87696, 34046, 55924, 3408, 29501, -36136, -90435, -4111, 81267, 32863, -98085, -109103, 34742, 79081, -40593, -74592, -12978, 6451, 19039, 7492, 3928, -13490, -30758, 45008, 71931, -24146, -49012, 33232, 53494, 633, -33552, 2708, 36257, -24824, -20811, 43780, -354, -49741, -178, 55840, 27662, -48168, -26039, 78254, 50246, -46908, -9574, 56494, 32918, -26463, -16598, 54677, 17049, -70778, -12408]
130a2408P5108o2088o9269K9543P3302o58p7959N916N5976j4054m456J5905j8953
143d095j5832J1581L6737M447o7347j1412O7693J379m4279j0186J6675J8518k0061
156a6182n334L7196j9929l5849M0599L3318k2951k6812O979L8237p852l1501K8872
169A8791N044m3108Q358L8130N32m2904l0484N0077M0338n0388k6241K9742J5145
182A3032j643r441Q166P235l0495J1268M8690k2117m6903N679L4462J6098l8672
195d641k9509L0377P366j2230J0278j2803j6202J4893K0540R403k9873k4064M5820
208I355K5683l5125j8575J0940K3891J812l2072K559J6621j6086M373J0436j6882
221a3070o135O845J6227M783l0046M925L5589j0900j3934J0064N065L573r920
$$ y = [-12408, 62700, 612, -68657, -39114, 34188, 33530, -44429, -38513, 17463, 3409, -1047, 14858, -4095, -19927, -8346, 28391, 32838, -34509, -45921, 21772, 23151, -21128, -31314, -14639, 3879, -16182, -21516, 15680, -4249, -40098, 501, 33819, 10868, -15944, -8965, 29272, 21420, -10081, 18791, 23835, -19273, -10915, 27215, 27747, -15157, -45641, 4436, 44774, -5614, -31855, -2113, 13032, 11389, 1948, 10114, 17349, -13146, -1878, 46812, 24695, -22208, -16529, 17933, 34031, -4641, -34150, -3773, 3593, -8637, 1641, -11162, -27364, -12471, 8069, 17472, -12401, -36465, 9355, 35038, -87, -18662, -7722, 16169, 17981, -14091, -11532, 5089, -10997, -6624, 3812, -13070, -19205, -12360, 3867, 8650, -21396, -16471, 19118, 8218, -5716, 4348, 9413, 12986, 3066]
234C066q24K0444j6642j8929K0818M233j1735p535n096J8150m64k0590J5134O708
248F738j4606R358P800k00l377j1507J8171J1383k6922J559J3341j0167r40l138
262b507j260M754j6029L319J9336j7677q556J3853L364N658r788p133K3213k338
276H209j3408J1343k886l639N756o730L854m791j2813J8286N46k2267Q830Q305
290a405q94k03j0544J1654J4082j6491M291J0155p617O513j260n305Q256r934
304A298j770J3222j5394n647J0884m492J329n246n552J7817m304j1598J5299j326
318D520m543Q398m296L340Q71j1012J2031M03j6746P218J308n986L845r825J610
333h864J0065j1876K924Q343r008O427L198l601Q259o589j087J4297j0474n408
$$ y = [3066, 2242, 22686, 6044, -12885, 7933, 12166, 431, -7104, -12200, 5950, 5486, -15104, 30, 6738, -7868, 1490, 9290, 9090, 5713, -5794, 12377, 23760, -3162, -1603, 11738, 1571, 631, -2507, -3767, 987, -15042, -11723, 7613, -10064, -18620, -4767, -1403, 4255, -5533, -12666, 10547, 8209, -5199, 6144, 3258, -381, 5375, -1355, 2499, -2292, -15105, 3181, 3727, -18540, -9710, -1405, -2299, -2502, -13046, -1392, 12690, -3801, 490, 10645, 3028, 9541, 8281, 2976, 11232, 1298, -472, 12750, -2644, -8291, 2593, -1899, -570, -5816, -11368, 6449, 2145, -9453, 5846, 4520, -23, 8375, 4079, 7419, 8290, -2722, 9309, 9712, -7034, 184, 1492, -4494, -649, -10474, -8864, 1201, -10675, -7751, 592, -8416, -1989, 1209, -2392, 5867, -722, -1809, 12488, 2014, -3394]
347c394R409n739P73r47q460Q445l025q580J1364l968n206R680l838K458N909
362D881q184P824M861q589P430n91o307O747n828k18N820j3288P15R092q693Q32
378c496O08m853R093j835k896Q025n737R73J0739p656m5L359n884O479j402r358
394c886N558l576l265N650p263p86N202n961N034K548p417Q097K281m772O072
409C516k078Q93N472q052J576N103q671K640J386p528L585j722j892O623p262
424f411k249R243j305K238l45o070J1119L171p740L855j494j368N262n820q63
439A223K564q832L615L357o376K662l733j941J0696k610m810M762j106M839K149
454F459p435O062J962p620M420o39k374J665r158J197Q846p251l020J406j580
$$ y = [-3394, 6015, 276, 1049, 102, -8358, 87, -2938, -11518, -154, -4122, -9328, 352, -3486, -1028, 4881, -3303, 4521, 9382, 793, 8223, 7632, 1325, 8072, 2244, 2026, 7846, -5442, -4727, 4365, -4328, -3496, -2888, -7741, 1352, -483, -3379, 4646, -1091, -118, 10621, 2965, 2920, 6279, 395, 6874, 5472, -3886, 1672, -1904, -5169, 481, -6782, -7568, -2366, -8327, -3293, -745, -8162, -65, 2216, -2556, 3516, 1438, 2331, 7803, -249, 1327, 6430, -2241, 399, 1785, -5743, -2158, -3880, -5772, 851, -6411, -8660, 583, -722, 1516, 1171, -4899, 6220, 9391, 1651, 5506, 4012, 2644, 7906, 2086, 1223, 3787, -5045, -1430, 1927, -4449, -1787, -5520, -7461, 3235, 625, -4185, 577, -529, 4310, 6459, -976, 5086, 7048, -572, 3848, 3209, 835, 2500, -6658, -5461, 3385, -3866, -6886, -5480, -7060]
469g060P273k458m186R005l390l707R895O40j975l087n641J1842M434j4055k479
484d949J672L290N270j1265m127R068l247J589M626n956K258O85J022J1573n985
499E524j0135P563L786K911k643j4683N628J0875p484l820l940K59R169n905m048
514f943P408m269R19P088l242K148j272l948J1698j265j1342L368K470J997j400
529C415j3090M692J0154r133k287Q73n94P194l353l188Q271n314l32R678k994
544C992j322j577m050J1982P5j4177J604K770J576K413j0715k26Q301m898K439
559a813K624n550M835N27j963R953l772o926N267K11L884j23j1896L357N307n256
575a334K946l281o342N586l36K014M408j1052L85J1021O13M23o209m378J3115
$$ y = [-7060, 213, -2245, -6431, 2574, -816, -4523, 5372, 6012, 4037, 950, -4691, 7151, 11585, -2470, -4949, -3277, 13, 5283, -5982, -10109, -1041, -4288, -2699, 1927, -4029, -1771, -1086, -64, 11509, 5524, -4611, 2952, 6738, 9649, 7006, -7677, -2049, 8826, 1342, -2478, -6418, -6159, 3010, -2895, -6943, 465, -3804, -2885, 4203, 961, 3109, 1837, -2111, 9587, 8322, -3020, 348, 2818, 4815, 3415, -9675, -4983, 5171, -3962, -6249, -5376, -5970, 1224, -2129, -5317, 2954, -2360, -2692, 6986, 3992, 2670, 1093, -2957, 9025, 9100, -5077, -3473, -703, 873, 3286, -7429, -7655, 646, -4252, -1813, 811, -4739, 96, 623, -1340, 8613, 4841, -2085, 3182, 3393, 7277, 7154, -4742, -1385, 3922, -1334, 1612, -1669, -8011, -2425, -2761, -747, 3661, -7391, -7006, 4015, 4628, 5051, -1158, -5536, 7579]
590G579J807q671O20l173J303N499o374o94m49o679P914L814p620K81j313M429
606a727R435q355m707P558R38L089j620p895O244J846m701K801n093k834O138
621A117l530q26K175o005M654M524m486K409r92N4Q103l815l507M384k062J357
637C554J949o470J286L51l997N515k588n776L620j311L069L495q440J293P031
652B581j85J608l252l045Q083q92l554K022m975O27M663m964k87j063m464N992
668a105J336m646J615j941L058O372m860j028L604j670M086M6n402K824o14j134
684E41L090n564j944M190l316J577rm627M514J985l186L950j273j43M667l303
700A149J179K834m290J937O05m246L129j724l926L194k104q86K543m666K442L400
$$ y = [7579, 9386, 715, 1335, -1838, -535, 4964, -1410, -2104, -2553, -9232, -1318, 2496, -5124, -4843, -6156, -1727, 7708, -647, -5354, 2204, 3142, 6231, 4611, -3284, 2960, 4806, 105, 2906, -2187, -5021, 1117, -2413, -3239, -1064, -7069, -2415, 2109, -2377, 32, -960, -906, 7197, 3382, -125, 4259, 2197, 3554, 5503, -967, 319, 670, -3327, 2188, -400, -6176, -2556, -3867, -798, 2697, -5743, -4450, 2581, 2396, 4004, 752, -2293, 5790, 4898, 1344, 3366, -1609, -982, 3681, -1283, -1570, -2633, -7097, -1105, 231, -4415, -2800, -4741, -1683, 4689, -171, -1199, 2405, 735, 4821, 4867, -535, 2289, 1675, 541, 3631, -1933, -3877, 313, -3003, -1426, -1435, -6062, -1548, 437, -2749, 1201, -72, -215, 4452, 1149, 2328, 5162, 872, 2809, 3414, -832, 2297, 573, -3353, -159, -2263, -3149, -606, -5272, -2830, 570]
716E70l576K769R92j874M784j688j856M341k787k57K611m723J388J005n039K898
732d42r22l731M465k129j251L815k664J686K883l706L588K126l942L899q87k278
748E10M158l733j472L194m849O88K128m468J845J13k664M966j581k647N296j639
764a55P67L651m056J783K358k933K612k071m110M868j816l344K466m041J385L432
780G96n226J909J926k522M174o63k235N258k082m84M079m586J097L018n090J747
796A116j3m569M034j958l232M372l051p72M842l685J523L045l402L877R86l540
812d27M460j847j910L888l818p37L173n107J414J356m812L347n6l403M316j454
828a617q64M985l155P93L764l669K340J583m081L289p91l536L351k784j828L324
$$ y = [570, -3006, -237, 755, -1119, 3665, 1977, 121, 4462, 1675, 1418, 4029, -694, 694, 1699, -3340, -442, -1364, -5095, -630, -2759, -4010, -195, -2859, -1173, 1710, -1996, 1592, 3718, -224, 3675, 2788, 510, 4668, 935, -537, 2657, -2192, -1504, 624, -3844, -1999, -1886, -4550, 416, -1165, -3812, 1484, -155, 612, 4263, 207, 1990, 4348, 1415, 4027, 1956, -2154, 2714, 898, -2446, 20, -4021, -2636, 796, -4430, -2521, -595, -3117, 1057, 394, -1841, 3417, 1335, 851, 4930, 344, 1441, 4459, -631, 1116, 1103, -3466, 568, -1390, -4622, -250, -3301, -4073, 769, -2916, -1393, 1652, -1750, 2127, 3113, -427, 4033, 2186, 276, 4164, 346, -391, 2782, -2325, -911, 445, -4367, -1020, -1076, -4479, -163, -1617, -2481, 2504, -651, 142, 3906, 237, 2577, 4160, 79, 3368, 2577, -959, 2392, -392, -2220, 1104]
844A104m751Q96K943m615K538J881l094M075p17k144N192j848n07L285m233J272
860A277K539m282J811j062l777M271j852l089L247k317N33L099l351K197K037
875A281l275M316P69l522L295p86m64K463m474m5L055m352J121M02l787L238r22
892a687k064M121k191q10M236j566M42K121k611L531K3l699K863q81k474L091
908B445l300j473K528l111J234R41l675L162Q69k055L385j070o72L429j726J582
924B493J654m628J555K602k793J24k088j469M048l218j978L222k828P83K050j212
940a683K223j104j873O018r7l742K138n37J444J474n368J513J115l780K231j87
956b15k680J165j247P76L478l768k26L932j255K090K64l315L700L13j562J540
$$ y = [1104, -3647, -2751, 192, -4423, -1885, -4, -3098, 977, 260, -1884, 3308, 1460, 953, 4238, 5, 1277, 3816, -466, 1345, 283, -3494, 777, -1075, -4164, -917, -3234, -2701, 398, -2953, -756, 1281, -1994, 2322, 3091, -431, 2864, 2078, 1614, 4077, -397, -442, 2613, -1739, -618, -216, -4003, -765, -1687, -3751, 370, -1821, -2631, 1605, 39, 481, 2602, -9, 3522, 3545, -154, 2709, 1828, -646, 2445, -855, -2328, 200, -2911, -1677, -736, -4411, -1249, -380, -2435, 950, -120, -792, 2637, 911, 2493, 4147, -481, 1074, 3676, 883, 1007, -1081, -2550, 1498, -1720, -3698, -476, -3304, -2521, -471, -1683, 540, -564, -2437, 3581, 3484, -258, 1880, 1343, 2787, 4261, -1107, 406, 1521, -2259, -28, -215, -2895, -1730, -2977, -2201, 1277, -2491, -2717, 1215, -40, 2050, 2314, -1001, 2699, 3012, 1450, 2990]
972B990l386J76L197m120l92J742l119J223j9j534L612k554j680N968j126j554
988e76J332o60L914n82n524M219K060m386N40j171O22J287m759J589L426n477
1004d146R05L157q70J475k349J97O324k748k767L486r61R58k14l799K943k05l967
1021b581K959j267k333K683k458O58L081l495J233K297k110M065o71l402M487
1036C146j81j910J368k758J466J490n840K038K572m276M14M8Q05L239n033j7O673
1053C244k688j902K549l42K343j894k438N602k037m791L614k73j117k37l811L320
1069h58J847n451K433K295k418K721j034P4L716l198O12L217l353P83J544l375
1085d45J691n90k642K807k496j276L741l806K7M045k830J024P68j225M584j746
$$ y = [2990, -396, -220, 2977, -1143, -1535, 207, -2912, -1689, -1708, -3242, 370, -2184, -3864, 2104, 978, -576, 756, 96, 4010, 3428, -2096, 2123, 4183, -203, 337, -834, -212, 1075, -3684, -2095, 1331, -4146, -3241, -84, -954, 521, -1828, -1631, 4693, 1945, -822, 2664, 1703, 2661, 2447, -1352, 1591, 1386, -2581, 378, -889, -3222, -539, -2997, -2339, 742, -2753, -1520, 777, -1333, 2732, 2061, -1341, 3146, 2965, 1055, 2423, -335, 1131, 2621, -3219, -1181, 1391, -2885, -2471, -2423, -1618, 1621, -3412, -3429, 3244, 556, -1346, 1203, 861, 3204, 1310, -1128, 4474, 2437, -2354, 1260, 987, -130, -367, -4178, -858, 989, -4462, -2029, 266, -2152, 569, -465, -391, 3325, 127, 739, 3956, 603, 1386, 2930, -445, 1246, 656, -1986, 821, -1675, -2951, 790, -3016, -2989, 1056, -1774, -750, 18, -1207, 3377, 1631]
1101A631l368N257q51k499J787j734J355L3m560L222J152n261J773J154p21J103
1117e27k644J873M213m607Q67L454j794N42J43j101K852k546k072L825k607j432
1133a561J725j922P91J33k855L675n48k595L902n0j497K503j434J745Q86l393
1149d95K620P49l873J642N85k266J080k284M93K258l823J142K999k963J351Q06
1165B1l30K524j912p34M139k231j465K505j758L62p63k126K680j321l436L587
1181b58o78j953K031p34J489P84k686L297J372l294K187P04r82R11k423Q70J676
1198B313l755L94K064l171P38K02o08J765j706m45L617j587o58K720j009Q60N5
1215A789j368J991j016k361L058j782j786J526j546O37K37k504K756N72l068K892
$$ y = [1631, -1737, 3520, 2669, 170, 1957, 223, 1578, 1611, -2949, 273, 1425, -3836, -2063, -909, -1630, -527, -3171, -1298, 2915, -1692, -825, 2629, 835, 1377, 1520, 419, 3271, 725, -1347, 2478, -129, -1561, 164, -1758, -967, -834, -3689, -14, -562, -3157, 745, 695, -802, 1701, 267, 2012, 2898, -495, 2125, 2874, -999, 643, 1228, -1038, 42, -2242, -1749, 509, -3314, -2172, 827, -2136, -785, 21, -309, 2215, 303, -431, 3708, 1477, 12, 2517, 759, 1121, 358, -1768, 912, -409, -3845, -258, -936, -2889, -858, -1592, -103, 681, -2005, 1292, 2664, -630, 1557, 2261, 1279, 2190, -233, 637, 2313, -1442, -1048, 1016, -2155, -1417, -1215, -1823, -58, -1764, -2209, 1408, -179, -837, 1883, 874, 1734, 1789, 421, 2412, 1396, -965, 2093, 311, -1475, 51, -1495, -858, -621, -3125, -369, 203, -2865, 27]
1231B7N90q84J766j491J051J979l226J116K316l113M60j07j178J639k804n96L112
1248F57k840m81K594j674R82Q19j323L214p18j914L516j141j471J977j784O40
1264A053J25k933K090N71l810J975K80j507J879j496Q16K638l096J483K426k625
1280a31J626O44j589J878j821j002K608k610j277K376k338L03P85k235K564o63
1296h82j842L644o97j343K973j449O01J487k722K098N00l304K236k93k094J075
1312a2j158k75J591k797P46K338k582J691Q17j208K494j011o81L166k379n56K498
1329B682k222j74R01k280J577q08k574K809r16j641K621j118q8K216k218J608
1345C75J446k198K345k0j960K057j083r94J751k553p8J742k705R37P61j737J668
$$ y = [27, 617, -267, 1499, 8, 1059, 3038, -188, 928, 3244, 131, 591, 484, -694, 945, -1859, -2455, 657, -2183, -2664, -70, -1744, -762, 57, -1266, 1948, 1230, -684, 2832, 1691, 220, 2197, 413, 1053, 1178, -1755, 335, 906, -2904, -929, -649, -2156, -277, -1773, -957, 1681, -1415, 68, 2494, -131, 1495, 2139, 550, 2428, 607, -395, 2213, -397, -1674, 702, -1636, -1333, -548, -2783, -219, -882, -2724, 920, 223, -1120, 1853, 404, 1005, 2492, -230, 1868, 2368, -936, 1300, 1007, -1087, -12, -1170, -1445, 146, -2651, -1905, 433, -2149, -458, 359, -849, 1645, 634, -47, 3119, 740, 184, 2682, 460, 286, 1187, -1093, 484, -324, -2898, -89, -1005, -2646, -25, -1143, -1231, 985, -1233, 375, 1821, -377, 1968, 1948, -12, 2045, 962, -32, 1719, -834, -912, 830, -1875, -938, -177, -1914, -246]
1362b46p06r69K704j203m48K721j363qJ436j888J589K57k563K103j098j667K199
1379H50j895m67J394j652O65J119j861J689M36j496K464l78n45J959j704MJ624
1396B206k545Q18P79k289J168m11j359J867j597p08K212j686N94J450j633K066
1412I32J51j545K050j3j212J513j156l34J053k192K05R80k095J045m96j142K276
1429B0q18q41K516j201J22J570j531J693M6j797J886J8j910J032j157p4R63k230
1447a693K35J133j446P89J3o84K041n42r93K709r16k06J122j046J033M18k496
1464e29J324J93j704Q05j179l72J665j919j69K050j314O13N11q03K228o11j112
1481c23K268m85j014J013j483J174j1k408J066O07j545K57o70N9J938k073J04
$$ y = [-246, -952, -1921, 783, -420, -868, 1853, 490, 482, 1918, 30, 1619, 1876, -687, 1416, 318, -1349, 850, -1045, -1512, -118, -1770, -1105, 14, -1847, -158, 278, -1218, 1246, 868, 323, 2282, 578, 582, 2206, -339, 479, 1258, -1031, 137, -274, -1633, 234, -1363, -2071, 141, -1545, -951, 499, -1134, 932, 1083, -462, 1588, 1575, 363, 1876, 720, 386, 1439, -753, -548, 432, -1663, -618, -1114, -2256, 20, -798, -1639, 877, -324, -202, 1368, -163, 1530, 1576, -221, 1665, 1683, -227, 805, -352, -426, 537, -1693, -1458, -325, -1771, -982, -969, -1653, 388, -154, -1147, 1562, 646, 440, 1562, 516, 1549, 1967, -529, 795, 988, -716, 89, -1090, -1462, 203, -1716, -1885, 165, -1149, -536, -25, -828, 1400, 789, -323, 1945, 1460, 446, 1459, -24, 1150, 1139, -1269, -203, 404, -1141, -884, -1554, -1495, 443, -1630, -1526]
1498a526K346j144K42J026j014J898p22j393K235r45r29R02j302L56N43k529Q40
1515a116Q40j556J167l37m03K085j406%K005j086N30Q43j363J282M03k590J643
1532I41p6j567J180j542J67J543k770O50J605j541J159Nk51J976j123q85K732
1549B203j312o14R00j120J250m02k530J838j18j695Q25k75k38J223j543P70J711
1566H73k043J173R41j190J679k89j182J817q92p02J213k166N30Q61k287J019M57
1583a88j829J544j71o56J771j008j62K233j763O94R41j379J712m54j939J952p54
1600E44j352R66j008K13O26k029J148R97j721J090M95p31J939j038j1K002j669
1617D61oJ087j323L45M3j210J044n00j607J571q48q00J735j176N64Q64j296J505
$$ y = [-1526, 820, -324, -82, 944, -70, 1828, 1106, -287, 1948, 1003, 74, 976, -326, 30, 573, -1956, -1116, -276, -1832, -665, -1002, -1405, 680, -726, -726, 1279, 193, 723, 1566, 203, 1485, 1888, -702, 941, 865, -702, 478, -1064, -897, 646, -2124, -1474, 131, -1410, -251, -246, -497, 1479, 356, -529, 2203, 891, 277, 1177, 57, 1307, 905, -1625, 213, 95, -1600, -775, -1050, -1288, -65, -1608, -838, 873, -1170, 3, 944, -246, 1433, 1144, -38, 1779, 887, 185, 1398, -768, -238, 623, -1664, -645, -188, -2017, -473, -644, -1300, 471, -537, -699, 1534, -229, 465, 1406, 27, 1739, 1285, -654, 1298, 544, -808, 158, -850, -637, -11, -2040, -892, 105, -1616, -526, -31, -762, 1177, 139, 128, 2130, 461, 455, 1542, 219, 564, 607, -603, 441, -59, -1666, -95, -943, -1743, -8, -1184, -620, 244, -1052, 453]
1635D53O93j403J427N7r07J016o33m86J001j746M37O95k316J236l40q83J368n57
1653h88j89J436j137M86J360j139N27Q38r08J151p28r58J392j350n24R19r87j50
1671h49L68j101J085J8j089J272N39o21R32l85K71R83j442J039P35j623N97r3
1689F36r77M74j127j9J137j325l13J418r92O53M90o37J224Q6q11J484p55k53J265
1708A658j397K66J82j060O66j79j559J216j82r27J069q42M11Q97j174J275M16
1725G36j037J057N27q35J294j115m64R78j388j08Q35j368K34L67j033J291p86
1742h15k12J466p86j76J355r69P45N07r43R89J7j422J247m34j176Q35j034l7R45
1761A02j388L51O86j199J165L49o62J250m48j17J272j146J50Q91j255O73K51j459
$$ y = [453, 1146, -257, 1170, 1227, 320, 1336, 703, 217, 1218, -528, -91, 604, -1712, -476, -816, -1699, -331, -888, -1077, 359, -778, -292, 1068, -71, 456, 1294, 386, 1537, 809, -149, 1243, -107, -631, 288, -699, -849, -481, -1582, -497, -479, -1568, -296, 243, -378, 554, 169, 440, 1423, -19, 1020, 1755, 132, 729, 636, -341, 133, -994, -1013, 124, -1201, -1514, -96, -1088, -435, 55, -582, 642, 728, -83, 1401, 646, 393, 1658, 261, 527, 709, -351, 315, 136, -1423, -207, -389, -1316, -247, -1089, -678, 219, -955, 320, 736, -301, 756, 1283, 448, 1742, 627, 163, 1141, -247, -355, 480, -888, -654, -287, -1320, -29, -815, -1027, 439, -347, -523, 832, -137, 608, 1115, 172, 1161, 1178, -244, 1003, 569, -607, 228, -806, -843, 102, -1286, -935, -249, -1448, -283, 66, -596, 654, 206, 89, 1361, 215, 365, 1256, 1, 674, 925, -534]
1779e34P97l89j080J414r93o49J485j175M61O59p59J124j8q34J650k37p15J164
1797A371p04n25Q19j246M86L49j665R40j76j146R35k14j40J138j095N51J325j259
1815b56O21Q03r52J162m50j121J277q00o32R09j110j01N21j278O57M21r49J350
1833G2o1p66J605n51JQ50r12O33L81j308O10J84j428R87q35l16R55j068k77J053
1853a91r41L81O44m89J074k14m24J550p13o56J480j012j66M48j025N23r0j402
1871a223R43k78q97J461r01k73J324q32N55J010j161P81M95r38Q22k06n16P33
1889H99r88o4O90j329K53O91j199N80k65m49J371m82o23J744o69J16N23q55R81
1908I25M1j475J499l05j203R77q05m54R98j141n0R25r57N04L57n90J115k24j69
$$ y = [-534, 263, -126, -1206, 208, -785, -1434, 51, -1124, -663, -4, -763, 361, 343, -491, 1159, 922, 207, 1371, 667, 142, 961, -285, 201, 550, -1115, -175, -351, -1497, -562, -776, -916, 222, -873, -322, 1003, -256, 365, 1168, 216, 1378, 928, -193, 1084, 284, -348, 561, -549, -650, -129, -1407, -750, -329, -1278, 72, 11, -755, 850, 299, 300, 1150, 238, 871, 1252, -56, 554, 738, -690, 297, -538, -854, 101, -967, -1244, -191, -1132, -751, -107, -596, 478, 264, -160, 1390, 677, 21, 1501, 489, 323, 771, -254, 269, 179, -1223, -280, -558, -1455, 6, -895, -1168, 156, -676, -121, 889, -272, 509, 1004, 66, 888, 682, 166, 899, -89, -153, 537, -792, -539, 152, -1047, -467, -732, -1181, 190, -292, -915, 829, 160, 276, 799, -56, 925, 966, -509, 990, 685, -518, 459, -346, -800, 198, -943, -993, -68, -1025, -521, -164, -754, 361, 137, -32]
1927c2J133m75j81P87r45K38L09j287N95j96q34P40k54p49J213r46l14J279n94
1946e13P40K9o53J334j48q48J230n83l97N60q52R7N13j247M17Q0o55N49m27J2
1966g62Q11m80m15J488n58L9O44o06R46m29q56Q85m03n76R92j369J82K82r69M49
1986g05M43p84P28M6j51J279r21k23J363o80JL30q42J048l07j063R05m07r65P78
2006a27n05j06P06j156Q18N71q68R20n8m49J202p22j0J045r35J58J84j074O37
2025B31J59j293P23l35n77Q58n40R8J062j151M15J019q00P81Oo05J208n34q87
2044a62J189p78n25N78q78L22N5j035Q72J49p85Q77k02K67P18o94P9J127r59J93
2064D08O41j199Q80j60j118J119r39p23J285r27j4R63j342P39L29p47J045n6l40
$$ y = [-32, 1101, 626, 445, 1232, 287, 525, 834, -453, 142, -54, -888, -148, -402, -1151, 62, -884, -1198, 81, -513, 227, 256, -397, 937, 789, -59, 1171, 588, 191, 751, -101, -4, 509, -738, -321, -241, -896, -347, -774, -762, 49, -431, -846, 642, 84, 123, 767, 161, 1107, 678, -178, 707, 304, -272, 720, -649, -467, -185, -1154, -705, -262, -1046, -318, -272, -423, 856, -65, -288, 1075, 395, 396, 726, -116, 932, 625, -438, 467, 60, -905, -127, -632, -738, -32, -1188, -370, 201, -667, 253, 195, -254, 948, 226, 216, 1261, 326, 484, 668, -406, 231, 390, -903, -180, -515, -1092, -234, -774, -676, 386, -765, -350, 669, -131, 650, 656, 51, 1259, 725, -162, 1027, 249, -276, 302, -576, -254, -199, -1234, -362, -213, -998, -121, -323, -56, 662, -32, 47, 1174, 215, 408, 1049, -150, 730, 570, -548, 571, -368, -1091, 194, -733, -747, 216, -1126, -387, -58, -805, 240, 184, -156]
2083a56J315p21l72Q88o91K27L83j560J132k06j301J226m67n03Q71q04J25Q22
2101B08q57L78R96p45M46K1k28R65o95k83P17o42n61O49j222O93j13p73Q31J8
2121a97q61J206m27m9P91n92M71N43j033R09L68j280O70P8j083Q66p54r6M46r52
2141i76K30O52p70O95J02l20O08p5n56J254o00j37Q32o93K22J45r99P55k14p30
2161e75P22m23p13O89m56M39L61l89L66O51q41O76K46l06L37j34n01M52q88J9
2181b68N98o96j6M12j024R56o03p4P07o92M64P31n58M59K44k58M22r9o58R62o87
2202C22m76P47q26l05P01q99N38q4q97J093K34p18P71j12N6N98m01j12P44q85
2222H9L58o5l22M77p59k53Q35r74k24O77n57N30qj47N90q6m42R26m28L6O73o79
$$ y = [-156, 1159, 438, 66, 954, 263, 490, 873, -687, 445, 239, -1062, 164, -303, -806, 65, -739, -614, 208, -649, -271, 725, -20, 426, 447, 219, 1184, 489, 206, 923, 281, -280, 369, -853, -160, -273, -1046, -215, -197, -1058, 148, -279, -328, 463, -129, 342, 885, -148, 761, 1129, -151, 519, 597, -486, 380, -374, -470, -24, -976, -746, -94, -864, -169, -67, -387, 221, 146, -410, 844, 244, 107, 939, 246, 468, 613, -386, 369, 155, -575, 147, -276, -989, -300, -756, -317, 44, -345, 21, 672, -169, 507, 753, 447, 784, 650, 149, 601, -287, -268, 330, -366, -382, 30, -994, -38, -641, -715, -8, -700, -236, 495, -63, 396, 640, 382, 804, 705, 47, 1009, 322, -154, 593, -233, -538, 163, -736, -198, -282, -1179, -86, 148, -570, 201, 89, 145, 743, 342, 230, 974, 89, 447, 382, 60, 537, -222, -475, 360, -614, -838, -161, -718, -188, -196, -343, 247, 161, -281, 645, 217, 253, 926, 247]
2244B47KK79q12N50J56j330Q29l32m94N85k22J82L19p72N53Q48r04P97J60o08
2264C3P32k35k38N16q28j74Q60j126J68j6l50P73m33n74R48k86m50J157m52J18
2284A43K70m92P78m1q70Q40M8j091Q95o08l04M65r11K41P08r08M24M68n03N48
2304A00k52k04J225o98j04Q44q38M29O8r01M29R4r46P83m77k37Q49r42L44N72
2324A38n27L32N46q80P08J33n29O08k33k99O02q67M68L33j210P51l8m97M25k24
2344b60o45J066k39j62N26n96L56M98k93L04J32o99O25P9q88O06p11j85N84o44
2364e46J62J83n50M77o8m31Q90K0n40Q77m56M68M79o36K42j57n80L79j17k96K54
2385E4n07k73Q89r48K21N27n19O03j10m32J047j65n03Q08k54l60P28j009L93K68
$$ y = [247, 249, 528, -284, 266, 422, -908, -79, -411, -905, -320, -542, -360, -41, -813, -260, 588, -316, 481, 641, 33, 765, 530, 292, 808, -20, -194, 666, -460, -292, -308, -658, 115, -318, -892, 56, -230, -680, 477, 25, 143, 413, -79, 699, 658, -212, 628, 676, -415, 480, -128, -432, 33, -878, -637, 71, -837, -413, 55, -448, 100, -152, -356, 869, 171, 67, 911, 73, 502, 570, -331, 98, 192, -754, 29, -448, -685, 164, -778, -434, 138, -389, -57, 489, -391, 317, 450, -79, 529, 296, -3, 599, -268, 200, 533, -677, 74, 36, -461, -36, -260, -905, 161, -78, -240, 286, -310, 46, 544, 251, 555, 687, -12, 613, 692, -196, 410, -301, -486, 98, -546, -384, -201, -751, -274, -342, -773, 117, 137, -403, 474, 18, 486, 965, 329, 571, 414, -166, 213, 96, -200, 54, -453, -726, 163, -785, -564, -37, -556, 47, -63, -495, 552, 387, -116, 692, 438, 78, 806, -203, 190, 458]
2405D58j157P91J3p75L51j01r5N19o62N20M56o21L96M36o53P96l87j0K03k35l72
2426a29K98k95jJ76p03M51j60j46N66l63k06P16k49k37Q42n87N24r5k53N25k26
2447D48j029J055m95j75O1n08K85L75p24K68N33p43Q72k10j71O49n08pQ93n32
2467C37J16J97o81J67K08p28M36m22k12P69r31L86J23k42K65M09l27M86o8l39
2487e1J122m86l31M58l94j11M6r59M43N02r88M08jj83N66n78K51N72m79K51N98
2508F56l98P4L05n78M18m9l26J60k80o0K69p51K38L76q84L59M00j92P17n02k89
2529c37R85p80L86M89n88K30j12k23K80k89n13L42j52j60N44p47R2N45l85L98
2549EJ82o41Q10j51m63R97m73o3N79r28M84j7p11J57L25r22N67o0j19Q83o95j19
$$ y = [458, -699, 92, 105, -670, -319, -420, -515, 4, -658, -138, 318, -303, 93, 529, -124, 672, 285, 275, 478, 243, -129, 169, -126, -127, 49, -654, -203, -363, -509, 57, -306, -512, 204, -45, -282, 560, -27, 497, 402, 149, 674, 448, -581, 474, -21, -196, -135, -643, -358, 17, -707, -439, 94, -649, 223, 13, -158, 491, -17, -24, 869, 337, 453, 650, -31, 136, 344, -384, 52, -370, -582, 187, -744, -358, -235, -477, -212, 197, -130, 356, 288, -51, 1071, 585, 254, 712, 318, 207, 253, -706, -263, 239, -749, -341, -342, -525, 41, -537, -286, 286, -193, 58, 656, 258, 332, 637, 59, 477, 428, 102, 262, -18, -78, 191, -560, -322, 54, -830, -471, -71, -263, 454, -48, -337, 648, -132, 254, 743, 155, 385, 273, 50, 330, 41, -472, -130, -282, -442, 102, -645, -553, -8, -393, 5, 187, -454, 356, 205, -258, 739, 266, 203, 782, -146, 338, 321, -390, -233, 92, -830, -263, -323, -442, 441, -254, -373]
2571c73P41m05J0N87l94M73m05j95L76l82k86O25m67p5J08m44P0J63m61N64j17
2592b87l14R60p10J66N81l41mN09n35L37K9k21K94m36n25P81n64k16L63m66J07
2613d92N07o00M73Q9j4O08l21k45P36q82M03L42n47K24j82o67M04k72o8N48o15
2634e71N6J55k36M39L33j47M5K18k94O74n04k29Q56n96k02M19m84LKl04M5K13
2656a09p27M61K36j15K52q8L4N37o86N19L94r09N51p4j80J62k17l17L45o87K78
2677c40N03m39L3J33m62N36j12k6N40l88J00N17l67Q5K34p66O27m16m45Q64n76
2698a65m60O83n36Q6K23m99M06L45k6J5J55j43M17k28q1M70p42L40M21q70J80
2719ir1l18N83o64P4N54l95N5M13p21N16P8l69P27j25l92Q51o47j23K31m70n8
$$ y = [-373, 368, -37, -27, 560, 166, 639, 234, 39, 415, 33, -253, 372, -95, -170, -62, -506, -436, -273, -734, -170, -287, -601, 359, -351, -185, 396, 55, 51, 560, 25, 362, 391, 170, 464, 28, -497, 284, -280, -496, -133, -599, -492, 15, -585, -112, -23, -37, 571, 250, 5, 741, -141, 262, 604, 57, 281, 99, -568, -164, -436, -504, 44, -571, -515, -360, -596, -157, 176, 29, 74, 292, -2, 672, 168, -61, 795, 199, -3, 416, -68, -65, -63, -367, -322, -109, -836, -375, -139, -254, -2, -90, -56, 481, -205, 314, 708, -201, 350, 276, 96, 258, 41, -276, 69, -618, -340, 163, -276, -243, -110, -572, -36, -148, -174, 366, -22, 78, 595, 228, 313, 547, -219, 408, -8, -453, 411, -165, -625, 58, -478, -392, -169, -668, -262, 83, 57, 72, 227, 84, 501, 273, 192, 662, -80, 260, 681, -189, -9, -100, -418, 165, -499, -425, 129, -266, -211, 202, -519, -3, 75, -294, 433, 308, -84, 767, 120, -3, 228, -242, -300]
2741c00L41l52K42o7o29M96M44o10M04k14k01Q69n21K28M99p49O44M2n85M14m61
2762f6l01O21o35k13R35o62J90K9l53M49Ql87N76l09j04L98K90q4R3n36K90K91
2784E20q78L61J19p71O11k10k23N24p75N92L45m26J54K12k56K92O4k14N80m35
2804A86l18Q44q87K72%o13N39j33m28N56m68J03O00n73P8P36n99L51N02p58K75
2825B65K97q84O72l92N0M4r33P54P0n75P9P41p20L31J31L6M97l99J3L35k11K2
2847B23K97m28O9R6n23L60J7k89j5l12K99O8l79K62M97n65L69K12n23O95j92j54
2869H4Q4j95m7N26n66K95J81j038O14k66p0P33q58Q8P84n87r7L93j29M44P0n76
2891a33P33j55p54R03m94j48K64l84L59l4p12L92j47m10R19k31l46O34n40K03
$$ y = [-300, 41, -311, -69, -136, -765, -269, 175, -435, -31, -245, -446, 423, -98, 130, 629, -120, 524, 566, -19, 395, -66, -367, 254, -381, -594, 341, -321, -131, -102, -455, -6, 2, -385, 191, -118, -222, 176, 466, 382, 475, -61, 229, 520, -358, 3, 122, -649, -38, -248, -471, 53, -722, -130, 215, -211, -57, 155, -101, 191, 255, 41, 621, 186, -132, 712, -175, 97, 97, -516, 23, -110, -538, 18, -450, -347, 253, -320, -242, 494, -105, 246, 748, -10, 265, 562, -322, 350, -42, 8, 52, -881, -127, -57, -632, -553, 188, -532, -201, -70, -34, 463, 64, 77, 412, 201, 223, 520, 92, 161, 257, -266, 94, 111, -178, -193, -505, -206, -138, -517, -255, 242, -323, 46, 258, -265, 430, 238, 84, 168, -27, -74, 452, -114, 181, 362, -676, -62, -328, -398, 335, -523, -435, 349, -238, -335, 58, -71, 373, 443, -133, 600, 445, -309, 594, 100, -48, 216, -168, 191, 157, -555, -163, -310, -720, 199, -32, -378, 256, -284, -81]
2911h1O41o54N90r4l26M88l59l89K77j22k58J37m34J41M08n60N49J09m24Q53l39
2932A53l00Q67n57k16K32j43M04l09oJ13l55k87J55j49q4L05J4K0K88l87J84J61
2954A03L7L57m85j12M89j75n1J99n21K82j88k51K60j11n32N17M6m57O14j45k12
2975c36O33k31k6K32l34L83J40n48K79Pj22M0k98m7Rk31j15N23l90M94k52l0M24
2998B04j71j84N85k60K91j0l19J51K59p59L55K4n78M37l61m1K59k78L9M29l50
3019b78L21K93l49J37J07j31M62k69k41L10m49K83j62o33K71K81m38N44j53l97
3039d91M34j14K20J98m10K01L59j47J33m6k53K43j95q3L21o94J63M73p69J49L15
3060Gm48L17J70k88N56k14j74N49k34k00M23n92L56o9n75N68k43j03J61m06j19
$$ y = [-81, 560, -94, 496, 402, 76, 564, 205, -184, 93, -29, -287, -150, -584, -443, -35, -595, -46, 63, -361, 492, 153, -147, 720, 163, -53, 179, 36, 440, 131, 125, 238, -117, -404, -249, -398, -482, -177, -163, -143, 145, -242, -58, 103, 140, 497, 12, -100, 389, 214, 163, 362, -159, 123, -65, -316, -56, -167, -699, -182, -136, -593, 21, -124, -336, 297, 66, 40, 272, -62, 321, 461, -87, 192, 199, 77, 117, -181, -228, -219, -450, -565, -42, -432, 62, -190, -220, 204, 33, -151, 434, 174, 465, 455, 136, 287, 546, -213, 142, 166, -412, 25, -336, -377, -118, -396, -357, 72, -278, 43, 336, -13, 124, 231, 100, 562, 293, 52, 362, -87, 196, 34, -599, -328, -47, -485, 59, -94, -491, -57, -171, 49, 247, -163, 38, 397, 250, 383, 337, 84, 327, 132, 49, 370, -324, -161, 312, -457, -308, 7, -441, -124, 46, -242, 314, 100, -74, 475, 241, 41, 464, -128, 228, 159, -416, 152, -91, -194, -33, -439, -558]
3081e58O81n89J02L84k27K03K13j85K98k04L5M01m13k10N31l38r5o9n01O25P8
3102A62o39M03j96k25O24k45q6K68k24J41M04k61M08m38R2M91o19k8P3k99J96
3123Bj87n58M08O0k46N49k37RO56m19j25M34k74m6L09k49K55O7l13J23m73K02
3145e3K41l56j10L75l44J13O9P8J90j14m66P71k01m7J60k04J48J0k90j42M25o41
3167c88M30m92MM34l34L03Q4m03L76K13k25R2J04j88L64k2k58J32j98j38J36j93
3189a67R6J82n85J77K22n5L80m89M09n5k29K12M13m99L85j65l84N99l77Qo7j49
3211a38N7K48l52r0J87l64L68n4k07L98k13J76L16j98m6j01J62K06k76l08M72
3232B43k11j43nk04j35P25o52o1M76k74K36M2m2M58n85L13L0k18K63J7l79J13
$$ y = [-558, 123, -466, -364, 20, -207, -4, 209, 24, 322, 118, 153, 554, 141, -69, 462, 124, 29, -40, -541, 84, 162, -477, -74, -270, -495, 129, -116, -202, 66, -158, -17, 387, 126, 534, 96, 188, 679, 60, 32, 105, -194, 2, -185, -743, -335, -275, -521, 28, -209, -200, 456, 37, -88, 346, 72, 26, 335, 86, 341, 408, 95, 218, -255, -53, 188, -168, -278, 97, -247, -134, -65, 13, 203, 89, -377, 394, 193, 146, 306, 102, 250, 260, -30, -172, 253, -388, 42, -450, -446, -12, -346, -43, 41, -362, 14, 227, 2, 94, 198, 10, 374, 352, 94, 226, 28, -110, 26, -167, -71, 111, -474, -297, -75, -130, 250, -239, 170, 115, -114, 98, 511, 12, 397, 232, -152, 447, 70, 78, 11, -138, -81, 167, -185, -275, -88, -452, -84, -138, -345, 53, -160, 16, 332, 134, 88, -13, 149, 355, 79, -229, 243, 32, -111, -116, -320, -455, 270, -382, -443, 33, -241, -5, 37, -5, 453, -132, 181, 211, -7, 256, 273, -106, 7]
3254Gj08j36K44k8l66M02l1m4J58k34J48L18l94K26k20J08L75j88m27K85q5l96
3276c86O98m98Q2K72n90M30J20m38L84m20J15M83n88K47L85j87r3K78k90J14o9
3297D9k59M48m06k04L23j78QK49m47J24K91RJ15m23K48N24n01r6M04k46O4K43
3319C39k10K57k56m31M34k75k84O78k61k70K06k48L03M9r4K08k7j15L76j42o4
3340A73L12o71j0M08l98q7M20m15K36pl37N00l30J6M18l50M07J19l12M09j64j36
3362B01Jm15lL55k10k16L09m47L38K20m30J04J50l43L54O3l9K17l50K71J43q1
3384A92m7jj77L12j68k91J81j6j99L48m55M8J02k73L65L45k64L14O6k78J65j33
3406A36r9l4L8k03K37m21K74Q7n38J28M70m09M59k18N7K58l42N5M93m09L12j10
$$ y = [7, -101, -237, 7, -21, -387, 15, -16, -60, 98, -136, 12, 330, -64, 162, -58, 50, 425, 237, -190, 95, 10, -386, 312, -186, -104, 168, -422, 8, 128, -310, 74, -346, -231, 252, -336, -89, 296, 109, 16, 294, 4, 118, 49, -210, 238, -168, -372, -49, -227, -219, 30, -417, -293, -2, 7, 122, -301, -53, 471, -30, -126, 278, 32, 96, 339, 129, 386, 130, -301, 133, -142, -426, 252, -9, -279, -73, -321, -18, 31, -63, 145, 118, 3, 379, 237, 173, 485, -186, -196, 212, -186, -273, 147, -268, -32, -39, -376, 124, -206, -190, 228, -122, 285, 404, 92, 501, 337, 201, 202, -213, -216, 139, -71, -287, 22, -425, -87, 133, -297, -193, -43, -386, -32, 31, -8, 209, -141, 130, 273, 192, 145, 144, -33, 279, 111, -180, 1, -15, -214, 134, -321, -273, -171, -444, -79, 266, 2, 316, 382, 104, 269, 136, 37, 3, 41, -162, 75, -346, -72, 15, -523, -395, 75, -334, 125, -93, -36, 222, -120, -65, 428, 19, 331, 221]
3428B21j80J49n5m9k44k14L02J62n21K26J30m09P05l26l05O59l63J81L00m00P
3449b4N17m13p0J07l71L73J23m15K09m29K32K47j33j78J38j98L65j06p5M06j15
3470A90k59K98j54k16M37l70p9J83l64K5Q8M1J49k13r4N33j15m00N34n73K50J51
3492D2k73N52j20k09L82l22k82N36n04J27P5l32L07j48j14K94j80j91N71j52j17
3513e8M56l54K33j94l64N34O9k12j05pj74L28n29M4L02j70L72k04k93M53J14l78
3535a37O20l45K7K15n18J44J04k68K25J79l80J91m82Q3L01j06L4J33m68L06K77
3556A35j19J17N4k25M10l10O4J37l92J57n6j49r1L14l32J23J56m28L54l06J57
3577b30L82m36J91J52k49L20j10pK80j54k16J37k54J68J37n10K89K38n37N02j57
$$ y = [221, 41, 190, 135, 86, -158, -372, -70, 92, -429, -203, -73, -482, 223, -103, -408, 251, -112, 69, 369, -31, -24, 493, 80, 10, 117, -254, 119, 242, -173, 36, -393, -161, 86, -47, -225, -87, -285, 80, -26, -101, 305, 190, -69, 229, 75, -141, 296, -74, -153, 30, -334, -309, -221, -180, -31, -244, -338, 195, 80, -320, 214, -359, -109, 42, -231, 321, 201, -8, 374, 52, -230, 306, -198, -71, 4, -328, -21, -169, -283, 11, -169, -360, 211, 59, -58, 398, 44, 277, 83, -281, 253, 322, 110, 5, -2, -176, 152, -377, -333, -31, -201, 171, -33, -326, 127, 241, -137, 483, 138, 165, 380, -138, 6, 110, -158, 67, 246, -134, 57, -425, -342, -41, -147, -113, 20, -448, -142, 135, 16, 133, 187, -38, 372, 62, 126, 263, -129, 28, -28, -177, -268, 46, -286, -163, -7, -435, -81, -387, -230, 152, -284, -93, 59, -190, 130, 20, 13, 293, 139, -77, 60, -194, -26, 111, -399, -110, 128, -409, 93, -64]
3598f4l13M66jJ82M8k20J85J53l63P6J3m15K81l13M0J77j65K11k7k41N0N61p20
3621c99N91r1l43M18j3J0L74m73j69K75n36K78J39j81K9j65j44K00M6J77j39r6
3643b12j16N17l04R9K63l84L46O0k93O3j14J31K44m26K5q8m2J8K23m8J5O5k06
3666a64J13Q5o2J31o0J7J12l5J6mm32K27O2l83N19n06L74K17m10j07M43m05K94
3689D2K57l05J79L5oj85K69l7j29k36L97k42r1j11J83k23L17l87L2L54k86j85
3711c58K11L24l8J60l21K06k38J0N1K7J71P7o49K79J02m95M98k13LK27O7k85K14
3734C0J11J92j33r7N6j04j00R2J11n30N83j67j64J64l11K06o2k05K35L90l02K3
3756A8R3k31K06K00j16Q7m36M26J22l02j59J32k43J57j08q1K89k23L3K2o8J2L22
$$ y = [-64, -377, 89, 88, 270, 318, 98, 283, 436, 73, 149, 162, -253, 28, -285, -245, -68, -233, -22, -49, -290, -240, 321, -399, 192, 101, -242, 176, 163, 173, 547, 74, -95, 180, -356, -78, 61, -120, -91, -256, -400, -200, -154, 23, -116, -212, -328, 189, -115, -16, 247, -137, 209, 269, -24, 39, -75, 56, 300, -126, -101, -189, -231, -213, 10, -38, -23, 42, -164, -51, 34, -28, 103, 43, 60, 172, 137, 153, 149, -283, -56, 6, -377, 142, -364, 10, 227, -183, -290, 153, -252, 42, 299, -6, 173, 208, 202, 17, 286, 249, 120, -116, 281, 39, -52, -163, 20, -203, 114, -273, -241, 113, -173, -358, -147, 177, 139, 299, -22, 184, -54, -44, 7, 34, 205, 282, -367, -88, 14, -481, 17, -196, -193, 34, 101, -184, 30, 141, 333, 200, 103, 159, 55, -45, 47, 158, -372, 211, 44, -120, 44, -267, -61, -123, -328, -93, 297, -5, 18, 111, -120, 86, 286, 170, 257, -179, 247, 369, 67, -92, 40, -203, -46, -154, -235, 54, -169, -136, -114, -182, -170, 152]
3779A52m93K96O9K1J39l71J36K78j17J51j91l27J13K48j89l4N9k65J03J24r8L95
3801A99l24K33J04m7j71J47k2j4J43k77J97k65J46J16m48J30K25m33J35K48j66
3822a44j6J22j09J36J26j4J97k52K4L1p2k23K77k33L59l79q5J62j21K60k22M7
3844a29J65P3l27L13j56K37P6l56N4L22m92L84n0j51J39r4l97K99k46K25j01K05
3866gk06L37l53L84j63K15J65j17m16L44p1j73K58l97K52n5k36J08Jj83M88j23
3888E2l8N3L19m56K96k04l4J45r4j09J93j90o9j0k13K08j09j7K48KL0Q5k65M93
3912C16l85n3N24l79n0M78l89p7M31m81O0K28n34K30K04j69k28J44j26M17j96
3933c5j62L78m99O22k12j85L71k50J34R2nk25J75k08j46j31M03q3J23m78J45K6
$$ y = [152, -341, -45, 24, 45, 184, -187, -51, 227, 110, 261, 70, -257, -144, 104, -85, -119, -60, -325, -222, -98, -196, 199, -125, 108, 212, 165, -6, 141, 119, 105, 248, -29, 168, -97, 49, 165, -283, -153, 72, -361, -226, 22, -144, -160, -38, -147, -11, 115, 101, 298, 46, 70, 101, 29, -194, 83, -150, 209, -170, -255, -93, -214, 46, -176, -129, 36, 109, -218, 95, -61, 176, 252, -104, -50, 272, -220, 164, 114, -37, 102, 8, -389, -90, -336, -111, -212, -7, -213, 124, -229, 155, -8, 207, 372, 255, -161, 183, 112, -61, 197, -200, 52, -3, -239, -131, -130, -313, 175, 52, 14, 67, 386, -70, 226, 22, -12, 133, 39, -70, 123, -67, -136, -146, -359, -151, -260, -277, -29, -27, 3, 88, -177, 316, -69, -122, 402, 23, -27, 451, 62, -15, 416, -65, -5, 223, -311, -81, 123, -46, -274, -130, -256, 161, -35, -197, 181, -318, 304, 92, -93, 278, 28, 162, 254, 249, 24, 199, -9, -155, -286, 117, 34, 157, -321, -176, -150]
3955a50L3K53k40J74j15o2K31J01q8J14k29rj39O8n0J44k30j1K18K1m5k22K9L23
3979A19n4o1J50jj79J07n7M8P3qj55R4O8m3j38q4K60l06N6J85j96j1J50k0J45
4004A42o2j3J00R5m12M91n67K32K49m97J01M4R4nr5j96M57p6j70K17k34k67O44
4027B72l47J10J29l10K19Nj72K08j59q4J26j22J05L39l88M5Jp4K29k2k39M47m44
4050a26PL42n13M96j76k40M00N0m06M06k88k35M7O6J27M4r7J42J91J4j71N4j33
4073AL65K5n50L70n19M27j47p4m3L0p1J56L9k02L43l4O2j79M2J20j03j85L62k02
4097C3M5P5m39L89N0r1P3k30q4p6rK10J58p8k64M33k21K2J28j54J24J64l19L34
4121B73Nj24N6m72J40J69l3Q8k01k73M63Nj80J14j15JJ90j55M0J13J70l88N12
$$ y = [-150, -117, 136, -104, 70, -45, -107, 124, 225, 137, 251, 22, 13, -126, -58, -108, 36, -194, -205, 13, 34, -11, -233, -204, 119, 65, 4, 154, 153, -26, 81, 24, 72, 145, 137, -18, 76, 144, 101, -37, -121, 139, -167, -111, 74, -122, -133, 17, -3, 142, 80, 67, 167, 262, -150, 341, -226, 6, 255, -242, -141, -97, -3, -8, -103, -299, 158, 82, -88, 129, -105, -372, 272, -75, 35, 164, -146, 73, 78, -94, 114, -45, -129, -3, -125, -20, 319, -69, -24, -23, -97, 132, 110, -129, 318, -126, -119, 223, -290, 206, 30, -210, 190, 240, -166, 240, -48, -283, -236, -170, -43, 1, -96, 46, 237, 251, 80, 134, 1, 366, 391, -159, 211, -308, 119, -28, -102, -145, -115, -186, -30, 9, -193, 150, 116, 178, -1, 41, 161, 58, -127, 235, 33, 78, 153, -286, 103, 153, 62, 135, -95, -179, -255, -264, -54, 104, 26, -238, 195, -26, -4, 124, -30, 94, 258, -61, 273, 278, 154, 210, -262, -122, 47, 14, 102, -99, -372, 91, 96, -84, 30, -85, -84, 106, -49, -9, 104, 274, -114, 398]
4144C98n32o5K92n7p0p8l5j11J69o0K58m93K85K30J98l48J03J01O4p4l2o2j46
4167f5j22M9Q1l16L80j68J38jl26K50J46l76N48l39k1M65m30j75O52l71O2o0p9
4190g8J19k77J72o7K43n27L32j93K29J15j93l08K81J87m9J41q8j9j82J19J91m64
4212c16L48Kk12J50J10m05L52j97J33M7l15K33r6p6M09o8L7rn6l2J13j21l40N34
4236B25j62j32Q9m49M08Oj94K73j11q8J98j5l43M49M0k91L00m75J80K81j35j68
4258a14J7J64r0m29L28J63j41M4J76j71K58k43OJ25k32J11K78j9m97O27m91L17
4280A87j24k07J09k24N8M42m20l1J12J31K0j82J41k2J40l49K1J91K35N9n00oK43
4303B4l28N30k49o6J93j55j23L16l17J49P3K0j06j04L43j28J37l35P1L4j22N64
$$ y = [398, -134, -199, 93, 36, -34, -112, -147, -258, -89, -149, 109, -384, -99, 131, 329, -19, 84, 185, 249, 175, 143, 81, -65, -187, -138, -57, -373, 7, -161, -23, -24, -350, -100, 46, -330, 218, -121, -142, 323, -107, -282, 370, -1, 61, 1, -78, 41, -236, -64, -131, 112, -415, -83, -276, -47, 68, -125, -433, -152, 35, -14, 127, 39, 20, -162, -43, 148, -316, 32, 34, -178, -28, 82, -323, 29, -168, -35, 12, -303, -70, -166, -242, 167, 99, 136, 127, 71, 39, 152, 31, -309, 225, 63, -69, 20, -429, -21, -15, -209, 64, -47, -135, 63, 48, -295, 154, 194, -97, 203, -272, -92, 189, 54, -114, -97, 67, -23, -452, -124, 39, -102, -58, 118, -53, 205, -38, -32, 93, -139, -28, 250, 231, -266, 361, -130, 187, 63, -144, -35, -259, -201, 241, -179, -210, -98, 33, 53, -129, 12, -10, 130, -219, -198, -7, 228, 287, -213, -219, 24, -304, 226, -23, -89, 104, -51, -174, 142, -175, -26, 47, 67, -39, -143, 200, 72, 209, -126, -55, -21, -143, 421]
4325D21n53K19J81l65L67l68p9K51j84q0J0J08K8K22L9r1P3n0l53M58n29K33K1
4348b1j75M21m15M34m30J18J84l54K21L86l61k17M98k23j88J03Q3K7k76M3J78
4369C6J81l68K78m5l27J01J0Q6J06o9l6K18l9J18l17j4J28J19j26R4l92K54J72
4392A68j53j66K17l75O7M24l26K14k38K45j76L6J16k44L01J06m15M2K76K80l58
4413D1j41k37L58L0j52N8m3R7j00k0J26kk1m2J31q5R8K21j02k09J5j04Q6n1j25
4438a73L05l02P5J85k36%J2K86j33J57n1L10j32k61m2L03j68q9m1l34J92M42o02
4461b97N42l76K37Kk64J31o8J3P0P8r8J69k06j92K44p6N7K94j92J95j46m7O5l34
4485a99R9L02m47K29J27r2k77L88l68M62o5j72N6k7N0j85l6M01k62P7j42k5L56
$$ y = [421, -132, 87, 268, -97, 270, -98, -177, 74, -110, -190, -180, -72, -44, 178, 217, 126, 199, 149, -204, 254, -275, -42, -21, -196, 225, -190, 244, -186, -68, 116, -238, -17, 369, 8, -209, 289, 66, -122, -19, 64, 91, -185, -142, 36, 217, -151, 127, 82, -245, -144, -134, -48, 58, -11, -47, 171, 132, 250, -67, -81, 47, 166, 40, 134, -258, -4, 168, 15, -151, 66, -309, -242, 182, -144, 70, -168, 77, -99, -63, 53, -191, 110, 216, -199, -157, 119, 399, 41, -100, -337, 21, 51, -101, -43, -86, 11, -89, -109, 17, 15, -6, -48, 83, -2, 96, 317, 215, 6, 21, -83, 3, -48, -173, 132, -170, -95, 90, -146, -146, -134, 152, 19, 176, 125, 435, 303, 42, 0, 303, 135, 46, 5, -329, -137, 305, -297, 245, -131, 106, 108, -156, -25, -93, -80, -10, 68, -30, 139, -67, -259, -15, -91, -34, 260, 68, 263, 117, 70, 135, -199, -100, 202, -245, -16, 111, 19, -258, 130, -238, 224, 159, -13, 43, 16, 66, -119, -155, 246, -16, 61, -81, -106, 250]
4508B50l04J00l22L77k58J46J63k28K74k34j11L2L57n34K86J5N5l9L95o51K79
4529D8j44J80l10K11l40O25k64k2J32j74J26j00J75p2K9J10l02N9M2k79Q7R5J59
4552G1j96K4Rj11J61oL27l07k2J02p4L9k89J49J27J59k10L43m59K25L6j67L2J85
4576A48j81n1O7J14P2j54k4K11j19k04K39j47j25J43L5l22K67M15o03q3J51J48
4598cj16K06%k99J64P6l00M33k38J50n5j06M06n2j43j76l41M62j28J11l42M71
4620A80j92o4q5qJ47l1k4k9N13m17L03l6m41m4K62P0K3j61m4K16l66J51K99m11
4644a89J26J67p8k46L38r9j19J11J2J85l34J67M8j11j47J80j30K90m45P9R1m6
4666a50J82o3j5k32L40mr6J35j79M2J33k34L27k60n9p9L63lk12P1K03j30k94L21
$$ y = [250, -54, 46, -276, 101, -157, -11, 152, -76, 198, -36, -147, -115, 242, -292, -6, 9, 64, 25, 420, -231, 48, -96, 84, -226, -15, -355, 270, 6, -16, 116, -58, 68, -32, 143, 71, 100, 210, -92, -33, 9, -270, -183, -88, 71, -125, -101, -92, -203, -42, -48, 279, -28, -50, 52, -22, 17, -272, -123, 4, 163, -47, 296, -163, 62, 98, -69, -37, 148, -33, -84, -17, 97, 169, 15, -9, 202, 83, -121, 118, -29, -154, -11, 24, -298, -31, 384, -219, -302, -151, -3, -119, 87, 87, -212, -48, 28, -272, 161, -77, 73, 18, -88, 318, 266, 123, -53, -394, 68, -60, 51, -291, 180, -12, -76, -161, -169, -22, -53, -77, -106, 407, -10, 293, 257, -184, -228, 34, 104, 127, -34, -78, 138, -228, -77, 222, -189, -63, 104, 26, -220, 118, 19, -100, 11, 23, 208, -126, 41, 89, -22, -169, 11, -119, 171, -274, -195, -104, -150, 32, -31, -46, -278, 62, 58, -38, 97, -82, -40, 93, -141, 186, -74, -133, -212, 151, 148, -64, 7, 210, 80, -214, 107]
4690A07J9l71J77K43O3k79K06l21J77r2K12m31K9M00l2p0j53j02M9J6R8J10j92
4713a37J91j41OK75l39K13J37j92k3l1K47l55J56NJ0k6k91L93j56j65P2K55l24
4736b20L75j48j14J11%K88k60J00o0J4M1j73L15l20o8j16K60J19k8k3K10k38k70
4759b05L95Kj47j66J47l06M01n7N9j70N9j4L0j77lj12J38P2J35n8j01R6K48l23
4783e7M36m22LJ00k3o3K12j5j34J31k29J38J7k59l0R4j0M66l09j23j87K64k1k48
4807b69j0L33J8l48L49m3n8K14m6j85L16j72o3o6J66n6r0K55l34J58lN4K8j97
4831d9J71k46L32m8j60R3k21K43k09K98k05L8R9q3j88K99k48R4mn5P3R2o8k93
4855b45K4L63p8j56L8N5K8K14l49K24l41K15K11l05qJ57O8j68j97J26L07m10M67
$$ y = [107, 126, -245, -68, 175, 238, -41, 165, -156, 21, -71, 141, -290, -261, 139, 107, 37, -116, -218, -169, -153, -55, 55, -137, 54, -87, -81, 194, -145, 68, 205, 13, -10, -41, 206, -149, 7, 12, 22, -4, -295, 98, -58, -223, -151, 104, -220, 155, 7, -107, 4, 4, 292, 32, 132, 72, 86, 127, -46, 269, -51, -119, -235, 25, 144, 116, 93, 303, 65, -205, 190, 192, 45, -121, 26, -280, 121, 64, 123, -47, 12, -2, 28, -149, -152, -264, -126, -54, 81, 23, -78, 18, 266, -57, 379, -43, -40, 60, 37, -26, 186, 171, 37, 168, -61, 77, 94, -165, -195, -101, -111, 355, 46, -77, -264, 0, -21, -269, -279, 54, 72, -276, 73, 30, -28, 186, 140, -45, 271, 99, 36, -30, 136, 80, -10, 245, -89, 69, 66, 120, 148, -49, 122, -124, 208, 160, 0, 93, -128, 115, -94, 204, -1, 37, 136, 53, -135, 164, -84, 10, 6, -49, 24, 116, 48, -245, -221, 142, 64, -92, -54, 1, 29, 243, -106, 118, -223, -8, 203, -102, -110, 47, 115, -53, -250, -124, 183, -227, 240]
4878B40n11K04K60k95L16J43k77j47n4K27k38J80j79K48j57J53j77M4J63j48J03
4899I8J07l13K21Kr0J16k22l0K7M3k5M9J65j44nJ24j60K30k50L02k72L70l09k5
4923IJ98n02J88r9J88J1j40l9J05P4k9Q7j81J08L41j29m0k96L1J58J89l8k12j34
4947a52J54j9J41O0R9m35j21K44j08R0K41j38o2M3K9j58O6K35J09k39j45k7Q3
4970a0M3qj34N9m9k04J23j05L00K2M0Nj87r1K41J7J20j55J63j16k22K3Q6q5J19
4995er4m5J49Q1l91j02O58p7k70J19R8l38M43k86R5L1k41K64j26j0P5k86M96j71
5019F7J4l06N92p5l78q0j9J47K38l90M18j17k60K43j3J42j06p4q9J65l31J49J35
5042G2j03j01N9J60k60J78J84k00J87j60J23k75K18j03l4L7J92l03O9kK19m0l00
$$ y = [240, -271, -67, 193, -102, 214, 357, 80, -67, -121, 106, -132, 48, -131, 117, -40, 113, -64, -20, 143, -5, 98, 205, -108, 113, 115, 25, 141, -81, -111, -84, -41, -66, -17, 148, 4, -1, 123, -37, 193, -57, 245, -27, 343, 34, 9, 207, -295, -107, -206, -18, -7, -147, -186, -81, -7, -36, 51, -130, -22, 319, 190, 150, -146, -115, 43, 232, 194, -18, -152, 2, -17, 124, 184, 283, -152, -273, -29, -137, -47, 194, 56, -6, 37, 66, -92, -26, 209, 318, 79, -66, -93, -10, 33, 25, -109, -50, -99, -303, -180, -285, 15, 37, 77, 82, -105, -196, 45, 62, 182, 27, 190, 74, -148, -125, -39, -124, -5, -99, -144, 5, 86, -305, -407, 251, 174, -96, 23, 121, -217, 226, -60, 35, 66, -175, 89, -37, -47, 28, -258, 238, 67, 81, -225, 367, 292, -86, -166, -185, -38, 200, -190, 228, 111, -149, 94, 81, 223, 117, 43, -46, 119, -212, -63, 72, -31, -132, -73, 87, -173, 5, 189, -11, 176, 16, 139, -136, 82, -21, -55, -18, 174, -129, -60, -62, 157, 117, -183]
5065a83J15L08k17r0O9j55J38K3R1j27j63K16l11l3L33k59J60k8J85l88L81l19
5087b54L47j31j57M67l18K4k11L31k2k17K08o4J54j51J46k7k2j73l0k05L26q4
5109f3o3L88o7l68k1J35K23j48J01j20on7P7K1k3k63J26J05Kk2r5j20K15q5O8
5134f0j34p3N33j13k41j09J01J45M0k15k9J16n3%Q2J98k29K47l49K33l4p0K41
5157B27k11j19OK06k37L7J78P4l53J85k6j1mm3j35M16l09P5r7J5L7k1K13m3k07
5182a47M12l75J79j49j35L75k17J87l01K03OQ9M7k84J25L4K5j22L11m28L28k58
5204i5K0k2J56n9J35j18k1J00j45J69k63rJ51P8j01o6j56K41L7j30L3J32k49J63
5228a9m9l7j62L08k46L54Kk66K9QK49j33m7j23K44k57M65m99L55l64p9M46m2j97
$$ y = [-183, -68, 240, 23, -67, 2, -153, -15, 8, 99, -28, -191, 25, -286, -319, 14, -245, -85, -113, 72, -316, 65, -254, 93, -38, -195, 272, -46, -22, -233, 98, 76, -141, 67, 3, 157, 6, 152, 125, 103, -70, -100, -305, 21, -63, -126, 262, 195, -173, -194, -59, 164, 16, 117, -3, -9, -66, 11, 32, 9, -254, -128, -23, -21, -43, -138, -258, -43, -128, -60, -194, -267, 266, 153, -88, -197, -96, 49, 89, -126, -155, -39, -92, -92, -10, 188, -41, 206, -143, 90, 56, -14, 227, 16, -103, -97, 109, -128, -91, 87, 161, -192, -7, -33, -44, -48, -91, -226, 190, -119, -44, -141, -126, -89, -110, 103, 60, -147, 265, -110, 69, -80, -215, 160, -57, 130, -171, 32, 38, 127, 174, -110, 15, 49, 74, -48, 263, -165, 163, -95, -75, -97, 59, 0, 135, 17, -4, 96, -49, 120, -143, -152, -1, 77, -24, -90, -246, -5, 32, -98, -65, 67, -182, -19, -68, -105, -267, 41, -205, 149, 151, -115, -86, -78, 171, 38, -9, -132, 112, -145, 320, -179, 176, -188, -267, 179, 137, -60]
5252f0p2K92m9j41J9J4m4J30p7n9M0M1o1J6j41PM8J16l5J82J56p9j18k83O6L75
5278B83l15J20k93L07q1L3p7j0L09n28P9P7Q2J25j12r7J06J94l43J95P4k16K27
5301A39Q3l54rJ13J01j29j59mL54r9L6j20p0j64K57L54m62L11j10j4j66J68po
5325D3K7k09J15K9l35K88J55j33K5L33k38O7j95r4J60j57L7q7K17j02L33l42K54
5348A91j76L7q8r6Q8J90l70L6L70k68J03L04n34K52R3q8k29M6M0j3J35j44O1Q4
5372B4J49j71J28J39j45m19N07j81J78q2j76M9P8J33j72j91N9P5p4L48m50L44
5394A50j80K64l90J64J80j86j50K79m64K44J5Oj9J9K35k08j24L22j64J63n2l66
5416b62K28N2j62J71j66N8K49l35J33P1j15J94j09n8J3J1J93j38k4k09J80K55
$$ y = [-60, -132, 160, 111, -30, -11, 3, -41, 89, 12, -47, -7, 34, -27, -11, -152, -145, -97, 19, -16, 166, 322, 243, 125, -158, -92, 283, -32, 88, -205, 102, 21, 54, -23, -33, 276, -252, -173, -96, -14, 111, -1, -98, 8, 202, -141, 54, 128, -88, 139, 222, -132, -141, -28, 73, -56, -215, -219, 135, 36, 72, -48, -118, -282, -25, 329, -133, 178, 68, 54, -112, 56, 49, 43, 70, -139, -24, 5, -330, -42, 113, -20, 5, 338, 100, 167, -28, -122, 38, -119, -82, -169, 48, -54, 279, -63, 191, 15, 52, -36, -132, -44, 146, -224, -188, 182, -86, 17, 321, -213, 39, 132, 44, -185, -139, -99, -112, 23, -121, -60, 24, 173, 2, 130, 269, 124, -295, 212, 31, 209, 127, -49, 0, 78, 211, 39, -152, -93, -18, -92, 256, -194, 150, -30, 234, -156, 8, 188, 2, -148, 131, -333, -89, -74, -68, -87, -68, 167, -41, -165, 157, -7, 156, 104, -262, -34, 18, -144, 27, -139, -81, 168, -167, -34, 37, -78, 116, 7, -51, -38, -27, 166, 28, 4, -205, -25, 230]
5438B30n88K3L02L5N4o9k80L57k16K01r1qj00K19Q9N8j22k77P4J6J34j03J09j39
5462i2L1MJ38l3J52r2k31q0K66J79k20J25j82L88m41oL25Q0j39j48k30K73j27
5485f0L21m27M35ql20rpk47K20K11LP7k3j69o2K08OO0k18M1j39MK8n5J0J8n0L63
5513B11k81J71k27J5K54r7J13k06J56j54q5K04k02q6L48k80J98P3k9j21P2j44
5535i7L07K9k33K20k32r6J78J53k48K12k55J13j3o6q0jRP0K67j45K8m00K81m84
5559d83J73L94P2j29R6o7O2j66%J2M5N6K6l99K65J6j92j18K5L37l5K06n93M14
5583A7j55K63K2o2j82K24j26J34k41J5L6J37j66r2K30r8j14J08N7mQ3j25K67K8
5607B56j03k50K85j34k21rn7M16k33K58k69J77L2j07j83J77j06k23L52k61J68
$$ y = [230, -358, -335, -33, 2, 56, -13, -293, 64, -152, 49, -42, -50, -150, 69, 158, 216, 94, -183, -109, -93, 41, -62, 47, -92, -61, -57, 81, 48, 200, 108, -123, -203, 63, 242, 22, 147, -35, 353, -88, -94, 231, 311, 172, 24, -206, 67, -60, 261, -166, 269, 261, -59, -68, -75, -322, -102, 109, 112, 189, 166, -3, -65, 143, 149, 209, -9, 32, -107, -103, -75, -130, -120, -102, -152, 211, -70, 101, -126, -111, 143, 46, 159, -47, 109, -45, -130, 74, -128, -214, 134, -146, 52, 125, 96, -25, 47, -97, 210, 239, 6, 226, -6, -102, 76, 229, -19, 193, -62, 51, 38, -28, -108, -109, -100, -30, 237, 92, 120, -280, 1, -483, -310, 84, 156, 27, 123, 56, 118, -48, -48, -36, 9, 65, 91, -308, -43, -27, -219, -337, -312, 25, -10, 196, -397, 17, -138, 125, 147, 85, -97, 127, 1, 135, -106, -91, -55, 82, -84, -176, 54, -44, -158, -50, 7, 3, 86, -39, 228, 256, 153, -97, 188, 54, -167, -176, -233, 183, -50, 208, -61, 116, 148, 41, -142, 35, -71, -294, 58, -203, -35]
5628c5K33p2l08K23m6m64L65O2Q5oK54l50j74K61J95k33K6N5n9J91k45K56k86
5651g2k17L85J85l34J46J12J05k98k77M72n90M09o1j10J38nl32N09l38J51j58
5672a80K86r5j35J31k24K94J1j38J50k00m0J42l09K17J56j31K9n8L18k40K46l37
5694a07J70k05J93m05M28k95K03J31n8k33J83j0k89K45r2K15j29J74p1J91l0k2
5716A87j90J80m49M27l3k10K11j92k09J98j27R8J06rK66j74k51k6J69q8K12r7
5738aM7k0J5r7J67j76K55j07n2k0Nk2KK06l00q8J43j78K71j10K2M24k65j46Q3
5763E8o0J24l46J92N4j64K74K50m79J75l0L8j52J21q8n1n2O9n8L05Nj73j08J13
5787A7j02N9J33J00Q9k27m8J01l7r7j82K35J01l06L15j51k75K25J81j67J01j07
$$ y = [-35, 198, 126, -182, 41, -5, -469, -104, -42, 43, 37, 291, -59, -233, 28, 223, -10, 16, 71, 12, 203, -42, 214, -72, -289, 96, 281, -53, 93, 205, 310, 12, -265, 207, -383, 26, -35, -145, -7, -12, -344, 165, -173, -22, -180, 106, 11, -124, 7, -217, 77, 88, -50, 100, -100, -140, 2, -307, -90, 66, -65, -36, -94, 224, -16, 230, -107, 63, -142, 51, -354, 74, -221, -18, 113, 55, -178, 5, -5, -294, -49, -141, 74, -55, 119, 48, 239, 209, 187, -3, 177, -272, 155, 122, -88, 123, -69, -278, -80, -207, -109, -3, -12, 254, 80, -171, -197, -28, -116, 96, -1, 46, 26, 41, -56, 111, -65, 190, 83, 31, 11, 16, -6, -4, 202, -98, -186, -43, -221, 50, -60, -38, 386, 121, -25, 58, -2, 122, -224, -32, 22, -142, 132, 382, -97, 78, 48, 86, -66, 55, -33, -84, -136, -67, -125, 180, 185, 12, -96, 17, -85, -26, 107, 207, 296, 69, 21, 122, 85, -12, -194, 41, 142, -164, 151, 0, -275, -50, 131, -36, 65, -42]
5809d2L16j84k3JQ9J60l02P3k52L62j30j62q8K42j16R0p3M2J6L00k94K06m41J06
5833a04K4j55P2K19l01K06j05o3M2K84L1J6k34r5K57k17K58j07J38l45J1L07k21
5856h2J20Kr9J12pn0Q3k4j16pK9J32p4k76K48L93l74K13k99K99l51M8n8L65j07
5881A20nj82K26m7q6q5K45k42R1r9QJ75K19o00K34PJ03P4j99pO9N7j99J18P8P5
5907A48k02K37k09k9r1J1J91K44m41L24j18M7l61M55l09K62M2l62M50o09L69K58
5929C07l40M2J42l45K51j01j1Ml6j09j8L54l80L13k59J28N9J10k43J09O8P9O3
5952A87k32l4J38j07K90j92j27J84j4m1j03K60j26k60L51j19j64P4O8o4m5j04
5974a80M0K06K25o01M23po1m8Kq0k3K36p0qj09K14k21K55n16j10M18J84k31J13
$$ y = [-42, 274, 90, 67, 68, 157, 317, 15, 88, -164, 198, 68, -94, -182, 60, -56, 34, -39, 3, 19, 319, 25, 231, -210, -104, -80, -235, -163, 56, -245, -39, -144, -207, -165, 119, 150, 166, -68, -163, 94, -123, 135, 28, 166, -179, -168, 139, -82, 38, 40, -59, 53, 46, -4, 79, 55, -61, -68, -39, 93, 19, -257, -9, 384, 10, 223, -76, 223, -128, -80, -138, 227, 120, 115, -67, 159, 112, 26, -59, 186, -56, 35, -64, -56, 119, 338, -262, -28, -21, 82, 156, -43, -50, 19, 76, -123, -5, 73, 148, -54, 183, -26, -55, -146, -135, 56, 300, -141, 183, 65, 112, -249, 206, -103, 159, 201, -161, 289, -320, 49, 307, -33, 9, 151, -194, 57, -44, -55, -51, -87, -196, -214, 140, -240, 73, -186, -58, 1, 111, -132, -23, 45, 124, 187, -45, -79, 59, -48, 242, 50, -77, 107, 93, 52, -51, 209, 83, -177, 174, 55, -109, -35, 33, -31, -76, -180, -140, 66, 291, -310, 113, 106, 45, -3, -1, -81, -104, 132, 62, 54, -55, 159, -62, 193, -323, -433, -15, 169, -62, 51]
5998E1J78o54L34J69j33N6j62J08r4L37j32j27r2J98M3R4k57jK42k57k71O95n78
6021b53O38m27J46k06J3K61r6L0j90J23n4k05K62P2j62K23j20n9J23k42K36k67
6043a54M3J00o6j6J26qK33l18m4J8K71k45r5L54k96j15L44n7P8K36n18K33k63
6066a59L9O2j08j98J01K01K08r9n4L28k25Pr3k2MO5jj0J56r6j12j60o6J70L09
6091B47l75J70J02l04L19j57r6K8O9L6l4L0k42J74l01M12N0l90M70l01K77K0k01
6114CM0l0pJ14l8j16L4j24K10p0L4j15J24N1K5k74J61L0R8j66J19r5M1L75l49
6139G5p9K03j9k62o7m2L56j32P4p4k08L24Nk33m7K00K4j7j04O6k00j02L70j65
6163e4m5K13j76j07K27m2J64nl97J23L2L19l98K90k03O8Q1q2k57R8J22N1j7K09
$$ y = [51, 229, -425, -91, 78, -55, 1, -161, -53, -147, 190, 58, -69, -161, 37, 80, 174, -83, -84, 158, -99, -370, 325, -253, 385, -42, 104, -102, -89, 172, 76, 106, -84, 39, -15, -220, 42, 114, -48, 175, 55, -4, 119, -123, 113, -154, -111, -11, -77, -93, 33, 25, 258, -60, -104, -86, 185, -60, -155, 199, -97, -212, 132, 75, 153, 389, -129, 104, -159, -120, -58, -166, -364, -263, -62, 146, 47, -7, 321, 96, 103, 10, -12, -8, 57, 56, 46, 202, 106, -6, -166, -232, -62, 247, -128, 42, 144, -160, 159, 2, -94, -66, 3, 39, 5, 35, -207, -33, -334, 78, 128, -262, 208, -93, 184, 204, 3, 43, 13, 6, 120, 82, -34, 0, -124, 86, 16, 50, -65, 59, 110, 135, -139, 22, 52, 150, -16, 103, 8, 49, 424, 75, -4, 199, 180, -82, -149, -191, 165, 33, 107, 33, -175, 149, 154, -79, -126, 74, 98, 81, -23, 43, -157, -259, 111, -54, -99, 114, -62, -169, 58, 16, 180, 175, -222, -99, -67, 252, -146, 144, -59, 9, 90, 8, -249, -151, -29, 22, 5, 214]
6187B14k8k81j18K2l0K38p6Q3KK8k18k0R2J95j20K13l36M07k24j05p4P2l05K77
6211i2j16J41J79l5q8P7j57K08n7l19L59m88N67q6o3r4l2J27j0q8J13N7j99Q5
6235a1Pk44J30K82q6l1j41j34J13q2K06J2k37J13Q2J58j3l71J42L20m94MK90j05
6259i0J53p6P8l73K27n1O5K05q9l20L22r7n9L00m23J58j9J89k38m9K11Q6j85M33
6283C58n38K74j52o0J17j37K24j80K48q8l17K43M8q6R3L0K86m43j51J8K75M5J75
6306B82l12n7mJ65K2nr1o8Q7J77j23j09o6q8R9J15j19R9j13k06K87q5J80l73L62
6331E6q9j64K48q4J24l52J3J98L8K73j87r8j63L67j20q0p1L8l80M40J38O1k91
6354h5K36l75R5M54l69J44n7J50k66RJ18k6k08K05J70k71K06r8n3P0K8rRk94K5
$$ y = [214, 186, -95, -213, -191, -221, 17, -59, 24, 26, 54, -164, -184, -92, 103, -17, 196, -140, 267, 43, -62, -136, -64, -369, -92, -208, -67, 112, 77, -11, 66, -91, 117, 60, -259, 100, -388, 179, 93, 30, -64, -96, 31, 21, -67, 46, 103, -96, -11, -4, -248, -118, 164, 78, 47, -94, -228, -115, -197, 9, 21, -216, -103, -21, 137, 124, -247, -105, 215, -279, -275, 15, -90, 63, -13, 65, -308, -81, -132, -67, 138, 49, -271, 51, -46, -105, 195, -228, -70, -89, 100, -138, -187, 24, 110, -75, 358, -180, 94, -58, -118, -1, -138, 86, -94, 154, 66, -251, -8, 40, -46, 47, 77, 363, -80, -231, -213, 62, 107, 282, -30, -87, -91, 74, 96, 91, 0, -68, 19, 196, 73, -36, -102, -190, -91, 24, -95, 4, -109, -315, -28, -113, 67, -306, 56, -33, -197, 51, -33, 91, -261, -248, -50, -12, 261, 74, -24, -187, 180, 60, -20, -91, -53, -433, 7, 145, 206, -85, 151, -224, -129, 325, -44, 100, 43, 193, -73, -64, 54, 28, -180, 25, 195, -76, 130, 32, -21, 49, 77, 68, 77, -217, -192]
6379a92L04J59k21m3N5m0M8l87K64J74k26J06p9r1K25O5k05j51L25j28J99k54
6401i3K99k0k07n9J68K4l01M65j98k4j30l13L79k06J04L32m34K52K24l69q9K13
6423A7k48K95q9J48k37K25j04K61k15J19o30N56J13j63l0j81K62k23K56J9j94
6444d3rK11k71K80l00J84r0J07Rl26K10L5k0K52k50j05K96j29k76M09N1k45j14
6467a34K17k88K04J91j8p7k23J25j87K82K7m94L57LJ04J39O1k14j11QL7j96K17
6490C0k6K07k38J88l27J05J18q1j1K54r8l84M72k28j43oJ78K29j56j9r7J08Q0
6513A55k73O0J41j4K34n36L92j17J07O8m48R9o9m1K07j0J12Jm5J47j16k90J75
6536f1K51qM7j10l21K05o7j67N64l81m2J54j85Q2J69q6j2o6k29K99K4j0k14L8
$$ y = [-192, 112, 271, 50, 7, 62, 22, 70, -317, -53, 121, -105, 1, -78, -169, 56, 121, -84, -235, 90, -38, 161, -93, 206, 186, -21, -80, 88, 112, -189, 276, 78, 54, -76, -389, -10, -216, -112, 220, -214, 38, 262, -107, -196, 17, -231, 64, -25, 123, -114, 111, 7, 268, 53, 172, -458, 98, 211, 48, 18, -163, 99, -124, 132, 151, -43, -52, 159, -112, 168, -132, 52, -38, 69, 78, -248, -38, -3, -23, 229, -21, -126, 170, 41, -235, 174, 225, -20, -134, 83, -205, -1, 190, 172, 95, -128, -3, -190, 92, 119, -375, -18, -15, 89, 228, 289, 75, -36, -28, 9, -187, 30, 4, 211, -27, 161, -166, -61, 57, -24, -35, 219, 121, -263, 209, -19, -162, -168, 10, 239, 83, 64, -33, 75, 155, -118, -58, 83, 69, 303, -233, 159, 42, 149, 217, -231, -132, -201, -242, -35, -45, 67, 68, 23, 170, 54, -236, -61, 190, 182, 229, 119, -202, 3, -64, -231, 333, -48, -90, 64, -121, -39, 130, 44, 32, -34, -263, 36, 60, 50, -164, -126]
6560a26K8L54l07j5J36k93Q6j95L74RN8k18J02M3l9K8o2r6Q1J82j45N6j80K97
6584A58J81j00j59J90k72J63j74K98l97j04P3K70j11j08j08K71k59M37j95Q6j12
6605B8oJ09o3mk05K34k85J47j57L04p4Q1k36k6J99K11j02m6l83L04k92J81M1J87
6629A47k22j39K84j84K67l88L49k60q7J05J21j51J38R6J09k31P2j03J40k15r1
6650b43N10l64J36j78L77m01Q8M6j11K88r2k23J06l23K87K40j35j03J14l6K52
6671B35l13J62n9m49N92k18L6J30R1k95N6k6K67k04j90M93l68J57p7k20L17k18
6693a01O8K24l7j66J70Kl32L02l42M46l81K55j15J34j52K00k33J70j0k05M38k98
6715C7J42qk51n4J51l2jo3j18L7J22N1j54J56l01L12J29k79L74k32j07K10j92
$$ y = [-126, -98, 256, -51, -66, 70, -223, -137, -332, 42, 51, 109, -109, -7, 36, -3, 25, -37, -133, -52, 130, -15, 41, -139, 158, 339, 239, 80, 270, -2, 161, -13, 285, -112, -216, -143, 127, 16, -92, -200, 71, -188, 249, 54, 140, 28, 22, 131, 68, 64, -141, 93, -192, -45, -202, 102, 28, 109, -127, -153, 46, 257, 155, 109, -274, 30, -262, -81, -40, 147, -75, -214, 70, -114, 153, -235, 114, -146, -233, -128, -7, -158, -20, 76, 185, -46, 26, -77, 63, -152, -243, 267, -97, 39, -139, 238, -163, -75, -29, -140, 148, 56, -167, -61, -384, -97, 143, 8, -95, 19, -17, 235, -78, 84, 25, -424, 168, -50, -14, 116, 207, -88, -32, -58, 209, 5, -185, 308, -60, 97, 20, -200, 117, -101, -33, 191, 154, -12, 158, 160, -172, 130, -212, 234, -147, 108, -7, 127, -25, 175, -58, 112, 102, -103, 335, 37, 179, 171, -80, -134, 17, -15, -16, -79, -197, -160, -38, 13, -141, 15, -286, 26, 155, -124, 250, 18, -89, 121, -71]
6738g1K60j73k20J32K44j21k85J93p7PK55j86o7K23l00P9J8K7J44r7j86J80M9
6761B8p3K3Q6J9P5m08K21j44K06j39j2L89k84K6NQ6m16M06j56R2k08K73p9J33
6785A49p4M8r4M1K18q0j92J4j81l2J00o5O9J30j94J0J98n6L6k43K74L3o5k01K77
6810A20Qj06Q9k17j6m5R2J30j45M21m09K08L8l08J95lN5J59j95Rj68K00m0k87
6834b15M25j72K12k30k2k8P5kn4J5j10J66O9j18M4j21J52R5k36j73K40K25j73
6857F4N2j68L6O4k14K8J2Q3R7k16R4n7r0L02n5Pk75J39J67K5j06K23m35K94J49
6882B20r1k86N67l41j92J26J48j65k9Q9O9l08M1K36k29M37m26J50K0J01k98L75
6904B14O7k65k37K17Ok5M9j26J46J08k71J14p6K56m02K21j45M41l48J6j35J84
$$ y = [-71, 189, 16, -204, -72, 172, 51, -234, -41, -118, -111, 144, -42, -109, 114, -186, -107, -89, -62, 82, -15, -201, -21, 28, -45, -22, 64, 83, 158, -250, -29, -173, 33, -106, -118, 271, -13, 13, 18, 104, -312, 94, -62, 30, -178, 95, 16, 149, 75, 123, 29, 70, 288, 208, 16, 30, -151, -183, -83, -148, -79, 51, -143, -133, 65, 9, 45, -198, 76, 109, 44, -157, 120, 128, 22, 111, -106, -122, -167, -75, 55, -90, 331, -78, 130, 168, -140, 55, 52, 107, 266, 71, 80, -88, 112, 72, -215, 210, 38, 250, 20, -2, -30, 45, 43, -11, 4, -106, 60, 129, 11, 55, -66, 86, 181, -55, -228, 12, 237, 64, 116, -52, -16, 48, -166, -138, -126, -43, 54, -162, -68, -125, -215, 87, 32, 39, -236, -97, 70, 95, -11, 212, -223, 71, 220, 129, -157, 410, 69, -123, 3, 151, -14, -43, 46, 115, -193, -152, 84, -145, 292, -134, 16, 36, 137, -161, 214, 281, 16, -221, -4, 2, -23, 26, -100, 46, 154, -117, -3, -79, 177, -225, -4, -149, 292, -56, -40, -175, 9]
6926IK51k03p9m23L06O5J94j58j08r7M12k67K62k41J88q9j1nl38Q9J5K94j02J7
6950a9j45J44O0j71J17K94l91J24k16M40o4l12J53kJ84k45mP7R5k4k08j13K08
6973a8J82m73J93m1P3n8Q7K03Jq8j82K15L06k64j94K25j70J36j07P0l26J84k5
6996g1k51L45j73K22J96r0J09l15K22o3l7J6N1j54M0J47j85j46J31K9R8j24kj41
7020a46j03K41m7J27k44J19K69p0k39J22j01j99K58J23j90o2J9J19k82J70j49
7041b65M21j09j93q8l8M24j86j57L10l23L5K26j6K0j28n3K51k20K90k50k5q1R8
7064e7K42j17q6K3J03J08l13Q7K86l65Q4j6K1k1O9J35k78j15J81m9j19K74l8j60
7088a21L26k53J93K4k38j52m1L12%R7j86j00N2Q8L8J01j3q0J30l0j19j42J61K43
$$ y = [9, 260, 57, -22, -445, -139, -74, 120, -38, -146, -243, 169, -98, 164, -77, 111, 22, 11, 6, -332, -243, -228, 66, -36, -19, -164, -20, 40, -131, -14, 280, -111, 13, -203, 237, 173, -139, 14, 12, 196, -49, -53, 24, 119, 95, -113, -226, -18, 164, -309, -116, -157, -84, -142, -55, 148, 149, 61, -121, 94, 400, 136, -58, 167, -3, 133, 26, 96, -230, -46, -71, -322, 23, -150, 72, 268, 178, 287, -28, 194, 131, 94, 110, 161, 7, 47, 194, 9, -137, -6, 23, 121, -3, -5, -146, -249, -8, -55, 72, -172, -53, 216, 146, -93, 29, -72, -271, -13, 110, -80, -142, -123, -4, -286, -116, -265, 156, 47, -146, -234, -272, 152, -34, -191, 119, -204, -169, 57, 41, 61, -67, -120, 131, -89, 201, -49, -74, -155, -57, 185, 68, -18, 5, 108, 216, -97, -10, 276, -89, -5, -21, 0, -21, 48, 183, -95, -210, -29, -78, -197, 77, 39, -121, 205, -48, 145, 169, -69, -221, -262, 50, 50, 147, -39, -139, -87, 1, 39, 140, 127, 47, 177, 147, 28, -114, 47, 290]
7112B90l03K77k84m9j12J09L13l39L14k84J31j30J12n8K69j85j06J27j05K63k14
7133C6q1J07q3j51K95j05j43K54Qk09j9L7k5N4j54O6J14J71k4j57k53K18k02J38
7157a08Q2j33J37k94L80J39l68N3J68k34K94j40J63l83K40l1J02j65J53j30J5
7178f0n8K34Jk24j51L41L14m94P8J14K8r2j11K0K57j13k02Q7L18k69j06J64l1
7201D5k18K72j14l2O7m1L52n08J04K46j99o2r1j41K49J70j82M1L58l38q4j15M02
7224A81l21K27j13L9N5KK8j4J97k29l03J08j0J88J35k01PP4R9j89M4j6O4L9k33
7249a42M62j18j00j42K94k11j22O9K50m38K02J7j48M17m2k87M1P0j65o4J63Q1
7271H7k61L51j13k1j58L30k18j09j24J28Q1j31R1J48R7q5j97L94l08K40j67j89
$$ y = [290, -13, 264, -20, -69, -181, -72, 241, -98, 216, -68, 63, -67, 45, -13, 256, 71, -35, 92, -13, 250, 36, -45, 62, -21, -172, 123, 18, -125, 129, 137, -72, -91, -54, -79, -25, -179, -113, 1, 172, 148, -9, -262, -44, -246, -108, -26, -159, -22, -316, 64, 203, -165, -112, 56, -178, 116, -24, 139, -244, -4, -35, 67, -98, 55, -75, -60, -118, 116, 117, -107, -258, 83, 397, -97, -19, 95, 123, 31, -80, -60, 197, 84, -118, -31, 287, 18, -88, 76, 45, -173, 99, -15, -47, 20, -21, 331, -177, -73, 173, -26, -88, -179, -320, -71, 99, -83, -42, 316, -22, -106, -221, 181, -140, 87, -26, 13, 68, 70, 98, 84, 281, 52, -251, -143, -153, 35, 170, -31, -24, 50, 149, -40, 4, -12, 52, 91, -142, 320, 202, 102, -40, 254, 43, -79, -10, 240, -198, 4, 21, -127, 290, 248, -39, 2, 72, -93, -157, 6, 87, -174, 177, 64, 43, -115, 215, -3, -112, -236, -108, -27, -158, -67, 81, 178, 93, -104, 290, -18, 222, 55, -134]
7293a34K52j89k16K62q1K42q9O3j65O2J38N3P2K39l39j69J78%k25J65L8m69M59
7316A47k8k78L9K9O0N3R5k5k56J23j92M04M8j70jn1K5J10k17r8K01j19L1K97k66
7341c9K55j51N7l7Q6k04k6R5J17j35l7o6J68N7p0J18k32J1R8P0j17j09J01O6m8
7366B8l0L9k02J77l3j05K30j99J4n0j02K18qJ75N7m42J04J56K2j33K22L3m3j84
7390e6J95j22j80o2K63j76K56pm04M15q2M1r9q3j00K14n2K30k71L14Q0j43k23
7413e2n5N7k5J03m5o3L5l5Q3pJ46M0r1q9j46J81j05L5J07P0l18l9L37Km5j38l5
7440i2J76l02K21k28M06j69j37J72r3J68k98K51j61Q3L01k00k6j68J4m8J42L0
7462D2j14L53o3l25K93j46j69J63j24M2K15j99o7l3J93J56m8j54k75K02qM7l3
$$ y = [-134, 118, -71, -287, -25, -106, 136, 47, 110, -55, 7, 145, 198, 270, 509, 170, 1, 179, 179, -46, 119, 157, -312, 147, 119, -159, -120, -91, -31, 22, 117, 92, -164, -41, -233, 171, 219, 49, 48, -3, 22, 132, -85, -183, 18, -101, -70, 227, -39, 216, 65, 122, 85, 171, -33, -59, 36, 153, 18, -19, -85, 83, 140, 70, 188, -44, -33, 65, 135, 18, -91, 10, 76, 28, -2, 37, -165, 12, -21, -126, 104, -95, -81, -131, -233, -15, -23, 152, 209, -233, -129, 27, 49, -84, 138, 171, 128, -56, 139, 17, -163, -225, 38, -138, 118, 111, -293, 122, 40, 81, -18, -101, -201, 13, -39, 191, -80, 234, 314, 171, -52, -107, -50, -75, 28, -17, -80, -45, -80, 3, -4, 142, 182, 91, 2, -144, 37, -68, -33, 74, 144, -174, -213, 124, 126, 81, -57, -92, 84, -218, 3, -225, 181, 12, -125, 47, -46, 122, -176, 75, -86, -3, 298, 98, 72, -96, -82, -130, 12, 42, -72, 281, 218, -107, 186, 40, -129, 34, -90, -48, 167, -32, -99, -132, 61, 217, 169, 15, -260, -58, -66, -19, -52]
7485e2mp0J5J41j23O3j74K61k06K7L4J85j6k63L02k11K9n9K07k84J34l7Q2j92
7509b11K20k01J94Q8jJ00l50L9K84j48kM5J73k73K94k46j43K25o5q5n0j0l09L56
7533g6O8R0Po0J51K65m21J7J93M4j74k68J90J3J17n5k72Q5j09K16J23k21J15q6
7557d8J17m2jj34P2n7N2K61j60r3J13k02L3%l6R1j35P6K82j32j23J81j56P8J67
7582B04k43K32M1l35J82J43k05j34J68J05P8k09J54k65K06n9j35n5L27k35j04
7603a39P0M1p5nQ1R7O8K41j4m94j15J64r5P6N3N8J40k10J22q6k15L01j23j43K55
7628E3P2l08M99l18O5n2J11R1j88k96R2L61l65J33K15j60N9j19J50K01n84L07
7650A9K02J42k88Rj38O9j34Q3J09J78k00j67K34j25J05j19j76P8J01k88R8J19
$$ y = [-52, -56, -126, -111, 30, -93, -30, -204, 57, -149, -122, -88, 97, 81, -182, 120, -91, -62, -121, 86, -198, -64, -101, -19, -211, 9, -192, 2, 90, 89, 189, -161, -122, 162, 14, 12, 57, 230, -43, 251, 5, -138, 87, 22, -63, -113, -123, -432, -76, -8, 82, 89, 29, 180, 445, 24, 41, 234, 278, 104, -164, 26, 39, 156, 101, -171, -86, -195, 21, 144, -77, 38, -48, 69, 27, 26, -108, -36, -93, -41, 220, 60, -33, 80, -122, -89, -89, -125, -34, -169, -93, 189, 57, -66, 115, -41, 37, 204, -39, 193, 234, -101, 81, 224, 19, -115, 53, 158, 236, 27, 181, -84, 122, 63, -72, -127, 200, -35, -139, -69, -28, -103, -108, -27, 70, 138, 379, 365, -129, -244, -80, -175, -99, -46, 12, 152, -58, 64, -22, -237, 64, -59, -202, 53, 125, -183, 316, -2, 63, 11, 122, 213, 25, -271, -179, 182, -183, -50, 165, 5, 64, -55, 95, 296, -288, 19, 221, 363, 75, 84, -54, 15, -119, -36, 73, 251, 51, -116, 118, -7, 98, -21, -197, -119, -18, -306, -208, -89]
7672h9q3K83j71n5Q4j62L70K2oN8k81N6m1j3r0R6j05j31K05L49n31L36l08K43
7696C6j9j30J05M7r8R2o9j48L79l20L03j93J15k59J29J69k63q6L08j74l1j43J39
7719a11P6K3r4J32K51k47q3Q0L4r4k07J07k2L37r9k00J08j37J07Q8r4J2R2j95
7743a36J92j90L97k14l55M50m4o6R2J7j73O1j68M12l02Oj46J82j16N9j6K09j00
7766E1K72m3j78k44K15j18K89m1l62K16l9K9J0k62J29K24q5k76J30m9K05j87K44
7789A30n7J11K1k20k8K07k23q7J15J58j48l2J77Q0k7l87O4K31L8j71J42k05mJ06
7813im6p2j22K79j85L4J08J28j25M2l9J43k14J15j15J45j45J11j93J41L9rR0P3
7837A74J55l49J89m33O33k39j81N8j93J69L3j29jK53J21k33j51J08J14J8k91J64
$$ y = [-89, -172, 111, -60, -115, -31, -193, 177, 199, 193, 251, -30, 26, -15, -28, -118, -22, -127, -258, -53, 296, -235, 101, -207, 36, 17, -113, -8, 39, -59, 33, -36, -184, 195, -125, 178, -15, 100, -159, -30, 139, -124, -210, 98, -76, -107, -250, -111, -35, -12, -106, 26, 277, 30, -53, 27, 61, -33, -240, -133, -155, 182, 83, -117, -9, -146, -39, 49, -45, -33, 59, -136, 56, -134, 263, 49, -306, 144, 100, 34, 126, 143, -30, 31, -137, 275, -27, -21, -167, 15, -101, -42, -58, 151, 51, 323, 280, 102, -142, 73, -45, 244, 203, -159, 57, 18, 47, 57, -205, -76, 148, 63, -213, -83, -132, 73, -114, 130, 73, 184, 205, -15, -43, 164, -59, -146, -31, 127, -21, -53, 124, 204, 177, -210, -146, 85, 123, -48, 94, -111, -115, -9, -55, -127, -249, 30, -155, -121, -13, 115, -10, 32, -7, 136, -78, 37, -78, 67, -78, 33, -160, -19, 20, 11, 101, 174, 329, -20, 169, -264, 369, 130, -51, 7, -186, -17, 16, -113, -114, 139, 260, 27, -124, -16, 98, 116, -175, -11]
7859a1j16K45k02J00r7K76p4j56J59k23j33J15l3n8K18Q5R2l52K39J1M0qj96o0
7883a39J87L7j81P0K94j59m07K87j83R6J91J23l24K7k2mn2K05k80O3L36j04j44
7906h3j02K58p6j48L58k80j32K74j97qK08k56J89K10l81J51j78K01L0m5o2R4n6
7929c1n4q6J52N0n5r0M38k05j10q0j65K7l6R1K84k68L59k8j13q9M2r4J0J5P7m1
7955@l41M23m4k4l27J91L73l33m6k73O03j10k00L84n37K36P0J67k31p7K4J36l2
7978C2j6J13j67r7M1J70j5k81K40P9l80L99j00L2K0J5k19k8QK39kJ57k40J75j90
8003a5m4P9l85K44Q7L0J20k73K48k14L16r2j4lj03L34l85L52m02J75P9q7j8qO7
8028H8k31L2k45J54L51j09k33O6nk3QJ31O9j09K7K8n5N3n4K0K07k53k2R4Jq1j51
$$ y = [-11, -127, 118, -84, 16, -81, 195, 121, -35, 124, -99, -232, -117, -150, -208, 10, 95, 187, -165, 74, 85, 125, 117, -79, -139, 48, 85, -96, -26, 268, 109, -298, -11, -194, -98, 93, 216, -108, -81, -103, -107, -159, 46, -234, -171, 165, 61, -83, -185, 73, -3, -151, 207, -73, -205, 69, -128, -136, 72, -184, 5, 215, -166, -15, -193, 8, 38, -7, -69, 25, -31, -85, -171, -19, 31, -24, -114, 324, 119, 9, -71, -236, -209, -245, -154, 130, -138, 221, 193, 80, -9, 33, -61, -51, -36, 41, 0, -341, 82, 38, 14, -313, -122, 251, -82, -128, -401, 202, 92, -108, 276, -261, -25, 45, 212, -19, -96, -72, 64, 32, 16, 129, -38, -135, -94, 76, 61, -220, 20, 99, -281, 118, 18, 50, 70, 85, -134, -162, -154, 85, 83, 240, 0, 175, -15, -59, 20, -365, -121, -34, -4, 116, -157, 91, -123, 193, 101, 87, 84, -19, 315, -70, 282, -120, 55, 134, 47, 29, 21, 88, -143, -111, -356, -202, 149, 40, -193, -127, -132, -155, -147, -16, 53, -56, -29, -1, -56, -3, -57, -37, 170, -83, -105, -11, -10, -91, -242]
8055b42J74K85l83L59l27K11j49k0L09l23jK12r8J90k82K26K03n86M08P9j51o
8077H8R8k13rj9M9J78O1j61j9Q8l22N9J97m9j31L9k3L9L11l95J12L03m47N0J89
8102G3q2r1K40m8p9o8J53k54k8K34m6K0j38L2J62j09M57m42m7L39j72j39K74k5
8126B16o4l98L16j22j31K93j2k93J96Mj22J66r9N3J74N4j57o2j74J10R7j13p9
8149a47L49o00N45J3k24j6K29j93j90O2k8K77k3l00M10j65M8J46j94q5Ol43M37
8172A4K38k50j09j69K15j34J27k8K66k23J38M6l10K63O0k94P0J04j73
$$ y = [-242, -68, 217, -166, 193, -134, 77, -72, -92, 217, -106, -107, 105, 7, 197, -85, 141, 344, -242, 166, 245, 94, 88, 186, -27, -36, -55, -6, 172, 233, 72, 53, 141, -181, -122, 75, 26, -105, -66, -89, -50, 261, -134, -22, 281, -166, -116, 73, -9, -100, 140, 92, 13, -55, 98, -156, -184, 50, 4, 24, -114, -82, 80, -29, 428, -14, -61, 278, 106, -33, 241, 216, 152, -246, 70, -52, -183, 110, 98, -195, 1, 5, -117, 49, -50, 3, 177, 231, 74, 12, -162, -52, 45, -68, -147, 202, -398, 147, 160, -64, -80, 149, -44, -234, -172, -200, 77, 54, -246, 164, -1, 47, 193, -1, -86, -80, -423, 14, 252, 2, -107, -276, -61, -195, -68, -96, 170, -53, 85, 131, -179, 84, 144, -150, -80, 24, -149]
8191a49
$$ Imaginary data points
##PAGE= N=2
##DATA TABLE= (X++(I..I)), XYDATA
0@%%%%%%%%%%%qJ6j6J6j6K4l2M0m8N6p2Q5j01J20j36J56j80K08k40K74l14L59
33A91m08M61n19N84o55P35q20R11j015J127j248J383j531J688j863K056k264K494
51A307k748L028l338L686m076M516n019N600o278P083q060R271j0817J2875j5762
66h732K0144k7664M4078j46854J15874K25062k20105j53671L9512J82966n885
77F4725p0035q443j192l7756Q4848P5554p8637j07000J6863J33067L9576j51855
89d0285l4363Q1928L0020k2976j6759j1429k411K071M4863L0226q7235k6444J01289
102D8495J6538o0164l0858M1921L5912n2081j8560N8347k7070o4438M9358M6342
114D3742m3631o2310J8205R6428k4261j02646L7596Q3464k6847n8948J7565O3718
$$ y = [0, 0, 0, 0, 0, 0, 0, 0, 0, 0, 0, 0, -8, 8, -8, 8, -8, 16, -16, 24, -24, 32, -40, 45, -56, 64, -72, 84, -96, 112, -128, 146, -168, 191, -217, 244, -275, 309, -346, 389, -431, 480, -535, 592, -656, 727, -804, 884, -979, 1077, -1187, 1307, -1441, 1587, -1751, 1935, -2141, 2375, -2644, 2956, -3322, 3761, -4299, 4972, -5845, 7030, -8732, 11412, -16252, 27826, -119028, -3154, 221908, 1803, -151868, -112356, 70610, 64725, -5310, -13753, -14945, -52701, 32147, 107701, 29064, -77936, -61073, 71994, 111570, -40285, -74648, 7280, 37300, 14324, -2435, -13864, -16275, -14204, 30659, 60885, -26350, -52794, 48495, 65033, 4869, -25989, 15932, 51844, -237, -18797, 39550, 12480, -51958, -2600, 43742, 111, -62199, -43994, 52434, 28173, -74473, -36877, 46587, 19740, -39208, -21643, 42075]
126D2075j8925q1740M7552Q3633o9555p1590M3305O6974j4273q1093N9O9286q788
139F920l0082J8928q582j1863K3443K6028J337n0583p930P4320N929n7996n329
152a5460K6571J3030j7088j7772K6429q415m1214L3385L4124l4457k6661J4845
164a2683L5238j799l4846K0249K1864l6731N396M2158q485m0469j8418M3208L6235
177E0917n6298l7904L8971J7475j5434j2672O45J0657j6740K370M4490j6721m7068
190c7312J9162M1668P136l5695k6209L5305J8927k5110N55l893j7651J5753J5502
203H138m749k4284j8977M0952K8449m1228j8793K6072K3136P16k7151M95K7888
216B0664j0242o640J4566j4902r092J0682P083j470k5738l336L5022q729k5770
$$ y = [42075, 23150, -58590, -11038, 72595, 3040, -68550, -25245, 41729, 27456, -53637, -53578, 15708, 6920, -23162, -4234, -12816, -24679, -1236, 24792, 26129, -24454, -32384, 41936, 47865, -10131, -15460, 11111, 24141, 7053, -10719, 15710, 7295, -33919, -534, 33590, -867, -27528, -12683, 22555, 20756, -14090, 6159, 28023, -8708, -3312, 38846, 30361, -10108, -28526, 14682, 50917, -5381, -43285, -4314, 13161, -2273, -14945, -14300, -3643, -20383, -18013, 26477, 9756, -37312, -18150, 23518, 30654, -5041, -31250, 4055, 22982, -2128, -1573, -5466, -23117, -7364, 8138, 3389, -20895, -39872, 1080, 29529, -11699, -30492, -4420, 18716, 19432, -7719, -7224, 20664, 10422, 3782, 18348, 3446, -5646, 5036, 12119, 10649, -15089, -18425, 16597, 7868, -17902]
229a7902J3422Q754r26l056k975J8621n662k0501K2236J1165j8848m605k02J0347
243I868J951k4381N613J2644j8699K199J0537p245k263o019J1956J5969k2360
256a0230l246K4467o793n184N182k774N047q602l599J8357j4455j6799J6610K748
270G29n089n573q680J8757M958j8673J0832P403o824Q982j193l01M215j0172J1849
285A1220P165k3992L966J4114r364l910p392K996J4356j5763n009J6171o642L95
299a689O530o736Q097k98n983J4725p971j1029J4817k780o858o12q096J0376m6
314B447j8703J0528N280j1844P722J41k074O885p009P357R119j5555N745J0040
328A0079q811K865l437m045J0356r585n864J0590r172j466P502o939M395j11m726
$$ y = [-17902, -4480, 4274, 3348, 292, -2683, 15938, 10276, -10225, 12011, 23176, 4328, -277, -479, 9868, 11819, -12562, -6949, 5695, -13004, -10805, -268, -7513, -9776, -15795, -3839, 12130, -10230, -13476, 10991, 4198, -986, 4196, 1422, 6469, -2133, -5732, 12625, -1830, -18629, -2019, 729, -4360, -9933, -18613, 144, 5102, -13571, -2739, 4664, -2160, 6822, 5629, 5328, 9543, -629, 11220, 18385, -5607, -1641, 12473, 3109, -801, -8193, -5197, 9159, -6604, -11613, 4558, -2084, -1689, 4841, -1895, 6202, 5904, -79, 14646, 6675, -4354, 10463, 7683, 825, 213, -7883, 2493, 2447, -16256, -5728, -448, -12292, -4570, -4429, -6503, 382, -6627, 730, 9849, -5706, 39, 10079, 1268, 4133, 696, -3349, 7007, -2578, -8442, 2148, -7024, -8490, -988, -7927, -3532, -3643, -8369]
343h369J4367l617r086J3887K51l717M790o211M978L085j2073O976N68j1676P390
358A543j431o034O429p029R47R145r066L716O436o901O206J855l905P957p336
373B532l388J1971p549n718M215o264L582M32r654N954j683m458J0736m628m316
388h236Q544l167L990M917q745N531L637o144N448l270n701O889n468j789M677
403A113r103K328N777p570L154K406k084O702l790o18R455m827m83O773o353J278
419D158K747n313M332n050o895Q698k064m828J125n186O427O088r832K511M662
434A580k211O344j720l154N824m990J61O667o919j702L37n368P088j514j0089
449i666M387P48N5L262o253K912P497o659L607N400l726K478l416j049J0033n801
$$ y = [-8369, 5998, 2381, -6705, 7182, 7433, 3716, 8506, 2295, 7273, 10358, -1715, 5261, 5829, -5847, 1543, 112, -5922, 507, -6522, -5575, 3570, -5496, -1780, 4656, -2245, 3961, 5816, 1911, 9868, 2532, -856, 11115, 3566, -2152, 2063, -4201, -619, -187, -9841, -3887, -5570, -10028, 708, -3920, -8236, 308, -2859, 1131, 6048, -2697, 2834, 6471, 327, 5775, 2505, -3196, 3693, -1775, -3564, 1113, -7990, -5662, 115, -7455, -4301, -1895, -3979, 2723, -1067, -1685, 7770, 2943, 2460, 9233, 2880, 4158, 6905, 1592, 5924, 874, -6021, 2677, 613, -4215, -3090, -8276, -1849, 4239, -5593, -3082, 1580, -631, 5713, 3993, 839, 6663, 1673, 1834, 8501, 1582, -120, 217, -5151, 1937, 423, -9666, -5279, -4531, -4476, -1214, -7467, -4555, 2942, -3717, -110, 5290, 1564, 4042, 626, -423, 9610, 3809]
465C809p761M203j374J940o49q409O038J81p315Q915K320n392P46j564R179P850
481A2717j3736k266Q990K127K556q651o930J0112j072n136L276o228j848L727
495b362j451O260k742j1543R597Q313j601j324r118N164J4734p787p485J681l04
510C2O600l923r799O349j377m900O964l627k737K795l234P955L500j1604M384
525b622Q275o24k21q031K283J3124q761p607M472j167K679j955p497O278j366
540b740m868Q986r37n326L118j039Q672L910j3799K100R417q83O82p274l517R755
556F257m050m334L293o097O24L822m679N690n29q813P299M422m3J620q049K380
572a187J0421n601p98N37o754M771J941l978J792p924l295J2279r67n428k095
$$ y = [3809, -3952, 251, -1123, 817, 168, -8241, -2203, -2022, -9337, -422, 1898, -3494, -2748, -4312, 4867, 12717, -1019, -3285, 5705, 7832, 10388, 1737, -5193, 4919, 3847, -1289, 1987, -4241, -6089, -2362, -3813, 2447, -295, -11838, -2241, 6072, 4471, 3147, -5971, -807, 13927, 6140, -1345, 336, 32, 6632, 2709, -7090, -741, -2118, -7018, -54, -3681, -6418, -3623, -6857, 1098, 4598, -7006, -2622, 5653, 5029, 4808, -3223, -940, 12184, 3423, -4184, 288, -879, 1800, -155, -7652, -1374, -2740, -7608, 1378, 441, -4885, -1767, -2806, 5866, 9776, -4023, -1923, 7494, 6611, 7293, 19, -3498, 6257, 2207, -2127, 1166, -4931, -4307, -485, -5164, 526, -3, -8816, -1517, 2905, 2862, 4482, -3567, -1187, 9234, 3633, 2835, 3372, -3382, 1389, 3330, -648, 1144, -6780, -10075, 2204, 1237, -4191, -6286]
587f286l139J1225N828j1419J022M163L13O259m635l393L408m508M012M635j0120
602b635k573K887N3O075o718p909R354K935j288M28n457N666O497n797J923J40
618C581l997O470j080n141L034m986K58N248o533j497K089k178O088j384o317
633f345O053J134r90M728m615N86M561l725K721O51p491K933J112j358J905p470
649e610j981Q501j447k956l71k614P245K920n865K895R1k73O104l160k905K138
665B712l388L197K210p009m04L77o80M760m785m079N909j25J034K289m949L103
681A72L892k443L297k126l165N175j495k297J713n372J223L590n739R98Q38k764
697d503L839j190j642N021k524L49M315l141J840K124m595K855P03l600K383k976
$$ y = [-6286, -9425, 1800, 7628, -3791, -2769, 1394, 1707, 7966, 3331, -62, 3346, -1162, 2850, 7485, -2635, -5208, -2321, -2268, 3807, -2911, -10820, -1466, 1469, 181, 609, -4848, 818, 7315, 1518, 3441, 3581, -416, 6054, 4974, -167, 2867, -2119, -1861, 3387, -3146, -4643, -2554, -4732, 1356, -28, -6345, -292, 842, -148, 4580, -35, 551, 5112, 1387, 4108, 4759, -2732, 201, 1313, -45, 1860, -5610, -7591, 910, -537, -3493, -3864, -6478, 767, 3687, -2178, 717, 808, 535, 6639, 3479, 574, 2712, -676, 2521, 4731, -2278, -2682, -2305, -2985, 1775, -3010, -7089, -1180, -1305, -271, 2018, -2931, 172, 4064, 1621, 4918, 2792, -373, 4802, 3307, 1010, 2723, -2649, -1426, 2164, -3575, -2577, -1739, -4503, -664, -1854, -3496, 1525, -999, -650, 3665, 524, 2364, 4488, -107, 2748, 3451, -149, 2234, -742]
713g42j636M048m619j106K836l221K579J349l975M379P07k040M316j891j54M136
729D966l981J287K066n077K606O8m640K716j010k379L013l582P68L921m477K352
745a383K949k884L728N52k885M285j843j538M019l797j115K302m107K089j83n254
761e065L852m98k392L693k386o93N262k868J592J792l355M440J153m622K858r29
777A834k067L867m635j779L747l819R89J271m928L982J014l038M551j826j278
792b115N860k980Q3L358l700J910J576m825L462j314m274M443l149k357M089l462
808c395O07L114l924K754K083l111M184n94j908N001k892j471M254m123J93K344
824C116n308K155J3m077L627j616k531M809k628j89M270l650K203L035l630L137
$$ y = [-742, -2378, 1670, -2949, -4055, -1219, -4440, -1861, -512, -4487, -108, 599, -1441, 2875, 984, 830, 4966, 985, 2272, 4338, -739, 1867, 1935, -2705, 11, -999, -3378, -365, -3947, -3179, 742, -3735, -1383, 1566, -1318, 2410, 2962, 77, 4362, 2519, 981, 5000, 1203, 88, 2390, -1717, 372, 189, -5065, -1213, -1711, -4103, -410, -2796, -3489, 1773, -1095, 497, 2289, -1066, 3374, 4527, -95, 2763, 1834, -233, 3634, -1001, -2780, 967, -2852, -1863, -592, -5520, -1538, -524, -3562, 989, -837, -2115, 3745, 765, 848, 4206, 506, 2416, 3992, -833, 2629, 1315, -2959, 1484, -1665, -4022, 67, -3395, -2788, 326, -3598, -844, 1239, -1872, 2312, 1718, -190, 4811, 1919, 448, 4702, 579, 772, 3116, -2192, -37, -24, -4101, -474, -2090, -4621, 188, -2440, -2629, 1641, -2009, 194, 3229, -401, 2736]
840B736M57l004L768k366k216L944l983j710L643m129R55Q59l983L905N18k959
856c565M231j366l39M525k783L54K685l378K707J031n079K697p98k683K856l077
872a982j428L328l419J572K740m412K096K439j897L431j490j465M949k360j249
887H53K766l468J192Q60m256K578q16l666L501j111k265K797j613J392K789l857
903b324K223K658k738L243m81k497L230j567j342J842l909K74K463m028J406M01
919a146k989L197l93r67L213l043O58N530k817n66J132r79L731k053l859L500
935B149j307k678K969k368o99L31k583L990J155n013K431J995J20K314l246J75
951b65M746l074K17K061l736Q99L11j996K380l313k585M002j063q17J288l099
$$ y = [2736, 3193, 189, 3957, 1591, -625, 3319, -664, -2374, 1269, -2860, -1905, -1046, -5029, -1124, -606, -3565, 666, -700, -1039, 3486, 703, 1057, 3742, 364, 3071, 4102, -977, 1720, 922, -1761, 1095, -1982, -3410, -82, -3501, -1929, 811, -3601, -1505, 934, -963, 2468, 978, -487, 4462, 2102, 853, 3619, 151, 1343, 2203, -2053, 525, -291, -3957, -456, -1567, -3832, -1035, -2648, -1256, 1533, -2324, -101, 2557, -181, 3062, 2581, 84, 3314, 1747, 405, 2247, -1662, -1388, 1075, -2953, -1547, -1146, -4135, -938, -1331, -2298, 915, -2128, -1470, 4060, 1243, 677, 1809, 830, 4561, 2508, -1351, 2149, 842, -1836, 1133, -1235, -1934, -1603, -4186, -196, 959, -4054, -1623, 372, 492, 2806, -440, -265, 4481, 1407, 1624, 3685, -51, 848, 1159, -837, 1543, -1770, -4355, -353, -1416, -2233, -945, -4044]
967d044K608L050k611J903m96p00M467k177j951L355k539m54J523l034J373q37
983e64l476M143J17m453K133N08J660J207n117L596M875m630M58K044o41J662
999C522l152p39M346m314k227M008k373p03q93j528N123j308m523M666J070j098
1015a23J950k349J805L004m285K098J295m162K440o24k406K759l185j485L107
1030a61k705J374J183m118L795K344l275K220J3N7L306m065K73M644m360j130
1046f05K072j305J380l739k241O297j978m820L602M76K47K92k519M704J398n551
1062b290L823K514l002P50j750J119L240o045m96L807l570R6O50k225L341j338
1078a376j733M518j875j052L980k184P69K034k507J721o1l125L524j960l351M352
$$ y = [-4044, -1436, 1614, -997, 906, 410, -290, 4177, 2000, 49, 3404, 865, 411, 1934, -1100, 273, -564, -4040, 103, 220, -4233, -2100, -1592, 68, 1275, -3842, -246, 4629, -1, 457, 2501, 1860, 3522, 370, -369, 3977, -337, -2564, 1444, -929, -1632, -2525, -4053, 1070, -238, -4761, -95, 975, -123, 1827, -522, 1283, 4287, 2, 2100, 3395, -767, 1673, 1049, -1357, 1402, -1783, -3268, -161, -2866, -1492, -309, -4427, -632, 1712, -1563, 657, 670, 727, 4033, -32, 241, 4885, 525, -605, 1467, 162, 1542, -2197, -4438, 1859, -119, -4939, -1337, -861, -614, -322, -2841, 1863, 3261, -2290, 1533, 4047, 1045, 1795, 45, 1164, 4404, -1641, -2137, 1670, -1900, -1804, -1154, -3379, -38, -1376, -3109, 1409, -466, -1518, 2462, 278, 1047, 3081, 574, 2295, 2234, -891, 2633, 673, -2678, 1674]
1094A674k675j718K193j935J905K22m016M356J760l797K365R12q8J907l479J550
1110A136L256n010K98K661k545J26j445p18L656l796j959M917j669o26J693j058
1126a083K389r0k280M024j49l332L046q74j226J304k957J467Q71m195K049Q79
1142a57k906J837J98p27K396k094R26L725l795R24K938k349Q19m35j118K565l057
1159c10j005L023k956j153J902j624J165l88j598L738m23k503L519L97j221J429
1175A992j513J795L87l876K431J181l662J012l31o73Q89k895J326K622l437J258
1191a494K516j789J458j84J04K769k644q32L456k401p70J157j421M00o18k345
1207b638L005j510k416L000m71o22J767j539K039J027k489L159J16k456J798M9
$$ y = [1674, -1001, -2719, -526, -2461, -556, -334, -4350, 6, 1766, -2031, 334, 1246, 1158, 3065, -414, 1136, 4392, -618, -320, 2341, -204, -78, -1523, -2241, 1415, -2381, -4340, 577, -1092, -1718, -25, -1083, 1306, 1216, -1064, 2960, 2811, -521, 2525, 1651, 425, 1729, -1228, 239, 1110, -3085, -1036, -157, -3063, -1226, -1028, -1755, 641, -1453, -527, 3198, -597, 327, 3265, 916, 1735, 1300, 182, 2747, -310, -1315, 1708, -1248, -2401, -499, -2123, -958, -1346, -2944, 794, 371, -2132, 1387, 1784, 563, 1992, 479, 2274, 2661, -1215, 1216, 2397, -1265, -253, -584, -1257, -368, -3263, -1937, 685, -2752, -1494, 1022, -767, 691, 507, 611, 3380, 736, -96, 3360, 959, 189, 1346, -75, 325, -293, -2638, 367, -1143, -3559, -559, -1030, -1652, 115, -1424, 615, 1642, -847, 2312, 2428, -28, 1770, 1819]
1223A819j243J140k923J162J378l807P91J854k305Q15j0o43K679j928k01L886
1239B464k063l72J798q03Q92p28j672L164k042k280K582j396j550J358j362J145
1255h65L71k821L259Q98k414K276K01n04J831j940R37J907l617P07J993k569M62
1272A12m13j367J794j828q56K941k402j00K618j438J154Q97j609L100q80k394
1288f71L164j090j377J561k039M32P24l315K123O28l368K422J21j134K258j604
1304a165Q20K563k752J046K528k820J088M12j768K019j855j347K996l227o62K242
1320A18k176Q50O33j963K958l41j846L221o71j082K432j304N19R64k665J405Q24
1337A876k994J670m60k245J880j502k83K228k382J059K025k098J670P36j662K300
$$ y = [1819, 576, 1716, -1207, -45, 1333, -2474, -1683, 171, -2134, -1319, -1329, -1972, 707, -1221, -1422, 2464, 401, 29, 1827, 1024, 1916, 1188, -484, 2680, 638, -1642, 940, -456, -2006, -648, -2010, -865, -494, -3315, -56, 842, -1572, 704, 905, 401, 2232, 292, 1229, 3136, -481, 226, 2219, -350, 112, -301, -1668, 126, -1702, -2558, 383, -2019, -2119, 499, -939, 215, 1112, -497, 2603, 1723, -671, 2493, 1403, 26, 1587, -452, -20, 704, -2611, -488, 140, -3228, -806, -685, -1819, 439, -1165, -345, 2218, -534, 512, 3040, 220, 1308, 1720, -48, 1971, 116, -1231, 1765, -1462, -2124, 118, -2058, -1208, -575, -2538, 420, 79, -1767, 1454, 783, -299, 2133, 829, 1348, 2312, -353, 1052, 1876, -1118, 552, 92, -2153, -273, -1775, -2058, 170, -2212, -1153, 872, -1226, 444, 1180, -482, 1818]
1353A818o71j328K948k170r26K100k132K40O04k435J737m27k308K734p31j231
1369b178K576j068O27J561j759J370R60k125J877j72j763J852j585p48J529k487
1385a533K8J578k196J103O85j596J851kj124K452j206j42K139j507M06R57j790
1402A03J142k68k178J945j136j326J671j735K09J531k005J132J191j282J377M48
1418H19o60J511p92n87K289j989k97J025j695O29j83j944J345k4j557J833p47
1435a024J2J110j331J470J323j713R91M99r48J735j491n52J711j654n88Q37j433
1452a046M78L53k262K222k2j791J901n30L84J606j716Q71J898j923N93L14r91
1469C39J419j481j474J907j075q35P46j110Q79M89j991J977O21j763J501P7K63
$$ y = [1818, 1147, -181, 2767, 597, -329, 1771, -361, -121, 483, -1952, -215, -642, -2950, -216, -947, -2178, 398, -670, -43, 1518, -241, 1129, 2089, -36, 1841, 1669, -94, 1758, 173, -575, 954, -1533, -1505, 73, -2123, -1020, -335, -1931, -80, -82, -1206, 1246, 40, -102, 2037, 530, 936, 1893, 103, 1245, 977, -1201, 744, -392, -1718, -47, -1782, -1573, -42, -2047, -915, 276, -1006, 371, 819, 159, 1670, 878, 291, 2580, 591, 294, 1319, -376, 253, 70, -1874, -529, -553, -2110, -277, -1024, -1012, 98, -1233, 237, 1560, -153, 838, 1337, 389, 2124, 633, 81, 1792, 138, -450, 387, -1046, -568, -215, -2477, -255, -277, -2068, -167, -697, -313, 1293, -423, 448, 2346, 423, 1016, 1330, 339, 1758, 277, -1197, 710, -365, -1200, -454, -1564, -685, -196, -2187, -210, 411, -1352, 149, 226, 489]
1486D89J366j396l4K130k294K15L14j096J190j364j458J990q20r75J258p78O64
1503e99P25j801K173J003j910J661o9n43J450j733j35J611k128K34L33j472J122
1520g8k85j952K199o17j178J847r95R73J284j943J366J271j955J371k34j000J894
1537A968k136j006K330k069j81Q58j329J110r6j679K128M84j428J539l60M61J017
1554A611j669Q59J525k539Q06N24j611J367j361r78J948j894j18J635j558P64
1570f89O72j217J901K29j657K366q74l65J545j738K62R87j894N52L38j719J203
1587i8n49j193J495p64k36J469j166J293O12j456J322J248k006J286k77n44J035
1604A471j739j39J550k073j95J240j368N19k13p93J717m48q60K251o82j05J207
$$ y = [489, 1855, 459, 425, 2555, 261, 476, 790, -306, 884, -480, -1938, 52, -768, -1743, -485, -1263, -599, 126, -1675, 498, 1501, -409, 1252, 1183, 640, 2090, 357, 222, 1833, -295, -61, 272, -1200, -78, -363, -2315, -116, -733, -1911, -64, -1059, -86, 1198, -745, 621, 1892, -63, 1308, 1074, 74, 1968, -168, -1174, 1156, -913, -1094, -236, -1565, -455, -551, -2230, -102, 382, -1046, 493, 133, 594, 1611, -58, 801, 2326, -213, 593, 1117, -494, 873, -488, -1466, 482, -1412, -1530, 105, -1453, -689, -17, -1234, 667, 896, -761, 1605, 731, 366, 1911, 173, 435, 1422, -472, 80, 418, -1301, -98, -647, -1840, -345, -1109, -1345, 124, -1042, 251, 863, -593, 729, 1977, -29, 1257, 980, 436, 1471, -268, -407, 1143, -930, -1125, 115, -1253, -734, -947, -1740, -23, -471, -1331, 920, 238, 133, 1340]
1621A340j244Q47P15k100J754k9j703Q14q34l60R79j747M12J087j475Q62Q96j477
1639a263J422K58n77J469q39k86J974k150L31J110j553J31k29p66P44o06r46J714
1657f2r34j81J019n44O38N88j058J439L26j134J381o58o80Q65r84J81J31j318
1675i85J40Q57j630O38K47l12J076n69j06J813j415J89J444q26N76j57q10J021
1693A191o16j062J055p97n20O05j192M34J86p04J371p2q25J555l39k41J036p80
1711B85P2J193j593M15N19j280N92m31q54R93q08m35J464j504M80Q99r29J004
1729H2M95q85J568n55m40J394q87n57Q99j202L18k3j314J224n70j223J533m51
1747e94m81J091p29J97J365j367J251N37j307J081Rr18J156j327j63Q31j321M1
$$ y = [1340, 96, 943, 1658, -442, 1312, 1283, -420, 394, -440, -800, 179, -1568, -1156, -69, -1544, -682, 214, -1263, 159, 417, -160, 1309, 470, 184, 2158, 8, 339, 1449, -104, 27, -202, -968, -224, -830, -1776, -62, -996, -1177, -158, -702, -64, 524, -534, 905, 1231, 97, 1478, 820, 140, 1005, 21, 202, 333, -985, -845, 12, -1618, -980, -733, -1045, 31, -538, -644, 1169, -246, -57, 1387, 561, 1137, 980, 170, 1191, 575, -487, 568, -229, -749, -144, -1336, -902, -716, -1420, -49, -121, -946, 609, 270, 29, 1065, 285, 357, 1550, -43, 372, 891, -389, 203, -228, -1082, -89, -897, -1332, 132, -1372, -892, 7, -922, 82, 577, -308, 1260, 705, 265, 1659, 772, 215, 1114, -88, 230, 207, -1107, 117, -453, -1676, -143, -594, -1075, 16, -713, -516, 849, -518, 733, 1270, -37, 1044, 1053, 135, 1291, -36, -199, 632, -689, -648]
1765f48R89j722O21J0m58J143j31p76J467m99NJ322j295R01L91j615J436o11p33
1784b03Q58p58j015J128j041j40J091j505J187O39j322J443J1q20J573o92j82
1801B52J300j313J27P83j301O23o66q16J155o65r76J556q04n43J366q77P43O51
1819E95j101J365R6r88J151j07r40J235j040j20P82j826O23K09j175P26L5o36
1837a116J003l16l17J494j343N40J594j386M14O70j250J082p99o98J272j316n79
1854a051Q59p64j1O90j070J142O2q69R84M88o99R98k72K18P49j235L67M87j475
1873d02N53J67j175J095r59l86J134p76k16J201j067P73N50q18J205j46o34J211
1891A310o85o61J403j118l08O96j298M54K43j737J934n35r45J247o08L09Q20r99
$$ y = [-648, 341, -1381, -760, -750, -1208, -65, -196, -972, 495, -4, 1, 1323, 28, 929, 1320, -295, 1141, 530, -203, 655, -103, -1118, 10, -1031, -1171, -80, -1585, -398, 241, -1081, 362, 373, -447, 1126, 434, 252, 1552, 239, 366, 1149, -152, 471, -195, -1011, 144, -521, -1497, 59, -745, -1288, 78, -799, -56, 595, -506, 859, 955, -33, 1118, 1011, 71, 1306, 266, 146, 928, -898, -275, -66, -1241, -515, -480, -1116, -113, -429, -746, 748, -595, -55, 1539, 153, 567, 1237, -13, 1069, 270, -428, 844, -472, -1051, -192, -956, -967, -277, -1347, -205, -143, -1012, -28, 460, -239, 759, 487, 705, 1454, 219, 586, 1073, -402, 151, 318, -857, 238, -721, -1107, 27, -749, -965, 236, -831, -58, 492, -326, 879, 733, 99, 1310, 625, -36, 1367, 249, -59, 637, -661, -207, 36, -1701, 233, -302, -1247, 0, -608, -299, 521, -478]
1909d78O70J044j125M16M38o66Q61r12l33P58j015k93N44j043N23M16j046J040
1927b01o7m15Q23l98K52J114q51J93Q30q40K24j57o49N11m47p38R78p44k49N00
1947c31o25N33K13o02R28L22m25O66j78r6R92j170K00R29j319J83L2j028R87m42
1967b31r84J068l95o11J052n85K85R26j144J193L41p49P06j50n18R64j020k33
1985h5Q10r12k46O70j218Q57k75j011J215j15m68J155m23K57Q52j200P17L86p36
2004B30O54m79o32R86j054p54J524j241K27K76o85R27L5r94J169K55p42J127n63
2023B66M33N64j289L97O68r93L19k96n35R28j157j04R36q67l12J027r99P41M89
2042B16o46J116L41j043R04l33j2O66j676M45R02j547K15L59p26P93o87l27J186
$$ y = [-478, 192, 1236, 111, 527, 965, 299, 1160, 248, -85, 673, -342, -635, -91, -1134, -611, -195, -1241, -201, -268, -683, 140, -258, -6, 1108, 257, 450, 1280, 440, 664, 507, -142, 369, -78, -816, 162, -582, -831, -331, -956, -423, -210, -812, 116, 438, 13, 679, 501, 405, 1397, 227, 427, 1356, 37, 220, 252, -776, 211, -231, -1215, -147, -542, -1153, -101, -686, -401, 525, -619, 574, 915, 166, 872, 722, 204, 1168, 148, -85, 725, -187, -433, 237, -981, -124, -399, -1410, -195, -310, -778, 377, -46, 211, 1063, -137, 580, 966, 230, 884, 405, -227, 759, -295, -1049, 475, -766, -539, -263, -948, -21, 14, -980, 189, 444, -298, 829, 266, 699, 1263, -26, 371, 1039, 46, 365, 69, -466, 462, -695, -799, 137, -730, -1042, -15, -1014, -273, 216, -430, 686, 1027, -16, 888, 555, 543, 1209, -467, -22, 880, -667, -452, -93, -819, -26, -713, -1040, 146]
2061A46n06l67J423j029J90J084j136R62o3q92J042l02m81K90o39j34M98j162
2079a076M09O75j055P78M22j083J509l01q23J379n64K71P02j106L91O49j395N36
2097C18j41r21Q12r22n3J186j134KQ05r91J008M33r32J388K11j170J354o16l70
2116B67N89p23l3J16q93M06J41q92P17k85j52O48n80O08O09q71M65Q12p19L33
2136E63L45p70Q52m35o96R05j141J3O22q35J36J65p04P91O1p89J267l19r1N69
2156E09k84L53M45r98O00Pr22Q55l92o34Q06j002J26N24r40K04Q36o78N12N88
2176E15n86P55m96p0R36p27m19J133q32l26J27l40N13m98o18R38m09l54M95r1
2196c54L19L75p34O71J65m39P67l13l50O84r70L99K53j164M81M70r14J57K83l57
$$ y = [146, -360, -727, 696, -333, -143, 941, -195, 767, 704, -188, 854, 552, 71, 361, -278, -412, 86, -1076, -667, 8, -1047, -269, 153, -930, 579, 278, -545, 834, 270, 541, 1243, 137, 528, 1177, -218, 318, 177, -744, 68, -854, -907, 279, -855, -853, -48, -1039, -31, 402, -530, 858, 1069, -101, 1253, 637, 267, 856, 133, 100, 216, -677, -271, -130, -1022, -305, -590, -742, -94, -674, -66, 543, -328, 137, 949, 230, 563, 908, 138, 990, 555, -141, 764, -377, -364, 258, -577, -441, -276, -980, -189, -128, -917, 350, 31, -60, 509, 225, 578, 1023, 25, 625, 632, -290, 565, 173, -461, 345, -657, -531, -7, -947, -743, 93, -585, -73, 515, -71, 684, 188, 118, 1054, 327, -92, 1041, 209, -117, 10, -330, 183, -315, -933, 5, -404, -758, -263, -354, -35, 340, -394, 277, 442, 3, 770, 457, 107, 791, -179, 220, 473, -691, -210, 260, -654, -497, -214, -571]
2216e71O17n20j89P69l39k7Q19m41O27R8j113J157l73o74R93p99m06M56o16P4
2236d58J50n16O80K28r27J231j75o08J065n63K92K16o63L47O71j151L40Lo56O93
2256A99p14k07P19r70J69R94o83K34N46r60J068Qm10J054o64j93P67p21P8L7o25
2277b74O26n2j148P88k80n47O74m59M65O27q43P55L18n74K93L45p50P55l80n33
2297a94J011j161j25O15o20J72J64o19Q72m36m01J092o27O4O96m32P3N38q97M45
2317B30M53r62O46M5q26N06m76q9P08j209J95R38j088R65K10p10R43j73l69J021
2337I58q50L5J008j148J98J86p68L83j28m30N82p99k25J084l72j53P59q58P84
2356B46L06o69O35L21q04P56o70p3K43n06m1K49q24M08J24p16R29j28l81Q72n61
$$ y = [-571, 46, -474, -663, 106, -233, -260, 559, 118, 745, 843, -270, 887, 514, -160, 833, 34, -372, 84, -532, -458, -308, -824, -144, 84, -843, 388, 213, -395, 670, 107, 399, 615, -48, 299, 970, -181, 159, 162, -494, 199, -515, -722, -3, -973, -804, 190, -493, -259, 287, -673, 395, 403, -7, 1047, 383, 190, 957, 236, 314, 351, -274, 352, 300, -848, -60, -340, -887, -213, -672, -207, 420, -423, 332, 650, 76, 369, 714, -36, 719, 339, -194, 817, -344, -469, 146, -474, -302, -138, -757, 115, -321, -722, 370, -257, -193, 503, 71, 144, 682, -215, 230, 683, -279, 367, 412, -414, 92, -384, -473, 235, -974, -779, 159, -929, 36, 246, -464, 479, 306, -63, 958, 108, 143, 1151, 3, 201, 387, -381, 2, -126, -556, 26, -773, -998, 86, -286, -439, 320, -538, 246, 552, -117, 518, 839, 35, 791, 121, 48, 291, -215, -256, -7, -831, -423, -299, -1015, -86, -214, -595, 277, -284]
2377b84P2Q94o11K10N22n81M71o5o56N67m76n24O26n18o3K11n75N84K43o49O85
2398H3K09o34O69l29J40O90o58l5P03r65L19J20q56P86k83n70N05m47j94L94k69
2419f22M14L77o33O62L48p81Q72m44OO29q31J28M11r91N28j24q48Q30j86o19R30
2440E6m81L0M72m45N40M45o88N26L7l04L73k51j60M70p70rM23q13K66R3q10O86
2462c14Jl63N24K56m17P52l04J60M96p99K58O0m40M66m30m9M46o50k01P63r22
2483g07M27P0l55P37j95n34Q52o8l1M90l48r6P95r85J43n6l10K88l61k23Q20o50
2505b97m29Q38n44Q7N72n27O52l3o15Q26j78l41N49q3k83K46n29p4M02j077O10
2526b28j21n04N48J7j22N97l48j15R02q43O02J95n88N75O2p60N87l25l73N88n59
$$ y = [-284, -212, 682, 71, 281, 803, 222, 693, 628, -28, 539, 63, -461, 165, -353, -416, -205, -780, -196, 47, -602, 83, 292, -342, 327, -2, 138, 828, 170, 135, 838, -127, 192, 312, -544, 242, -41, -611, -106, -553, -747, -353, -622, -208, 169, -464, 198, 546, -235, 637, 193, 199, 828, -3, 125, 536, -455, 73, -51, -899, -69, -255, -874, 56, -425, -395, 77, -368, 172, 617, -71, 455, 492, 188, 561, 310, 150, 620, -150, -159, 264, -549, -283, -190, -1000, -314, -313, -676, -152, 104, -313, 439, 135, 295, 791, -8, 250, 310, -130, 336, -94, -143, 303, -347, -548, 215, -707, -280, -210, -565, 172, -23, -557, 295, 227, 196, 686, 338, 242, 1037, 52, 195, 139, -171, 117, -244, -467, 353, -297, -726, 112, -432, -345, 227, -300, 352, 319, -296, 530, 352, 11, 560, 477, 194, 440, -89, -163, 239, -838, -228, -349, -853, -305, -288, -410, 187, -161, -276, 626, -217, 385, 580, -8, 567, 629, -131, 456, 131, -242, 346, -213]
2547b13k40P14q05M65p7l84L42k0k25J173p11J9Q14q76N11K35p73L07J58o53K20
2568a9m6o29Q21o60j6K09r5J01P02o84M14J70m19O33j67k39L64l05k72O78j135
2589e94M64K27p17L18p8j97O62m41l77R99n68RM70j07N96j03n81N11P0q46R19
2610F36n09j20J97o92L19L8o17L73L63o79R24l62l03Q63l42L9P62r21L89K31n33
2631E6K49k01j08J77n99J37L03o30J46N70k91j07K40m81Q59J96p93J090j73n02
2651A38N60o96J32M11r80O57j93k69J20j78K9K59k41k27P54p21N66J48l59L11
2671B21Q1k07P30o18m8M98p97P3K67l39K37j55o17N48k25k21Q04m75K17L95j70
2692A99K9L70o31M24J2o09P80n32P0j60k1k10L28r89N13N17p70P33p4n9L11j73
$$ y = [-213, -453, 261, -544, -79, -156, -540, -198, -218, -443, 730, 19, 38, 852, -24, 487, 722, -51, 256, 414, -239, -19, -65, -694, 127, -533, -549, -340, -435, -334, 368, -316, 98, 268, -151, 482, 315, 76, 440, 135, -137, 541, -594, -130, 97, -620, -302, -380, -577, 85, -356, -733, 266, -302, -293, 177, 70, 666, 563, -18, 493, 563, -283, 636, 127, 7, 204, -488, -169, -131, -748, -375, -12, -691, 233, -129, -432, 431, 89, 128, 890, -31, 358, 589, 56, 305, 104, -4, 173, -426, -289, 14, -616, -470, 100, -191, -298, -58, -539, 320, 516, -277, 813, 640, 138, 698, 2, 134, 545, -435, 222, 29, -240, -120, -298, -269, -10, -251, -478, 276, -445, 121, 269, -90, 221, 302, 95, 825, 207, 159, 657, -140, -67, 200, -139, 98, -57, -674, -126, -351, -572, 232, -243, -26, 369, 199, 228, 598, -33, 391, 403, -206, 574, 42, 112, -48, -69, -279, 49, -940, -427, 90, -680, 53, -21, -80, 231, 58]
2714E8m68J078o00P3L88m58O9J66n26L58m41j95N45m49Q5J83l29K58K03m48N62
2735A12p3O4M26n0m13N88l09j27J64n00j12L79o80K51J34m16P59l74k67M55l00
2756b89r3N51o0J90L3l89O37l89k62M41m07j11O69p72r4K09l64K23o5j96K30K77
2778c1j41N91n06R2Q29p74j16R95o99KO0m08N13p66j96O32n71P5M71n47M12J76
2800I3m93O63j38m59P65j73j95N40p24L10K57m26K02j89n10N30r4o45M82k22J56
2821b70M49n36L04J65l19L30J0K21J13M5n60P16p63k83O73k39l71N36j104O22
2841b61J52m66N66N6k71M68rl31L75k96K44L29l26J19Q7l78K93l63n53O88m58
2862c35O7N14p18L68%j39M65o2l86O60m44Q4N18o14r7O38q53L13R0o78P74j96
$$ y = [58, -410, 668, 68, 141, 529, 71, 140, 306, -220, 138, -303, -498, 47, -402, -317, -134, -463, -205, -2, -450, 112, 39, 103, 529, 479, 66, 654, 345, 218, 382, -118, -230, 149, -531, -280, -146, -562, 197, -177, -444, 11, -289, -382, 169, 109, 299, 332, -57, 580, 191, -71, 370, -37, -148, 521, -251, -345, -136, -500, -277, -342, -538, -308, -31, -172, 419, -87, 5, 834, 60, -56, 939, 240, 242, 302, -106, 407, -359, -555, 77, -494, -419, 52, -495, -83, 93, -400, 263, 125, -334, 431, 258, 63, 603, -121, 189, 446, 20, 222, 33, -477, 53, -41, -686, -204, -426, -270, 179, -357, -53, 112, -207, 123, 133, 354, 467, 512, -48, 668, -95, -378, 295, 56, -315, 221, -883, -261, -109, -575, -9, 47, -224, 244, 235, -96, 279, -17, 227, 556, 230, 349, 436, 58, 351, -12, -565, 123, -335, -268, 246, -472, -104, -104, -243, 222, 160, -226, 434, -10, 74, 592, -22, -119, 519, -334, -21, 69, -609, 165, -31]
2884c1l35K93r9j39L50l73M38K77o23P08om85N42k88q6K65p08J70L04l20L0r4
2906b10j37N62n25l08R25k71k46L17Q2J2K55o28O48J2k92K01l60j75J92l60L48
2927D2j30l88J04M51p79P81k14k87O37m01K63L17k05O9M42m56M6j13q2K11n05
2948a97n0M06m34k05M97k41j48L05k54K72m8l2N44j95k5K50j74j77K22m50K9L03
2970A98l17j4N6j12K05j76m33N45o3j44O72m62J50J82m10O52m44n6K73l75N8J48
2992A33l80J20j26j33L47k86l09R95m01k78K16o6J32M26l32K91J45o01M08K00
$$ y = [-31, -366, -73, -172, -311, 39, -334, 104, 381, -242, 466, 460, -25, 517, 229, 143, 408, -300, -130, 174, -146, -116, -210, -347, 215, -310, -618, 307, 36, -210, 107, 189, 201, 456, -172, 476, 488, 196, 397, 37, -138, 54, -306, 42, -88, -476, -372, 79, -700, 81, -133, -420, 217, -184, 79, 396, 191, 260, 702, 246, 292, 179, 97, 308, -197, -247, 159, -275, -480, 17, -224, -372, -67, -321, -49, -97, -129, 415, 220, 195, 445, 271, 94, 316, -134, -105, 198, -119, -133, -77, -189, 16, -160, -593, -48, -111, -255, 417, -45, 105, 287, -123, 529, 85, 29, 302, -73, -15, 133, -247, -127, -253, -386, -39, -325, -634, 361, -40, -318, -102, -168, -36, 390, 58, 349, 494, -107, 301, 501]
$$ [...]
8191C3
##END NTUPLES=NMR FID
##END=
