##TITLE=1H_Pr NCS 1
 CDCl3
 8 sc, 
 19.09.2022
##JCAMPDX= 6.0         $$ Bruker NMR JCAMP-DX V2.0
##DATA TYPE= NMR FID
##DATA CLASS= NTUPLES
##ORIGIN= UXNMR, Bruker Analytische Messtechnik GmbH
##OWNER= root
$$ XWIN-NMR		Version 3.5
$$ Mon Sep 19 14:29:22 2022 Russian Standard Time (UT+4h)  she@DPX200
##.OBSERVE FREQUENCY= 200.1313499994
##.OBSERVE NUCLEUS= ^1H
##.DELAY= (6, 6)
##.ACQUISITION MODE= SIMULTANEOUS
##.ACQUISITION SCHEME= undefined
##.AVERAGES= 8
##.DIGITISER RES= 18
##SPECTROMETER/DATA SYSTEM= spect
##.PULSE SEQUENCE= zg30
##.SOLVENT NAME= CDCl3
##.SHIFT REFERENCE= (INTERNAL, CDCl3, 0, 15.7039)
##AUDIT TRAIL= $$ (NUMBER, WHEN, WHO, WHERE, WHAT)
$$ ##TITLE= Audit trail, XWIN-NMR		Version 3.5
$$ ##JCAMPDX= 5.01
$$ ##ORIGIN= Bruker BioSpin GmbH
$$ ##OWNER= she
$$ F:/spectra/data/she/nmr/H-F/1/audita.txt
$$ ##AUDIT TRAIL=  $$ (NUMBER, WHEN, WHO, WHERE, WHAT)
(   1,<2022-09-19 14:28:26.70 +0400>,<she>,<DPX200>,
      <created by zg, POWCHK disabled, PULCHK disabled
       configuration hash MD5:
       00 E9 B6 7A A2 85 ED C7 34 08 36 98 17 FE 4E 26
       data hash MD5: 16K
       26 1B B6 CC 05 CC 30 A9 E6 5B 4B 34 FC 52 6B 73>)
$$ ##END=
$$ 
$$ hash MD5
$$ 6E 09 9D 0D 0D 78 69 C6 7D DC 32 32 4A 5C 60 14
##$RELAX= 
##$RELAX= 
##$RELAX= 
##$RELAX= 
##$RELAX= 
##$RELAX= 
$$ Bruker specific parameters
$$ --------------------------
##$DU= <F:/spectra>
##$EXPNO= 1
##$NAME= <H-F>
##$PROCNO= 1
##$TYPE= <nmr>
##$USER= <she>
##$AMP= (0..31)
100 100 100 100 100 100 100 100 100 100 100 100 100 100 100 100 100 100 
100 100 100 100 100 100 100 100 100 100 100 100 100 100 
##$AQSEQ= 0
##$AQ_mod= 1
##$AUNM= <au_zg>
##$AUTOPOS= <>
##$BF1= 200.13
##$BF2= 200.13
##$BF3= 200.13
##$BF4= 200.13
##$BF5= 200.13
##$BF6= 200.13
##$BF7= 200.13
##$BF8= 200.13
##$BYTORDA= 1
##$CFDGTYP= 0
##$CFRGTYP= 5
##$CHEMSTR= <none>
##$CNST= (0..31)
1 1 145 1 1 1 1 1 1 1 1 1 1 1 1 1 1 1 1 1 1 1 1 1 1 1 1 1 1 1 1 1 
##$CPDPRG= <>
##$CPDPRG1= <>
##$CPDPRG2= <>
##$CPDPRG3= <>
##$CPDPRG4= <mlev>
##$CPDPRG5= <mlev>
##$CPDPRG6= <mlev>
##$CPDPRG7= <mlev>
##$CPDPRG8= <mlev>
##$CPDPRGB= <>
##$CPDPRGT= <>
##$D= (0..31)
0 1.2 0 0 0 0 0 0 0 0.06 0 0.03 0 0 0 0 0.0002 0 0 0 0 0 0 0 0 0 0 0 0 
0 0 0 
##$DATE= 1663583306
##$DBL= (0..7)
120 120 120 120 120 120 120 120 
##$DBP= (0..7)
150 150 150 150 150 150 150 150 
##$DBP07= 0
##$DBPNAM0= <>
##$DBPNAM1= <>
##$DBPNAM2= <>
##$DBPNAM3= <>
##$DBPNAM4= <>
##$DBPNAM5= <>
##$DBPNAM6= <>
##$DBPNAM7= <>
##$DBPOAL= (0..7)
0.5 0.5 0.5 0.5 0.5 0.5 0.5 0.5 
##$DBPOFFS= (0..7)
0 0 0 0 0 0 0 0 
##$DE= 6
##$DECBNUC= <off>
##$DECIM= 32
##$DECNUC= <off>
##$DECSTAT= 4
##$DIGMOD= 1
##$DIGTYP= 9
##$DL= (0..7)
0 120 120 120 120 120 120 120 
##$DP= (0..7)
150 150 150 150 150 150 150 150 
##$DP07= 0
##$DPNAME0= <>
##$DPNAME1= <>
##$DPNAME2= <>
##$DPNAME3= <>
##$DPNAME4= <>
##$DPNAME5= <>
##$DPNAME6= <>
##$DPNAME7= <>
##$DPOAL= (0..7)
0.5 0.5 0.5 0.5 0.5 0.5 0.5 0.5 
##$DPOFFS= (0..7)
0 0 0 0 0 0 0 0 
##$DQDMODE= 0
##$DR= 18
##$DS= 0
##$DSLIST= <SSSSSSSSSSSSSSS>
$$ [...]
##$SUBNAM2= <"">
##$SUBNAM3= <"">
##$SUBNAM4= <"">
##$SUBNAM5= <"">
##$SUBNAM6= <"">
##$SUBNAM7= <"">
##$SUBNAM8= <"">
##$SUBNAM9= <"">
##$SW= 18.0517283424941
##$SWIBOX= (0..15)
0 0 2 0 0 0 0 0 0 0 0 0 0 0 0 0 
##$SW_h= 3612.71676300578
##$TD= 16384
##$TD0= 1
##$TE= 0
##$TE2= 300
##$TE3= 300
##$TEG= 300
##$TL= (0..7)
0 120 120 120 120 120 120 120 
##$TP= (0..7)
150 150 150 150 150 150 150 150 
##$TP07= 0
##$TPNAME0= <>
##$TPNAME1= <>
##$TPNAME2= <>
##$TPNAME3= <>
##$TPNAME4= <>
##$TPNAME5= <>
##$TPNAME6= <>
##$TPNAME7= <>
##$TPOAL= (0..7)
0.5 0.5 0.5 0.5 0.5 0.5 0.5 0.5 
##$TPOFFS= (0..7)
0 0 0 0 0 0 0 0 
##$TUNHIN= 0
##$TUNHOUT= 0
##$TUNXOUT= 0
##$USERA1= <user>
##$USERA2= <user>
##$USERA3= <user>
##$USERA4= <user>
##$USERA5= <user>
##$V9= 5
##$VALIST= <valist>
##$VCLIST= <CCCCCCCCCCCCCCC>
##$VD= 0
##$VDLIST= <DDDDDDDDDDDDDDD>
##$VPLIST= <PPPPPPPPPPPPPPP>
##$VTLIST= <TTTTTTTTTTTTTTT>
##$WBST= 1024
##$WBSW= 4
##$XGAIN= (0..3)
0 0 0 0 
##$XL= 0
##$YL= 0
##$YMAX_a= 94733
##$YMIN_a= -160505
##$ZGOPTNS= <>
##$ZL1= 120
##$ZL2= 120
##$ZL3= 120
##$ZL4= 120
##$ABSF1= 10
##$ABSF2= 0
##$ABSG= 5
##$ABSL= 3
##$ALPHA= 0
##$AQORDER= 0
##$ASSFAC= 0
##$ASSFACI= 0
##$ASSFACX= 0
##$ASSWID= 0
##$AUNMP= <proc_1d>
##$AZFE= 0.1
##$AZFW= 0.1
##$BCFW= 1
##$BC_mod= 2
##$BYTORDP= 1
##$COROFFS= 0
##$CY= 11.3945322036743
##$DATMOD= 1
##$DC= 2
##$DFILT= <>
##$DTYPP= 0
##$F1P= 2.36226072786647
##$F2P= -0.459571619588291
##$FCOR= 0.5
##$FTSIZE= 0
##$FT_mod= 4
##$GAMMA= 1
##$GB= 0.15
##$INTBC= 1
##$INTSCL= 1
##$ISEN= 128
##$LB= 0.24
##$LEV0= 0
##$LPBIN= 0
##$MAXI= 10000
##$MC2= 0
##$MEAN= 0
##$ME_mod= 0
##$MI= 1.114404
##$NCOEF= 0
##$NC_proc= 0
##$NLEV= 6
##$NOISF1= 3.799351
##$NOISF2= 2.8
##$NSP= 1
##$NTH_PI= 0
##$NZP= 0
##$OFFSET= 15.70392
##$PC= 1
##$PHC0= -18036.4
##$PHC1= 18.60069
##$PH_mod= 1
##$PKNL= yes
##$PPARMOD= 0
##$PSCAL= 0
##$PSIGN= 0
##$REVERSE= no
##$SF= 200.130013532006
##$SI= 16384
##$SIGF1= 3
##$SIGF2= 2
##$SINO= 400
##$SIOLD= 16384
##$SREGLST= <1H.CDCl3>
##$SSB= 0
##$STSI= 0
##$STSR= 0
##$SW_p= 3612.71676300578
##$SYMM= 0
##$S_DEV= 0
##$TDeff= 0
##$TDoff= 0
##$TI= <>
##$TILT= no
##$TM1= 0
##$TM2= 0
##$TOPLEV= 0
##$USERP1= <user>
##$USERP2= <user>
##$USERP3= <user>
##$USERP4= <user>
##$USERP5= <user>
##$WDW= 1
##$XDIM= 8192
##$YMAX_p= 0
##$YMIN_p= 0
$$ End of Bruker specific parameters
$$ ---------------------------------
##NTUPLES= NMR FID
##VAR_NAME=  TIME,          FID/REAL,        FID/IMAG
##SYMBOL=    X,             R,               I
##VAR_TYPE=  INDEPENDENT,   DEPENDENT,       DEPENDENT
##VAR_FORM=  AFFN,          ASDF,            ASDF
##VAR_DIM=   8192,          8192,            8192
##UNITS=     SECONDS,       ARBITRARY UNITS, ARBITRARY UNITS
##FACTOR=    0.0002768,     1,               1
##FIRST=     0,             0,               0
##LAST=      2.2672688,     0,               0
##MIN=       0,             -160505,         0
##MAX=       2.2672688,     94733,           0
$$ Real data points
##PAGE= N=1
##DATA TABLE= (X++(R..R)), XYDATA
0 0 0 0 0 0 0 0 0 0 0 0 0 0 0 8 -8 8 -8 11 -16 16 -24 24 -32 32 -40 48 -56 64 -74 88 -98 112 -128 144 -164
35 -164 184 -207 233 -260 289 -323 360 -400 440 -488 539 -596 656 -723 796 -877 965 -1066
53 -1066 1175 -1300 1437 -1594 1775 -1984 2230 -2525 2882 -3334 3916 -4705 5835 -7604 10787
68 10787 -18296 77353 -17015 -128752 51047 59209 -12300 -5073 16240 -40009 1377 43430
80 43430 -13311 -43980 -794 6008 3506 9883 -15144 -39475 11334 18076 -19658 -5369 18869
93 18869 -9758 -9339 31052 5553 -27882 19134 26381 -22070 -8101 36494 -5271 -34555 23496
106 23496 31068 -23688 -19522 19487 5972 -15678 562 2726 -5631 -5105 -4860 2740 4915 -6706
120 -6706 -3009 17792 -1508 -26826 10405 26406 -19102 -23993 24824 18212 -24348 -5746 18555
133 18555 -1373 -6666 9729 2436 -10045 5780 6401 -9776 -1209 10715 649 -6982 1992
146 1992 3392 1715 1877 -9650 -7307 10692 4710 -13777 -4809 6480 -6964 44 15004 -9148
160 -9148 -21951 12812 23969 -12635 -18683 9277 10577 -690 1717 1442 -3896 5267 12091 -755
174 -755 -7487 -685 4880 4045 -1934 -5258 -1321 1469 -4292 -3424 3675 -2892 -10479 -1306 6604 -4335
190 -4335 -9710 814 3648 -1217 592 2161 -479 878 4865 3072 1674 3091 1745 3091 5181
205 5181 228 -2109 3636 2361 -3556 1313 1795 -6429 -3488 3898 -4400 -9532 1573 2055 -9137
220 -9137 -3807 5595 -2284 -6304 2514 3121 -2113 2133 3022 -690 2555 6372 375 -1345 6408 4470
236 4470 -1273 1344 2812 -522 983 1285 -4997 -3330 3882 -1209 -7468 -2286 1035 -4021 -3314 678
252 678 -2707 -3308 1159 299 -2637 36 2208 985 2972 3151 493 2313 4760 2301 834 2476
268 2476 543 -90 2220 458 -2289 454 1172 -2345 -2497 -95 -2669 -4245 -1168 -1686 -4122 -2146
284 -2146 -662 -2019 157 1624 -1107 78 3510 1477 -1220 2431 4028 221 1299 3464 1580
299 1580 1045 3632 1515 -1066 1368 1598 -3011 -2807 242 -1546 -3043 -962 -1924 -2643 -449 -1042 -2950
316 -2950 -1063 3 -2173 -1324 1047 -172 -153 3031 2559 388 2314 3998 895 773 2164 918
332 918 -5 1550 577 -506 546 1309 -1012 -1270 -606 -1803 -2215 -1649 -2666 -2678 -394 -1063 -1894 -177
350 -177 1027 -758 312 1881 426 -802 1635 1520 13 1737 2211 1363 1792 3068 1200 -369
366 -369 943 539 -873 -1163 -1618 -2098 -645 -467 -1934 -1843 -467 -1468 -1863 -900 -1519 -2127 -736 89
384 89 -570 -307 1274 1651 1302 2175 1640 1091 1330 1574 877 1070 1062 869 859 695 -7 -376 230 -259 -1813
405 -1813 -1751 -1605 -1856 -1576 -1168 -2172 -2104 -254 279 -1107 -1132 380 586 303 120 -2 87 1438 2822
424 2822 1582 188 993 3001 2271 732 64 -122 373 1410 -318 -2075 -935 256 -869 -1222 -116
441 -116 -1890 -3153 -401 443 -2132 -2475 -584 -400 88 1196 -380 -1266 2284 2874 563 861 2571
458 2571 449 506 3453 1384 -2307 486 3468 305 -1687 -43 -364 -1477 -79 -1813 -3118 -663
474 -663 -334 -3611 -1944 1512 -671 -2800 582 1484 -318 1066 1669 -852 317 3024 1553 504
490 504 1852 1621 893 2258 677 -2248 357 2451 -886 -2946 -403 -757 -2370 -1215 -750 -2028
506 -2028 -446 -129 -2156 -1816 714 -238 -1908 915 962 -680 1647 3177 -363 247 3778 1889 -846
523 -846 1664 2077 -785 874 1935 -1289 -986 2211 -458 -2004 547 -427 -3855 -1914 505 -2749
539 -2749 -3052 -246 -472 -1472 1399 251 -3075 192 4358 1110 -1510 1183 1837 1080 2502 1599
555 1599 -771 1859 4288 832 -1501 743 -367 -1444 1062 -471 -3772 -907 2106 -1980 -3549
570 -3549 -324 -58 -1326 -592 -1356 -1916 1430 1080 -2726 208 3805 1372 -389 2250 1481 -265 1426
587 1426 1966 -299 65 1444 455 1389 1622 -2226 -2349 1952 873 -3105 -1162 113 -3480 -2013 1972
604 1972 -1117 -3580 897 1482 -1460 278 729 -2391 465 3769 -656 -2043 3549 3332 -953 650
620 650 2059 -613 1003 3019 -1428 -2445 1317 596 -2210 -213 11 -2640 -194 1948 -2783 -3626
636 -3626 1149 -292 -3392 310 2226 -1289 -789 1852 416 -104 2351 1281 -482 1867 1795 -804
652 -804 536 2293 -345 327 2371 -107 -1906 928 562 -2570 -946 282 -2437 -1473 595 -1749
668 -1749 -2421 1166 -145 -2777 2 1816 -1067 -656 2103 438 -525 2034 1625 -7 2190 2319
684 2319 -464 619 2582 -355 -1436 1589 268 -2066 311 549 -2649 -1551 1269 -1842 -2797 681
700 681 -147 -3186 -496 1026 -1828 -655 2264 201 -1026 1717 1684 -330 1358 1876 -58 780 2094
717 2094 176 -243 1807 1037 -852 104 400 -1386 -389 359 -1579 -1973 -89 -797 -2225 -210 112
734 112 -1485 -755 464 -408 -325 978 556 -28 1247 932 231 1451 1794 474 913 2022 379 -238
752 -238 1002 -39 -888 408 -182 -1778 -535 236 -1536 -1748 236 -1110 -2178 153 -254 -1688 -410
769 -410 634 -622 -409 1344 578 244 1725 1326 49 1104 1738 246 280 1427 685 -390 880
786 880 695 -847 -119 285 -1619 -1564 -471 -1112 -1969 -849 -173 -1211 -630 127 -562 -436 477 260 -20
805 -20 649 595 336 983 1529 1039 778 1292 809 400 365 75 2 130 -401 -645 -465 -453 -806 -819 -363 -979
827 -979 -871 -649 -940 -848 -557 -482 -614 139 797 616 507 1096 833 360 885 770 680 537 1096 629 131
848 131 503 358 222 412 -246 -1095 -947 -668 -1071 -1177 -704 -775 -966 -463 -252 -666 -453 276 -425 -387 -38
869 -38 229 179 617 979 1124 1298 1334 973 686 958 664 61 280 50 -578 -238 -15 -389 -1049 -617 -759
890 -759 -1372 -668 -870 -1328 -1134 -272 -660 -781 280 -4 207 943 928 55 307 1220 577 405 1240 751
910 751 788 808 814 -78 138 327 -278 -475 -360 -790 -936 -290 -697 -1289 -618 61 -796 -522 8 -426 -932 376
932 376 550 -539 348 958 266 405 985 998 483 919 936 76 538 377 -6 78 156 -752 -536 521 -444
953 -444 -1180 -540 -480 -1259 -639 -200 -1221 -719 418 -229 -717 711 727 -193 975 1343 -239 349 1955
972 1955 913 -347 872 1002 -97 328 862 -752 -374 705 -1470 -1008 670 -785 -2150 -101
988 -101 372 -2075 -1262 1010 -372 -1363 786 396 -1133 153 1316 99 396 1635 141 340 2004
1005 2004 967 -500 757 1405 -406 -140 620 -495 -870 219 -313 -1409 -8 87 -1533 -667 151
1022 151 -1448 -1474 575 -273 -1314 481 878 -318 561 1235 222 358 1289 539 667 1051 -1 -31
1040 -31 1425 980 -1060 88 1227 -662 -1067 252 -883 -1799 -45 54 -1867 -804 692 -994 -1350
1057 -1350 367 -278 -1184 676 850 -841 -150 1532 347 70 2073 1229 -407 1339 1467 -1216 -416
1074 -416 1728 -463 -1166 1283 -67 -2245 -132 1230 -1700 -1399 434 -948 -2264 220 116 -1615
1090 -1615 -189 1228 -419 -195 1268 342 -199 1308 1240 -228 864 1498 50 380 1439 41 -331
1107 -331 787 351 -1273 38 340 -1569 -1205 172 -806 -1406 -45 -150 -870 -394 132 -841 -644 331
1125 331 -379 214 772 370 495 1503 667 -111 1486 1182 -490 265 1087 -411 -542 626 -174 -1484
1143 -1484 461 783 -1383 -706 182 -1341 -1582 313 -566 -1436 242 512 -728 558 912 -448 -468
1160 -468 1636 458 -548 1440 1050 -1015 762 1873 -177 -165 1577 347 -1370 30 662 -1268
1176 -1268 -724 537 -984 -1302 44 -215 -1295 -130 -23 -603 -29 201 -534 -435 713 189 121 921
1194 921 805 23 1090 1054 -112 526 918 209 -309 527 36 -676 -108 17 -809 -322 -631 -1067 -807 -323
1214 -323 -1125 -668 -138 -787 -1068 557 441 -670 756 1306 -85 -120 1332 565 -347 815 1070 -179
1232 -179 479 1110 122 -141 553 203 -943 -57 200 -1092 -685 -58 -758 -962 113 -372 -993 -127 283
1251 283 -696 -305 678 -208 87 1030 630 -208 848 1307 176 196 804 367 -318 616 390 212 -36 275
1271 275 -418 -434 -151 -497 -583 -898 -719 -740 -487 -667 -273 -208 -146 -233 -69 310 300 352 528 510 366 436 617
1294 617 493 622 533 562 320 350 -137 -300 -133 -275 -544 -479 -521 -546 -463 -239 -283 -456 1 -295 -709 -9 189
1317 189 -121 -114 516 388 329 805 911 378 686 699 279 274 246 -186 46 63 -203 -218 -332 -145 -358 -431 -703
1340 -703 -718 -659 -535 -403 -569 -684 -33 -192 -315 -70 381 433 151 575 379 111 239 844 371 202 772
1361 772 511 69 338 385 -202 -380 -340 -592 -388 -472 -386 -893 -609 38 -321 -356 -438 -454 -224 -188 43 14 146
1384 146 571 289 470 488 582 410 312 623 230 293 404 323 36 218 -58 0 -237 -173 -235 -415 -599 -744 -420
1407 -420 -457 -490 -361 -116 -291 -226 -128 135 199 410 355 420 302 499 558 443 415 343 469 453 92 140 79 -44
1431 -44 -200 -194 -354 -711 -636 -345 -597 -567 -435 -175 -266 -18 -82 -233 -222 153 269 341 387 490 573 622 324 459
1455 459 698 141 443 515 299 -161 105 254 -313 -373 -61 -495 -712 -373 -361 -728 -719 -328 -21 -406 -238 161
1477 161 41 117 460 10 257 579 175 -60 789 554 45 492 914 121 -82 796 -213 -373 316 -8
1497 -8 -993 -382 149 -669 -872 -110 -424 -991 -88 -143 -664 -164 250 -123 -46 313 295 -204 559 551 100 664
1519 664 569 234 -41 820 -155 -101 664 -55 -651 152 180 -710 -655 -1 -784 -858 -58 -225 -953 -76 -21 -278
1541 -278 78 289 -273 -300 757 292 -24 956 470 -225 625 958 -309 30 1272 96 -532 477 72
1560 72 -973 -101 757 -641 -494 218 -619 -871 200 -202 -875 60 76 -627 -210 717 -304 214 848
1579 848 360 -216 988 982 -94 352 815 -208 -396 603 232 -290 468 443 -381 -143 294 -850 -672 55
1599 55 -573 -941 -287 -108 -895 164 284 -320 -78 875 -163 -299 786 481 -302 840 1000 12 485
1618 485 883 50 -18 832 341 -674 81 202 -1106 -421 496 -608 -755 30 -158 -791 157 95 -821 -151
1638 -151 634 -263 -213 977 264 -247 927 869 -309 328 1279 365 -409 1008 49 -574 410 230 -530
1657 -530 7 306 -610 -567 449 -444 -991 202 -309 -948 -132 388 -612 -54 1032 -29 -426 791
1675 791 287 -560 571 1234 -108 161 1249 187 -115 543 148 -432 137 330 -888 -315 377 -728
1693 -728 -790 190 -332 -1121 46 119 -1151 -502 335 -609 -383 772 202 -570 545 807 -210 194 843
1712 843 191 -79 708 510 -497 437 477 -429 114 374 -517 -517 437 -677 -867 165 -194 -926 -164 98
1732 98 -675 -248 551 -113 -230 611 445 -244 169 636 -223 52 516 442 159 565 183 -151 329 244 -369
1753 -369 27 189 -508 -394 33 -211 -601 -316 -74 -841 -203 51 -427 -391 327 153 -409 281 644 -22
1773 -22 326 504 125 174 496 36 86 555 108 -228 312 324 -362 -359 20 -556 -597 -133 -277 -576 -314 -195
1795 -195 -545 -247 25 3 -152 194 130 38 297 457 53 339 498 357 144 216 298 307 255 28 -135 -91 -136
1818 -136 -152 -275 106 -47 -237 -324 -385 -331 -241 -367 -314 -87 -101 -118 -71 306 352 116 494 228 56 181 323
1841 323 227 374 149 210 75 482 256 -219 100 70 -455 -469 -157 -511 -586 -133 -119 -245 -59 -352 -228 -149
1863 -149 248 130 -44 -284 149 -16 597 129 393 518 344 381 222 205 105 -125 -55 10 196 -296 -436
1884 -436 -286 -557 -11 -210 -393 -448 -194 -305 -396 -199 -144 17 213 -11 121 387 232 188 61 259 268 476
1906 476 201 249 306 393 192 -42 -22 -99 -227 -125 -65 -245 -192 -288 -453 -340 -141 -34 -261 -19 -102 -87 103
1929 103 181 16 115 190 89 54 582 614 299 95 417 185 -130 122 12 12 -218 -41 -184 -62 -180 -214 -170
1952 -170 -298 -552 -310 -221 -467 -115 -68 -304 -8 530 362 193 295 188 231 465 232 62 350 93 119
1973 119 -44 247 76 158 21 -140 -171 -189 -328 -168 -432 -307 -36 -424 -371 65 -228 -20 -100 -167 -136 -51 71
1996 71 347 277 207 175 291 251 119 565 354 243 70 244 -72 -433 201 125 -82 -19 -257 -326 -387 -167 -614
2019 -614 -511 -234 -345 -274 95 -323 58 178 -45 233 293 332 233 393 269 118 -67 248 399 36 217
2040 217 53 33 -26 123 -327 -400 -108 -27 -360 -135 -87 -379 72 -167 -219 -16 224 -211 -153 489 179 -121
2062 -121 291 537 -19 398 526 -163 -156 416 309 -164 251 19 -323 -42 56 -357 -419 98 -381 -493 -201
2083 -201 0 -430 -10 22 -327 -291 593 1 -218 263 302 -192 39 520 -145 -68 460 52 -46 526 164 -247
2105 -247 135 332 -512 -381 -106 -412 -400 -156 -256 -319 -169 -132 -242 -172 31 -100 -222 237 164 -219 276 213
2127 213 -85 243 333 275 181 621 297 -262 -32 304 -351 70 -294 -273 -271 29 -326 -446 -184 -147 -508 -315
2149 -315 138 -372 -332 360 7 -211 121 388 -202 394 342 -156 127 346 159 -224 271 -7 -267 284 345
2170 345 -396 -173 167 -553 -506 446 -415 -324 -31 298 -154 -221 451 -208 -286 267 232 -190 370 359 -186 177
2192 177 463 296 -86 318 141 -18 337 207 -270 46 111 36 -310 245 -24 -369 168 127 -439 -341 -42
2213 -42 -438 -346 384 -55 -185 271 313 -78 61 389 -447 -311 309 -22 38 358 148 -6 183 533 -350
2234 -350 -176 249 -279 -390 172 -127 -537 -19 -43 -727 -137 424 -296 -255 112 -86 -513 25 221 -39 105
2255 105 605 177 -224 577 116 -207 262 389 -130 49 267 -168 -254 138 257 -429 22 -48 -607 -466 87
2276 87 -416 -435 203 -211 -470 -146 20 -34 335 111 -272 -76 304 46 69 414 313 115 -10 273 -30
2297 -30 -74 100 3 -336 -94 -194 -414 58 -1 -363 -221 41 -363 -310 -188 -170 -294 77 266 -157 -68 395
2319 395 11 424 378 263 131 432 115 2 192 159 -235 -39 156 -277 -71 -248 203 -222 -268 -135 -59
2340 -59 -258 -9 -122 -161 -81 87 -147 101 205 -66 147 388 171 198 327 18 89 44 319 -16 -274 330
2362 330 -45 -80 -103 -31 -255 -29 -311 -333 -72 -248 -97 -237 -406 -173 -6 115 -201 -65 356 265 206 -43
2384 -43 203 184 58 -47 -20 307 16 163 41 241 -115 -156 -99 -131 -231 -328 -5 -357 -97 -227 -174 -92 -100 -91
2408 -91 -47 -172 -84 -258 -77 58 239 335 36 145 136 369 361 255 -40 277 101 -91 37 -74 6 44 -96
2431 -96 -57 -59 -181 -86 -282 -92 -334 -73 -92 66 121 109 38 24 -31 -38 300 152 -141 19 408 141 -3 94 62
2456 62 -13 200 -192 95 -52 -84 22 -283 -50 -313 -260 -163 -371 -257 -44 -205 -31 -162 115 -90 149 126
2478 126 -49 36 442 187 -43 38 2 113 44 171 -66 43 38 58 -237 108 -37 -204 -187 77 -349 50 -176
2501 -176 9 -212 78 -289 26 -197 10 -68 -173 142 -40 96 -6 107 134 108 179 90 -88 51 42 38 -23
2524 -23 128 -175 148 -60 -86 -447 167 -208 -298 -170 -121 -278 -387 151 -106 -43 153 99 -102 308 194 -29
2546 -29 161 142 340 151 117 -70 -78 225 61 49 -68 60 -31 103 -8 -105 -210 -239 18 -429 -461 68 -101
2569 -101 -28 183 59 -146 103 -176 -38 -59 -4 84 -5 -60 315 -218 57 172 86 27 227 -147 -148 165 -76
2592 -76 -321 -190 -117 -243 -160 -101 -33 -103 19 56 24 250 -26 -379 55 -5 -99 154 341 57 14 95 -51 -276
2616 -276 98 28 15 122 264 -303 255 140 -32 -438 -127 213 -348 -117 102 -442 -23 369 -302 -323 -10
2637 -10 -47 -53 9 263 143 241 218 -92 -67 -114 230 65 206 49 37 -105 437 -30 -68 189 11 -360 -77 35
2661 35 -324 -36 169 -273 -177 250 -267 -341 104 92 -49 209 214 -39 -57 333 148 -333 207 323 84 42 219
2684 219 -331 -294 17 -56 -656 104 281 -143 -166 216 -181 -205 -164 148 -114 14 -33 41 179 74 -267 150
2706 150 229 3 -212 97 129 -178 -94 78 136 -145 282 13 -228 212 112 -118 -34 -98 -175 -300 -40 -337
2728 -337 -186 -84 69 -12 67 24 -182 51 279 -201 27 229 218 -246 -79 342 -24 1 227 201 -9 203
2750 203 156 -158 119 -11 -60 -128 -121 -120 106 -217 -205 -193 -113 69 -133 166 39 -270 303 376 147 109 21 -121
2774 -121 49 261 326 -44 -91 277 60 -147 152 -109 -260 -5 -17 18 -70 -307 -174 -81 10 -360 -290 -93 222
2797 222 -170 -66 -32 -57 118 228 126 258 155 255 -333 -4 432 233 -68 205 63 -30 -170 29 -223
2818 -223 42 -10 77 124 -48 6 20 -313 -172 -65 -43 -30 -80 171 21 -64 -87 152 149 92 126 340 101 70 153
2843 153 297 148 -104 356 177 -254 100 -51 -75 234 -14 -227 -188 -83 -141 179 188 14 -147 -97 -69 -5 -42
2866 -42 141 339 255 -25 137 173 20 191 -3 126 -59 -83 32 39 7 -75 -256 -74 -46 -105 3 -92 119 -33
2890 -33 4 -18 -48 -57 -130 -97 68 -43 268 173 168 69 426 43 129 214 354 174 -36 212 112 130 -60 -29 -449
2915 -449 -6 99 41 235 166 91 -5 26 152 99 -211 -104 -98 -151 -114 75 229 -144 126 248 -207 14 111 174
2939 174 63 -38 -59 138 26 -137 -47 -186 72 -145 158 -158 -125 57 41 -203 -251 29 -66 31 7 87 77
2962 77 146 48 -76 173 -121 296 77 -92 57 186 -29 15 159 -78 211 -36 -84 -43 -162 -168 -91 -334 -325 -88
2986 -88 -73 -42 -25 129 133 85 90 4 68 -188 88 -72 55 58 94 175 29 58 -72 -88 -196 -16 -189 -96 208 -74
3012 -74 178 -7 -255 -105 -343 169 -91 128 -141 -53 -41 -259 14 -93 12 395 -202 108 175 -77 -10 59
3034 59 30 150 -96 352 -125 -211 -127 54 -52 9 -110 -67 -27 -192 54 243 118 -89 -175 3 2 -117 -225
3057 -225 235 220 137 24 -174 -59 -5 -196 268 77 146 77 -106 233 103 39 -158 67 25 -262 -95 -109 -1
3080 -1 -113 6 -80 -7 44 -21 92 145 -169 -49 -12 -115 -48 19 146 -23 -108 164 -76 81 -61 268 173 -469
3104 -469 -108 -7 14 37 86 -224 -190 -18 -102 -123 101 -300 -266 -16 127 -26 -31 -67 1 85 184 -223 -79 -99 169
3129 169 41 44 249 -145 238 24 -97 125 37 -92 -180 -175 47 -468 183 233 -108 -127 15 -126 -132 35 -156
3152 -156 -122 291 144 -65 228 133 -133 8 212 572 -147 32 315 -310 -155 190 -23 -299 13 211 -82
3173 -82 205 -58 -264 -143 78 -170 -199 188 -20 -252 47 53 -256 410 -43 26 -231 255 296 104 192 251 204
3196 204 171 414 119 -72 102 -45 28 -189 -4 -46 74 28 -40 -119 30 74 -230 -52 -26 154 -10 147 -61
3219 -61 112 187 136 -291 101 -101 94 -95 75 -274 -18 -44 55 -91 116 46 -69 174 430 40 -196 -60
3241 -60 195 -265 -145 191 -303 -40 188 -325 180 137 -20 -60 183 169 -128 192 119 13 59 137 67 112 206
3264 206 81 54 2 24 -78 -255 -88 -122 -203 152 -42 -281 31 -264 -213 28 -149 99 -131 92 80 129 107
3287 107 -41 29 62 15 -160 -11 -48 -53 -78 -218 13 -17 70 43 -216 -479 18 -64 -134 179 124 -50 -93 108 20
3312 20 -21 -64 -425 -107 -1 106 -56 -23 74 -58 -58 354 116 -154 123 -204 -151 132 33 -20 -80 -2 91 78 178
3337 178 13 -76 16 134 -179 -119 113 97 -185 -39 146 151 159 266 67 310 254 39 -187 356 -87 -65 432
3360 432 -57 -74 -38 63 -215 -129 127 -52 -133 -117 -334 -193 75 16 -338 17 53 -37 -104 -51 346 -184 -2
3383 -2 209 132 52 199 -126 74 76 239 270 126 -101 -102 -202 97 31 -58 131 -349 -242 90 -57 47 -107 -155
3407 -155 -49 58 198 -223 78 43 118 -310 -200 117 259 130 137 -156 -25 93 -59 -59 -188 41 -59 256
3429 256 17 120 89 -258 -173 -27 -113 -88 -226 61 -1 45 101 15 -58 -209 -45 -64 232 111 58 154 87 48 22
3454 22 -102 138 156 81 -50 109 -138 -256 -85 139 -121 -67 96 40 39 -336 80 92 82 -107 -65 -35 -65 61
3478 61 293 -93 2 63 148 164 82 -11 93 -128 -50 131 -39 -40 35 -100 -324 14 -40 -56 206 32 161 -210
3502 -210 20 100 55 -136 -169 -49 -59 105 -62 70 24 -220 4 41 8 89 288 274 36 205 56 -13 -23 -75
3526 -75 73 49 -76 18 -233 191 -61 40 61 94 67 -102 -105 -88 162 -94 44 12 15 26 -166 248 -120 -8
3550 -8 298 181 218 -44 95 41 -104 -346 221 45 11 19 -87 -197 -152 -16 -130 -67 96 -188 28 -173 -30
3573 -30 52 67 29 -261 -28 19 154 -117 -106 -61 184 50 269 -130 131 15 -241 190 -204 -22 -31 -85 -29 -176
3597 -176 -88 -10 155 -79 -52 -149 -20 102 130 -129 198 -13 -72 77 81 136 201 204 134 201 364 105 -19 -175 111
3622 111 180 -65 20 12 160 -73 82 53 -49 -83 -94 -1 -45 55 174 -172 -30 -106 -112 -87 56 -194 -148 236 103
3647 103 55 130 -56 29 -93 -240 21 64 -19 -40 116 126 -166 -8 -11 25 -133 21 -118 -4 33 57 -303 -74
3671 -74 155 -7 158 115 -1 70 -113 -154 -93 -108 -5 -36 -129 25 -259 135 -27 229 41 203 75 75 -143
3694 -143 -136 -103 98 44 -21 -133 -20 -216 -87 -92 -21 117 -143 41 10 15 -111 137 9 108 134 28 -113 256
3718 256 -185 -72 -169 231 -225 -118 192 -20 -175 -245 151 91 -99 50 -143 46 111 182 -74 -194 -140 184
3740 184 249 128 -102 78 -37 -2 162 70 -208 -241 -48 -102 8 -36 169 -73 -18 -68 45 -350 3 117 -181
3763 -181 160 -12 267 35 -296 8 205 129 44 -61 -107 254 39 -117 23 297 73 117 -3 -71 87 -141
3785 -141 146 -267 13 73 108 356 -227 -152 -247 -68 170 -143 171 208 -230 24 -103 -39 193 159 -80 -9 100
3808 100 264 -72 78 286 274 50 133 168 -155 141 -3 -210 -171 139 -140 -59 44 36 119 77 66 18 68 -114
3832 -114 -20 -102 217 152 -82 -52 -121 110 -9 107 -91 11 -5 153 -50 48 172 -30 66 -109 -75 -159 -262
3855 -262 -86 8 124 56 58 -145 -83 147 -37 -180 84 -69 -74 -29 -31 68 -8 -8 225 -120 -179 -111 -137 -110 -12 -73 -18
3882 -18 -207 -207 -21 84 139 86 -11 92 11 -55 14 -43 -84 -131 95 88 166 -117 41 -23 115 114 97 186 -224 -193 145
3909 145 -132 92 -31 -7 -48 -110 -143 10 40 -231 -162 53 -428 50 -87 -36 7 -26 167 -46 -18 91 26 222
3933 222 -191 386 -71 -148 178 65 52 -187 0 -110 162 113 121 -88 -11 -21 166 -78 -84 109 -165 -313 -33
3956 -33 81 42 -3 -145 -114 185 -55 -65 -32 -211 -27 103 -90 97 141 -148 93 105 -195 -72 225 101 7
3979 7 -126 -219 -95 6 147 -31 -30 -119 88 -440 122 -68 90 -9 6 95 267 -17 -120 40 -31 -106 -40 9
4003 9 255 20 -163 2 140 344 82 10 -196 63 63 -26 -136 -18 -150 -96 -134 -176 30 162 15 -84 252
4026 252 79 -137 12 -304 138 33 173 145 -7 164 215 70 -99 53 66 -97 156 -142 15 -43 -196
4047 -196 -167 112 -60 -112 -113 -225 214 -28 -80 154 5 -96 56 -156 -196 80 207 61 81 49 -90 102 106
4070 106 -180 -333 190 -249 -38 188 35 2 -25 -114 -151 -104 -147 179 -137 3 57 -31 63 -3 222 -24 84
4093 84 4 84 -18 301 358 -122 128 125 -31 -164 6 -89 138 248 -69 60 104 95 -130 -125 -21 124 -95 114
4117 114 41 -3 -32 -127 153 107 110 -133 12 275 -34 173 245 276 -89 5 -103 -61 166 226 11 241 220 155 148
4142 148 -152 -183 -149 98 -7 -41 288 -86 -125 82 -190 93 52 85 -3 64 -13 -99 -32 67 -2 178 7 -26 -143
4167 -143 155 -80 -84 -182 7 -331 -113 73 130 89 -89 -129 -111 -193 -221 -67 -30 118 -26 201 -111 100 -51
4190 -51 -187 -20 -199 61 117 250 -25 -241 -114 186 191 -241 -13 -134 232 133 -30 -40 -90 -209 -229 -84 158
4213 158 -124 -267 -133 -21 -89 -12 -22 -8 158 5 -51 240 147 57 21 86 -18 98 244 292 39 68 -115 -57
4237 -57 -67 -165 -229 -96 -40 51 -182 8 19 -14 -20 -21 -122 -190 -22 215 89 90 241 89 76 67 -284 4 -19 125
4263 125 -52 78 -72 -139 -160 -289 44 -12 -79 -48 78 175 -333 -159 -153 21 184 -24 -352 -73 -39 42 15 14
4287 14 -66 289 -122 90 37 173 -109 -19 -186 -198 -163 122 57 179 -35 -116 121 8 199 -132 -100 -100 -146 -173
4311 -173 -173 61 30 80 72 -65 198 -164 96 137 40 -394 127 146 110 139 76 -32 -77 -88 -45 -43 22 112 70 133 -141
4338 -141 -107 -86 -43 -148 -305 -39 131 84 0 340 71 -156 136 -82 -98 109 -79 -59 -57 -8 -2 37 -98 -120 -126
4363 -126 55 -20 -41 39 33 82 265 -122 87 -185 54 62 184 -248 -160 -68 147 45 144 -183 73 191 -155 39
4387 39 174 26 -59 21 131 122 -81 -50 100 13 146 -84 -185 48 -181 -123 -105 -60 16 -96 5 33 -38 -301
4411 -301 -167 -42 151 113 -2 -95 17 59 234 208 -140 -13 76 -182 -2 123 -69 78 -42 -131 -90 -6 -145
4434 -145 19 -74 -28 30 -209 26 86 5 -190 -148 -61 103 -34 -15 182 150 203 132 231 142 30 8 210 11 19
4459 19 130 -42 -57 -91 41 120 50 137 -197 -132 -152 -154 40 -288 138 -47 -222 67 45 51 -339 -176 48 -5 -48
4484 -48 -203 11 265 -30 45 -63 136 -180 -15 -6 -176 66 -72 -227 22 -159 -120 -194 -112 -162 -11 -330 -141
4507 -141 205 -40 -96 186 70 83 112 -184 79 -20 130 -113 -130 163 364 -161 97 -43 -221 -158 -343 -5
4529 -5 6 45 179 61 -33 -199 -10 -71 60 179 -135 -80 86 375 254 9 18 -27 -223 92 249 27 -31 81
4553 81 -41 -231 338 249 -137 -40 297 -71 -26 126 57 97 -121 141 -63 -82 7 -167 71 -283 96 -84 -108
4576 -108 289 -13 223 -17 9 133 -72 -35 28 -12 -60 56 -7 65 13 206 -200 -220 -148 5 -81 142 31 -266
4600 -266 14 -120 -20 -250 -29 25 -204 -9 52 -2 -9 -76 332 -73 -269 -24 24 -18 96 49 -23 192 -176
4623 -176 118 -86 20 -29 -76 -194 28 -30 -118 71 -21 183 -60 -70 18 39 -80 81 227 119 148 99 66 256
4647 256 123 49 84 289 -154 -110 157 -312 200 17 124 81 -179 -45 -15 -234 -149 -299 -224 42 68 -49 -227
4670 -227 -46 35 255 -265 -36 -258 148 13 92 113 52 60 100 243 -72 159 117 -27 -228 -98 283 7 -87
4693 -87 175 -229 -53 261 60 -219 -232 -112 -99 90 279 4 224 37 57 -106 103 6 136 71 -2 6 -88
4716 -88 -134 121 -264 55 -40 -233 -180 -148 -29 -117 25 35 -21 74 170 -432 61 260 -130 -148 24 -15 -17 -104 -158
4741 -158 -128 131 203 -411 -92 122 -126 108 -50 55 240 104 -180 16 -71 -117 -106 -122 -355 -21 -155 23
4763 23 24 110 132 150 27 82 256 96 -3 162 -17 92 182 -98 228 2 -11 -19 -96 0 -96 -151 16 -79 101 -93
4789 -93 73 -27 -35 134 182 178 -248 -151 -5 16 -206 44 501 152 210 405 15 -23 135 95 108 86 230 118
4813 118 4 79 101 -72 -121 -12 -100 -60 91 -132 -275 -272 287 -47 -122 198 18 94 269 12 -10 -22 142 101
4837 101 -316 -20 -88 238 -80 159 6 75 179 -91 -18 177 51 -100 -204 69 -78 -102 161 -115 -94 50
4859 50 -47 94 -147 -36 129 174 63 33 265 187 232 170 7 91 112 138 -66 -46 149 -286 152 60 -12 -68 -223
4884 -223 126 -150 -3 9 73 -381 -301 33 -113 -87 -4 -38 350 -1 -182 -3 -164 259 -187 -19 -263 84
4906 84 -31 -186 5 26 -40 -133 -106 -74 -145 -192 99 -180 -330 -131 50 197 41 175 1 44 -25 -8 -81 289
4930 289 70 -93 -15 -286 24 76 32 -184 34 -53 -13 289 120 -124 1 -152 4 377 -168 -200 -67 26
4952 26 153 55 -68 -156 104 -400 -68 -193 67 78 27 -12 -15 -71 121 168 -105 65 -14 -195 91 191 -359 128
4976 128 -18 103 65 -11 95 -109 -28 -231 -85 -63 -196 -50 -63 -150 -76 206 37 -139 -239 113 336 200
4998 200 135 193 -232 -147 -106 -93 -77 -2 -127 -5 106 22 257 -167 -169 112 180 49 -118 -53 -38 42 -130 -257 6
5023 6 82 -4 239 -68 -183 62 88 -122 22 159 113 200 199 57 57 -230 22 -284 16 43 225 -131 297 -168
5047 -168 -42 -239 -9 -27 -23 -92 -108 81 -42 -184 -31 -64 -52 26 -130 204 -41 233 31 147 242 9 14 -138
5071 -138 165 65 -85 113 149 -102 -255 21 -92 18 76 1 99 -27 -53 169 86 -155 -22 4 276 -181
5093 -181 69 102 -106 102 183 102 204 99 13 -287 -92 -141 -105 177 27 -21 -83 -158 -232 -65 -71 -437 117 -137
5117 -137 -327 -12 61 109 -91 39 154 62 131 -6 -119 358 -69 32 264 -62 -136 -32 130 11 61 -156
5139 -156 -106 -121 -11 -257 -232 54 -120 149 122 -183 -343 -52 -39 277 -23 55 -119 -128 -237 50 -32 -74 109
5162 109 212 224 -60 -1 -170 -63 -15 -28 -245 -168 27 31 -54 145 -72 46 -156 180 -151 216 18 -72 -51
5185 -51 -55 32 -172 -177 55 -13 35 121 -13 -126 10 22 168 33 151 -271 -159 -253 -111 -129 -20 76 -117 -112 -136
5210 -136 -214 -1 -38 -193 14 -247 -196 -208 94 -150 209 -140 63 -91 -280 -60 -72 -4 -130 134 -176 130
5232 130 15 148 60 186 215 -21 -124 191 329 216 83 -163 34 11 259 -22 -76 93 -149 -193 112 12
5254 12 -98 -58 120 8 -142 -135 287 147 -198 60 -61 -193 36 -37 97 115 23 -240 -159 144 112 -197 -206 195
5278 195 -250 -100 52 -40 -59 -65 82 64 -1 -108 -14 87 126 141 -42 137 146 -43 274 115 68 -6 18 -104 28
5303 28 -251 -110 -133 -204 22 9 -25 115 312 -67 124 289 117 -86 -40 -16 -54 21 224 -135 157 205 132 -113
5327 -113 37 -22 0 -31 -19 -93 56 19 -372 -122 -132 -127 -122 -59 -9 35 270 68 123 73 -147 -88 -11 60 9 -11 -53
5354 -53 26 103 37 -131 79 298 116 55 265 155 58 65 -37 30 154 -2 -132 -220 -28 30 -13 140 -115 -176
5378 -176 -207 -184 -3 121 28 240 146 -68 -19 75 -156 474 -114 11 26 -68 -168 -71 171 -119 -68 -75 117 -5
5402 -5 34 36 177 173 -31 195 1 -58 16 -114 -33 39 -197 -58 63 171 -188 28 -196 2 -108 -69 -52 -52 12
5427 12 -13 -107 -157 -115 43 127 30 32 13 -128 48 71 -135 -57 75 33 -235 -80 -161 124 -70 -20 120 98 -90
5452 -90 -68 153 67 -19 104 -96 -25 102 -140 134 -57 102 56 -267 226 -34 92 20 94 -198 92 144 -20
5475 -20 -67 -22 -149 184 -120 -160 192 -38 111 82 73 146 -35 -77 59 39 -83 21 -44 195 -86 31 176 -73
5499 -73 -201 -53 52 70 96 -15 -56 -26 -338 -7 4 131 181 59 193 0 28 -87 114 -50 59 72 -166
5522 -166 114 -212 -276 -223 205 17 74 -181 134 -179 -6 3 173 -25 -6 77 -82 -17 -153 393 214 350 -92
5545 -92 261 130 -256 111 18 381 -109 -171 -39 -30 103 -9 -5 15 -109 -294 58 11 -52 -203 145 -76 -15 -320
5569 -320 -95 55 82 29 -158 0 -49 136 50 94 33 -84 73 -47 -67 146 -123 157 49 -259 89 -184
5591 -184 -177 197 43 -100 68 -144 13 -112 -55 89 -161 43 -58 -91 -37 77 -212 259 -73 -41 -13 188
5613 188 -89 -287 -42 -212 -132 -11 -163 -35 -114 158 -20 -149 13 -436 133 11 6 -26 44 -20 -295 113
5635 113 58 132 -25 39 136 -37 166 64 388 -92 233 -4 -105 66 151 -148 107 -29 -51 16 -283 -252 -29
5658 -29 -106 132 -210 -70 7 -6 -65 -141 -42 228 5 -35 5 -1 149 204 81 158 -27 -41 -59 -71 6 76 65 -150
5684 -150 -37 -21 -331 45 -278 89 -38 -37 54 42 -129 85 189 19 85 0 -221 123 180 -262 -88 256 248
5707 248 30 96 367 196 -125 -96 88 -93 -24 -276 106 4 -23 190 -1 -287 -125 79 40 161 -46 56
5729 56 -92 51 90 109 -40 10 76 294 111 110 148 238 -54 47 247 -51 -295 236 186 -28 15 -198 -22 131
5753 131 -146 -89 133 -276 33 75 -43 222 -163 -62 -47 9 -81 34 77 -28 209 224 69 90 124 71 -9 56
5777 56 -32 74 229 -95 115 14 -253 -134 139 -133 -12 -134 -116 -53 11 -36 -165 78 -9 -34 -161 115 89
5800 89 203 113 -174 180 -45 210 -126 -102 -82 129 -74 34 252 -31 67 111 122 -190 -140 165 -12 88 -35
5823 -35 -26 42 -91 352 62 -35 -164 148 62 -176 -118 -206 78 -55 209 73 -94 133 -178 17 56 -69 -92
5846 -92 -101 21 -102 -80 76 -99 41 158 -144 -4 25 -7 46 -85 -243 197 -83 97 126 -80 17 -119 -49
5869 -49 -45 -65 323 -9 -91 -76 59 100 5 33 13 48 -176 258 -172 328 -64 -69 95 -17 -190 275 187 125 130 167
5895 167 -56 -18 24 -206 -36 -158 12 194 -51 -33 87 -24 3 8 -123 -54 -128 -140 -158 -183 -160 -235 91 20 -196
5920 -196 -10 -270 -74 -9 143 53 94 109 -3 -93 -98 139 -298 -3 135 -4 30 50 -7 173 -138 -230 -5 -146
5944 -146 115 -83 -3 -115 246 -147 100 109 66 143 30 -57 93 50 289 -129 -11 135 -111 279 -94 131
5966 131 151 245 22 21 83 -119 176 151 191 -95 54 13 -62 -44 -279 88 -218 -173 22 -142 60 -241 -57 205
5990 205 13 7 -151 -82 190 69 317 24 121 118 202 25 -93 47 77 -15 -83 189 136 21 -73 -228 -113 10
6014 10 23 82 -33 72 128 -22 260 -36 -188 -3 -7 -142 131 -36 63 107 97 206 183 29 -16 -84 -95 -137 27
6039 27 270 -10 -69 -8 -209 136 137 -21 -132 -189 -30 19 161 -69 -139 146 -141 -35 6 -131 74 -3 -338
6062 -338 -63 -51 -49 -30 -157 108 -162 -223 1 283 160 101 15 -7 152 193 -302 89 172 -27 -33 -137 196 -117
6086 -117 -143 -79 -58 -26 158 150 -54 -66 -57 -29 120 127 75 47 -39 40 -39 -75 -1 73 -121 -215 -189 103 -258 -206 15 -19
6114 -19 47 -288 -102 140 -71 -127 -168 75 37 -2 106 154 21 -55 2 134 166 -89 4 127 44 34 136 9
6138 9 -194 -34 107 112 97 -39 -103 60 0 -96 39 -164 11 -34 -65 205 -91 -82 -186 137 145 103 -71 280 123
6163 123 -225 -166 140 -22 -274 108 198 68 -238 67 -61 18 -104 292 147 58 -150 6 135 -37 38 42
6185 42 238 -35 6 298 -29 103 252 49 7 138 197 269 -231 -51 161 -67 73 -57 135 -90 143 -44
6207 -44 56 -94 -120 55 -49 194 187 42 409 -27 -35 126 224 98 59 -84 109 194 -19 81 59 196 19
6230 19 -162 148 -100 124 113 59 -94 -64 -151 -222 14 41 -24 173 10 -203 -9 -301 -56 -129 143 23 -5
6253 -5 -183 -132 -96 -47 60 71 223 340 91 85 -286 -165 36 -104 -187 -156 64 -1 121 -75 -132 -108 -106 45 -111
6278 -111 56 -68 140 198 99 -50 52 7 57 -25 79 351 11 9 118 147 -24 43 -218 -91 35 25 49 -45
6302 -45 -214 -17 -5 -90 12 -110 -215 -136 -28 199 52 -61 77 37 -289 -226 54 -262 2 8 -30 143 63
6325 63 34 -38 1 -230 -53 -88 -183 -176 -169 107 159 32 -8 152 110 -82 -209 69 190 57 90 125 -81 55 -37
6350 -37 304 65 -163 19 -36 -140 14 -149 -129 -94 67 135 -79 -119 27 -29 -82 -54 -287 -75 -68 147 -132 -14
6374 -14 -94 105 43 -40 162 42 -48 241 61 48 -47 212 27 120 144 109 -15 108 -129 66 38 11 -26 15 194
6399 194 322 48 -45 182 39 -273 199 55 4 161 -49 94 -125 68 21 20 20 192 2 -27 233 85 161
6422 161 -8 213 157 -205 94 16 110 -91 -156 60 -94 9 59 80 -42 78 -82 206 -98 78 -145 -11
6444 -11 62 31 227 -265 37 191 256 -105 92 203 -155 -147 177 138 208 -67 -46 163 -51 16 -146 134 -63
6467 -63 112 35 -75 -86 63 -10 156 102 -51 209 41 155 24 89 -19 314 -106 156 118 -111 18 -39 -22
6490 -22 73 9 -243 -253 116 -58 59 -177 289 103 319 -81 -329 -100 -156 146 274 -65 -15 -31 -224 -214 -13
6513 -13 372 85 -10 -24 8 192 44 78 168 -28 -125 13 -183 -113 -144 -43 204 -138 -40 -90 -247 30 95 49
6537 49 -30 183 -55 227 -23 -55 206 62 8 -168 0 144 -84 230 -142 -104 101 -187 137 -18 -142 -137
6559 -137 33 -200 174 -5 31 80 -117 -84 -86 -140 -79 -68 -114 -78 -11 249 -149 169 108 -171 99 45 -12 66 63 -53
6585 -53 146 -30 -105 -132 -88 -313 -217 -86 53 -98 -59 -133 17 112 21 299 -27 -36 -62 -107 47 -116 186 -274
6609 -274 214 23 -188 285 96 -182 -135 9 234 -42 -49 241 -115 10 -213 -87 14 64 -68 -85 129 89
6631 89 194 -21 -66 -127 -103 103 1 194 -44 72 -193 5 139 -27 3 152 19 -118 -232 -125 -44 -41 167
6654 167 -178 -324 -167 59 170 108 231 85 160 71 -30 95 -38 45 236 -111 -61 90 94 35 -13 238 78
6677 78 -148 -178 8 -13 -119 -10 -7 -204 -185 -41 222 198 -162 -80 208 -405 -173 182 -22 -70 101 77 100 234
6701 234 -132 -48 -15 123 -37 113 -338 -25 143 -204 -65 -156 206 43 27 12 70 -174 -15 92 221 229 8
6724 8 -42 18 -156 -264 -144 144 -43 88 43 174 -90 246 71 220 -88 -60 -10 -153 -252 117 213 19 -128
6747 -128 -78 90 57 -2 -118 163 -99 -132 5 -220 186 -107 120 84 -398 -122 -103 167 197 45 188 2
6769 2 -4 159 254 53 161 85 96 0 -23 140 -21 -120 20 110 -69 83 -45 232 -61 -123 265 69 -101 94
6793 94 205 -169 175 -91 221 -155 91 -62 -7 111 218 -53 106 30 -84 57 -167 -102 46 -37 -66 -430
6815 -430 -49 -53 -120 233 -121 32 -291 28 97 2 -81 -107 -11 -64 270 -25 0 142 248 129 -3 -227 -1
6838 -1 100 -114 230 122 263 33 -23 54 -8 11 56 60 23 -90 -41 32 -487 -10 213 -90 -74 61 -91 -26 112
6863 112 27 -81 3 -95 23 138 44 14 -83 -67 -35 -157 -249 -69 -197 122 -64 -21 -128 -375 -23 -105 260 69
6887 69 6 74 -36 -78 -6 42 79 -231 109 -168 11 -2 -17 44 132 -70 264 136 17 -250 -62 -197 258 66
6911 66 -310 189 -57 -211 -57 -110 -228 59 -88 134 -208 -160 -92 30 2 -176 -58 127 99 24 -59 -36 248
6934 248 42 228 29 112 -169 -201 146 71 -67 46 -25 -374 -242 19 -198 -66 -107 -156 33 23 -125 -33 -309
6957 -309 -169 299 197 101 -126 92 110 7 -135 131 -30 -121 -105 163 221 -178 158 -69 -172 -107 -214 90
6979 90 -295 -34 95 -53 41 -38 56 47 55 294 -111 207 -111 -5 -228 -25 68 264 174 -101 32 182 -152
7002 -152 132 19 48 112 -66 -81 33 18 -76 -55 7 -191 -69 -88 -28 161 35 -139 -278 229 -126 14 -121
7025 -121 319 -22 12 -54 -340 -87 -84 -122 -82 17 -89 -98 -197 10 -40 138 53 -128 -8 4 12 -204 -96 107 -88
7050 -88 -302 63 260 168 184 -35 -168 -267 177 -168 59 121 -174 27 -14 -289 85 -124 -27 165 24 10 60
7073 60 -46 -99 162 -135 62 40 146 68 254 -131 -49 -20 48 153 150 3 108 -89 -114 69 60 180 -148 105
7097 105 119 -55 -24 -60 168 -6 127 10 192 63 19 -8 -38 25 50 97 83 76 -146 55 187 358 71 -21
7121 -21 -11 235 -149 59 29 17 -47 -123 4 33 -46 41 -158 96 -71 -73 62 54 67 -240 145 -75 28 -4 83
7146 83 271 -79 -30 105 25 -186 49 -45 64 114 -257 -27 -73 293 156 302 -130 -249 64 -70 70 150
7168 150 -140 -134 -21 14 -194 107 135 -81 204 -191 221 194 92 -26 29 255 -95 -155 -163 -142 37 -256 113
7191 113 -151 112 2 -47 71 104 -168 -88 -68 67 367 -12 -9 146 147 63 -10 -110 -43 159 161 -6 307 -101
7215 -101 60 58 161 -20 188 -49 -58 195 -47 55 -107 65 90 151 -143 -67 65 -330 -307 -154 44 70 -128
7238 -128 -7 -83 105 22 -40 -7 110 246 -2 86 237 82 272 258 -55 18 68 -83 -109 -44 -13 -171 37 125
7262 125 -163 -253 -50 -23 -20 -99 -172 196 106 -71 33 -114 22 140 -36 8 -47 58 143 75 180 -155 -65 318
7286 318 22 -1 -59 43 9 130 20 -65 123 -25 -181 -66 178 66 271 66 -43 76 -147 -41 -145
7307 -145 -227 29 -83 -106 -178 53 117 -166 -91 62 -106 -35 -85 0 -116 29 22 -106 -133 103 -94 -11 -186 -323
7331 -323 -37 -242 25 97 -105 60 -222 -233 -98 -67 -231 -193 -29 -91 237 37 -160 203 77 118 93 293
7353 293 58 169 128 136 97 -146 -13 7 -62 -66 0 183 67 193 -108 -40 89 -146 -49 -65 83 -2 -90 -121 80
7378 80 -71 122 8 -133 136 410 225 10 -142 97 128 4 -145 -84 154 51 96 -139 72 -7 -12 -173
7400 -173 -47 186 195 -148 88 -188 -179 -215 123 -16 166 26 23 143 81 -129 -47 -90 -94 -25 21 -52 -204 72 39
7425 39 238 -156 -68 -87 -62 -108 -31 -24 -63 -171 -42 -35 90 166 -37 169 112 -145 75 -2 40 -73 -125 151 305
7450 305 -148 136 109 49 299 17 268 139 -75 31 59 176 91 -100 80 13 57 89 -101 112 356 72
7472 72 37 8 -80 139 -82 124 -136 147 -66 -140 79 118 -97 -117 148 -115 144 -11 -100 48 125 -39 118
7495 118 -126 -153 -114 148 71 -204 61 112 -202 -68 52 14 150 29 80 72 -25 81 -80 10 -19 61 105 -281
7519 -281 -204 -114 88 -131 -15 -195 -66 -54 85 66 -68 33 102 -148 86 1 -171 65 -18 46 -74 40 206
7542 206 35 48 -215 91 -30 -91 -101 95 -115 -71 -76 -175 -95 56 -2 -77 -72 -26 0 54 -69 -97 -72 31 129 61
7568 61 7 -6 21 -11 131 -67 -169 -178 64 21 92 -46 -54 -123 123 -55 -174 -46 -162 118 -65 107 211 40
7592 40 -189 -235 -112 132 63 -157 -193 132 17 -70 -12 120 87 -52 385 -55 117 67 -222 -6 76 44 -36 -93
7616 -93 5 -82 34 -4 -55 2 128 144 -104 73 -54 -248 65 -106 168 53 119 7 76 -129 -66 116 147 -48
7640 -48 -105 0 -144 65 16 -66 140 -87 68 -10 -95 110 23 -127 308 52 -21 -52 -26 48 -68 -193 162 -79
7664 -79 -42 201 -24 -116 -44 63 89 225 20 -20 132 51 121 -69 84 91 -35 -3 -39 -126 -7 14 -228 -121 -124
7689 -124 -208 97 -95 -169 -39 41 224 43 91 -99 57 -6 -39 66 100 54 -110 203 174 217 -13 197 47
7712 47 217 82 140 -49 228 63 -28 93 -117 -290 68 97 -43 -77 157 -134 -137 95 -8 -370 -36 92
7734 92 33 -22 150 167 -86 69 31 368 82 111 -92 99 -168 52 -78 -124 -37 -94 -102 -104 325 -144 211 -97
7758 -97 16 -1 -210 102 162 109 37 -273 96 -85 -63 95 144 -229 -84 67 -103 70 57 63 -149 69 -70
7781 -70 99 60 -183 348 36 -66 80 -240 111 -164 -28 -89 -34 -72 -319 180 -25 -100 26 58 -132 -63 101
7804 101 22 -81 123 10 -122 -86 113 62 218 -27 31 -22 -178 -97 -54 -231 -313 -169 102 -133 -129 306 -113
7827 -113 87 142 -37 -73 65 45 -139 -136 -35 -108 -198 -14 -18 161 94 -1 -50 -111 71 -222 -58 84 -169 -24
7851 -24 -34 -47 44 -40 -54 186 -132 54 -200 0 140 -132 27 -120 -27 80 -169 67 35 26 -373 261 -109
7874 -109 -28 -195 -205 45 -143 17 9 -40 -194 -120 210 182 126 250 35 149 57 -48 -44 312 -107 76 78 -6 -34
7899 -34 -223 156 91 7 158 150 10 201 -312 10 39 61 -70 -65 46 -115 78 -150 112 -165 -176 59 262
7922 262 -111 77 -270 -104 34 83 197 161 -48 -17 125 -113 -244 212 39 -124 12 -214 24 62 67 101
7944 101 14 -149 -162 -130 -192 -89 -45 -113 179 -55 258 94 63 63 -37 180 374 181 -63 -75 -51 98 -33 74
7968 74 -124 11 166 130 -41 14 -75 -7 -47 -208 145 285 -60 83 -44 -311 6 182 -70 -83 145 -22
7990 -22 31 10 7 -2 59 -15 253 -20 -82 -89 77 -169 -174 -30 -43 174 89 -178 -145 56 -40 -197 -77 -120 26 -84
8016 -84 -59 103 35 202 -105 -153 -15 4 -273 -269 79 111 32 60 -71 42 75 46 27 -237 103 87 -173 125 130
8041 130 -78 -31 -76 -213 89 -117 44 -5 -23 -182 3 -13 103 -80 -20 369 81 -29 -40 238 -151 126
8063 126 -73 -59 1 -76 -114 -153 -39 -166 -264 -341 -248 -75 69 -34 -275 15 -12 161 -1 -152 -30 -24 5 201
8087 201 -82 -57 -26 7 146 -184 69 210 185 -130 217 -211 -164 -223 117 -314 -37 -76 209 -166 23 117 -78
8110 -78 78 -38 -253 152 -156 -61 81 172 -202 -122 -46 -72 -117 -90 17 -26 -50 -56 -39 -80 -72 74 24 -64 -275 -79
8136 -79 -8 -164 -97 -51 294 -23 47 -9 -1 173 120 -36 185 -327 -101 -103 -158 -17 169 -51 199 -195 167 -90
8160 -90 -140 1 148 153 -83 167 -82 -63 -135 51 87 -149 0 -16 -17 -298 22 -66 -27 315 -27 54 -174 -151 -1
8185 -1 255 -53 15 179 -145 -1
8191a
$$ Imaginary data points
##PAGE= N=2
##DATA TABLE= (X++(I..I)), XYDATA
0 0 0 0 0 0 0 0 0 0 0 0 0 0 0 0 0 -4 8 -8 8 -8 8 -16 16 -16 20 -24 26 -32 35 -40 48 -56 61 -69 77 -89 98
37 98 -109 122 -136 151 -167 186 -205 226 -248 277 -304 336 -369 406 -448 494 -545 604 -670 743
57 743 -830 934 -1055 1203 -1388 1622 -1940 2383 -3054 4177 -6396 12406 -62755 -160505 41643
72 41643 94733 -28359 -32802 18815 -21573 2334 46698 -1443 -45132 10237 31246 5359
84 5359 11321 -3940 -21358 18732 30814 -12741 -16277 19975 -5748 -18052 18008 475 -35056
97 -35056 -247 24601 -24248 -22515 28088 -4968 -38803 11625 32288 -23533 -25084 27067 15387
110 15387 -12082 2937 13329 2448 574 7124 6410 8572 -1410 -4202 14260 920 -22119
123 -22119 4213 24312 -17805 -31840 18365 15488 -30155 -16794 17070 -745 -16530 5164
135 5164 3429 -9915 4110 10655 -4572 -1323 14725 5088 -4638 7104 9815 4493 2745 -3221
149 -3221 -3008 11031 7510 -14164 -7443 7030 -5193 -7365 6653 -7937 -22820 7842 19663
162 19663 -17759 -24594 9322 14967 -4311 -3341 2188 -2162 5714 11802 1205 -5828 3631 9576
176 9576 4927 -343 -2123 2652 5476 -780 -2077 2695 -1075 -9022 -2046 5992 -5112 -12077 -1051
191 -1051 3211 -3402 -3597 442 -2652 -1620 2233 -60 -1889 57 1159 1480 4474 1399 -1107 5031
207 5031 5486 -453 1940 4837 -2741 -2198 6078 -310 -6880 3306 5664 -6460 -4411 5913 -1495
222 -1495 -8403 -278 1738 -5271 -3157 617 -2825 -1098 3685 -1344 -3650 4033 3868 -2851 -571
237 -571 4141 719 1165 3741 -496 84 6419 3006 -4143 704 5056 -1695 -3410 914 -1555 -3373
253 -3373 483 461 -3907 -2069 -73 -1655 -1507 -650 -2824 -2147 1343 -305 -1564 1589 1796 1009 3057
270 3057 2256 -28 1703 4068 530 21 2739 776 -1286 1575 1623 -1833 -805 536 -2173 -2042
286 -2042 -1014 -3408 -3044 446 -1255 -4279 -1222 1841 -1687 -1596 1981 329 -952 1919 1055 -821
302 -821 2391 3971 425 283 3754 2271 -93 1416 1354 -507 367 272 -2313 -808 855 -2060 -2442
319 -2442 -506 -1506 -2961 -900 -751 -3179 -1424 766 -1111 -1913 1337 995 20 1425 1746 406
335 406 1740 2727 1240 756 2155 1667 968 1304 348 -497 715 219 -2388 -1066 -148 -2006 -2432 -852
353 -852 -1751 -3021 -938 -397 -2295 -1542 124 -823 -380 1595 543 -102 1553 2508 1633 1677 1760 1106 1958
372 1958 1953 746 362 1480 692 -825 -318 -742 -1847 -1307 -595 -2383 -2700 -1669 -1430 -1986 -978 -1072 -1204
391 -1204 -292 272 30 364 975 1440 1783 2122 2030 1842 2143 2352 1390 1302 1294 681 -22 55 -1087 -1287 6
412 6 -375 -2219 -2725 -1222 -1195 -1974 -2093 -2082 -1960 -520 236 -273 -1519 65 2364 1655 -26 402 1075
431 1075 2018 2450 1457 -240 1118 2745 1058 473 1111 -191 -1771 16 917 -2139 -3000 -467 -608
448 -608 -1628 -766 -2303 -2950 -276 1085 -1652 -2120 390 -189 -685 2223 1710 -1404 1239 4919 1693
465 1693 -774 1431 1891 312 1030 476 -1011 536 1731 -1720 -1413 1453 -978 -3784 -790 -254
481 -254 -2324 -1746 -781 -1885 -1214 1583 467 -1408 734 739 -44 1266 1166 -1049 1116 3912 1365
498 1365 -1009 1997 2241 -121 176 1015 -611 -692 340 -2123 -2300 460 -535 -2482 -637 416 -2045
515 -2045 -1542 441 -2316 -2348 1530 817 -2152 218 2596 75 530 2798 334 -247 3130 1593 -664
532 -664 1950 1933 -1375 -68 2978 -391 -2039 743 264 -2062 -764 -912 -3795 -1448 2429 -1145
548 -1145 -4356 -739 940 -1187 -257 382 -1760 475 3491 785 -2069 1301 2475 821 2330 2536
564 2536 -969 835 3849 -396 -2763 903 1396 -1176 -571 -947 -2174 72 -119 -3603 -2387 1701
580 1701 -954 -3251 -295 231 -1814 121 1850 -352 -132 1931 1181 1123 2090 -364 -314 3520 2835
597 2835 -1538 31 2105 -630 -1155 2200 -125 -3396 119 1715 -2409 -2176 -282 -2701 -1637 1916
613 1916 -1398 -3736 1395 2418 -2363 -1379 2220 146 891 3455 -1 -1956 2679 2681 -782 575
629 575 2107 -566 474 2632 -1096 -2806 1522 910 -3056 -816 1667 -2532 -2961 446 -649 -2275
645 -2275 129 -5 -1846 -129 1123 -1163 -219 2309 214 163 2947 1732 -633 1972 2396 -713
661 -713 326 2589 -129 -932 1573 -197 -1839 823 446 -3304 -1098 1281 -2076 -2761 -50 -775
677 -775 -2453 -53 593 -1361 239 1353 -752 -49 2519 534 -1016 2306 2274 -743 925 2687
693 2687 -520 -7 3126 297 -2204 1026 851 -2771 -1300 1142 -2011 -2170 1172 -760 -2752 -161
709 -161 398 -2101 -761 457 -1035 -389 1526 174 -616 2119 2013 -72 1016 1913 209 290 1776
726 1776 201 -594 1252 917 -1261 -127 613 -1389 -1322 19 -891 -1946 -812 -1192 -1667 -549 94
743 94 -1008 -389 484 -805 -322 1356 441 -41 1674 1249 355 1556 1929 32 921 2142 -259 -691
761 -691 954 280 -1161 -59 82 -1377 -921 230 -1269 -1557 -31 -925 -1978 -491 -30 -1290 -192
778 -192 1018 -85 -369 1362 805 101 1096 1626 -107 983 1623 358 117 1622 1015 -310 282 372
796 372 -804 -779 -247 -853 -1407 -582 -883 -1321 -462 -362 -704 -635 74 -315 -178 666 391 264 975 748 851
817 851 1118 1366 649 619 877 581 647 500 58 -414 -182 -237 -520 -737 -571 -965 -827 -343 -1419 -1381 -734
838 -734 -388 -1089 -461 130 -85 -312 848 476 223 1072 747 178 885 1130 512 636 1101 492 304 586
858 586 199 -255 -273 -155 -783 -956 -503 -1211 -1583 -754 -907 -920 -937 -139 -609 -385 165 256 2 280 638 496
880 496 984 975 830 723 1205 1212 502 724 629 233 225 -131 -768 -619 -307 -908 -764 -453 -1038 -1140 -660 -565 -1202
903 -1202 -887 -96 -263 -739 -26 680 189 808 919 479 526 1381 993 519 592 947 61 555 583 -360 -137
924 -137 430 -196 -886 -111 -398 -1371 -776 -589 -1426 -970 175 -548 -1045 372 144 -608 -74 623 -81 161
944 161 823 863 1045 1102 574 840 1382 835 -406 327 795 -441 -599 -18 -660 -854 176 -428 -1466 -759
964 -759 -496 -1170 -728 -40 -1347 -1135 812 251 -835 306 1354 138 780 1372 32 269 1328 462
982 462 -263 1499 599 -720 744 1409 -1297 -1064 986 -290 -2252 -140 -8 -1953 -836 370 -869
999 -869 -1100 627 -373 -888 624 351 -1433 429 1426 -97 -102 1707 1004 82 1441 1018 -559 609
1017 609 1272 -654 -220 644 -572 -979 593 -370 -1684 -575 177 -1225 -1162 -116 -908 -1067 137 -14
1035 -14 -473 539 448 -346 1391 1013 -651 407 2077 445 -536 1571 766 -708 834 1257 -806
1052 -806 -533 811 -225 -1410 -218 -174 -1724 -282 255 -1834 -1128 499 -525 -1223 682 523 -808
1069 -808 498 1271 -866 -292 2299 587 -405 2022 1064 -1078 451 2279 -279 -934 1199 123
1085 123 -1619 718 371 -1877 -961 736 -791 -1490 -6 -426 -1648 -53 505 -1030 -428 1037 -272
1102 -272 -268 1896 404 -349 1069 1324 -370 628 1648 72 -208 1196 480 -836 298 563 -768
1119 -768 -661 -132 -967 -935 -167 -948 -990 -396 -742 -990 92 -188 -924 323 1015 -665 65 1496 326
1138 326 -112 1410 1011 -431 846 1795 -165 -421 1142 -297 -826 741 124 -1204 -38 397 -1226
1155 -1226 -693 491 -1141 -1285 496 -52 -1673 266 819 -1151 -75 1814 -170 -771 1787 888
1171 888 -681 533 1453 -196 156 1177 228 -366 789 315 -702 146 377 -840 -712 -518 -1089 -1261
1189 -1261 -164 -399 -876 66 138 -1020 -187 394 -585 -465 768 138 74 1154 969 301 672 1188 468
1208 468 425 863 -243 -97 505 -454 -458 142 -526 -1196 97 -53 -1328 -640 180 -1075 -1207 505 -127
1227 -127 -972 226 859 -289 -78 1237 465 -150 847 953 -140 245 1109 94 80 970 -93 -312
1245 -312 442 273 -901 -121 -89 -893 -735 297 -826 -1213 24 371 -1016 -154 297 -377 -648 323 444
1264 444 -266 621 1144 378 523 1268 528 463 519 467 106 270 130 87 95 -149 -680 -468 -276 -494 -594 -398
1286 -398 -433 -805 -597 -126 -695 -108 149 65 -291 258 378 606 365 400 279 677 351 514 556 551 193 -73
1308 -73 362 -57 -338 105 -209 -860 -225 -258 -616 -742 -495 -345 -498 -599 10 -228 -189 7 180 -1 355
1329 355 603 471 689 771 652 306 477 472 270 124 372 90 -148 108 -301 -781 -241 -484 -600 -665 -459
1350 -459 -594 -774 -475 -349 -738 -209 112 16 51 424 442 325 456 716 513 191 615 568 510 430 786 128
1372 128 0 76 -233 -628 -288 -498 -646 -607 -516 -613 -422 -238 -436 -313 -8 -125 -257 -114 42 -41 188 596
1394 596 657 545 454 781 574 499 390 411 262 197 513 36 -22 -278 -446 -72 -471 -368 -322 -519 -538 -522 -513 -539
1418 -539 -457 -140 -256 119 44 256 207 548 519 443 290 243 576 342 663 509 387 382 201 50 -195 -201 -264 -508
1442 -508 -881 -355 -747 -498 -349 -302 -436 -220 -347 -279 -304 87 -116 -109 370 376 285 367 341 313 568 314 547 466
1466 466 62 -42 365 -8 -104 -7 -140 -501 -398 31 -480 -423 -181 -751 -753 -26 -166 -459 28 233 185 156
1488 156 698 189 -88 605 343 58 673 885 -39 650 858 94 -23 327 221 -282 -51 51 -916 -462
1508 -462 177 -648 -536 6 -464 -498 101 -269 -640 -225 156 -245 -151 642 517 -284 961 695 -279 592
1528 592 811 19 115 761 -9 -375 357 317 -578 -256 225 -769 -409 236 -718 -927 66 -315 -663 212 -142
1549 -142 -257 90 982 -401 -353 1161 500 -283 715 791 -153 370 935 -64 -360 847 319 -822 130
1568 130 -41 -723 -172 161 -794 -713 381 -332 -1048 66 -193 -1037 -324 256 -503 -137 792 88 90 822
1588 822 984 -181 634 1132 -133 -29 704 -88 -361 779 263 -689 -1 -105 -656 -425 -11 -849 -839
1607 -839 65 -377 -1200 137 209 -894 89 829 -465 -371 851 235 -509 703 554 -307 375 1168 -246
1626 -246 -239 862 -117 -567 384 314 -853 14 441 -1032 -761 515 -504 -1083 282 -264 -1375 -97
1644 -97 633 -558 20 643 -137 -451 696 550 -391 474 1124 -68 -23 891 -232 -643 721 79 -557
1663 -557 543 359 -666 -287 336 -786 -651 285 -538 -1261 162 24 -1130 -569 430 -271 -279 1102 352
1682 352 -703 621 524 -400 381 1291 -229 407 806 455 -357 761 159 -648 44 408 -1039 -799 364
1701 364 -388 -672 330 -285 -1076 -60 14 -571 -483 377 -306 -261 389 425 -363 470 936 122 396 923 112
1722 112 -221 602 353 -125 338 313 -546 -23 262 -602 -629 497 -438 -999 -52 51 -666 -329 183 -262
1742 -262 -293 491 183 -202 394 206 96 253 416 10 187 509 313 380 625 -122 -253 186 -23 -379 -260
1763 -260 115 -640 -615 355 -291 -639 -219 -90 -546 -181 255 -79 -596 463 197 98 510 433 213 266 697
1784 697 11 303 550 179 -148 77 282 -285 135 281 -370 -488 212 -328 -279 -283 -229 -513 -452 -109 -61 -140
1806 -140 -31 165 -31 -19 349 312 188 400 372 381 385 163 294 314 148 -189 45 151 -121 -9 -38 -442 -361
1829 -361 -383 -157 -241 -383 -234 -268 24 -236 -441 -224 14 -195 22 391 273 -25 673 236 102 411 650
1850 650 196 200 -133 156 -175 -3 362 6 -315 -28 -296 -327 -510 -403 -336 -338 -457 -251 -102 -230 -43 18
1872 18 10 190 -38 172 74 317 -36 111 415 332 335 116 254 36 253 138 -92 -124 -150 -331 -445 -400 2
1895 2 -374 -418 -16 -236 -449 -342 -13 -101 48 13 311 105 373 182 329 189 63 364 216 219 146 373 -44
1918 -44 99 -30 35 47 1 -328 -81 -279 -433 -338 -222 -273 -261 68 -103 -250 83 -96 -19 4 7 -52 294 5
1942 5 418 333 308 360 423 222 311 195 19 -297 -115 -203 -397 -99 -239 83 -359 -162 -77 -167 -95 -116 -319 85
1966 85 10 61 -23 -52 97 270 115 422 113 406 479 155 17 356 168 32 -18 -31 76 283 -42 -212 -72
1989 -72 -222 -448 -434 -611 -75 -213 -77 -102 -509 101 289 26 -112 -13 294 203 209 243 250 225 385 180 339 292
2013 292 -2 -18 -5 85 -142 -21 66 -173 -361 -198 -425 -289 -71 -48 -27 -359 -9 -325 -22 222 19 -33
2035 -33 462 476 129 198 417 82 347 403 35 302 274 48 -145 154 180 -275 134 297 -501 -302 -103 -415
2057 -415 -573 97 -295 -98 53 302 -568 -158 10 -132 -138 337 304 -61 439 585 81 235 575 -326 60
2078 60 248 6 -272 141 139 -448 -332 389 -500 -238 21 -137 -614 -133 55 -586 -156 142 -205 -237 382
2099 382 -59 -323 452 479 -14 111 543 287 -47 272 187 -372 191 197 25 -21 339 -346 -363 298 -189 -531
2121 -531 -13 -152 -654 -157 255 -205 -151 200 93 -370 332 98 -168 383 214 3 274 504 150 -77
2141 -77 318 -25 -78 134 268 -174 -400 304 -521 -293 173 -142 -746 40 -137 -399 -235 124 -101 -392 219
2162 219 135 -190 388 257 -129 173 688 -126 72 352 -31 -72 195 299 -225 18 430 -125 -503 211 -291
2183 -291 -764 7 -5 -674 -291 422 6 -136 62 200 -274 206 154 -289 260 597 70 51 661 227 157
2204 157 369 271 -227 10 357 -178 -124 332 -76 -279 184 16 -584 -183 -3 -399 -270 186 -223 -258 232
2225 232 33 -231 203 325 130 248 389 -46 -159 661 135 56 465 304 -173 -53 230 -327 -122 265
2245 265 -208 -538 185 29 -827 -214 283 -628 -331 216 51 -463 205 -135 -398 53 89 -254 139 591
2265 591 41 -70 526 272 -429 6 517 -133 -59 292 -147 -452 161 110 -486 -57 165 -455 -395 -29 -70
2286 -70 -471 151 -119 -141 174 68 -122 -9 277 225 -35 315 269 -73 247 207 -69 51 179 -75 21 -113
2308 -113 -83 -386 -81 -52 -381 -224 -43 -389 14 130 -318 -151 -1 -27 -213 -83 315 117 74 472 212
2329 212 -2 497 229 25 287 140 -131 -169 92 -40 32 172 248 -262 15 -38 -566 -65 -16 -531 -159 -175
2351 -175 -312 -273 -77 222 -61 282 109 -61 -234 222 311 -89 258 212 47 -36 -39 230 17 -111 -75 -143 -333
2374 -333 -176 -341 -138 -167 -199 91 -11 -144 -75 25 84 -315 -96 -193 -134 122 69 227 210 224 194 378 353 91
2398 91 324 243 -146 -103 -46 -232 3 138 -197 -150 -96 -106 -6 -47 -223 -339 -194 -367 -91 -112 -247 2 14
2421 14 2 374 20 213 196 175 178 204 343 117 274 190 64 95 104 41 -110 -185 -122 -508 -269 -243 -47 -202 -49
2446 -49 25 -179 53 88 223 88 460 16 173 61 164 323 129 46 33 -42 179 140 -10 126 379 -152
2468 -152 28 66 -197 -291 -275 -108 -440 -297 -192 -179 -397 -52 49 26 -277 119 159 273 237 120 -14 127
2490 127 -8 261 340 325 283 189 266 -310 -127 -160 137 10 -131 2 8 14 -17 -177 -281 -159 65 -169 -314 227
2514 227 -2 -172 -176 103 -180 -13 212 -75 445 320 -161 171 98 -34 191 -52 402 91 -192 -98 61
2535 61 -153 35 -87 23 -79 -62 -285 -132 117 -240 -165 -45 -63 -235 121 242 -68 53 280 -66 55
2556 55 244 97 192 370 102 45 35 -124 -95 -134 -156 -117 -51 -45 -276 -288 -34 -49 -377 -93 -18 -331 -158 127 159
2581 159 -50 151 226 -129 44 197 139 -150 82 168 0 79 309 130 -38 218 -140 -231 146 -19 -194 153
2603 153 -130 -322 -218 -181 28 16 -70 211 -302 -87 327 -400 240 134 -47 204 271 200 -76 159 370 42
2625 42 96 304 -314 -13 128 -121 -274 31 -102 -372 -15 106 -198 -254 104 -179 -213 281 64 -129 119
2646 119 223 -18 213 376 9 308 323 65 4 357 129 -60 5 31 -49 -67 363 -46 -320 119 -62 -459
2668 -459 -125 150 -413 -306 55 -96 -388 -262 170 -155 114 347 -45 -19 386 41 32 45 454 -208 335
2689 335 145 -325 102 215 -71 -106 149 -38 -297 -132 150 -166 -22 155 -393 -256 -20 -263 -548 170
2709 170 -50 -197 -65 64 308 -136 361 -23 -193 436 298 -264 287 182 -196 133 383 -56 -99 -213
2729 -213 35 -181 -80 272 -226 -115 -9 -87 -216 24 -86 -105 -108 213 -255 8 269 7 -42 483 53 -218
2751 -218 181 225 -193 88 386 67 -134 -207 -207 -136 -139 49 -114 19 151 -284 -285 -63 -120 -345 37 174 -303
2774 -303 -174 219 -120 184 169 73 197 214 223 -53 -106 156 13 -149 -133 58 -284 112 -2 -185 -95 -192 -266
2797 -266 -166 -199 -118 -129 -21 -101 -197 50 71 -6 -104 204 180 -179 54 46 -80 418 309 15 320 232 23 123
2821 123 2 -66 -299 -196 -163 -351 -55 -188 -244 -174 114 -49 -55 26 -113 -256 -27 -12 -52 207 279 -103 -55 1
2845 1 -16 259 185 315 -79 26 79 -100 -118 141 -97 -289 238 -183 -208 -44 103 -354 -84 -188 13 -107
2867 -107 -215 -139 -102 -75 -41 -81 46 207 152 34 -130 278 -92 -59 251 -15 -12 242 177 -176 -145 48 109 51
2891 51 -89 -294 -223 90 -28 -161 -55 265 -320 -72 -40 -39 -190 -78 -4 194 100 -66 3 -55 109 -4 160
2914 160 47 68 -65 161 -120 -47 95 280 -249 -145 70 -305 -276 -324 -64 -352 -378 99 -72 1 22 46 -41
2937 -41 52 166 124 258 -170 112 107 120 -109 203 -135 184 123 -12 47 197 -74 103 -61 -91 -159 1 -76 101
2961 101 -230 -125 -83 -44 -37 13 -15 110 -72 265 38 51 158 105 151 -352 137 46 162 105 -131 135 -117 66
2985 66 -6 -11 -176 -126 -26 3 -115 -46 -38 -170 3 -24 91 4 194 98 -95 106 119 -80 4 247 225 -95 239
3010 239 121 -42 20 -8 159 65 -106 -162 -180 -52 40 -31 -128 -1 -213 -197 -222 -102 -166 67 63 -442 -82 231
3034 231 -102 156 172 -8 -110 60 -19 127 31 312 73 19 50 14 -257 146 -292 -30 23 -452 -55 -248
3056 -248 -211 -229 -83 -144 72 -195 8 -71 -35 184 -9 260 118 50 -166 140 174 58 83 245 9 377 -107
3079 -107 -154 45 0 166 -295 200 5 -177 -142 -120 -28 -113 -174 -82 104 -201 -77 270 33 81 -21 59 61 3
3103 3 -117 289 128 -2 244 -215 22 72 -175 0 184 390 -114 -187 157 9 -291 -1 -221 -65 56
3124 56 101 -181 -252 -155 98 -18 43 192 32 82 -24 -156 177 284 -158 -122 -81 -82 142 247 -31 -153 -38
3147 -38 113 -45 -180 50 -162 -179 19 -176 -221 16 142 37 -1 194 -40 61 240 -150 -17 -121 47
3168 47 95 55 134 -87 102 88 68 -245 12 159 -110 -98 -19 -56 -22 102 -186 -184 252 36 -416 291 80 -211
3192 -211 179 133 -51 21 -76 247 -143 88 -127 -148 117 122 -70 -297 -53 -72 -113 99 33 -115 -104 94 -97
3215 -97 -124 36 -66 -221 18 -146 -219 111 -7 -79 -57 44 98 -115 226 127 126 195 62 -1 23 49 -292 53
3239 53 90 108 -166 199 306 -62 98 -29 115 15 -45 -202 -16 -118 -95 -448 -215 -24 -258 -62 225 4
3261 4 -94 78 124 -15 -116 95 -61 -134 324 140 24 300 202 -153 129 8 7 -150 -134 -15 -242 -19 12
3284 12 -37 -35 80 46 -75 119 -52 -78 -45 21 -335 249 22 250 152 32 32 -210 336 179 35 37 -25 -125 -25
3309 -25 34 -155 131 -203 -232 -179 -61 -187 -70 7 -76 -109 68 49 181 -7 328 72 -190 -99 -227 136 259
3332 259 304 175 79 137 182 -3 -62 69 -174 -117 -153 83 -259 -157 -13 -360 -155 35 -155 -62 27 66 -128
3355 -128 286 -100 -150 115 425 138 31 -24 -131 19 -43 122 -288 -248 -118 54 163 -96 241 -11 -74 -93
3377 -93 -18 226 -44 -96 -241 24 55 224 12 -126 71 173 185 40 -1 -20 140 -197 181 -95 9 -37 169
3400 169 -198 -99 -276 -31 -13 121 143 -16 61 87 38 -99 -10 -54 -167 149 179 -36 162 215 16 92 -43 -2
3424 -2 228 -86 -27 76 232 107 86 280 207 117 101 -113 -214 39 29 -246 22 66 -202 -79 -45 46 81 -169
3448 -169 -70 -146 135 -123 189 -50 256 97 152 131 75 -9 98 119 -83 106 128 93 24 -276 -63 81 35 -127
3472 -127 -89 265 -193 -47 -65 40 -65 -232 -156 -136 -159 -211 140 109 -174 35 109 15 241 27 34 6 -127 -37
3496 -37 119 138 31 -211 -88 60 -239 96 -28 124 62 -260 -233 -21 56 -86 -17 -147 -146 -12 137 -203 -138
3519 -138 -8 255 223 -41 -20 187 -18 -25 -23 -109 279 -37 164 232 -211 -175 25 -3 29 -67 -74 83 -72 -118 -59
3544 -59 -238 -175 -94 102 -104 28 52 -86 52 -71 -27 65 -12 112 23 149 -15 206 -120 24 -73 -78 -116 -78
3568 -78 -76 -57 -181 114 77 80 40 85 -50 47 -5 137 166 -122 -206 101 184 -97 -7 117 172 -412 9 130 -53
3593 -53 305 31 -142 122 82 29 -154 -88 -5 -174 53 -56 45 -45 37 169 34 -20 -90 -145 -159 57 88 -96
3617 -96 112 138 -158 56 173 191 -64 168 192 76 230 25 -38 24 216 -126 78 -227 -134 39 265 70
3639 70 -98 -220 217 -239 -47 140 169 -5 35 107 -140 -113 2 135 7 -48 105 113 -49 136 -123 158 -119
3662 -119 -44 -60 97 -225 -160 -72 -162 -72 119 -100 -1 -19 -136 -137 33 48 312 30 -172 130 -36 145 195 118
3686 118 199 24 50 102 -85 13 -102 140 122 -123 -69 -112 -272 -72 115 -86 -363 17 -28 -229 166 79 -34
3709 -34 -178 127 -56 56 32 33 -140 -66 139 202 -104 -36 -83 116 141 298 -164 -174 38 -115 -26 100 173 -125
3733 -125 -134 -41 -103 -284 182 173 -90 -232 -58 -153 -205 39 -316 -55 -35 -176 -34 218 39 -66 2 24 43 182
3757 182 -21 -89 129 304 212 -15 -86 14 -69 -57 -127 16 -240 401 235 174 139 135 -105 -60 103 -2 -49 -128
3781 -128 -162 3 244 69 47 67 128 -55 49 325 -34 -80 78 117 -306 96 -56 -171 -350 -247 190 -260
3803 -260 200 116 48 -262 95 25 -122 -53 366 61 19 137 -163 200 -122 -163 -127 39 -240 -52 7 -135 -138
3826 -138 -235 78 16 163 -184 -59 -118 -114 -73 321 -78 -194 193 159 270 -50 275 -88 33 25 -152 -18 318
3849 318 295 -99 113 -382 -51 29 -142 -89 -3 150 -60 98 -214 -243 135 -124 142 36 -128 -181 -17 154
3871 154 -121 -76 100 15 162 114 43 110 121 13 -74 159 2 -26 89 108 165 -162 -52 -212 -128 -20 39 -75
3895 -75 27 33 -148 -73 -139 -16 -186 -117 -141 111 52 203 88 -25 365 33 -104 -62 263 131 -88 132 -3
3918 -3 62 61 -8 -55 -208 208 -3 -7 54 -162 -264 12 -70 -155 -13 -32 -184 -1 54 2 33 -93 -54 123 133 166
3944 166 97 -206 -134 -87 -18 94 120 -259 79 -51 27 -273 37 6 -371 257 -158 -298 -88 -131 134 174 -298
3967 -298 -8 195 88 -1 -289 37 7 82 113 36 -32 260 333 134 191 101 -83 -223 -69 -119 99 -121 98
3990 98 28 181 257 -64 112 -105 87 -135 -273 56 -42 -54 131 -119 12 65 224 232 -145 -23 201 129 -136
4013 -136 41 -106 -55 171 -155 -152 -106 -195 -206 -59 -146 -76 121 148 95 292 -11 84 38 -85 -88 120 118 -230 158
4038 158 -22 386 -63 -26 0 218 -46 -71 170 73 -80 -93 -209 -38 40 -145 -131 23 -118 -23 -68 -124 -94 149
4062 149 -151 -164 -80 111 -52 -71 -95 98 -3 94 442 161 76 25 66 281 38 167 167 -117 152 -83 -155 -1
4086 -1 -5 11 -5 -181 -99 -261 41 18 218 95 31 -13 -95 199 209 79 -188 242 103 -4 81 10 52 -84 100
4111 100 255 53 14 97 -50 -205 -166 -48 -274 -25 -301 -121 -39 -219 -157 -70 231 -207 -116 -368 125 6
4133 6 140 160 98 83 -20 256 -151 11 0 124 -125 -16 -132 -29 62 126 -160 -72 -5 -404 50 -75 -39 206
4157 206 -283 -276 -85 -181 -68 -124 246 -121 33 -57 6 128 -82 -28 33 24 -136 237 78 61 -120 -139 -265 -6
4181 -6 119 -69 187 80 158 -98 -60 9 35 -80 183 21 -390 208 50 -26 275 103 6 -26 124 225 19
4204 19 63 -239 -60 -127 -8 63 -46 66 -38 28 -58 203 -146 120 -80 -130 -32 -171 -239 -46 -63 60 31 57
4228 57 -394 240 171 -136 -31 -109 232 -70 171 197 -17 212 127 37 -134 -131 69 -18 -300 126 -10 -81 -274
4251 -274 -71 -176 -24 58 -126 54 -165 2 36 8 1 125 -128 -109 24 83 -88 181 137 119 67 150 156 160 -12
4276 -12 -127 64 -481 -2 178 -143 -57 -224 103 -201 213 60 -136 137 77 -75 74 -62 -62 -135 147 68
4298 68 -12 -23 -82 146 -3 -42 -70 -25 -146 -22 -54 -129 150 -32 44 -92 28 52 -274 17 -159 -268 -188 112
4322 112 -47 -5 -21 -300 -150 304 195 -78 166 -1 -105 -59 355 136 -60 104 284 40 261 -75 13
4343 13 193 -184 -95 -305 31 -158 141 45 -49 127 -35 -73 -25 -207 75 265 31 -57 -121 72 178 51 51
4366 51 43 56 49 -124 23 127 -201 -241 213 -142 -146 65 9 10 -383 10 -85 0 -225 347 11 94 65 -94 -68 289
4392 289 111 -211 -77 162 183 -68 52 -3 6 157 31 126 -46 -184 -168 -69 -32 -54 191 -23 54 2 -188 -90
4416 -90 35 2 -90 284 -134 -98 168 112 10 156 64 386 72 -203 -102 -33 -8 127 88 -165 192 176 -51
4439 -51 -169 -54 -283 -74 -109 43 -62 -58 -37 10 -142 -52 116 127 109 -233 204 35 177 32 -15 36 225 108
4463 108 75 -3 -113 24 0 -81 -46 194 -113 -143 -68 -234 -85 -2 208 244 -7 42 -37 123 46 -341 258 -18
4487 -18 -69 214 220 8 -108 45 69 219 162 -206 284 -131 -31 -41 6 27 70 -8 -193 -127 -20 225 -113 9
4511 9 -110 -252 82 24 -78 99 94 47 65 268 -212 -63 201 188 71 340 138 187 -14 174 -47 -67 8 -126
4535 -126 -20 44 44 -149 -140 -79 -206 32 -112 13 12 2 -25 98 -248 -83 -51 -88 -245 95 26 -146 58 161
4559 161 -32 148 187 -97 -103 -217 81 -232 125 257 -161 -130 -130 -60 -111 57 -288 145 -185 -210 6 210 34
4582 34 2 -169 -53 80 -75 320 81 114 -26 128 -27 53 -92 -74 -51 111 -88 68 97 -197 -46 150
4604 150 42 -122 -6 -1 87 -183 -140 59 -67 -382 -246 8 -59 169 -6 244 138 -122 -64 138 -90 51
4626 51 21 267 22 270 -137 -5 238 -236 -130 151 -198 152 -110 8 -149 252 -192 -92 23 132 193
4647 193 -128 194 -88 -92 174 87 40 29 32 74 -61 -45 -119 -60 96 176 -241 -40 78 -98 132 -176 -40 -315
4671 -315 -16 113 26 79 52 172 -87 -101 -12 -6 17 225 44 39 232 143 -204 192 64 -62 -250 -104 38 -126
4695 -126 26 124 -34 -88 3 -323 27 -1 -154 100 69 -94 -11 44 147 53 -90 -88 201 20 20 107 -19 -77 125
4720 125 -79 0 -7 35 -208 -88 -117 -127 -4 -61 137 -166 -97 -172 -151 -124 92 90 16 -109 -53 -211 240 115 133
4745 133 86 92 -53 -13 -69 302 225 -155 191 22 -91 -219 37 -172 60 -46 100 -120 -173 93 -141 -93 -21
4768 -21 -148 26 -75 -155 90 33 -51 231 43 35 62 10 34 -19 340 -23 45 42 92 212 177 86 -12 -124 -166 -155
4794 -155 -240 -28 44 81 22 -14 -145 -106 -117 -160 -22 -72 -130 -191 -206 181 143 3 -8 159 -2 143 -166 3 -102
4819 -102 -181 -43 -72 -234 -24 212 -31 19 -12 -187 5 -151 -367 -36 -216 -171 65 -39 6 209 93 -124
4841 -124 -138 -144 30 229 81 -51 -74 137 -44 10 295 96 -289 91 -258 174 4 -30 46 -216 306 134
4863 134 -161 -85 -115 248 -40 -160 45 47 34 138 155 -155 267 248 -40 -57 -70 236 283 -124 -217 54 40 35 -9
4888 -9 -117 -79 -158 -180 -207 -56 -63 121 -29 -88 -170 -39 121 215 -96 -58 33 143 33 -113 -171 -3 119 -43 -60
4913 -60 -43 -354 341 -128 -81 -60 -125 -32 -86 8 198 -58 48 -393 168 12 -43 12 103 31 -289 69 112 98 109
4938 109 -204 -74 236 337 36 -75 -174 83 192 23 -62 -123 72 -148 161 -181 -229 7 -168 43 15 -423
4960 -423 -102 -41 23 -24 -162 3 153 -27 -123 7 147 47 61 -45 153 -30 218 33 43 194 -48 49
4982 49 259 8 20 -68 5 228 47 179 -15 83 -126 -136 -80 221 -58 161 -74 110 -67 72 61 175 187
5005 187 18 -36 -189 -102 318 227 184 -42 40 7 191 -156 120 149 -108 -34 232 -23 -62 246 64 81 256
5028 256 -122 37 -146 -185 192 20 -78 256 121 -100 22 95 91 231 -42 55 -35 -93 -68 -131 55 -100 93
5051 93 -138 51 2 18 -127 60 -53 -101 -20 180 29 -90 -73 -144 159 282 -22 47 -115 32 -51 72 -76
5074 -76 113 311 -180 83 -36 -90 -25 -59 83 -19 109 -17 -166 234 -385 -26 212 191 126 -145 100 205
5096 205 85 181 -112 -2 -40 25 -116 -37 385 -53 64 23 -133 -73 -48 141 -5 -267 -23 15 -67 -2 -141
5119 -141 -150 72 201 157 -207 121 -39 -74 45 -127 -212 49 217 86 149 -64 9 -291 -45 181 225 22 500
5142 500 -2 -138 8 -183 178 -276 76 250 11 -79 128 -260 -204 -244 -14 22 -127 76 76 -69 -59 -34 188
5165 188 32 192 -97 147 24 275 -147 112 37 109 14 -155 -139 -162 -123 -274 -56 157 -134 5 290 20
5187 20 -88 -180 -11 253 -6 -130 25 -74 114 -108 10 91 92 -64 136 -238 -42 -181 51 -142 -23 304
5209 304 -51 -264 6 148 -247 -134 -145 -131 -137 135 -31 104 -199 123 -222 248 -66 56 186 138 56 -199
5231 -199 -70 221 48 -93 108 -13 -6 18 180 -10 -80 66 174 -62 -35 -100 -182 -39 39 -156 -401 90 120
5254 120 -8 -11 140 -97 -211 -97 -53 -71 322 109 157 20 50 -45 -141 121 -180 -61 -108 118 21 201 -116
5277 -116 67 -181 -141 -21 24 17 -40 -137 -138 222 138 -52 35 -168 83 110 57 122 -28 209 27 -6 -81 -260 38
5302 38 28 144 -163 46 -418 -308 86 -14 -93 94 289 -115 -38 -274 117 -224 42 -9 -300 -41 85 -57
5324 -57 -9 41 -147 -57 -42 -10 30 -35 85 -47 -276 -1 -256 155 -67 -63 87 -5 -118 -81 -185 -21 165 50
5348 50 -118 98 8 -90 -24 275 -50 81 135 -166 -104 -56 199 101 4 -76 128 -156 69 -92 1 -123 -7 -35
5372 -35 -22 -4 65 -83 1 61 94 -236 185 -302 -54 26 -261 -78 94 -47 -350 224 193 -105 190 106 -101
5395 -101 244 -190 63 22 -109 52 -20 31 -30 20 -2 -159 -85 185 391 158 40 316 61 -64 84 -279
5417 -279 -109 4 205 -83 -197 38 29 54 172 -271 310 162 -100 -50 76 133 -87 -47 10 -257 -100 56
5439 56 -118 -31 -43 -15 171 -100 -138 -11 132 34 -120 71 -74 58 -179 97 208 83 -290 -42 26 -46 59
5462 59 129 184 281 102 342 -131 284 277 5 48 5 25 -166 -52 -65 267 136 -203 -76 189 243 280 23 330
5486 330 -65 -185 139 16 -117 -146 119 -13 -135 168 359 -142 -67 290 -336 -162 47 209 -5 -33 0
5507 0 107 -202 22 -176 67 -132 -25 77 -223 -33 -65 -4 -188 -13 -67 38 -184 79 97 59 35 -14 72
5530 72 54 75 -5 -245 -93 145 -94 -135 5 104 166 -232 -34 -67 -163 -77 155 -195 14 -72 -111 -95 -102 -30 118
5555 118 -126 109 -153 80 26 137 27 -184 -32 25 -33 -45 -125 -325 143 -28 -65 3 -9 -95 -25 3 -64 99
5579 99 -40 -1 -5 -31 2 11 76 -174 42 -10 134 -440 132 126 -119 -78 88 -49 -71 -8 16 -155 86 -309 -188
5604 -188 -15 329 37 -147 -43 184 136 54 -217 -197 99 269 169 133 358 134 -196 106 225 127 74 21
5626 21 6 68 -70 308 171 -41 68 -65 90 -300 52 -87 -204 57 179 -100 -159 95 166 26 69 59
5648 59 33 178 28 92 138 -48 61 207 -70 -116 -79 -430 7 66 -110 -69 -73 -129 -16 -225 35 -66 8 40
5672 40 -133 -242 -2 20 -28 -2 28 -25 -114 41 221 52 -19 287 143 47 333 200 180 202 -18 196 59 -106
5696 -106 -158 23 4 -338 -248 -88 -60 11 -116 -67 117 -191 6 167 -376 -35 272 102 6 -51 -93 105 -130
5719 -130 98 -143 65 238 62 -114 158 -181 -31 255 110 -26 -28 -31 -1 64 -69 64 254 1 -18 19 193
5742 193 -17 -200 71 115 93 50 51 -105 -43 -294 125 -54 -151 -89 -18 -107 -41 39 -162 54 -7 -404 -5 62 -75
5767 -75 310 138 -188 -85 108 208 -23 145 -310 82 91 -79 -90 51 35 24 -140 285 53 181 87 -3 -47
5790 -47 -21 -107 115 -145 144 120 -75 10 -260 -38 -68 80 19 199 105 6 81 121 -13 -33 301 33 170 319
5814 319 205 -98 -14 14 -12 109 102 -119 200 209 -220 -78 -120 128 76 -132 18 -37 -349 1 58 108 61 -121
5838 -121 -110 56 -167 309 170 82 57 -273 108 -186 -186 242 165 99 -396 120 -14 -232 -59 -114 276 170 -279
5861 -279 -51 177 181 17 -311 -152 67 158 111 256 41 188 70 -91 43 -27 -6 243 98 19 137 -246
5883 -246 -105 -64 -299 203 73 62 -19 -173 -441 -49 75 274 10 -83 50 -43 -93 -219 1 208 -16 191
5905 191 -5 184 -46 107 157 5 57 137 -125 258 -46 -235 132 -188 209 -23 -149 -103 158 12 -312
5926 -312 -237 -81 -183 -108 10 212 -75 101 -134 2 296 -215 -89 -110 87 -74 25 137 -188 48 121 -61
5948 -61 65 130 72 -218 342 -34 -18 -124 115 165 144 28 -53 55 -145 -36 61 87 155 100 -85 64 248 110
5972 110 185 -84 1 96 -6 -68 -161 -59 29 55 -75 54 153 90 95 36 -101 68 6 1 -80 79 -106 -112 -4 -184
5998 -184 224 99 73 127 127 101 87 -116 3 7 89 -312 78 15 -74 -179 111 78 -100 27 -44 -60 -131 59 -94
6023 -94 -179 42 -176 -74 -182 -103 75 109 64 -10 142 -71 -147 23 125 -5 154 264 73 203 17 -43 -23
6046 -23 65 111 344 11 -103 31 -107 -53 45 232 127 76 -260 -37 -63 -12 -103 -2 89 -132 -20 49 -154 23
6070 23 136 -95 123 81 5 218 -37 -202 -20 -185 -179 187 -185 152 -128 1 -45 -158 164 99 92 -57 209
6093 209 343 369 -44 222 56 191 -2 -2 -36 -76 27 -36 -91 -58 -33 -69 -107 -104 9 -190 98 222 -124 -117 -101
6118 -101 -73 215 299 135 -74 140 -46 -388 70 311 138 66 -246 -67 -68 145 -1 -37 75 134 -289 177
6140 177 -63 4 141 28 -77 -80 78 -194 162 -532 48 238 114 -120 -190 -121 -19 156 -129 -94 -220 -29
6162 -29 -61 44 462 -98 39 -95 -15 150 -26 108 38 -33 -144 48 -128 -148 65 -129 -137 104 -64 -195 -266
6185 -266 -28 -102 -228 83 59 -22 20 -79 136 133 234 -76 94 20 5 312 54 85 -57 -248 -75 224 86
6208 86 187 -138 -66 73 58 58 160 -69 -3 -135 -192 60 14 -63 -71 -31 -198 89 146 175 -56 168 43 186 -153
6233 -153 -197 4 111 29 -182 109 -156 -40 -209 80 120 27 -26 -211 -296 -144 -292 225 -64 122 -99 -150
6255 -150 -61 89 83 -156 294 -77 32 -12 57 0 -76 -63 195 181 61 43 -49 -119 20 20 172 -231 -251 -60 273
6280 273 -488 -24 41 57 -23 -80 -111 373 -15 -45 148 -72 167 -29 24 -80 66 51 6 -317 -25 66 -208
6303 -208 353 -332 -107 101 -88 223 -215 46 -6 68 -180 -77 -89 -40 29 56 108 -89 347 115 70 -110 88
6326 88 163 -86 -186 -63 310 163 -11 227 127 12 8 -41 36 -33 -18 12 100 45 135 103 -31 112 77 -130 -6
6351 -6 -94 -65 41 94 67 -77 -15 25 -18 8 56 92 196 78 -44 -112 227 -85 -3 47 147 209 36 -168 -54
6376 -54 -209 252 -65 -123 -74 7 -208 95 -26 -194 166 95 265 12 235 90 49 250 200 -63 -170 -279
6398 -279 -115 -7 24 267 -174 -128 174 -92 -240 -168 -248 -139 381 -460 -71 -223 -114 198 -178 -85 -24 266
6420 266 63 134 -75 38 98 189 -164 235 -147 -351 26 84 -206 182 -280 -214 -107 -156 -50 -286 -74 -164
6442 -164 -109 -214 -121 355 -36 -112 -45 -42 -145 107 241 189 -8 -51 163 117 247 257 176 31 -199 21 152 -167
6466 -167 -30 196 -3 -113 -235 -68 -125 220 85 -109 14 168 -29 62 106 -202 -225 -59 -33 151 -67 157
6488 157 266 88 71 185 87 -31 -127 13 9 99 -79 -117 79 -162 152 -46 93 -22 29 -164 -30 -224 4
6511 4 -19 234 165 -237 104 92 -134 30 -80 128 -52 88 68 1 -24 155 -7 96 -53 97 204 -63 167
6534 167 114 -104 79 4 7 -50 -5 -124 9 -27 -118 -158 -116 140 30 -117 -9 -49 169 94 116 140 -397 87 49
6559 49 72 183 -31 -101 11 124 -111 -171 -8 279 13 -149 -31 45 80 -63 127 -78 -4 -82 88 -122 -120
6582 -120 -114 18 3 22 3 50 -96 32 157 -43 102 -91 42 69 26 -24 -89 72 -35 184 89 -30 67 -41
6606 -41 21 48 213 -258 -95 -52 -57 -135 211 251 6 90 60 -48 91 208 -75 24 9 160 -111 247 -81 56
6630 56 -85 -68 -125 13 -20 208 -27 -138 122 81 -57 207 221 47 -93 1 -35 317 -30 -30 185 19 -21 -64
6654 -64 77 -26 269 36 356 9 179 42 88 -77 -10 -120 -53 160 105 -276 78 92 61 137 175 -54 -226
6677 -226 -46 118 77 -57 142 27 86 72 -161 221 168 -59 230 160 -69 -207 -361 120 214 -134 96 152
6699 152 66 -13 -207 -85 0 -114 112 -96 -48 204 -303 -78 128 224 85 47 -116 54 15 -49 -85 -84 26 106
6723 106 21 -132 36 171 -154 -51 95 48 -119 39 -46 80 100 -205 -186 -6 5 -3 -250 227 38 -100 -87
6746 -87 215 210 -119 -28 -38 -126 46 -158 186 -401 -67 -13 -40 214 -216 -12 359 33 -27 -45 -4 103 -28 -33
6770 -33 255 88 16 -172 120 188 -31 -15 -3 140 188 -114 216 -17 -149 -26 93 -223 -212 -91 75 211
6792 211 -167 18 -83 44 131 152 223 -48 23 -163 11 -193 -107 -93 312 -196 -94 -50 -28 121 43 150 -39
6815 -39 0 53 -86 155 115 -158 -57 -36 8 275 191 1 44 41 74 48 62 81 -43 54 10 11 -25 1 -28 59 -61
6842 -61 31 14 135 95 145 52 -70 6 21 25 7 82 -203 -312 -51 -73 89 -200 -28 115 67 7 26 119 63 -48
6868 -48 64 285 118 -61 84 129 99 72 97 69 81 -23 -62 43 -231 -274 112 -375 -58 85 -106 65 88
6891 88 -209 -49 -54 -307 -75 -188 231 108 150 -11 -53 184 83 197 -193 -93 -11 -202 158 193 25 59 90
6914 90 -18 -45 -3 -38 59 192 85 107 22 -260 43 -117 -106 -146 -122 183 165 121 19 -61 322 129 -61 27 -37
6939 -37 -16 -110 -7 -9 21 -61 164 139 -97 -305 105 -36 -104 -132 -61 343 -111 70 -181 38 133 6 108 24
6963 24 195 29 79 38 21 -134 3 -40 26 -93 -9 -217 232 386 156 -85 -38 -56 5 192 -140 10 34 -29
6987 -29 -63 -42 -110 282 16 59 115 102 13 19 -46 -27 50 121 76 37 -36 -78 -28 -27 86 -109 12 55 149 200 -43 -185
7015 -185 -29 -301 -150 98 96 -78 -6 -27 122 58 57 -161 -137 -247 -18 116 56 -180 -34 113 63 -120 -68 50
7039 50 152 50 273 93 -249 265 31 181 -272 24 126 -117 -143 -113 205 -61 -100 169 -67 -69 123 34
7061 34 -96 211 74 -137 -99 -123 -153 47 151 130 232 -154 -29 -119 50 -399 -53 -344 -141 156 -53 -179
7083 -179 130 -266 -302 18 152 -164 108 20 -61 16 14 52 138 1 37 -46 -42 40 213 -187 95 -28 34 41 -25 -147
7109 -147 129 -29 -61 195 -22 127 221 -13 -106 245 -134 -125 24 62 81 -290 58 49 202 182 -180 -56 -17 55
7133 55 -158 -16 204 51 14 120 294 -184 148 20 -126 186 -207 211 -329 -92 -210 -104 -101 -36 43 77
7155 77 -26 41 -123 -27 -233 -155 99 125 10 -24 7 31 33 -10 273 186 -74 90 66 260 120 225 184 179 88 -149
7181 -149 147 70 68 -29 123 -106 130 -9 13 -465 -16 74 93 146 -29 172 -84 -228 -36 -282 109 123 -72
7204 -72 -122 -165 -25 114 41 70 210 -264 268 -114 -100 118 -9 18 -154 73 143 212 28 91 -95 -20 -30 -148
7228 -148 -185 -21 20 200 -195 -64 275 94 -49 75 -194 66 -72 204 288 136 175 -258 -320 35 -1 6 110
7251 110 49 -120 242 127 -35 -143 -77 232 -25 40 242 79 57 -114 176 -23 246 92 56 214 32 -29
7273 -29 -118 -205 13 -171 -231 -51 -58 -241 109 -154 -95 -27 128 295 166 81 -72 153 -44 -132 37 -135 23
7296 23 -44 -45 -82 -250 111 -42 38 -98 187 197 218 230 -348 -193 -23 89 15 89 265 218 253 -5 -136 163
7320 163 -24 -66 57 56 -67 -263 134 134 194 -248 -142 -62 82 -15 84 18 -182 -234 239 41 -13 -37 133 -68
7344 -68 -183 84 138 44 -4 -71 -104 -186 -178 -126 -14 164 20 -105 78 180 27 -89 -90 99 -253 61 135 -20
7368 -20 172 127 -130 193 -225 10 -63 -19 24 141 159 144 -20 -168 21 215 24 -155 -196 -31 -239 117 45
7391 45 65 61 15 -43 86 219 28 94 97 -6 -85 29 -267 -54 -328 -100 31 -13 -155 -132 -92 130 47 165 -183
7416 -183 -286 86 176 3 8 39 99 -144 143 126 32 89 -79 -109 271 33 -106 -8 69 -166 103 128 152 74 -48
7441 -48 -120 -197 -26 85 38 -82 163 237 172 -132 16 -187 -268 -32 -12 60 -151 8 -85 -46 -83 137 284 -78
7465 -78 -86 -115 42 87 59 88 -223 -81 -16 123 -117 -4 123 -87 101 -221 106 149 -65 -152 107 -153 176
7488 176 151 -289 103 34 137 -112 -244 -162 122 -1 26 50 15 -139 121 -27 80 76 -108 -56 189 -94 58
7511 58 -6 11 -135 21 35 62 -19 207 283 204 148 -72 22 85 -26 -31 -22 47 -73 -136 -102 67 33 92 69 -137 41
7538 41 -200 68 186 153 119 -73 134 132 -21 -139 169 3 180 -107 -67 107 -10 -78 3 189 -56 -140 -145 -155
7562 -155 82 -47 -88 16 149 -12 -312 59 -174 52 -45 -188 -13 385 5 47 177 -113 71 248 248 133
7584 133 102 196 2 -207 -16 193 256 -136 95 -97 -247 -123 173 -276 -144 -112 -262 317 15 -159 49
7605 49 -27 99 -8 -21 -119 27 -115 81 -259 45 369 -41 71 -73 -146 -304 37 -115 156 -172 -200 24
7627 24 74 -24 -67 17 76 91 -327 -83 -214 -232 10 22 202 113 21 293 -40 38 378 -161 -23 96 -31 120
7651 120 -32 84 -14 37 -74 -119 -124 -20 102 -183 -22 138 -278 27 164 243 51 -82 156 -240 127 236
7673 236 124 -155 25 150 69 131 -46 145 46 -5 -287 114 -166 -40 -87 -81 44 -171 14 226 -17 -144
7695 -144 -8 -12 -20 165 184 -76 -115 97 116 -42 -179 60 123 -73 -104 159 64 155 180 -83 -2 -30 140 -194 -136
7720 -136 7 59 -71 -39 -80 231 -81 -41 -55 -3 397 -126 28 -51 10 -69 -8 70 -81 16 -89 -258 -94 -10
7744 -10 -272 66 13 237 -104 -112 330 -97 -125 63 -113 111 -234 -93 112 -150 -69 4 -73 -2 195 385 35
7767 35 -145 8 -6 -12 -291 145 -359 -109 91 232 122 137 -79 -48 10 55 172 -177 37 7 -285 -115 -28
7790 -28 -155 -185 42 3 -109 44 -319 121 -189 94 7 -170 86 -149 -19 -45 18 -44 48 101 -209 29 -372
7813 -372 110 -144 6 -69 -124 -48 131 38 60 195 -106 -37 -89 15 198 -164 -123 218 51 18 35 21 -146 -236
7837 -236 -217 -134 45 -376 -117 -70 154 -89 -53 31 -88 -47 76 68 58 120 -48 20 -160 265 -36 40 -55 -71 -190
7862 -190 14 54 162 -120 51 110 12 -156 52 54 81 174 230 -11 99 -99 203 -180 -254 200 38 -136 127
7885 127 118 -22 -189 -118 59 -203 -89 -338 -7 -260 149 209 19 77 -8 -47 -49 23 223 255 -130 65 -60 -88
7909 -88 14 -366 217 172 -113 -165 -237 31 67 -5 -173 154 470 -36 -118 14 -61 -88 31 127 -111 242 92
7932 92 43 69 -117 228 181 -29 152 66 19 -149 137 -84 61 -29 149 62 -7 -15 -126 91 -174 71 243 119
7956 119 -130 -33 121 1 108 -8 -122 40 -202 -63 42 -94 -323 -11 12 -163 -18 215 -137 240 143
7977 143 180 41 -112 -217 -40 65 230 -26 -239 -161 -153 94 -57 -1 147 198 170 188 -16 62 -14 -130 89
8000 89 -274 295 119 33 -172 -58 -8 -131 -60 23 -1 -233 19 -142 -164 -102 -260 18 104 -77 -244 8 19
8023 19 32 79 287 -97 -265 -15 7 38 -68 -41 -157 -109 -87 201 -198 214 194 -26 -86 99 -328 0 46 -9
8047 -9 -210 -135 -28 33 -100 64 -89 -125 51 68 -88 42 119 -150 -40 121 166 10 -7 -133 -168 20 134
8070 134 -18 89 31 -60 73 57 92 107 204 24 15 -6 -146 61 3 59 154 -92 27 -59 -16 36 -46 1 35 107
8096 107 151 187 -14 -130 -124 -3 259 -126 91 -27 68 -40 -166 -79 -6 -210 -96 5 64 -196 -123 -142 -48 -148
8120 -148 -62 168 -67 -9 -80 126 -13 -25 -167 -242 139 134 -35 139 16 -308 -73 -29 -73 -156 126 -22 171
8143 171 165 -43 -202 -40 149 123 -133 -18 -3 5 -25 -166 -166 -39 44 -274 96 140 -22 93 176 40 -73 -106
8167 -106 -70 45 234 24 -51 -106 8 -15 -89 -181 -137 260 164 92 40 -18 -13 116 -77 2 1 -147 59 110
8191A10
##END NTUPLES=NMR FID
##END=
