##TITLE=1H_Pr NCO_Br
 CDCl3
 8 sc, 
 20.09.2022
##JCAMPDX= 6.0         $$ Bruker NMR JCAMP-DX V2.0
##DATA TYPE= NMR FID
##DATA CLASS= NTUPLES
##ORIGIN= UXNMR, Bruker Analytische Messtechnik GmbH
##OWNER= root
$$ XWIN-NMR		Version 3.5
$$ Tue Sep 20 14:07:17 2022 Russian Standard Time (UT+4h)  she@DPX200
##.OBSERVE FREQUENCY= 200.1313499994
##.OBSERVE NUCLEUS= ^1H
##.DELAY= (6, 6)
##.ACQUISITION MODE= SIMULTANEOUS
##.ACQUISITION SCHEME= undefined
##.AVERAGES= 8
##.DIGITISER RES= 18
##SPECTROMETER/DATA SYSTEM= spect
##.PULSE SEQUENCE= zg30
##.SOLVENT NAME= CDCl3
##.SHIFT REFERENCE= (INTERNAL, CDCl3, 0, 15.7039)
##AUDIT TRAIL= $$ (NUMBER, WHEN, WHO, WHERE, WHAT)
$$ ##TITLE= Audit trail, XWIN-NMR		Version 3.5
$$ ##JCAMPDX= 5.01
$$ ##ORIGIN= Bruker BioSpin GmbH
$$ ##OWNER= she
$$ F:/spectra/data/she/nmr/H-F/1/audita.txt
$$ ##AUDIT TRAIL=  $$ (NUMBER, WHEN, WHO, WHERE, WHAT)
(   1,<2022-09-20 14:05:44.15 +0400>,<she>,<DPX200>,
      <created by zg, POWCHK disabled, PULCHK disabled
       configuration hash MD5:
       00 E9 B6 7A A2 85 ED C7 34 08 36 98 17 FE 4E 26
       data hash MD5: 16K
       E1 6D 05 D5 2B 3D 44 E0 7C 87 E3 B3 05 F5 8F 15>)
$$ ##END=
$$ 
$$ hash MD5
$$ DC BC 50 3B 30 C7 5A BE 90 A3 EB 3D DF EF 91 79
##$RELAX= 
##$RELAX= 
##$RELAX= 
##$RELAX= 
##$RELAX= 
##$RELAX= 
$$ Bruker specific parameters
$$ --------------------------
##$DU= <F:/spectra>
##$EXPNO= 1
##$NAME= <H-F>
##$PROCNO= 1
##$TYPE= <nmr>
##$USER= <she>
##$AMP= (0..31)
100 100 100 100 100 100 100 100 100 100 100 100 100 100 100 100 100 100 
100 100 100 100 100 100 100 100 100 100 100 100 100 100 
##$AQSEQ= 0
##$AQ_mod= 1
##$AUNM= <au_zg>
##$AUTOPOS= <>
##$BF1= 200.13
##$BF2= 200.13
##$BF3= 200.13
##$BF4= 200.13
##$BF5= 200.13
##$BF6= 200.13
##$BF7= 200.13
##$BF8= 200.13
##$BYTORDA= 1
##$CFDGTYP= 0
##$CFRGTYP= 5
##$CHEMSTR= <none>
##$CNST= (0..31)
1 1 145 1 1 1 1 1 1 1 1 1 1 1 1 1 1 1 1 1 1 1 1 1 1 1 1 1 1 1 1 1 
##$CPDPRG= <>
##$CPDPRG1= <>
##$CPDPRG2= <>
##$CPDPRG3= <>
##$CPDPRG4= <mlev>
##$CPDPRG5= <mlev>
##$CPDPRG6= <mlev>
##$CPDPRG7= <mlev>
##$CPDPRG8= <mlev>
##$CPDPRGB= <>
##$CPDPRGT= <>
##$D= (0..31)
0 1.2 0 0 0 0 0 0 0 0.06 0 0.03 0 0 0 0 0.0002 0 0 0 0 0 0 0 0 0 0 0 0 
0 0 0 
##$DATE= 1663668343
##$DBL= (0..7)
120 120 120 120 120 120 120 120 
##$DBP= (0..7)
150 150 150 150 150 150 150 150 
##$DBP07= 0
##$DBPNAM0= <>
##$DBPNAM1= <>
##$DBPNAM2= <>
##$DBPNAM3= <>
##$DBPNAM4= <>
##$DBPNAM5= <>
##$DBPNAM6= <>
##$DBPNAM7= <>
##$DBPOAL= (0..7)
0.5 0.5 0.5 0.5 0.5 0.5 0.5 0.5 
##$DBPOFFS= (0..7)
0 0 0 0 0 0 0 0 
##$DE= 6
##$DECBNUC= <off>
##$DECIM= 32
##$DECNUC= <off>
##$DECSTAT= 4
##$DIGMOD= 1
##$DIGTYP= 9
##$DL= (0..7)
0 120 120 120 120 120 120 120 
##$DP= (0..7)
150 150 150 150 150 150 150 150 
##$DP07= 0
##$DPNAME0= <>
##$DPNAME1= <>
##$DPNAME2= <>
##$DPNAME3= <>
##$DPNAME4= <>
##$DPNAME5= <>
##$DPNAME6= <>
##$DPNAME7= <>
##$DPOAL= (0..7)
0.5 0.5 0.5 0.5 0.5 0.5 0.5 0.5 
##$DPOFFS= (0..7)
0 0 0 0 0 0 0 0 
##$DQDMODE= 0
##$DR= 18
##$DS= 0
##$DSLIST= <SSSSSSSSSSSSSSS>
$$ [...]
##$SUBNAM2= <"">
##$SUBNAM3= <"">
##$SUBNAM4= <"">
##$SUBNAM5= <"">
##$SUBNAM6= <"">
##$SUBNAM7= <"">
##$SUBNAM8= <"">
##$SUBNAM9= <"">
##$SW= 18.0517283424941
##$SWIBOX= (0..15)
0 0 2 0 0 0 0 0 0 0 0 0 0 0 0 0 
##$SW_h= 3612.71676300578
##$TD= 16384
##$TD0= 1
##$TE= 0
##$TE2= 300
##$TE3= 300
##$TEG= 300
##$TL= (0..7)
0 120 120 120 120 120 120 120 
##$TP= (0..7)
150 150 150 150 150 150 150 150 
##$TP07= 0
##$TPNAME0= <>
##$TPNAME1= <>
##$TPNAME2= <>
##$TPNAME3= <>
##$TPNAME4= <>
##$TPNAME5= <>
##$TPNAME6= <>
##$TPNAME7= <>
##$TPOAL= (0..7)
0.5 0.5 0.5 0.5 0.5 0.5 0.5 0.5 
##$TPOFFS= (0..7)
0 0 0 0 0 0 0 0 
##$TUNHIN= 0
##$TUNHOUT= 0
##$TUNXOUT= 0
##$USERA1= <user>
##$USERA2= <user>
##$USERA3= <user>
##$USERA4= <user>
##$USERA5= <user>
##$V9= 5
##$VALIST= <valist>
##$VCLIST= <CCCCCCCCCCCCCCC>
##$VD= 0
##$VDLIST= <DDDDDDDDDDDDDDD>
##$VPLIST= <PPPPPPPPPPPPPPP>
##$VTLIST= <TTTTTTTTTTTTTTT>
##$WBST= 1024
##$WBSW= 4
##$XGAIN= (0..3)
0 0 0 0 
##$XL= 0
##$YL= 0
##$YMAX_a= 272036
##$YMIN_a= -442599
##$ZGOPTNS= <>
##$ZL1= 120
##$ZL2= 120
##$ZL3= 120
##$ZL4= 120
##$ABSF1= 10
##$ABSF2= 0
##$ABSG= 5
##$ABSL= 3
##$ALPHA= 0
##$AQORDER= 0
##$ASSFAC= 0
##$ASSFACI= 0
##$ASSFACX= 0
##$ASSWID= 0
##$AUNMP= <proc_1d>
##$AZFE= 0.1
##$AZFW= 0.1
##$BCFW= 1
##$BC_mod= 2
##$BYTORDP= 1
##$COROFFS= 0
##$CY= 11.3945322036743
##$DATMOD= 1
##$DC= 2
##$DFILT= <>
##$DTYPP= 0
##$F1P= 2.36226072786647
##$F2P= -0.459571619588291
##$FCOR= 0.5
##$FTSIZE= 0
##$FT_mod= 4
##$GAMMA= 1
##$GB= 0.15
##$INTBC= 1
##$INTSCL= 1
##$ISEN= 128
##$LB= 0.24
##$LEV0= 0
##$LPBIN= 0
##$MAXI= 10000
##$MC2= 0
##$MEAN= 0
##$ME_mod= 0
##$MI= 1.114404
##$NCOEF= 0
##$NC_proc= 0
##$NLEV= 6
##$NOISF1= 3.799351
##$NOISF2= 2.8
##$NSP= 1
##$NTH_PI= 0
##$NZP= 0
##$OFFSET= 15.70392
##$PC= 1
##$PHC0= -18029.43
##$PHC1= 5.00069
##$PH_mod= 1
##$PKNL= yes
##$PPARMOD= 0
##$PSCAL= 0
##$PSIGN= 0
##$REVERSE= no
##$SF= 200.130013532006
##$SI= 16384
##$SIGF1= 3
##$SIGF2= 2
##$SINO= 400
##$SIOLD= 16384
##$SREGLST= <1H.CDCl3>
##$SSB= 0
##$STSI= 0
##$STSR= 0
##$SW_p= 3612.71676300578
##$SYMM= 0
##$S_DEV= 0
##$TDeff= 0
##$TDoff= 0
##$TI= <>
##$TILT= no
##$TM1= 0
##$TM2= 0
##$TOPLEV= 0
##$USERP1= <user>
##$USERP2= <user>
##$USERP3= <user>
##$USERP4= <user>
##$USERP5= <user>
##$WDW= 1
##$XDIM= 8192
##$YMAX_p= 0
##$YMIN_p= 0
$$ End of Bruker specific parameters
$$ ---------------------------------
##NTUPLES= NMR FID
##VAR_NAME=  TIME,          FID/REAL,        FID/IMAG
##SYMBOL=    X,             R,               I
##VAR_TYPE=  INDEPENDENT,   DEPENDENT,       DEPENDENT
##VAR_FORM=  AFFN,          ASDF,            ASDF
##VAR_DIM=   8192,          8192,            8192
##UNITS=     SECONDS,       ARBITRARY UNITS, ARBITRARY UNITS
##FACTOR=    0.0002768,     1,               1
##FIRST=     0,             0,               0
##LAST=      2.2672688,     0,               0
##MIN=       0,             -442599,         0
##MAX=       2.2672688,     272036,          0
$$ Real data points
##PAGE= N=1
##DATA TABLE= (X++(R..R)), XYDATA
$$ [...]
1949H5j44L22k89L90p59m6J014o63O9P6k28N82q43M81M80p03O6r5N2l2j10M09
1971A14k81j30J65r8J40L19j087O58M89j081M30K03j22N72q04K51O8j6M42m83
1991b51M25j08p44P14J66l54M53o55O93K61j056M31K55k58L45m61K26J19j47j5
2011C9j09L50J70o75N58l7p18O31J95m10K58l97N64l18j75N51p60N96J13p78Q18
2032D66l61m63N23k78K46l8k97l0k55N05K15o83N14m57J2Q57p65k43P59m59L10
2053G8P1m16J19J87K44m54q4M88m07J48O15j111N70J88q44N01K73o53N69n6K8
2074E4q45Q80M34j235P63O09j191O73K59o92M29L90p30J51K69Kk52O15n02r87
2094i06J465j21j176J163l52q08J310j94p48J56O85l92o50J413j460r5K064j313
$$ y = [85, -59, 263, -26, 364, -395, -441, 573, -90, -21, 55, -173, 409, -434, 47, 527, -176, -110, -205, -153, -185, -295, 114, -167, -297, -132, -230, -90, 229, -858, -200, 289, -792, -362, -159, -281, 291, -513, -262, -194, -210, 232, -251, 174, 66, -678, 36, 202, -152, 301, -354, 339, 600, -456, -25, 230, -28, 317, -144, 82, 201, 54, 39, -70, 280, 450, -225, 333, 296, -422, 209, 404, -6, 252, -145, 419, 101, -74, 477, -283, 313, 426, -352, 466, 105, -358, 165, -113, 133, 95, -202, -232, -487, 18, 233, -450, 64, -393, -381, 476, -289, -532, 227, -232, 78, 149, -267, -148, 39, 283, -171, -255, 233, -174, -26, 589, -522, 48, 236, -608, -107, 166, -487, 82, 26, 54, -791, 89, 523, -712, 51, 660, -531, 142, 401, -291, 138, 528, -202, -51, 218, 220, -32, 583, 81, -906, 559, 438, -738, 425, 73, -735, 575, 381, -367, -211, 474, 82, -568, 845, -615, -710, 1354, 41]
2112D1j310J809n43n43J199k44j016N86P78j222l03J630j264p1J447j578k74K016
2130A138q88o38Q79l15r12Q18P35j268M23Q36j999P23J500j345L45Q72j433m1
2148e70J210m98n42O70K63j237R75L75j439J219L53j542N37N95j352J170N92j479
2166g00J33Q12r9p86J145k95j271J426q2j423J840l41j145J074j28r17P81R11
2184I35j063m52J186p73m08J535q91q38J701r22q20J459k20q35R16n1j092M42
2202a91P62j037K26J527j931J19J422j562J99J386r79o07R48j16p14J033K67j473
2220g21Q68Q55j894Q64J022j928R38Q84j107j47R65q11l74J289p23j087J650K
2238E45j650J520J53j649J369L52j706R08P83q22o40J941j041j046J973j039r34
$$ y = [41, -1269, 540, -3, -546, 653, 409, -607, -21, 757, -465, -768, 862, -402, -473, 974, -604, -878, 1138, 250, -388, 491, 176, -736, 82, 817, -451, -28, 808, -1191, -468, 1032, -313, 32, 904, -529, -570, 640, 142, -400, 270, 533, -704, 271, 646, -793, 426, 779, -763, -226, 369, -983, 187, 779, -700, -567, 245, 146, -640, 505, 210, -1061, 365, 283, -1140, 700, 359, -786, 288, 160, -757, 24, 935, -128, -580, 606, -167, -575, 960, 69, -769, 932, 10, -810, 649, 429, -406, 510, 459, -633, -191, 571, -466, -240, 1287, -644, -525, 897, -665, -466, 920, -59, -666, 282, 166, -548, 485, 752, -721, 147, 1002, -892, -28, 994, -934, 4, 888, -219, -366, 599, -212, -586, 703, -20, -1107, 543, 545, -1105, 415, 568, -1081, 288, 640, -1066, -158, 625, -197, -837, 1104, 63, -983, 990, -49, -983]
2255i83J796k12j558J407M9j203P08N90j057O6J125j110m44J627q09p25J662j206
2273b77k70J074m22p95Q54L45r95K71J135j045j67J314j336m5R53o33k27J208
2291I42q28n71N23K62m30n5P16j172L94Q59j159M47N45r16L94L10n80J68J27J8
2311fl63P66k84n92Q12l4q88Q51j3q99Q82k0o06L59J6l6j14J85J24p27J026q18
2333c79j21Q72m94j96P55o95Q5K8K9j35r9N83m22R2Q57j006J00P60p29J89M51
2354E25p92K35M54m26l3L23R0o25K23L64q60L27M28o25M55P0k75K78J17j25K8
2375A56j57J17l03L56L2q53J067j00p32P16Pn47K05L69k37j69J85j97l21N86q6
2396I4o57Q05k29n96O33k19l59P29k98q7L4L15k76k90P70j82n71P33k02j25K60
$$ y = [-983, 813, 601, -957, 450, 499, -704, 4, 594, -463, -397, 728, -382, -826, 801, -8, -733, 929, -277, -547, 527, 105, -690, 164, 509, -486, -215, 920, -125, -292, 1022, -314, -359, 594, -39, -266, 942, 114, -457, 66, 328, -102, -157, 559, -613, -219, 640, -519, -72, 473, -443, -49, 261, -319, -151, -24, -6, -369, 397, 113, -479, 333, 299, -589, 262, 249, -650, 232, 212, -394, -35, -19, -55, -169, 16, 140, -587, 439, -379, -500, 372, -122, -318, 437, -258, -173, -145, -116, -251, -350, 233, -189, -97, 760, -246, -146, 614, -115, 74, 525, -267, -32, 422, -4, -37, 286, 376, -249, -26, 338, -522, -195, 233, -392, 63, 133, -142, 136, 253, 128, 156, -1, 116, -187, 169, 201, -652, 415, 315, -417, 299, 306, -241, -36, 333, 96, -73, 112, -85, -406, 180, 94, -563, 242, 13, -583, 50, -169, -528, 201, -97, -184, -150, 165, -111, -401, 369, 187, -384, 349, 147, 22, 282]
2417B82m15rL56j8k56J2J53l33j09M09j51l28L93j42J59p2K23j91rk3K16l42L21
2440A26M8k46M61l91n7K78l06L37q3l45L71m36L95J22l18K68l97j05M59k00J29
2461A10K51m85K44k76K04J1M0K96m25Q5J50m96K08P00q78M19K02l26OK88n2l93
2483a17k31M92j7k41L81o18L87K90o47O6K77k29J95j14J05L0M5K22m70J54p3j82
2505b95K87J13k37M86L6m19k9J42k28j9M17q4m09K99k9j42K87k43l95M86m5j89
2527b10J7K26j28K8L95m98j25O80k29m44N64q6n86P92j14m20O9M51o07R6O83p50
2549a96J05O60j008L99N40o75k58P48m56J77J44k85k06q4Q78o79K14L28o53M80
2569A73J89r33L11P52o01j80M22j35l86L08L71q81O78K47j118Q29M13j088R61
$$ y = [282, -133, -142, 214, 196, -60, -48, 105, -228, -337, 72, -79, -407, -14, -156, 3, -69, 154, -37, -46, -69, 147, -195, 126, 174, -72, 389, -2, -59, 219, -87, 250, 167, -178, 193, -243, 152, 274, -44, 224, -173, -278, 181, -19, 110, 361, -124, 120, -156, 48, 59, 99, 395, -30, 55, 205, -291, -83, 617, -261, 158, 360, 34, 40, 328, 276, -117, -348, 144, 127, -114, 267, -351, 36, 326, -321, -255, 22, -207, -12, -126, -21, 9, 54, 276, -194, -40, -113, -295, -8, 105, -132, 354, 390, -29, -58, 84, -144, -163, 254, 170, -239, 60, 31, -111, 176, -67, -462, 24, -21, -210, -193, 33, -95, -67, 328, -170, -295, 385, 156, -288, 276, 190, -396, 396, 282, -138, -69, 382, -225, -129, 554, -196, -91, 569, -439, -40, 500, -175, -433, 315, -141, 36, 180, -105, -311, -395, 483, -196, 18, 346, -307, 173, 362, -571, -260, 492, -109, -289, 133, -2, -388, -80, 291, -590, 88, 335, -783, 46, 459, -629, 332]
2588C32q7n18K7K58M7l99P02k02p81Q01Q3q50P16N6p17L83M57o94N40Jj4n52N76
2611A65l36l2O89n56m09Q27n43l31O86n9q6K39k81k31L11L59m81j24M81n48K47
2632a3M10n15n1M91m61J71K46j49m17M81o6l26L50m4o13P39%n99N05l9n04N32
2654A28J53m18j19K34l2k98N10N9p00R16l64n88Q72k76k69N44k42m67M67N65o35
2675D0r3O27p39k21Q35m70p0M46m26m43Q46k93l73L02K43n80L81N68o35j15O59
2696D89r23j20Q94m12l0M22l45l76J016m84n27K65N43r18O49J01q62O54M60p19
2716b23j23O66l37j71J58L86p49N53K4n91M16M96p44L55j02m87N86P0k79j98N14
2737B20m04m5N20j16l61M92m27n0N82n19L5K60j54j88K61k13J29j09J26n01K04
$$ y = [332, 245, -273, -246, 12, 59, -340, 362, 160, -621, 180, 263, -587, 129, 185, -532, -149, 308, -386, 154, 155, 141, -411, 165, -171, -203, 486, -70, -479, 348, -195, -526, 160, 101, 15, 254, -27, -258, 53, 412, -69, -193, 288, -260, -13, 397, -118, -169, 322, -139, 32, 278, 129, -288, 193, 127, -199, 151, 107, -506, 233, 233, -366, 139, 100, -404, 128, 281, -137, -256, -22, -54, -352, 158, 217, -483, 433, 69, -519, 353, 77, -192, 352, 110, -357, 110, 675, 40, -53, 574, -165, -386, 449, -21, -91, 355, -71, -514, 332, 39, -334, -32, 211, -369, 12, 580, -55, -170, 489, -434, -554, 340, -72, -102, 320, -25, -401, 615, 131, -396, -131, 412, -506, 143, 244, -618, 36, 496, -223, -346, 320, -17, -188, -30, 356, -393, 160, 184, -407, 9, 505, -239, 116, 14, -473, 113, 183, -96, -294, 220, -184, -229, 291, 175, -186, 306, -121, -171, 411, -108, -73, 187, 33, -155, 106, -107, 22, -87, 39, -462, -258]
2758b58N49n26j87Q07m00j65O69m63k29M20J04n76J00L31m52M48o2n09K72L62
2778B35m92Q8M76o50K26L88l47k24J93K98p30O54N4n19L43K7n41P77M3n69K69
2799ap3j14M19oQn12N50M8q56R11q8q58Q59k0n25L12Rj63m5L73j43k50L29m60
2823b96M0L32j27j63M89j56q4J36j48r9P5K82n16K06N26n59P9M19p75J15M13n68
2845c79K53M2p7J51J79m9n56L36K51l37L8L18n84M40R5m37K82J21k71M7K77j87
2867d7k80K20K72m78L92k69j7M05l41o0J68J10k61l4N95l99L2K23Q2p86Q96l90
2889C3n31O65O9j41L5j94n0P2K76k17j17M5j14Q4M90n12j87N63m56K71j20p2j04
2912b12K12K08j41k14K30l25K20j01J09O1J97k89K91k53m7J14L0J60k52L2L50
$$ y = [-258, 291, -235, -422, 385, -15, -180, 489, 26, -203, 217, 321, -255, -155, 176, -276, 172, 110, -399, -127, 235, -257, -169, 307, -343, -117, 271, -76, -300, -107, 191, -539, 115, 169, -350, -7, 20, -521, 256, 299, -270, -1, -74, -188, 231, 225, 233, -279, 271, 319, -537, 374, 286, -572, 287, 267, -258, 54, 63, -100, -145, 228, 85, -165, 164, -296, -256, 76, -51, -214, 275, 119, 35, 171, 23, -76, -1, 281, -235, -29, 497, -62, 17, 436, -339, -224, 189, -379, -126, -84, -161, -10, 169, 120, -436, -100, 151, -186, -148, 170, -414, 26, 121, -316, -34, 87, -184, -137, 140, -47, -327, -107, 165, -313, 79, -190, -207, 198, -143, -203, -35, 75, -186, -220, 375, -24, 8, 231, 313, -473, 423, 33, -498, 167, 236, 95, 130, -64, -114, -42, 234, 17, -100, -55, -169, -85, 405, -107, -294, 269, -187, 84, -36, -108, -212, 0, 208, 67, -147, 83, -242, -22, -123, -14, 47, 244, -45, 246, -7, -54, 60, 90, 250, -2, 30, 380]
2933C80n09K05J5m24J77K97J2p9j62m4R6j28K96k89J88J6k60K50j49j87N49j56
2955I4j96j0K4n7J94K3kp4J4K74l28J49n1k33J29k10K87n4j04K72k74jJ75l93
2979c52M42j58L7J08j29J6o5K06l5j43j81N93n83K71K02l06M27l34k0J78q0j00
3001fO9J19j52k60L61k93k19N97l72q6L28j86p8L53k83j47N13j32l20j96P58k76
3023I2k08N99o73M6M13k28Q4n3K17m01o9J62m29L24L29m70K85L11n27J30L28k23
3045C9j57N4N4k26K11K46m94J18M69m76P9M82n51J77L44o18K48K8j73L2M95n59
3067a78j44L52m0o0Q0J99m78K58J56l02K68K07j93l31J38N1O1L89k81n41O73j92
3089I2m42N53O4m11J25k4k4j62L72n6k66M84k85l63M63k91o3K75m4m5K64l8j2
$$ y = [380, -129, 76, 91, -333, -156, 141, 153, 74, -88, -132, -36, -164, 132, -157, 31, 47, -213, 37, -112, -299, 250, 94, -102, -112, -88, -145, 49, 72, 70, -4, 10, 284, -44, 105, 54, -179, -50, -260, 27, -27, -131, 141, -133, -134, 41, -352, 90, -68, -31, 77, -52, -36, -101, 105, 70, -73, -254, 339, -244, 27, 229, -77, 350, 16, -4, 174, 94, -6, 63, 182, 30, -230, 131, -162, -381, 216, -156, -242, 86, -100, -178, 175, -108, -255, 258, 126, -194, -390, 368, 92, -116, 483, -190, -144, 269, 41, 125, 72, 289, -112, -181, -19, -448, -124, 205, -265, 20, 331, -196, -66, 262, 39, -118, -64, -10, -236, -25, 221, -273, -155, 314, -162, -83, 399, -152, 25, 369, -249, -1, 27, -146, -114, 381, -178, -322, 30, -10, -70, 10, 209, -269, -11, 145, -157, 111, 318, 125, -206, -68, -17, 44, 433, 152, -389, 284, 92, -350, 203, 267, -144, -19, -43, -67, -229, 143, 87, -179, 305, 20, -343, 120, -171, -234, 41, -3, -48, 216, 178, 166]
3112A66j92K76k95j16M55n59J49M00n89L94J33m73K42L34k35N1k7r8j44K87K64
3133D23n74P2K29m08N08j99j23J42J73j53j20O7J17l32M38r1k17J82j64l2J93
3154A31r7j26L28kl74K33J87l08m9Q6L5n43M63Qj72L27k0l09N00j51p68Q60l25
3177h6k41K95J86l76J32K91j21j99J66j14N2J80l23K48r8K46k71J10M9l99m3L37
3199B1l96M43Pj56J07O0m48K18j00M6P6K28j53j37K62J00j25l7J79l71N08l25
3221Gl14L09k03J43J7R9J07m49J06L49n77N22l43lL58j51J18r1o1J92k00j1K50
3244A74j40J50k09R1J72m36P7M44n71N18j08j47M7J22j39j1j27L23l25r7M10m56
3266b38L86K4m81J50K20m08J29J27J62R7j68M9j82L77k30m5L61m53J44R7j83K61
$$ y = [166, -26, 250, -45, -161, 294, -265, -116, 284, -305, 89, 222, -251, -9, 325, 90, 141, 114, 16, -128, 159, 423, -151, -79, 150, -258, 250, 51, -72, 70, 243, 90, -30, 37, 154, -178, 260, 169, -48, 134, -30, -62, 131, 34, -92, 236, 234, -140, 93, 280, -28, -77, 9, 44, -499, -36, -28, -200, 127, 107, -202, 298, 147, -621, 239, -86, -327, -32, 154, -222, -90, 201, 80, -119, 47, -67, -15, 165, -158, 90, -8, 238, -33, 77, 126, -273, -316, 21, -375, 68, 75, -81, 26, 86, -362, -144, -244, -198, -122, 106, -47, -184, 78, 178, 53, 16, 195, -176, 332, 7, -307, 2, -201, -58, -41, 58, 165, -284, -178, 171, -406, 116, -227, -230, 128, -23, 95, 4, -57, 135, -65, -76, 174, 34, 184, -25, 66, 238, -198, -121, 323, -248, 270, 162, 15, 62, 184, 45, 34, -93, 230, -95, -192, 218, -238, 148, 172, -309, -159, 61, -347, -218, -91, 71, 168, 0, 49, -133, 244, 14, -31, 330, -123, 21, 118, -65, 196]
3288A96j16j1n4J8M5l48L1M82k91j70M21k74P8J57m20K6N01k55m5k6Q0l16J81
3311a10N06l61j04K80m97K88M35l97j64N25n66J57k25N10n28K37K70m68J79Q2
3331D9j70K71j76j37o9K39k01L04j18O6j0k9Jk32M96k30j45n8K26k08O1K17l36
3354a89J71J67l02m6M72j61k84K31m21L25J64q2m42N02l84L15j85K72j43k34K57
3375CL7J01j30J2J63pk0j36L13m64J26r7L02k73J9M80p40M59k60K69j69r0r3J16
3399g9j8K60l76K06n2lL1K79l67M2K08k70J07J74j4j55K1J44k03J10L8k44J97
3422C6j06p6K94j6l67K13K18m22L41q4j48K70k68R7j51J50K4j72L92j69m3j28
3444a15J00R0N5l04J12mJ84M2k67L43o03K42J73k37k34L58N7J3K35l03K67n70
$$ y = [196, 80, 69, 15, 33, 78, -270, -239, 243, -48, -218, 203, -71, 7, 164, -256, -230, 271, 16, -29, -55, 25, -291, -110, 396, 35, -69, 211, -286, 2, 437, 40, -124, 401, -165, -8, -233, 277, -251, -14, 256, -212, -33, 49, -121, 150, -26, -163, -232, 7, -194, 110, -8, 58, 48, 19, 20, -212, 284, 54, -91, -149, 77, -131, -70, 147, -189, -18, 149, -153, -199, 273, 112, -172, 59, -362, -37, 127, 45, -397, 105, -279, 36, -149, 123, -20, -254, 3, 40, 141, 11, 23, 186, 179, 159, 23, 336, -128, -2, -99, 203, -70, -51, 429, -311, 148, -112, 157, -12, -102, -195, -79, -97, 163, -213, -7, -59, -62, -31, 248, -119, -77, 131, -139, -32, 142, 128, -27, -6, 138, -65, 45, 83, -161, 36, -70, -146, 148, 132, -235, -22, 196, -226, 115, 31, -117, 153, -115, -18, -169, -19, 5, -167, 225, 56, 13, -115, -15, 75, 130, -174, -62, -66, 118, 160, -107, 236, -367, -125, 48, -189, -423, -65, -8, 5, 240, -63, 204, -366]
3466c66M45p0R6n4o1R7j5j68j4L87k60j25J79K5m5o4j6j78N6M48m89L39j18k99
3490b70o0J64L11K7m43K76J36k45L75k21q9J2k02K18j02J18K05l84L81j37n1j29
3512a10J31o5j4J34k45m2R4J55L7j78J21r5J84j09o4J75l7J29j89l65N07j16j48
3535a10L54j81Q1j72K5L2j20l0R6q7j9K10l14L39k49J40J34k08L6j08K96q6Q9
3558A48n7j07mo5R3J40k34O3P4J70k24j1j0J24j36m6K18J03l70oJ86j12L39k06
3582G0j65J05J43j7kl47R0Q4J09n0L0j76L71l72M8N8k20K09J65k66L11K9k96o6
3606a55L46k32L5L8l90J25K74J09j5K6l09R1p6L86j36j14n5R0k11K56j83J66K09
3629B75m39K95j59Q3K5K07l22k81L64j73j10M37r3o5j28J29n7k9K92j98l83L90
$$ y = [-366, 79, 9, 105, 51, -10, 87, 72, -96, -110, 277, 17, -108, 71, 96, 51, -13, -29, -207, -151, 297, -192, 147, 29, -270, -330, -166, 145, 172, -271, 5, 141, -104, 271, 50, -39, -27, -229, -11, -113, 5, 210, -174, 207, 70, 19, -110, 21, -44, -58, 76, -169, -211, -117, 38, 75, -103, 18, -77, 107, -2, -66, 109, 72, 201, 12, -353, 154, 38, -110, 244, 63, 144, -28, -3, 29, -91, -121, -25, -112, -131, 79, -235, 104, -145, -5, 129, -79, -43, -151, 145, 59, 148, 91, -16, -20, -85, 8, 148, -86, -23, 51, 221, -3, -14, -24, 100, -36, -82, 136, 239, -131, -137, 49, -63, 276, 70, -95, 10, 153, 136, 134, -213, -123, -39, 70, 20, 50, -126, 245, -127, -79, -21, -241, -32, 133, -133, 178, 207, -89, -155, 191, -41, -6, 32, -358, -233, 41, 150, 135, 161, -148, -57, -133, 253, 117, 3, -52, 38, -173, 83, -100, 66, 275, -164, 131, -28, 55, 80, 287, -35, -316, 48, -125, -235, 202, 109, 44, -84, 45, -12, -41, 251, 53, -330, 60]
3651F0k65K2K47k25n7K74J45k39Q2k03K58kJ92k50O4j01R4P0J61k16j54R7L1L9
3675A24j03k14J95Rrp9O7K26l47L28k03o3J06R0k16R5q4O5j35J97M2j82M1Qj3
3700e5k0K08l13L71k48K09j80J19j96P7K67m86M78k69J72l7R6j92j17r1M71m33
3722a69K68j23l0O1j13K87j99j90K97j1O1j86J14J97n07J83P1m09N26q6l46N86
3744B82k18j8j96J58m4j61R8J32K59l12J09j4r9O0j97J42P1j12K23j06q8r8K71
3767A42k14j06J06J58l87L70j47J10j20j30R7K29m6l85K44P0n6j2K26r7j95L08
3789A65J22j73K0j45Ml4j39j36K49Q1J17l41N34l05K78l00J33m1j32k60L46m7
3811dJ5j55J18j29j75L48j21j76L80j24q7K9K25l27k0L19j90J83j24p0K14Q1k36
$$ y = [60, -205, -183, 64, -161, -218, 56, 201, -38, 44, -159, 99, 97, 289, 39, 103, 2, 96, 166, 327, 111, -43, 54, 85, 124, 21, -193, 2, 11, 2, -77, -10, 216, -131, 197, -6, -69, 37, 127, -89, 6, -78, -13, -148, 49, 91, -91, -50, -42, -55, -75, 133, -180, 191, -57, 152, -28, 91, -105, -28, 239, -247, 231, -38, 134, 97, 193, 1, -116, -207, 264, -169, 99, -24, -54, 7, -106, 181, -18, -208, 89, 78, 139, -47, 67, 264, -243, -60, 11, -398, 128, 42, -304, 282, 64, 46, -150, 8, -36, -197, -99, 33, 292, -20, 89, 75, -24, 36, -161, -19, 52, -60, 163, 57, -31, -129, 142, -72, -178, -72, 86, -301, 69, -78, 32, -88, -218, -121, 108, 62, -323, -79, -9, -65, -77, 149, 52, -143, 165, 287, 114, 134, -11, -7, -41, -180, -316, -67, 14, 131, -210, 324, 19, 297, -3, 130, 89, -43, -303, 43, -4, 11, -144, -26, -155, -330, 18, -103, -279, 101, -23, -110, -81, 144, -183, -203, 116, -74, 109, -15, -85, 129, 210, -26]
3834b6l61N81Jk78M0L7L7j19J27j43%K65Ol59N96m34k76O96l49M4L76o14P4k9
3858a08J60j18J35j09j32J50K20k79J30Q5k73Q9J12J02P7q3j49n2j25J55j09J37
3880A5K59k32Qj08p3K36J39l12J62R0j99j71J34K05J1l48J5l4J75r9r5N24l66
3903f4k08J99p9K58j24k93M74k19j41K86n4K5j79N5L38k40l9N1k31K75m63N16
3925A43j00l5L49m81K34m3O7k9Rk83J14r6J71J44j6l09M0M8L35m12r1R8j1L89
3949B35r3l60J91k57M26K4q7M6r5l6K43k06J40r1k44K79j47j0n4J6L3j16M1J75
3973E3j43K39j14p9j30L44k29K01k63N9Q9j98J37j42K12m3j0J78L1l61P2P2o7
3996i2J43q3J05j01l0q6J91M7q2m9M2q5Q6J33k82J65l5j20NK57k47J35j02k69
$$ y = [-26, -387, 194, 195, -83, -43, -6, 31, -88, 39, -104, -104, 161, 167, -192, 404, -30, -306, 390, 41, 85, 461, -153, -79, -108, 52, -66, 69, -40, -172, -22, 198, -81, 49, 134, -139, -50, 62, 164, 241, 158, 9, -43, -168, -13, -122, 15, 274, 42, 50, -58, -131, 105, 244, -68, 94, 184, -15, -186, -52, 153, 164, -184, -169, -203, -28, -127, -222, 302, -64, -272, -73, -152, 106, -18, -311, 163, -56, -197, 89, 35, 60, -119, -64, 274, 34, -5, 46, -185, 90, -373, 143, 43, 8, 357, -124, 110, 67, 134, 105, 114, -169, -55, -151, 20, 164, 148, -161, -121, -73, 262, -150, -241, -143, -154, 235, 142, -218, -27, -284, 142, 166, 79, 125, 30, -6, 237, 31, 171, 80, -164, 115, -32, -42, -96, -80, -47, -163, -122, 53, -90, 149, 35, -44, -174, 170, -59, 142, -121, -62, 27, -171, -34, -176, 36, -7, -17, 161, 192, -169, -97, -25, -92, 51, -32, 73, -28, -58, -144, 47, 94, 12, -37, 5, -80, 6, 139, -143, 22, -13, -133, -128, 129, -118, 17, -85, -354]
4020c54N02j32J66k04N4O7K38m40J68k67K30l9R0M6qm3j4j04J24N2j8j6k32M3
4044i1J31k76J41R1j57L57k44K55R9m53K59j0P3l60K88j22N5k10K20j0J38j41
4066C3r4J8J13j09n3J04j0r2r0K42l88L31o7JK66k55j18M20m12K29j64L19r0l9
4090I5N6q0k34M4R4L6o4k29j5J93P1O6k82K47P2O3j62J79l20K60J30j97op9Q6
4115B4L8j16K39l05L5J62k14J98j77L03j03k34J83n9j34L69r2j64O0j12R5j2l
4138a9J19l49M45o1L2j54r9J17j30j4K17p0j45L3Q5M6k18r6J14J29J8QL2j30K3
4163f7j92J66J25j25J13n7K07l93N18k60q0j47J73k14L21J20l48K41K88m62Q7
4184A4k0o9K06j33J41j67K02k63J6l9j1P3j8M2J19k88K55Ol27J77K20k76n1M7
$$ y = [-354, 148, 16, 182, -22, 32, 99, 337, -103, 65, -202, 28, -11, 79, 125, 117, 74, 60, -44, 80, 132, 114, 98, -134, -91, 40, -236, -95, -4, -161, 196, -48, 207, 306, -147, 112, 102, 175, -185, 103, -19, 36, -174, 46, 36, 174, 33, -61, -43, 70, -39, -92, 12, 2, -90, -180, 62, -326, 5, -62, -61, 205, -50, -168, 252, -160, 69, -95, 224, 134, 95, 151, 71, -163, -119, -25, 11, -53, -282, -297, -104, -33, 33, -249, -2, 70, 133, -29, 150, -170, 90, 220, 23, 17, -62, 24, 62, -54, 185, -120, -85, 77, -137, 61, -116, 187, 84, -150, 33, -26, -160, 209, 117, -47, 13, -99, -4, -16, -19, 100, -249, 196, 135, 167, 13, -86, 31, -99, -113, 104, 34, -111, -78, 7, 53, -165, -261, -147, -18, 0, 8, 40, -90, -67, -259, -93, 32, -93, 20, -37, 170, -223, 295, 35, -45, -192, -19, -233, 88, 208, -140, 101, 389, -73, 14, -6, -75, 131, -2, 139, -28, 174, -89, -73, -112, -123, -50, -68, -26, 93, -195, 60, 66, -261, -84, 136, -140, -191, -144]
4208a44J20J77j67J8J5r3K36j74P5j23j68L00RRj68Q4l3N7k61J85Q0j67K22j08
4232a9n1J39M6k05J35K54k73o7j4j3k3K30j81N1m5k83L95K9k19R4m8K64o2j75
4256d1J56j46k9M9R0k75K32j18K91K6l02j9J52K37k09k53L68l23k81M29j70K51
4278A15q7o9j28L25j86j36K0l1L11r0j43M5Q5J04l31K43K08l69K58j55Jr5j8J64
4302D1k46L5K62l42L26j92j77L04K22k79K67q5j17J96L5j46P3j88j94K13L2O9
4324A09l00K70j32J2L9j38K95j37N3J75j68j71K74j76k69L00L3j20m5L5J15K2
4346G6J18k51j68K19o9J84k62M07k9l57j9R1M3K63m03J19J88k9j51j41K42r8q5
4369a12M6r7j08N18n21J47M3kK6pJ66j30K7K12n3j58N2k53J65L75n80K62k90L23
$$ y = [-144, -24, 153, -14, 4, 19, -74, 162, -12, 63, -60, -228, 72, 81, 90, -78, 6, -27, 30, -231, -46, 34, -133, 89, -19, -70, 69, 115, -90, 45, 299, 26, -41, -55, -68, -91, 139, -42, 9, -36, -319, 76, 105, -114, -20, -68, 196, 134, -41, 115, -31, -60, -11, 79, -196, 36, -82, 209, 235, -67, -86, 66, 303, 94, -159, 209, -114, -395, 34, -136, 115, 28, -41, -169, 156, -30, -166, -146, -177, 134, 44, -99, -54, 31, 135, -196, 47, 255, -114, 144, -11, -10, -105, -123, 41, -205, -170, 92, -250, 76, -116, -293, 11, 233, -46, 221, 136, 19, 215, 250, 104, 177, -11, -205, 8, 40, 109, -191, 79, -53, -41, -2, -140, 155, 18, 71, 246, 78, -93, 181, 5, -264, 36, 69, -51, -96, -61, 54, 76, 194, -57, -225, -6, -75, 109, -153, 254, 225, -132, -151, -60, -17, 246, -157, -38, 150, 121, -30, -171, 71, -27, -112, -66, -163, -271, 247, -274, -127, -84, -86, -60, -67, 99, -31, -4, 208, 155, -3, 49, -204, -39, 336, -244, 18, -272, 51]
4393E1J1q6Q3j79J16j1M5k6L04j97k96L53k02m6R0j39O3K43m19J59K12j64mK9
4417a0J39j61j50L11n53M43J10k02mJ3K17m91K73j1q4J18R6m30M51O5j80O5j54
4440a29K08Pm7k50J60K9N8J6j36j9LK58K7k91M4K01j63J99l7l93L13k15J11j79
4464b25K73O1j14Q5k18j4J90KL0r0J25J58m09K73j4o6j2K0J06N1m62P8K52L5J09
4489B24j29r9j68J43j9J51K1J01j90j2J25j38L4j7j79J18K69Pj56K2j73m1J19
4512A3l20K24J49j34k8L1Q4J51p3k5j38J06K04k93J1J19J02l03K11m22J04M05
4534A78j33J25j45O4j23j7J2L01l40J79k18K7K28q3j19K38j06j82L7j42K84m3
4556B2m5r6l0K46l2J50L9k39M7q8n7J71j95l9J04j03K33k30J65J44P6l25K66l7
$$ y = [51, 62, -24, 59, -120, -4, -15, 30, 4, 308, 111, -185, 168, -34, -80, 10, -129, -66, 177, -242, -83, 129, -35, -39, -10, 129, -32, -182, 129, -424, 19, 129, -73, -77, -64, 153, -338, -65, -76, -160, -42, 54, -376, 75, 140, -40, 25, -129, 79, 86, 39, -211, -51, -22, 36, 52, -84, -103, -100, 158, 185, -106, -62, 139, -24, 175, 138, -255, 58, -157, -46, -225, 48, 109, -5, 80, -138, -152, 38, 40, 70, -20, 105, 263, -146, 127, 113, 47, 35, 55, 161, 212, -250, -172, 80, 115, 224, 95, -4, -172, -29, -48, 103, 124, 225, 35, 23, 148, 10, 44, 27, -152, -34, 235, 242, 86, 108, -65, -106, 13, -307, -83, 66, -68, -96, -65, 19, 170, 97, 72, -66, 40, 244, -49, -38, 81, 183, -120, 91, -331, -227, 178, 45, 170, 25, 89, -34, -51, -39, 262, -78, 101, -117, -90, 138, 55, -64, 174, 68, -114, -77, -219, 65, 22, -23, -119, -149, 97, 65, 215, 254, 15, 62, -26, -83, 88, -107, -146, -42, -145, 88, -142, 23, 167, 243, -82, 184, 147]
4580A47qk5j09K15l61O2K50j98J77k49O8J96l01K23k0L17m35j2k84L50P6Oj79
4603i4K01l6j72jQ7r4K24k1l21J66K78m40M21l41J98Qr5r0O8Q0p5O6K11k41m0
4628e3p2J36K82r9l97J48J40m4J19q8j02J53L7k68q5J31N9N4j61J53o9j93J25
4651i4P6m4o3J21Q1j40K74l00J56J37j69p1J98m78J90n4K54r0k80K85j81L30j15
4674B3j08R3j08j27J41K83q1j78j03K96j84J4Rm4J40J23j31P1j72j51O29n83N7
4697i1l1n9M23j26Pk13R9j68K02o1K23m81J24M05k24q5K69j47P1l60j6J06L19
4720A86R8n11J15J24o9Rj4K12l5r0p7ql5Q6j17J58K02n3j30L3R5j20j07R7r6L44
4746B97l14K3l5J63n9pQ4k33M9J44j9j18J13k80R7J47M9R7j78l7j53K42k4Kl9
$$ y = [147, 139, 114, 5, 220, -141, -79, 171, -27, 150, -99, -31, 165, -136, 87, 67, 384, -51, -63, -347, 3, 79, 85, -94, 107, 71, -101, -102, -15, -109, 115, 94, -227, -61, 217, -223, 198, -143, 55, 63, -32, -122, -54, 26, -49, 17, 228, -13, -53, -125, 11, 293, 194, -203, -55, 85, 41, 160, 72, -30, 123, 160, -108, -193, -62, -3, 51, -110, 43, -26, -219, -94, -18, -62, -125, -4, 77, -63, 211, -89, 67, 204, 35, -36, 162, -316, -126, -180, 74, -16, -296, -11, -192, 138, 23, -85, 8, -100, -227, -86, 197, 116, -62, -165, 131, -53, -39, -30, -74, 66, 189, 58, 129, -43, -194, 435, -148, -91, -122, -181, 242, 116, 123, -90, 9, -159, 43, -18, 205, -276, -152, 253, 29, -56, 213, 66, 137, -223, -239, -133, 186, 284, -227, -112, 12, -57, -48, -62, 150, 115, 25, -52, -60, -95, -9, -126, 32, 234, 181, 51, 84, 179, 59, -48, 49, -47, 297, -17, 6, -29, 134, 75, 68, 152, -81, -32, 112, 93, -25, 88, -192, -95, 52, 101, 198, 20, -17, -170, 72, 48, 50, 11]
4771A1j94ON22l19k3k00k00N39k85l3J72j4K01l0l62K50j76j20K6K28lj24L19
4794A91J23k61Q6k40J71K1J6j03j54J81j4j25K31j21K7Q7j81LrP8p8J13k2k2J05
4819A03k72j39J3M55j94L3K6J67J03l74o6J59o5o4j03K48jJ44l08J77r1K04J26
4842B81m77L15J28m13K25m70K93K61r0o8k8m3K83j33k1J26m00k1O36m69K05j77
4864e7K10q0m7J10Lq5k76J56R2J09o0M8k42k11L87k73M02k67Q4Mq2l9N7M5N6l0
4890A4P7P9j43n7K60q9p1K32n94N8K97P3l20K44l12J42K78j57q8K34k44m2L04
4913A75j94k50L71n4k12M13j97j09J8M1P3l7k8L10l09kP9J37k16k24K90Np8J07
4937A09j53RJ96r7N6M5j97J81l82J64J11O6K61n59K32N4j26J59N4k38K36j11j87
$$ y = [11, -183, -177, 345, 26, 3, -197, -397, 142, -143, -176, -4, -18, 183, 153, -209, 41, -135, -255, -229, -1, -4, -128, 191, 314, 53, 139, -101, 70, 91, 107, 4, -150, 31, 17, -108, 123, 2, 29, 116, -65, -62, -71, 7, -71, 42, 20, -2, 103, -169, -308, -295, 160, -34, -1, 25, 192, 295, -79, -145, 14, -51, -115, -218, 30, 29, 173, -135, 42, -49, 155, 281, -196, 119, 247, -166, 59, -411, -118, 143, 53, -15, -43, -86, 197, 64, 43, 169, -231, -252, 384, -85, 120, -57, 153, 73, 26, 136, 139, 54, -222, -66, 26, 135, 75, 123, -119, -330, 57, -216, 186, -81, 3, 7, -75, -114, -57, -12, 44, 14, 91, 170, 27, -30, 230, 141, 70, 302, -292, -234, 63, 136, -184, 60, -252, -110, 168, 11, -77, 157, -87, -129, 175, -19, -269, 102, 48, -164, 249, 52, -57, -39, 2, 75, 38, 10, 320, 11, 9, 88, 225, 9, -215, 75, 80, 2, 109, -44, -35, 161, 64, 120, 165, -32, 149, -233, -69, 42, 108, 369, -190, 42, 96, -30, 129, 183, -55, 181, 70, -117]
4960a17k6K38j80L07k08p7K05k2m9k47K20k0k00K15L2p7Q8j67LJ26J34j52j62
4983a36J19J26j34j62K67l5p1Q9k88L29k01K97j31j92M60o67L66j7j61J63j20
5004i9K30j38P2p9J68n0L4j7J05k71j41K17L9j84K8J46m9L1K8k6R1j06K11k27
5028A3J08j32k7j18J79j36J62k8J19l55L59l7m7P8J8O7j46Oj1j23j2M0M8K14p3
5053A66j54K09k23m3m9J77j48j47K24k78K82J25k46pK01j80K57m8k56Q6L15j73
5075I0k40L43R7k53J10M3l12J69LL2j98J46k24J57K39j9j17P6k07J29J8l83L99
5098I8L7j80q3P6K20m39K53K8K09q3N1j27m08K32Q9k16K4L29j21o9pj11L54l37
5122a81R5L04j05P7k40N8j71k4K09P4O0L5r8k09J48n6j72K67K7k26M9J19J29j19
$$ y = [-117, -143, 95, -85, 222, 14, -63, 142, 120, 71, -176, 44, 24, -176, 39, 71, -6, 82, -85, -82, 44, 178, 26, -136, -17, 109, -25, -187, 80, 45, -26, 63, -225, 104, -97, 200, 69, -123, 337, -330, 36, 19, -142, 21, -99, 131, -7, 65, -14, 154, 104, 138, 121, 226, -45, -186, 31, 70, -114, -86, 60, 11, 42, 70, 44, 135, 29, 240, 13, 121, -11, -38, -156, 23, -113, 49, 21, 140, -215, 144, 107, 60, 138, 156, 223, 77, 83, 72, -51, -63, -23, 25, 239, 166, 12, 221, -2, -45, -94, 83, -65, -212, 12, -266, 16, 141, -105, -112, 89, -91, 166, 118, -138, -52, 263, 90, -150, 193, 290, 37, 147, 190, -122, 47, 50, 82, -116, 30, -194, -37, 202, 183, 66, 142, -65, 64, 82, -301, 98, 135, -45, -128, -52, 168, -271, -18, 10, 219, 136, 187, 60, -348, -116, -27, -243, -219, 110, -11, -80, -87, -198, 156, -181, -86, 218, 113, 190, -50, 8, -163, -187, 22, 96, 156, 191, 93, -116, 32, -24, -196, 71, 98, -128, -79, 40, 169, 50]
5146E0j2Jl46K37K0K39j43j57n1M09l89R1p2K24N3o1o3j07K45l9j71P7j57OR4
5171b2j71L03n8J8qP2p1k06J61p2M3LR9n1k75L04m3J36j07j49J46J78l9k07j12
5196a28L3J36K1J8l9ok9J07j44M5MJ91k22j14K12P7l97K98j08n4K56o9j50M2Q0
5221F0j21J66l06L03o7j51R2J2j39K01j70n3lL18K8l4j83k3L33j80J43n3k70K01
5245A04Q4j61r2J07O3k08N0k12k9L09Q3k36J16N6k49L78l14J36J44l31N1qJ49
5268a0M1J41q4J1j36j5J38j81M9o4Q6N2Q1J63l84Q0J74J27k70k67K45K0q1L3J86
5293A35j84L35l57K29p5q6J62l8j54J42R2r1j59k0K94j36j56N0J69l30L40l51
5315a89J92M4J2j28K13j28P1m9J18k15Q9q5q0k3k4L00j97P7J38j70k11L08l9J24
$$ y = [50, 38, 39, -307, -70, -50, 189, 46, -111, -162, 247, -142, -51, -123, 101, 154, 93, 30, -77, 168, 129, -42, 35, -122, -116, -22, -193, 110, 52, 70, 62, 134, 63, -143, 18, -54, -11, -8, 91, 40, -235, 69, 26, 162, 55, -94, 52, 230, 191, -16, -128, -95, 41, 62, 80, 41, 35, 6, 113, -31, 14, 18, 209, -13, -127, 85, 162, -235, 63, -45, -99, 157, 88, -62, -20, 60, -61, 105, -201, 102, 35, -116, -24, -12, -151, 50, -120, -173, -176, 142, 170, 136, -47, -70, 263, 83, 226, 173, -97, 104, 188, 27, -65, 42, 105, -103, -53, -265, -294, 15, 98, -138, -22, 34, -215, 163, -151, -15, 129, -202, -151, -159, -10, 31, 172, 88, 99, -37, -52, 86, -95, -46, -110, -24, 28, 109, 272, -112, -32, 142, 269, -1, -268, -23, -3, -84, -51, 135, -49, 286, -71, 158, 83, -3, 159, 121, -33, 109, 201, 110, -49, -69, 225, 89, -67, -17, 152, -178, 162, -189, 3, 47, 59, -69, 144, 16, 87, 38, 156, -59, 30, -55, -135, -158, -182, 118, -79, -2, 136, -34, -245, 63, 24, 148]
5339A48J81l07k57L77k24Q4J1j99J25K46J09k96m6q0L15l5l10M6m0Q3N2j43K57
5362I7J3j08O3j27j01J23j69L8J12L03l16j02K51O2j03n7l39N19j82J59j75l7
5384g6J0j90K12J29j54N2k59P7K48K43k39j28L05l96J96J5J8k67K79k05K15r6
5406a1j52J59j62J44j17K95L1j90n0J12p5J19J05l49K24J06l05J30j0p4L79l08
5428AJ23j59J8j5o6J08J12j33n7r0N8J14N7p5N5k15L47k66K34J1l59Q6J65o1J42
5453A35q3j19L33l98J18k36K7K06K29j25J72l71j8Q3l0K11k96M1J45m9n1J52J2
5476H8k77L08K96n62P2K30q5J8K25k72N9k29R4ml2n1O9k2J46Kj19K98k17j41J81
5501G5j3Mj13K01j96j9M4n2MJ67R9l56K24q6J9K3l02M31l01M9N7PL05l82P0r0
$$ y = [148, 329, 22, -235, 142, -82, 2, 13, -186, -61, 185, 294, -2, -48, -128, 187, 152, -158, -112, -152, -69, -17, -160, 97, 110, 2, 65, -62, -163, -40, -209, -171, -59, 244, -72, -174, 77, 139, 36, -21, -360, 159, -23, 136, -39, -76, -66, -256, -44, 85, -69, -17, -276, -199, 49, 292, 53, -75, 230, -166, 30, 45, 63, -204, 75, -130, 85, -11, -163, -4, -166, -22, -139, 156, 187, -3, -53, 59, -16, 103, 208, -141, 83, 189, -116, 14, 4, -70, 309, 1, 124, -35, -17, -32, -98, 10, 122, -11, -68, -158, -100, 14, 71, -4, 51, -164, 183, -83, 151, 162, -197, -111, 54, -7, 135, 52, -67, 266, -132, -14, -250, -223, -17, 212, 87, 259, -112, -130, -47, -77, 134, -162, -121, 24, -25, -76, 76, 88, -189, 119, 415, -147, -75, 155, 70, 88, 313, 41, 100, -129, -35, -39, -71, -122, -53, -75, 71, 73, -46, 252, 35, -106, 75, 62, 66, -47, 154, -42, -61, -17, -69, -65, 102, 201, -155, 69, -17, 2, 25, -277, 154, -147, -98, -41, -34, 271, -111, -41, -131]
5527a31J2M4K59j93J59j65J28m9k13J56QP4qo7L4n3k26L00N3%j26j10L28k71R
5552d8J02l1k33P3L45j7p9l10L44Op5M8R8k23K47R5k59k4oK9k1n4J46m00J71j41
5578b17K75k17J36Q1m8R7l52L36j28K41m73Q8K47k1K33l03Ml0JJ36J42k26J64
5601A66j30L48k81k20N0K2J14L0k73J14Q3J6K1m4n0m5J50k49K12l24N41k47N1
5624E5J52k00j66rJ60k81K44k00M19p2O9m24K91o0kk4l9O6L7O6n0K56l21J6JJ4
5650bj94PK91p9J46K7l53J35N5m7m1J2J33k67J43K14k38LO1l36K55J17j21L42
5674B63k57O3K54l16J15J09k16k5J38l15j18J77RJ43K4K19m44K18j07J79K1k43
5696a09m3L12m9K4k15l6Q0Q7J11n1k37K83M2l80J58N4q6J7r5n4K36J07J55l60
$$ y = [-131, -119, -75, 184, -9, 150, -15, 113, 64, -149, 7, 15, 89, 81, 14, 48, -5, -231, 69, 122, 122, -4, -114, 214, -57, -48, 54, 23, -210, -137, 208, 191, 112, -198, 146, 152, 77, 125, 223, 0, 247, 342, 83, 59, 53, 82, 61, 7, 153, -247, -76, -217, 58, -159, -23, 58, 10, 107, -245, 91, -37, 204, -269, -181, 66, 45, 278, -25, -21, -51, -50, 86, 228, 2, 166, 36, 384, 103, -117, -67, -45, 69, 99, -174, -60, 23, 39, 60, 16, -34, -79, 71, -178, 34, -290, 251, 4, 55, 207, 7, -159, -168, -8, -289, -45, -245, 174, 102, 171, -253, 38, -22, -24, -48, -87, -21, 16, 82, 32, 288, -33, -17, -16, -2, -196, -189, 102, 23, 169, 196, -157, -22, 33, -14, -55, -43, 90, -177, -34, 180, -58, -55, 6, -330, -75, 42, -79, 263, 6, 69, 323, 7, 122, 231, 15, -10, 128, -187, -305, -128, -119, 24, 48, 267, -177, 41, -66, 113, 134, -109, -152, 160, 111, 135, -80, -116, -36, 51, 162, 111, -126, 157, 199, -181, -23, 31, -55, -38, -133, -187, 49, 156, 311, -49]
5720d9O9k75R9K59j26j9O0q5J10JJ6J32nl50J57J60l42J48M4m4J42j69O4Q7k50
5745a66j48M70l06J75k8k81J02M02q5j33K01j42k22O8K21r0J95l03K31j69j6N5
5767C1K0R9j43j93L73j52O4k01J10J92j69O4Q2j59J65m3p3m4P4l7j03N8q6J5J7
5792c9K11k29J0p3k3L29m41L54k93J19j8J20o6j24K73j45J78J20k48j82j22J01
5814a88M56j50r5L5p6R2R4K2k92K37l43J12L52j43m8k23J1J81N1r6N3l8J13Q1
5838A98k37o5K80l32K10p8J43j28jj02O1o4J58Rk20K15j22l1J4K89k71J57o2p0
5862d9J50j00J0k05K23j9J0j85n6M47k41KO7L7o3o2R3L4k24M9j0K26j34M0J03
5887A43Q2J2j17M6j34k06O9J98N2J28m39L38k45K53j13R6l14K12k77J69J08JJ3
$$ y = [-49, 20, -255, -156, 103, -23, -42, 18, -67, 43, 44, 60, 192, 187, -163, -6, 154, -188, -40, 4, -40, 102, -67, -3, 84, -166, -314, 156, -150, 25, -3, -284, -182, 220, 135, 2, 203, 61, -161, -93, 128, 38, 233, -70, 161, -8, -24, 31, 51, 150, 7, -186, 187, 35, 99, -102, 8, 200, 31, 95, 177, 18, 183, 140, 67, 23, 97, 60, -43, 15, -71, -56, -39, 172, -57, -47, -120, -143, 186, -255, 99, -194, -75, -93, 27, -39, -163, 110, -35, 143, 263, 15, -167, -289, -188, 268, 118, 23, 58, -18, 74, 168, 190, -102, 135, -208, -96, 256, 113, 65, -158, -147, 34, 85, -11, 42, 4, 117, 198, -39, -104, 176, -156, 54, -24, 119, -9, -10, -112, -51, -115, 43, 52, -168, 47, -75, -106, -92, 197, -74, 83, 21, -49, 101, 1, 11, -194, 29, 10, 20, -165, -221, 226, -15, -13, 54, 91, 28, -34, 59, 93, -131, -82, -92, 134, 0, 40, 143, 225, 237, 120, 166, 32, -174, -105, 93, 145, 273, -166, 172, -73, 180, 67, 163, -151, 61, -216, -47, 61, 62, 75]
5910G5j69r3K04R6J26k92rj48L39k21P3K07j46j08K54k14n9K27j02o4Q7j46P8
5933eN0N2j38J95k83L08K6m56K07r4K51J90l32k7j68M17l81M25j17j15P8j88K33
5956A28k73k03O92m20J68kk12O8q2L58k11j24J35O5l72K03J19l51L30M3n2o0J53
5979A00O0l3k7m2m76N88j15r2J87k35M5o5j45M02k80J48K23m06k4J71n9R0K3M2
6003H0k5k20L55k89N2J04l9m9K8M8j05q7J14qL5j06j13L40n5j21R5l2J03K4Jn
6029A25J3k16l5k1p3K31l7N7p9J20k3L1j92L61k12rJ83k77L6M3J89L8k17j34K33
6054A35j98o7R4J5m7kn2m1O6J61r1K01j12oLJ02j03J54P8l09L13l90L09J26j15
6079B24j0l60J74J00l30K2J5K01J10k30q9K16pj63L57j29j6n3l6K7r7P9J92l91
$$ y = [75, -94, -187, 17, 113, 239, -53, -62, -210, 129, -92, -19, 188, 42, -66, 188, -26, -85, 142, 40, -24, 63, -83, -5, 45, 97, -41, 154, -129, 179, 205, -251, -44, -138, 113, 303, -29, -56, -224, 193, -188, 237, 120, 5, 83, -105, 128, -145, -348, 344, -76, 92, 90, -122, -54, -136, 222, 11, -113, 22, 87, -285, -82, 37, -314, 16, 59, 7, -53, 100, 160, 127, 100, 58, -418, 170, 55, -37, 150, -85, -40, -105, -250, 152, -128, 20, 243, -163, -187, -16, -75, 15, 38, 80, 55, -165, 190, -99, -47, 57, 18, -31, -3, 45, -60, -147, -33, -41, -6, -112, -225, 115, 60, -61, 34, 2, 105, 129, 130, 125, 138, -78, -113, -134, -207, 24, -13, 44, -35, 85, 62, 93, -99, 262, 50, 41, 224, -53, -17, 26, 215, 253, 36, -98, 135, -63, -130, -36, -21, -68, -70, -122, -163, -97, 64, -27, 174, 62, 56, 59, 161, 58, 212, 290, -19, 294, -96, 213, 339, 224, 214, -146, 28, 128, -202, -180, -165, 36, 146, -84, -173, 43, 36, -127, 230, 101, 85, 32, -4, 23, -74, 5, 197, -194]
6103a94K12l00K39j19L28k19K23m18J26J95j3N6k26K14k45m2n9l2J22Q8j17K53
6125G2l61K11k3K3K01k69K05p0j40J77J42m61J30L6Q4j16M5l2K06M4p9k39J48
6148f6L66k72j23K08Q6l4k00J04K4j94q0J49j34L60k39K11m58R9J39p0K64k21
6170h1J81K9j61lkj29L22P4m40L82J5j92K07k36K0J18j53j55K99j86q4j13L65
6193G7L1j05m4o9RK51j16j16N0J54k08K32k90J80k12J42J65j24P9k99L12o6q1
6216d8m9j78J86K4p6M00k89J20k76K31kJ84r5k24n2P0J10k45K16k12J68J08j1
6239F0l08M87k41K26k68q9J75J75n53J78L5K85k47J52l20K05K88m87K57O5K00
6260B75k77J22k94J36l16K22L70k65J15j0k30J43j6K09r8p5o9j62K68ol14L81
$$ y = [-194, 18, -282, -43, -162, 166, -53, 170, -248, -122, 73, 60, 116, -110, 104, -141, -183, -242, -274, -152, -64, -181, 72, -289, -78, -101, -78, 123, -146, 59, -11, -151, 26, 168, -293, -163, -127, -43, -159, -114, -146, 60, 104, 25, -214, -66, 300, 28, -95, 113, 199, 165, -35, 69, 93, -101, -181, -32, -166, 194, -45, 166, -292, -193, -54, -124, 140, -81, 100, 129, -32, -35, -37, -166, 156, 230, -210, 172, 187, -5, 202, -34, -14, 104, -49, -204, 95, -91, -175, -288, 77, 108, 3, -41, -110, -101, 150, 34, -82, -32, 122, -86, 146, -144, 36, -176, -34, 131, 7, 86, -213, 99, 33, -48, -97, -275, -89, -65, -141, 259, -30, 90, -186, 45, 43, 227, 132, -92, -144, -74, 36, -209, 7, -205, -37, 71, 60, -248, 239, -2, 224, -44, -133, 42, 217, -336, -158, -123, 162, -85, 67, -253, -48, 240, -247, 10, 75, 275, -2, 120, -174, -38, -354, -132, 238, -27, 88, 78, -152, -9, -25, 184, 86, 11, -58, -220, 48, 42, -272, 109]
6282A09k84L99j47j57J58j14j05J87j70m6N8j07M31q3k40j6K85k77K07L9Kl6k26
6305a33J87k91L73n4j8J99j15j02j4k6KL6J03l04J88r7R0K34k90q5l2P1J59o0
6329B1J39l53J17J97j03j23j42L28m6J08Jk95L9O5j92K18J3N0j05K28j76J65N1
6352B05l00J20J21k64K28j31O7m49N73M5n6k37K1J23j38O1q2R9j10M17l05K2J64
6375A94k78N5j52L40j83P3p3q8K63j60l2J95k06Q6l3k76K73n8j82K57p4L11m05
6398a53O6o8J38J01j71J23o3q0j63K08J1J62j18J09k06J62P1k8R8j03q3q7j67
6421b41j4L99k36K52q6o8J0j67K64k14J49L10l07j30K8K9N0K5j57K0J92J10J77
6444C95n56P0J71j14k35J89j71L11r0j00j06M41j41j99K62J10q2J0n5k32J61L6
$$ y = [109, -175, 224, 77, -80, 78, -36, -141, 46, -124, -170, -112, -219, 212, 129, -111, -127, 158, -119, 88, 127, 129, 93, -133, 54, -237, 136, 82, 64, 263, 148, 46, 32, 6, 8, 44, 147, -157, 31, -66, 24, 258, -32, -117, -149, -78, 81, 21, 160, -193, -76, 121, 18, -105, -247, 81, 35, 143, 144, -151, -112, -47, -239, -21, -8, 42, -63, 165, -11, 154, 205, -95, 25, 146, -118, 110, -21, 46, -403, 170, 215, 159, -78, -57, 66, -72, -11, -93, 6, -104, 313, 8, 30, 194, -84, -29, -181, 159, -24, 49, -24, -112, 151, -9, -41, 154, -52, 34, 1, -275, -2, -60, -242, 15, -59, 252, -153, -87, -155, -17, 84, -87, 36, -27, -107, -270, -62, -51, 111, -7, 102, -104, 58, 129, 101, 199, 96, 13, -74, -241, -255, 144, -92, 160, 74, 6, 16, -151, 113, -101, 48, 358, 51, -79, -51, -22, 28, 53, -104, -84, 108, 218, 395, -161, -91, 80, -34, -269, -80, -251, 60, -30, -130, -236, 205, 64, -135, 127, 237, 155, 165, 110, -122, 39, 75]
6466G5J4P9Q3l00M5M2j9q0K21j82j32L19ol01J47p3J38j17p7K34k42L24n7m43
6490c08O27k30R7l5r7P6r3j60J57p3K81l13J71j2rM3k55J71n5o7p5K55%Jn4j03
6516f0m6J10J26n0j6n2o7J44k33j6Q4J94n2j80K17P4k84j9M03o5k81J23Mk96M07
6541A69l58M02k77mO6K25P3k72J59m3k86K27J33j90P0j83K30K7l18m1J45k38M04
6564A20O2j06j63N4M48m59p7M39j74M8j64P3j87Oj1j12K17J88j86n7j01n6j19
6587c17M20k04l8M10m22QJ92M6L1j64R4J06l03L32j54j97K60j09J63q9m65K38
6609a62R1O5J90J4j41J13m35L49j77K43k41m0L12k33Q0K75l88j05K80K6q6j98
6631a68K91P8K10m10m4J09o8J17j59OJ53K6J25l50M5J56r0j1j28J99k07K6J24
$$ y = [75, 89, 168, 251, -49, -4, 38, 19, -61, 160, -22, -154, 165, 159, -142, 5, -68, 70, -47, -124, 110, -132, 192, 135, -308, 319, 89, 186, 151, 54, 130, 37, -123, 34, -39, 242, -71, 100, 88, 79, 122, -133, 38, -17, -84, -159, 96, 96, 97, 43, -60, -106, 4, 130, 80, 64, 12, -55, 89, -144, -160, -76, 118, 66, -114, 103, 177, -107, -126, 277, 212, -69, 54, 58, -238, 169, -189, 213, -64, -68, -2, 223, 296, 24, 183, 140, -146, 81, 214, 24, 94, -89, 141, 168, -150, -191, -46, -284, 120, 182, 76, -87, -33, 415, -44, -121, 318, 144, 192, 28, 101, -86, -80, -91, -203, 14, 202, 16, -41, -142, -198, -317, 103, -101, -139, 271, -151, -143, 49, 95, 126, -38, 56, 162, -141, 191, 37, -160, 100, -9, 154, 65, -400, -162, -71, -6, 184, 198, 57, 170, -265, 84, -93, 150, -91, -131, 181, -52, 28, 303, -85, -190, 90, 116, 30, -168, 123, 201, 411, 1, -43, 66, -2, 115, -44, -38, 115, 141, 266, -84, -39, 117, 27, 16, -112, 87, -120, -94, 30]
6654C0k4J54rj85R3J30n8J74m95N1L19m24K77j35J3K83j48k06L25n3K4k27J39
6677D8J08j86N7J03m86L88N8j53j34K85k1j14L8P1o2J22k20L3J93Ql3m0np1Or3
6703a00L52k15R2j51K21m44L31l10K46p1L1L66m36j1o0k2N1K30n4j21j5K43l13
6726a60rL15K2K1J4k05J21j78J75l33J65J46J6j48K38J2l29J47L9M2j96k69K43
6749a11q9oM55j69j88oL98l76j06K25M1k70L32k59P0J45n3nJ51k11Q1j27J45j34
6773f7P2rR1l42K44j17jJ77k70L82k05K93j62q3j83J50j05K94j73n7N4k6J90k60
6797a13o4K51j58R7J13j36J7P7K5k70K19p5o1P9l8p1K72k33L08k81l0J2P7K1J00
6822A38j7k98J95R9k79K31L7j62KL3O4j64N1p1o1L16l24M85j21j64N6mqj75M0
$$ y = [30, 6, 160, 151, -34, 59, 189, 131, 305, -190, -139, 180, -244, 33, -102, -89, 194, 46, -160, 165, 112, 136, -91, 48, 156, -30, 27, 130, -356, 32, 90, -63, -197, 88, 67, -47, -9, 62, 0, 122, -98, -65, 128, 136, 103, 63, 58, -13, -7, -100, 252, 37, 129, -22, 199, -245, 86, -224, 22, -49, -18, 348, -88, -99, -159, -181, -130, 100, 46, -75, -90, 153, -160, -169, 146, 168, 189, 203, -2, 119, -59, 116, -217, -52, 94, 110, -38, 200, 212, -117, 30, 69, 111, -85, -354, -111, -200, -206, 249, 80, -108, -114, 284, -92, -198, 27, 68, -202, 130, -129, -59, 86, 33, 28, 179, -32, 49, -78, 67, -67, 5, -4, 87, -255, -11, -128, -129, 48, -222, 160, -45, 248, 86, 3, -180, -30, -135, 159, -14, -71, -17, -43, 147, -113, -177, 74, -84, 13, 126, -10, 7, 84, 109, -161, 58, -17, -78, 1, -37, -108, 164, -69, 239, -42, -72, -60, 17, 38, 138, 121, -177, 18, 117, -162, 69, 106, -56, -54, -21, 43, -121, -70, -141, -202, 114, -210, 275, 154, -10, 46, 42, 34, -141, -101]
6847a01R8rJ52ll10L90q4K4k78O2k0J56l00J05R0o8R2R1m0l54L69j88j3J23O6
6872E0O9n7j34j14O2J45N6j54q9o1L64j89j71M39m0k88Q0J24p0l1j19L07k18p8
6896a17K00l03J50j21j14L26j58L7K83j30j25Q5j91K09j77J16K1L1K80l46k7j45
6918b16R5M4K04k76J53n8J73j38J14Q9l47j12K90j06j66L98k03J16l8q3l0J48
6940E1J64l28k52M16l0K61k31j66J55l09J95K4j30J74J89q5l21J18K67j25k19
6961a82K28j51K14O3M9k68J84n0m3R8Mp8o8j95L10JK0r0j02J28j84J36j40Q6l5
6986f5JJ56l04k1L08j45K53j94j60J80o1J63l19L27J03l15K37m37L38J13m81N99
7008B76o4r5j04j74p9J49K92J14j30k68P0q8n5P3K50l01j24J75J1N5q4l1K90j90
$$ y = [-101, -3, -12, 140, 137, -173, 217, 133, 157, -121, -59, -79, 77, -223, -118, -28, -96, -4, 87, 47, -307, 62, -126, -139, -16, 50, 119, 62, -72, -186, -124, 21, 77, -77, -166, -227, 137, -52, -223, 216, 176, -112, -32, 92, 22, -9, -128, 179, -39, -117, 83, -220, -70, -191, -305, 21, -137, -100, 183, 53, -72, 13, -178, 31, -146, -30, -9, 22, 302, -44, -71, -216, -121, -77, 127, -149, 4, -54, 119, -19, 95, 184, -163, -275, 15, -91, -257, 141, -62, 54, 16, -67, -97, 51, 215, -113, -365, 51, 21, 282, 51, -115, 40, -269, -74, -50, -180, -6, 183, 98, -223, -105, 162, 37, -182, 46, -105, 109, 172, 221, -47, 137, 87, 44, 142, 146, 68, 0, -195, 115, 116, 136, 46, -56, 72, -112, 24, -116, -30, -65, -64, 92, -212, -233, 75, -70, 183, -11, -171, 9, -52, 111, -208, 119, 222, -93, 144, -293, 45, 158, -323, 276, 212, 117, 13, -161, -240, -91, 201, 315, 185, -83, -13, -101, -156, -83, 167, -134, -258, -83, -72, -17, -101, -132, 158, -32]
7032c2j32r7L74m1Lj30O4O1J7o5k32M7J84K9J4l19J12K44j64J52k4j42J62j97
7056a12J23j15J0L24l28J45J1J3rj6nQ3k49m9K97j87j99J70K9Q9r0J32r7o8P8
7081b0k03L00o3n2K30l32P8J21Q8j62nJ30Rj98K11j04k02K55j70J62j13j6J53
7104I7k95Q2K20j02m2J38j8L8k93J06K02m8j48J22j27M83j59j7l07N7K94l53n1
7127a21K66j06jj15N3q8q8O7MK48k53K2r6L08k24J6K18j08K05j86J40j59n4K05
7151A53j19j60j61J95K3J6j10j4J39J51J8k24o1J64k24J98K81l94K58J5j9j05
7173B0l6n9J49j35K80l92K17j3M00l16q2j1O1kp7M7j80P0m4J08lK05k02k79K22
7198e2K94l16J43q0j86K23j63N5J10j77q2L13j86R7J35r0J01l94L42R1j68P5Q6
$$ y = [-32, -164, -261, 113, 72, 75, -55, 9, 70, 87, 22, -210, -163, 21, 50, 64, -255, -143, 101, -63, 89, 65, -77, 85, -112, 11, -104, -94, 230, -98, 47, 58, 71, 62, 46, 41, 124, -125, -174, 123, -64, -263, -93, -64, 25, -65, 67, -30, -98, -20, -223, 77, 14, -38, 192, -140, -62, 59, 147, -15, -20, 110, 119, -79, 132, 28, -174, 81, -89, 73, -40, -56, 97, -198, -116, 104, 2, -40, 98, 80, 118, -175, -69, 133, 85, -63, 59, -68, 415, 256, 239, -68, -11, 283, -70, -121, 145, 39, 38, -77, -24, -112, -200, -133, -129, 119, -134, -112, -208, 100, -124, -108, 110, 2, 207, 21, 161, 2, -52, 153, 34, -126, -287, -92, -69, -53, -163, -177, -38, 113, 131, -93, -154, 10, -214, -16, 265, -129, 129, 144, 125, 20, -16, -75, 74, -61, 219, -173, 44, 31, 431, 115, 33, 22, 83, 81, 4, 51, -129, -59, -103, 5, 2, 207, 5, -274, -52, 242, -74, 69, -11, -197, 26, -137, -82, 28, -149, -231, 82, -104, -7, 128, 38, 139, -255, 87, 178, 10, 85, 171]
7221A71k16J06j29J42J38k94j44J63mK45j43O8j14J97k91J67k3J58k94k5O2J64
7243A04P2j04k85J96J82k82Q0j84K31k01J40J37j62R8K03j94K1p3J4n7J02R0o6
7266F2n3k9K20l39J9L5J09m1O8P5r8l6j92j09L85m1j04L47k03j7l0M4r1K8P2k01
7292a20J58q8J32q1j5j8p0P6kK8J17N6N8l47Q9k4J99j39jj51L88l2q6J8Ol41K35
7319D5j9J08k97Kj1N2J19r6j30L57o2loJ53l0j39j27J58l9r9q6K12K3K6k01L1
7345e9j31jk0R5p7K56j47M7J44k31L57m10K61k27N3R8k24J49J09q3j23N9q6J04
7369h7N0N4nO4n17K46N7M6m8K87j69k31j1K58R4K2l5j19l2L16l38O7J52k63N3
7394h9J19l4j28K2O0J35J44l74J24j82J79m9J09J78k30J94j85j2O9j3k09Q8J32
$$ y = [171, -45, 61, -68, 74, 212, -82, -226, -63, -67, 178, 35, 103, -11, 186, -105, 62, 39, 197, -97, -122, -60, 104, 176, 72, -213, -17, 165, -117, -37, -221, 10, -191, -51, 86, -76, 22, 225, 31, 52, -21, -7, -64, 38, 128, 62, 9, -20, 200, -139, -120, -85, 24, -17, 51, 126, 28, -8, -200, -309, 76, 35, -69, 278, 75, 58, 28, 72, -19, 9, 81, -120, 38, -50, 82, 1, -14, -32, -102, -26, -28, 0, 117, 173, 231, -116, -27, -51, 148, 9, 8, -143, 245, 213, 127, 145, 151, -190, 45, 26, 134, -163, -161, -172, -120, -1, -97, -227, 130, 68, 65, 59, 212, 182, 43, -84, 74, 35, -64, -150, 62, 85, 111, -90, -59, -190, -191, -211, -116, -193, 63, -84, -37, 107, -124, 233, -177, 84, -143, -90, 8, -216, -67, 42, -41, -164, -105, -191, -87, -37, 17, 12, 76, -441, -195, -138, -92, -140, 147, -22, -253, -264, -6, 88, 110, 75, -44, -76, 240, -98, -31, 121, -142, -89, 30, -4, -132, -110, -50, 85, 229, -145, -21, -203, -24, -73, 36, 214, -16, 178, -7, -19, 50, 37, -172, -84, 48]
7417D8pk28J54j01J71k98J8R4q5L81K6K6m32l4N67k88l6p7K33o1k67K99J33m29
7441a93J77j33L25K7k67K6J50J02l73J95k05J78K1N2j00l0L77k56p6M8j27R4P8
7464I0k4Lj3rj37K1J45o3M73l19k88L37l27R4R7l2o1m3J72j4k6m8j98K31k44L45
7490A62k60K05L0j47K42R2j89m0O3N9l36pJ32j0j90K21J64j00k20N4K76l02L30
7513B29l0k40L07r3l9l38K49O5j28K21j29k67K73N6J62l46J05L9j09J50r8j41
7535a02Q3P8O3J97k46k04L0K11k22K11j94J06j40j49J93l6K08q8j49K74j84Q2
7557B2Q1k33J5R0K15j83K03k24qk26J59J07K20j48m24L46K52m26L14j77mqj56
7580a93K68k5j45J96k27K60j53J01Q3q0l6o1N8J87k63Q7K7Jj42K64j38K00j59
$$ y = [48, 41, -187, -33, -134, 37, -261, -243, -149, -234, 147, 173, 199, -233, -267, 300, 12, -24, -101, 132, 71, -196, 103, 236, -193, -16, -149, 176, 203, -64, -38, 112, 214, -159, 36, -169, 9, 30, 82, -18, -48, 329, 73, -3, 45, -82, 12, 90, 66, 69, 56, 47, -90, -69, 76, 13, 486, 167, -121, 216, -111, -17, 80, 48, -13, -56, 116, 102, 76, 28, -170, 61, -183, 162, -98, 107, 137, -10, 232, 324, 135, 95, 158, 217, -119, -126, 6, -4, -194, 27, 191, 91, -129, -75, 201, -101, 229, 199, -41, 266, 173, 134, -204, 45, 110, -18, 203, 74, -193, 80, 136, 298, -48, 57, 96, -13, 137, 39, -102, -19, 59, 122, 319, 73, -131, -101, 110, -112, 99, -95, 11, -129, -278, -85, -121, 87, -1, -150, 124, -60, 22, 103, -130, -115, -25, 190, 7, 210, -14, -22, -248, -89, 18, 238, 90, -334, 12, 264, -162, 152, -25, -29, -37, -193, 75, 50, -95, 101, -126, 134, -19, 82, 165, 85, 49, -12, 46, 233, -30, 57, 84, 85, -57, 207, 69, 269, 110]
7603A10j71N3o2L7n0L41k96J9j11L31k2j78J80j71m3M8j72K06j79K51l41n6O41
7626C65m29J45j88k02K48p4J46j3j37M8J63m5K92k56k3j31J55L7Q5k20j04K62
7648A24k77J37K49k21l0j84K24j08J38K43k72j08K32k75jk5L72j99Q9k11L68k58
7670GK06j94J64O4n05J21JK45j6J51l37q1L46o2k2p8lJ60j68R7m44J39J95k27
7694b41L18J39k22J55n2J60l80L2J56r2K42k12n8J37j9J81k22n3J81j53q6LJ73
7717H7K5J26k77K80l15M5j11r1L32L8j01n2P3o8N2L0R8j32J07N0m64K07n2O0k6
7742g9R8j00Q9j12J77j29j01K36j52o9J67k7Q5k05J40j23K2j16q7K81q6L9p6J48
7766B0j57J80k3K38k71q6J40K12l56J16l7q3K51n29O14j84p7K32j41q0K4J13m3
$$ y = [110, -61, -8, -70, -33, -83, 258, -38, -19, -130, 201, 179, 1, 181, 10, -33, 15, -157, 49, -130, 121, -220, -276, 365, -64, 81, -107, -309, -61, -135, 11, -2, -139, -91, 72, 27, 319, 63, 40, -91, 64, 101, 186, -34, -138, 124, -153, -16, 233, 12, -18, -202, 22, -86, 52, 295, 23, -85, 147, -128, -129, -154, 218, 19, 108, -103, 265, 7, 213, 19, 183, 247, -258, -137, -136, 109, 93, 244, -93, -174, 172, 110, 88, 10, 7, 167, -1, 96, -348, -209, -14, -241, 77, 216, -6, 149, 97, 257, -123, -91, 65, -27, 215, 3, -55, 82, 63, 244, 22, -31, 150, -3, -89, -86, 87, 112, 238, -39, 241, -74, -29, -140, -231, 101, 139, 38, -14, 59, -9, 43, 73, 171, 39, 146, 196, -268, -61, -113, -53, -79, 19, -81, 8, -104, 73, -56, -157, 79, -73, -142, 25, -2, 83, -122, 18, -105, -83, -199, -286, -5, -91, -52, -128, 20, -137, 43, 20, 258, -13, -99, 41, 253, -103, 13, -24, -107, 144, -385, 229, 45, -32, 200, 59, -21, 3, 116, 73]
7789G3l6p7K01k84l1K47j47P0k6j25K56k10L5O3J8l6J84l19k28K21K76Q6j60k47
7813a96K28m3l35J48J53J96j57pO6q9nj23J03J05l98K67O0Mk41K99o4J29r9K47
7837B48l22o9Q1K33j4l24J69J08j72J55r0N9l41M54l21L36m7k36k2R0J38Q2O1
7860B56j24j43j37K24l74M89p6N9Nl37J33k98K23q5J19m2Q4N1q2P1j29K05r1j6
7884a5j46r1K8J21K47j96p6J05n5q6J43j35nM8OJ46o1J71k00p0Q3L4K33k02r7
7909g0K62k33j21O5J84k00J00J71j69L5j03R4J27n44N24J08j52r7jl16J75M15
7931B54j61m2K42l41L0j93K20m6K27m0k4J57l24J05K1J1R8l20J76j16R7r4j61
7954b24n2L83j25L0l8O6j01J35k6M6j59J82j88JJ73J1k37J51p0R5J67k39J15j67
$$ y = [73, 37, -40, 161, -123, -154, 93, -54, 16, -10, -135, 121, -89, -54, 9, 27, -9, 175, -144, -372, -151, 125, 211, 51, -196, 32, -11, -346, -198, -45, 151, -6, -13, 53, -36, -41, -164, -61, 44, -354, -87, -27, -23, -264, 35, -29, 100, 1, 248, -74, -143, -62, 171, 157, -167, 2, 110, -62, 93, 3, 62, -279, 175, -146, 190, 143, -93, -115, -25, 113, 195, 256, 132, -11, -148, 76, -298, 191, 115, 174, 179, -158, -25, -323, -100, -185, -66, -108, -24, 27, -55, 16, -113, 92, 1, -15, -161, -252, -224, -103, 144, -52, -128, -23, -78, -164, -21, -156, -161, -113, -107, 39, -22, 149, -51, -121, -38, -4, 229, 27, -70, 192, -41, -162, -97, 87, -113, -13, 158, -11, 24, -79, 15, 142, -402, 122, 230, 78, -19, -20, -336, -161, 254, 93, 51, 293, -48, -18, -211, 9, -37, 190, 150, 126, 283, -41, 64, 85, 96, 194, -126, 50, -66, 31, -63, -224, -276, 107, -18, 12, -26, 40, -61, 74, 48, 94, -65, 117, -71, -70, 103, 114, -123, 28, -42, 53, 220, -19, 96, -71]
7978g1Q1kp6J10q9Q4j33J12oK45k29o5N7R6j65k27L51j25J6J30k47J55J43L3o6
8003A12k95J94J94j53j39J67J30k54J7j5m9J41N9n7k25K2j9K37P1j3q3K1q7k36
8027b60J39J39K0l8j03J69k61K5L21r2K35l60J73k50J79K27l93K34k07K87j55
8048B9j2j08J44J29n2k00N2j01J12k0p6L2K11m95L68J25k09p8N1R0J5J68o1KJ74
8073B90k45L7K07k09J88o3l20r6L91k04J83o36M88%j73JP7K40j66n4j56J76K5
8096a9R1j40mm7Q0J67j91r0Q3J07r9l1J30L1o8k6MP7l61J51J30j85L00k30J08
8121c2J94k76K76J9j21j05J10K7R6j94M9j44J90j06K23r2O8j04m3m6K7K9k29M4
8145a40J8J29j53M5j34M28k07J83k13K0qj60k6K48j16J89k12p1K24k04R4p0J39
$$ y = [-71, 10, 8, -68, 42, -47, 37, -96, 16, 10, 255, 26, -39, 18, 114, -51, -278, 73, -52, -36, 94, -153, 2, 145, 178, 112, -183, 11, 205, 52, -87, 80, 210, -44, -27, -42, -91, 50, 109, 52, -173, -151, -170, 67, 138, 125, 42, 63, -24, -260, -121, 18, 38, 0, -103, 66, -195, -170, 151, 59, 294, -66, 107, -143, 36, 263, -130, 104, -103, 184, 29, 17, -91, 53, 182, 130, -70, -18, -119, -7, -27, -103, -71, 140, -355, 13, 138, -71, -149, -98, -8, 7, 175, 114, 116, 290, 45, 82, 289, 80, 268, 205, -115, -211, 180, -24, 159, -477, 11, 11, -162, -161, -84, 156, -10, -64, -220, -44, -19, 72, -68, -72, -119, -39, 128, -63, -153, -70, 37, -62, -93, 37, 68, 0, -26, -22, 55, -306, -155, -25, -210, 90, -140, -32, 162, -114, 162, 181, 60, -45, 65, 92, 188, -6, 43, -101, 89, -17, 206, 114, 182, 78, 35, -11, 16, 45, -184, -140, -122, 7, -146, -101, -235, 193, -14, 169, -44, -24, -32, -192, -218, 30, -86, 103, -109, -180, 44, -160, -66, -136, 3]
8168CRj51j29K34M5K5j32j90L54kO0j51O1k17J25K8J7j76O8K8K0k7q0
$$ y = [3, 12, -139, -268, -34, 11, 36, -96, -286, 68, 66, 126, -25, 36, -181, -56, -28, -11, -187, -119, -91, -71, -98, -178]
8191a78
$$ Imaginary data points
##PAGE= N=2
##DATA TABLE= (X++(I..I)), XYDATA
0@%%%%%%%%%%%qJ6j6J6j6K4l2M0m8N6p0Q2r6J12j29J49j72K00k28K60k96L34l80
34b02M28m77N33o00O72p48Q32r23J024j133J251j383J525j680J850k036K244k476
52a299K731l013L331l691M102m576N129n787O580p561Q808j0448J2715j6053K1441
67A2409l1487N6100k17313k62308O26315l9591l08206K54591L4540k76357K05500
78E4193P3239k83939J77863K34315l06574K3985K45864k89211o4664L93409j26081
89A32399k51131K27042K950k32130J86963R9529k35403J09764J40026k75884N2605
100d3270K55327k53029j09325L25272o9317k58853J60531Q7079j70486Q5170Q1468
111I0567j90952M2918J37848j58251O042J66845j41699p9813J91101l9096j68604
$$ y = [0, 0, 0, 0, 0, 0, 0, 0, 0, 0, 0, 0, -8, 8, -8, 8, -8, 16, -16, 24, -24, 32, -38, 44, -52, 60, -69, 80, -92, 108, -120, 140, -156, 178, -202, 226, -251, 282, -318, 354, -394, 438, -485, 539, -594, 657, -726, 799, -881, 969, -1067, 1177, -1299, 1432, -1581, 1750, -1941, 2161, -2415, 2714, -3073, 3507, -4054, 4754, -5694, 7021, -9032, 12409, -19078, 37022, -180291, -442599, 183716, 144125, -164081, 90510, 125050, -151307, 54193, 127432, -156507, 21356, 255671, -50903, -26918, 218946, -70265, -134929, 258480, 132399, -118732, 108310, 111260, -120870, 66093, 165622, -69781, 39983, 180009, -95875, -43270, 212057, -40972, -150297, 174975, 105658, -153195, 7336, 94415, -76071, 9099, 90567, -100385, -57467, 80381, -77870, -71828, 95017, -46682, -126495, 64606, 25510, -143094]
122a43094J05784Q4136j06610L3536M8708j03233N2375P6791j32431J9394J35928
133G1284j10399p2450J70807R088j67783N5477J18217r0904k7424P8360m2001
144g728n943O9135m5376l0216O5379k9527o0680Q6385L5451j20697K1697J11351
156H9231q3813o1384R3596l883n1435M0819r777m6005N5309J2531q3334N3775
168E630P5867j24046k2142J39800n3587q9944R9289J6930r5754L7518M8211o6303
180b8531J8224M8749q3343J6551R7751r4398m2636J32393l4525j05317Q3037L7063
192D5018r3752L4490O9338p3912j798O4644o9416j341Q5461p9397l8272J22688
204F3751k7639j10860P2678N6968q5776J5658O6917o8600j1995O4529n0936q056
$$ y = [-143094, -37310, 46826, -59784, -26248, 22460, -80773, -28398, 48393, -84038, -64644, 71284, -39115, -111565, 59242, 68330, -99453, -43976, 74241, -16663, -44087, 34273, -7728, -13671, 55464, 10088, -20128, 45251, 15724, -44956, 41429, 76880, -43817, -22120, 89231, 5418, -55966, 37630, 33747, -17688, 23131, 13354, -32651, 22658, 35189, -48145, 5630, 81497, -42549, -64691, 75109, 21522, -68422, 30867, 47797, -47957, -10439, 37772, -28531, -10307, 38442, -44901, -28350, 69401, -24997, -67633, 64760, 30235, -75082, 7955, 45018, -48734, -14244, 55094, -18818, -20616, 44028, -25388, -26729, 58732, -20665, -58937, 63751, 36112, -74748, -2070, 54898, -30878, -15220, 51697, -16903, -28898, 35631, -15305, -23361]
216b3361P0753n2214l4106Q1229k4206q0806O4087M9481p7135L654N6646m9471
228a5449r955M4588l7163K018M7769m6205k1245O5556j5891o0169M9614L8395
240D1863o5761q00M7845l3143o119L4502j9223n11J7469l4337p554M6063o715
253A3579l8373L2763K3921n2808k311M0839j4091m886J4858j3066m25P005j4793
266g788J497K6409p292l1213K2919K1174l8952j747L4869r038j6559M748M139
279C166j175m567j74L870R779n256k2960J4642K1080k4563n601K3029l634j9607
293a1971l72J7588J975r438L690n23k68k090j3536J4627J7746k0117r243J5821
307C889L251j6999r39K2477m735j7635P469L792P7j915q802J0573P555j3316k980
$$ y = [-23361, 47392, -4822, -38928, 42301, 18095, -62711, 1376, 50857, -26278, -22624, 34022, -15449, -25404, 19184, -17979, -15961, 31808, -14397, -35642, 29914, 14023, -46146, 3468, 41863, -23898, -24698, 23147, -9996, -16115, 18387, -836, -1347, 16122, -18215, -25769, 20294, 13579, -24794, 7969, 31890, -20918, -23229, 17610, 3519, -1367, 13491, 425, 0, 7005, -7788, -6291, 20118, 12826, -18387, 4532, 25706, -13246, -14993, 19876, 10838, -5721, -973, 3166, 1991, -2576, -2750, 1120, 10899, 5643, -17317, -2675, 18405, -6158, -11759, 11270, 7636, -11971, -12343, 5245, 7220, -2218, 1472, 949, 681, -1409, -14945, -318, 17428, -2689, -11932, 3889, 7140, -9859, -10798, 11679, 6944, -10691, -3222, 570, 647, -1268, -10070, 503, 8058, -5258, -8238]
322h238J1295M703j3749m181J8611l256j3823N285O664K321p221m488J2972j822
336E073j1130L463P537L044j0155n984J2750k16r402K291R871K486j6529j038
350g939J5677q391o603Q789J89R9l823m821Q009N074p508p198J3069O835k1646
365a0188M603J9567j4770o092J1147j373k96L92m893J961O412o223j0965J5675
379D957N431k4052R902J8852j9215l293J1902n673j877N913k490k302P538o385
393g92j2703K0254O309k5163J0910J4931j8260o21J0542o837k941P677j351n800
407c845Q336k805j1557J6324J288k1663J2948J4022j5165m863P952p30l985N665
421A922Q85q446O822J927j1877Q530L401j1681N954Q738p565o815Q099O517j1327
$$ y = [-8238, 3057, 7760, -5989, -10170, 8441, 5185, -8638, -3353, 3311, 5632, -1589, -6077, 6895, 5073, -6057, -2594, 4943, 7987, -2168, -8152, 4598, 4382, -5020, -2729, 7142, 9628, -6901, -7939, 7738, -653, -7256, 1533, 1722, 1821, -2002, -6823, 1186, 6260, -1248, -8446, 4623, 11458, -10188, -5585, 13982, -788, -6880, 4267, 2894, 2598, 2990, -1903, 58, 6470, 247, -10718, 4957, 10388, -13664, -3762, 15090, -4125, -7418, 4484, -1189, -3066, 2847, 357, -1945, 5593, -792, -13495, 6759, 13068, -12095, -1185, 13746, -4514, -5135, 5407, -1430, -4371, 3306, 1955, -3845, 4491, 1686, -9871, 6453, 7741, -13922, -974, 13048, -2117, -6980, 972, 242, -3743, 1922, 2807, -5639, 1183, 3110, -8767, -237, 3164, -8517, -2563, 6175, -1390, -8205, -106, 6411, -4916]
436d916M89R979r025l07Q483o124j689N696k455m608O969L388j5443M994J7510
451A2941j6789n795J7982j1198q104K0031Q77j5765O335O155j4212R985J5464
464A7907k6253J076L0009k1668j4148K6462q044j5121K2436M14k7503J3667J8670
477A7904k5146M342J9727k8646M066L3687k7570j5458L2818j0215k2894K6623
489I238N232l2660J5362J9590l0790O498K2603k9946M947K9735l1487j2363L5968
502A1927r851k3469K5248K514l0084K1486J6611l2596J1690K0330l0503O876K4611
515A4790k7096j863L2281j7836k2646L0171K622k8811K0315J2996k5424J4222
527C721Q245l0460J7211K5656k6980o045K3466j2075j0671K5430o418k7632K1088
$$ y = [-4916, -4427, 5552, -3473, -3780, 4703, -1421, -3110, 2586, 131, -4477, 2492, 5880, -9563, -4569, 12941, -3848, -9643, 8339, -2859, -10963, 9068, 9945, -5820, 515, 6670, -7542, 2443, 17907, -8346, -7270, 22739, 1071, -13077, 13385, 5341, -9780, 12656, 13070, -14433, -766, 17904, -7242, -2900, 16827, -11819, -7753, 25934, -1636, -17094, 15724, 5509, -17385, 9238, 14470, -18190, -2828, 16762, -14028, -7530, 15073, -14873, -9926, 19809, -11678, -24041, 11927, 2076, -21393, 3855, 6369, -23715, -2229, 14382, -18214, -6524, 13806, -16697, -9821, 14790, -12306, -14169, 18112, 276, -22370, 7801, 10423, -18388, 1927, 14923, -10501, 3721, 11966, -18494, -1283, 24373, -2607, -8652, 14814, 2739, -7932, 17498, 11080, -16552, 4536]
540D536J2337k1410Q265M159j4779J6036P111k6813j09K5252k726j4146P545m381
554H77j1900J5970O561j0928L132l374n947Q203k187o138N265P861m589j2677
568i871N60Q805K170k495j832M733o954j1057J5649Q004j2845L791J752r589Q145
583a034L573j0294P304J2862j6328p867J9059j1294j4406L2042L014k9975Q794
596d550O990j2851J4326P211k2902O202K1495k3080r963L1164j2593j8319L3804
609A6934n429l5158J9109J6318j5751P860M971k3078J0090K4589k7405r419L5616
622A9247j2556k0244K6628p350k3416K3869R370j9998O815N880j9172J0624J8844
635A8541k6178p88L0635k1480j9078K6101k743j4280J8088J752j7429O000L829
$$ y = [4536, 16873, -4537, 3728, 7887, -6892, 9144, 16255, -10558, -10667, 14585, 11859, -2287, 5258, 877, -11023, 4947, 11508, 580, 3712, 338, -5609, 2594, 407, -5731, -466, 7395, 2806, -9871, -9311, -506, 1664, -831, -2663, 2070, -4884, -15941, -292, 7712, -5133, -1342, 410, -9179, -1034, 2539, -7755, -451, 12411, -3917, -11784, 7275, -4019, -18425, 13617, 16631, -13344, -4550, 2440, -10411, 3915, 11126, -11776, -5574, 15921, -7159, -17122, 14042, 1449, -16870, 16934, 11505, -23653, -4544, 11774, -3977, 3883, 8854, -14224, -4134, 20455, -6950, -16369, 19247, 6691, -13553, 13075, 5725, -17691, 6178, 15548, -4450, 2365, 8245, -10927, -303, 18541, -7637, -8425, 22210, 730, -18348, 7753, 5010, -9270, 8818, 10570, -6859, -859, 2970]
648B970j2810J3097J3954k4413O04K1227j9098q005K2969m501j1837Q481p15q827
662f904P105J715j0349J0338P412k1518K339J8766j2202n957J2691l439q185M333
676c855M648k725J47M78m964P114L524j3575M803J2885p266p175M358L450l708
691a861j450O996m31n590K455J094j55K35k641J601L257n73n596o8J1187l852
707D608j2667J0373N528j1786J995P348l152k492K671j896j879O623m703o159
721e588J4871k840j5285J1218N565j4549K405J1705n349o359N844k748m463R613
735D040m235p530J4552l803j6030J1979P130j2059K531J1184p466q188Q138m05
749a62l065R533o265p058J2606l947j0876J1763N075j0749l47Q329n795m825P967
$$ y = [2970, -9840, 3257, 17211, -7202, -6598, 14629, -4469, -12474, 10495, 5994, -5843, 2638, 1923, -6904, 201, 1916, -8433, 1905, 9317, -12201, -9862, 8904, -3298, -9255, 3436, -3, -8188, -3855, 793, -1932, -1785, -1307, -6271, 843, 4367, -9208, -4405, 8480, 1214, -5961, -1603, 1847, -1861, -3311, 3685, 3254, -2336, 119, 1213, 1058, 1293, -1348, 253, 3510, 2937, -2659, -2727, 8460, 4608, -8059, 2314, 7842, -3944, -1949, 5399, 2247, -245, 2426, 530, -1349, 5274, 571, -5588, 9283, 6443, -8842, 2376, 7941, -6608, -4203, 7502, 2153, -4206, 1638, -1110, -5573, 4040, -195, -7725, 6827, 3024, -13006, -1027, 6103, -5956, -3425, 7759, 293, -7895, 243, -162, -3227, 6306, 41, -7017, 5589, 1642, -9234, 2529, 7604, -3145, -3492, 4837, -958, -5783, 2184]
764B184o33k460N151o855k744J0665n535n769J0526J651r428j443P240k084k980
779b514N349j058j620K013n959J999P408n237k448N271k53o481k22O780o15l622
795a209K835j223q39j82l410N093L332n774l33L238J24l318n80N759r06m075J552
812H4Q40K98j574q13N055j178m973J090J505J719k148j414M508k209n201K130
828b281L210J044l806k47M288l856k238K547J121J529k814k440M949j045l393
843c432J999L219k5n060J579M420l843m79J990L73R39l767K66M911j823k626Q84
860d75K345J97n060K318M655l083j513R27J610j95l924L071M256l439j415j95
876H0J222J507l683K055L219k884l107LN063j482n377M928Q87n017R81L13J010
$$ y = [2184, 1551, -909, 4242, -2613, -5357, 5308, -227, -5996, 4530, 6181, -3247, -4690, 2550, 466, -2514, 2835, 1777, 157, 2170, -3789, -1790, 5618, 381, -2067, 3204, 2951, -3530, -3752, 3028, 2413, -1209, 1626, 403, -436, -618, -4028, 1065, 4397, -1377, -1710, 1528, 1652, -1666, -2246, 3513, 2607, -1468, 84, 924, 1222, -352, -1165, 3890, 2712, -2261, -1171, 334, 2053, -95, -1509, 2999, 790, -4411, -2281, 929, 1973, -1833, -2080, 2208, -1648, -3886, -1339, -218, 1311, -1503, -3943, 1006, -39, -3432, -1433, 1786, 1761, -3299, -1720, 2700, -1143, -1622, 368, 741, 1680, -2087, -1821, 3090, 1267, -1359, -475, 1870, 2067, -2993, -675, 3980, 897, -616, 311, 1921, 1726, -2198, 873, 5129, 1690, 275, 80, 1302, 2809, -874, 1181, 4400, 1516, -1591, -1588, 3475, 1993, -3384, 1544, 2431, -2586, -1605, -1292, -282]
893b82J534l628l44K904L0m080L33O670l522n420O710q15m305L363O19J33P56
910F56k962p39L735J182m836J508P311o510m332P839r68l307L765j130q22J324
926A714k867j060M608J552n922J622N250p278p21Q217l766k791L136j426L97J464
942B129k334j294M175J263o793J928N266o458L23N601m706j430K699r32l93j49
958a105o23m60K968J84o621K890N627n277J92L221k264m92J027R40n84q20J644
975D47k6l50M00k998K347K956k463r85Q08J162p56j886M088k14m581L602Q03l178
993h24J871Q45j127m53J666j413j870M300k027l983O883j065p743N493L582m794
1009f59L19K439m103J8O000l594m800P632k212o022P715j554p122P270K418q412
$$ y = [-282, 1252, -2376, -2720, 184, 214, -3866, -3533, 3137, -385, -5805, 905, 90, -4215, -852, -233, -100, 656, -2306, -3045, 690, 1872, -2964, -1456, 5855, -655, -4987, 2852, 1884, -1423, 2342, 1212, 390, 1714, -1153, -2213, 2395, 3947, -1975, -353, 4897, -2381, -3102, 5115, 1349, -1442, 1694, 268, 665, 2129, -205, -1499, 2676, 3939, -2854, -926, 4340, -2118, -1795, 3806, -900, -2330, 369, -563, -956, -1105, -1728, -2188, 780, 964, -5657, -2767, 2860, -2417, -2225, 996, -1268, -1760, -733, 207, -377, -1197, 447, 421, 71, 471, -2527, -180, 2776, 313, -672, 136, 1298, 542, -1344, 2744, 2530, -2051, 1551, 2354, -824, 1047, 1892, 765, 312, 1978, 565, -1305, 2995, 968, -3015, 3868, 2803, -4940, 553, 4135, -659, -340, 2099, -2004, -1986, 4014, 420, -4380, 3252, 1040, -4982, 2733, 1179, -5943, 1327, 3745, -4667]
1025d667P82O089l887j182O072n716m002J0433m191n609R463k707o960P686J393
1040B997q152L728P238p523k544Q005o053j427J0188p244m468J0144m499o024
1054e634Q734Q28q714M723N876r101L86R335p425k155R054o939j890R021n051
1069A048n811Q721J772r828K949O908p532N43P416q157j798R396m531l216M692
1084B572k577l226O423R41r215K239Q560o089l541N872k545j129L977k857k794
1099c389K763K194k498j18K943m561n80O988l677m838N035K259l787j875L280
1114A39M2k595L375j251l266M878j129m033N380L21n726J859O358l867m655O174
1130B004k62n776O115J220n485M061o10m587N264L136p233j54P908m697n569Q137
$$ y = [-4667, -3885, 2204, -1683, -2865, 3207, -2509, -6511, 3922, -269, -5878, 3585, 878, -6082, 1604, 2997, -5155, -1427, 5811, -1712, -4256, 3749, -2304, -3731, 6457, -787, -5255, 4889, 390, -5634, 3100, 3928, -4786, -63, 5813, -3288, -2902, 6433, -992, -3147, 5907, -1032, -2922, 6099, 1048, -4763, 3958, 5730, -4098, -1149, 5759, -1773, -1230, 6186, -1971, -3769, 5627, 1096, -2120, 2572, -5, -3231, 3192, 4133, -5082, -2843, 5717, -372, -3913, 1959, -586, -1715, 2262, -595, -3389, -626, 1568, -930, -1048, 1895, -2666, -3246, 3742, 65, -4773, 262, 2521, -1266, -3141, 139, 181, -2414, 961, -290, -3556, 1322, 193, -3840, 1540, 1861, -3865, -2006, 4352, 485, -4170, 2004, 1742, -4034, 2081, 3301, -2184, 1877, 1267, -3320, 1944, 5080, -2153, -2307, 5601, 904, -4665, 3472]
1146C472o84o941P390k6p296M744J104m322M770K033q461N61R868o251n760R864
1162D065k001o339O952k001n323P155P25o478L564K721p824K760R226q847m183
1177e828J0283l878n124O767k069m051O501j104o519N104L652p840K256P959r004
1192b895k185J0132m733l974O461j950l318M644r80m046M248K341p576K521P025
1207E715p266k356P564l616k079L799j154j854J936k73k234K374J652m696J670
1222h18M279n535q18M349n24r79o46O74J10p70P33K22K63J89k014Q09J676j869
1240f69M86P03L08k63k669K284J962l234N65J885j200p50M99P33n47P79K9k092
1258a191K716j47l902L839K453m859O79K489k180q89J897L38j569J248q38k434
$$ y = [3472, 2788, -4153, 3237, 3211, -4085, 659, 1763, -2559, 2211, 4244, -4217, -3656, 6212, -39, -5799, 4065, 2064, -4275, 2677, 676, -4647, 2508, 3233, -3245, 319, 3040, -4784, -2024, 7202, -1645, -5828, 4455, 577, -4547, 2220, 151, -3900, 2601, 1497, -5022, 82, 3734, -4106, -1850, 6109, -2895, -5080, 5052, 319, -3655, 2806, 856, -2462, 2182, 1202, -2844, 1404, 3745, -3831, -1310, 5715, -1551, -3907, 3657, 41, -2038, 1761, 607, -1247, 689, 416, -1818, 556, 2208, -2488, -818, 3461, -2074, -2892, 1457, 933, -46, -692, -18, 92, -678, 55, 277, 540, 729, -1285, -476, 1200, -669, -183, 520, 828, 565, -2104, 180, 2142, -1092, -527, 1358, 158, -592, -93, 640, 93, 872, 901, -1191, 1525, 1378, -2524, 1315, 3768, -1091, -412, 2077, -103, -992, 905, 1243, -326, 922, 84, -2350]
1274b350L884k57m532M315J111n015J391K653k274m44J856o45j441K150j499j499
1290b596M517j578l785M413k40l637K250J579j832j60J761j358o78K299j848q01
1306a694M938l302k577M580r51k813K637J036j927j80J275j086l46K840k622j50
1322c42L904l870q95M006j529j482J728M14j383m24J144r65M15J418k705P24K045
1339B203l700M39K798j630j188M11N92n24q93J415m58j46O61j929J588R52k554
1356a963J353J194j271k48n13J358lq96Q60k43M0m56j078K366l92j509J373k34
1374b62R2mp91J613k01j332J260O6k7j007K96J826j098j025J253n32Q44l49r93
1393c71J879q19q18O21N66j4r63O2J227j076l21N62k49Q96j489n57K055j466p66
$$ y = [-2350, 1534, 1277, -3255, 1060, 2171, -2844, -1453, 1200, -1074, -1518, 338, -307, -1748, 402, -1097, -2596, 1921, 343, -3442, 971, 731, -2906, -656, 923, -909, -1069, 692, -666, -1344, 955, -893, -1694, 3244, -58, -2635, 1945, 994, -1819, 818, 1854, -73, -253, 1022, -64, -410, 2430, -192, -342, 3562, -308, -1203, 2803, 1274, -208, 1520, 1934, 551, 127, 1271, 306, 721, 2139, -566, 158, 2203, -1497, -1058, 1740, 110, -1078, -667, -75, -599, -1492, -77, -535, -681, -20, -1949, -361, 591, -1963, -610, 584, -687, -935, -1448, -90, -93, -989, -129, -372, -332, -788, -1866, 500, 108, -1401, -28, -262, -170, -174, -965, 648, 447, -885, 375, 441, 414, -593, -297, 1529, 431, -594, 659, 127, 971, 622, -371, 1508, 689, -129, 492, 1058, 1044, 81, 143, 1370, 294, -27, 535, 286, 1182, -307, -864, 1191, -275, -1041]
1412a041J124L69K65j389k20J328l48O7k54K80N13k185R16J859j626J19K88r0
1430b5K69j085L62Q71j22q57p43J667M25k859J295J976j681N03l38n09R55l71
1448b67j48P55K01j004n42K300n01k514K658M45k029R71l93QQ89p73j63O26L14
1467H33j751o47L167j060j891K390j005j594J727p41P02P28j314m85J045N36j794
1484a154N38K886k258j656K600j598L19J472j380r1J080r26o68J093J089k006
1500f60L32K341l131m65K674q98m16L46q84O94P71l52j264P52J349j918N94J947
1518A812k254r5J675p41o39k4N94O88o25%r06O92J136j663q6J376j510NN09K45
1538A89M6r17P31k90j048J432k03j31J006j846K89J127p00k25N55P99r37j459
$$ y = [-1041, 83, 452, 717, -672, -892, 436, 88, 155, -99, 181, 694, -1491, -575, 1284, -342, -223, 65, -25, 244, -841, -479, 392, 270, -587, -1330, 337, 762, -2097, -802, 1174, -507, -4, -342, -851, 104, -267, -415, 340, 541, -463, -1005, 1295, 794, -1720, 938, 1383, -646, 325, -68, -60, 829, 56, -107, 519, 833, -918, -1565, 1602, 542, -1349, 1041, 36, -1558, 169, -572, 130, 858, -456, -941, 104, 640, -1154, -616, 2270, 12, -1644, 956, -642, -323, 1149, -231, -322, 758, -168, -836, 257, 1346, -660, -328, 2013, -1118, -1583, 1091, 193, -223, 123, -761, -67, 704, 352, -912, -160, 1189, -729, -135, 1812, -442, -537, 1138, 397, -242, -266, 328, 1016, 391, 391, -515, 177, 1313, -350, -436, 940, -570, -565, -56, 189, 235, -682, 49, -241, -1289, 143, -60, -191, 815, -1031, -742, 385, -315, -540, 15, 814, -123, -1582]
1556a582K012l27n24J256j665n00J876p87m97J061n03q31Q26J467k217n61L095
1573A599j556j008J698j688L05K372j303j524J240Q80j662P96J671k570l28L469
1589B391k495o34K430j442p52J771j351q43J758P45k392N44J832k922O36K961
1605B237k744k98K129k196l02K186l39j183N90M97k202J722J654k763P58J455
1621A201j759N48J26q33Q84N76r51n00M43L21k33R26p54j511J899j23r53J191
1639D98j161J13J944j418j117J058M60m33M21R1j329K73K820k407n99J763j785
1656h08O19K068k660l72J908p50j301J754N27k484J311J306k939J586J880k795
1672a150R65J770k832J21K444j564o33K485o25l338K558J293k821K466K83l601
$$ y = [-1582, 430, 103, -421, 835, -830, -1330, 546, -241, -738, 323, -180, -1011, -185, 1282, -935, -1496, 1599, 43, -965, 733, -955, -650, 1722, 419, -1105, 135, 1015, -647, 149, 1820, -750, -1078, 2391, -104, -738, 1692, 250, -502, 1269, -82, -925, 833, 1578, -814, -270, 1562, -1360, -724, 2237, -507, -805, 1324, -872, -1174, 1012, 673, -510, 80, 577, -1625, 97, 1751, -1012, -254, 1201, -558, -10, 116, -717, 167, 743, -208, -708, -265, 56, -177, 749, -5, -1516, 383, 260, -693, 498, -663, -550, 1394, -24, -1141, -83, 377, -56, 365, 456, -873, -600, 2220, -187, -786, 977, -808, -189, 1879, -781, -1153, 755, 5, -1296, 458, 985, -1499, -188, 1118, -1821, -235, 1645, -1150, -185, 1585, -1247, -1126, 1318, -246, -879, 1606, 981, -2357, 201, 1494, -1327, 1139, 1422, -2179]
1688b179K492J617l458J286K131k283r43L019j573k389L900l34l413L528o81l061
1704b341L504N56l521K018K031l362J30L053j967j850M115j654l018M046j066
1719F74k678L609p23k925K404J480l564N36L177l038p71L745k638j446L813k194
1735e39j576L379r47k645K679P15k749R61K341k556k43K955k658p1K352k122o0
1752g84K407j614j314J693J40j374Q90J213k239M48J654j966Q63R29j800J196
1768C42N23j043m9J102k32q63R05K71j560J083J5j241J631l39j232J710o14r14
1786e05P49K62p50j82J001o47m28R73r01m60K254j808o84K006j702l49J319j41
1804Gr52P85K95j020L25J393j525K23J105j819L14J684j198j77Q60l32l68J22
$$ y = [-2179, 313, 1930, -1528, -242, 1889, -394, -1337, 1682, 109, -2280, 1620, 1286, -2127, 1401, 720, -2341, 1163, 1719, -1802, 216, 2247, -1115, -985, 2068, 101, -1749, 2366, 712, -2306, 1740, 674, -2004, 1605, 882, -2043, 361, 1841, -1723, -1187, 1990, -1048, -1819, 1926, -712, -2158, 1655, -539, -2115, 1264, 317, -2328, 351, 1066, -1683, -722, 1619, -937, -1180, 1775, -883, -954, 1398, -724, -784, 1623, 9, -1305, 388, 528, -846, 44, 1257, -982, -534, 1120, -846, 17, 946, -854, 342, 865, -178, -227, 875, 643, -220, 685, 956, -604, 479, 494, -747, 884, 545, -687, 1023, 409, -505, 244, 506, -244, -426, 575, -72, -500, 473, -428, -888, 1366, -442, -1126, 880, -822, -1171, 148, 7, -945, -160, 135, -885, -560, 833, -692, -469, 636, -1183, -869, 815, -383, -560, 300, -32, -400, -278]
1822b78O38j028R15J14j303Q99N43j863J391J058j862M30P98l83k44N04J91r17
1840c97J219j95j214J538k17j833J859K2j387J087J55r81M69L12l70o14J374o97
1858A30j026J973p77j269J675k33j198N83N67j85l85L32k67m63J094r07k68J710
1876A086j303l79J393p20o87O05PJ8m37N91k23j25N88o46k40J060j294L73P69
1895D36p79J18M9n4M04l44L75j19l81L99j22J28K93q37P81N9o78O61o99L24M56
1916D70n09Qk6r4L59n27O56j66p21N70J0j86K31n97O78J8m26M01K37k11j62m17
1938d04R10j06o99O45j52R2J94o40L99q4l46O05l91kP4k17O72m14m45N44m04L23
1960A54k42N6O31q48J36K56l22L90k2m61M96l16R2J54L5M2l72j03N13o15J01K15
$$ y = [-278, 360, -668, 247, 361, -942, -43, 500, -1363, 28, 1086, -776, -346, 452, 69, -175, 329, 520, -397, 822, 627, -587, 951, 734, -1099, 760, 782, -605, 482, 637, -344, 125, 437, 67, -547, 827, 130, -896, 1077, 300, -969, 706, 473, -725, -142, 425, 240, -145, 187, -80, -543, 551, -356, -624, 1086, -217, -596, 797, 77, -610, -5, 2, 20, -417, 174, -49, -174, 414, -232, -472, 588, -706, -333, 436, -343, -225, -176, -230, 174, -170, 205, 86, -295, 104, -18, 110, 403, -434, 347, 406, -272, 389, -310, 14, 470, -39, -31, -57, -151, 208, -319, 337, 171, -550, 20, 30, -156, 75, -522, 156, 174, -252, 149, 386, 175, 13, -404, 506, 400, -299, 346, 194, 286, 480, -160, 239, 155, -191, 414, 23, 21, 95, -122, 550, 136, -309, 235, -169, 154, -88, -32, 599, -249, -113, 143, -179, 211, 189, -272, 224, -92, 0, 154, 189, 231, -141, -244, 269, -346, -245, -30]
1982c0j93M27n73l82P58m02M41o2j93K79n82O27k3o68L30J2k32N69m89L61M88
2003D63m20J05l31M33K51q54L48l8k32N93n35R0M91n93K61J50o45M29j24K52K21
2024C15n57N24j05pJ39n17K27M44p58M01K97O0K9m10j19J72P9N44o66p4J95n00
2046b87P24L3j149J079o17J25K46m63J77L43j94L9n15L83j82q0R73r30l04R44
2066C45o37l9N94m52J8K05J18o53N55M75q85J02P12j173O70P01j412P09O63j238
2086f22L47M40r2l57O39j10j110J226P19j881Q52O25j391R86L33j053L60Q08l77
2105C42r03Q95k6j223K018o82j637J377L53j163J153j6j320O50Q37r28l61J535
2123I01p56j219J501l63j091J888j05j619J162nr89R23N91j062K2J083j092o99
$$ y = [-30, -223, 204, -369, -751, 7, -395, 46, -16, -209, 70, -512, 115, 92, -576, -246, -234, -466, 103, -386, -25, 463, 43, 148, -183, 250, 501, -353, -5, -43, -275, 318, -217, -127, 364, -229, 32, 182, -463, -34, -158, 94, 315, -242, 282, 177, 170, 309, -208, 19, 463, -295, 106, 403, 463, 492, 82, -37, 135, 214, 758, 92, 18, 213, -287, 437, 470, -679, 400, -217, -92, 154, -309, -132, 211, 17, 56, -459, -76, -258, -338, 635, -295, -599, 345, -292, -331, 263, -189, -171, 34, 152, -501, 54, 529, -356, -254, 458, -715, -45, 656, -756, -47, 616, -622, -275, 165, 73, -284, 355, 245, -865, 361, 1080, -801, 51, 676, -715, 271, 604, -449, -89, 719, 342, -561, 334, 308, -915, 1103, 421, -1216, 161, 514, -649, 504, 488, -832, -182, 655, -273, -634, 901, 145, -1074, 427, 64, -1027, 861, 756, -863, 299, 294, -695, 228, 819, -243, -221, 862, -230, -929]
2141i29K244j345o87J514j193k09J277n69m86M08K54p85K31J057j330L47J459
2158A258j911K87J297j311M16P92r46l41P72r1n64P70j59j322P24J196j752J107
2176B22N19j629Q39M02q18J67Q68o71q11J122J1q89J459m73j363J522N0j345J188
2195C70M2j058R00L07j082O4J476r12p95J813j215j008J858r29n04J334l75r24
2213f38O67L21o39K93O40j413L40J629j589J28J636j861L5J456j072n26J047l25
2231A29n41J079Jj643R51R33k115J274J099k198P05J128j517L1J477j113l77J150
2249D53j35j294J135N76j683J695M4j949J051P72j356N00J257j224m38J378q07
2266b5j141J915l30j697J790l07j179J012K34q18O04M98r87qJ242q54o81J364
$$ y = [-929, 1315, -30, -717, 797, -396, -605, 672, 103, -383, 25, 279, -506, -275, 782, -548, -201, 1258, -653, -366, 931, -380, 36, 828, -118, -459, 313, 222, -342, 428, 269, -1053, -329, 867, -885, 222, 741, -888, -49, 353, -465, -298, 570, -101, -912, 210, 221, -668, 791, 318, -1045, 477, 527, -818, 370, 412, -646, 254, 561, -521, -457, 1019, 107, -688, 1125, -90, -1098, 760, -169, -673, 661, 286, -638, 29, 350, -289, 4, 644, -769, -429, 1200, -389, -261, 1375, -486, -451, 1005, -67, -593, 454, 129, -412, 667, 668, -975, -24, 909, -1206, 68, 1167, -1031, -326, 802, -715, -684, 793, -320, -697, 453, 318, -976, 159, 735, -948, 747, 791, -1158, -107, 665, -691, -191, 1066, -158, -596, 782, -25, -1166, 749, 419, -1278, 512, 205, -974, 38, 272, -546, 58, 556, -431, -439, 803, -51, -732, 632]
2284F32p40r72J467j77q19R96j63n56N31J50m98P5N54p82K35Q29j173J81R97r46
2304a79o0N90l39k71K19K58l81J28M02n19J15Q23j144N20K07r19O83L44q00L81
2324E8K24k69N1q5K85p03O01jq34J015j06q43R45j70n55O68m21l86M21J70l25
2345b60l7N22m32l11P90k84m62R52p76J9O34l46j13M40P3l17L8jk19M0N72p45
2367b23J79M73j056P98K00m65%K84j20j51o1O16p90L86K33p07M14M16o36M75L5
2388C00k90P8R6Rm87M30K83q93O45K17q48N51j61j11M3J07j90m4L41Q0n47L19
2410g2M64p05O01k89l70M98ln53M33j21J36o2L05J44q35P42l91n48R39l63j81
2431b31L99j31k44p2o8M41k46K54j83j43J79J7l73O62l30J41M3l95K82J4O3J20
$$ y = [632, -108, -1080, 387, 210, -609, 387, 224, -332, 199, 349, -149, -74, 480, -302, -67, 762, -411, -230, 767, -179, -239, 351, 12, -259, -40, 218, -163, -35, 367, -152, -37, 786, -358, 162, 369, -550, 133, 477, -323, 58, 282, 13, 64, -21, 264, -439, 162, 161, -673, 342, 236, -607, 338, 168, -387, 281, -140, -526, -105, 65, -260, -297, 225, -207, -518, 272, -12, -474, 478, -298, -279, 355, 9, -104, 336, 409, 92, 130, 129, -90, -50, 522, -223, -44, 429, -627, 171, 371, -94, -94, 190, 70, -81, -142, 474, -316, 70, 303, -404, 10, 426, -210, 265, 300, 10, 88, 184, 193, -294, 136, 419, -474, 171, 388, -460, 91, -70, -181, -138, -31, -221, -265, 76, 156, -391, -72, 392, -313, 288, -1, -371, 127, 124, -429, 4, -117, 19, -43, 262, 406, -429, 313, -78, -626, 313, -50, -231, 168, 37, -207, -279, -347, 94, -152, 102, -81, -224, -45, -28, -401, 261, -69, 72, 115, -280, 2, 16, 79, 199]
2453A99l08N8J40k28M34m07p3O25m13O1K23l11N0LJ4j01j69K58J9k67L25k10j61
2476b39L32j42K11K6j49K18p1j1p6q8O51p35j34N76m44j94N56m79K06L7Q7L9j35
2499D2N16p57p0R13n84j12L26o76K22L22l38L39Rj96J76j35J86n37N04J68m51
2520a33M71j57o42O28J62l92N3j87P3k28L99km80M95O3p93J097j29q62P59q1l46
2542b32K31K08j18k65O00l62k92O26k63p56J256p42l33R82m62m08O76M3o40p0
2562c21O49m20Q8L46l93k17Q46p61j15P73l84l14L28K73m24j52M94p59N11N46
2582E94q44k2P08o26J52M30n20j69N38l35lR5K47n32J28O09q20K87M01o29J64
2603a47J78k99K6K33n7J28L12k69l90O09P4q62O10L9m89L00K94l60q0J10l24K45
$$ y = [199, -109, -51, 89, -139, 295, -112, -185, 440, 27, 88, 311, 0, 50, 53, 67, -34, -203, 55, 74, -193, 132, -78, -239, 93, -49, 162, 188, 39, 257, 186, 175, 99, 11, 662, -73, -207, 369, -75, -269, 287, -192, 14, 51, 138, 177, 42, 558, -199, -269, 644, 60, -52, 274, -402, -180, 142, -196, 143, 152, -44, 132, -3, 183, -354, 150, 318, -133, 338, 181, -461, 167, 329, -63, -10, -197, -124, -352, 47, 45, -435, 60, 123, -670, 427, 298, -564, 195, 114, -232, -1, 207, 89, -176, 424, 62, -230, 396, 133, -623, 633, -109, -442, 540, 78, -330, 346, 389, -251, -321, 328, -92, -4, 342, -51, -268, 578, -183, -298, 475, 91, -223, 105, 378, -46, -198, 296, -463, 48, 594, -250, -272, 436, -190, -38, 392, -128, -297, 241, -94, -97, -2, 245, -287, -159, 450, -370, -83, 318, -311, -147, 31, -268, -242, -9, -66, 62, 374, 105, -285, 324, 398, -464, 146, 185, -304, -4, 290, -70, -150, -40, -364, -119]
2625a19M33m08k46P53o61k91J008m33p62Q51l29j69N59k97J18l3L87o77J74O29
2645D87m64L40K50j146L44O45q22K80K87k53j2L10r0m72L74K33q02Q62N4q97Q88
2666C96n4q91N86Q2l19L3L52k28m13Q65k57o38O25M26j096R85p3o87M72k67k64
2687c65L00M53o09J55L96l22n41Q65o90l7Q95m50l76N67j79m09M51J49l85J14
2707a8M80p66l1R02p59N8P87r36J16O46p96r5N69q2k50L91J38q92M68M95r41P38
2729B22K05o17N8P83p46j35K88R0m69M15n5k31K22J92n25M74K01o09M82q4l55
2750a94O8L48m05nL70j99k71M15q9k7L04l53l29R32m16k44K66j06o2N4L47m27
2772b3k40O07o10L05M30n38J5M63o44j71N41L2k98K81j88j98j8P09o66J7Q93j029
$$ y = [-119, 314, -94, -340, 413, -248, -539, 469, 36, -726, 125, -204, -373, 186, -111, 7, -26, 361, -316, -142, 487, 23, 363, 613, -533, -189, 456, -366, -86, 201, -52, -64, 246, 156, -316, 58, 291, -511, 351, 405, -492, 396, 342, -549, 37, 119, -200, -167, 185, -43, -456, 409, 152, -486, 139, 565, -531, 454, 381, -306, 166, -101, -365, -65, 388, -221, -66, 330, 8, -533, 332, -358, -395, 500, 50, -326, 241, 62, -347, 104, 253, -132, -18, 462, -304, -335, 567, -192, -134, 653, -283, -167, 479, -317, -412, 157, 75, -175, 216, 354, -538, -70, 425, -516, 222, 427, -190, -132, 651, -95, -230, 58, 148, -321, 94, 39, -192, 30, 222, -303, 171, 372, -237, 245, 161, -194, -126, 222, -183, -188, 182, -17, -288, 127, 38, 11, 315, -38, -367, 565, 149, -95, 171, 65, 3, 57, 404, -23, -263, 344, -266, 39, 469, -69, -54, 409, -235, -406, 135, 167, -131, 150, -38, -236, -254, 455, -211, -194, 699, -330]
2794c30K62M22o66Q9K11o2j41K30l3m10M09J43m45M97J27n91N71j29l04M76j93
2815A33k27l2K74k20l99N83j00n00M94Q2l60M93j03m26O09j56m12K70K49k80j99
2836b27O72l82j82L52k35k63O75l82M0M31n68j51M8M57m18j80Q42q35J18L26m70
2857c32J69J08J12j15J19lk01J75N0l66J33M09n95K61M21p23M93O8k17J53P2k16
2879b5M5J64J1m18K49J02l63N07j34l87J73J53l25L64jj79j97L32L13k88p8O2
2901H0k2K7j30R8L11l27j85K32j45O0N5m4O7k58K09P8j28L54l55j0K77n56K95
2924a7J25l04j6K02r9Q4Q8K80n44K99n5j32K7L37l9m27K10j45l1J69P7J1k38P9
2948e9K63j09R0k41Q6l1m9o9J09m8r7K24k1m08J91L38k20j5K3l43N91k68j06L11
$$ y = [-330, -68, 354, -312, -223, -12, -74, -215, 15, -18, -428, -19, 124, -321, 176, 303, -288, 283, 154, -150, 326, 133, -94, -126, 148, -72, -471, 112, 12, -488, 6, 88, -272, 221, 118, -308, 301, 145, -267, 3, 252, -28, -227, 445, 63, -119, 233, -2, -265, 410, 28, 68, 499, -69, -220, -172, 285, -133, -313, 529, -306, -188, 138, -332, -163, -55, 57, -58, 61, 58, -143, 32, 82, -284, -151, 258, -337, -76, 345, -378, 115, 183, -34, 119, 191, -25, 20, 184, 195, -223, 26, 128, -235, 272, 138, -249, -76, 77, -248, 116, 115, -64, -261, 71, 384, 96, 18, 80, 58, 85, -45, 53, 364, 37, -148, 84, -61, -1, 54, 10, 77, -181, 28, 106, -22, 332, -23, -33, 244, -312, -17, 108, -196, -212, -10, -109, -25, 63, 343, -201, 98, 43, -89, -62, 275, 236, -191, 19, -126, -157, 12, 89, 100, -138, -59, 204, 95, 185, -56, 30, -1, -50, -119, -10, -58, -155, 69, 48, -360, -169, 169, -51, -66, -43, -386, 205, -63, -169, 142]
2972A42l26J99j23K31O9l10oL90k91K6o2O2j48J09n3J24l48L72l88K02K52n03
2994c80M74j31j23K48N1J7l17L66o3P7n5l06j53O55k54k76M94j93m16K05K25l37
3016a92J18K36m48K07K93m2m76N01k01l01J61L7Pj06K07j08jK18m2k23N20n74
3038b09P2M46m50k08O10k39k97M22j50j88Q5J09M5o6L6J06k55L52l45k17L21q6
3060a06k02L23k11J07K73P1m85L58l8p7l68R13r73K36L38k98J93Nj11l09K98k84
3082c47J13M24K28p14J16K62l64N58%n90K62K79m38K01J5J65k20qO6n72J032l54
3104A14j94L16r8n89O45K0k92J0m7j6Q3N01k34n91O42k40j90M67o2j44J53l09
3126e5Q2J60k59K38k89M20k87k62L84k81l6L77j27m22N65j95K7n7P2l9k40M02
$$ y = [142, -184, 15, -108, 123, 192, -118, -124, 266, -25, 1, -61, 1, -147, -38, -91, 33, -315, 57, -331, -129, 123, -380, 94, -37, -160, 88, 139, 156, -161, 205, 142, 219, 164, -142, -295, 360, 106, -170, 324, 131, -285, -80, 145, -192, -74, 162, -286, -79, 214, 172, -304, 197, -4, -305, -144, -107, -100, -206, 1, -107, -108, 110, 68, -155, 365, -209, -137, 309, -141, -349, 261, 22, -275, 147, -3, -191, -106, 3, 48, -18, 18, 124, -131, 221, -124, -341, -20, -106, -308, 15, -196, -89, 184, 255, -230, 128, 90, 13, -355, 558, -415, -179, 159, -139, 54, 59, -52, -361, -63, -347, -234, 190, 418, -296, -180, 82, -282, 276, 276, -314, -52, 227, -211, -10, 5, 170, -50, -58, 8, -564, 468, 114, -80, 236, 138, -451, 194, 214, -78, -68, -115, -131, -48, 453, 219, -372, 270, 30, -160, 307, 245, 101, 254, -55, 27, 187, -72, 166, -123, 297, 10, -252, 132, -149, -185, 192, 65, -357, 208, 13, 40, -17, 55, 16, -224, 178]
3148A78l21M2K43o15O99J05n11K00J95k98K13j50J0R1R0j56j30M45l07l22N22
3169B23ll58K20n8j86j40L75k73J64K1R8m08M55m1m21P48m90l09M50k78Q9j36
3191b58L71l35J94j06k1K05L07m56K12J82l58k46N18o59N48n2j11K23k84K54j95
3212f7lL04l18J21Q3l79K93n2j35O9K58l25M29k58k3K3l8K2j88K26k99M7L12J42
3236B44m64L68k64N0J61p1m75K89J86J62l05K25p8l82M39O6k32K17j37oL13l51
3258d5J69l07L43k75J31M27n18j17N92o94L52J63m83J59J51Q9j16k45K55l97M44
3279G8M7l42l0K59j06K70L6l86K84j4n3k51J37Rq0O5K81m81O07l38p1M53m46j27
3303a99J66K06l28K30p0L37k58j79J36l56O74m69L5K08k6l36K97K5j94m0M86l12
$$ y = [178, -143, -101, 142, -473, 226, 331, -180, 20, 215, -83, 130, -20, -10, 81, 171, 15, -115, 330, 23, -299, 223, 220, -138, 82, 24, -162, -302, 73, -200, -36, -15, 83, -325, 130, 89, -332, 416, -74, -383, 67, -211, -122, -258, 113, -222, -28, -134, -155, 50, 357, -99, 113, 295, -63, -309, 209, -450, 98, 46, -65, 158, -126, 128, -67, -70, 234, -84, 37, 120, -259, 34, -18, -153, -84, 174, -151, 278, 20, -3, 20, -18, 4, -184, 42, -257, -210, 102, 244, -220, 148, -116, -66, 95, 24, -451, -162, 24, 186, -119, 106, 28, -354, 85, 151, -81, 136, -1, -7, 306, -45, 124, -183, 160, -115, 16, 443, -75, -192, 400, -294, 58, 221, -262, -103, 48, 137, 21, -224, 31, -366, 78, 125, -217, -247, 12, -94, 176, 212, -174, 110, 96, 43, -208, -71, -62, -142, -77, 204, -277, 330, -8, -79, 374, -72, -199, -33, 173, -155, 75, 5, 342, 84, -95, 41, -315, 359, -110, -75, 133, 107, -229, 68, 93, -101, -141, 345, 33]
3325C3P4K24k35k1J47l96M7M18m69J01L12k93j19J72K63n62L01K38l42J58J25
3346A76m63K36L83p37N54j85O6J33L2m82L40R7J02k42K30j9l60J28J18q7K31j89
3368F2k45L82l7j76j10J31J00k92L02j56o1K08j83N7K77K1p2j47l3J25o9Q9o2
3391A11l60M44m46L9L66k47J34k14J05J13j77J05J23l88K01K51k6M1k04L09k53
3412B7k99Q9j9M24j81j48K04j52NL9J04kJ52m81K20K17l78L3J21l1K46m06K73
3435E7k6j49J87o5J30j03j08Q5p6Q6K29m66K48j74K31j07p6K21P1j73O6k51K02
3458C9J73k29N8j46J41J54l46J24K16j52m9r8j8J61K25l74J40J41k13o4K16O6
3480A65j30J44J51l11j09J41n1K47q6j55j24j11K97M4l9l8l87M48k18j96N26j93
$$ y = [33, 107, 331, 96, 75, 222, -174, -127, 291, -178, -77, 235, -58, -177, -5, 258, -304, -3, 235, -107, 51, 176, -287, -51, 332, -405, 149, -36, 30, 163, 195, -287, 53, 150, 252, 10, 240, 221, -139, -11, 107, 20, 251, 62, -183, 199, 162, -14, -124, 7, 107, -185, 117, -39, -100, 108, -75, -18, 259, 280, 208, 61, 28, 153, 84, 173, 111, -249, 195, -251, -212, 154, -93, 41, -173, -68, 45, -132, -27, 96, -292, -91, 160, 134, 175, -29, 280, 27, -272, -183, -202, 222, 41, -107, 97, -55, -50, -11, 93, 91, 243, -238, -18, 199, -179, -146, -25, -56, 190, -216, 57, 31, -118, 69, 4, 134, 31, -77, 8, -68, 18, 247, -219, 29, -145, 86, -21, -97, 124, 195, 22, 88, -163, 39, 212, -17, 41, -105, 36, 190, -156, -32, 184, 32, -17, -115, -133, 28, 253, -121, 19, 160, -53, -117, 99, 165, 35, 179, 330, 19, -90, 51, 0, 247, 161, 6, -118, -229, 68, 112, 73, 35, -352, 96, -122, -318, 208, 15]
3502A5p3qO1n8J68j03j27K6M2K76l38J44R2k49M93m54O3J18j43K20l23L88l56
3525a26R7N5L4k13M38l40j56K14J46k44K18j69k7J48l3J25k97K68j87K51K0k56
3547c4J83j65N4J3q0p7K98j30k23K15k16J94Q8j11K59o62O5L86k18K54p4R9l19
3570b01L79m9j9j04j82J11J9L08l58P5k13L49n6j12J39MJ6q0l66L23K09l13K50
3593A29j9j60K57j54k64J53lJ20j81K0K6K50K9j65q0J08J38m35L66j77j7K36j37
3616D0J2j27M5N1R7J0j55p9m2L2K0K71n30J43K40k0j0J86o0j72lL21n34L12L31
3641C79m43J06J98m96L32O5l03j25L58k0j3K05j80k69L89m07J74R9j85q2K20K19
3663B21l56L18l70J69k48K76m3r2K51j07r2L3J15p5j69J79M4k99M08n4j66K68
$$ y = [15, -58, -66, -5, -63, 105, 2, -125, -99, -57, 219, -119, 25, 117, -132, 361, -93, -30, 88, -55, 165, -158, 230, -126, -29, 26, 60, -153, 285, -55, -211, 3, 149, -95, 123, -46, -73, 75, 42, 167, -130, 138, -49, 202, 222, -34, 149, -16, 38, 51, -29, -106, 192, 62, -161, 54, -162, 32, 120, 9, 268, -394, -329, 57, -161, 93, 19, 118, -201, 178, 129, 110, 6, -176, -65, -46, 262, -96, -21, -234, 115, 59, -53, 86, 90, 106, 26, -340, -17, 192, -121, 129, 110, -50, 207, 53, -211, -58, -61, 59, -122, -102, -76, 174, 203, 38, -42, 66, 204, -231, 135, -42, -59, 177, 40, 52, -75, -30, 21, 118, 128, -27, -106, -148, -116, -96, 175, -355, -212, 28, 8, -2, 184, 124, -48, -51, 270, -264, 48, 379, -64, 42, 240, -256, 76, 141, -162, -287, 71, 51, 38, 243, 63, -206, 183, -224, -50, 49, -136, -218, 2, 221, -135, 183, -187, -18, -266, 10, -33, -125, 126, 19, -73, -40, 75, 0, -169, 10, 54, -245, 163, 109, -57, 211]
3685B11k50k13J16P6j12K12k6j34L09k1j47j62K80l70K17J06j61j26K31j0Q3k2
3707H7qJ17k58pK4J12L3j09J79L0j38P1Rj56J37j79K62J84n56R3K01j49k72L11
3731A8j45L42j55K3J69k42R9Mj03J27l34J03J37j26R5L9J9%j91lJ74j87L54n00
3755b83K69M08o06K53j78j3K75o0m7l09L71qp2K79k62q1J94m8k20L66j19j07M10
3778D12j16l01kp7K6rJ83nLJ13k02n5K69j31k30N2N6N1L1K2l8Q9j50PJJ80l67
3805a88J67L5k88K36J75j19k67o8L66n4l31N61m78L47O0j20J29j47J86l04L03
3826B01m37J56k7K01j3j06K17k89K80K59m80R3oj84j21K14J52Rq0l6N4R7j16k58
3850b20L47n9M2k11m9N0J47J0K2j36Q2j62M5N8j01J07J89l4l25L69k02k26K54
$$ y = [211, -39, -252, -136, -60, -172, 40, 14, -120, 189, 168, 21, -141, 139, -231, -14, 92, -69, -195, 36, 26, 109, 87, 79, 196, -62, -69, -45, 67, 100, -9, 170, 200, 62, 133, 142, -14, 123, -56, 206, 390, -166, -73, 128, -21, -293, 18, -127, 215, 60, 83, 252, 10, 109, 113, 10, 137, -197, -94, 43, -83, 12, 51, 70, 70, -121, -124, 50, -137, 217, -283, -14, 394, -212, 41, -137, -150, 125, 65, 18, -291, 80, 72, 0, 279, 17, -64, 130, 82, -138, 228, 109, 2, 412, 296, -5, -7, -84, -58, -67, 116, 111, 114, 227, 25, -30, 239, 108, -122, -70, -14, 37, 68, 90, 52, 141, -9, -2, -1, 179, -188, -21, 14, -274, -38, 137, 18, -249, -317, 49, -5, -336, 225, -253, 94, 154, 34, 163, 16, 202, -102, 201, -236, -80, -107, 94, 81, -25, 192, -97, 183, 442, -38, 55, 49, -135, -256, -42, 110, 119, 39, 3, 57, 154, 38, -220, 127, 68, 110, -101, -150, -100, 47, 57, 79, -57, 25, -137, -92, -34, -135, -28, 161, 127, -198, 171, -31, -257, -3]
3873cQ8j73K09j52k11L35N6l93L44j6k54L24j24n4R1m7k00L73l48K17l3p2J94
3896A51k52R0J46q9P6k38J88j82L13l67L41L6m10K11N9J43m81L45k9M8j68J5q4
3919a38M45n10J84j29K1L7L7L5L6l3J60m05K71L07j79j44Jr0j42K83j58K51l4
3942A06k48J50j67N8j78K82J53k32O4j2O7k98L70K05l77KJ14l59K35Q7k55K32
3964aj10M3O1k01K46Pp8m8J70m3j33M3J43j24j90N64l05p2N1L7k26J18j0J4P5
3989C1K0K02m67K1L67m48L72J31m66M00j56P7k9j46j42M31l42J66j6L13m14L8
4011e7L88k87j7mN8M8l62N5K63j48J04j78p0J09k14K50p6K17j36k03K62L43l44
4034AJj58K28J5k28J77k7q9J82l28J17j03O7L61l05k5K3J56n01O13q7P2J0j53
$$ y = [-3, 85, -88, 121, -31, -242, 93, 149, -244, 100, 84, -170, 154, 30, -24, 67, 20, -180, 193, -155, 62, 29, -43, 151, -101, -11, 135, 46, 122, -116, 72, -110, 203, -164, 177, 213, -197, 14, 73, 216, -265, 80, 51, 99, -69, -54, -138, 307, -203, -19, -148, -127, -90, -53, -18, 18, -15, 145, -260, 11, 318, 139, -5, -4, -94, -236, 47, -111, 140, 106, -142, 8, -159, -101, -279, 3, 156, -76, -12, -24, 43, -255, 115, 320, -57, -55, 59, -300, -65, 22, -233, -1, -111, -68, -7, -208, 38, 45, -33, -81, 89, 46, -87, -44, 99, -25, -215, 349, 44, -28, 23, 60, -166, -48, -58, -44, 31, 51, 253, -214, -193, 174, -274, 98, 229, -237, 163, 7, 84, 55, -91, -233, 198, -144, 22, 6, 319, -95, -57, 331, 44, 27, 23, 81, 129, -233, -178, 85, -63, 41, -137, -207, -98, -312, -62, -138, 79, -57, -260, 2, 345, 1, 2, -156, 72, 87, -141, 36, 9, -80, 102, -226, -109, -212, -145, 216, -89, -114, -91, 65, -436, 177, 90, 162, 172, 19]
4058A9j0O4l16J83R6j2m4J45J30m12J50J87l09K76k09k04K87n2j55M67k54j95
4080a68K28l8J9k56R9L53l74l9J6P1L4O8j73P8J00JL32m33J57j86n5J75n0L76
4104C35m93J70r5J21p9m9P9l44J26K16j63Q3J34l3O2j33J98m28L84l30L38p7L6
4127E8j09Q4n9j3J86k39K2R6k53J91k30J89J15Mj39J34J20j82j87J54K00j82J89
4150A49j34J69m62K25po1K09k21O7J81p5m6k4j75N52l42J79k47K21J9l54L05j01
4173B7K15k81L5j66p4J82J04J02p7J03l02j13N9J39Q0r5R8q8%J5K68m05M37k13
4197E0k05K84k22J92o6J1Rm59Q2L88K3J04l44M40j35k53R0J01r3K50l63K03k12
4220a25r0L31n9o9N7P9q5J2o1J14j19N7p8k0l18M64k04J00J66m9k35O0J4J80j97
$$ y = [19, 9, 73, -243, -60, 36, 24, -20, 125, 255, -157, -7, 180, -129, 147, -62, -266, 21, -31, -186, 281, 27, -168, 60, 22, 41, -215, -116, 237, -137, -176, -160, -89, -55, 13, -160, -82, 18, 19, 351, -82, 75, -111, -166, 9, -41, 335, -158, 12, -83, 38, -41, -90, -11, -355, -229, -13, -176, -93, 41, 8, 70, -63, 135, -293, 91, -239, 99, 22, 58, -51, 33, -26, -39, 147, -92, -70, 26, -227, -36, -266, -77, 38, 42, -97, 37, 157, -25, -212, -58, 142, -40, 149, 15, 184, -278, -53, -60, -121, 88, -133, -66, 115, 40, -6, -30, -205, 347, 5, 184, -63, 158, 177, -177, 128, 27, 242, -39, -4, -170, -244, -62, 42, 144, 67, 170, -132, -245, -186, -47, 33, -62, 36, -52, -52, -37, 231, -174, 263, 50, -155, 129, -93, 99, 33, 44, 53, -406, -324, 64, 87, 191, -153, 287, 152, -101, -11, 90, -3, 247, -116, 87, -125, -215, 116, 57, -12, 45, 124, 39, 51, -10, 104, -15, 42, -36, -56, -374, 90, -114, -14, 152, 103, -132, -72, -58, 122, -75]
4245g5j68L78o05M43R2j4j4k39J95k57M50q9q0m0Q8Q0j19K3l9m9p7K63j43o6k72
4270c34L21R7O0k56N0R4k9j8L6k41M01j19K2j94j8M8j03J39J63k64M42m45L91
4293B43N3l13J00j64J32n8J89l55M13m82L36m1k55K30q8m2R2j24L2Q7K32j79j08
4316g0J82l45L44l49J70q1O2r6K48K4k78J31o5o2N25j88k09j3k10k24M44k3j6
4339i9k79L81J65k98M15l01k14J07K61k54P1j80K34j18L25l64j9L20o6k65J6K07
4361D5jo2P7J32J17m27L90j21l53K90l37J57j77K49J28j71K08j37k38J36J92r7
4383@k43L15k05J45J68l29M7L99j80o1m2k8%j68O4j06K04q7J02l16M63m0l36L49
4407A15k94J67K26m42J33M85m56p1K78n9O5j72J82k29K11K7p4j31J31k1j29L8
$$ y = [-75, -243, 135, -470, -27, 65, 51, 37, -202, -7, -264, 186, 97, 17, -23, 65, 145, 26, 49, 10, -39, -116, 147, 4, -62, -334, -13, 84, 144, -112, -62, 32, 3, -15, 21, -220, 181, 62, 84, -110, -128, -80, -183, -44, 119, -145, 297, -148, 243, 296, -17, 83, -81, 51, -7, 182, -173, 240, -242, 94, 53, -202, 28, -60, -102, -10, -134, -102, -15, 217, 38, -70, 112, -233, 111, -238, -68, -149, -87, -183, 65, 89, -189, -58, -123, -185, 340, 152, -57, -70, -280, -504, -60, -83, -99, -378, 3, 168, -130, 285, -16, -230, -123, 138, -116, -45, -225, 9, -109, 216, -148, -167, 153, 87, -178, -162, 45, 44, -18, 59, 191, 308, -119, 271, 150, -203, 87, -250, -93, -270, -21, 107, -64, 144, 7, -231, -95, 97, 0, -243, 72, -133, 12, 180, -149, -102, 297, 117, 56, 14, -14, -14, -182, -118, -224, -20, -107, -5, -321, 142, 102, -234, 115, -179, -12, 214, -228, -95, 390, -66, -137, 141, 82, 147, -25, 157, -72, 139, 166, 92, -39, 92, 71, -58, -20]
4429b0Q0k85K47K52l88KR2k26J75K38j70L07r6l98l4K68L0j56J42K5j90L92l42
4452e5l9J8J04O7M1j71k20K41kp1L26l90K19k14j1K85j17K13J2j91q5J5O0M9j0
4477G4K8r8qK39m15Q7m8K90k4o5p6l3J1j93J21k3J97o4k82K19J02P7k17O1L07
4502B67l59m9M11k16j66j08J83J6j19J16P8J59pk11K19r4r0k52L63k50Q5K30m27
4525b21J94N1J34j56k85L17p0oJ97k91J91K9j51L5J50j85j42K50r7r1K05L4k8
4548F4j3P1l39J53p7J63o3L7q0J27j23O5J16k33J10j9J23j21q9K0J09l83L09J28
4572E5j55L55j72j91j2j0J42K7P2n1j21J33j44k3J05k07J80k87P09o14Q5J13j22
4595a33j47M31j75J01k75k2J48j17K33N6k88L95l69pk2P7n4L02k5J3j72J83Q0
$$ y = [-20, 60, -225, 22, 274, -114, -112, -20, -246, -71, 167, -3, 304, 208, -190, -224, 44, 74, -82, 60, 85, -105, 287, -55, -94, -76, 28, 95, 136, -35, -255, -14, -16, -87, 239, -151, 68, -146, -157, 128, 11, 224, 236, 45, -40, -25, 35, 84, 74, 102, 4, -4, 235, -180, -93, -141, 149, 125, 60, -16, -49, -38, -231, -110, -133, 64, 0, -282, -63, 39, 116, -101, -40, 267, -92, -141, 270, 54, -112, -220, -37, -21, -140, -24, 54, 213, 206, -5, 214, 120, 30, -222, 141, -109, -24, 206, -221, -27, 24, 158, 2, -283, 34, -36, -42, 155, -136, 55, 84, -67, -32, 118, -67, -209, 41, -56, -147, 58, 92, 64, 51, 122, -217, -64, -141, 22, -41, -4, -84, 43, -80, -15, 101, -132, -22, -41, 82, -39, -128, -108, 1, -382, -73, 55, -100, 255, 83, -108, -120, -130, 12, 39, 111, 60, -61, 72, -72, -95, 10, -197, -17, -304, 405, -209, -124, -11, -133, -280, 151, -24, 77, -198, -220, -72, -189, 44, 100, -188, 207, -162, -169, -191, -114, -168, 134, 109, 122, -50, 133, 213]
4618B13l93J42l8O8j28p0L09L08q36L59R8k53K93k76J99j05m6Q3K71j40j25M2
4640b5J9M0m4J4R7L5j82M0Lj34J53J7j79K09n1o9O9k22j50M06j52K41or6P3J22
4666B28j30p5r4M5pj08K76k83J50J01o7p2J12l43J38j3L7k2J24j75J28j56J26
4689h0J42l19L46k56k2K05r2r9K48K1J1j26k1r0J82k8k52J97M6O7k68N3K90k04
4713d9R3j85Q2q5K33j97K65r6M9L4m9k61L78r0K0l69L86pl18K23q3j82J39L37
4737B68k42K43l0j67N5m0J45l23P1k52P1M08l55K88j5j65L2K23m40j74L96j40
4759a43J05r2P6J65l58K64o9O4j31J33k4m0J02K5j42K70o0r7k27J16J45j16l9
4782g3M0Q5q0k79L90j47j3O5j2q6n3J70J13k39K19j87K59m3j19K14l38J53j38
$$ y = [213, -180, -38, -76, -8, -136, -206, 103, 411, -425, -66, 32, -221, 72, -204, -5, -110, -156, -73, 198, 58, -67, -25, -6, 34, -10, 4, 101, 136, -46, -6, -3, -137, 16, 33, -146, 63, 12, -57, 12, -210, -360, 46, -106, 135, 129, 33, 106, 228, 98, 23, -71, -26, -33, -141, 135, -148, 2, 103, 36, -36, 76, -267, -129, -142, -105, -127, -3, -178, -50, -206, -80, 62, -257, 89, -167, -189, 16, -76, -175, 73, 94, 105, -21, -42, -132, 50, 22, -230, -33, 13, 80, -188, -135, 155, -49, 44, -141, -59, -144, 89, -108, 157, 61, 110, 144, 95, -166, 212, 122, 142, -227, 159, 152, -166, 57, -26, -208, -69, 268, 26, 269, 239, 72, 127, 87, 232, -91, -20, -272, -201, 207, -148, 140, 125, -40, -8, 215, -225, -399, -3, -143, -38, -130, -54, 111, -247, 17, -52, 12, -119, 14, -10, -50, 52, 77, -65, 205, 145, 48, -179, -63, 82, -34, -73, -33, 52, -28, -307, 83, -64, -77, -12, -24, -110, -163, 7, 120, -119, 100, -87, 172, 129, 10, 224, -114, 39, -99]
4805i9J40j36M2J88j7n5m3k44N13q7j24l44K92j03j61M43k94J31j2k87L54j69
4827g2J15j87L01L3j85k03L5K79j69Q9lj24N5nj7l80K97K29m3r7M7k15L06k28
4851a42j07L1k15K91J49j36J87N7j15j44J78j5j32J01K6K39k25J77l05N5J32j50
4873f3J34M7j32K40k42J44l13M7n8J20K14l41J52J23m6j51K69k35q9K68K4j92
4895h0J89j19lJ96p2k00r4P3K02l8j06K31j87K7L94l90k92L07O0j22r8n8J75j58
4919a63j5L06N8l22M12k94L13k97o8J73k42J69j92L06l96O9L07n2P0M3j67j02
4941h4R6q6O9M5N3k68R4J28p3Mj09R2K51k58j43K36o2J27k33O3M2L5m6R5L3k46
4967a45j44J09L54J79k47k30M09k83K7j36j48L42P8l6k75R8j14J13J5j2L9J91
$$ y = [-99, 41, -95, -53, 135, 118, 63, 20, -224, 289, 202, 78, -266, 26, -77, -238, 205, -89, 42, 30, -257, 97, -72, 43, -144, 157, 190, 5, -198, -163, 116, -53, 36, 33, -91, -36, -41, -58, -438, -141, 88, 45, -52, -5, -220, 86, -142, -249, -218, -433, -142, 7, -129, 58, 115, 0, -144, 34, 19, -113, -12, 14, 253, 28, 205, -100, -45, 87, -63, 71, 118, -14, 226, -16, 128, -185, -138, -196, -76, 138, -203, -51, 72, 26, -125, 144, -91, -180, 88, 112, -80, 109, -10, -13, 183, 111, -89, -183, -110, 92, 54, -52, 179, -8, 19, 413, 23, -269, 38, 98, -24, -122, -180, -5, -163, -178, 128, 186, -136, 276, -18, 295, -2, -70, 103, -139, 30, -162, 144, -252, -183, 124, 72, 142, 185, 18, -84, 12, -74, -5, 40, 93, -175, -81, 47, -26, -22, -131, -39, 212, -46, -189, 47, -15, 112, -121, -58, -16, 19, -27, 68, 101, -145, -289, -180, 174, 353, 106, -124, 285, 2, 29, -107, -255, 87, 165, 129, -146, -48, -162, -49, -34, -46, -7, 184]
4989A84l48L63j47j78K05k01L62l19K36k95J86k29K59k51K25pJ62n42M44L3j94
5010e2j15M7K3o6j7L02k9j88J11M9J01m81N73k30j23J03o6lL4j56q4K43J61Q4
5034B21j36k15L13l41M3J87l06L01k54K82l06K84P8k27J2k35J02L65l00K08J51
5055B27j64l21J24n4L10%l21k3J39q8M94m26L2K67j93J09k39M2Q2J9k3J53n2k66
5079a72n5L74m10J34J97j51N3J22J07k24K6k86K91kO0K8j56o4R5l9L08k80o8P2
5103d0J38k40L05k77PK42j65O9o9J64k79j58J31J37n7%L6K42j89J54l65J16M65
5126C67n22O3R1J78k28J70q0%OQ1j61k80L51j18pK52j96Q7k69N59r6k43q2K90
5150B13l57J74R7k05J39n2O7p3j54K19O1p4l2P7J5k74j02M08k83L06k20J4N9Q
$$ y = [184, -164, 199, 52, -126, 79, -122, 240, -79, 157, -138, 48, -181, 78, -173, 52, 45, 207, -335, 109, 142, -52, -167, -120, -97, -163, -180, 122, 93, -95, 16, 65, 166, -315, 258, 28, -95, 8, -58, -61, -27, -183, -267, -24, 137, 221, 85, -130, 183, -158, -115, 72, -234, 67, -187, 95, -211, 73, 151, -76, -64, -299, -197, 168, -132, 76, 227, 63, -258, -134, -188, 122, 122, -199, -222, -83, -171, 323, -103, -71, 196, 3, 112, -127, -85, -3, 16, -7, 146, 94, -172, -227, 147, -263, -129, 68, -83, -30, 92, 199, -25, 1, -285, 6, 4, 64, 92, -64, -128, -33, -72, 236, -44, -112, -40, 98, -142, 163, -114, -107, 135, -30, 39, -30, 134, -145, -303, -172, -35, -92, -92, -56, 186, -3, 151, -214, -98, 367, -155, -92, -1, 177, -51, 119, 39, 39, 45, 126, -35, -315, 36, -82, -89, 163, -33, 54, -215, 344, 248, 5, -77, 213, -144, 30, 127, -78, 61, 9, 76, 3, -151, 68, 129, 55, 23, 100, 115, -159, -261, 147, -136, 170, -50, -36, 23, 31]
5174C1O3J02k68m5M2J4n6J31L89j77l18M37m16j32K68m7m8p4j63N0L07J00k41
5197e1L87k51o4J50n54N76pK2j15j23J80l68K57j29J44k33J28J00l5r1J76j22
5219b3N9%j74K30j82P8mJ76j49J8M8p0j33K71l6n0j37N5l8K16N4p8l15LK97j54
5245c8n5L20j55j20J38K3J36q3N0k44N2J1K83j83j49J17m8J72k45K17k59q3K44
5268A01j41J04O8j90jk5N1j40J98j24J33l2m5M0J34l26R8K01k26J83J27J7l50
5291a45k6p5J41j25J43Q6Qj12J21k43N46k10j49J76k37QJ18K12k65o5k03K61j03
5314a38K13k39Q3J99j89J43j96R0R6J01l56m9J03L8q5L75m02M14j99R9k31J14
5336a6m4L7m9J17J9k9n8J03j67n3J87k7P2m8j27K70Q7n22K22K91k62j10J08K4
$$ y = [31, 94, 196, -72, -117, -75, -61, -117, 14, 403, 226, -92, 345, -71, -203, 65, 18, -30, -104, -267, -217, 90, 190, -51, 336, 85, 21, 171, -383, 193, 186, 208, 93, -30, 150, -218, 39, -90, 54, -179, -51, 49, 14, -77, 99, -23, 36, 36, -138, 92, -90, -12, -16, 160, 11, 29, 77, 7, -126, 145, 109, 59, -78, -23, -61, 155, 209, 131, -184, -181, 116, -38, -93, 227, 72, -48, 90, 113, 249, 166, 216, -28, 24, 35, 318, 135, -14, 103, 55, 227, -18, 199, -60, -143, 101, -40, 64, 132, -58, -59, -84, -33, -173, 25, -99, 34, 2, -43, -3, 131, -195, -97, 104, -122, 61, 188, 205, -145, -171, -246, -105, -230, -87, -1, 7, -105, 16, -227, 319, 109, -40, 136, -101, -93, 25, 237, -28, -93, -296, -35, -138, 75, -164, -81, 118, -71, 72, -124, -34, 62, 163, -193, -242, -139, -101, -186, 189, -213, 201, 2, 101, -130, -16, -60, -23, -72, 45, 64, 35, -23, 80, -87, -140, 47, 20, 92, 44, -83, 187, 274, -248, -26, 265, 3, -107, 1, 25]
5360B5j11k8K14J45P0q3k44K32ql34N70m68Q2O2r3J09l01L21j13k71L53N4N3l
5384B33j63k53J04J75k59J49J3J24m6j21J05jQ2J81n8j81n6R8Mj53j30O5j57K62
5408A7j37K59j52K67j55n7m5Q3q3J16j92j3O5J87r6j2j09J40J91n01M17k71L05
5431B24l23K19O1l74K04j9J00J48k90M7j0lK11k48J65K24k31k26K98k38J32p3
5453bJ98m19K34j1n8K9K05l45J92J0K23j84L6j62p1J47K8Q8K2j57K07j16L00j91
5477B03l54P0j81M13q0q3M5M2oj15J18k86J16j28Q2K73q1K8R8j80%J34p8k94M1
5502b03L57k16n6k21L49j26O2K17j25j18J35j97J01J73k92K05J4j31r3K37no7
5524@K05k86k5J26K62m45K38k01j78N19l64K59M1m33J69J9M0K09k42j6J54j6L1
$$ y = [25, -86, -114, 100, 245, 315, 232, -12, 220, 212, -122, 448, -20, 62, 124, 31, 140, -161, 160, 47, -224, 129, 183, 236, 233, 70, -183, -79, 96, -163, -14, -1, 123, 77, -44, 61, 60, 142, 323, 265, 84, 28, 126, 130, -23, -153, -88, -245, 17, -120, 139, -13, 254, 99, 42, -3, 80, -3, 113, -79, -92, -27, 160, 64, 52, -57, 83, 274, -227, 190, -81, 224, -99, 120, 181, -193, 11, -8, 92, 240, -50, -3, -13, -16, 195, -53, 112, 336, 105, -121, 177, -61, 71, -2, 196, -223, 11, 0, -58, -29, 176, -169, 23, 33, 256, 72, 108, -54, -125, 22, 50, 138, 160, 3, 210, 94, 394, 203, -151, -81, -262, 151, 71, -12, 33, 75, 69, -46, 72, -214, -98, -226, -144, 129, 48, 76, 174, -6, -6, 128, 50, -244, -203, 154, -62, -118, -339, 10, -116, -54, 163, 38, -80, 55, -142, -41, 132, -160, 45, 59, -72, -165, 72, 67, 0, 205, -81, -106, 20, 282, -163, 75, -126, -304, 215, -149, 110, 151, -282, -113, -94, -54, 155, -87, -103, 51, 35, 66]
5547F6k44K15j36P7j39K7p3J29qN9K28k13j87K39m6K65L6k57%j60J55N3m25L00
5571c9p1L7L4J54j28q7K01j7k60K34k25j17K69j7J20j07j67L99j7j03k28p3K36
5594B8r4J5k03L30p0J5L9L4Q3m24M12l0k96K22q1j66j71L00J11j74O3j05K05n8
5618a5q2p4J86Rk1N9j04J16p6k61L24k17k4J67lJ1j46J18O6l25J91K28p1J34j94
5643dj76Q6Q5j72M18l07J1Q8j49K35j93P4J0J35j02J30j78j14J17L01m6o8k55
5666g4O9R5J01M8l53J81r4L3k3J15o0J9K1l5j77J81J1nj92j64N18o1j74Q8j29
5691f1J13p5K59n2k53K34Rj90j13N11k89K15m82J86pk14R7OL70m88L79J39l52
$$ y = [66, -178, 37, -99, -22, -161, -134, -207, -78, -86, -27, 201, -12, -199, 40, -6, 259, 295, 38, 38, -122, 33, 86, -339, -39, -110, -73, -39, 115, -13, -100, 101, 84, -176, 58, -167, -284, -15, -32, 88, -19, -186, 213, 196, 93, -135, -208, 28, -66, -51, -254, 76, 6, 21, 60, 94, 177, -247, 165, 135, -161, 61, -20, -186, -357, -57, 54, -120, -57, -162, 43, -15, -97, -171, 15, 24, 3, 62, -42, 74, -2, -263, 61, -156, -180, -13, -16, -5, -151, -33, 33, -292, -101, 127, 56, 190, -4, -180, -94, -9, -181, 237, -70, -59, 29, -120, 115, -78, -4, 6, 141, 39, 169, -9, -123, -6, 295, 249, 181, -74, -5, 90, 191, 239, -114, 67, -27, 6, -17, 98, 38, 57, 78, 43, -134, 47, 58, 53, -139, -303, 215, 154, -20, 68, -61, 52, -23, 236, 184, -69, 165, 174, -16, -129, 382, 93, 308, -174, 12, 5, -209, -112, -106, 264, -224, 155, 294, -58]
$$ [...]
8191A32
##END NTUPLES=NMR FID
##END=
