##TITLE=1H_Pr NCO_Am3
 CDCl3
 8 sc, 
 5.05.2022
##JCAMPDX= 6.0         $$ Bruker NMR JCAMP-DX V2.0
##DATA TYPE= NMR FID
##DATA CLASS= NTUPLES
##ORIGIN= UXNMR, Bruker Analytische Messtechnik GmbH
##OWNER= root
$$ XWIN-NMR		Version 3.5
$$ Thu May  5 15:41:39 2022 Russian Standard Time (UT+4h)  she@DPX200
##.OBSERVE FREQUENCY= 200.1313499996
##.OBSERVE NUCLEUS= ^1H
##.DELAY= (6, 6)
##.ACQUISITION MODE= SIMULTANEOUS
##.ACQUISITION SCHEME= undefined
##.AVERAGES= 8
##.DIGITISER RES= 18
##SPECTROMETER/DATA SYSTEM= spect
##.PULSE SEQUENCE= zg30
##.SOLVENT NAME= CDCl3
##.SHIFT REFERENCE= (INTERNAL, CDCl3, 0, 15.7039)
##AUDIT TRAIL= $$ (NUMBER, WHEN, WHO, WHERE, WHAT)
$$ ##TITLE= Audit trail, XWIN-NMR		Version 3.5
$$ ##JCAMPDX= 5.01
$$ ##ORIGIN= Bruker BioSpin GmbH
$$ ##OWNER= she
$$ F:/spectra/data/she/nmr/H-F/1/audita.txt
$$ ##AUDIT TRAIL=  $$ (NUMBER, WHEN, WHO, WHERE, WHAT)
(   1,<2022-05-05 15:40:28.84 +0400>,<she>,<DPX200>,
      <created by zg, POWCHK disabled, PULCHK disabled
       configuration hash MD5:
       00 E9 B6 7A A2 85 ED C7 34 08 36 98 17 FE 4E 26
       data hash MD5: 16K
       A9 0B 19 E6 DF 69 00 D8 A7 6E 09 17 25 13 3F 77>)
$$ ##END=
$$ 
$$ hash MD5
$$ E5 4C 01 86 FD 79 D1 C3 3D A8 35 4C C4 E9 EE 19
##$RELAX= 
##$RELAX= 
##$RELAX= 
##$RELAX= 
##$RELAX= 
##$RELAX= 
$$ Bruker specific parameters
$$ --------------------------
##$DU= <F:/spectra>
##$EXPNO= 1
##$NAME= <H-F>
##$PROCNO= 1
##$TYPE= <nmr>
##$USER= <she>
##$AMP= (0..31)
100 100 100 100 100 100 100 100 100 100 100 100 100 100 100 100 100 100 
100 100 100 100 100 100 100 100 100 100 100 100 100 100 
##$AQSEQ= 0
##$AQ_mod= 1
##$AUNM= <au_zg>
##$AUTOPOS= <>
##$BF1= 200.13
##$BF2= 200.13
##$BF3= 200.13
##$BF4= 200.13
##$BF5= 200.13
##$BF6= 200.13
##$BF7= 200.13
##$BF8= 200.13
##$BYTORDA= 1
##$CFDGTYP= 0
##$CFRGTYP= 5
##$CHEMSTR= <none>
##$CNST= (0..31)
1 1 145 1 1 1 1 1 1 1 1 1 1 1 1 1 1 1 1 1 1 1 1 1 1 1 1 1 1 1 1 1 
##$CPDPRG= <>
##$CPDPRG1= <>
##$CPDPRG2= <>
##$CPDPRG3= <>
##$CPDPRG4= <mlev>
##$CPDPRG5= <mlev>
##$CPDPRG6= <mlev>
##$CPDPRG7= <mlev>
##$CPDPRG8= <mlev>
##$CPDPRGB= <>
##$CPDPRGT= <>
##$D= (0..31)
0 1.2 0 0 0 0 0 0 0 0.06 0 0.03 0 0 0 0 0.0002 0 0 0 0 0 0 0 0 0 0 0 0 
0 0 0 
##$DATE= 1651750828
##$DBL= (0..7)
120 120 120 120 120 120 120 120 
##$DBP= (0..7)
150 150 150 150 150 150 150 150 
##$DBP07= 0
##$DBPNAM0= <>
##$DBPNAM1= <>
##$DBPNAM2= <>
##$DBPNAM3= <>
##$DBPNAM4= <>
##$DBPNAM5= <>
##$DBPNAM6= <>
##$DBPNAM7= <>
##$DBPOAL= (0..7)
0.5 0.5 0.5 0.5 0.5 0.5 0.5 0.5 
##$DBPOFFS= (0..7)
0 0 0 0 0 0 0 0 
##$DE= 6
##$DECBNUC= <off>
##$DECIM= 32
##$DECNUC= <off>
##$DECSTAT= 4
##$DIGMOD= 1
##$DIGTYP= 9
##$DL= (0..7)
0 120 120 120 120 120 120 120 
##$DP= (0..7)
150 150 150 150 150 150 150 150 
##$DP07= 0
##$DPNAME0= <>
##$DPNAME1= <>
##$DPNAME2= <>
##$DPNAME3= <>
##$DPNAME4= <>
##$DPNAME5= <>
##$DPNAME6= <>
##$DPNAME7= <>
##$DPOAL= (0..7)
0.5 0.5 0.5 0.5 0.5 0.5 0.5 0.5 
##$DPOFFS= (0..7)
0 0 0 0 0 0 0 0 
##$DQDMODE= 0
##$DR= 18
##$DS= 0
##$DSLIST= <SSSSSSSSSSSSSSS>
$$ [...]
##$SUBNAM2= <"">
##$SUBNAM3= <"">
##$SUBNAM4= <"">
##$SUBNAM5= <"">
##$SUBNAM6= <"">
##$SUBNAM7= <"">
##$SUBNAM8= <"">
##$SUBNAM9= <"">
##$SW= 18.0517283424761
##$SWIBOX= (0..15)
0 0 2 0 0 0 0 0 0 0 0 0 0 0 0 0 
##$SW_h= 3612.71676300578
##$TD= 16384
##$TD0= 1
##$TE= 0
##$TE2= 300
##$TE3= 300
##$TEG= 300
##$TL= (0..7)
0 120 120 120 120 120 120 120 
##$TP= (0..7)
150 150 150 150 150 150 150 150 
##$TP07= 0
##$TPNAME0= <>
##$TPNAME1= <>
##$TPNAME2= <>
##$TPNAME3= <>
##$TPNAME4= <>
##$TPNAME5= <>
##$TPNAME6= <>
##$TPNAME7= <>
##$TPOAL= (0..7)
0.5 0.5 0.5 0.5 0.5 0.5 0.5 0.5 
##$TPOFFS= (0..7)
0 0 0 0 0 0 0 0 
##$TUNHIN= 0
##$TUNHOUT= 0
##$TUNXOUT= 0
##$USERA1= <user>
##$USERA2= <user>
##$USERA3= <user>
##$USERA4= <user>
##$USERA5= <user>
##$V9= 5
##$VALIST= <valist>
##$VCLIST= <CCCCCCCCCCCCCCC>
##$VD= 0
##$VDLIST= <DDDDDDDDDDDDDDD>
##$VPLIST= <PPPPPPPPPPPPPPP>
##$VTLIST= <TTTTTTTTTTTTTTT>
##$WBST= 1024
##$WBSW= 4
##$XGAIN= (0..3)
0 0 0 0 
##$XL= 0
##$YL= 0
##$YMAX_a= 446299
##$YMIN_a= -424744
##$ZGOPTNS= <>
##$ZL1= 120
##$ZL2= 120
##$ZL3= 120
##$ZL4= 120
##$ABSF1= 10
##$ABSF2= 0
##$ABSG= 5
##$ABSL= 3
##$ALPHA= 0
##$AQORDER= 0
##$ASSFAC= 0
##$ASSFACI= 0
##$ASSFACX= 0
##$ASSWID= 0
##$AUNMP= <proc_1d>
##$AZFE= 0.1
##$AZFW= 0.1
##$BCFW= 1
##$BC_mod= 2
##$BYTORDP= 1
##$COROFFS= 0
##$CY= 11.3945322036743
##$DATMOD= 1
##$DC= 2
##$DFILT= <>
##$DTYPP= 0
##$F1P= 2.36226072786647
##$F2P= -0.459571619588291
##$FCOR= 0.5
##$FTSIZE= 0
##$FT_mod= 4
##$GAMMA= 1
##$GB= 0.15
##$INTBC= 1
##$INTSCL= 1
##$ISEN= 128
##$LB= 0.24
##$LEV0= 0
##$LPBIN= 0
##$MAXI= 10000
##$MC2= 0
##$MEAN= 0
##$ME_mod= 0
##$MI= 1.114404
##$NCOEF= 0
##$NC_proc= 0
##$NLEV= 6
##$NOISF1= 3.799351
##$NOISF2= 2.8
##$NSP= 1
##$NTH_PI= 0
##$NZP= 0
##$OFFSET= 15.70392
##$PC= 1
##$PHC0= -18189.91
##$PHC1= 9.800749
##$PH_mod= 1
##$PKNL= yes
##$PPARMOD= 0
##$PSCAL= 0
##$PSIGN= 0
##$REVERSE= no
##$SF= 200.130013532006
##$SI= 16384
##$SIGF1= 3
##$SIGF2= 2
##$SINO= 400
##$SIOLD= 16384
##$SREGLST= <1H.CDCl3>
##$SSB= 0
##$STSI= 0
##$STSR= 0
##$SW_p= 3612.71676300578
##$SYMM= 0
##$S_DEV= 0
##$TDeff= 0
##$TDoff= 0
##$TI= <>
##$TILT= no
##$TM1= 0
##$TM2= 0
##$TOPLEV= 0
##$USERP1= <user>
##$USERP2= <user>
##$USERP3= <user>
##$USERP4= <user>
##$USERP5= <user>
##$WDW= 1
##$XDIM= 8192
##$YMAX_p= 0
##$YMIN_p= 0
$$ End of Bruker specific parameters
$$ ---------------------------------
##NTUPLES= NMR FID
##VAR_NAME=  TIME,          FID/REAL,        FID/IMAG
##SYMBOL=    X,             R,               I
##VAR_TYPE=  INDEPENDENT,   DEPENDENT,       DEPENDENT
##VAR_FORM=  AFFN,          ASDF,            ASDF
##VAR_DIM=   8192,          8192,            8192
##UNITS=     SECONDS,       ARBITRARY UNITS, ARBITRARY UNITS
##FACTOR=    0.0002768,     1,               1
##FIRST=     0,             0,               0
##LAST=      2.2672688,     0,               0
##MIN=       0,             -424744,         0
##MAX=       2.2672688,     446299,          0
$$ Real data points
##PAGE= N=1
##DATA TABLE= (X++(R..R)), XYDATA
0@%%%%%%%%%qJ6j6K4l2M0m8N6p2Q8j04J26j50J76k09K49k94L40l92M52n21N97
31C18o83P78q82R96j120J261j416J584j768J969k188K429k694K982l296L638m014
48b106M427m876N371n916O519p191P940q783R740j0834J2097j3580J5350j7500
62i342K0179k3629K8259l4837M4999o2905J03668l64488k3813O20543k95727l80937
74c78030R6555L55677l3129j09637J7423Q9212L1526P0277n8960j06628Q7321
85F1607K24382p6430k39185M7568K56397m2774k49176l2266J81325M7421j21636
96E7233j40224n8743O4567J47418j1498k15972j04355J70035J34603r9808j05124
107a61868P5439Q5606l9499n7040K8868P6052N0034l7592q8352J6606J40198M0228
$$ plain form
0 0 0 0 0 0 0 0 0 0 0 -8 8 -8 16 -16 24 -24 32 -40 48 -56 70 -80 96 -113 136 -158 182 -210 242 -279 318
31 318 -365 413 -469 527 -593 668 -748 836 -932 1037 -1151 1278 -1416 1566 -1730 1908 -2106
48 -2106 2321 -2555 2816 -3100 3419 -3772 4168 -4615 5125 -5709 6388 -7192 8158 -9342
62 -9342 10837 -12792 15467 -19370 25629 -37276 66392 -298096 -321909 298634 2907 -378030
74 -378030 -281475 74202 41073 -68564 -51141 38071 69597 139874 80914 -25714 61607
85 61607 285989 209559 -29626 17942 274339 231565 -17611 -49877 131448 178869 57233
96 57233 -82991 -141734 -77167 70251 58753 -157219 -261574 -91539 43064 -56744 -161868
107 -161868 -86429 -823 -40322 -97362 -68494 7558 57592 20000 -68352 -51746 88452 128680
119A28680j33455n0776J46100P4037j40126r5875J05187Q7080p3951o6979L1238
130A1160o229n8911L3186Q5742l3363j03359N059P8898J544m3161K1869L3962
142B6397l8420m2443K8679M2353J45j0983j1024k5285N877N2698R493n7037r072
155b8622O4080P620p2747j4036O7293J6126m8967m115K6457k8006k7343N1899
167I639M4548m4929m5385K5455K2915j4997P758K5270j9364l7484L678J8472K840
180a584J3623P563m0864l0592M6618M4819l7572l6245L9788K8748m0186k0442
192b6326L5315J0450k1625J3701J8233l9068k7663N2221M2416m1221l6443L0463
204A0453J7135l5518j0037L7114R776l5119k6334j584J3306K8489R875m1426l3424
$$ plain form
119 128680 -4775 -55551 90549 164586 24460 -71415 33772 120852 46901 -20078 11160
130 11160 4931 -53980 -20794 64948 31585 -71774 -66715 12183 13727 -29434 -7565 26397
142 26397 -12023 -54466 -25787 16566 16711 5728 -5296 -30581 -24704 27994 37487 -19550 -28622
155 -28622 35458 43078 -29669 -43705 23588 39714 -9253 -13368 13089 -14917 -42260 9639
167 9639 54187 9258 -36127 -10672 12243 -2754 5004 30274 10910 -26574 -22896 -4424 -1584
180 -1584 12039 19602 -21262 -51854 -5236 39583 2011 -34234 5554 34302 -5884 -26326
192 -26326 8989 19439 -2186 11515 29748 -9320 -36983 15238 57654 16433 -20010 10453
204 10453 27588 -7930 -17967 19147 28923 -6196 -32530 -34114 -20808 7681 17556 -23870 -57294
217e7294L8309M4878k9526l9539L3513M1703k9557m1956K0425L7937k293j4887
229A713K000L84k20J3869N827j1467O606K0864j6715m1148O039M4614M675l9202
243b161k0255R713P838L249N864o946j3814N034Q759j4262q074K4091J2836k8748
257a6876k1080K3197K1092j3976p606J9893Q646j5361n257J3361Q791J863K841
270A9528r466j7970K856J9613K735j2815j913K787r260l941J6100R259j3545j0975
284g007L967j011o782O345J0773q303j4380M510R234l715L92J3949L755j4919
298c192p325J1026P549k608O5m60r123n749O411O382m18J283L64r977o501J1479
314g94J1625o216r079K290R51q221R8J3081M399q864m493L673J866K639Q653L378
$$ plain form
217 -57294 -18985 25893 -3633 -43172 -9659 32044 2487 -39469 -19044 18893 16600 1713
229 1713 3713 4097 3877 17746 23573 12106 18712 39576 22861 -18287 -12248 32366 37041 -2161
243 -2161 -22416 -12703 -4865 -1616 4248 -2698 -16512 -11478 -2719 -16981 -25055 -964 11872 -16876
257 -16876 -37956 -14759 6333 -7643 -15249 4644 13290 -2071 -7328 6033 14824 16687 19528
270 19528 10062 -7908 -5052 14561 17296 4481 2568 5355 -3905 -7846 8254 17513 3968 -7007
284 -7007 -3040 -4051 -10833 -4488 6285 -2018 -16398 -11888 -2654 -6369 -5977 7972 11727 -3192
298 -3192 -10517 509 8058 5450 5515 5055 -4068 -9817 -3406 2976 2558 3841 4205 -5772 -12273 -794
314 -794 10831 4615 -4464 -2174 -1223 -9444 -9346 3735 8134 -730 -5223 -1550 316 2955 11608 14986
330A4986q894o176L720J015k447L751L590q908j0860K665P184l25j042K231m239
345c749q355O44P728J607k912j54k140o405J289J1213N862l900j709L978R55r56
361B996O488P947j887o860k865L22R47K805J467m851n843m32p75k783K236N410
377D322l382j1879n412M948M154j289j914k259l314k48N410O442K617O03O06r4
393f89J944N283M755P50j409l21j347j660K304M058Q5k851k046l050m391O60N853
410G928P97r713j0003j813L829K343o69k581m514l164K927P258L939r85k240M06
426f255K722L473K610m57j232K915M191j551m854J467Q329M223m637n721r31J467
442E759M83R26J377l196j0046o353N175J0627J693r940j0061J053J0788P899l972
$$ plain form
330 14986 6092 -84 3636 4651 2204 5955 9545 637 -10223 -7558 -374 -699 -1741 490 -3749
345 -3749 -12104 -11460 -3732 -2125 -5037 -5191 -7331 -13736 -12447 -1234 4628 728 -981 2997 3952 2996
361 2996 9484 17431 15544 8684 5819 6141 7088 9893 11360 6509 666 234 -541 -3324 -1088 4322
377 4322 940 -10939 -16351 -11403 -7249 -8538 -10452 -12711 -16025 -16273 -10863 -4421 -1804 -1201 -595 -689
393 -689 1255 6538 11293 12043 10634 10313 8966 7306 9610 13668 13753 10902 8856 5806 1415 2075 7928
410 7928 8725 -988 -10991 -12804 -8975 -6632 -7301 -9882 -14396 -17560 -14633 -7375 -3436 -4421 -6661 -6255
426 -6255 -3533 -60 2550 2093 861 3776 7967 6416 1562 3029 11358 15581 10944 5223 4292 5759
442 5759 6242 7168 8545 5349 -4697 -11050 -5875 4752 6445 -3495 -13556 -12503 -1715 6184 2212
457B212j2777r12J1181M586j0524q124J0972J0756r057j1958R526J4390p477j3476
471a0682R012J8274n303k0412k392J7265J1645o564j3825p198O624J6026N376
484A7846j4258j2035Q587J2401o233j1887N398R902r307j5214M461J4713j710
497B664j4761k792J0436N452l789m955k093L366J0486O307j1036j5301P185K3048
511A4217N176j7682r820J0516R546k564j132M345m688j0211J282R435k15q736
525e31l176m00o241m57J2218L581j8522j3394J8052K3492r751k7942m55K8070
539D544J4821j5638j7805L686J6027J0039k302r697m626O997P453m028n096P780
553A2155L600j8256j5369J8064K5224j3776l7109l961L2393J5712k0533k2469
$$ plain form
457 2212 -10565 -11477 -296 4290 -6234 -14358 -3386 7370 -1687 -13645 -4119 10271 2794 -10682
471 -10682 -1670 16604 11301 -9111 -11503 5762 17407 10843 -2982 -10180 -3556 12470 17846
484 17846 3588 -8447 140 12541 6308 -5579 -181 9721 414 -14800 -10339 4374 2664
497 2664 -12097 -14889 -4453 999 -2790 -7745 -9838 -6472 4014 10321 -715 -16016 -8831 14217
511 14217 19393 1711 -8109 2407 11953 9389 8257 12602 7914 -2297 -1015 8420 8205 -531
525 -531 -3707 -4107 -10348 -10805 1413 4994 -13528 -26922 -8870 14622 4871 -23071 -23526 4544
539 4544 19365 3727 -14078 -10392 5635 15674 13372 3675 -951 6046 13499 9471 4375 12155
553 12155 15755 -2501 -17870 194 25418 11642 -25467 -29428 2965 18677 -1856 -24325
565b4325M136J9027J0114p416j5594l838J5895J4913o761j5071J797J2638J667
578G182o677M481R420o160j5519K51K0530J0163j5779k3778J086K1439J0558j3421
592C776j7386p1J0672R916p68r798q666M722J5001L676j4144r122Q737R862l068
607C339m895K090k60m874J608Q928K988o185p547l554M022J1897O442j4079k0428
622b0508M893K6007Q543k0357j6587J0290J8993J351j1946o226M943P177P1o085
636E59k971L975K192n193l560P200O494q362j3109L377J7784O231j7317j7882
650b0582O850K1649O239j6782j4174P153J5161L084p380l701K904K550M56O99
664D126L70j363j894j272k3K242K283l644p278N83R800M016r443r963K922J1091
$$ plain form
565 -24325 -20189 -1162 8952 1536 -14058 -17896 -2001 12912 6151 -8920 -7123 5515 7182
578 7182 505 4986 14406 8246 -7273 -7022 13508 23671 7892 -15886 -14800 6639 17197 3776
592 3776 -13610 -13681 -3009 6907 6139 -3659 -12325 -7603 7398 11074 -3070 -12192 -3455 6407 3339
607 3339 -1556 534 274 -4600 -2992 5936 8924 2739 -4808 -8362 -4340 7557 13999 -80 -20508
622 -20508 -15615 10392 18935 -1422 -18009 -7719 11274 12625 679 -5547 -604 6573 6644 559
636 559 -2412 1563 3755 -1438 -4998 2202 8696 334 -12775 -9398 8386 14617 -2700 -20582
650 -20582 -13732 7917 14156 -2626 -16800 -9647 5514 8598 1218 -2483 421 2971 3427 4126
664 4126 4496 3133 1239 -33 -56 2186 4469 825 -6453 -5870 3930 7946 -1497 -11460 -8538 2553
680B553M757o646j0164k371R302J0440j789j0178l096P655O583j790l121J108
694C243P78k036j262J999J898j788m227k566K004M700J08p396m972N624Q500j658
710B949j0242m590P457R157m70q823m025O162P556m11m126K65L371j64k645J802
726C223M815m29o757m458M240N827j412p204m123L047M741o45n093k843K370L903
742g98L05l274k280O96L618L287r92k610m44K806K534J158L25J78j651j656J821
759C023L628N08m565m642J277L303O08l634k781L43R25R10m85k467l01J304J895
776a151p50k059n45J161K832J614q29j115K11K805J720L5n86J35o26r98J729Q58
794D441j843k205k401J377J339k95j058j776o33O65N99k55j022N9J073j18j85
$$ plain form
680 2553 7310 664 -9500 -11871 -2569 7871 6082 -4096 -7192 463 7046 5256 2135 3243
694 3243 4021 1985 723 2722 4620 2832 -1395 -3961 -1957 2743 2851 -4545 -9517 -3893 4607 2949
710 2949 -7293 -11883 -4426 4731 4261 -4562 -8587 -2425 5131 4720 594 859 4230 4066 1421 3223
726 3223 8038 7609 852 -3606 634 6461 5049 -2155 -6278 -3231 1510 865 -4228 -7071 -4701 -798
742 -798 -493 -3767 -6047 -5351 -1733 1554 562 -2048 -2492 314 2848 4006 4331 4509 2858 1202 3023
759 3023 6651 7159 2594 -2048 -771 2532 3140 -494 -3275 -2932 -2007 -1097 -1582 -4049 -4350 -3046 -1151
776 -1151 -1901 -3960 -4505 -3344 -512 1102 273 -842 -631 2174 3894 3929 3343 3478 2852 1854 3583 4441
794 4441 2598 393 -2008 -631 708 413 -645 -2421 -3054 -2389 -1790 -2045 -3067 -3008 -1935 -2053 -2238
811b238m89k5K469J673j90k032Q97K543M43j32P1J596q97k077N93P58K98j289
829A972k183q8O46l43o41r88J53J50j394r11N18J141m6j209K11Q29L36J81J441
848b25J791l9p70L83J120M73K12J13r15j23m9M80r27n06R89p67j935m84J451j98
868G4j540q02l01L63j172N52O61k77O34M55o07J15K223J682q26p72N20J747o00
887B129l32L95P71o75j148l11M13M66K66q92k375m51J605M68j583j634R13j82
905b157n87N25K59J0J39J331K40q80P14K296O1j314N03J643o20j745L80K188K61
924C247k035k056K66J928R86j540k538n74J788O79j796n00P67k4j265M59J757
941d51N41r01k68N15J346J736q20l009N57M696Q94n458k846M657L258l218k900
$$ plain form
811 -2238 -2727 -2752 -283 1390 1200 -832 65 2608 3051 2919 2990 4586 3689 1612 2205 2963 3261 1972
829 1972 -211 -299 347 4 -637 -1625 -1472 -1322 -2716 -3627 -3109 -1968 -2014 -3223 -3012 -2183 -1847 -1666 -225
848 -225 1566 1527 757 1140 2260 2733 2945 3058 2143 2020 1971 2451 1524 1018 2007 1240 -695 -1179 272 74
868 74 -1466 -2268 -2569 -2206 -3378 -2826 -2165 -2442 -1808 -1353 -1960 -1845 378 2060 1234 462 982 2729 2129
887 2129 1797 2192 2963 2288 1140 829 1242 1708 1974 1082 -1293 -1744 -139 329 -1254 -2888 -1975 -2157
905 -2157 -2744 -2219 -1960 -1950 -1811 -480 -240 -1120 -406 1890 1951 637 1140 2783 2163 418 798 2986 3247
924 3247 1212 -844 -578 1350 2336 796 -1742 -2316 -528 151 -1645 -2145 -1378 -1402 -2667 -2208 -451
941 -451 90 -811 -1079 -564 782 2518 1698 -1311 -754 3942 4836 -622 -3468 1189 4447 1229 -1671
958a671J520Q91j769rK132n90k762j46P56j43J361J959k772m388L132P412p57
975D156p634q92P023L099m206l039J518J692J48J89m90j615q41P40R58K86K07
992A299j390l131m67M123L045k663n664j178M833M907j339n955k076M891M504
1007C739j592l359J23J421K25R75J654j981l179J194L212j49j619M47q97l085
1023b871J851O746o79r205l098P969N798m460n910k14K074K410K819j250o035
1038d055j437O467L727m810l588L146J836k904j24M384n3n664j606N282M508j864
1054C245n180k561L260O531J422o425o345K776P959K216n660n605O06N177L053
1069D469k349m099l61K086L0o72J953O26m735k983M329N323j571n497j874K359
$$ plain form
958 -1671 -151 740 -1029 -1038 1094 504 -2258 -2404 -1648 -1791 -430 1529 -1243 -5631 -2499 4913 4156
975 4156 -3478 -4370 2653 5752 1546 -1493 25 1717 1865 2054 1564 -51 -892 -152 806 1092 1299
992 1299 -91 -3222 -3689 434 3479 816 -4848 -6026 -1193 3714 2375 -3580 -5656 -765 3739
1007 3739 2147 -1212 -1089 332 557 1532 3186 1205 -1974 -780 2432 2283 664 1111 214 -2871
1023 -2871 -1020 5726 5047 -4158 -7256 713 6511 2051 -3859 -4073 -1999 411 3230 1980 -4055
1038 -4055 -5492 975 4702 -108 -3696 -550 1286 -1618 -1742 2642 2589 -3075 -4681 601 5109 3245
1054 3245 -1935 -4496 -1236 5295 6717 292 -6053 -3277 4682 6898 1238 -4367 -3761 1416 4469
1069 4469 2120 -1979 -2340 -254 -224 -896 1057 1683 -3052 -6035 -1706 3617 2046 -3451 -5325 -2966
1085b966M400L817k461q161j760R592P560o418r512J778P629J762k812j481j069
1100a02j361K073L202p74l704j17m0j766K074M515j622r119j800R811N571o668
1116A73p589M69P501M427j970o515k897N109P112j500o447p34L828J412j679J050
1132A750J944l249l056J046L575L580l242o716j824N862P113k736r606k689Q378
1147A30N792l488o279j134L322M264R10l260m126J392M217M42k185P4M62k408
1163a875j068M672L393m304n570R05M921K754j196m283m056K328P633J462o822
1178a106m865M157N731n11k788j290k09R36K745P43k999k064J548Q31o30P66J323
1195B318l563l520L088N395j091n379k352K646L138J341j805m130j100M700L914
$$ plain form
1085 -2966 1434 5251 2790 -5371 -7131 2461 10021 3603 -5909 -4131 3498 5260 2448 967 -102
1100 -102 -1463 610 3812 3038 -666 -783 -823 -2589 -515 4000 2378 -6741 -8541 1270 6841 173
1116 173 -7416 -6947 554 4981 3011 -3504 -6401 -1292 5820 4320 -2127 -2861 967 2379 700 1750
1132 1750 3694 445 -2611 -1565 2010 5590 2348 -4368 -6192 -330 6783 4047 -5559 -8248 130
1147 130 5922 2434 -3845 -4979 -1657 2607 3517 257 -3869 -2477 1740 2182 -3 71 533 -1875
1163 -1875 -2943 1729 5122 818 -4752 -3847 1074 3828 2632 -1651 -5707 -3379 4254 5716 -1106
1178 -1106 -5971 -1814 3917 3406 618 -672 -881 55 2800 3543 544 -1520 28 859 229 995 2318
1195 2318 -1245 -4765 -1677 3718 2627 -2752 -5104 -2458 680 2021 216 -3914 -5014 -314 3600
1210C600k544m190J007K970J097n57J11r37j447J734J807k82j684j14p17q77K489
1227A466K209k115m567r6M701J887l185k536p27J644K801J195l485l307K139L795
1243A819p84k373N37P97n42j97J597M11k623m65J429J160o48M29j287j426J451
1260g15L423K5m390j508L675K656j686j739k50K53J589J284q62k180j73K022R5
1277A519j261L40K75j558p87J017J957j672k028J23J883q38R73o75j519K57K402
1294D08P02j792j006L89J944M3m04k48o46O99J721M26l49j713J520k40m48L24
1312A330O35n46j167j47M49K34j897J718n18p55R70l36j153j13M16J001j408q94
1330b181K19J060m55M52P02n48j21J023k21J52R8J57Q86r70O44N38L7j079P94
$$ plain form
1210 3600 1056 -3134 -2127 843 1940 1383 1494 557 -890 844 2651 2369 685 571 -146 -1023 1466
1227 1466 3675 1560 -3007 -3103 1598 3485 300 -2236 -2963 -1319 1482 2677 -808 -4115 -1976 1819
1243 1819 1035 -1338 -801 -4 -546 -743 854 1265 -1358 -1823 -394 766 118 547 -740 -2166 -715
1260 -715 2708 2733 -1657 -3165 510 3166 1480 -259 -509 -256 1333 2617 1755 -425 -598 1424 1519
1277 1519 258 598 873 -685 -1472 -455 1502 -170 -2198 -2075 -192 -1030 -57 -732 -2251 -1994 408
1294 408 1110 -682 -1688 -1299 645 688 284 36 -610 89 1810 2236 1887 174 1694 1454 1006 1330
1312 1330 1965 1419 252 105 554 788 -1109 609 91 -664 306 -30 -1183 -1296 -880 121 -1287 -2181
1330 -2181 -1962 -902 -1357 -905 -203 -751 -872 151 -70 82 180 337 1223 253 897 1435 1472 393 1187
1349A187K40p09JK04J01k18m74lP5p64l26L16J98r83j86M2k21j91L4O56M71o51
1371a201M86M62N9K02J80M94R4L92k87L15L33j74n21K43M9k35n84l8J07o17j41
1392c82m84K57p7o40J28K33l31j02M06O05m17K30O88N58k58K52N90N6j04kL99
1413A605j13l96q7R2m70l48k1k03o05n48K2P9o23m10J46M80j0l41K43M01L23M56
1435c28J19M89J83M1M63O09K61m22j47L00R7K4j22k78o31k18J71J05p47r50q2
1456a063K98lj33k85m86r5K96J148J83j197m90J328J419l32q85J19N31L13J60
1475H26K54k60r42J13R03L40o21o52j87k04L04Q95o3j719r26J623J740o84j796
1494a056k93J443J167m4p79p76J8R62J115n49j411n59R16P47n58m70n20m30k58
$$ plain form
1349 1187 1427 718 719 923 1024 806 332 329 404 -360 -686 -370 -172 -1155 -1341 -1299 -1520 -1711 -1677 -1021 -550 -1201
1371 -1201 -715 -253 -194 8 188 682 776 1168 881 1196 1529 1355 834 1077 1126 891 307 269 376 -241 -382
1392 -382 -866 -609 -686 -1326 -1198 -965 -1296 -1398 -992 -387 -804 -574 114 672 414 666 1256 1312 1208 1206 1605
1413 1605 1492 1096 1009 1101 631 283 262 59 -546 -1094 -1072 -993 -1616 -2026 -1880 -1400 -1410 -1751 -1508 -1107 -784 -328
1435 -328 -209 280 463 504 967 1576 1837 1415 1268 1568 1665 1689 1567 1289 658 440 611 716 -31 -981 -1063
1456 -1063 -765 -768 -901 -1186 -1672 -1767 -1471 -323 -140 -1337 -1827 -499 920 588 -297 -178 353 666 826
1475 826 1080 820 -122 -9 894 1234 613 -39 -226 -430 -126 769 706 -1013 -1939 -316 1424 740 -1056
1494 -1056 -1349 94 1261 1217 438 -338 -320 642 1757 1208 -203 -762 154 901 343 -127 -647 -1077 -1335
1513a335O49R24l71j823p50J674J852m36j833q00J245J952P32q04j826k25K454
1530A279J859r57k248j44J689P47p20n15k16j074n76J203J289j182k315o15J246
1547a250J537L31j653k087p4L031K385j759l302K65L241J645j167j506K3P15J025
1564A400O63k52j071j110K51R38Q49l26j831j804M64K605J101k178l259J89L292
1581g9K188j700k914m34K511K383j59k027q07R56J511R68k66j251j014N32J072
1598A470N86m61j433j584j67K005J401j772l361o30K782K462j110k971j179J645
1614b317L053J034j992k355O64L173J794j039j697J18P16R52Q25R7j546j832K79
1631g3J920R48j477k771j543J485K736K66l429l036J480L441J134k240k667L34
$$ plain form
1513 -1335 -686 238 -133 -1956 -2706 -1032 820 384 -1449 -2249 -1004 948 1680 876 -950 -1175 1279
1530 1279 3138 2181 -67 -211 1478 2225 1505 990 774 -300 -876 327 1616 434 -1881 -2496 -1250
1547 -1250 287 618 -1035 -3122 -3196 -165 2220 461 -2841 -2576 665 2310 1143 -363 -340 375 1400
1564 1400 2063 1811 740 -370 -119 819 1668 1342 -489 -2293 -1829 776 1877 -301 -3560 -3371 -79
1581 -79 2109 409 -2505 -2939 -428 1955 1796 -231 -1038 -82 1429 2397 2131 880 -134 398 1470
1598 1470 2056 1595 162 -1422 -1589 416 1817 45 -3316 -3946 -1164 1298 188 -2783 -3962 -2317
1614 -2317 736 1770 -222 -2577 -1913 1260 3054 2015 318 436 1152 2104 2929 3026 1480 -352 -73
1631 -73 1847 2795 1318 -1453 -2996 -1511 1225 1491 -1938 -4974 -3494 -53 1081 -1159 -3826 -3492
1647c492K579K177l84j588o66J252J512Q23j7o24j145k37J653J922p24k871j626
1664a456J269K478M88k646l054M4L064J866k158l389j19K391J727n25j442q51
1680b313K64J625J337j49j030n19L49J152J367M64j769j901P43K932Q99k217k677
1697a443P4K376J553j157k507j369J320K327J23k193j548N69J378O83k22q41q15
1714a692J37J219J174qj101j102M71J802J548q79k268n56K056J925n83j983j351
1731a191R00J889O69j552k007j55J686P03p91j055m25l5K48J010L02j027j076
1748a907L71J453R61l09j201q21J094K020O32j742j579P48K054N64j175j294j71
1765c02P45P98o8j205p30j8M25L16k02n53n89k93P37J052j34j144l63O63J465
$$ plain form
1647 -3492 -913 1264 880 -708 -1374 -122 1390 2213 2196 1572 427 190 1843 3765 3041 170 -1456
1664 -1456 -187 2291 2779 133 -2921 -2877 187 2053 -105 -3494 -3613 -1222 505 -20 -1462 -2313
1680 -2313 -2049 -424 913 764 -266 -785 -436 716 2083 2547 778 -1123 -380 2552 3451 1234 -1443
1697 -1443 -1369 1007 2560 1403 -1104 -2473 -1153 1174 1297 -896 -2444 -1875 -497 186 -36 -877 -1692
1714 -1692 -1555 -336 838 830 -271 -1373 -902 900 2448 1569 -699 -1255 801 2726 2143 160 -1191
1731 -1191 -291 1598 2267 715 -1292 -1447 239 942 151 -904 -1329 -1364 -1116 -106 196 -831 -1907
1748 -1907 -1536 -83 878 569 -632 -1453 -359 1661 2293 551 -1028 -280 1774 2338 1163 -131 -302
1765 -302 443 1241 1173 -32 -762 -780 -355 -39 -241 -794 -1383 -1676 -939 113 -21 -1165 -1528 -865 600
1784F00O73o92j195M5J561J022m35j360q6N95O76j26p13o61l48M77L26l58p32
1803g31m71N9K36M33%m59n93J53J285N29n64o11J25J037Q17k10n52k85M74P35
1823A407N6o10n14M8L25l5k79l87n15p7J93Q8l04k70k14N6K94M13j16l98O5Q13
1845C9M00k05p5Q9R5K37L44j18n84o3N13J5m14l07M8n2k84J34Q4l55l90L25L94
1868a30l71l9R4L03k7J18L57O4l14K34L81m2j47j50N2R3J2k46j43o7j38%k06j6
1892c28j44j49l5J32K9k17J52K00J97k13L96J62j46Q7M22L64m83j84M69J49m25
1913D35o1K41j32l84p0L59k84n40j9K82k55k67K09J37k22k33M07K45l03O0K39
1934a56L07n4J38L4J11j08Q5K80n4j33Kj4K7j80r2k6ml34j31K56k9m11k20K81
$$ plain form
1784 600 1273 581 -614 -569 992 2014 1579 219 133 728 1404 1278 565 -96 -444 33 359 1 -731
1803 -731 -1202 -1143 -907 -474 -474 -933 -1526 -1373 -88 441 -123 -734 -609 428 1245 1035 483 198 672 1407
1823 1407 1463 853 339 387 712 677 398 11 -504 -581 -388 -300 -604 -874 -1088 -1032 -738 -325 -441 -839 -774 39
1845 39 439 234 159 248 343 580 924 806 222 159 672 687 273 -34 14 -38 -322 -188 -104 -459 -849 -524 -130
1868 -130 -501 -540 -446 -143 -170 -52 305 369 55 289 670 628 481 331 383 476 488 242 99 32 -106 -106 -312 -328
1892 -328 -472 -621 -656 -524 -495 -712 -560 -360 -163 -376 20 182 36 123 545 909 426 242 711 860 435
1913 435 374 615 483 99 29 388 104 -436 -455 -173 -428 -695 -486 -349 -571 -804 -397 -152 -455 -395 -156
1934 -156 151 97 235 269 380 272 357 637 583 450 452 438 465 285 193 167 163 -171 -302 -46 -75 -486 -706 -425
1958d25K24j95k03kL83j82O4L04l2k81K55M73j2l18R6L69r0m0K60j20k29l29N28
1981D98K03l75l74j49M10J30k80j93k46j07K91K43l9o78k90N31M55j65k75j25
2001e35L6K60L43J36k61m20NP38M00m33l56r5M29L27M06m18p72j22Q33O92m19
2022G74j080j47M95M59n8l46m94j95L49L17J86n62n29K8N09N27l6o48n20K43Q51
2043A23N35m72q25m00R20J214j93j304k66O71P36Q3m17m45l07L55O90J41p40m67
2063c68j32O34L53m7m36q88l0J067R42p24j450j52J269Q08k08p70q80K58J273
2082E19P10p03j229M1O49P00M5o08n65l68O43Q63L3q93q39l3R82R80k89j539o71
2103a572R42J625K07j235j169K78J324J005k18j504n07Q35J274n6q82p12p9L19
$$ plain form
1958 -425 -201 -396 -599 -601 -218 -400 -336 -32 -64 -345 -90 383 371 53 149 518 428 388 648 528 299 -30 498
1981 498 701 326 -48 -197 213 343 63 -130 -376 -483 -192 51 12 -666 -956 -425 30 -135 -410 -535
2001 -535 -499 -239 104 240 -21 -441 -436 302 702 269 -87 -182 247 574 980 562 -210 -332 501 1193 774
2022 774 -306 -453 42 501 443 97 -397 -592 -243 74 260 -302 -831 -803 -294 233 197 -451 -971 -728 123
2043 123 658 186 -639 -1039 -119 1095 902 -402 -668 3 739 822 405 -40 -347 8 698 839 99 -368
2063 -368 -500 134 487 440 4 -884 -914 153 1095 371 -1079 -1231 38 846 638 -132 -1012 -754 519
2082 519 1229 526 -703 -662 -13 687 732 124 -441 -809 -166 697 730 -163 -1002 -1035 -53 927 638 -901 -1572
2103 -1572 -630 995 1202 -33 -1202 -924 400 1405 1187 -317 -824 11 1285 1229 347 -365 -444 -125
2121a25P97M67q81j471j62J204J079n29j169q74M34J451R89r92j725j70J737J226
2139A286m80j216n12O23J113N99n60j052l69Q53Q16mo83q54m96O13J168R8j430
2158d87j211M59J394Q65p91j523n68J301J707l3j427j045P81J244O28l87j070
2175a63m90N76J307J83r03r78k46N85Q32L20q67j504k96J671J185q91j664m18
2193a761Q48J397L70q52j379P4J623J069o21j317j13N98Q54L10j79j082o02P22
2211d1R60J69r73p89l22Q12R69Jj360j266R70J513L89j052j114Q8R55J024Rj212
2231b70p07O10J071K95m75o83l45K48R13L45p03j186J1P13Q56k23p67r59K2J369
2251A35Q05n10j491j06J191P94j36n48o89J27Q85P36l28j026j97N62M33L9j47
$$ plain form
2121 -125 672 1139 258 -1213 -1375 -171 908 379 -790 -1664 -1230 221 1210 218 -1507 -1677 60 1286
2139 1286 806 -410 -922 -299 814 1413 853 -199 -568 285 1101 1097 414 -440 -936 -323 845 943 -487
2158 -487 -1698 -1239 155 1020 229 -1294 -1862 -561 1146 1113 -314 -1359 -578 666 1294 907 -163
2175 -163 -653 -77 1230 1413 510 -468 -714 -129 703 1023 156 -1348 -1644 27 1212 321 -1343 -1761
2193 -1761 -913 484 854 2 -1377 -1303 320 1389 768 -549 -662 -64 790 1100 921 -161 -763 -41
2211 -41 919 1088 115 -674 -996 -184 785 786 -574 -1840 -870 643 1032 -20 -1134 -1046 -91 933 942 -270
2231 -270 -977 -367 704 999 524 -159 -504 -256 657 1002 299 -887 -876 -163 693 470 -297 -1256 -1234 135
2251 135 940 430 -1061 -1167 24 818 682 134 -555 -428 457 1193 865 -161 -358 204 637 676 529
2270E29o91n63L58R09K22j055p49J98P59M60l66p79l89M77J087K87q56p15M38
2289d39N88N01J7o56m39M04O70J68l95m61l9M4M17L19o05p14j46Q57M18m42n56
2310d89k62O4P57K08l59p37K9P63N56l73m39L8K36L14K62n5m39k51M20M51p5l76
2332B43k42j92K54M10j20n18l93K52M02Nk95l43o1J88L74Q3n31k16L44M61n0q3
2354b8k1j62M8M45J29k11k38L56J31k8Jk5k11j84L05M19m11m98J51K35l5j96p2
2377a00j50q2J03L12l61j21j02K33R3k33K11l4p3P0K17P7n0j17J85K11L4m8r8
2400A77O1O0J21j26j4j66J0J6l9L1j49j46J21L5k41n5l9J65j21M7R8o7k34L09
2424a46L24j70j68J97J69j03L1J49P8l36J04K64p0k53j28J69J0j15r2L0j18k4
$$ plain form
2270 529 -162 -725 -367 542 764 -291 -1040 -842 -83 377 11 -768 -1157 -680 407 694 -162 -877 -439
2289 -439 149 650 667 11 -428 -24 646 814 419 -42 -81 -37 380 699 94 -620 -766 91 509 67 -489
2310 -489 -751 -687 70 278 -81 -818 -789 -26 530 157 -282 -244 -8 306 568 513 74 -177 243 694 619 243
2332 243 1 -191 63 473 353 -165 -558 -306 96 101 -194 -537 -598 -410 -36 47 -484 -700 -356 105 55 -28
2354 -28 -49 -211 -163 282 411 200 -38 318 449 421 422 397 186 2 307 726 315 -183 -32 203 168 -28 -100
2377 -100 -250 -332 -229 83 -278 -399 -501 -268 -175 -408 -197 -231 -304 -234 -17 60 10 -107 78 289 323 275 177
2400 177 238 298 419 293 279 113 123 139 100 131 -18 -164 -43 -8 -249 -304 -343 -178 -299 -252 -154 -221 -455 -146
2424 -146 178 8 -160 37 206 103 134 283 361 25 129 393 323 70 -58 111 121 6 -86 -56 -174 -198
2446a98N1l4l0j43M3J31N0m8j7L5qJ12K83Qm9j40Q6K16J15k50N0oj7j35J33O0
2472B98k17j24l9J6k5r0k6p4K1N2K05j00k41J4J85J96j49L0jR7L6P8pN0j71R7
2498A11J62j24p6qp2L3O1P5l5k25j28K92R1l1k92K2R1J29Nm9j20m9J80J12L5l08
2524a18j58K98J58j07k0k27j02Q7L65Pk17k15JK60J74o0k25k38L01L96N8l81k75
2547b38O0L87J53j6l34k18K4L82J33k02l69q4J77K22J63k68k78k43M62M75K9o41
2569b24k59K42M60M00m31l46k31L53N56k4l94m12K5L85L31j10n99k52K52M51J16
2590B89j08n18k96K79P98Q9m90n33J26N52M83l15n30l19L65P39R9n60o48K8O92
2611B22K32k76l14l66o2M73N56l20p31k71N36O40m2l10m70j13O91O71M9q74n61
$$ plain form
2446 -198 -147 -181 -211 -354 -311 -180 -130 -178 -195 -160 -168 -56 227 235 186 46 132 348 463 213 263 257 240 105 238 298
2472 298 81 -43 -82 -66 -91 -181 -207 -281 -260 -208 -3 -103 -344 -330 -145 51 -98 -68 -69 28 64 142 135 185 14 111
2498 111 273 149 73 65 -7 26 87 162 127 -98 -226 66 157 126 -166 -144 -53 76 81 32 -88 -137 43 155 190 -118
2524 -118 -276 22 180 73 53 -174 -276 -189 176 183 -34 -249 -248 12 186 126 -99 -337 -36 360 418 37 -238
2547 -238 -178 209 362 346 12 -206 -182 200 333 131 -238 -322 -145 77 240 -28 -306 -549 -87 388 417 -224
2569 -224 -483 -241 219 619 188 -158 -389 -36 520 496 102 -310 -285 100 431 321 -278 -530 -278 173 289
2590 289 181 -337 -633 -354 444 533 43 -490 -364 188 671 356 -174 -493 -128 611 710 150 -498 -470 222
2611 222 454 178 -136 -502 -564 -91 465 145 -586 -857 -321 319 277 -33 -503 -616 75 746 795 -79 -640
2632f40N72R30J12o04n48j91M29N75l8o06p53K42N72M37l43o64m78L08O33L92
2652C37l62q68n1P37P53P9o62n20J73J118M55o28o34j32N27M28L17o70p81K3N72
2673B11N43m69p82k29J39M28N00l07q74m51P37J015O0q48m22K55O94N89j29p46
2693h6n00N14J079N0p17n56J8M62L36K80q34p04J32N97M59m25p58m10N52P12K34
2714D35n16q12k5R01P24k09p09k78K03Q61L89m48q08o8N54N13n3m66n50j19N02
2735B1N87k85r42l09L61N41K08l96n38j67N11R34n0p51l37L44O12M26j44n05m07
2756b86L47P40J64o32n77J50M11J66k5m34p27J04N86M74n23p56o1M30N79J7m84
2777c37m46J62O77N31j67o72n8M80M26K31k59n02j38L93M55k22m53l55M9L25L64
$$ plain form
2632 -640 -68 862 974 370 -178 -369 60 635 597 -9 -762 -520 52 489 146 -518 -996 -688 -55 337
2652 337 -25 -893 -944 -207 546 625 -37 -557 -384 734 1189 561 -73 -205 322 750 1067 397 -384 -361 211
2673 211 754 285 -497 -726 -587 -159 341 34 -840 -1291 -554 461 521 -327 -749 -494 200 789 660 -86
2693 -86 -586 -72 1007 1057 340 -216 -198 264 600 880 46 -658 -526 71 530 105 -653 -1063 -511 201 435
2714 435 -81 -893 -918 -17 707 498 -211 -489 -286 575 964 516 -292 -360 194 707 654 188 -362 -481 21
2735 21 608 323 -619 -928 -567 -26 182 -214 -752 -919 -408 526 476 -275 -612 -268 344 770 626 121 -286
2756 -286 61 801 965 333 -244 -94 317 483 458 24 -703 -599 -13 461 -62 -818 -879 -449 130 147 -337
2777 -337 -783 -621 56 587 420 -252 -310 170 596 827 568 66 -72 321 776 554 101 -254 -205 120 484
2798D84k78p38k59M09M75o1l08m40M7L14M62km83j58L80N68Q1l95M9j64L06L22
2820F11P8k38n60j4N28O9k82l37j03j30L86K23l88n00L5N18L01k11m04K0J22K30
2842d6L00r6k59j57L38M35r3j58k21k3K04R3m6k88j18k4J84Q4r5l45r5K08L26
2865A08j93j43j04N8J43J16J01j21k08K48L30N1l48j29K25J15J05l1r5k61p1L04
2887B00N3k16k53P4M8L4j9j14p8n9J67K26j83j08P7K59L2j12J7M0k3J02J93p3
2911B84j51r4J24J11L4l54J34p1JJ04j40O0k34k1P4J82j14l01Q3L09pj28q0P8
2935a17M6%J94Qj76p3K03R8p9k7L8O7m4j17L39j89k08O8N8K7j73O6N2kj51J16
2961B4k0j53k2J48Nj74k3J06j5O8p8R5MmJ09Q1q3j6N2Q2N7j30N6p8O2L7M9j33
$$ plain form
2798 484 206 -532 -791 -382 93 32 -276 -716 -669 -355 107 105 -378 -536 -156 412 493 98 147 -17 289 611
2820 611 689 451 -109 -123 405 474 192 -145 -248 -378 8 231 -157 -657 -622 -104 197 -14 -418 -398 -276 -46
2842 -46 254 158 -101 -258 80 515 422 264 43 20 224 317 271 -17 -135 -159 25 109 14 -331 -426 -218 108
2865 108 -85 -228 -332 -274 -131 -15 86 -35 -243 5 335 386 38 -91 134 249 354 323 228 -33 -104 200
2887 200 253 37 -216 -142 -94 -60 -79 -193 -271 -330 -163 63 -120 -228 -151 108 140 28 45 85 62 164 357 284
2911 284 133 39 163 274 308 -46 88 17 18 122 -18 42 -192 -213 -139 43 -71 -372 -289 20 13 -115 -195 -117
2935 -117 -71 -71 123 131 -45 -118 85 183 104 77 115 182 138 21 360 171 -37 31 89 116 -57 9 61 59 -92 24
2961 24 4 -149 -171 -23 -18 -192 -215 -109 -124 -56 -134 -39 -35 -39 70 151 68 52 104 186 243 113 169 91 153 190 239 106
2989A06n1p8J0J10l8j95J0n0mP0L6o1o5mQ9P7Pj91J74QnJ05N0L9j46O3R1o2J5
3018A10J6j06M4R6m0l7k01J5N9N0J1j03L2l1QJ96o7j36n7J42J1J19Mj79M7m7Q9
3045D5M4L7j36j16L3J66K9q3j20M1qP2K3j41o8O4J45O3m4j04L5O2J43K3k0k43
3071e8jK22O3Pl49m1J49J44n7j59o2j21J48J72K6k02k38J87J66J44n5k76o2K18
3095c5K54Mj03l57L0L62K27k04k25j38J96J20J58k55k83n1J75K68J01l73j41j0
3117b80K51K48q2k11j77J63L37J56k75l68J06K51K03j3l42k84J17K82K33k73k87
3138b45j71K64K94r1j09l55J37K54L22r4k60k17J60M32O5j23l47q2K48L42K3l56
3160I1k84r5M70J09k25l20k04K35K42J12j82l78j40L62L24K8j26l81J23L24M00
$$ plain form
2989 106 55 -23 -13 97 59 -136 -126 -176 -180 -110 -74 -135 -200 -204 -115 -38 -31 -222 -48 -40 -45 60 110 149 3 66 157 95 110
3018 110 126 20 64 160 120 83 -118 -103 -44 6 17 -86 -54 -85 -77 119 52 -84 -141 1 12 131 135 -44 3 -44 45
3045 45 89 126 -10 -126 -93 73 102 19 -101 -60 -68 4 27 -114 -182 -118 27 90 46 -58 -23 39 182 205 185 -58
3071 -58 -59 163 226 233 -116 -157 -8 136 79 -80 -142 -263 -115 57 83 -119 -357 -170 -4 140 85 -191 -253 -35
3095 -35 219 223 120 -237 -207 155 382 178 -47 -185 11 131 289 34 -249 -300 -125 143 244 -129 -270 -280
3117 -280 -29 219 137 -74 -251 -88 249 405 130 -238 -132 119 322 309 -33 -317 -200 82 315 42 -245
3138 -245 -416 -152 142 51 -58 -413 -276 -22 300 206 -54 -271 -111 321 386 263 -84 -166 82 424 447 91
3160 91 -193 -288 182 291 66 -254 -458 -223 19 131 -51 -429 -569 -207 117 145 19 -362 -239 85 485
3181D85l36k00j46K79L12J64l40l77j1L19J73l5l65k12R9L12J68j78l62l52M90
3202a13L34m0k46k78m7L57L34q2m11j39K90K86K28k97l53j32L20L25J65n18k92
3223c09K4L86K38j87l64j98J44M06J08k94l50O5M37K65l3l55k75P8N59K25l17
3244B53k99j47K75L55j4l30k86j6K62K60j17m07k90J78M57L4l21k91n2K63M47
3265B14R9m15k49R2L68K55P9m28j22K12L05J75l04l69J00J04K61j33j95l88J7
3286c22M03J72k86l30l6M9L77M5j93k79KL10J73J0l05l7J55J78K30j46j42j54
3308a26K82L63j39l32j99N6L03M0j53l15r3L9K74J0j47j73kK60O4P5k64j18K22
3331g3J81J20j26q9o8J73J75P4l14m6j25L26o0o4j51p0k9J94Q6j50j96n3Q3M6
$$ plain form
3181 485 149 -51 -197 82 394 558 218 -159 -170 149 322 287 -78 -290 -191 121 289 111 -251 -603 -113
3202 -113 221 181 -65 -343 -390 -33 301 219 -192 -331 -41 245 473 176 -177 -309 11 336 501 -17 -309
3223 -309 -285 101 339 152 -212 -410 -266 140 248 -46 -396 -331 106 371 338 -17 -292 -214 345 570 253
3244 253 -46 -193 82 437 423 93 -193 -209 53 313 196 -211 -501 -323 134 168 -153 -444 -496 -233 214
3265 214 313 -102 -351 -259 109 364 443 15 -107 105 410 585 281 -88 12 116 377 244 49 -339 -322
3286 -322 81 253 -33 -363 -399 -350 27 72 -121 -400 -398 -88 85 95 -210 -247 -92 86 316 170 28 -126
3308 -126 156 519 380 48 -151 -95 208 248 95 -220 -313 -274 0 10 -137 -310 -312 -52 12 87 -177 -295 -73
3331 -73 108 228 102 13 -55 118 293 367 53 7 -118 208 148 84 -67 -137 -166 28 114 -36 -232 -285 -202 -156
3355a56K4j7j43Q2J25J99o4j24l3J26K83j0j59j04k2J98pQ0k61j29J46K4L9K0
3379A17k57l2J9J57j5k01N7j30J82J63p0p6j86J93J68j9j42J01p1K42m8K4j7j53
3403FM4J00R1j89j00J1J50j8j6j13o6N4N5M7j31k1p0J06k3J18q7r1k2K01j7P3
3429I2j02o6J48l8J85j91l1L7Ljm4M0q8JQ8q4K1q8R2n6L8k3j46P3J02j16K01j14
3457f7L8j9Q4O3P2k33N5M5OJ77k7j70k2O3J1K0j07lq0JMK6o6r5O0J41l0N3j56
3486a56j6J48oQL6KP9o3R0K0N1j68J44Q3j5j10k3m8oJ7p4j2j04O1o2oO7n6n2m2
3516b13RK08r6q3N4J27M8Jl3K9J00m7m5J86k24J34r0M8N7q3j50J09j74J09j08
3541a27J8r3kR3m9M9p0k1L1R2J58o3k3J22o3P2R5o7p5J19j47K19j68n8N9q4L8
$$ plain form
3355 -156 -132 -149 -292 -210 -85 114 50 -74 -107 19 302 292 133 29 7 205 198 278 17 -112 34 58 97 117
3379 117 -140 -172 -153 4 -11 -212 -155 -285 -103 60 -10 -86 -272 -79 89 70 -72 29 -42 200 152 176 159 6
3403 6 50 150 241 52 -48 -37 113 95 79 -34 -100 -46 9 56 -75 -96 -166 -60 -83 35 -52 -143 -165 36 19 92
3429 92 -10 -76 72 34 219 28 -3 34 37 36 -8 32 -56 -55 33 -51 -30 -118 -26 -82 -44 -67 -213 -140 -38 -154 47 -67
3457 -67 -29 -48 36 99 171 -62 -7 38 44 221 194 24 2 65 76 96 -11 -14 -94 -93 -89 -63 -129 -224 -164 -23 -53 0 -156
3486 -156 -172 -24 -30 -22 14 16 95 32 122 142 193 25 169 252 237 127 104 56 50 67 -7 -19 -123 -62 -124 -130 -63 -119 -171 -213
3516 -213 -204 4 -92 -175 -121 6 54 55 22 51 151 104 59 245 21 155 65 113 170 87 -63 46 -128 -19 -127
3541 -127 -109 -202 -204 -111 -160 -111 -181 -202 -171 -79 79 16 -7 115 52 124 219 152 77 196 49 268 100 42 101 17 55
3568E5N3j39j12L6MN9j05L1j15L6N2J9R8O1j02p6K71J01j12m5N3rJ27J0jj09j01
3595D0R1m3J13j43j63MM6P7k2j50n0P9K8M3p6p6L5J90MR7j07q8L8J43J01o6j3
3622A32j36N4J30Jj00r3j35J19P3N1p7k12R5JK25j01j34m3O6J22M8j31o6J7K05
3647A11l0qk0j60P2K21J5j13j48PJ84P0q3p0j47m3J78L5P8k20j14O9J74R2n9k36
3673a45k3J52J18K7j32n4l2R7J78l3j69m4M8K32m1j37j90K5Q0K13p6j25j50M0
3697a41J34L1o9MkJ07qJ37k06M8q6J09R2K0j35j66J20P4J33j35o9j52J21J86J26
3722B73l33q6Q1J34J90k04j55K9p6J93lo7j32l9J37K10j08j37o8%N9J62O1j69
3746d8j00J1K89Jj73l8n2J55J75j3j60j41P0J35J51k05j93K8R2J76pj40p7q6J16
$$ plain form
3568 55 108 -31 -143 -107 -103 -44 -149 -118 -233 -197 -145 -126 -28 33 -69 -145 126 227 115 70 123 114 241 251 250 141 40
3595 40 131 88 201 58 -105 -101 -55 22 0 -150 -200 -121 -93 -50 -126 -202 -167 23 27 124 17 -71 -33 110 211 145 132
3622 132 -4 50 180 181 81 -12 -147 -28 45 96 19 -193 -98 -97 128 27 -107 -150 -84 38 86 -45 -111 -94 111
3647 111 81 73 53 -107 -35 186 201 88 -60 -53 131 201 118 48 -99 -142 36 71 149 -71 -185 -116 58 150 91 -145
3673 -145 -168 -16 102 129 -3 -57 -89 8 186 153 -16 -60 -12 220 179 42 -148 -123 -43 170 94 -31 -181 -141
3697 -141 -7 24 -45 -41 -43 64 56 193 -13 35 -51 58 150 170 35 -131 -11 63 196 61 -8 -160 -39 147 273
3722 273 -60 -146 -65 69 259 55 -100 -71 -147 46 43 -24 -156 -195 -58 152 44 -93 -161 -161 -102 60 121 -48
3746 -48 -148 -137 152 153 -20 -58 -110 45 220 207 47 -94 -24 111 262 57 -136 -108 -16 160 153 13 -64 -150 -34
3771c4K53j78m3j05k4J76N8j07k26J20L9K61j38o4k2L4Q5P4K8k49L4R6O1J21j71
3796G9j27O0N0N7lj93j07O3J23O0p8q4j84K17J09RM3k66j2K22J82j47j42K7nK27
3822A80j12Q5j52p4J35N6L8j89q1N1O9N5Nj56k0kK79o7j54j19J34O2L4R4j61j08
3848a18N3J37J83j41q5q0P6M5Q5k12j7O4K7Qpn4j43R8M3K1o2pm7Q7J32j4j29q4
3876a41J03J4J47Oq3o9J48o8R9j51mj1P5j6P9j04l9K8k9m7P4k16R8P8l0M3n3O1
3904ho8O2Q1Lk8j46P3J08r1k4rJ33j08O1j0m1n8O1J14j43k0KJ1N9Rpq9K4J39r1
3934am1P0j5j15P7J14q5o4M1M9q5O7p3K8O7J5l5K0j13N0O7n2N8K4k9r0p2K19j
3963I5m3K9p1Q5p3j0k5RK5q2Q7ml4pn3M4L4j2j47J72l4l7L9L5j31J02N0rn6j7
$$ plain form
3771 -34 219 41 -2 -107 -131 45 103 -4 -230 -110 -71 190 52 -12 -34 0 85 159 187 -62 -28 68 129 250 79
3796 79 -48 12 62 119 116 -77 -184 -121 2 62 -16 -100 -284 -67 42 51 94 -172 -184 38 220 73 -69 -42 -47 180
3822 180 68 153 1 -73 62 118 156 -33 -114 -63 6 61 66 -90 -110 -112 167 100 -54 -173 -39 23 57 151 -10 -118
3848 -118 -65 72 255 114 29 -51 25 70 155 -57 -74 -10 17 25 18 -36 -179 -81 -38 -17 -79 -86 -133 -46 86 72 -57 -141
3876 -141 -38 -24 123 129 46 -23 125 57 156 5 1 -10 65 49 128 24 -15 13 -16 -63 11 -205 -107 -29 -59 -16 -69 -8
3904 -8 -76 -14 67 70 42 -104 -31 77 -14 -38 -47 86 -22 39 29 -12 -70 -9 105 -38 -58 -56 -45 14 23 16 -73 -49 90 -1
3934 -1 -42 28 13 -102 -25 89 4 -60 -19 30 -55 12 -61 -33 34 49 14 34 -79 -29 38 -14 44 68 39 -51 -123 96 95
3963 95 52 81 10 95 22 12 -13 -4 21 -61 26 22 -12 -19 -72 -28 6 -6 -153 19 -15 -52 -13 22 -109 -7 43 34 -22 -39
3993c9J04j2oJ6nK8j5k3N2p9ol2r6J19M0r0k5RJ09K4o8q4J07k4R0om4m5k9j3J7
4024b6O0k4l5K6l2K5qJ7p2P5R1j34N7p2k5M8R2o3j3K3K8J7k0K6O2l8J6K5j52J42
4054A16q8j5N1l9J2p2j57J99p7J2PK0j0k0K2O2q2j20K01P4j17Q7j23N6O6j6O3
4081A12P3l9j36J15j19J28m4p8n6J80q4n6j09M3QL8kk1q3j6mQ2N6k5p3N9J9J47
4109A15o6oL6J0kO9j50O8n9k3N1r0K40j49l6r8LN7j50R6M8%R2j65j5R3j12J50
4137GK1n2K9k7O3L0J19j31m1k3j4K04j45j58jN9K22j80r8K03m6j35j9M9p5J05
4163c4n7J17r5k0%J5q4J34J52j6o8l1J8J68r6o8j9N3J4J4n0o9m6k1N8P9k9l6r1
4192a08J15Jp4J2r7J07J41j02P3j41K4J37O5j9j47N4L3L4l5J1l9M5Jm8m5J2m8
$$ plain form
3993 -39 65 53 47 63 58 86 71 48 100 21 15 -17 -113 6 46 -44 -69 -60 49 73 5 -79 28 4 94 88 44 -1 -30 -43 -26
4024 -26 34 10 -25 1 -31 -6 -14 3 -69 6 97 -37 20 -52 -77 -29 63 0 -13 10 38 55 35 61 123 85 101 126 -26 116
4054 116 28 13 64 25 37 -35 -192 7 -70 -58 -51 -31 -41 -61 -39 23 -59 -179 22 96 -21 66 -57 -1 65 49 112
4081 112 185 146 10 125 6 134 90 12 -44 136 52 -4 -113 -70 -62 -24 -26 -47 -130 -146 -150 -68 -12 -37 -110 -51 -32 115
4109 115 49 43 79 89 87 156 6 74 15 -8 43 -47 193 44 8 -90 -87 -30 -180 -84 -36 -36 56 -109 -124 -31 -143 7
4137 7 28 -24 5 -22 41 71 190 59 18 -5 -19 185 40 -118 -119 -60 162 -18 -116 87 41 -94 -113 -64 -139 -34
4163 -34 -91 26 -69 -89 -89 -74 -158 -24 128 112 44 13 31 199 103 35 16 69 83 97 47 -22 -68 -89 -31 48 19 -17 -108
4192 -108 7 8 -66 -54 -151 -44 97 -5 68 -73 -49 88 153 134 -13 41 74 108 73 84 45 90 91 43 -2 10 -38
4219c8j15J62M6j07J1j86Q3J10J01q7k2j7Q7L4J8r5M1qj2lP0M5j07J05j24M8j8
4246B2q5k6Q7O6o8pN1j13J54j55O3j22O5N2Q4o8k7L7k5N9J43q2q5lj6k6R2N1j70
4275e2m3J15k7j22J68l5N5k30Ql65N85l90L45p8k72J014j154M37o48N22j3J71
4297ij65P1J37q7O1l4n1J06P3P3j06m1j33K56j47k59M29q6k27K88j03kj31j3O2
4322c8O8M9j97NJ14L6l9M4q3o3J6J17Q5n3j0Mj2M4k1l2m0J28r1k1M8q0K5o1N4
4351dj8qo5J3N9N8L2j41q7J07Q8j1N9j06q9K48j40O7l8k2MO7J1j08M1j01R6P0
4379H2Rm6j07N6j2K1Qj42O6J7J58j08n4J7M2J02j31P0j09J21o4J63n9lJ58n14
4405b59j15L74m44M6l01R00p14N93l10P37k35m98O1L7K15l44K00P4j94J26J90
$$ plain form
4219 -38 -153 9 55 -52 -41 -227 -144 -34 67 -20 -42 -59 28 62 80 -15 26 18 6 3 73 118 11 116 -8 40 22
4246 22 -63 -89 -2 64 -4 -11 40 -73 81 -74 -11 -133 -68 -16 68 0 -27 10 -15 44 187 105 20 17 1 -25 67 118 -52
4275 -52 -95 20 -7 -129 39 4 59 -171 -163 -528 57 -333 12 -66 -338 676 -478 -41 -689 -167 -180 -9
4297 -9 -174 -103 34 -53 8 -26 -77 29 102 175 69 28 -105 151 4 -255 174 88 -139 149 46 44 -87 -100 -38
4322 -38 30 79 -118 -113 1 37 -2 42 -41 -104 -88 29 114 61 51 55 43 87 66 34 -6 122 31 10 58 -22 3 -58 -4
4351 -4 -22 -30 -95 -82 -23 35 67 -74 -161 -54 34 23 82 -24 -113 135 -5 62 24 2 6 73 84 -24 17 -84 12 82
4379 82 91 45 -62 -6 -18 3 11 -131 -65 -48 110 2 -52 -35 7 109 -22 48 -61 60 -4 159 100 97 255 -259
4405 -259 -374 0 -444 -398 -699 201 -513 80 -230 507 272 -226 -165 -128 87 -257 -57 17 -177 -51 139
4426A39k27R1Q8q7J30L7l52K16J25l2O6j23m3Q5j48L3k3KK4J0m2k0jn3P6P8m6
4453Clm2L8N1K5n1K5r9N6LL7j00L6k7L7J61j92O2p9K4R2p0K9r0Q0J16n7P5kj7
4483A21p3K74k37o7M6j39M5N00k55o79Q9j75L29J77l06L12M19J17k08m61O13l33
4505A09K46m84J60K77p44P01J46l17j8K39j56p1Nq7Q6Q0j84K4K0l1R6q3l0l5J02
4530E1j6oJ6o4J7M9M2j11L3j03M3K8L9l3m8OO9P2J8j28J03k6j27R6m2j06J57m3
4558a4L7K4p0k2M1O0Rj50L4m8O3J02j33Q7o5J6J57j52J35j54m4P8P9q1P5l2p6
4585d4R4r6J03n3L0n9Mj2K1J6J00p0K3O4j92O3n7R3o8L9n4M7l3NN1R1r7K3QL8
4615G8j15R6l9j30N6N4J2l9JL4k7KJo3P9j2M9r8O0j34P1K0pN6J5n5R3P5r0l0n2
$$ plain form
4426 139 -88 3 91 4 134 171 -181 35 160 128 194 71 28 113 -35 -2 -25 -23 1 11 -31 -51 -52 -105 -29 49 3
4453 3 0 -42 -4 47 72 21 46 -53 3 6 43 -57 -21 -48 -11 150 -42 20 -59 -35 57 -13 16 -74 6 122 65 140 138 121
4483 121 48 322 85 18 64 -75 -30 470 215 -464 -375 -550 -221 -44 -350 -38 381 498 290 -171 442 109
4505 109 355 -129 31 308 -436 265 411 94 76 315 159 88 93 6 92 172 -12 12 32 1 97 14 -16 -51 51
4530 51 35 29 45 -19 -2 47 89 -22 11 -92 -49 -21 18 -15 -63 -57 12 84 102 -26 77 51 -76 20 -22 -128 29 -14
4558 -14 23 47 -23 -45 -4 56 65 -85 -51 -99 -36 66 -67 20 -45 -29 128 -24 111 -43 -87 -9 70 -11 64 32 -44
4585 -44 50 -46 57 4 34 -25 -21 -33 -12 4 104 34 57 121 -71 -8 -65 28 -40 -1 -55 -8 -41 -36 15 106 9 32 40 78
4615 78 -37 59 20 -110 -54 0 12 -27 -26 8 -19 -17 -16 -79 0 -12 37 -61 -1 -135 -64 -44 -51 5 20 -35 58 133 43 13 -39
4646c9N8J15j09l%M0n9o4R7q0k8N4q6N1J7K3n5M3k6J61k61J19mnJ8n3J31l8rJ1
4676A9L7o3R4k3j01KJ10r0qN7q9Q6m5o1J66j03P0l1o8j2N4n1M1l8N1M9n7L9j2
4705B3J8m7j12R4L8R0j27o0O2nm2J04n2P5j45K5M0Q4m5k4P2j30K10q7N6j63J0
4732c8J33k6J1M7j38P3j14L7r4R8n8L1K8n8J10m4j19J11rp8N3rL4J3l3R2k6l3
4760fR1p5L7M1j36Q7K0n4L0o3l7M2pJ15r2O6j68Q6M3o0L9p5m7J3J44M7jo6k2K2
4790A4J02q4J2j7Q5j26M4l0L5J4K3p8j6M9j07J27n0R2o4l1LN3j4qOrl8mM6PMN9
4822I9k7l6n5J63q3r6Q5l1M0l4n8R2J16j95o6O3K7kn3P7o6l9N7J23r1j23R9K6
4850A2j2O8r1K0j4j07J39J7J06r8m8Q8l9n5j4O2L7j07lK5q1Q8j7L4O8j47O4k1
$$ plain form
4646 -39 19 134 25 22 22 62 3 -61 36 -44 -72 -18 -104 -53 -36 -13 -68 -25 -51 110 -151 -32 -36 -41 -23 -76 55 17 8 19
4676 19 56 -7 87 64 -37 -35 75 -15 -23 34 -55 31 -14 -75 91 -12 58 27 -41 -53 1 -50 -9 -47 4 53 -4 35 23
4705 23 41 -6 -118 -24 14 104 -23 -83 -21 -26 -68 36 -16 59 -86 -61 -21 63 18 -6 66 -64 146 59 115 -48 -38
4732 -38 95 69 80 127 -11 62 -52 -15 -109 -11 -69 -38 -10 -68 42 -2 -121 -10 -19 -97 -44 -53 -19 -6 -39 53 27 -6
4760 -6 85 10 47 88 -48 39 59 5 35 -28 -65 -23 -30 85 -7 59 -109 -23 20 -40 -1 -76 -123 -110 34 81 80 14 -8 14
4790 14 116 32 44 27 112 -14 30 0 35 49 72 -6 -22 27 -80 47 -3 89 25 -6 -3 50 36 28 34 25 -13 -17 29 36 40 99
4822 99 72 36 -19 144 61 -35 50 19 59 25 -33 59 175 -20 -86 -23 4 2 -51 26 -40 -79 -22 101 10 -113 -14 12
4850 12 0 68 -23 -3 -17 -124 15 32 138 40 -8 80 41 -14 -28 34 71 -36 -39 -14 -95 -7 -24 10 78 -69 -5 -26
4878b6lP2j15P1k4M8p4J37j22P3n8L6N1Q9j26J3J3l9L9j08P6j6n9J24q3J2q3J03
4906B1m9Ok8K5M6m4j5J3M3o3J02j68K35n6p1M1M4r5k6J43j19Pj9rK6NP9j90J36
4935B0j5j22K32j8q9j12J9J6P8J7j43J19P0n8l0O7l0O3J2q8M3l2RO4or8N2j40
4963a00J21J2qr1N1k6J07n6q7M5j8L8L1Lm1k7Q5m5j5R4n2J10q2J8J3K3j53R8K7
4992G5j53R6R7o1n7K1k7n4PoJ50j37j1R5o7J30o8MRr5P0L3k8qq6L2N2K1j4j2j49
5023a41K22m9j02O0o8J46m6k1QK5m8j67J43N1P3j68O4rJ17j5l9p0o1Q1K7l1m6
5050f4O2m3M9O2n3L3n4m0MJ66j24p1J3OM5N9RJ9j43R0Q9j04n6N7n1Q8J4j00pQ9
5080D4K0j8Q2j40o2O7L9J04j98K7N6q7J26q1J20j01r3k1J41j0p6O4L4p9J0R9o
$$ plain form
4878 -26 -29 43 -72 -1 -25 23 -51 86 -36 37 -21 15 66 155 29 42 55 16 55 -53 23 7 -52 72 -11 1 -82 21
4906 21 -28 -22 -50 -25 21 -23 -38 -25 18 -45 57 -111 124 68 -3 38 82 -13 -39 104 -15 -8 -27 -36 -10 -5 74 -116 20
4935 20 5 -117 115 97 8 -104 -85 -69 9 26 -117 2 72 14 -16 51 21 84 96 8 51 19 28 92 86 -12 40 -100
4963 -100 21 33 25 -66 -15 -41 66 10 -77 -32 -50 -12 19 22 -19 -46 39 -6 -21 73 21 131 49 67 80 103 -50 48 75
4992 75 -78 18 115 54 -3 18 -9 -63 -56 -62 88 -49 -60 35 -32 98 30 34 43 -52 18 51 23 15 -71 -39 13 34 20 8 -141
5023 -141 81 32 -70 -10 -78 68 22 1 9 34 -14 -181 -38 13 86 -82 -18 -27 90 75 36 -34 -95 -14 13 -18 -64
5050 -64 -2 -45 4 66 13 46 -8 -48 -44 122 -2 -73 -60 -54 -9 50 59 78 -65 25 114 10 -46 11 -40 48 62 -38 -45 44
5080 44 64 46 128 -12 -74 -7 32 136 -62 -35 21 -66 60 -21 99 -2 -95 -116 25 15 -61 3 37 -42 -32 67 61
5107F1m6k3O4K6p5NN6q6QN9rr9J31j01k0Q4J2q1M4O7r4O3k4j39J13M3J3j27J0
5136f5O3K9oN6N1j23M6m5n7O7L3k9M6J2j08M3m0P0J5j50P0l3O6n7kj7O7m4PRM5
5167A9lLn5j08J64K7o9N2j54J10M4j24J07o5O6JP3m3Qj64J63r2J4Q4q4N7r8k8
5195i5J16j26J13k5J19o6l4j1n5J05j8p1K5l5J29l2o1L0O5j09k2N8J2j02O1Kn5
5222h2L4N4M2j03J51j38J09j22P4r8jN9P2l0N7jk5j5lK5o0p7J24k4N3k5j15K1
5250d4K9m9N7K0n9k6J23J1N1l2p8p9L8M3m9q3R8l0N8k6P1J5j5O4r5J2Qj2J44j56
5280Ik2L3j8k4m5J40r5J32j40o9M8P4j52J23p9R5l2P6n3J2J0Ol0M1J1l4M8n3L1
5309D3j54Q5J40j86J04r0L0m4Q6k3n3M7j26J84o9J4m9L0M9N0j15p0K6J04N5MM2
$$ plain form
5107 61 15 -8 56 82 7 12 68 -18 -10 49 40 -59 72 -29 -49 35 47 -34 10 77 -17 46 22 -117 -4 39 52 -75 -65
5136 -65 -2 27 21 77 128 5 51 6 -51 16 49 20 66 78 -30 13 -27 43 58 -92 -22 -55 11 -46 -48 -65 2 -42 -35 -26 19
5167 19 16 19 -36 -144 20 47 -22 30 -124 -14 30 -94 13 -52 14 15 88 45 53 -111 52 -40 -26 58 -26 31 -67 -95
5195 -95 21 -105 8 -17 102 36 2 -9 -64 41 23 -48 -23 -58 71 39 -22 8 73 -36 -58 0 12 -90 -29 -27 -82
5222 -82 -48 6 48 -55 96 -42 67 -55 19 -79 -80 -21 51 21 78 77 52 37 34 59 -1 -78 46 22 75 50 -65 -44
5250 -44 -15 -64 -7 13 -46 -72 51 62 113 81 3 -76 -38 5 -44 -127 -29 -59 -1 -27 44 59 44 108 13 25 33 21 165 9
5280 9 -13 20 2 -22 -67 73 -22 110 -30 -99 -51 23 -129 -6 -85 10 -22 54 1 13 23 29 -1 40 51 17 65 12 43
5309 43 -111 -26 114 -72 32 -58 -28 -72 14 -9 -62 -15 -141 43 -26 -12 -61 -31 18 68 -47 -117 -91 13 68 72 114
5336A14j56R7p2N4L9l7j10N9J8R1q0n6K3Q5q4M4qj31R3n6J23j18J18j93J04K3
5362a6k7N8q4J30j59L4K5J10r6kk4O0QK8j5k4m9N7rJ9o8M8k9L7n1n3R6J7J22j16
5392B7n1Rn3J61j33j4p2M2R4P5K7j53M8l1n4J21l1q1J03n6M3L0O1q7m0N6J03o7
5420G7n1p8K9m9oJ44l8j7q3M7o5J48l8j5K1OJ9j19P3Pj4L4n2J1Qj30J58k7kk4
5450b6j2J75q9l09J04J81j49N56k08k92l95K94o55Q41K85l13K72o95L14P00j196
5471f17N83n74M08L58n83N75k07k17K17j50M5R3O75k42m28m71L66K75K42n46J54
5492d4O1p64K3P99j00M67n32K80l70j46M73n58M75L98o08K8J25m3p6Q8k6Q0j40
5515a10K36j74J35no4M4k5j43J83jj47k3M4R7k0j16k77P7L08k25K93r0J22o04
$$ plain form
5336 114 -42 55 -17 37 76 39 -71 -12 6 97 17 -39 -16 69 -15 29 21 -110 -17 -73 50 -68 50 -143 -39 -16
5362 -16 -43 15 -69 61 -98 -64 -39 71 -25 -27 -51 9 17 45 30 6 -43 14 5 24 -44 4 -25 12 -39 -92 4 21 143 27
5392 27 -24 -15 -68 93 -40 -54 -126 -84 10 85 112 -41 7 -24 -78 43 12 -69 34 -22 21 51 112 25 -15 41 144 77
5420 77 26 -52 -23 -72 -78 66 28 11 -72 -25 -90 58 20 5 26 32 51 -68 5 12 -2 32 -20 -9 -1 -131 27 0 -2 -26
5450 -26 -38 137 48 -261 -157 24 -125 431 223 -69 -464 -170 -825 16 301 -12 260 -435 -121 579 -617
5471 -617 -34 -608 -200 158 -425 150 -57 -274 -57 -207 -162 -69 606 364 -64 -535 -169 106 348 -198 -44
5492 -44 17 -747 -724 75 -25 442 -90 190 -180 -326 147 -411 64 462 -146 -118 7 -36 -112 -24 -50 30 -110
5515 -110 126 -48 87 82 18 62 37 -106 77 76 -71 -94 -50 47 27 -89 -366 -289 19 -206 87 -3 119 -485
5539d85R93j079N56K51m21J1M39J31m47q8l87M51j1J22m64J05k81P19K97k03p0
5560A39j65K30J64o21L69O8m10M04j23J57l82n4J37N8M1j9l1J4L4pn1J89j67l5
5584f1J29m3J0q5J19Kn5K9R4p6k50K23R7%j07J1m3Pj0N8o2o0N5O4l0l9N5p9L6
5613a1O5m8m0J2M8o6J20j76N9P8j07Q6j7L2l4M9k5n3J1K4k5L8L1ol2R0p6l2m0
5642d5R4j09R2l5k0l1R3N2q0m6L0J08r6J4J2L2o3j9RQ0p6n6J10l1L7j6m8Q8n1
5671B9rm1O7qn0J01j09j6N5K4L7L5j64M5j49J48P1n3L6j7q4R6m8L0J7O0q1k6L6
5700C2r5J02m1p8K2J12K4j84M7M0O8q9l4Q0k5L6l9L6j4MM3N1j14K5m8l5kJ51q3
5729hq2N5j2L2k1k2K0J8lN9M1q8k0NP9p1Q0k6J5l9PN7j37O2P3j09M6lO6j11J19
$$ plain form
5539 -485 508 -571 -15 236 -185 -174 265 396 -51 -139 -526 -75 -86 36 -428 -323 -604 115 412 209 139
5560 139 -26 204 368 -253 116 184 -226 178 55 212 -170 -224 -87 -29 12 -7 -38 -24 10 3 -48 141 -26 -61
5584 -61 68 25 35 -50 69 71 16 45 139 63 -187 36 133 133 26 37 -6 1 -9 49 -13 -73 -18 46 16 -23 32 -47 -11
5613 -11 54 6 -34 -22 26 -40 80 -96 -37 41 -66 20 3 35 1 50 25 -28 -17 7 -18 20 51 45 13 103 27 -5 -45
5642 -45 49 -60 32 -3 -23 -54 39 91 11 -35 -5 103 7 21 33 65 2 -17 -8 72 -4 -60 50 19 56 40 -8 80 29
5671 29 20 -21 46 38 -12 89 -20 -36 19 43 80 115 -49 -4 -153 -5 66 13 49 32 -52 44 -4 26 43 103 22 -4 32
5700 32 -63 39 -2 -80 -58 54 78 -106 -59 -19 49 -40 -74 6 -19 17 -22 14 0 4 47 98 -16 9 -39 -74 -76 75 -8
5729 -8 -90 -35 -47 -15 -36 -58 -38 -20 -23 36 77 -11 -31 -26 53 -18 62 36 51 12 19 76 -61 1 74 -35 11 8 74 -37 82
5760H2q7k0Q8o8r6J13N0q6O3J0p1N2J8j11O3k1N1r1O8o5R4o1m9K9N9L6n4o6J08
5789C8n1L1N3o3N4J5j07P6n0j3L9k0p8J01M1k7L1j55P7PNj18J02n2o0J53m9j2
5817c2mqO6n9P1l5k7J58j44j8l0J05nM8o3k7q1J20j07Q1L3j4q4N2R6o0l8k3P9
5846E0j32O1L3j13K9M9p6R7L0K3j22L4k9lK0o4N8J34j03Q0Jj8n9o4P6j9L7l0l3
5875e3n6K7Q5j6J34j94R0K9k1m1J0m8K8k1K3R6r6N0Jj5M1q7j4J10o9K4q4o7J65
5904C1M0o2j24K4P7l7l1j4J01j1n3N3J7l7N2m7qN9N6l6K2kr9J02lj23N9K5o8R7
5934F0p1l3M4M8N5j21Ok0K5p8J08J3M7%j12N4o5r5J53N1n5R0j89oQ5K7q8J27j21
5963f1O5P1m1K3r5O5n0l6J1P7m8JQ6o3rlL6N0k0j12O1J10n0p5M3k4k7l9L9NK0
$$ plain form
5760 82 -5 -25 63 -5 -101 12 62 -24 39 49 -22 30 48 -63 0 -21 30 -61 7 -58 36 -25 -74 -45 14 50 -4 -70 38
5789 38 -13 18 71 8 62 77 -30 46 -4 -17 22 2 -76 25 66 39 70 -85 -8 -1 4 -114 -12 -64 -124 29 -20 -32
5817 -32 -36 -44 22 -37 34 -1 -28 130 -14 -32 -62 43 38 86 23 -4 -85 35 -72 9 42 28 -56 -4 92 32 -6 -29 50
5846 50 -82 -21 12 -101 -72 -23 -99 -2 28 51 -71 -37 -66 -69 -49 -113 -55 79 -24 56 57 39 -20 -84 -8 -27 10 -20 -53
5875 -53 -109 -82 3 -13 121 -73 17 46 25 -16 -6 -54 -26 -47 -24 72 -24 26 27 12 53 -34 -48 62 -7 17 -67 -134 31
5904 31 71 9 -115 -91 -14 -51 -82 -96 5 -6 -59 -6 11 -26 26 -21 -29 30 86 50 72 70 -29 73 70 -53 6 31 -37 60
5934 60 -11 -44 0 48 103 -18 -12 -32 -7 -85 23 36 83 83 -29 25 -40 -135 18 69 14 104 -85 -91 -6 21 -67 60 -61
5963 -61 4 75 34 57 -38 27 -23 -59 -48 29 -19 -18 68 5 -4 -7 29 79 59 -53 8 118 68 -7 36 12 -15 -54 -15 -10 10
5994A0rj2OL9N1n7J6j15O9J7K0q0j10J63J7r2J18p8N6Qr2j6R9k0O4J09k02K8N5
6023F2o3Q1j36M1j8m6mJ4J41p6Q6j05L8m7P9J01k68J91r6J38r4o7K6L4J6n0J17
6050I5j71j5J53m6o1J01J7j52J85l1jj45J06p2R8K5j31O7j3O4o5j00j0M3L9O0
6076D0j00K5j0K7m2K7J5j9O1m0N7q9pk0L2N8K6q2R1o4K1N0o4J1p5J20r2P0L9j15
6106d9Q8q8J71j04J9n5l7O9k7J03p4K7o4jk6oO5Nl4m5L4L1oN3n1O2q3k8P8q6R5
6137C6j5q5L6J6l8Q2q0O4KN8Ql7j49O4R4n6O6p4r2J53r5l1Q8Mm5q8J09M9q0N2
6167A6q5Q2r5J42p0m5%J1l9L0N0J08r1r2Q2J8LK3m4Pj0N8qj7k3N2r4M0J10j20
6197am3j2K2J22j44%L9J36k08M5M3j26K57j64K8N4k5q7l5M3m6J71n2p9P0L2J2
$$ plain form
5994 10 1 -11 -5 34 85 28 44 -71 -2 15 35 -45 -155 8 25 -67 51 -27 29 37 -55 -71 28 8 72 181 -21 7 62
6023 62 -1 80 -56 -15 -33 -79 -83 -69 72 -4 82 -23 15 -32 47 148 -120 71 -25 113 19 -48 -22 12 28 -22 95
6050 95 -76 -91 62 16 -45 56 73 -79 106 75 74 -71 35 -37 61 86 -45 22 9 73 8 -92 -102 -59 -20 40
6076 40 -60 -35 -45 -18 -60 -33 -18 -37 24 -16 41 -48 -55 -75 -43 15 41 -41 50 -14 7 57 -7 4 -71 49 -43 27 66 -49
6106 -49 39 -49 122 18 37 -18 -55 14 -13 90 16 43 -21 -22 -48 -54 11 16 -18 -63 -29 2 -4 49 -2 60 -23 -51 27 -59 36
6137 36 21 -64 -28 -12 -50 32 -48 16 18 76 84 47 -102 -38 56 0 66 -8 -100 53 -42 -73 15 19 -26 -114 -5 44 -36 16
6167 16 -69 13 -82 60 -10 -55 -55 -44 -83 -53 -3 105 14 -78 4 22 25 48 4 11 1 59 51 34 11 63 -31 9 119 -1
6197 -1 -44 -56 -34 88 -56 -56 -17 119 -89 -44 -1 -127 130 -34 -6 48 23 -64 -99 -56 -102 69 17 -62 8 40 52
6224E2o9l8Q3m0P9j03N3J03j46rKQ7L6m4J4r6N4q4J10q6M6K6o9O9k0q8J26o2k0
6253c4j6J14j01k5Q6j43K2N9O0m1P4ol4op1L9R4n6J5r7R7m0j1M7L6O3j37O4m2
6282A0j5N4j5J5K8l5q6j6Mm0M6r3J22J6rO8j77J09k8P5j9o6J13q9J22k11J86j13
6310d4K0L9N8n3Rm9NjP3o6N7J8r2M4m4R1J3q7K4m8O6m0p1N0P4k7m2j7j2O9K1l8
6342@l6J5rr2J02j7M6r5N5J59o9r2k5Q3o5O4j6q4J73pr3K05o3k03N4k7R4j55R4
6371dn4P7M0M3j33o6R3j09J60l5m6l7K3N5N1m9J4qj14J05k9Rm2N6OQ3m4l5m0k1
6401e1l1Q6M2L9j31O0q7L0O3l9O1q0M5l2l7L9J0j8L9j8R4k4n4O2p9jr3K05l9j04
6431d3Q5m1k9J8M0L5m7K4Oj04K9J48j05P5p2Q0j68J51p9p6O5lM7n8JkJ33j65M2
$$ plain form
6224 52 -17 -55 28 -12 67 -36 17 120 -26 -35 -33 54 90 46 60 -36 18 -66 44 -42 4 30 -39 30 10 -78 48 -14 -34
6253 -34 -50 64 -37 -62 24 -119 -97 -38 22 -19 55 49 15 9 -62 -23 71 15 30 -67 30 -10 -21 26 62 125 -12 52 10
6282 10 -5 49 34 49 77 42 -44 -60 -56 -96 -50 -143 -21 -5 -14 54 -123 -14 -42 33 14 -52 61 -28 94 -117 69 -44
6310 -44 -24 15 73 20 29 -20 -15 -16 57 -9 48 66 -26 18 -26 65 78 -9 15 -33 33 -7 -78 -28 46 19 -23 -40 -52 17 38 0
6342 0 -36 -21 -30 -122 -20 -37 9 -86 -31 128 59 -33 -58 25 -40 24 8 -76 97 90 -3 202 139 -64 -10 -37 57 -98 -4
6371 -4 -58 19 59 102 -31 -97 -4 -113 47 12 -34 -71 -48 7 58 9 23 15 -99 6 -23 -14 -56 0 6 89 45 10 -30 -51
6401 -51 -82 4 46 85 -46 14 -73 -43 20 -19 42 -38 7 -25 -62 -23 -13 -31 8 -10 84 60 6 68 -11 -12 -105 100 61 -43
6431 -43 42 1 -28 -10 30 65 18 42 48 -56 -27 121 16 91 19 99 -69 82 3 -73 -8 -11 36 -22 -21 -23 110 -55 -13
6460a3J00j75J23j10J37o9J3M3l2PP6q4q7J42j55J26p8N7j2N9j96J13pr3J54n9
6486b0O4m8o7lJ66r9N3p8jr0O6O6n5Q7J9o6j18K01qq8l8l8O6J40j10Jl7j6Q9M0
6516G8r4M7P8m9p7L9q2K0p7J11M8Kn8Jn2J27k1q1O9l1Q7l6j10J04m7K1m5M7o9
6545e0N6p8J11k6J0pq8Q7j7L7mj1r2O7pN1o2J3Q1j96J66m5OM2q7P2j7N5r3J9l0
6576c7O5Rm3O8o2M1mo7m0K3O7jn0k1J05k1n5k2%L0j6l0kL4L5o0lQ4N9j08%rJ10
6609G9mm6L1o4L7O2n9o4K3M3p4O6Jj43J74l7kj37%P9NQ3L2j24J74n6r4M2j06J56
6639G7J1m3j9j5oO0j2m1l7M7k3P2n5n9L9k4L1M5j2K4o2l0K6N1kJ2o4M4p3O6q0
6670e2RL6l8N0Q1r8Q2k0j7j18K0P2k8M9j00O3J3Q7q8k6j1N8o6K6jJ15j85P3k6
$$ plain form
6460 -13 87 -88 35 -75 62 -7 6 49 17 24 100 16 -71 71 -84 42 -36 21 9 68 -128 -15 -22 -115 39 -20
6486 -20 44 -4 -71 -74 92 -7 46 -32 -33 -123 -57 9 -46 41 60 -6 -124 77 69 -19 -57 -95 -29 111 1 2 -35 -51 38 78
6516 78 -16 31 109 60 -17 22 -60 -40 -117 -6 42 44 -14 -13 -65 62 41 -40 29 -2 85 49 -61 43 -4 17 -28 19 -50
6545 -50 6 -72 39 13 23 16 -72 15 -2 35 31 20 -72 -5 -12 39 -23 -10 71 -125 41 -4 2 44 -43 29 12 67 -26 -7 -37
6576 -37 28 37 -6 62 0 41 37 -30 -70 -47 20 19 -31 -52 53 32 -23 -45 -45 -15 -31 -61 -63 -29 6 -54 -57 27 86 -22 -22 -31 79
6609 79 75 29 60 -4 33 95 36 -28 -5 38 -36 30 31 -112 62 25 23 -114 -114 -35 -30 53 85 -39 135 79 -15 27 -79 77
6639 77 88 45 26 11 5 65 53 12 -25 22 -1 71 16 -43 -4 -28 3 48 36 60 -2 -32 -6 45 43 55 -9 35 -38 28 -52
6670 -52 -43 -7 -45 5 86 -12 70 50 33 -85 -65 7 -21 28 -72 -9 4 91 3 -23 -34 24 -42 -16 -17 98 -87 -14 -40
6699d0m9N1nO1N5l6l2Qj5o1O9N2r4RK8Nlj17J40L3j23J35o4j0N0n0j3N4o4j05
6729a31L02k69J53Q2j23L7%mN4j25K9k3j5j6O6N4n4j8j12J47r3P7m8J54j63N9
6755B0L5j25J50o1l0LK9l4j1P7m8QK0J7n4qoL2J13j51J40j47M4o7M7K5k9J1n0
6784e0P3K0k9l3L8M1l5J27j52p8M4J09q9P7o0P4m2M4m7o7P8j53J38j1n9K0N5n7
6812b4O9m9mo7L4J3nP0j08N4j1P4k1L9j43K17Lj22L0o9PQ8K0n0n9n7Q1n0M7o8
6842f1J14o3l2R4o5L1m1q0P4M7m0O8l7l8N2Q8j10J19o2m0JP3j48N4N7r2M0Nn2
6871d4J67j02o7J43o0r5m5K3L4R2q1J9j6J12K0k16K08o8k9pL0O5J5j03o8J42l7
6898C2lj1L8q0J32j84K02j10r1L7LO6j50J41n8N9Pj9p2m5J03m1j4J10q2J10j07
$$ plain form
6699 -40 -89 -38 -43 18 73 37 5 13 -2 -63 6 58 -36 -27 1 6 3 -114 26 59 -64 71 7 -3 47 -3 -16 38 -26 -131
6729 -131 171 -98 55 137 14 51 51 47 101 -24 5 -18 -33 -49 17 71 17 -1 -113 34 -59 18 -30 124 -39 20
6755 20 55 -70 80 19 -11 -8 21 -13 -24 53 5 13 33 50 -4 -12 -18 14 127 -24 116 -31 13 -54 -7 18 -11 0 -50
6784 -50 23 43 14 -19 19 60 25 152 0 -78 -34 75 -14 63 3 77 35 79 32 -35 43 -110 28 17 -42 -22 33 -24
6812 -24 45 -4 -8 -75 -41 -28 -33 37 -71 -17 -28 46 25 64 -79 138 141 19 49 -20 -13 75 95 45 -14 -71 10 -40 7 -61
6842 -61 53 -10 -42 52 -13 18 -23 -103 -29 18 -22 46 9 -29 23 111 1 120 58 18 19 92 -56 -2 55 -37 3 8 -44
6871 -44 123 21 -46 97 37 -58 -103 -80 -46 46 -35 -16 -32 80 100 -116 92 24 -5 -12 18 83 98 -5 -73 69 32
6898 32 29 18 56 -24 108 -76 126 16 -75 -38 -35 31 -119 22 -36 23 30 11 -61 -106 -3 -44 -58 52 -30 80 -27
6925b7Q8j15Q7m7l7J12L2j06kj3Q1JK9o5p5O7J3N6j27L4l9j5O7j2L0M5j06JO1
6954A8Q2j30m6L8J06q5O8l0o5J24M3j20n2o7L6N9M0p9K1l4K3m6O3j13M4l0M3J71
6982H2n4L5oNj20J06N7l7j75M8L9J32q9j5k4LP9j63J34o3n5P2L1o4J05j25P3K
7010A3j3j02J33l5J0m8J7J26q8N1kk5q2k1J27m8m9M4L3j3pm7J21o6j14M8k8O6
7038Am1m0l8J11m0P8pn7l3k7J40j9j16J30l0M1K5j0j38lJ00j5M0k5n4J3m0K4p7
7067a07J92n7n7l3J9L7M0m3M4q2O3R7j87Q3j00J14Ol7J05j26M0j6L4om1M3qmR2
7096A05p1K7j27J13j2K6j03k0P5j06J05J1l0Pj2K8O4p6L3l9lj8P3r2J04j15J06
7123E3j13J28L6p1M4q3l1l7J09j34J17N2m4j85J01L0O9P8j68L3Pl0N8l0M8pr7
$$ plain form
6925 -27 61 -54 33 -14 -51 61 93 -13 -15 -28 53 54 83 18 -57 10 23 79 -48 -14 -53 -68 -1 -13 17 62 -44 -43 18
6954 18 100 -30 -76 -38 68 -17 51 21 -44 80 123 3 -49 -116 -80 -21 19 -60 -39 -73 -50 -96 -33 -146 -102 -132 -89 82
6982 82 28 63 57 62 -58 48 105 68 -107 -59 -20 112 23 8 -16 -13 66 -97 37 -26 -81 -9 22 -42 63 -62 11 13
7010 13 0 -102 31 -4 6 -42 -25 101 13 64 62 37 -45 -66 61 13 -36 8 41 28 21 -26 95 29 -85 -37 -65 1
7038 1 -40 -80 -118 -7 -47 31 24 -33 -66 -93 47 28 -88 42 12 53 78 68 -70 -73 27 12 52 27 -27 -14 -54 -30 -107
7067 -107 85 28 -29 -62 -43 -6 34 -9 35 -47 16 113 -74 9 -91 23 29 -8 97 -29 11 -5 29 23 -18 25 17 13 105
7096 105 34 61 -66 47 35 61 -42 -62 13 -93 12 23 -7 0 -12 16 80 4 37 -2 -5 -23 50 -42 62 -53 53
7123 53 -60 68 104 33 77 -6 -37 -74 35 -99 18 70 26 -159 -58 -28 41 119 -49 -16 -9 -39 19 -11 37 30 -67
7150f7J43n9j3Op1Q5m9m3J01p5j4O7nj3J20j32MK7j44J51p2O7j32J11R4n2K1n1
7178EK5j42L0N6N0k7kL0q6P3M5n3R3o0j16J15k5rm3m5J64o8K2j6O%l5k0P3Q3j51
7209b8k1J59k7Ml8k0l6P2p7J67j07j54J02l7P1QLj25N3L2QK6Oj22k2P7O5m5p8
7238h4N3m6Q0O7n4p3r6K51j33R0j2J0j51R2oJq3R3PP0p7l0N8q9J18r8N7j3l9o
7268d3M1o3J26j78J91l6j5O1j15M3p9P4l0M8o7M8k9Q7k8l1O6j96N0J13J2j07K0
7295c7P2M9p6O0p4jL7o0R0q3J0J23n2j17Q9p4k7J11j04J24j33J31o0n8J09Lj08
7322e6J04j28Q8J25j39p0Q6M5j6j03Jr4J39j9l8J22q1J27j49J48k7p7mN%O6q2
7349b7N1J11k47J25J2lm6P0L8N2k2k6j15JM6O2j67kK0J58q1k0J31q0l9JlRL0j9
$$ plain form
7150 -67 76 17 4 10 -61 24 -25 -68 33 -42 -56 11 6 -7 113 -19 -15 12 -132 19 -53 14 -118 -7 87 35 56 5
7178 5 30 -112 -82 -26 24 -3 -5 25 -61 12 57 4 97 37 -79 36 11 2 -41 -86 78 10 32 16 22 22 -13 -33 40 123 -28
7209 -28 -49 110 83 87 49 29 -7 65 -12 155 48 -106 -4 -41 30 38 41 -84 -31 1 9 35 41 -81 -103 -26 39 -6 -84
7238 -84 -31 -77 3 70 16 -57 -153 98 -35 55 43 53 -98 -6 -12 -11 -94 -1 6 76 -1 -31 27 -62 56 -42 15 2 -37 -43
7268 -43 -2 -65 61 -117 74 38 23 84 -31 12 -67 7 -23 25 -42 6 -23 64 36 5 71 -125 -75 38 50 -57 -37
7295 -37 35 84 8 68 -6 -7 30 -30 60 -23 -13 110 58 -59 30 -44 -71 40 -64 60 -73 58 -2 -60 49 52 -56
7322 -56 48 -80 8 133 -6 -76 10 55 39 -64 -63 -157 -18 -37 -75 47 -34 93 -56 92 65 -12 -16 -11 -11 55 -27
7349 -27 24 135 -112 13 25 22 -24 46 84 136 114 88 -27 -26 20 82 -85 -87 -67 91 10 -10 121 41 2 3 0 9 39 20
7379B0j27J71M6j07P2n1j13L4k8J37kr7O4o0J3J31j92Q3J9Q6K3j04oL9r9J20Q
7406H0k08J78r3n5O1J2q5JJ08J08k5kk09J91n2Njk7j20J53m6J31j44Pl7O7J39
7433A37o6r7m7NJ24m2K7m1n9O0J0j5o7Q0k2P3n0J4j3o7M6j1L2l8K4q3J24k4L1
7462D5p2n9O1RQ3j38O6P9m9J1J9J7j48K0J52J6n4j17M4J9j20J43o5Kj5J30o5L7
7490E1r5J09j68OJ91j74R2j52J27L4P3j26k6O7m8J59j4r4J8p1J15O3j42Q0J1k1
7516F5M5J9p5j30R1q4L7P3k6M3QJ0m7o9L3K8k6N0K1r9n9j2K03o3M7j31p3K13q5
7545GK1%p1J1M1k7k7L8J01q7Pn1J06j49P4qJ6R9n0j55J04q8J35l7l9L8mMr4O1
7575b4P9J1m1j3n3j1N7P8j09Ln9Q9k9K1Q1r0Q3j29P1O0o8J2L1m6J56j63N7P9j64
$$ plain form
7379 20 -107 64 110 3 75 24 -89 -55 -83 54 52 -45 19 -41 -28 103 -89 -6 13 99 122 18 12 51 -48 72 80
7406 80 -128 50 -43 -98 -37 -25 -110 -109 -1 107 82 80 -129 62 10 15 14 -13 -133 20 -26 105 -39 -32 -69 -2 137
7433 137 71 -26 -73 -68 56 14 41 0 -59 1 11 -4 -71 9 -13 60 10 24 11 -56 -10 -21 11 -27 -3 -86 38 14 45
7462 45 -27 -86 -25 -16 67 -71 -5 74 25 36 55 72 -76 -56 96 112 58 -59 -15 4 -116 27 -38 -36 -51 79 14 51
7490 51 -44 65 -103 -97 94 -80 12 -140 -13 21 94 -32 -58 9 -39 120 106 12 30 -41 74 137 -5 75 86 65
7516 65 110 129 54 -76 15 -69 -32 41 15 58 66 76 29 -40 -7 21 -5 45 66 -33 -92 -104 99 36 83 -48 -121 92 7
7545 7 28 28 -43 -32 9 -18 -45 -7 94 7 14 -37 69 -80 -6 -14 2 101 51 -104 0 -88 47 10 -29 9 5 9 -85 -24
7575 -24 55 66 25 12 -41 -52 5 83 -26 -23 -82 7 -22 -1 80 -10 73 -56 15 75 7 19 50 4 160 -3 54 133 -31
7604c1j8J9k2J45l6r9J3O6m7m6K00k17L2J02j00L7m5O0j38Q9R6n3L5m7N2MmP4
7632A21r4j32R7K5O4j2k4o5J31j33r2J5J29K0N3j40p2J10k3o6K6j2M8R3j65R2
7658fR7l5o8jj2J8R9j27j0K7%R6o3K9k7rNQ9o3r4L9l2M4o6M2N0NJ03j66L9N7k9
7690C1j2j8m9j7N5R0p8J0j19R3k7N8k5O9J9p9J01k1m5m7lj00M2l3j2L8J25oM5
7719H5j58Q1l1K0jQl9pO5l6M7R9m9r3K9o4MN0M2j03N3j9K3l6K0j2K3m7n6K52j75
7750b5K9k3o4N9Q7n3M2l0R4j96J81j12n9J22K3n8j9j8j36R8O2L5k3R6j18P7p6
7777ej7M9p1P4r8Q3n1l7P0n2O2Rj05L6M7j01Q4o3N8Q4j80J30J3J6k7Ko3L4Ql3
7807d4N2M2n9m5P1r1J41%j05R1j42J01J7N4p9O5J0oo4K2j2mJ8l4j19O2J10l0j3
$$ plain form
7604 -31 -49 -30 -52 93 57 -42 -29 37 -10 -56 144 -73 -41 61 -39 -2 -47 13 -125 -36 60 7 42 -5 47 51 47 121
7632 121 27 -105 -8 17 81 69 45 -20 111 -22 -114 -99 30 50 103 -37 -109 1 -22 -88 -62 -74 -26 67 -98 -6
7658 -6 91 56 -12 -13 -25 -7 92 -35 -45 -18 -18 78 15 44 17 8 13 102 39 -55 -16 -48 -4 -70 -28 22 27 130 -36 3 60 31
7690 31 19 1 -48 -65 -10 80 2 12 -107 -14 -41 17 -8 61 80 1 102 81 36 -11 -14 -114 -72 -105 -117 -79 46 40 85
7719 85 -73 8 -23 -3 -4 4 -35 -42 23 -13 34 133 84 -9 20 -44 -40 10 52 -51 2 -17 6 -30 -10 -22 1 -46 -102 150 -25
7750 -25 4 -19 -83 -24 63 10 52 22 116 -80 101 -11 -70 52 75 17 -2 -20 -156 -58 4 39 16 112 -6 71 -5
7777 -5 -22 27 -44 30 -68 15 -36 -73 -3 -55 7 16 -89 -53 -6 -107 -23 -86 -28 56 -124 6 19 35 8 10 -53 -19 -11 -44
7807 -44 8 50 -9 -54 17 -74 67 67 -38 53 -89 12 29 83 4 69 79 73 9 31 19 15 33 -1 -120 -58 52 22 9
7836INK7p4K0L3n9M6K7q4J6o3P6N7nOL4Lm7pJ8j18O8l0M1M5q5J34lp0j6O3kj38
7869g3P1j1o4M8l9j0K7N4k2K5p6O8qJ3M8j85O5N0L7L5l0P3n3L2j42J93j53L5N9
7898F7o1K4Mk8p3Q8j2k8L9m3L9l6M4n2P0j6k2O2L2j17L3q5J24k3J11j19j06K2
7926f2p0P7R6jk6r4O9R0j45P6K0m3O3k2r0M3k4L8R2m6j38J08o5N1Q9%j59Q7N2
7955F6P4k36O7J34j29k4N9M5l4j1K6L7j15P1n2j18J35j6J03J9j41P4K0qn2o6L
7982f9p0O3Q2M1p7O6o0J35q8K2p8Q1J8K4j76P1J8q5J05J3r1Q5j2K4j3J6p9j22
8010a56J40L8j00J56Pq9JL2J6k3k0kP3J13j43l7N4o1JJ3L1j09J49j94J84l4K3
8037F3m1n9J21l5p0P7m6M8j9l6m7L7M7p9J9L9j5l1MJ93j83j2J29k03Q8N5n8q3
$$ plain form
7836 9 14 41 -33 -13 20 -39 7 34 -50 -34 -97 -21 36 31 37 71 74 27 20 38 -80 -12 -42 -1 44 -41 93 90 20 4 67 65 -73
7869 -73 -2 -13 -77 -29 -68 -78 -51 3 -19 6 -70 -2 -10 3 51 -134 -69 -19 18 53 23 96 43 75 -67 126 -27 8 67
7898 67 6 30 34 6 -67 21 9 -19 20 -23 16 -20 24 -28 42 26 4 66 98 -19 14 -71 53 30 141 22 -84 -62
7926 -62 -132 -55 41 40 14 -80 -11 79 -66 10 30 -13 50 28 -62 -19 -43 -5 87 41 -97 11 -54 -3 86 86 -73 14 66
7955 66 140 -96 -29 105 -24 -48 11 56 22 11 37 74 -41 30 -22 -140 -5 -21 82 101 -40 34 54 46 -6 -72 -69
7982 -69 -139 -76 6 47 -30 36 -24 111 23 45 -33 48 66 90 -86 -15 3 -82 23 36 -55 30 18 42 29 45 -34 -156
8010 -156 -16 22 -78 78 85 -4 -3 29 45 22 2 0 73 186 43 6 60 -1 0 13 44 -65 84 -110 74 40 63
8037 63 22 -37 84 49 -21 56 10 58 39 3 -44 -7 40 -39 -20 19 4 -27 -23 170 -13 -25 104 -99 -11 44 -14 -97
8065i7J27q5K0R9N9j32o7J87O8j37n0K8NL0n7qq5J17M5q3J0M1j19P5N4q7O4M0
8093F2j18j2Q8p4J09N2K2j87K5Q5p7N5J5k8L4j11P5N6o1m6J9K2n8j07K76j09J14
8120A21q2J8n3o8R4K6p6L7j14J47n0%Lk5O5j22J02O1k2o0o0P7n3m2K24k14Q8K0
8148D2j2o5J57j04k9R5k6m6P1j2o1l3N0l6l9P9N1j20N6l7J9M9l8MK1L4j01nL2
8177dk1o6N5P3j3q7K0MM4j9o3M7Q6j8
$$ plain form
8065 -97 30 -55 -35 64 123 -9 -76 111 179 42 -8 20 25 55 -2 -10 -95 22 67 -16 -6 35 -84 -9 45 -42 22 62
8093 62 -56 -68 20 -54 55 107 129 -58 -33 52 -25 30 45 17 51 -60 15 71 10 -36 -17 5 -53 -160 116 7 121
8120 121 39 57 4 -64 30 56 -20 17 -97 50 0 0 3 -22 43 -79 23 84 62 2 -58 19 -34 -76 148 -66 22 42
8148 42 30 -35 122 18 -11 84 58 12 83 71 10 -23 27 -9 -48 31 82 -38 18 -19 0 49 11 15 36 70 -31 -36 -4
8177 -4 -25 -91 -36 37 24 -63 -43 -39 5 -14 -77 -30 56 38
8191C8
$$ Imaginary data points
##PAGE= N=2
##DATA TABLE= (X++(I..I)), XYDATA
0@%%%%%%%%%%%%%%%%%%%LpQqJ2j6J6j6J6k0K4k4K4k6L2l8M0m4M9n3N8o2O9p7Q3
44D3q9R8j08J16j28J43j58J73j90K13k38K69l07L50m05M79n74P00q81J145j555
65i04K246l541O424j5146Q5021L72199l47224n23819J51752L58273p5867k34633
77b25219J8022R8980J0293K823l2745p0371R5867J90631o3506k13709Q4995K74460
89A70521k3938k33721K7482K37549N2414j48842r4770L4508J07501J00649n6650
100A72703k10089p0015J80557J07987j53088j42177O8311Q1340o5921p4772L3998
111g1166O5524P974n9258o9189L1639J22055J8373j32761m0625J47839P1065j35730
123d4260p5788J35375J03637q2897p6725N0889L1256m2116K0801O7086m4521j05706
$$ plain form
0 0 0 0 0 0 0 0 0 0 0 0 0 0 0 0 0 0 0 0 0 3 -4 4 -4 8 -8 8 -8 8 -12 12 -12 12 -14 18 -20 20 -24 25 -28 30 -32 37 -40 43
44 43 -46 52 -56 60 -68 75 -83 90 -100 113 -125 144 -163 187 -218 261 -313 387 -494 651 -904
65 -904 1342 -2199 4225 -10921 74100 446299 99075 -424744 -272992 85281 9414 -225219
77 -225219 -207197 -108217 -97924 -95101 -127846 -198217 -102350 88281 24775 -188934 -103939 170521
89 170521 146583 -87138 -59656 177893 230307 81465 -13305 21203 128704 229353 172703
100 172703 -37386 -107401 73156 181143 28055 -114122 -45811 35529 -30392 -105164 -71166
111 -71166 -5642 2332 -56926 -126115 -94476 27579 45952 -86809 -127434 20405 91470 -44260
123 -44260 -120048 15327 118964 36067 -40658 10231 41487 -629 20172 87258 42737 -62969
135f2969J3421R0254n24o0945Q167L6032l1301l5318L8989M6964j3750l0171r878
148a1029r540Q748M0176J848n6220j0036O1387R846o6674p942P3327J6683o0569
161i995j4789L2969j4541k7427L9808L3359n3003m8257L7085L9734j3734k242
173a033K2405j4014l1320J4317L1528O07n117k500l2546k1505M4860L9068m2633
186B117m1928L8411L3053l9575k4152L8788J6049k9844j701J6311k8767k2105
198d3343M8637L7682m6190l8747L8720L1372k7077q145L9846R438l8932k0041
210a6780J6805J9765J3440o223m0806k5642L8907L9606l4243m3616L0262L9078
222C0553l3553m3666K4458L9582j2553k9085o29O443J0J0109P032r060L584J8970
$$ plain form
135 -62969 -49548 40706 40182 -20763 -12596 23436 -7865 -43183 -4194 42770 29020 -1151 -11029
148 -11029 -20569 -11821 28355 30203 -26017 -36053 25334 35180 -31494 -39436 33891 50574 -9995
161 -9995 -24784 8185 -6356 -33783 6025 39384 -13619 -61876 -24791 14943 1209 -1033
173 -1033 21372 7358 -23962 -9645 21883 22490 17373 14873 -17673 -39178 5682 44750 2117
186 2117 -39811 -1400 31653 -7922 -32074 6714 22763 -7081 -8782 7529 -21238 -43343
198 -43343 5294 42976 -3214 -41961 -3241 28131 1054 -7091 32755 42193 3261 -16780
210 -16780 25 19790 33230 27007 -13799 -39441 -534 39072 4829 -38787 -8525 30553
222 30553 -3000 -46666 -22208 17374 4821 -24264 -24893 -18450 -18440 -8331 -1299 -10359 -6775 12195
236A2195q400k6725J6662M7642N83m4021j4620K4004J5018k418k052p495j2425
249b052M837J1671r278q459J8193P778l0176k0374K3858J9277k0943j7030J4480
262h218O068j8442n670J7247J0405l131j672m507q873Q994K1834J108j7071l713
276e641P047l009j824J4622P696j5214j0036R298O116m080L972P507j0139j5583
290i268L943J0321n003n142P736K12j4914m790J5449J0211n028l230N56n098k347
305f392Q202O446m289m153j231o310k858J2408J0528q455j0822L711M950n108
319c373j93R917L83j3307o667N405L943R06M785J198p926l279Q828O679q55K636
335I080K813p449p915N591R327j909n130P3l030n711K817Q373L38o589k935j798
$$ plain form
236 12195 3795 -22930 -6268 41374 41957 -2064 -16684 7320 22338 19920 17868 10373 -2052
249 -2052 2785 14456 5178 -3281 14912 22690 -7486 -27860 -4002 15275 -5668 -22698 -8218
262 -8218 -2150 -20592 -26262 -9015 1390 -1741 -3413 -7920 -16793 -7799 14035 15143 -1928 -5641
276 -5641 1406 -1603 -3427 11195 18891 3677 -6359 2939 9055 4975 8947 16454 6315 -9268
290 -9268 -5325 4996 -7 -5149 2587 2799 -12115 -16905 -1456 8755 3727 497 1053 -4045 -6392
305 -6392 1810 8256 3967 -186 -1417 -7727 -10585 1823 12351 3896 -6926 -3215 1735 -3373
319 -3373 -3566 6351 6734 -6573 -13240 -7835 -3892 -2986 1799 2997 -4929 -8208 620 7299 6444 9080
335 9080 11893 4444 -3471 2120 11447 9538 4408 4481 1451 -4260 -1443 6930 7268 679 -2256 -4054
351d054n233L76P658N30r629n785L420J946o00N479O615k241n328J621O531M785
367F091L317J250l740l808K599L436j59K250M177l525r436j420Q100M198m932
382H398o005m295m218k038K138J156l747n037k464l66J931M574L532p12j530J140
398g543J778J784M096M634L93k144J53J452J227M403P146Q86p950n901L800O496
414A4710Q45m824o163n591l429J553L491j439o146m781N3K735K027M74j681j918
430a0084J957L223j855l701K799Q139K962n360l628L748O086L342J483J060k482
445G689o033j734Q036Q181l531j2858p637N216J0505L326p962j1029J384J1427
459D980L252j0826p497J0665Q002j1318j2121R027J2581q601j3447Q598J6327
$$ plain form
351 -4054 -9287 -8911 -1253 -723 -10352 -16137 -12717 -10771 -11371 -5892 723 -1518 -6846 -5225 1306 6091
367 6091 9408 10658 6918 3110 5709 9145 8986 11236 15413 11888 2452 1032 9132 13330 8398
382 8398 2393 -1902 -6120 -8158 -6020 -4864 -8611 -13648 -16112 -16478 -14547 -9973 -6441 -7153 -8683 -7543
398 -7543 -5765 -3981 115 4749 5142 2998 3151 4603 5830 10233 17379 18265 10315 4414 8214 14710
414 14710 15555 10731 4568 -1023 -4452 -2899 592 -847 -6993 -11774 -11721 -8986 -6959 -6485 -8166 -10084
430 -10084 -8127 -4904 -6759 -10460 -7661 478 3440 -1920 -5548 -1800 4286 7628 9111 10171 7689
445 7689 1656 -78 7958 16139 12608 -250 -7887 -2671 7834 11160 3198 -7831 -6447 4980
459 4980 8232 -2594 -10091 574 8576 -2742 -14863 -5836 6745 -1856 -15303 -6705 9622
472I622p179j8873K612K0460P856j2595j3859o49J1256J2918l32j5831q874J2424
486a044J4028n578j0963O494J1343p185j2464P065J4497m477j6526k189J1297
499D298K891q463o627J02M197O131K97j1741j1052J0066K0133j303k1348q140
513b0559J4844J1735m445m038M155o77n141N721J2172M36q988j939L688j660m51
528D853P683l89j7813j0034J7504J7187j5856k7605M218K8379P277k3143j7872
541b5611R691J8127M120r040j0231n68J0064Q653k599m181P082N340j1399p299
555g851J9956K0378j7550l3038M110L4665R031k8931k1767J1005K0590K863j4698
568a237j4628J103J6135R690j2178j6340L753J4561Q90q610J948Q257m495j1263
$$ plain form
472 9622 2443 -16430 -13818 6642 14498 1903 -11956 -12605 -1349 11569 11237 -4594 -13468 -1044
486 -1044 12984 7406 -3557 2937 14280 7095 -5369 1696 16193 11716 -4810 -6999 4298
499 4298 7189 -1274 -7901 -7799 -3602 2529 2826 -8915 -19967 -9901 10232 8929 -12419 -20559
513 -20559 -5715 6020 1575 -2463 1692 1015 -4126 1595 13767 14203 5215 3276 6964 5304 4853
528 4853 12536 12147 -5666 -15700 1804 18991 3135 -24470 -20252 8127 15404 -7739 -25611
541 -25611 -15920 2207 6327 -2713 -12944 -13512 -3448 5205 2606 -1575 5507 10847 -552 -7851
555 -7851 12105 32483 14933 -18105 -13995 20670 29701 770 -20997 -9992 10598 13461 -1237
568 -1237 -15865 -14762 1373 11063 -1115 -17455 -13702 859 1749 -6861 -4913 3344 -1151 -12414
582a2414N589K0644N877j8854j7296J0039K3422M492j8720j5998M959J4706N412
595A1858p412j1156m177P548J2715m51j5037o843J1819R820n621p882J960K262
609e97k761K111P748O80p915n194K171O874Q236R7j4933j4537R702K3529R59k5111
625h941j3989J5503J8665l812j5488l951R088P949j296o213j159N363L009l963
639G65k505O361M833q044r542O747J5846R61j9013j2835J2429K0136j061k1227
653f149j1933J1190J5017k146j1928m351N131L840k61K98P23q53l84R49J875K458
669C476R78l082m761K602Q912J377j0432p452O586J1014O93j0027q763J732R899
684B752O435o700j1594j511R113N614m304m642J746K548n20J25L203K073j564
$$ plain form
582 -12414 -6825 13819 19696 842 -16454 -6415 17007 21499 2779 -13219 -8260 6446 11858
595 11858 4446 -6710 -10887 -3339 9376 8925 -6112 -12955 -1136 8684 3063 -4819 -2859 -597
609 -597 -3358 -1247 6501 7181 -734 -5928 -3757 3117 11353 11450 -3483 -18020 -8318 15211 16170 -8941
625 -8941 -22930 -7427 11238 7426 -8062 -12013 -2925 5024 3728 -2485 -3644 1719 4728 765
639 765 -1740 4621 9454 1410 -8132 -1385 14461 15422 -3591 -16426 -3997 16139 15078 -6149
653 -6149 -18082 -6892 8125 5979 -5949 -10300 -5169 -1329 -1590 -1292 -569 -1422 -1806 -857 1018 3476
669 3476 4454 1372 -3389 -787 8125 9502 -930 -8382 -1796 9218 9911 -116 -8879 -7147 2752
684 2752 9187 2487 -9107 -10618 -1505 4109 -195 -4837 -3091 -543 -1063 -938 2265 4338 2774
699B774l032k45L249L587j492o661k877O323O546m290j0101j875Q855P048m794
714C015j0102k631P440N888l315o201O8L907O57j813K213M791m19n144j255O585
730C684N855k803p160j756M932M204k371n760j792L454K988j336m404k003J566
745b702K827N38k850l856j68K714J928r9q04k9k60L83L052M090L9l825k248L282
763B012M573l94l700k210R21J872K15j727j894n11J991K46k126j940j370J628
779b414J097o53j982j610Q08K910J016o65k94J38R56J249K084J430r15j064j499
796E92K459J891m94k231j32q18J749j328p10j495N67k94o74j583p04j03O26J524
814a158k048j827Q58J808J604q99J33J741N1j844K241K522N68j692j133J104J485
$$ plain form
699 2774 -258 -503 2746 6333 4841 -1820 -4697 1626 8172 3882 -6219 -8094 761 7809 3015
714 3015 -7087 -9718 -2278 3610 295 -5906 -5838 -1931 -1274 -3087 -874 3917 3498 -1646 -2901 3684
730 3684 9539 6736 -424 -2180 2752 6956 4585 -1175 -2967 487 3475 2139 -2265 -4268 -2702
745 -2702 125 663 -2187 -6043 -6211 -3497 -1569 -1668 -2472 -2501 -2761 -2378 674 4764 4803 978 -1270 2012
763 2012 6585 6191 2491 281 1202 3074 3289 1562 -332 -843 1148 1394 -732 -2672 -4042 -2414
779 -2414 -1317 -1970 -3952 -5562 -4754 -1844 -828 -1493 -1787 -1649 -693 556 2640 4070 3155 2091 592
796 592 3051 4942 4448 2217 2085 1267 3016 1688 978 -517 50 -244 -918 -2501 -3205 -3308 -2682 -1158
814 -1158 -3206 -5033 -4175 -2367 -763 -1662 -1529 212 263 -1581 660 3182 3750 2058 925 2029 3514
831C514M5j446K70K14j64j020j183M57J133j307k171p00q6j21k08l39N00o03q68
850d083L31J930N38O15J48l64R02P61J389l74M4J064j8j393L08J839j31j259j093
869A154J30K63o21m11l41p85o91o52j140l69R09J407j550j641J327K075q4o42
887a662J181R87r9n26P25R26J097K24p40j365K32K124Q51j858j418Q26L13j575
905B43l84n6o84r84K66m39j093RJ940j58j545K08K164K44j639J223K509K50k126
924e2q86J514K278N64j696j830M53K304P01k207q66R35o20j414j22R28l27j734
942b077o08O72J046O44r57k039J217M371L73m957j571N340L445l823l060K233
958B49K008j371k64J876n43k716J81J640k64J36L71k615l558K968N869k308p738
$$ plain form
831 3514 3559 2113 2383 2597 2433 1413 230 687 1820 513 -1658 -2358 -2444 -2565 -2773 -3112 -2612 -3215 -4083
850 -4083 -3752 -1822 -1284 -669 -521 -885 17 778 2167 1793 1837 2901 2883 1490 1798 3637 3506 2247 1154
869 1154 1284 1547 926 515 174 -611 -1302 -1954 -3094 -3463 -2554 -1147 -2697 -4338 -3011 -936 -1020 -1662
887 -1662 -481 506 407 -119 606 1532 2629 2853 2113 748 980 3104 3955 2097 679 1505 1818 243
905 243 -141 -197 -881 -1865 -1599 -2038 -3131 -3122 -1182 -1340 -2885 -2677 -513 -269 -1908 -685 1824 2074 -52
924 -52 -938 576 2854 3418 1722 -108 345 2649 3350 1143 277 1212 592 -822 -944 -16 -343 -2077
942 -2077 -2685 -2013 -967 -323 -1280 -3319 -2102 2269 2642 -2315 -3886 1454 4899 1076 -1984 249
958 249 2257 886 622 2498 1955 -761 -580 1060 796 932 1303 -1312 -4870 -1902 3967 1659 -6079
975f079m3P519K596n400l067L183K892k45m12l10r43n0J467J018k13l26j038j876
993a327P68L886J657l974m965O83N395K866l643o148p16N550L562l353m187Q30
1009c116K562M18J64Q35j483k322J752L589m45k598RN15j452J856M991j582q195
1026d502j183R258M845o655o440J889M212J574J20k265m946j26O659K754n787
1041e93l924L821K842k890p92L458n53n022p22N734K986m095n159j06M831M919
1057D735r33o696l984N085P858q7p235m293L297N954J695l914l863R20L128O50
1073B317j078P38J56l726j621M552L982l474o302m57M113L284N30m126o443Q66
1089f689R505M868q376q787M428R150N13n081j709P40L67K148L060j403l583N39
$$ plain form
975 -6079 -6122 1397 3993 -1407 -4474 -1291 1601 1356 944 634 -309 -359 1108 2126 1913 1587 549 -1327
993 -1327 -559 3327 4984 1010 -3955 -3272 2123 4989 1346 -4802 -5518 32 3594 241 -3946 -3116
1009 -3116 -554 -136 28 863 -620 -2942 -1190 2399 1954 -644 -635 -120 -1572 284 5275 3693 -4502
1026 -4502 -5685 3573 8418 1763 -4677 -2788 1424 2998 3118 853 -4093 -4219 2440 5194 -593
1041 -593 -4517 -696 2146 -744 -1536 1922 1369 -3653 -4375 1359 4345 250 -4909 -5015 -184 4735
1057 4735 3802 -2894 -6878 -1793 6065 5978 -1257 -5550 -2253 3701 5396 1482 -2381 -1461 1667 2317
1073 2317 1239 1977 2133 -1593 -3214 1338 5320 1846 -4456 -4913 -800 2484 3014 -1112 -7555 -6689
1089 -6689 2816 7684 -692 -9479 -5051 4099 4612 -469 -2178 -1438 -1071 1077 4137 2734 -849 -310
1105c10J868k98J325K764k569p101J3R825K994r014p633L239Q188K230n446o147
1121f072o37O469N162l446p024O78N253J219k136l25J686j778j854J538N169L21
1137D223m060l122J7O519M890m941r132j98R623L901o252o741R92N210K828j143
1153B614m150k776K461M548j91l360n69J226j187n25L939K078m675m545K832N411
1169C131J158l395l978j527L634N830n85p770l511N851N427k150m316n98J353
1184a446J584K155N3l002j507K571K006j064p3O89k283k134L606M225k186n776
1200b582q78M484K507j029l174l258J51M581K591m175m049J747L619K19j166j105
1216a517O8j31R67J964n86j386k6N79j15J891J592k672l286J180N220J65m068
$$ plain form
1105 -310 1558 1260 2585 5349 2780 -4321 -4308 5517 8511 -503 -8136 -4897 3291 5521 75 -6072
1121 -6072 -6709 -240 4922 1476 -5548 -4870 383 1602 -534 -859 827 -951 -2805 -1267 3902 4223
1137 4223 163 -2959 -2942 3577 8467 3526 -5606 -5804 3819 7720 1468 -5273 -4281 929 3757 2614
1153 2614 -1536 -4312 -1851 2697 2506 -854 -1423 -197 -1384 -1909 2030 4108 -567 -5112 -2280 3131
1169 3131 4289 894 -3084 -4611 -977 4853 4268 -3502 -7013 -1162 4265 2115 -2201 -2799 -1446
1184 -1446 138 2293 2346 -656 -2163 408 2414 1350 1277 1966 -317 -2451 1155 5380 3194 -2582
1200 -2582 -3460 1024 3531 2502 -672 -3930 -3779 802 3393 -782 -4831 -3084 535 754 -412 -1517
1216 -1517 -1449 -1580 -613 1351 765 -621 -647 -68 -183 1708 3300 628 -2658 -1478 3742 3907 -161
1233a61j810R84K085J581o78l144k268K944L280j035l637L89J783l04o00J270
1249F79M47k330k01J783J303j379j021n35o32J067K648p54m249m95L469L033l148
1266c15j546r0J322J235Q68j356j830M00L211N1j262J20O84q90NP18J921k586
1284F60j225Q04J388J03j199p06j309L87J856lk452j414J537J902k70j149j225
1301b315J019k90Q19Q76j209k24J566l3j29J14J240o44j202J004J875j505m19
1318E43r2J340l32N16j021l72m51J930Q2j746o97K00Q11o81p52P8o90n60O46N67
1338f81k47j061Q17p70K58R06Q68q97o00J364J071n99r59L55N59Q05J17l23R07
1357A890o79l19O89K93q55j66k22m74k9J03m96j157J42R57l84o65m8K92k17J76
$$ plain form
1233 -161 -1971 -987 1098 2679 2001 -1143 -3411 -467 2813 1778 -1859 -1470 313 9 -591 679
1249 679 1126 -1204 -1405 378 1681 302 -719 -1254 -1886 -819 1829 1075 -3174 -3669 -200 2833 -315
1266 -315 -1861 -1951 -629 606 1474 118 -1712 -1312 1899 1950 688 808 1492 602 607 1325 3246 660
1284 660 -565 239 1627 1730 531 -175 -1484 -1097 759 756 -1696 -3110 -1573 329 59 -1090 -2315
1301 -2315 -1296 -1586 -767 109 -1100 -1324 242 209 80 194 1434 790 -412 592 2467 962 543
1318 543 451 1791 1459 1975 954 582 131 2061 2143 397 -300 -100 711 30 -722 -644 -1334 -1894 -1248 -681
1338 -681 -928 -1989 -1172 -1942 -1684 -778 90 -807 -1407 -43 1028 429 -530 -175 384 1189 1306 983 1890
1357 1890 1211 892 1581 1874 1019 853 631 157 128 231 -265 -1422 -1280 -323 -707 -1372 -1420 -1128 -1345 -1169
1377a169O45j72K48k4K83K69K47J85K56lK33L80j03k47M84n1l72n99Q7k27n22
1398a72l04P8k00m32o58O19O9o19J84M39L32m16N21N75M41j79L26L74J03L32J20
1419A533K28k64k27K67M3o36n20R7J52o58q73k68Q8j24k89l48P4j07j56N69M07
1440a012p1j31L31N29O77R3K08J84j94L93N89K42k42o01J47M46J3n17n32l38l15
1461a01P7M95l92j398m70J125R10q06j157J58R28K30J2K09l09m04N02J143J77
1480I29p68m95M17K52K65M61l33j421o15J623J337j321k058K28J546Q49p72r49
1498h25k04M68J148P70p03j141Q3J401P97o05p52j56J23N5O02M81q58j689m22
1517a427J729J079j231k217l73J460J272j01j707j419N25K368J228j507j856N68
$$ plain form
1377 -1169 -524 -696 -448 -472 -189 80 327 512 768 765 998 1378 1275 1028 1512 1461 1089 490 577 350 -172
1398 -172 -476 -398 -598 -1030 -1688 -1069 -1000 -1619 -1435 -996 -664 -1080 -559 16 457 278 604 978 1081 1413 1533
1419 1533 1761 1497 1270 1537 1580 944 424 521 673 15 -858 -1126 -1038 -1162 -1451 -1799 -1725 -1832 -1988 -1419 -1012
1440 -1012 -1083 -1214 -883 -354 323 416 624 808 614 1007 1596 1838 1596 995 1142 1588 1601 1084 552 214 -101
1461 -101 -24 471 79 -1319 -1789 -664 246 -560 -1717 -1559 -631 -401 -389 -180 -489 -893 -391 752 929
1480 929 161 -334 83 335 600 1061 728 -693 -1308 315 1652 331 -1727 -1499 47 896 124 -825
1498 -825 -1029 -561 587 1357 654 -487 -404 997 1794 1189 437 281 404 459 1061 1542 684 -1005 -1427
1517 -1427 302 1381 150 -2067 -2440 -980 292 191 -1516 -2935 -2410 -42 1186 -321 -2177 -1609
1533a609K373Q56r45l30K38n9o2J498R45j345k158J80J922J143r68k099j604P15
1551a309K545Q29k849l033R94L253R14k315j712P47J355Q02K70l79o22l85J072
1568A77J376O29q05j546o09J338K293Kk807k490J083L318O92k828k920K65K752
1585h0J532j569k412l45J592J543K67o60j064j4J284J575L59n70j059m68J058
1602I69J915O10k107k878N31L103J251k487l320m84K285K002o39k937k105J244
1618c047K890P45k089j627P88J567R49N91j06j047n71J453K355Q00j752j980r0
1635a71K292K204r54l642j967K135L137m12l550k481R94K490O99j818k118l77
1651c539J615J391M5p28m83l59Q02J908J566j061k306j20K542K414k25k850j921
$$ plain form
1533 -1609 764 1620 675 345 583 524 462 1960 2905 1560 -598 -418 1504 2647 1679 -420 -2024 -1309
1551 -1309 1236 2065 -784 -3817 -2823 430 1344 -971 -2683 -1936 -581 221 491 112 -510 -895 177
1568 177 1553 2182 1377 -169 -778 560 2853 2855 48 -2442 -1359 1959 2651 -177 -3097 -2832 -80
1585 -80 1452 -117 -2529 -2874 -1282 261 528 -132 -1196 -1210 74 1649 2008 1438 379 -89 969
1602 969 2884 3494 1387 -1491 -960 2143 3394 907 -2413 -2897 -612 1390 751 -2186 -4291 -3047
1618 -3047 -157 588 -1501 -3128 -2340 -773 176 767 661 -386 -957 496 2851 3651 1899 -81 -171
1635 -171 2121 4325 3371 -271 -2238 -103 3034 2622 -928 -3409 -2415 75 774 -1044 -3162 -3539
1651 -3539 -1924 -533 -488 -1216 -1699 -2058 -1256 652 2218 1157 -1149 -1269 1273 3687 3462 612 -1309
1668a309J405L403O67l148l063P71K739Q61j739k162n81P11J419M08j201j440
1684b259k99R93J135O90l07j307j146J578K948L91k717j744J417K854Q41j709
1700A359k256j85K307J770q76k466j042J244J487n0j051j164n41N43R66N14q21
1717b62j405m55R42J377P74j338k018M57K402J559j246k054l47J726J987N1j793
1734C57j363Q22J878N25j259j209Q2M24L78L87l36j315q07O20J242K09j169j292
1752a826j95J104J615n6k008j072J461K090J66j541q42N93J471P14l96q92m11
1769b5O05Q13l2n25n91m75p7P80K71n79j390m43Q81R04j03j231p71L86J578O16
1789E92q16j035K80J420O46k24m88j77M37N45L01l31p05k22L93P6n9j71o61o67
$$ plain form
1668 -1309 96 3499 4166 1018 -2045 -1274 1465 2326 587 -1575 -2156 -1445 -26 382 -819 -2259
1684 -2259 -2558 -1565 -430 260 -47 -1354 -2500 -922 2026 2417 -300 -2044 -627 2227 3068 1359
1700 1359 -897 -1082 1225 2995 2119 -347 -1389 -145 1342 1292 241 -923 -1464 -921 45 559 -262
1717 -262 -1667 -2122 -1180 197 971 -367 -2385 -1928 474 2033 787 -1267 -1614 112 2099 2150 357
1734 357 -1006 -184 1694 2219 960 -249 -167 257 635 1022 686 -629 -1436 -816 426 635 -534 -1826
1752 -1826 -2021 -917 698 642 -1366 -2438 -977 1113 1279 -262 -1104 -511 960 1674 1278 386 -25
1769 -25 580 1393 1361 836 245 -230 -307 473 744 165 -1225 -1668 -787 117 14 -1217 -1988 -1602 -24 592
1789 592 -224 -1259 -979 441 1087 863 375 198 635 1180 1481 1150 445 223 616 692 633 462 -199 -866
1809h66J80Q36j39r52q32L60R79J55l37n36n5O89R69n6m37k19N60N78K56k59j77
1830F97j95J30N13k13k19m77k19m7J82M5n43o99K6O44J86n37k23J02L21K81J73
1851g2P7l04j1Q05J56k46l7J51J12j95K02N3l46l43J09J92k41m69K6J37k87M0
1873d91J16p9j81J66L06J1j96K35J91K33J43J9o8P8K01p8j9J2j89r6l1N5k97k03
1897a62j51N5j21k75L6R4k39j95N72J66k80j26M86K51o8o5L43J30k85L55K99o5
1919G55m35R1L81k71l55J11J35m12k35K03J06n35k75K68J63k43q6J47O9j28K67
1940b79K02J1j39J36K23L01j88k1K90k9j76J26J24K6k72k92L67J10l32l96J25
1961h3J04l06p7J66j98k60J44K71p8k50K7L51J1j02J29J14o6J3M46K58n13k10
$$ plain form
1809 -866 -686 150 11 -941 -1773 -1413 -434 -279 -616 -1152 -1207 -518 451 395 -42 -261 299 877 1133 874 697
1830 697 502 632 1145 932 713 236 17 -30 152 197 -346 -1045 -1019 -375 -189 -726 -949 -847 -526 -245 -72
1851 -72 5 -299 -310 495 651 405 368 519 631 436 638 691 345 2 111 303 62 -407 -381 -244 -531 -491
1873 -491 -375 -454 -635 -469 -163 -152 -348 -113 78 311 454 473 405 483 684 606 587 599 410 314 283 338 41 -162
1897 -162 -313 -258 -379 -654 -618 -524 -763 -958 -386 -220 -500 -626 -140 111 43 -22 321 451 166 521 820 755
1919 755 320 411 792 521 166 277 412 0 -235 -32 74 -461 -736 -468 -305 -548 -634 -487 -418 -546 -279
1940 -279 -77 -66 -205 -69 154 455 267 246 536 507 331 457 581 607 335 43 410 520 188 -208 -83
1961 -83 21 -285 -362 -196 -394 -654 -510 -239 -317 -567 -540 -189 -178 -280 -151 -37 -103 -90 356 614 101 -109
1983a09K72M11J30k06k36j04PL24L07n57m16n7N61J77m38l60j35K07P0J15n1m53
2005e41l21J23P55K54o77m75J53N86M18j82k39n23J45R92M41n63p86J50P63N34
2025A007m57l20k46P6M88L33k16n54m00K17L62L05l35p09l13L24Q34J43r37o69
2045a067L6J004P11n62j192j19R18P51o9o47l69J77O56M10l4q05l29M57P45Q9
2065G61k76n66m65J94J111M90j041j191J00J340O22p48j118l10O93J043L07j041
2083i5r54J82J283M68m22n83m42J79Q28O12l51j086n80O53Q98N51q52j309k99
2102a319J307J245n26j699n74P69J309K96p55j293m4J388J065m45r45m62N43O30
2120D90O14N3r78r52M37J319O22j052j186l45P80J220J30j525j455L74J781P76
$$ plain form
1983 -109 163 574 704 498 262 158 165 489 796 239 -177 -234 327 504 66 -294 -429 -222 -152 -37 -88 -541
2005 -541 -862 -739 16 270 -407 -882 -729 -143 275 93 -146 -669 -524 468 909 346 -440 -290 473 1007
2025 1007 550 230 -16 60 548 881 665 111 -289 -72 290 595 260 -449 -762 -438 396 539 -398 -1067
2045 -1067 -1031 -27 684 122 -1070 -1189 -271 480 411 -236 -605 -428 228 638 604 -201 -530 -73 672 761
2065 761 485 -81 -546 -352 759 1249 208 -983 -883 457 1079 331 -787 -1097 -404 639 946 -95
2083 -95 -1049 -867 416 884 462 -121 -563 -384 444 1056 705 -381 -961 -308 590 1141 289 -1020 -1319
2102 -1319 -12 1233 707 -992 -1566 -797 512 808 53 -1240 -1284 104 1169 724 -221 -683 -140 490
2120 490 1104 1157 179 -773 -336 983 1605 553 -633 -978 -198 1022 1152 -373 -1828 -1454 327 1103
2138A103j238j293k3R47J007J00q94p84J15J332Q23m25p68m27K26P51J059n11
2156A100j453o88Q83J353J35j229j398n5J443J130o49j893m17J153J365r4r68
2173b82p57%R08J074M7j126n58L85R44N87Rj017j029K78J676O76j410j574N9J333
2193B23R69m85j253j042N36J524N75j272j233K94Q93Q22R1o44q11M3Q66J176k45
2212A027j139n63M38R41P41n96j606m64J202J307l09j450r05N70J081O29o16j288
2230a000l18R60J063pp35o72K18N33P17K95r55q76M30J132M15o34q90n78N27J077
2250G02L88j176j335K88J271N88p67q31m7L23Q55M42o01r03Q5R56N68k20m20l16
2270a50j78P00P81j65j026n98N03R29J31o46q22l69Q69P11k62j030o47P27O30
$$ plain form
2138 1103 -135 -1428 -1451 -504 503 603 -291 -1075 -960 372 1195 770 2 -425 -199 552 1611 1100
2156 1100 -353 -1041 -158 1195 1330 101 -1297 -1352 91 1221 572 -1321 -1738 -585 780 686 -282
2173 -282 -1039 -1039 -131 943 990 -136 -694 -309 635 1222 1231 214 -815 -537 1139 1815 405 -1169 -1110 223
2193 223 1192 707 -546 -1588 -1052 472 1047 -225 -1458 -1164 -271 551 642 -2 -813 -770 96 1272 1027
2212 1027 -112 -675 -237 704 1445 849 -757 -1221 -19 1288 979 -471 -1376 -806 275 904 288 -1000
2230 -1000 -1318 -358 705 698 -37 -709 -491 42 759 1054 99 -777 -347 785 1200 566 -324 -902 -375 702
2250 702 1090 -86 -1421 -1133 138 726 -41 -872 -919 -596 259 701 100 -803 -718 238 806 586 166 -150
2270 -150 -328 372 1153 988 -38 -636 -133 796 927 281 -541 -910 -41 670 408 -622 -1269 -542 88
2289H8J89m23m26j30L79P70Q5n49m58L34M82K45J66m45p11J89R67K19o82p07P1
2310c47L67L04J78o84n12N5O90K48m55n84K23L21J18J49j50l30p9M81M63q5l92
2331b1j75L19L14J87j43m92j47M22N56k22n15j88J6K61K40k55m63r4L00J21j73
2352a52j91n6m0j1L56J00m35j62L47L31k67J07m9l2J04K46M16m37l79L25M29l
2374E47k59m1Q0j74J79J69k78l44N5K63j71j62j33N7K5j11K08r9j60j45J43K55
2396i6N3j72n6K5J40P1oJ14m7J15J01N2P1j36j69K88J24k69j82J61L8l03k7J56
2420D6k09Oq1K31j08k85J12J93j05n1M1J96j00j5L18J1k44M6K18K8j50mJ11jp7
2445A27L1J02q5l97J86J12qj61j93L0l4L2J73j50l0p8J03J76o7O2p4J94K6mJ31
$$ plain form
2289 88 277 -146 -572 -702 -323 447 532 -17 -475 -141 341 586 752 307 -404 -215 752 971 289 -418 -347
2310 -347 20 324 502 -182 -694 -639 51 299 -156 -740 -517 -196 -78 71 -79 -409 -488 -7 456 371 -21
2331 -21 -196 123 437 624 481 -11 -158 264 820 598 83 -105 -89 172 412 157 -306 -400 -100 21 -152
2352 -152 -343 -399 -439 -450 -94 6 -429 -591 -244 87 -180 -73 -122 -154 -50 196 612 175 -204 121 550 547
2374 547 288 247 327 153 332 501 223 -121 -66 197 26 -136 -269 -212 -187 -298 -90 -189 -349 -494 -351 -96
2396 -96 -43 -215 -271 -246 -106 -35 -41 73 26 141 242 294 365 229 60 348 472 203 21 182 220 -83 -110 46
2420 46 -163 -157 -238 -7 -115 -400 -288 -95 -200 -251 -210 -14 -114 -129 189 200 -44 2 220 248 98 94 205 204 127
2445 127 158 260 175 -222 -36 76 68 -93 -286 -256 -290 -258 -85 -235 -265 -343 -240 -64 -131 -69 -143 51 77 73 204
2470B04jmo3Q3J26P6k42Pp1j0p4J79k21k12L7J61M5k30r8J23M3k1J66Nj12o0N5
2497a09J54J31j46k26J93K25Qj71P8j67k7J92J76k05l17K02J00J14j59r8j27J40
2519c9Q2J60j13j93j03K70K16j33j24j09L6J95J47J5l64k36K41K04Q5k94j96j43
2541c96J75M06K4l79k20O6M76J65j28k82j02J07L43R6k47l05R3K44K33m9k53m08
2563c41l2M46L70k55n62j78L57M91n8l30l29J4N42L77k61n95j03K24O36J68l40
2584B41n16j27M29L93J0m18l90r6L86N63j25p23m52M91O80K50o05n45P0M56N70
2605E42oo43l34J48P46K08m38k86k43K87M75R8k79q94j5P66M61l29o40m33K34
2626e75O05M57l45r03j55Q35P20p0p06m65M31N36M29j16o64m54N24P16M6n49n23
$$ plain form
2470 204 203 199 136 219 345 421 179 186 115 105 31 210 -11 -223 -186 -25 20 -210 -308 -185 -142 -163 3 8 -104 -164 -109
2497 -109 45 176 30 -196 -3 222 230 59 137 -30 -57 135 311 106 -211 -9 91 205 46 -52 -179 -39
2519 -39 43 203 90 -103 -206 64 280 147 23 -86 -50 145 292 307 -57 -293 -52 152 237 -57 -253 -396
2541 -396 -221 185 209 -170 -390 -324 152 317 189 -93 -195 -88 255 351 104 -201 -108 136 369 320 67 -341
2563 -341 -373 73 443 188 -374 -552 -195 296 238 -92 -421 -407 135 512 251 -344 -447 -223 413 581 241
2584 241 -275 -402 27 420 430 12 -378 -474 -88 475 350 -373 -825 -334 346 596 -9 -554 -484 -28 542
2605 542 536 -107 -441 -293 453 661 223 -63 -306 -19 456 554 275 -619 -634 132 593 264 -376 -809 -575
2626 -575 30 487 142 -761 -916 -81 639 569 -137 -602 -171 365 794 678 14 -440 84 800 846 297 -226
2647b26k45N18M61R3q15q17K96P22L52l37p75l81N63R62N9o93o37K29Q39M63o7
2668E64m99n27L31R34L52n60p63k1L55N81O8o12p19j73P42P59n50j028k82N45
2688e03N29L74n44o45j71O86J032l10p76l67N10N89L35j13o69m06M47R30O0p07
2708B81n51j39N57O30k44q24o01K72P78L97o35p34j89P56O32O8o68n40J93Q83
2728C22M24k30n52l59M24N84L89m62q46j48O55N28j71o06n75j39O20O91m05j000
2748h56k04P22N90o2n51l59J87M23O60J6p20l77O10O60P8l17m23j33J93O35J62
2769I34o72n77n4O15K05l62n09l86K31N66R3l38o84M6O95L42m6l78l12K77N76
2790B62L68k87l48m2K67L83J72l21m95p8M87L58k42o14k25M9K89L76m53o21LL53
$$ plain form
2647 -226 -471 47 508 601 -214 -1031 -735 -13 339 2 -773 -1154 -591 371 430 -263 -900 -671 168 631 564
2668 564 65 -462 -131 803 1155 595 -168 -189 166 747 815 203 -516 -689 53 812 262 -766 -1048 -503
2688 -503 26 400 -144 -789 -960 -274 758 448 -328 -695 -185 404 739 626 -43 -449 -2 928 988 281
2708 281 -270 -409 148 778 534 -290 -891 -619 159 556 -79 -813 -1002 -246 386 454 -214 -754 -561 322
2728 322 746 516 -36 -395 29 613 1002 540 -306 -454 201 729 558 -48 -623 -762 -142 549 144 -856
2748 -856 -1060 -338 252 190 -361 -720 -533 -110 550 566 -154 -531 79 739 817 500 77 -56 137 772 934
2769 934 262 -315 -369 246 451 89 -420 -806 -575 -9 84 -254 -938 -892 -197 145 99 -279 -591 -314 262
2790 262 630 343 -5 -47 220 603 775 454 -41 -119 368 726 484 -130 -355 -306 -17 359 -94 -715 -712 -359
2812c59N12k98l96K7O9K75M22n2k74l04L62N80J00m56r6M0R0K81J14m28m23j1
2834b25M87J70m79l26o9K62J6M8j12k33p9N10K38k35j82j8J83K77J20k32r9q1
2856e9L71M2rj51k85M4L20Q9j80l25l6K06j04l0j52j65p7K89K24j7l42K1K93J86
2880A53j24L9O3j16n2M14Q0l26j72L26J63k15k30O7n6k58K35M8k00j98J68J09
2902h2L6k57J11j6M2JJ68J3k63J17K66J19r1j40N2J06L2j1L9j43K6j24J71P1q0
2927A63k44j04L29p1j69N9j10J20q9N2O0k81L7K98m9j95n1K57pq7L8K43j64j65
2951a30J10K54o9j18o2J72N7p3jQ0p0j53K47j8k94j9lJ01p2j30J28n9m1J56o1
2976f8j13j26J88k4K4O7o3J38L7k3O9o3N1q5P6P1P0q5L2ql4r1N1o1j05j8J25o3
$$ plain form
2812 -359 153 -145 -541 -514 -445 -170 252 200 -74 -378 -16 564 664 208 112 152 242 523 637 209 -214 -225
2834 -225 262 432 -47 -373 -442 -180 -164 -116 -228 -461 -540 -30 208 -27 -209 -227 -44 233 353 121 22 -59
2856 -59 312 354 345 194 -91 -47 273 362 182 -143 -179 27 -77 -107 -259 -424 -501 -212 12 -5 -347 -326 -33 153
2880 153 29 68 131 15 -37 377 457 131 -41 285 448 233 3 70 14 -244 -9 39 -161 -359 -191 -82
2902 -82 -46 -303 -192 -208 -166 -165 3 16 -247 -130 136 255 164 24 76 182 214 203 242 99 125 1 172 243 163
2927 163 -81 -185 144 73 -96 -37 -147 -27 -116 -64 -4 -285 -248 50 1 -194 -245 12 5 -82 -44 199 35 -130
2951 -130 -20 234 165 47 -15 157 214 141 140 220 150 -3 244 226 -68 -87 -90 11 -61 -191 -63 -122 -163 -7 -68
2976 -68 -181 -307 -119 -143 -119 -52 -115 23 60 37 106 43 94 9 85 156 226 141 173 165 131 40 91 30 -75 -93 32 -31
3004c1L8j26j15J18o2R1jm6l5J03J10O1r1k0mJ51J2q3J1n4k5Q3Kl7p4n6N8k1O0
3033A7m7j8q5R6J0O4J7k18M3N5J82nj26NM7R7J09j06j81L7L2J05n8O4k31j02R9
3060i8J94j02j58k9O1R8J77j98n8n2R0K11j5K4k61J7K79q2Q5j82m4m3K30J19j11
3085A52k22j78J26J75O9k17j41O8J33J15L3j76k66K56K69o2o7k48J01J17L02j33
3107B06j29j72j2K35J99m9m36j05J44L00J5k26j14k17K68L09l4k03l22J39M69
3128B65l2o3k34o4J07K89J78m21j66o0L70J28j42k94l14L16K15K33k11m71k3L20
3150g4L46m9k80k98O2K75L62j88k50j88L11M37M1l31l25q8L30L50k3m28l25J59
3172a74K16J81j26m11j21J88M25L5k78l71Q8L22L25l8l31k72J67L99K48k44m39
$$ plain form
3004 -31 7 -119 -234 -116 -178 -87 -88 -134 -169 -66 44 105 14 -6 -10 141 153 70 81 27 2 85 87 50 -24 -80 -22 -43 17
3033 17 -30 -48 -133 -37 -27 37 54 -164 -121 -66 116 111 -15 -10 37 134 243 137 -44 -7 25 130 72 136 -95 -197 -98
3060 -98 96 -6 -164 -193 -132 -34 143 -55 -113 -165 -75 136 121 145 -116 -99 180 98 183 1 -43 -86 144 263 152
3085 152 -70 -248 -122 53 122 -95 -236 -168 -35 80 113 -63 -329 -73 196 134 67 -181 -80 37 339 206
3107 206 77 -95 -107 128 327 278 -158 -263 -119 181 196 -30 -144 -361 -93 216 182 -21 -343 -204 265
3128 265 233 170 -64 -128 -21 268 446 25 -141 -201 169 297 155 -139 -453 -137 78 311 100 -371 -394 -74
3150 -74 272 223 -57 -355 -293 -18 344 156 -94 -282 29 466 507 176 -149 -237 93 443 420 -8 -333 -174
3172 -174 42 223 97 -314 -435 -247 178 213 -65 -436 -348 -26 299 261 -70 -342 -175 224 472 228 -211
3193b11P9K02K47J43l06l96lL31K97j53m40j95N5M36K30l62j75l48L73L21J44
3214B69l45l56J69M32L34k61l52j33K53L31O9k74m14n9M19K18mm32k18J20L40
3235A06J16k24l28r9L10K52J12l48k61Q2L74K99j05l35j50L09K38J57l51k54m4
3256a44J53K47O4l00l31O9L25K60k91l33k12J47L18J15j61k43r0K97L11k3l11
3277a33k22K23L86J08j48k28j57K62M14J7l65l32K9L58N4l2m22j29N8L53J29k41
3299a8m22M2K23J51J33l04j33P3M01Q1o7k99l4J32M11j4p5l00O7J43J35o1k27
3322C8j63oJ07J76k35j81j94K50K18L2j85k18J37J11J84J19k99k08L01J93J39
3343C16k05K4j26J64J19n4k73m8K3J40J73j89j81r6R5M9j2k4j84N2J14J86j45
$$ plain form
3193 -211 -132 70 317 460 154 -242 -245 86 383 230 -210 -405 -350 86 316 -46 -221 -569 -196 125 269
3214 269 -76 -432 -263 169 503 242 -110 -243 10 341 410 136 -278 -337 82 300 296 -136 -354 -234 106
3235 106 222 -2 -330 -429 -119 133 245 -103 -364 -282 92 391 286 -49 -199 110 348 505 154 -100 -144
3256 -144 9 256 320 20 -311 -242 83 343 52 -281 -493 -346 -28 87 -74 -317 -407 -110 201 178 -133
3277 -133 -355 -132 254 362 214 -14 -171 91 505 522 157 -175 -146 212 266 234 -188 -317 -259 94 223 -18
3299 -18 -440 -398 -175 -24 109 -195 -328 -255 146 227 160 -139 -173 -41 370 356 281 -19 48 191 326 265 38
3322 38 -125 -131 -24 152 -83 -264 -458 -208 10 42 -143 -361 -224 -113 71 190 -109 -317 -16 177 316
3343 316 111 135 9 173 292 238 -35 -83 -60 80 253 64 -117 -213 -118 -69 -81 -105 -289 -237 -123 63 -82
3366h2r4m9J60K15pq8j06J23q6K56K1j04k43O1K00P5j35j26JO4J18p2j30j88N9
3391a57J31J12r9k20J8R9P7k1l0m0N1M4J58N6j95p3J85Ml5J21j95M3L2lJ78l15
3417g4O3k5J57r8j5j40J12m5k5KJ47j34k2J37K8m9r9q1J86J42j30l6j3r5P3J84
3443A50j2j59j02J86O8J4q2j39o5J11j0N0j02j60N1K03j31m4m1J29nP2M1p9m1
3468i7L2K02M4j11J5q2J87p8k7J52j59K7j78J67j05l6m8O8j0m4n0m6L6j4J52N8
3494E5n2q5j8O0N4o3J13p7N3J26L2j48J3K7pj2K7N5p8m0r7m3pk9j3j3pNrO4J4
3525a00o3M9J01p5J21J8N9oL9m9J11PMJ3m0k0r4o5M8L1j54l0J4n4O1n3K5j51J2
3554b41M3J48K0m4k5O6P5J3nL2m6P4M2K7Rk4j7m0J03l1j00m2p2j3p0m4n2OJ4O5
$$ plain form
3366 -82 -176 -225 -65 150 143 55 -51 72 -14 242 263 159 -84 -23 177 252 117 -9 -8 56 174 102 -28 -216 -157
3391 -157 -26 86 -13 -233 -215 -116 -39 -60 -90 -130 -79 -35 123 179 -16 -89 96 100 65 186 -9 34 66 63 241 -74
3417 -74 -11 -36 121 23 8 -132 -20 -65 -90 -88 59 -75 -97 40 68 19 -80 -161 25 167 37 1 -12 -107 -34 150
3443 150 138 -21 -123 63 131 145 63 -76 -141 -30 -40 10 -92 -252 -201 2 -129 -173 -214 -85 -90 -18 23 -56 -97
3468 -97 -65 137 181 70 85 3 190 112 85 237 78 105 -73 94 -11 -47 -95 -27 -37 -81 -131 -177 -141 -155 -3 55
3494 55 3 -82 -100 -40 14 -49 64 -13 40 166 198 50 63 90 83 71 98 153 75 35 -62 -105 -112 -141 -154 -167 -174 -169 -178 -114 -100
3525 -100 -163 -114 -13 -88 33 51 110 104 143 94 205 212 216 229 189 169 75 10 58 89 -65 -95 -81 -135 -74 -127 -102 -253 -241
3554 -241 -198 -50 -30 -74 -99 -33 42 55 50 82 36 110 152 179 188 164 147 107 210 179 79 37 -35 -48 -118 -162 -214 -208 -194 -129
3584a29m9J01j56L4N4J02K03j42j6mR7P1m4k6n2J03O7k0p4j37K8l7R0L4j76R0
3610A2j19l6L4OM7j12lK33m4q2k5j3K02j6Ml5j3q7Q1J83q1r2o2P5Q6j74N3j30
3638a08k7J15J23k8j87J2lK22r9k05J89j14j05K72K4j48j06J10Q5J55j11q1q6
3661a01Q6O5l2J03k04QR9Q7k0m6j57P3N9O5Oj59k5n0K46L7j14r1q2J97J33j00
3687H3k28NQ5J88L6j13p3j21Q1J85N2j23j56r1J43Q6J66k82n0o4K73J08k67N8
3711a9r5J73L8l8o9j52J03J53M9m0j62j86Q2K44L1o4p7K8J64J8n3j71j16P2J31
$$ plain form
3584 -129 -178 -77 -233 -199 -145 -43 160 18 2 -2 95 166 122 96 44 147 214 194 120 -17 11 -26 64 98 -78 12
3610 12 -107 -143 -109 -103 -56 -168 -171 62 18 -64 -89 -102 100 84 88 53 40 -47 34 217 136 44 -18 57 143 -31 22 -108
3638 -108 -135 -20 103 75 -112 -100 -103 119 20 -185 4 -110 -215 57 81 -67 -173 -63 22 177 66 -15 -101
3661 -101 -15 50 18 121 -83 -75 24 111 91 45 -112 -39 20 85 91 -68 -93 -143 103 140 26 -65 -147 50 183 83
3687 83 -145 -140 -55 133 169 56 -17 -138 -57 128 180 57 -99 -190 -47 39 205 -77 -127 -191 82 190 -77 -19
3711 -19 -114 59 97 59 -10 -162 -59 94 143 103 -59 -245 -163 81 112 48 -29 -1 163 181 128 -43 -159 -87 44
$$ [...]
8191i8
##END NTUPLES=NMR FID
##END=
