##TITLE=1H_Pr NCO_Am
 CDCl3
 8 sc, 
 5.05.2022
##JCAMPDX= 6.0         $$ Bruker NMR JCAMP-DX V2.0
##DATA TYPE= NMR FID
##DATA CLASS= NTUPLES
##ORIGIN= UXNMR, Bruker Analytische Messtechnik GmbH
##OWNER= root
$$ XWIN-NMR		Version 3.5
$$ Thu May  5 11:39:51 2022 Russian Standard Time (UT+4h)  she@DPX200
##.OBSERVE FREQUENCY= 200.13135
##.OBSERVE NUCLEUS= ^1H
##.DELAY= (6, 6)
##.ACQUISITION MODE= SIMULTANEOUS
##.ACQUISITION SCHEME= undefined
##.AVERAGES= 8
##.DIGITISER RES= 18
##SPECTROMETER/DATA SYSTEM= spect
##.PULSE SEQUENCE= zg30
##.SOLVENT NAME= CDCl3
##.SHIFT REFERENCE= (INTERNAL, CDCl3, 0, 15.7039)
##AUDIT TRAIL= $$ (NUMBER, WHEN, WHO, WHERE, WHAT)
$$ ##TITLE= Audit trail, XWIN-NMR		Version 3.5
$$ ##JCAMPDX= 5.01
$$ ##ORIGIN= Bruker BioSpin GmbH
$$ ##OWNER= she
$$ F:/spectra/data/she/nmr/H-F/1/audita.txt
$$ ##AUDIT TRAIL=  $$ (NUMBER, WHEN, WHO, WHERE, WHAT)
(   1,<2022-05-05 11:38:48.40 +0400>,<she>,<DPX200>,
      <created by zg, POWCHK disabled, PULCHK disabled
       configuration hash MD5:
       00 E9 B6 7A A2 85 ED C7 34 08 36 98 17 FE 4E 26
       data hash MD5: 16K
       D1 98 7F 8E E0 22 3D 56 1B C9 04 C9 4E A4 C6 FF>)
$$ ##END=
$$ 
$$ hash MD5
$$ C0 AD AE 2E 32 BF E0 D7 78 54 4D E7 D3 F1 C7 FE
##$RELAX= 
##$RELAX= 
##$RELAX= 
##$RELAX= 
##$RELAX= 
##$RELAX= 
$$ Bruker specific parameters
$$ --------------------------
##$DU= <F:/spectra>
##$EXPNO= 1
##$NAME= <H-F>
##$PROCNO= 1
##$TYPE= <nmr>
##$USER= <she>
##$AMP= (0..31)
100 100 100 100 100 100 100 100 100 100 100 100 100 100 100 100 100 100 
100 100 100 100 100 100 100 100 100 100 100 100 100 100 
##$AQSEQ= 0
##$AQ_mod= 1
##$AUNM= <au_zg>
##$AUTOPOS= <>
##$BF1= 200.13
##$BF2= 200.13
##$BF3= 200.13
##$BF4= 200.13
##$BF5= 200.13
##$BF6= 200.13
##$BF7= 200.13
##$BF8= 200.13
##$BYTORDA= 1
##$CFDGTYP= 0
##$CFRGTYP= 5
##$CHEMSTR= <none>
##$CNST= (0..31)
1 1 145 1 1 1 1 1 1 1 1 1 1 1 1 1 1 1 1 1 1 1 1 1 1 1 1 1 1 1 1 1 
##$CPDPRG= <>
##$CPDPRG1= <>
##$CPDPRG2= <>
##$CPDPRG3= <>
##$CPDPRG4= <mlev>
##$CPDPRG5= <mlev>
##$CPDPRG6= <mlev>
##$CPDPRG7= <mlev>
##$CPDPRG8= <mlev>
##$CPDPRGB= <>
##$CPDPRGT= <>
##$D= (0..31)
0 1.2 0 0 0 0 0 0 0 0.06 0 0.03 0 0 0 0 0.0002 0 0 0 0 0 0 0 0 0 0 0 0 
0 0 0 
##$DATE= 1651736327
##$DBL= (0..7)
120 120 120 120 120 120 120 120 
##$DBP= (0..7)
150 150 150 150 150 150 150 150 
##$DBP07= 0
##$DBPNAM0= <>
##$DBPNAM1= <>
##$DBPNAM2= <>
##$DBPNAM3= <>
##$DBPNAM4= <>
##$DBPNAM5= <>
##$DBPNAM6= <>
##$DBPNAM7= <>
##$DBPOAL= (0..7)
0.5 0.5 0.5 0.5 0.5 0.5 0.5 0.5 
##$DBPOFFS= (0..7)
0 0 0 0 0 0 0 0 
##$DE= 6
##$DECBNUC= <off>
##$DECIM= 32
##$DECNUC= <off>
##$DECSTAT= 4
##$DIGMOD= 1
##$DIGTYP= 9
##$DL= (0..7)
0 120 120 120 120 120 120 120 
##$DP= (0..7)
150 150 150 150 150 150 150 150 
##$DP07= 0
##$DPNAME0= <>
##$DPNAME1= <>
##$DPNAME2= <>
##$DPNAME3= <>
##$DPNAME4= <>
##$DPNAME5= <>
##$DPNAME6= <>
##$DPNAME7= <>
##$DPOAL= (0..7)
0.5 0.5 0.5 0.5 0.5 0.5 0.5 0.5 
##$DPOFFS= (0..7)
0 0 0 0 0 0 0 0 
##$DQDMODE= 0
##$DR= 18
##$DS= 0
##$DSLIST= <SSSSSSSSSSSSSSS>
$$ [...]
##$SUBNAM2= <"">
##$SUBNAM3= <"">
##$SUBNAM4= <"">
##$SUBNAM5= <"">
##$SUBNAM6= <"">
##$SUBNAM7= <"">
##$SUBNAM8= <"">
##$SUBNAM9= <"">
##$SW= 18.05172834244
##$SWIBOX= (0..15)
0 0 2 0 0 0 0 0 0 0 0 0 0 0 0 0 
##$SW_h= 3612.71676300578
##$TD= 16384
##$TD0= 1
##$TE= 0
##$TE2= 300
##$TE3= 300
##$TEG= 300
##$TL= (0..7)
0 120 120 120 120 120 120 120 
##$TP= (0..7)
150 150 150 150 150 150 150 150 
##$TP07= 0
##$TPNAME0= <>
##$TPNAME1= <>
##$TPNAME2= <>
##$TPNAME3= <>
##$TPNAME4= <>
##$TPNAME5= <>
##$TPNAME6= <>
##$TPNAME7= <>
##$TPOAL= (0..7)
0.5 0.5 0.5 0.5 0.5 0.5 0.5 0.5 
##$TPOFFS= (0..7)
0 0 0 0 0 0 0 0 
##$TUNHIN= 0
##$TUNHOUT= 0
##$TUNXOUT= 0
##$USERA1= <user>
##$USERA2= <user>
##$USERA3= <user>
##$USERA4= <user>
##$USERA5= <user>
##$V9= 5
##$VALIST= <valist>
##$VCLIST= <CCCCCCCCCCCCCCC>
##$VD= 0
##$VDLIST= <DDDDDDDDDDDDDDD>
##$VPLIST= <PPPPPPPPPPPPPPP>
##$VTLIST= <TTTTTTTTTTTTTTT>
##$WBST= 1024
##$WBSW= 4
##$XGAIN= (0..3)
0 0 0 0 
##$XL= 0
##$YL= 0
##$YMAX_a= 1032300
##$YMIN_a= -1160709
##$ZGOPTNS= <>
##$ZL1= 120
##$ZL2= 120
##$ZL3= 120
##$ZL4= 120
##$ABSF1= 10
##$ABSF2= 0
##$ABSG= 5
##$ABSL= 3
##$ALPHA= 0
##$AQORDER= 0
##$ASSFAC= 0
##$ASSFACI= 0
##$ASSFACX= 0
##$ASSWID= 0
##$AUNMP= <proc_1d>
##$AZFE= 0.1
##$AZFW= 0.1
##$BCFW= 1
##$BC_mod= 2
##$BYTORDP= 1
##$COROFFS= 0
##$CY= 11.3945322036743
##$DATMOD= 1
##$DC= 2
##$DFILT= <>
##$DTYPP= 0
##$F1P= 2.36226072786647
##$F2P= -0.459571619588291
##$FCOR= 0.5
##$FTSIZE= 0
##$FT_mod= 4
##$GAMMA= 1
##$GB= 0.15
##$INTBC= 1
##$INTSCL= 1
##$ISEN= 128
##$LB= 0.24
##$LEV0= 0
##$LPBIN= 0
##$MAXI= 10000
##$MC2= 0
##$MEAN= 0
##$ME_mod= 0
##$MI= 1.114404
##$NCOEF= 0
##$NC_proc= 0
##$NLEV= 6
##$NOISF1= 3.799351
##$NOISF2= 2.8
##$NSP= 1
##$NTH_PI= 0
##$NZP= 0
##$OFFSET= 15.70392
##$PC= 1
##$PHC0= -18390.96
##$PHC1= 9.00075
##$PH_mod= 1
##$PKNL= yes
##$PPARMOD= 0
##$PSCAL= 0
##$PSIGN= 0
##$REVERSE= no
##$SF= 200.130013532006
##$SI= 16384
##$SIGF1= 3
##$SIGF2= 2
##$SINO= 400
##$SIOLD= 16384
##$SREGLST= <1H.CDCl3>
##$SSB= 0
##$STSI= 0
##$STSR= 0
##$SW_p= 3612.71676300578
##$SYMM= 0
##$S_DEV= 0
##$TDeff= 0
##$TDoff= 0
##$TI= <>
##$TILT= no
##$TM1= 0
##$TM2= 0
##$TOPLEV= 0
##$USERP1= <user>
##$USERP2= <user>
##$USERP3= <user>
##$USERP4= <user>
##$USERP5= <user>
##$WDW= 1
##$XDIM= 8192
##$YMAX_p= 0
##$YMIN_p= 0
$$ End of Bruker specific parameters
$$ ---------------------------------
##NTUPLES= NMR FID
##VAR_NAME=  TIME,          FID/REAL,        FID/IMAG
##SYMBOL=    X,             R,               I
##VAR_TYPE=  INDEPENDENT,   DEPENDENT,       DEPENDENT
##VAR_FORM=  AFFN,          ASDF,            ASDF
##VAR_DIM=   8192,          8192,            8192
##UNITS=     SECONDS,       ARBITRARY UNITS, ARBITRARY UNITS
##FACTOR=    0.0002768,     1,               1
##FIRST=     0,             0,               0
##LAST=      2.2672688,     0,               0
##MIN=       0,             -1160709,        0
##MAX=       2.2672688,     1032300,         0
$$ Real data points
##PAGE= N=1
##DATA TABLE= (X++(R..R)), XYDATA
0@%%%%%%qJ6j6J6k4L2m0N6p2Q8j12J44j76K08k48L04l60M22m99N83o75P84r10
29d87J046j196J365j555J763j994K249k528K836l177L545l949M395m880N408n986
45c145O618p306Q059q883R788j0782J1877j3090J4438j5941J7631j9545K1729
58A1448k4253K7212l0731L4995m0297M7100n6186O9009q8608J22592j97743O41544
70E16082k39476j103130J081176P77648m48569p20650K42499K03034j80231j97008
80f8625J9557j16875P2234J38422k64269m82940K39113N71629j41186o17188R1967
91e58161N69186O8869l80585m8967K76709K51937J14726j16390l62819K398O11899
102D28802L50607n08095m91813K73165M05318j32512k33444N4465P593j77331
$$ plain form
0 0 0 0 0 0 0 0 -8 8 -8 8 -16 16 -24 32 -40 48 -64 80 -96 112 -136 168 -192 230 -269 314 -361 423 -487
29 -487 559 -637 728 -827 936 -1058 1191 -1337 1499 -1678 1867 -2082 2313 -2567 2841 -3145
45 -3145 3473 -3833 4226 -4657 5131 -5651 6226 -6864 7574 -8367 9264 -10281 11448
58 11448 -12805 14407 -16324 18671 -21626 25474 -30712 38297 -50311 72281 -125462 516082
70 516082 276606 -826524 254652 1032300 583731 -136919 105580 308614 128383 -68625
80 -68625 -49068 -165943 -93709 44713 -219556 -702496 -463383 108246 -32940 -650128 -558161
91 -558161 11025 79894 -300691 -349658 -72949 178988 293714 177324 -185495 -183097 428802
102 428802 779409 271314 -220499 52666 457984 325472 92028 146493 154086 -23245
112b3245n9958M3393j1466M9704M2906k56134k60291K61873L86465k00837l92483
123d20073J53234L34434j00203j60845J75066O5269j77143J50874L26513k53467
133I3659m52600L18443O18727k17889o45840P6400N08906l8605l52364O0795K18027
144A87659j36384k13519O2136J36793M3649J2640j32561k44942P9901L97642N0176
155B43190m05312j36953L32278J54065k24321r3162J55552L4672q2374L5446J7447
166C0528j15568J7325J82391j9406k03290R330J62583m2371j21412J03423J30623
177A34156j23036j53447P2619J34989L2891q233o6062j29873K6501K15383M9651
188A85539k00736o3317J48216o084j45092P3983J64044j28518k08542J18184J92312
$$ plain form
112 -23245 -83203 -39810 -51276 -1572 41334 -214800 -475091 -213218 173247 -27590 -420073
123 -420073 -266839 67595 -32608 -193453 -18387 46882 -130261 20613 347126 93659
133 93659 -358941 -40498 578229 360340 -285500 -209100 299806 261201 -91163 -30368 187659
144 187659 51275 -162244 -100108 36685 80334 92974 -39587 -284529 -204628 193014 243190
155 243190 -162122 -299075 33203 187268 -37053 -130215 25337 60009 -22365 13081 30528
166 30528 -85040 -67715 114676 95270 -108020 -98690 63893 21522 -99890 3533 134156
177 134156 11120 -142327 -69708 65281 98172 89939 23877 -105996 -79495 135888 185539
188 185539 -15197 -78514 69702 63618 -81474 -7491 156553 28035 -180507 -62323 129989
199A29989j30776j81536J22713J50476j17179j25792Q7587Q2080n0039n276N7509
210A9756k6368m4834N0776L8285k7044M1258O7045r2687j24407J07063J78757
221A87600o0687j65202J2450Q3011l4154k6671O7964j6686j21009q44J02228k3311
233D689r4440L7807P7431o3834p9702O3224P0735m2755l0247M4722J2457k8802
245b8715J8291L0620j4462J6775N7533l5233r3192M0361J27213r704j12763q596
257a1872O2374k3621l9311N4781K5700q8800m8619O3792K4891n9076m174N1299
269G364k6448o6790K4830O3406r219l4322J2783J3532j0766J6425K5829j6437
281A87l838M6580J553o5405J833R1808K0975q5841k9528O0009R802m9128O636
$$ plain form
199 129989 -787 -182323 -59610 90866 -26313 -152105 -64518 17562 -32477 -37753 19756
210 19756 -6612 -51446 -670 37615 10571 51829 118874 26187 -98220 8843 187600
221 187600 126913 -38289 -25839 57172 23018 -3653 64311 47625 -73384 -74228 28000 4689
233 4689 -89751 -51944 25487 -38347 -118049 -54825 15910 -26845 -57092 -12370 87 -28715
245 -28715 -10424 20196 5734 22509 80042 44809 -48383 -8022 119191 109487 -3276 -11872
257 -11872 50502 26881 -12430 42351 68051 -20749 -69368 -5576 19315 -39761 -43935 7364
269 7364 -19084 -85874 -61044 2362 -6857 -41179 -28396 -14864 -25630 -9205 16624 187
281 187 -3651 42929 44482 -20923 -19090 72718 93693 7852 -21676 38333 48135 -993 5643
294E643M0692k6703n4778P914K8425j2699o958J6280j8851l8422J4922M0989n780
307i326k2726J4766J2133k0860K517L7126P974j9509R323J7201k0782j2241M3694
320C9290K5896m3778l2326K8995J8272k7831r241K5071q021l9287n937K1229l23
333g991q869N347p628k4434L755K9035L635j3958P358J1081j2727l807K8124J8819
347B7740j3606p320J3285M09q430J5015J6937j6771k2590Q139J2173j5040r724
360B17J3254k906k8151j1661J5328O216j0823m456J123r361m899J1102J1315M038
374i664K163l674r767P022K9157J5039j6661j1755J5586J4438o544n213J0477
387C0604L458j3672q667M024J450p053o306n616n945m299m332o737r11Q264j135
$$ plain form
294 5643 46335 19632 -35146 -27232 1193 -11506 -18464 -2184 -21035 -59457 -44535 -3546 -9326
307 -9326 -32052 -17286 -5153 -26013 -23496 13630 21604 2095 11418 28619 7837 -4404 39290
320 39290 65186 21408 -10918 18077 36349 8518 -723 24348 16327 -22960 -28897 -7668 -7991
333 -7991 -16860 -11513 -19141 -43575 -39820 -10785 -7150 -21108 -13750 -2669 -15396 -19203 8921 27740
347 27740 14134 6814 20099 20508 12078 27093 44030 27259 4669 12808 24981 9941 217
360 217 13471 10565 -17586 -29247 -13919 -7703 -18526 -22982 -21859 -31220 -36119 -25017 -13702 -9664
374 -9664 -7501 -11175 -20942 -13920 15237 30276 13615 1860 17446 31884 25340 20127 30604
387 30604 34062 20390 11723 15747 17197 10144 3838 -1778 -7723 -12022 -16354 -23091 -24002 -15738 -16873
402a6873j6093p276J1732J3422M403L623r07j2766k725K9135L1529q319l1549
415b664l205K9911J9078j0962j5118r80N441J228m335o381o115q62j941j1328
429h233o702R279L587k1373j8434K0447L1327j4254m6626k168N5307L4887l6532
442E12m9657J3764N5243K2103k5972k7172L910K1153J1022n346q723J982M493
455A7312j1942j5186J4002K9303j0235n0958j4155N3340L6867m3252n5790J7519
467c3175N5055P079l6620j6613J0036Q767J2209J6079j4191m1072l963N1148K7276
480D2015l9474m0714J3390K9654k74q108N691n614k2379L220L0425J3661j3939
493G554j2379l651k000K1453M1488o367o7670k4742P7668O8035n6798r9388J0869
$$ plain form
402 -16873 -32966 -40242 -28510 -15088 -10685 -7062 -7969 -20735 -23460 5675 37204 28885 -2664
415 -2664 -5869 24042 43120 32158 17040 16060 21501 22729 18394 12013 5898 5036 3095 -8233
429 -8233 -14935 -5656 -2069 -23442 -41876 -21429 9898 -4356 -50982 -53150 2157 37044 512
442 512 -49145 -35381 19862 41965 15993 -11179 -7269 13884 24906 19560 10837 12819 17312
455 17312 5370 -9816 4186 33489 23254 -27704 -41859 11481 48348 5096 -50694 -33175
467 -33175 21880 28959 -7661 -24274 -14238 -5471 6738 22817 8626 -32446 -36409 14739 42015
480 42015 2541 -38173 -24783 4871 4597 -3511 2180 -3434 -25813 -22593 7832 21493 7554
493 7554 -4825 -8476 -10476 10977 52465 46098 -21572 -46314 31354 99389 42591 -56797 -45928
506d5928R5298K5049p4324n6173K6092M3695l461l0573j6218L922R287j799j1077
519c6210P078K9869L181n0690k5046P4981Q5106m3661j14182N418J31499N8978
531A26321r1759q0787M5477P4824m554m2596j4464l522q429J4402J7790k7640
543E063m1860L896K2153j3578j6797K1352N099m8434j8890O4904N1130m6070o4098
556g6130K2244P0048K7628j6599k5195k0831J0266O0972M6175m5743q1133Q898
568a9400Q5876K8415o7342n7026K1207M0357q159l1990r591N669p893j5890J201
581c4566J9396J0968k0204l6769j299N7840N2254l7417q8063J81J16009P0620
593A08950q4402j08984L8048J22665K0684q8861m5353M4449L6661j5733j7825
$$ plain form
506 -45928 49370 74419 95 -56078 -29986 13709 10248 -20325 -36543 -32621 -23334 -25133 -36210
519 -36210 -29132 737 3918 -46772 -71818 3163 88269 44608 -69574 -64156 67343 126321
531 126321 34562 -46225 -748 74076 69522 26926 12462 8940 511 14913 32703 5063
543 5063 -36797 -32901 -10748 -24326 -41123 -19771 -14672 -63106 -81996 -17092 34038 -12032 -76130
556 -76130 -53886 16162 43790 27191 1996 -18835 -8569 52403 98578 52835 -28298 -19400
568 -19400 66476 94891 27549 -29477 -8270 32087 23928 -8062 -17653 -11984 -19877 -35767 -34566
581 -34566 -15170 -4202 -24406 -61175 -62474 -4634 47620 10203 -77860 -77679 38330 108950
593 108950 24548 -84436 -46388 76277 96961 8100 -37253 7196 43857 28124 10299
604A0299L615l366j3789l006M056M662J0944p518m3342j9976N7551N9097m6113
617A3114r2578P730R8050M1132o3570o3833J4801N7208L1304j7657m4957k2198
629d1454L1706M5352l304l9590j4771J9356J1846n903L252J0123r632k2854k442
642a8315K7856K6408j0614l9961k1281L0729M9675R20n6147m0666L0108O1385
654D0097J0201n7727n1205K2971O4384J1664n7470l7868L3921M0489j6163l0264
666b6970J2765K4287j4938k3443J9806L7625l31l7194k1613K5162M6274J3439
678E4869m2992m7998J8570O4859J5462n7652m6180K5676M6890j072l7147k2062
690b8777Q063J7838M247j2785j0425N398O587r833n303K1787J8261k1180k8039
$$ plain form
604 10299 13914 10548 -3241 -6247 -2191 2471 13415 5897 -37445 -57421 130 59227 13114
617 13114 -79464 -71734 26316 67448 3878 -59955 -45154 12054 43358 25701 -19256 -41454
629 -41454 -9748 35604 32300 -7290 -22061 -2705 9141 3238 6490 16613 6981 -15873 -18315
642 -18315 9541 35949 25335 -14626 -35907 -5178 44497 45417 -10730 -51396 -21288 40097
654 40097 50298 -7429 -58634 -35663 28721 40385 -17085 -54953 -21032 19457 3294 -26970
666 -26970 -14205 10082 -4856 -28299 -8493 29132 28801 -8393 -30006 -4844 41430 54869
678 54869 11877 -36121 -17551 47308 62770 5118 -41062 -15386 31504 30432 -6715 -28777
690 -28777 -20714 -2876 1371 -11414 -21839 -16441 -9854 -19687 -24990 -3203 15058 -6122 -34161
703c4161J7053M4071R713l4009k5103J7131L6221J3850k2558l1830j095K9952
715A9235J8721j8825k8438k644J4617N519o874r010p045j785L596K024j093K094
729i908M42j0466n220J9015K2129r818k7023J833L2283J7722j6410k0915K495
742c841J9363J3259o217j7990q322J0021J1195n623j1570k396m59n043j156O571
756b208l83j1196o436O599P213J401k518n065k897Q462J5066J699j4130n148J3839
771D298J3509k611r354j959M411N463J412m526p620j236L402M26m271k273k093
786c022n449k484M890L009n394n614J250L594K838K546m96m498J230J0439N786
801H625o728m554O871Q050j237m309R31J914p73p95j38j667k037j341j789j674
$$ plain form
703 -34161 -17108 26963 36676 2667 -22436 -5305 30916 44766 22208 -9622 -10717 19235
715 19235 37956 19131 -9307 -11951 2666 8185 1311 -7699 -14744 -16529 -12933 -10909 -12002 -9908
729 -9908 -9466 -19932 -25152 -6137 15992 6174 -20849 -19016 13267 30989 14579 -6336 -3841
742 -3841 15522 28781 22564 4574 -3748 6273 17468 11845 275 -2121 -2580 -7623 -8779 -2208
756 -2208 -2591 -13787 -20223 -13624 -6411 -5010 -7528 -12593 -15490 -7028 8038 9737 -4393 -9541 4298
771 4298 17807 15196 5842 3883 8294 13757 15169 10643 3023 1787 5189 5615 1344 -929 -3022
786 -3022 -8471 -10955 -6065 -3056 -8450 -14064 -12814 -9220 -6382 -3836 -4332 -8830 -7600 2839 8625
801 8625 1897 -2657 4214 12264 11027 6718 7649 9563 8790 7995 7857 6190 4153 2812 1023 -651
817f51L88n95n814m412N186L692n427n880L694M930k383j619M645L143j999m6
833c148M388L102l25K81J855N46K319J250l147k924L726L492n247o756K905M649
849F966n328p265Q33L090k350l362j44j02j063J504O09k860J125O679J696n509
865e481o83Q738L925m245j494N257L579j632j515j13J41J350J166l877m495K646
881C267K709o009o321L065M355m661n799K053J910k204J472J614l788j191Q011
896a517N197o627n287Q946P724m209l569M407L135k794o29K554r68j627J378k070
912D044m926J877N234n420j0645K101J1199j156j1595l449P116N335j539l796
926e620k368K753P379J323o521J64P645J91n881L631Q967m551j1409L346J1316
$$ plain form
817 -651 -263 -858 -6672 -11084 -5898 -2206 -7633 -13513 -9819 -4889 -7272 -8891 -4246 -1103 -3102 -3148
833 -3148 1240 4342 4017 4298 6153 6699 9018 10268 7121 4197 7923 11415 6168 -588 2317 6966
849 6966 1638 -5627 -4794 -1704 -4054 -7416 -7560 -7662 -8725 -7221 -6612 -9472 -8347 -1668 28 -5481
865 -5481 -6164 2574 6499 2254 760 6017 9596 7964 6449 6336 6477 7827 8993 5116 621 3267
881 3267 5976 -33 -6354 -3289 1066 -3595 -9394 -7341 -5431 -7635 -6163 -4549 -8337 -9528 -1517
896 -1517 3680 -2947 -8234 712 8436 4227 658 5065 8200 5406 4777 7331 6363 4736 6114 4044
912 4044 -882 995 6229 809 -9836 -7735 3464 2308 -9287 -12736 -5620 -285 -1824 -5620
926 -5620 -7988 -5235 2144 3467 -3054 -2890 4755 4946 -935 2696 11663 7112 -4297 -951 10365
941A0365j776q489p49K97k856M011P182r194j4297P684J6844n788j5722M012J1024
956B548n493n372J2804M914j6385o036J8712J0129j3679q777P470M022k841M281
970F297K712j1595q276J1865J1611q057j2031L93M197R13M071K493q794r044O414
985f831J3202J707r431p382J512R885Q442m517r863j563N905K422L021M152q252
1000B409j6404N226K4822J311k6607j0182J9079J0291r983l288L646r330m614
1013a3624J8256J1450j8996j3593J4778R536j0082K722J4523j3158k4080J7528
1025d740L5232j0640m0193j128L2120R383j5822r986j657j718R370J3882p789
1038F314k2218J873J8810J362j0586K939N165j1416n957J8338J5073j3437k1161
$$ plain form
941 10365 8589 100 -649 -352 -3208 803 7985 -1209 -15506 -7822 9022 3234 -12488 -8476 2548
956 2548 -2945 -8317 4487 9401 -6984 -13020 5692 15821 2142 -6635 835 4857 2016 6297
970 6297 9009 -2586 -10862 1003 12614 4557 -7474 -7081 -2884 -1971 2100 4593 -4201 -13245 -6831
985 -6831 6371 8078 -1353 -8735 -7223 2662 11104 6587 -3276 -4839 1066 3488 6509 10661 2409
1000 2409 -13995 -8769 16053 17364 -9243 -19425 -346 9945 -38 -3326 320 -9010 -13624
1013 -13624 4632 16082 -2914 -16507 -1729 7807 -2275 447 14970 1812 -22268 -4740
1025 -4740 30492 19852 -20341 -21469 10651 20034 4212 -5774 -7431 -9149 221 14103 6314
1038 6314 -15904 -14031 4779 6141 -4445 -1506 3659 -7757 -13714 4624 19697 6260 -14901
1051a4901J91J9571J5878n588k2262j2513J6774K2909l427k1586r369P201R591
1064B469Q192r12j7482j3625J4102K0656o121j5985K319N211p430L219K1338r92
1078A4959k9625p098K9360J6052j5217j3083j179j376R243K2487m601l8759j0629
1091b9466L8181K2502k7037k5571J0527J3596k987J276L281j1861r937J2617J2876
1104G997n529n248K736o996o670J9510K1917j8059l2974O564L5206J0943k1704
1117G693k1197o87J6991J9331m148k7510j3321K0087J8236r978j4058K259J237
1130e065n705O101J2285m528j5085j694R621P075O606j68j8687j2875K3939K9974
1144C1794j2996l5377j903K7363J2484q845j1208r625k740J6779J4948j4810k3764
$$ plain form
1051 -14901 -14710 4861 20739 15151 -7111 -19624 -2850 20059 16632 -4954 -14323 -7122 2469
1064 2469 10661 9749 -7733 -21358 -7256 13400 7279 -8706 -6387 -1176 -8606 -5387 15951 14959
1078 14959 -14666 -21764 7596 23648 8431 -4652 -5831 -7207 2036 24523 19922 -18837 -29466
1091 -29466 8715 31217 4180 -21391 -10864 2732 -255 1021 4302 -7559 -17496 -4879 7997
1104 7997 2468 -2780 -44 -7040 -13710 5800 27717 9658 -23316 -16752 18454 29397 7693
1117 7693 -13504 -14191 2800 22131 17983 -9527 -22848 -2761 15475 5497 -8561 -6302 -5065
1130 -5065 -10770 -4669 7616 3088 -11997 -13691 -4070 3005 9611 9443 -9244 -22119 1820 31794
1144 31794 18798 -16579 -18482 8881 21365 12520 1312 -8313 -11053 5726 20674 5864 -17900
1157a7900N034J8584k134q836M812N32j4541j164K1131Q253j6072j1866M962Q273
1171i32R049P560j1518k3595N656L3376Q769k9738j8082J5134J7589j252p106
1184D910p225p559M405J4202N50j4740l476P865j287m028R911O235j5917j3253
1198a9407J5148J9241m671j6062n672N250J0380J1498n374k1613n950K3022J4757
1211B0547j5588j6660M915R744L88LL00q025n128Q349O967m518k846K112m600
1226d040n109J2047J2505j1993j8415O335J9375J555j1243o682j31L051J0046
1239G301M728j3687j2774R709J4789m827j1645J931M812l679P8P533r04r379m22
1254f436P390K645j259R82m257o763O240J3633k785j5936k303J2639N315o519
$$ plain form
1157 -17900 -12866 5718 3584 -5252 -440 92 -14449 -15613 5518 13771 -2301 -14167 -9205 -932
1171 -932 8117 15677 4159 -19436 -13780 19596 28365 -1373 -19455 -4321 13268 12016 4910
1184 4910 -2315 -9874 -5469 8733 9283 -5457 -8933 -1068 -2355 -6383 3528 9763 -6154 -19407
1198 -19407 -4259 14982 10311 -5751 -11423 -6173 4207 15705 10331 -11282 -17232 5790 20547
1211 20547 4959 -11701 -6786 2958 3346 3349 3649 -4376 -9504 -1155 5812 1294 -1552 560 -4040
1226 -4040 -9149 2898 15403 3410 -15005 -8670 10705 12260 1017 -5665 -5796 -2745 7301
1239 7301 12029 -1658 -14432 -4723 10066 5239 -6406 -4475 337 -3342 -3264 4269 3365 -6014 -6436
1254 -6436 954 3599 2340 3322 -935 -7698 -1458 12175 9390 -6546 -8849 3790 9105 2586
1268B586l914o02k030L552P343l333j0581J75Q906N65n558J500K533n224j598
1283e680P659L208o818l347M253K022n92K644p02p641J07J0500L017r580n265
1298f215O521M127k683r84O24k914o90N317J412o424j747N214L88m394J656M030
1314C238m381n001M447N196l644m112K207J421j754K285K407m394l550O285N627
1329F277n653m770M816M259l432j397L822j54m052J282L843k399l525J930J815
1344B662l350j669K924q05m632M48L877j111l069P09J499j087N76K771m05k334
1360b996K417M052j432k359L177K383j342p64K223q6k884Q56J975k927k999K208
1376A502O77m601k459L327J25m882n93L898m54l622J195L311q20j008L696J796
$$ plain form
1268 2586 -1328 -1930 -3960 -408 6935 3602 -6979 -6804 2102 2667 -2891 -1391 1142 -4082 -5680
1283 -5680 1979 5187 -1631 -4978 -725 1297 705 3349 2647 -4994 -4887 5613 8630 -950 -6215
1298 -6215 306 4433 1750 766 1390 -1524 -2214 3103 4515 -1909 -3656 1558 1946 -2448 -792 3238
1314 3238 -1143 -6144 -1697 3499 -145 -4257 -2050 -629 -2383 -98 2309 -2085 -5635 650 6277
1329 6277 624 -4146 670 4929 1497 100 3922 3768 -284 998 4841 2442 -1083 847 2662
1344 2662 -688 -2357 567 -238 -4870 -4422 -545 -1656 -4725 -4016 -2517 -3604 -3028 -257 -662 -2996
1360 -2996 -579 3473 2041 -318 2859 5242 3900 3136 5359 5273 2389 3245 5220 2293 -706 1502
1376 1502 2179 -2422 -4881 -1554 -1429 -6311 -6904 -3006 -3460 -7082 -5887 -2576 -3396 -4404 -708 1088
1392A088j580P5M504J178k868P20M043J11l409O05J873j374k869L98j21j753j578
1409i57j55k005j524O12L17j713j365J493R13q53J010J362l70N66L498J657j463
1426A023J80L042L74j829J870K914k340l439J446L451k349l683j1O17k321k10
1442a265J368k518m234J353M722j155m534M52L851j71j881J938L091j495j918
1457b396K623M068n51k697n15J407J899R92r42l355j475K576L026j409m909k018
1473c676K961L224j741l829o60K881Q08j496Q57J616k026k633K514N219p64m911
1489a656j346K552J901J323m70l770l704L128P398p71r409k946P038M595l229
1504F34k915N32j3l69L781L545l525m708K024N100Q51j931o68k294k251L653O590
$$ plain form
1392 1088 -492 -417 4087 5265 2397 3117 7160 7271 3862 4467 6340 4966 2097 2495 2374 621 -957
1409 -957 -1112 -3117 -4641 -4029 -3712 -5425 -6790 -5297 -4384 -5237 -4227 -2865 -3235 -2669 829 2486 1023
1426 1023 1203 4245 4619 2790 4660 7574 5234 1795 3241 6692 4343 660 649 1266 -1055 -1265
1442 -1265 103 -2415 -6649 -5296 -574 -1729 -6263 -5811 -1960 -2131 -4012 -2074 1017 -478 -2396
1457 -2396 227 4295 3744 1047 532 1939 3838 4830 3888 533 -942 1634 4660 3251 -1658 -3676
1473 -3676 -715 2509 768 -3061 -3721 -840 -32 -1528 -671 945 -1081 -3714 -1200 4019 3255 -1656
1489 -1656 -3002 -450 1451 2774 2304 -1466 -5170 -2042 5356 4585 -4824 -7770 -732 3863 634
1504 634 -2281 -1749 -1762 -2131 1650 5195 1670 -3038 -1014 4086 4937 3006 2338 44 -2207 1446 8036
1521H036j562j0465m462P936P176l196q755l395L676N042R21l357m203j221M231
1536c598N226K55l489k249J873K909K882K581r55m656l178N955Q708r67j1300
1551cn757P627R014k541r591n682J698N816L279l811q785l725O881O156k553n355
1567g332m5K343J15K888O076q10p577j937J0262Q871k850q576l577M751Q469L623
1583A4694p262j1375j117J1171O077p935j1540j960O597L949k082m684l958o04
1597a0029L039M457J865k432m883r69N811Q858K363p504p059M492J2137N776o621
1612I301j1469j921J0914R971n324j3646m665P226O662k301o567m848j661K263
1626f065M601J383m885n456j42M460N718L644m022q653k22J2812J1059o286j3243
$$ plain form
1521 8036 6474 -3991 -8453 -517 6659 3463 -5292 -8687 -5011 31 952 -2405 -6608 -7829 -3598
1536 -3598 1628 1883 -1606 -3855 -1982 927 3809 6390 5435 779 -2399 3556 12264 11297 -3
1551 -3 -5760 1867 10881 8340 -1251 -6933 -5235 581 3860 49 -8736 -12461 -5580 576 -1977 -7332
1567 -7332 -7377 -5034 -4919 -2031 4045 3235 -4342 -6279 3983 12854 10004 1428 -2149 2602 11071 14694
1583 14694 7432 -3943 -5060 6111 12188 4253 -7287 -9247 -2650 1299 -783 -5467 -9425 -10029
1597 -10029 -6990 -2533 -668 -3100 -7983 -8952 -3141 5717 8080 576 -6483 -1991 10146 15922 9301
1612 9301 -2168 -4089 6825 16796 11472 -2174 -6839 387 7049 4748 -1819 -6667 -8328 -6065
1626 -6065 -1464 -81 -4966 -10422 -10564 -6104 -386 3258 -764 -9417 -9639 3173 14232 7946 -5297
1641e297j318J2080R081k953r426n928L636Q762K325p168q464k08M724K526j772
1656F00k503l708l788K310P008K944n787p529L37R266Q018j969j0550m923R019
1671a255J2435n3j0297o858M496R142L447n110p778j855M912N116j566n009k778
1686c011m26K75L155M124l617q870j607Q098P812k795q458m407M535R145M049
1701H002o860r311J458J0996N721o028p777J39M865M264J80k855m119j402L040
1716C13L605R56l541m334k065L808O137K15p402o184L051Q325K983n523p941l93
1732g990P267O309k361p675j966N364M787j80k727k245n14J948L917J209k743
1747B400l546l26K790K824J151l516n625l76O021M425m520p595q19N773M342k052
$$ plain form
1641 -5297 -6615 5465 14546 11593 2167 -3761 -125 8637 10962 3794 -4670 -4878 -154 2372 600
1656 600 -1903 -5611 -9399 -7089 -81 2863 -2924 -10453 -10116 -850 7168 5199 -5351 -10274 -1255
1671 -1255 11180 11127 830 -6028 -1532 7610 11057 5947 -1831 -3686 1226 6342 4776 -233 -3011
1686 -3011 -3437 -3162 -7 4117 500 -8370 -9977 -1879 5933 3138 -5320 -9727 -5192 3953 8002
1701 8002 1142 -8169 -6711 4285 10006 3978 -3799 -3660 1205 5469 5649 2794 -1325 -2727 313
1716 313 3918 4874 1333 -3001 -5066 -1258 4879 5094 -2308 -8492 -5441 2884 5867 344 -7597 -7990
1732 -7990 -723 5586 3225 -4450 -6416 -1052 3735 3555 828 -1417 -1931 17 3934 5143 2400
1747 2400 -1146 -1472 1318 4142 5293 1777 -3848 -4224 1797 6222 1702 -5893 -6712 -939 3403 1351
1763A351m700l052K529M759J878k917l694O11L235K466j21j102j147j253J902
1778G45L159Q04l074l064q5L221K655j423n180k307L195M133o11m520k164J698
1794b818K846J098j168k321q61K443K825m5k151m08R29N00R89J130o01l178o86
1811a477K759J847j792l109r81J540J526j72j608k322L22K764J508j132j756K45
1827a838K085J553j05p74k48P70O28P63m2l29j108q45P16J231j027k626p80M54
1845a522R59j182q64l23j035N12J783L81k285P3K599J748r07m50J881O61oJ141
1863C164J272o88j237N72J446r18j819L8L9j489q69M85r35j998q42R98L00j382
1881c863r80J017O07JM76O86L29Q09P95J402Q54k46N91J007O59k0o10K97J02o53
$$ plain form
1763 1351 -3349 -6401 -3872 887 2765 -152 -3846 -3235 0 2466 2345 1243 96 -1157 745
1778 745 3904 4708 1634 -1430 -1515 1706 4361 2938 -2242 -4549 -1354 2779 2168 -2352 -4516 -2818
1794 -2818 28 1126 -42 -2363 -3224 -781 2044 1999 -152 -560 369 869 1858 2988 2387 -791 -1477
1811 -1477 1282 3129 1337 -1772 -2753 -1213 313 141 -1467 -3789 -3467 -703 805 -327 -2083 -1838
1827 -1838 247 1800 1695 921 673 1443 2071 2834 2792 2463 1355 510 1226 2457 1430 -1196 -1976 -1522
1845 -1522 -563 -1745 -2609 -2932 -3967 -3455 -1672 -1291 -3576 -3503 -904 844 -63 -513 1368 2029 2023 3164
1863 3164 4436 3748 2511 3083 4529 3611 1792 1830 1869 380 -489 -4 -939 -2937 -3779 -2781 -2481 -3863
1881 -3863 -4843 -3826 -3219 -3218 -2742 -2056 -1727 -918 -123 1279 2133 1887 2478 3485 4144 4124 3514 3811 3913 3260
1901C260j000k31n5j289j336ML25j610j802J037L53j342m06Q90P60j275M08K027
1919a282J42q84R58K560K9j357J371J791n26j292J289J224j130j352R15K77j234
1936A499r25N11l16j799j67P25n50j403j18J003j43n29k7O41QR9L09O55L36j02
1956b93l33J194J059l53p95j10J178N48o58K1P1j128k33J739j56j985q81J365
1974B50J123j666l09R81n71j824R09K201m10k868J94K172M8o60J14j64j049O81
1992h48K365j73l061p36K700J368j041j007J89p3J73Q32J076j264j434P16J282
2009A064M84m68r26j402J038J400Q34j333k051k30J443J958n94k600j637J503
2025a517K866o3k657r04N47R43O39J271r37k439m6K953J748j731j389mK78J170
$$ plain form
1901 3260 2260 2029 1974 685 -651 -647 -322 -1932 -3734 -2697 -2344 -3686 -4092 -3202 -2442 -3717 -3309 -1282
1919 -1282 -1140 -2024 -1066 1494 1523 166 1537 3328 2802 1510 2799 4023 2893 1541 2456 2733 1499
1936 1499 574 1085 769 -1030 -1197 -472 -1022 -2425 -2543 -1540 -1683 -2212 -2239 -1598 -1590 -1491 -1182 -527 -191 -293
1956 -293 -626 568 1627 1274 479 369 1547 2095 1437 1458 1529 401 168 1907 1751 -234 -1115 250
1974 250 1373 -293 -602 379 -192 -2016 -1107 1094 684 -2184 -1990 182 230 -430 -316 -480 -1529 -848
1992 -848 1517 1344 -1717 -2453 247 1615 574 -433 -244 -317 -144 688 1764 500 -934 -218 1064
2009 1064 1548 1080 154 -1248 -210 1190 2024 691 -1360 -1590 -147 1811 1217 -1383 -3020 -1517
2025 -1517 1349 1286 -1371 -2275 -1728 -785 -146 1125 188 -2251 -2297 656 2404 673 -716 -720 -442 728
2043G28K707n41m008j817M024L693j629m374n89J711J478O38q95l177j576K497
2059a130L046o36l217j124Q67J359J386O97j936k780P07M019K272j902l696p63
2075b831K768L832N51l847l695J549M810J163k631l259o58J672L108Q09l335l118
2091c112O26K734J278p03j117k121j332L598L988j389n303k073M122M170k08k773
2107C85l276q13M034M906j626o519j591M445L528p32k992j380o62J794L178J018
2123C697l724l549J496L725J611p59k983l444J606N121K636m447n408L50M739
2138F67L304j680m301l275K349N398J499m340l700J002K515K120J068j869l324
2153b567r89M413M198k190l864j463J506L430K468j284o000k885N282N747k304
$$ plain form
2043 728 3435 2894 -1114 -2931 1093 4786 3157 -1217 -1806 -95 1383 2021 1126 -2051 -3627 -1130
2059 -1130 1916 1280 -1937 -3061 -2194 -835 551 1248 -688 -3468 -2761 1258 3530 1628 -2068 -2831
2075 -2831 -63 3769 4320 473 -3222 -1673 3137 4300 1669 -1590 -2248 -576 2532 3341 6 -3112
2091 -3112 -2486 248 1526 823 -294 -2415 -3747 -149 3839 2450 -2853 -4926 -804 3366 3158 385
2107 385 -2891 -3704 330 5236 3610 -2909 -4500 -55 3473 2741 -251 -1631 -2293 -499 2679 3697
2123 3697 -27 -3576 -2080 1645 3256 2497 -486 -3930 -2324 2797 5433 986 -4422 -4072 667
2138 667 3971 2291 -2010 -5285 -2936 2462 3961 -379 -4079 -3077 -562 1558 2626 757 -2567
2153 -2567 -3556 857 5055 2865 -999 -2462 -956 2474 4942 3658 -2342 -5227 55 5802 3498
2168C498o193k202K922L145J127j472m230k031L295N068l63m405j888J516K022
2183a91K542J384k779m253Q19N586K808l407m142j278L306L832M46m463m992J046
2199c736N718K011l644l935l89J894K869J471k523l704PM238K095n69j745j719
2215a661m72K705M644j021n629k054M124M168r71l180k667l94K631L950j772n728
2231c327k364M321L389j008k734q45p27J036L564J297l019l000J621L484J582
2246C270o84k050k288Q27M152K228l225m600K06M066J658j809k877k064R12L010
2262G32J459l228k959P11K353J040r0m55j845j057L037L487j274k935m46J575
2278A05J850J433n01l061j884K914L550j184m044j236K017J219J72p95j926j800
$$ plain form
2168 3498 -2695 -4897 -1975 1170 2297 825 -3405 -5436 -2141 2927 2564 -1841 -3729 -2213 -191
2183 -191 2351 3735 956 -3297 -2478 3108 5916 2509 -1633 -2911 395 4227 4673 210 -4782 -3736
2199 -3736 1982 3993 349 -3586 -3975 -2081 788 2259 -264 -3968 -3961 277 2372 1803 58 -1661
2215 -1661 -2133 572 5216 4195 -1434 -3488 636 4804 3833 653 -2014 -2408 223 4173 2401 -3327
2231 -3327 -5691 -1370 2019 1011 -1723 -2568 -3295 -2259 1305 2602 -417 -3417 -1796 1688 3270
2246 3270 2586 536 -1752 -925 3227 5455 2230 -2370 -2164 1902 3560 1751 -1126 -3190 -2278 732
2262 732 2191 -1037 -3996 -3285 -932 108 18 -437 -2282 -3339 -302 3185 1911 -1024 -1470 105
2278 105 1955 3388 2887 -174 -2058 856 4406 3222 -822 -2058 -41 1178 1350 555 -1371 -3171
2294c171J300K716j9k819q34P14J411O69O46o84k350M13L470J213j876j816L97
2311f20J576J590J55j051k867L88K655P84j680k031L90N58O95M21q06k342k23
2328b408K223O64j138p19Kj28O06J955q7k147o27J946J422r02q40J51K37J60J018
2347A388O45j919j097J469J502j277j464M48N71m49L65N24r30j063M15J135j40
2364A23j045J37q6J42Q85M20o94q47M17R76J28n76P2k59K9R87K29q05p78P48P45
2385I48m45k66m8o9q86J058Q48j360q23P43P52n09n31L39L0p95O27J153m55j399
2405a088K45J450m66p51K71P04m46k49J134J15j216k67J274K44j007k34M36L27
2423D76o02L69K81q53m07P08J66k04l56L4K79k58J84L97l75k21M11L60l6j47L27
$$ plain form
2294 -3171 -1871 845 826 -1993 -2827 -2113 -702 -33 613 -71 -2421 -2008 1462 2675 799 -1017 -620
2311 -620 956 2546 2701 1650 -1217 -829 1826 2610 930 -1101 -711 -153 542 963 157 -2185 -2408
2328 -2408 -185 479 -659 -1378 -1376 -1504 -898 1057 970 -1177 -1804 142 1564 662 -178 -27 210 370 1388
2347 1388 2033 114 -983 486 1988 711 -753 -305 266 -183 182 706 -224 -1287 -872 263 123
2364 123 -922 -785 -871 -729 156 576 -118 -965 -548 428 556 -20 52 -207 -178 809 1038 233 -545 203 948
2385 948 503 237 189 120 -766 292 1140 -220 -1043 -300 452 -57 -588 -249 -219 -1014 -387 766 311 -1088
2405 -1088 -843 607 141 -610 -339 365 -81 -330 804 919 -297 -564 710 954 -53 -287 149 476
2423 476 -126 243 524 -329 -736 -28 138 -66 -422 -388 -109 -367 -183 214 -161 -382 29 389 353 206 533
2444E33n86L35N71m03o51L74L57l70k99Q1J96n95n38P30p5m22J22M66J34r84O49
2465c75Q20r21k54O91R43q08l96P06N62l98k10P30k31j107M87O87l79p65J49L93
2485C24o60l23P18J0r93j23Q08n2k55o34O42Q7M1O42J22l69l26P77O04m85J09
2506F64n7l34M52N32j43r28m95K57M33K17l08p74p33N38P14K2j127l31N45M72
2526c84M02j9j40r49L56J283O93o75o22r3M46K61Q66k69j540l79J434Q44o79j440
2546f04m82K97Q41M83l73j348m43J175J099m36o11p20O51N11R35m06o95r58P62
2565c22J851K37j105j129l72J042J289j72j439j601M10J845P15j342j317j62J116
2582d56J178M24j351j473L75J952R55o00j172r71P18J729O34q95j895p15J656
$$ plain form
2444 533 -53 282 853 450 -201 173 530 160 -139 -58 138 -457 -995 -265 -340 -762 -640 -174 -40 -1024 -375
2465 -375 445 -476 -730 -39 904 96 -300 406 968 570 360 1090 859 -248 239 926 547 -218 -69 324
2485 324 -336 -659 59 69 -924 -1047 -239 -291 -546 -1180 -538 -451 -410 232 354 -15 -341 436 1040 555 664
2506 664 607 273 725 1257 1114 186 -309 -52 381 598 290 -484 -1217 -679 35 57 -1070 -1401 -856 -384
2526 -384 18 -1 -141 -1090 -734 549 1242 567 -55 -148 298 559 1425 1156 -384 -763 671 1515 836 -604
2546 -604 -1086 -789 52 535 162 -1186 -1629 -454 645 209 -402 -1122 -471 40 975 569 -126 -1084 -322
2565 -322 1529 1766 661 -468 -840 202 1491 1319 -120 -1721 -1311 534 1249 -93 -1410 -1572 -456
2582 -456 722 1146 -205 -1678 -1303 649 1604 1004 -168 -1139 -421 1308 1942 1047 -848 -1563 93
2599I3J597j34j829j806Q6K486R41q15k295q64J504J862K81j012j902j47K032
2616G8K077m12k236j018J256J616J145p90j688j967J658K770J07k484k339N19
2632a708J898J308m66k153j726Q50K841R90j876k503L63K244J412pj335j525N5
2649a338K202K145q56k476j265J643K140L27j762k655k74K388J836l12k746j769
2665b772Q41K403J305j586k737j85K386K132l39j680j262K83J823K165m09k845
2681d77j530J562K655M80j802k074p81J341K622L81k900l062J325L230R32k053
2697a51k013j94J071J922J274j897k491K90L148J432r06j878o48P17J993J302
2713B971r31l045j159K232K678m90k496k181O01K047J207r68k515r40J244K447
$$ plain form
2599 93 1690 1556 -273 -2079 -1993 493 1434 619 -1676 -2540 -1036 826 1107 95 -1807 -1954 78
2616 78 2155 1743 -493 -1511 -255 1361 2506 1716 28 -1939 -281 2489 2596 112 -2227 -1708
2632 -1708 190 1498 1032 -1121 -2847 -1997 844 1834 -42 -2545 -2182 62 1474 1467 132 -1393 -1338
2649 -1338 864 3009 2153 -323 -1588 55 2195 2522 760 -1895 -2169 219 2055 1743 -1003 -2772
2665 -2772 -1931 472 1777 191 -2546 -2731 -345 1787 1448 -232 -1494 -1211 612 2777 2368 -477
2681 -477 -2007 -445 2210 2690 888 -1186 -1967 -626 1996 2377 -523 -3585 -2260 970 1902 -151
2697 -151 -2164 -2358 -1287 635 1909 12 -2479 -2189 959 2391 1485 -393 -1041 -324 1669 2971
2713 2971 2040 -1005 -2164 68 2746 2256 -240 -2421 -1820 227 1434 466 -2049 -2989 -1745 702
2729G02Q52j757k239K02K221J918k89j982j091R98K002J069l75k320j498J345
2745b42K971K09k917j707N09J567J115n10k083j528O23K643R50k194k130O03J835
2762b86J172j73n45j382l61K302J967q51k314n16J328J634L10j302j546n92J438
2779B83K187o63k770j404R74K076L02j499j359l44J138J422K48r24j553N2J748
2796h6J654n83j415p77J537J280K05o09j317m49R37J385L3j944j370J013J425
2813I19r7j039j085j9M9J083M90o66j574K24J805P77q51m60j10K94R53R81m18
2832A256j442l99J329J210k20j642m69J25P00L71m57j148o53N30R99j16r74q45
2850a845N36P89O69k08o35m34O71Q14N53l2r05m34J499M94k49j019r5Q5N25J27
$$ plain form
2729 702 1554 -203 -2442 -2240 -19 1899 1610 -372 -1463 -465 1537 2606 2231 -89 -1587 -242
2745 -242 2729 2938 21 -1686 -1177 390 1505 995 -1088 -2616 -1993 650 1600 -594 -2724 -2121 -286
2762 -286 886 713 168 -1214 -1575 727 2694 1843 -471 -987 341 1975 2285 983 -563 -1155 283
2779 283 2470 1807 -963 -2367 -1393 683 985 -514 -1873 -2217 -1079 343 591 -333 -1886 -1834 -86
2796 -86 1568 985 -430 -1207 330 1610 1815 1206 -111 -560 377 1762 1795 -149 -1519 -506 919
2813 919 822 -217 -1302 -1321 -1272 -189 301 -365 -1939 -1715 90 867 16 -444 -554 -260 693 1674 1256
2832 1256 -186 -585 744 1954 1734 92 -377 -252 448 819 362 -786 -1439 -909 90 -26 -1000 -1845
2850 -1845 -1309 -520 149 -59 -694 -1128 -457 357 910 878 -27 -461 1038 1532 1283 264 169 254 779 906
2870I06l77m12j002L32J030l57q59n62N68N19n71K10K26o04m2J049O41q03p50
2889h58P59Q53o3k50N5M3n48M18O42k55r47j61O12J45m72l19j23k2j06K82M3l09
2911e81l35K36Q98j77p63K57L75L49P6k72L2J41k70M25N12q29k59j25P53K27n98
2932G2n69L41n4L1K46J10o96j86N30O91p16n78N18M65l26n9J47J53m91J83O16
2953D28K22j028N6N19K33m00m0K83m07m15O88L84o32n08J42Q79l05k48K7J83n66
2974e05M52K99J82o19M4J5M31k99L1j17K8L5N9P8L0l88K16L30N8j43j81O6L9L0
2998A71qJ44l20k14Q5J33K90p82J54M06k4k76J91K23l20l21K39N62lo82K47J72
3020F7j22J94L25l46j41j55Q91l48j70m05M21o6k69J94J47m75l21L45M56l38o42
$$ plain form
2870 906 529 117 -885 -553 477 120 -739 -1301 -733 -214 -785 -575 -349 -953 -995 54 695 -108 -858
2889 -858 -99 754 691 441 496 539 -9 409 1051 796 -151 -312 300 445 -27 -346 -469 -491 -597 -315 -272 -581
2911 -581 -916 -680 218 41 -722 -465 -90 259 335 63 95 236 -34 391 903 74 -185 -310 443 670 72
2932 72 -497 -156 -210 -179 67 177 -519 -705 -175 516 -200 -778 -260 205 -121 -180 -33 120 -371 -188 428
2953 428 650 -378 -322 197 430 30 -10 273 -134 -549 139 523 -109 -617 -475 404 99 -149 -122 61 -505
2974 -505 -53 246 428 -191 -147 -132 299 0 31 -86 -58 -23 36 114 144 -244 -28 302 360 217 36 102 141 171
2998 171 163 307 -13 -227 -142 -9 281 -501 -347 59 35 -241 -50 173 -147 -468 -229 333 330 -352 -105 67
3020 67 -55 139 464 118 -23 -178 713 365 195 -210 211 145 -124 70 217 -258 -579 -234 222 -116 -758
3041g58K45N19K88k30l1j88R0L83N56m84k69j10L90O3K95l33m61k18M13L96n4
3062E02q18m36J51J46P09m97l59k10K40P07J85m63m32j60N72Q35K37p73o02N15
3082D9O12L58l87n36j98K76O90M83j120r99n0Q22M51n55l05o54J99M99Q01l26
3102A10j261k3J053P28k33m04n65K75Q21Q30j90j140l79Q05P07j60n03o96n29
3121g54O88R93l06j114j024M69J103K87m50r25m95P27J321K37r85r72L47J090
3139B37J036j29j147p84P02J158J25n12j084j72O28P70M36j243j402J4J338Q59
3157H30n17j386k14J69J316P52n75j503k60J166J602l68j238p44O93Q68Q18K1
3175A430j560q22P85J505l2j004j303J53N42J155j17j347j272N43J982M86j206
$$ plain form
3041 -758 -513 6 294 64 33 -155 -65 318 874 390 121 11 401 464 759 426 -35 -253 160 556 502
3062 502 -316 -752 -601 -455 254 -243 -602 -812 -572 135 320 -143 -575 -735 -163 672 909 136 -466 49
3082 49 661 1019 632 96 -102 174 864 1347 227 -772 -822 0 451 -104 -409 -1063 -864 -365 436 110
3102 110 -1151 -1174 -121 607 374 -30 -595 -320 501 1331 1141 1 -378 427 1134 974 471 -225 -754
3121 -754 -66 927 621 -493 -1517 -1048 55 342 -108 -1033 -1528 -801 520 757 -228 -1200 -853 237
3139 237 1273 1144 -3 -787 -85 1073 1198 686 -398 -570 58 828 1264 21 -1381 -1367 -29 830
3157 830 313 -1073 -1287 -1118 198 950 375 -1128 -1388 -222 1380 1012 -226 -970 -277 591 1409 1430
3175 1430 -130 -952 -167 1338 1306 302 -1001 -848 -306 849 732 -615 -1887 -1344 638 1124 -82
3192h2j044k09J118J055K03j279p02K64R95J138n36r19q64M28J557M79r28j481
3210h07k52J209P36k7j068j278J30J599R45j086j540L72Q19P45K89n66r49l46
3228a075J208J436l71j685m60Q54J129M85r73j084n42P43J522K39j856j338J057
3245g11J073K61o21r64n49P38J458M75j236j422O55P73J364m10q07j059M98J259
3263G75Q45q56j444m5P43O89L19j112q04o6J096J125j082j029m85M29R26P53q51
3282g4j006k69J150J108k14r62l09q9J235P26l22j057q93J278J132j60j372m94
3300e92J3Q13L36K59j344j074Q02J230J3l74j043o2N75P17L24m84j147L51J072
3319C85L99k17q89k36L29R50L11m15j232R6J053L96l09j080j72J22M58Q18p54
$$ plain form
3192 -82 -1126 -1335 -217 838 1041 -238 -940 -676 319 1457 921 2 -862 -434 1123 1602 674 -807
3210 -807 -1059 150 886 859 -209 -1487 -1357 242 1187 101 -1439 -1067 -248 497 786 220 -729 -1075
3228 -1075 133 1569 1198 -487 -947 -93 1036 1521 548 -536 -1078 -335 1187 1426 -430 -1768 -711
3245 -711 362 623 2 -962 -1511 -773 685 1160 -76 -1498 -843 -70 1294 884 77 -982 -484 775
3263 775 1620 764 -680 -725 18 707 1026 -86 -890 -956 140 1265 183 -846 -1331 -902 24 777 -74
3282 -74 -1080 -1349 -199 909 695 -267 -576 -665 570 1296 974 -83 -976 302 1434 1274 -98 -592
3300 -592 -579 234 570 829 -515 -1589 -787 443 456 82 -961 -1023 -448 269 593 109 -1038 -687 385
3319 385 784 567 -322 -558 -229 721 1032 617 -615 -519 534 930 621 -459 -631 -509 -51 767 13
3338A3r06J71N50M01n7l28n51j57J140O76n91r63OP60K14K30k64k65l91L41Q41
3359H70j67j101k54P74J8J2j32m1n35r4J000J98q89q64P06Q13J05l71k48Q1N3
3380f6L10N82n79o14J76N33K51k51m21l6M4K82J55l75k67j49L68L21L9n33l53
3401e83L8O22j79k35J11J17L8K21L4L8p35M85L65J01m17k9J88J32j72L84k32o31
3423c39j17M22P26l80o17K95P4q1q5Q1r9m96K55P98j91n59j06Q36m56k9j6J72
3445H8l88J17J93O10o33k38L18L38r9k27j09J01n1J6L2p5k04j06K14L66j42m23
3467c02o6L63O0k24K6R8n5k28N69N6l72l73M67O58k33m61K15M44o76O9N07l65
3489A77j83o4M77k17m88p3K63k00j44J81M28o32l15N52L10l75J2J95L8O8L72m3
$$ plain form
3338 13 -893 -722 -172 229 172 -156 -707 -864 276 952 361 -602 -596 164 378 608 344 79 -312 29 870
3359 870 703 -398 -652 122 140 152 20 -21 -556 -650 350 548 -341 -1205 -499 314 419 48 -200 -119 -66
3380 -66 244 826 247 -367 -191 342 593 342 -79 -115 -71 211 366 -9 -276 -425 -57 264 303 -230 -583
3401 -583 -545 77 -102 -337 -226 -109 -71 150 184 222 -513 -28 337 438 21 -8 180 312 140 524 292 -339
3423 -339 -456 -34 692 312 -305 -10 64 -17 -102 -21 -120 -616 -361 437 246 -313 -419 417 -39 -68 -84 88
3445 88 -300 -183 10 620 -13 -251 67 405 306 79 -30 71 20 36 68 -7 -211 -317 -103 263 121 -302
3467 -302 -368 -5 55 -169 -143 -45 -100 -328 241 297 -75 -448 19 677 444 -17 198 642 -34 35 542 177
3489 177 -6 -70 407 190 -298 -371 -108 -308 -452 -271 157 -475 -790 -238 72 -303 -291 -96 -58 10 382 339
3511C39r3j49O8K77mJ16o00M66l31Q6L2n1l43R8K7k46K31j63n10L34K13L6l19
3534d86J76K85k76N29J72o0m6n00O59K90k42k54L0n3NrJ37p3o64K81rk8l95L98
3558a33m16k08M69J96R2n50R8L41J94J3k39J94J06K68L7j67J53k91M07M7j90k16
3580B05k84K30L1k89O2l36j30J52J57N6l34m7j3L16J34P6j11j23J52L33M55Q5
3602G77m60l08J61M65J14l59m39k8L6J08R1J3n09r9J81J67l3l33l32J33N29j10
3624b35K40l40k53O40O02k55j57n96N28N48l31J54k54n94M50O48j51o55m53J1
3644d53M67l9m0m12m02K42P28L44o46q06K57P56J67L3q0m03K0M74Q65k48p41o86
3666f03O78N93L15q87k93J0J1Q01k15o64o27L54O94N8l11n05J30J45M28K56k55
$$ plain form
3511 339 246 97 165 442 438 554 -46 420 89 175 207 156 -187 -89 -62 -308 -77 -240 -750 -416 -203 -167 -486
3534 -486 -310 -25 -301 228 400 340 294 -206 453 743 501 247 277 224 229 220 357 284 -380 -99 -108 -136 -531 -133
3558 -133 -549 -757 -288 -92 0 -550 -452 -111 83 96 -143 51 157 425 462 295 448 157 564 611 421 205
3580 205 -79 151 182 -107 -45 -381 -511 -359 -202 -146 -480 -527 -540 -224 -90 -14 -125 -248 -96 237 692 777
3602 777 317 9 170 635 749 390 -49 -77 -41 67 158 171 -338 -437 -256 -89 -122 -455 -787 -654 -125 -235
3624 -235 5 -335 -588 52 654 399 242 -354 174 722 391 545 291 -303 147 795 644 -11 -464 -453
3644 -453 14 -25 -65 -477 -879 -637 91 435 -211 -1017 -760 -4 163 196 116 -287 -267 207 1072 824 83 -603
3666 -603 75 668 983 96 -197 -187 -176 625 410 -254 -881 -527 167 225 -86 -591 -461 -316 112 368 113
3687A13n67j39P47N00J2o76m77M75O14J66k54n88l86O93K36r0o5q67l4Q47J53
3708D13l07l42m65M13K56M50j65r41j86Q24N52Mn77l58R3K73P97j89n63o53Q34
3729A63O41j58n27l76k1M49L52j3q62l27J81Q39J87n90m11j78M86M78N4m60l27
3750d20o9N24O09l72m98l60K53P01L00m90o05J23L80L11R9m89n88R2P04L18m77
3771D6k92m58L83N93K45m08q92K77M80N88j19q23J05O2O46j00r9n65m55N16R78
3792G08m8p03m14K71N72J22k59m45m74M27Q05k44l34k57o0K76M79l6l64n29L08
3813a99M75n1n8m64j48J22O00M20o32l69n3M38L78j52n92m75Q02M58l5l78o64
3834e77J54P10J70k80j02l34j26N70N80n45p17k4O24K72j06m45k52J07M91J58
$$ plain form
3687 113 -454 -593 154 654 666 -10 -487 -12 602 768 514 -74 -460 233 469 379 314 -553 -587 260 413
3708 413 106 -236 -701 -288 -32 418 253 -688 -874 -50 502 506 -71 -429 -336 -63 734 545 -18 -671 163
3729 163 804 646 119 -257 -278 171 523 510 -352 -679 -498 341 528 -62 -473 -651 -165 313 367 -93 -420
3750 -420 -489 35 644 272 -226 -586 -333 368 668 178 -427 -304 76 387 486 -3 -591 -499 205 523 46
3771 46 -246 -704 -321 272 517 109 -783 -506 -26 562 443 -380 -275 -213 433 333 234 -331 -786 -270 708
3792 708 660 -43 -457 -186 386 508 249 -196 -670 -243 562 318 -16 -273 -333 -57 422 386 22 -507 -199
3813 -199 276 225 167 -297 -445 -323 277 697 65 -304 -357 81 459 307 -285 -760 42 500 465 87 -577
3834 -577 -423 287 457 177 75 -259 -385 185 765 220 -497 -521 103 375 269 -176 -428 -321 170 328
3854C28k81n01l42N11N38O1l74K4l01M87J42j17J5l64p9O44j6l94m45J25M75L34
3876D70l73l71M0k09L11K28P4n53K61j44M53P2k98m12M07K67L82m21N8n65J40
3897a83M34K68m03l35P0J76m6M70l73l65j67K05M50J8n77J18N40k91J37k57n0
3918a61k9K43K00j6l31j04K08M58nm33j65P6NK10J26l75m44P6J80N47j29o55J12
3941d06L26K19j52j42J40k21K84K31k74m5J29n6J97j89K4n5k24J17R3Q0j65m71
3963e60L50M34j16k32l86J54L49l6J27Q9m71J83J86P1q6Q9M5q8L00r8r1j01j33
3986b1K47p0l4j69l56L98J6oJ12l88lQ5L10l73M02o47L68j0M97k58k90M19p6K59
4010D12m8m15K12n1K5K90k65j75n1P3J16q0k11j49r4L56kM6m13K71j70M25j25
$$ plain form
3854 328 47 -454 -796 -285 253 314 -60 -36 -337 150 292 175 190 -174 -253 391 375 -19 -464 -339 136 470
3876 470 97 -274 -234 -443 -132 96 170 -383 -122 -266 187 259 -39 -451 -44 223 605 184 242 -323 -183
3897 -183 251 519 116 -219 -149 27 -19 451 78 -287 -454 -249 201 219 -358 -240 300 9 146 -111 -161
3918 -161 -190 53 253 237 -94 -198 10 468 463 30 -135 -59 -54 156 282 -93 -537 -461 -281 266 137 -518 -406
3941 -406 -80 139 -13 -155 -15 -236 48 279 5 -40 89 33 230 41 65 10 -214 -97 -4 76 -89 -560
3963 -560 -210 224 108 -124 -510 -356 -7 -43 84 173 -298 -115 71 142 56 145 190 102 402 304 213 112 -21
3986 -21 226 156 122 -47 -403 -5 11 5 117 -271 -274 -189 121 -252 150 -497 -129 -139 358 100 -190 229 153 412
4010 412 364 -51 161 110 135 425 160 -15 -66 7 123 43 -168 -317 -411 -55 -57 -11 -424 -153 -323 102 -23
4033b3j68M04m99L85K54K7k48r4n3L55k23k4j43%J86l58K45j1k37J40k41K90L7
4056Al48K1M7K22K04j09o7j49j92N65J43l73O7j13K32K60k73K6J08m2q0J86m4
4079B92l45l23K70K93j38Rj6k56k06K98l2l65K66r9L61j71K3k1M8K72k05K74K00
4102D29m30j00L86l7j6k49J75l81M34n7P6k16k68J05K34j82j89K2J41j06K6M14
4124B11l41J82l64K67J37J55j63k64L58j35L14j59k36q9k5K55J8o9j50J2o4K86
4146A36j73J10l98L64j49L62r6l03k13K41K30m7J46j21k09K60J76m5j99l92L68
4167D8L5K56k51Q3J19l51o4L00m30J20j0KJ91l75L17k83M38l78L05K32m96j25
4189c17K61K88L0j28P7k16l93O35J23m99Q5R9L82l66j04j78L5r5O93l04n00J56
$$ plain form
4033 -23 -191 213 -286 99 353 380 132 38 -15 340 117 93 -50 -50 136 -222 23 12 -225 -85 -326 -36 1
4056 1 -347 -326 -279 -57 147 38 -29 -178 -370 195 338 -35 32 -81 151 411 138 164 272 230 150 336 292
4079 292 -53 -376 -106 187 49 58 42 -214 -420 -122 -154 -519 -253 -352 9 -162 -139 -160 -112 160 -45 229 429
4102 429 -1 -101 285 248 232 -17 158 -223 211 154 230 14 -254 -149 85 -97 -286 -264 -123 -229 -203 211
4124 211 -130 52 -312 -45 92 247 84 -180 178 43 357 198 -38 -127 -152 103 121 52 -98 -86 -150 136
4146 136 -37 73 -325 39 -110 252 156 -147 -360 -119 111 64 210 89 -120 140 316 271 72 -320 48
4167 48 83 339 88 171 290 -61 -125 175 -255 -135 -145 -143 48 -327 -10 -293 145 -233 72 304 -192 -317
4189 -317 -56 232 262 134 211 -5 -398 237 360 -139 -54 45 427 61 -43 -221 -186 -281 412 108 -392 -236
4211b36J9L84k66Q6j4j89K7J79K73q9l36K03J84K91j13k68k63j75L13J82m2l66
4233b16J78L2k29K61l08j58Q6K11M96l17l61L1P4M23J5K7j94k20L28K22k62q8
4255C1r6J84l6K43R7l84j01l3L36K9n48j66K57j15L27J4K1k68k56M49K69m36N1
4278a31n2j4L70M27k80m69P1K26L98o11J28k53M57l6Oj91k08R1K50m7N5k28l2
4301g3j36J84p1Q4j88j24K58L64j18j65l11K05J9N08j46m91J47J77QN1j85k84
4323b87M34l76M13N8k65k21K49K02r3m9l11J66j60K77N28m95l95K97J27J67J6
4344B82j1k00k54L21j4o9k61MK45J51K5k85l87J79N11j58n6l31K03K47n5p4k6
4367a3j01k15L63J54j02k01k50L46J64l2J57j13l19J3K79J4k41k95K23L74R6p2
$$ plain form
4211 -236 -217 167 -99 -13 -27 -216 -189 -10 263 174 -162 41 225 516 403 135 -128 -303 10 192 150 -216
4233 -216 -38 -6 -235 26 -282 -440 -354 -143 353 36 -325 -294 -220 203 218 245 51 -169 159 381 119 31
4255 31 -65 119 83 326 423 39 -62 -95 241 270 -278 -444 -187 -302 25 39 60 -208 -464 -15 254 -182 -131
4278 -131 -183 -197 173 600 320 -149 -78 148 546 -65 63 -190 267 231 237 46 -162 -71 179 132 187 -41 -73
4301 -73 -209 -25 -96 -12 -200 -324 -66 298 180 15 -296 -91 -72 436 290 -201 -54 123 131 182 -3 -287
4323 -287 147 -229 184 242 -23 -244 5 207 114 65 -246 -80 -240 37 565 70 -325 -28 99 266 282
4344 282 271 71 -183 138 124 55 -206 -202 43 194 219 -66 -453 -274 237 79 23 -308 -105 142 87 13 -13
4367 -13 -114 -329 34 188 86 -115 -365 -19 145 113 270 157 -162 -149 130 144 -97 -392 -169 205 301 229
4389B29n33L3J77L68l36K17m66J11J22M2O8k79J53j17K78J32k67k0J15n6P7J76
4411B24l22q7K74J1K51j38m24N5L7n7J71J87m45R0jK35l69m4M25n2j10N5k5j70
4435b29J06r7N51m12l29K65M59j18j3o5q8j6J71m9J2k52o9K22l84L77j6j46j93
4458c13J59J74l9j37L7K63r0N4j56j32J13J93K18k64j50R7R1j13K95K6l37k38
4480b49J64M67k81k12j29R1p0J61J69k52k45L6M12ll37K39o5j96M93O5O7m29J36
4503C2L53n8l57J51j32N5K65j65J5j9m75K11j6K56k03j11k2K82J02j89l59J31
4525b53j6M02j98K79j04m16Q3M90O4l23N4K0M3J68m0k37R3m4K41j02k43m5rJ07
4549A4o2O3j46O0k08J66J21k19j78L0J65L44l1P4j65o2J05j41K59l99O13l27j68
$$ plain form
4389 229 -304 -271 -94 274 -62 155 -311 -200 -78 -36 32 -247 -94 -211 67 199 -68 -88 27 -29 48 224
4411 224 -98 -185 89 100 351 213 -211 -156 -119 -176 -5 182 -263 -173 -174 61 -308 -352 73 21 -89 -34 -59 -229
4435 -229 -123 -220 331 -81 -410 -145 314 196 183 118 30 14 185 136 148 -104 -173 49 -335 42 26 -120 -313
4458 -313 -154 20 -19 -156 -119 144 54 108 -48 -180 -67 126 344 80 -70 27 118 5 300 326 -11 -249
4480 -249 -85 382 101 -111 -240 -149 -219 -58 111 -141 -386 -350 62 59 -278 -39 -104 -300 193 258 325 -104 32
4503 32 385 327 -30 121 -11 44 309 144 159 140 -335 -124 -140 116 -87 -198 -220 62 164 -25 -384 -253
4525 -253 -269 133 -65 214 110 -306 -223 267 331 8 62 82 125 293 253 16 109 65 306 204 -39 -84 -93 14
4549 14 -48 15 -131 -71 -279 -113 8 -211 -389 -359 -194 150 119 193 28 -34 71 -70 189 -210 403 76 -92
4572i2K76J13j03j60j26J66j48k37K94p7N3Q5k52j44Q7p1M89j38O1j95P2P3K5
4595E1K97j97N0m9K82l34K22r8L0k0j00o2k20m9K94p5NL4k71J56j59j24L48k57
4619b46M4lJ15P7J2N9l65L01K98o0l1r4lj0Q5j12J09k33q1Q5%K06k40j52L8N6
4645a45K29J3p8j56k82J78J85N4q0k0L72j42j13J02O9j00J23N7l50m5J39J43K3
4668A76k86Q7n57N44O7n0K15l59r2L08k11K12J2k46K55r2M6J94J95l58Q6k23M86
4691D09n37N16k60J41k74j67j05L3K76j85M8j17p1K1J79J36j51J47o9J36m9P1
4713A28j00R6J56l42M6J98J5J11j97j05K96j86p0qM6j0M1q2n1o6O3k40j18K34
4737a45j66R0K10k34L46j26j71J44K5Q2J61r3l40M17k39L99l94P9j50L97k81P0
$$ plain form
4572 -92 184 297 194 34 -92 74 -74 -311 -17 -94 -41 44 -208 -352 -265 -336 153 15 76 -119 -47 26 51
4595 51 348 151 201 152 434 100 322 224 254 234 134 72 -148 -197 97 22 27 61 -210 -54 -213 -337 11 -246
4619 -246 -202 -205 -90 -13 -1 58 -307 -6 292 232 201 107 104 94 179 67 176 -57 -138 -53 -53 153 -87 -239 -201 -145
4645 -145 84 97 19 -137 -419 -241 -56 -2 -82 -102 270 128 15 117 186 86 209 266 -84 -129 10 153 176
4668 176 -110 -23 -580 -36 31 -19 196 -163 -255 53 -158 54 66 -180 75 -17 29 223 418 60 146 -77 409
4691 409 -128 388 128 269 -5 -172 -277 -244 32 -153 -105 -222 -293 -272 -93 43 -108 39 -30 106 57 128
4713 128 28 124 280 -62 -16 182 197 308 111 6 302 116 46 38 84 74 115 33 -18 -84 -21 -261 -379 -145
4737 -145 -311 -221 -11 -245 101 -25 -196 -52 -27 55 216 123 -217 200 -39 360 -34 45 -105 292 11 81
4759H1Nj56M2KK20l68K85m86K95j58K40j02j34J60l8K68k49J08j96J72OJ90k01
4782a4M5j45J35L68n2j67j26j04R1J61k29n3M8r3N3R3j2J67j51l37J83N7Q4L0
4806C2j07J52j17J35J10m30L76K5j98J28J88k84J8K12j19k50Lk47K64L41l39K1
4828h6k63K65O1N4M8m45L80j61K69j84j76K10q8j0M04j46j62j10J67M32k91j33
4850C5k07K33K41k7j89k64l3J17K74l54r5J1L17N9j26o4J10j64R5o2K86mk36j36
4874a83K36j78L97l85k7L81k24L03k90o0k14K18PJ25j13J22j34k19L69j64j77
4895b10J92RQJ4Kk42K86j14j51L89k56k9J29k6M2j9J83k06J15r7RRl60J04k6M03
4921A58k62q4J6L96n0l16L32l80J8J68J09j8j09j38J2L65j18j10N8n4n9M19l57
$$ plain form
4759 81 86 -70 -28 -26 194 -174 111 -375 -80 -238 2 -100 -234 -74 -112 156 -93 15 -181 -9 -3 187 -14
4782 -14 31 -114 21 389 337 170 44 -60 31 192 -37 -90 -42 -135 -82 11 -1 166 15 -322 -139 -82 2 32
4806 32 -75 77 -40 95 205 -225 151 176 -22 106 294 10 28 240 121 -129 -126 -373 -109 232 -107 -86
4828 -86 -349 -84 -23 31 79 -366 14 -147 122 -62 -238 -28 -116 -126 278 132 -30 -140 27 459 168 35
4850 35 -172 61 302 275 86 -178 -211 -94 180 -174 -269 -258 59 118 -8 -72 38 -126 -31 -93 193 189 -47 -183
4874 -183 53 -125 272 -113 -140 241 17 320 30 -30 -244 -26 -19 106 -7 115 -19 -238 131 -33 -210
4895 -210 -18 -9 -1 13 15 -227 59 -55 -206 183 -73 -102 27 1 43 24 207 1 116 19 28 37 -323 -219 -245 158
4921 158 -104 -188 -172 224 174 -142 190 -190 -172 -4 105 87 -22 -160 -148 217 99 -11 47 -7 -66 353 -4
4944dJ39k92O7N4K24j96M6k47P5J41K1n5k34O3J90%J44k53j2l8K85J0p1L8j40
4969d5L8J19j15K3O5l01K53J87k3j07r2qj33J2J63p3k07P0L27J16l14QM6m6J63
4994A26M3M5l98L13m3j57J98k1j13j60Q8R2J43l17Rj6j36K25qnM2J06j36J32j94
5019a42q4Q7L32l2m2j54P7J86O4l01L3j66K05Rn4j8k42J83J39O5K92k40j30j57
5043i0M8K17r7k4k10J77r7kj07k3K00j20K20m9r4j56M7J66K81k16K8k24L03q9
5067H9J09J86n18L15k6K3j95j34O8q9J70m0k71L98k72J47J07l00J46R8P8j85J77
5090H1j54J27K8k07J91J89k94J5j01L44l06J51k96J87K56j38l5k0j11j42L54%
5112A19r7j52J76n3j25L6j61K54j8l16N13J49m48j38J33K60K23l84oK11j50n1
$$ plain form
4944 -4 135 -157 -90 -36 188 -8 38 -209 -134 7 28 -27 -261 -198 -8 -8 136 -117 -129 -167 118 128 57 95 -45
4969 -45 -7 112 -3 20 85 -216 37 224 201 94 2 -6 -139 -127 36 -37 -244 -174 153 269 -45 -37 9 -37 126
4994 126 169 214 -184 129 86 -71 127 106 -7 -167 -79 13 156 -161 -152 -168 -304 -79 -87 -92 -50 56 -80 52 -142
5019 -142 -226 -139 193 161 119 -35 42 228 292 -9 24 -142 63 72 18 0 -242 -59 80 145 437 197 67 -90
5043 -90 -42 175 78 54 -156 21 -76 -78 -185 -208 -8 -128 92 43 -51 -207 -160 6 287 71 99 -125 178 89
5067 89 198 384 -134 181 155 178 -17 -151 -83 -172 -2 -42 -313 85 -187 -40 67 -233 -87 11 89 -96 81
5090 81 -73 54 82 -125 66 255 -39 -24 -125 219 -87 64 -232 -45 211 73 38 18 -93 -235 119 119
5112 119 22 -130 46 -7 -132 -96 -257 -3 -21 -337 176 325 -123 -261 -128 132 355 -29 -35 176 26 -25
5134b5r7J95N3r2j15J72M7j84J97j44J82j74P3K7j86L5J20k39L47l68J72pJ66
5157A55L36m35j4m2P5Q1k50J69k32L49k74M3oN2O0k46M21j62q6j86Q6J15N5k48
5181a84K12k02K23l7J88k2j89j40J25J54m00K09p4J68N0M5j77nj21N2L42k99p5
5204a57m6K51j28J09K79n14J91L58k93O4j53k6K63J39j47k52R6k67L35J98m01
5225a01J22l26K02O7Q0K7K2k13J32j75R8J80j16n2n8L91l04l4l9K82j82L45l47
5248Aj02K18J3ll13L39k53J89j36K01l63K81k44kL10j35P3nj27L2k54L94Q3j98
5272an4R3Q8K7j1p4l64M16o6n7R7kj55J84j47R1l6k3R2k74q7JJ14J40N1k1j14
5299i2n1j1J1LJ94j09J40j93j26M26l90J56q6J24j30K28Mj12j70R4Q6M0j14R4
$$ plain form
5134 -25 -122 73 126 34 -81 91 138 -46 151 7 189 15 88 115 -71 -36 84 -155 192 -176 -4 -11 155
5157 155 491 56 42 0 75 156 -94 75 -157 192 -82 -39 -45 7 67 -179 242 80 -6 -192 -106 9 64 -184
5181 -184 28 -174 49 12 200 178 -11 -151 -26 128 -272 -63 -137 31 81 126 -51 -56 -177 -125 217 -82 -157
5204 -157 -203 48 -80 29 308 -206 -15 343 50 114 -39 -65 198 337 190 -62 34 -233 102 300 -101
5225 -101 21 -305 -103 -36 44 71 93 -120 12 -163 -65 115 -1 -53 -111 280 -24 -58 -97 185 3 348 1
5248 1 -101 117 130 127 -186 153 -100 89 -47 154 -209 72 -172 -174 136 1 74 69 -58 -26 -280 114 197 -1
5272 -1 -55 38 126 153 142 68 -296 120 54 -3 94 92 -63 121 -26 65 29 6 98 -176 -263 -262 -148 -8 43 22 -92
5299 -92 -143 -154 -143 -140 54 -55 85 -108 -234 192 -198 -42 -128 -4 -134 94 98 -14 -184 -90 -4 36 -78 16
5323A6k37K05j37J91Q6k65L59m1k95L14l36Q2L35k40J41k43jp5J04R7m2Q9l35
5346b28L86r5o3k42j57K64l8J09j69J74J7L9K06q8j06l3J74n3r8r4r4K99j67L44
5370B87j92J6m07L54np0j80J22L14l09j94K00K25j24l18K99J51m6k3j58M1J8K50
5393B51m03K9j25L61q4O6p8Q8l18K71o4j13Q1n0j70L52l2L4j9m7r4J17r8p9K20
5418I6rk4n4P1l85L00j31J54j6r7mj35J39Q3j06O2k7Q8J50k41J94k3l81J75L24
5443B03q8P3J46q3k15M2j26j73pK06J37q0J75j52j68M3J57k51K14k01J60L0O3
5466A05J11l72O6O1p7K48r2J19k54L73l58K77j60k65K16J00j58m4k1p3M44j02
5488A44n3k20K10j57J26J36L8l00k07J07L5J93L4p3j78K53j18N9K8J03m41M86
$$ plain form
5323 16 -221 -16 -153 38 124 -141 218 177 -118 196 -140 -58 277 37 178 -65 -66 -141 -37 60 18 107 -228
5346 -228 158 63 0 -242 -399 -135 -173 -64 -233 -59 -42 -3 203 115 9 -24 150 97 -1 -95 -189 110 -57 287
5370 287 95 111 -296 58 53 -17 -197 -75 239 -70 -264 -64 161 37 -281 18 169 123 100 -58 -17 1 251
5393 251 -152 -123 -248 113 29 95 17 105 -213 58 -6 -119 -38 -88 -258 94 62 96 77 30 -64 53 -45 -124 96
5418 96 87 63 9 80 -305 -5 -136 18 2 -95 -99 -234 -95 -12 -118 -56 -83 5 155 -86 108 85 -296 -121 203
5443 203 115 188 334 251 36 78 -48 -221 -228 -22 115 35 210 58 -110 -67 90 -161 53 -148 12 42 105
5466 105 216 -156 -90 -29 -106 142 50 169 -85 288 -70 207 47 -218 -2 98 -60 -104 -125 -198 246 144
5488 144 91 -129 81 -76 50 186 224 -76 -283 -176 -141 52 86 13 -165 88 -30 29 57 160 -281 205
5510B05j03M2j21j16J17L28k80O1m18L57l17K46K33m51R6k12M06N6O5k88K12j17
5532Am0k73M56k12j61L99k04K77j36l0q9J43j9p8J50l89J50J32J22l39K63j99
5554g6K4k9L20j62j8j26K78j30Qj85J34Oj68J02m6K64k59J88j34J51l72L53j70
5577d7J20j65J91L3j37l4J82N1j59j38L3J3K52j70q6N1m1J66R7p6k76K38r8l2
5601c2l1k01J23LK16l9n5j70K70Lj08K3k30K76j54L5O8K9M4k5o6M1nL5k24J41
5627c3K76l37J68P8j84r6P1P3q7J98l57O2O9J64Q0j05j45L7J36q6j44Q3K06j01
5651B6k7L3k97K01J54j01Q2j45j9K03Q6J02m11J33K03k32N6k91O9J82l95M21j36
5674a03K56j41k1j85L20p7p2j9J38j86K04k59J68j95O7O0j1J50k50K31k16L67
$$ plain form
5510 205 102 144 23 -93 24 352 72 133 -285 72 -245 1 234 -217 -121 -333 73 129 194 -94 118 1
5532 1 -39 -312 144 -68 -229 170 -34 243 107 77 -12 131 112 34 184 -205 -55 77 199 -140 123 -76
5554 -76 -52 -81 239 77 59 -67 211 81 89 -96 38 44 -124 -22 -68 196 -63 125 -9 142 -230 123 -47
5577 -47 73 -92 99 132 -5 -39 143 194 35 -103 -70 -57 195 25 -61 -10 -51 115 212 136 -140 98 0 -32
5601 -32 -63 -264 -141 -138 78 39 -16 -186 84 87 -21 2 -228 48 -106 -71 -3 26 70 45 -21 20 15 50 -174 -33
5627 -33 243 -94 74 152 -32 -128 -57 16 -71 127 -230 -168 -99 65 145 40 -105 -68 68 -18 -162 -79 127 26
5651 26 -1 32 -265 -64 90 -11 71 -74 -93 110 196 298 -113 20 223 -9 47 -244 -175 7 -388 33 -103
5674 -103 153 12 -9 -194 126 49 -23 -42 96 -90 114 -145 23 -172 -105 -45 -56 94 -156 75 -141 226
5696B26l24J39q1j85J31mK96kl6k82rJ46nl9K62r7j79k6J14j68j20N80l02J0k94
5721b49L31Pj12O6j03n3J40p1K27j46k9n2j68L35m1k03Q9M9mL8J2J83m40J94K32
5746B32k59J34k32l4Q7M6R4l9m2k23L70n5o7K3j85K79J7j60n6o3kR4K14k58J91
5771A06l18J3Q3K28j60j56K54j30p1J06J62j45o1n8J06J73k12K15j16O1k7K4l37
5794b60P4L26k0j07K3r0k2K05K8K36l73j84n6K85K16j73j96M4J56j61L4Q9r6K76
5818B54l29L17m89Q3J31J18j69J32m8j79Q7M3J20j57o4K92j97J77J47k06R3l97
5840b41K42K23N2j90j53Q0K18q0k19K2r3J78PN7l9m2j89M3J92p1m5J22l96N28
5864B06n9k25K31j64L80l58jQ0j0o3j26K08j22p2O0J04J20m5k02k5M1L2P4nk87
$$ plain form
5696 226 -98 41 -40 -225 -94 -98 198 196 160 -122 -131 15 10 -29 233 136 -43 -69 45 -123 -243 337 35 45 -249
5721 -249 82 89 -23 43 -60 -113 27 -44 183 37 8 -44 -212 123 82 -121 -32 17 13 51 63 246 -194 0 232
5746 232 -27 107 -125 -159 -72 -26 68 29 -13 -236 134 79 12 35 -150 129 146 -14 -70 -133 -135 -41 173 -85 106
5771 106 -212 -199 -116 112 -48 -204 50 -80 -151 -45 117 -28 -89 -147 -41 132 -80 135 19 80 53 77 -260
5794 -260 -186 140 120 13 36 -54 -76 129 157 393 20 -164 -220 65 281 108 -88 -44 112 -49 -15 74 -22 254
5818 254 -75 242 -247 -164 -33 85 -84 48 0 -179 -92 -49 71 -86 -150 142 -55 122 269 63 156 -241
5840 -241 1 224 276 86 -67 13 231 151 -68 -46 -139 39 46 103 64 22 -167 -124 68 -3 -48 74 -322 206
5864 206 147 -78 153 -11 369 11 10 90 80 17 -109 99 -23 -95 -35 69 189 144 -58 -83 -42 -10 64 59 -228
5889b28J93k37K83M9p3K4j54Q0jJJ97q8j80J11n3J87j48q3J72K5K42m27m5n2J86
5914a9Q3o9k2k47J25k08M50k62L34j45j9j18R8Q1j56L4J16L4L0k64L13J07j22
5937A54Jl12J31M2n4K81J16k44l09L04m49L57o1j9k22J85K1k68K09Q3L8R0K6p8
5961B2m1o2L8j56J29J13Q0K4j41Q5J88k54k0M6N1j95J11p2j47J88k58o5J34L30
5985A28P5n3m84M05o0O4j54L4P3J52k52k6J23l2K64k30p1J05nL3p1k00K59j43
6009f6k1Q8p6k4K39k97J70K17K6l80K02M1k37L95l28N5p0K15j22r9K83k39P5m
6033D3Q6k01J6p1N2Q3QQ7j60N9J48k60J46n6K19j69J5p0J21l42L49j4N6N4j70
6058B9l4j78L21K13l20k6k78L76j50K89j46p6J98k74jN4j76L3L10j84o4J65j76
$$ plain form
5889 -228 -35 -272 11 60 -13 11 -143 -63 -64 -63 134 46 -134 -23 -76 111 -37 -120 52 77 319 -108 -153 -205 -19
5914 -19 64 -5 -27 -274 -149 -357 93 -169 165 20 1 -117 -19 62 -94 -60 56 90 120 -144 169 276 154
5937 154 155 -157 -26 16 -38 243 359 115 -194 110 -339 18 -43 -62 -284 -99 -78 -346 -137 -54 -16 74 100 22
5961 22 -19 -81 -43 -199 -70 43 123 147 6 91 279 25 5 51 102 -93 18 -54 -201 -13 -271 -336 -202 128
5985 128 203 150 -334 71 11 75 -79 -45 28 180 -72 -98 25 -7 257 27 -44 61 56 89 18 -182 77 -66
6009 -66 -87 1 -75 -99 140 -157 13 230 256 -124 78 119 -118 277 -51 4 -66 149 27 -72 211 -28 47 43
6033 43 129 -72 -56 -127 -75 8 16 103 -57 2 150 -110 36 -20 199 30 45 -25 96 -246 103 89 145 199 29
6058 29 -5 -183 138 351 31 5 -273 103 -47 242 96 20 218 -56 -57 -3 -179 -146 164 -20 -84 81 -95
6081i5R9N1j83K59Pq8j1O2n1p3R8j98j6K01q9k8j69L1j03J49K94N6l05L23k51
6106c0j65K26m4K04l7k27J38k9q2Lp5K67j08J81j28j82QKO1m8J82j93q5j0K36
6131F5o6j93L00j04%r9q2M52qk40j06O6r5J8J59J71N7k55l73J84L89j20j05J08
6155A23J16k95j61M25j50J63k22K32k12J5n6k8P2q2R7q2P2j83L17j34j04J75m0
6178E8L00l30j3J34j72m9Q7l69K53L34l02j22L36N7l88L14j97Om7M29l49m3Q4
6201A1J06O7j92p8k0L62n10L74j70N3M7J11k58mJ36l84L22O7q8o9P7k80J95L5
6225i0j45J99O1j15J60m7Q2j68q5K07J40j48j23j06J27J61o0oj11Q4N4j10P2L4
6249F7l25K44O6J21j04P6j42J0J15R0j43J16m06J17K90k7l32k4Q9K06L1L3j56
$$ plain form
6081 -95 4 55 -128 131 138 50 39 101 50 -23 75 -123 -139 62 -27 -55 -224 -193 -296 -147 147 203 -102 221 -30
6106 -30 -195 31 -13 191 154 -73 65 36 -46 -43 -118 149 41 222 94 -88 -80 -78 -17 -65 117 -76 -161 -171 65
6131 65 -1 -194 106 2 2 -97 -179 273 265 25 -81 -15 -110 -92 67 238 295 40 -333 -149 240 120 15 123
6155 123 239 -56 -217 208 58 221 -1 231 19 34 -22 -50 22 -60 37 -45 27 -156 161 27 -77 98 58
6178 58 358 28 15 149 -23 -72 15 -354 -101 233 -69 -191 145 202 -186 128 -69 -63 -110 319 -30 -73 11
6201 11 117 184 -8 -86 -106 256 -254 120 -50 3 50 161 -97 -101 35 -349 -27 40 -48 -117 -40 -320 -125 -90
6225 -90 -235 -36 25 -90 70 23 105 -63 -148 59 199 51 -72 -178 -51 110 50 44 -67 17 71 -39 33 67
6249 67 -258 -14 52 173 69 145 3 13 128 218 75 191 -215 -98 192 165 -167 -191 -102 104 135 168 12
6272A2k19J36j02R3M1N0j37J09K33l56J23J74j77J7J30j68rj0K00j0r1o0J1j02
6296a12J47J11L8j69j93J52q7L05k90j47L03JJ19l18p4J42K89j20j38J78K7k89
6318a25J18j03J70k37J49q1K19p9K1K1k90M40j62n9k9j64J72J00l31K38J77k7
6340A38k11K8J46p2p1P9p2J87J28o2l09J24k68M41O6m93n3L09j08P3k2r2K99j22
6364F3N6j82j51L21k62K37K0j20m29M07j09J08q8R6M5n8O1p3M59m36k5n0K7K39
6388A56J39k87n8o2OJ85r3j90J68J26j39J4Q7j42J29J8M7k7oj25r5L03J29l80
6412i7Q8j68L22k8l1k41J35m2J16j49J57q6K2jq9p2L37o7k26K2K09r2j00j59K91
6437E1j07j12M89m67p7K24P1l0r1k43j3L41j5J31j31M2j01o2k43K12L23k26j48
$$ plain form
6272 12 -207 -71 -173 -80 -39 11 -126 -17 216 -140 -17 157 -20 -3 127 -41 -50 -60 140 130 39 -21 -10 -112
6296 -112 35 146 184 15 -178 -26 -113 192 -98 -245 58 59 178 -140 -214 -72 217 97 -41 137 164 -125
6318 -125 -7 -110 60 -177 -28 -109 110 31 52 73 -217 223 61 2 -27 -191 -19 81 -250 -12 165 138
6340 138 -73 -45 101 29 -42 37 -35 152 280 218 -91 33 -235 206 272 -221 -274 35 -73 0 -22 -114 185 63
6364 63 119 -63 -214 107 -155 82 102 -18 -447 -40 -149 -41 -129 -33 12 -46 15 -58 401 -35 -60 -110 -83 156
6388 156 295 8 -50 -112 -106 79 -14 -204 -36 90 -49 -35 52 -90 39 57 104 77 71 -54 -149 154 283 -97
6412 -97 -9 -177 145 117 86 -155 -20 -62 54 -95 62 -24 -2 -3 -92 -164 173 106 -120 -98 111 19 -81 -240 51
6437 51 -56 -168 321 -146 -223 1 72 42 -49 -292 -305 36 21 152 21 63 -38 -100 -343 -131 192 -34 -182
6460a82L14l6Rr8o5R7jj06k00o7N16n2m2j30q4L5j31K75L3j82J67p3R9k07P9N9
6486B7L0n5m2k33M41l11J98On4j7KJ75j12j5j15LP9J39k11n8O4j4j99N06l38l2
6512a36M27k09R8j32J83O9n84M23j00j79M80n2k10k97K31j48L38l66j02K95QJ8
6534E5Mk2n9J53NO5k65J71j52RK9j02L05j0Q9j92m7K5q5R7L6N6j70J49P6j75k13
6561a68J29on9J31o4J4J0L1k08J65j16J83J94r2j55k11K96q5K8J5k45O3K87O9
6585B06l40J06J88j21P3j94J84j48j18J83j15r4QL59o6j06j62J88Rq2rR2J88l07
6609g8K21k37P6O0p6o8J29NJ1J06l53p2N3K55j3M5n0j89K5K45n4J4J94l42k2K61
6635A46k69K04k90J35l4j8J83o2J10j0k17k8L35l93j04K26J55L8j73j14L89k46
$$ plain form
6460 -182 132 96 105 7 -58 39 38 -68 -268 -335 181 129 87 -43 -127 -92 -223 52 85 -97 70 -3 96 -111 -32 27
6486 27 57 2 -40 -273 168 -143 55 61 7 -10 -8 167 55 40 -75 -72 7 146 -65 -123 -59 -73 -272 234 -104 -136
6512 -136 291 82 180 48 231 300 -284 139 39 -140 340 288 78 -219 12 -136 202 -164 -266 29 37 55
6534 55 59 37 -22 131 136 201 -64 107 -45 -36 -7 -109 196 186 275 83 36 61 -24 73 109 165 -5 144 220 45 -168
6561 -168 -39 -45 -104 27 -37 -23 -13 18 -190 -25 -141 42 236 144 -11 -222 74 -11 17 32 -213 -150 137 206
6585 206 -134 -28 160 39 112 -82 102 -46 -164 19 -96 -190 -182 177 111 5 -157 31 40 -42 -51 41 229 -78
6609 -78 143 -94 -18 42 -34 -102 27 32 43 149 -204 -276 -223 32 19 64 14 -175 -150 95 41 55 249 -93 -115 146
6635 146 -123 81 -209 -74 -108 -126 57 -5 105 95 -122 -150 185 -208 -312 -86 69 107 -66 -180 209 -37
6657c7k66M39j65M5J27k46J64j64n1R8M4j36K34l22L96j24o6K37P7k63k53k9J59
6680a02r5K77j65KR9j25M5j04j24J02L02n4n6j12J04R1J29j42o7J20l75K91J64
6703B05k03q9j35J79o4K56j2k04pj70K03n3j65M36k87M3M3O1l50J20M05j74j44
6726a06J24O6j46K2LJ84q1j32J02J68k31kJ44p2p6J24p9o6J48j15M1L8j88J8J09
6751cn5L1M5p0J29k4m0Q9J24j94m08K68l0J77J0j26k8P1J95o7MJ07l22J87J28
6776A98M4l56rj0M64k42k24J61o5l5J48j10n5n3j21J82J85m09M05K0l30L28j87
6799g1M2k48K65K51j25j04k6j14J8M5R3R8m86K30K5j3j4K38k25Q8K3J37P5k16
6823a4Q3%K03l19J35l7k94M74l01L12k31J22j00m2K8p8o4j9J63M2j30p5L07k09
$$ plain form
6657 -37 -303 136 -29 16 143 -103 61 -103 -154 -56 -12 -148 86 -236 160 36 -30 207 284 21 -232 -261 -102
6680 -102 -197 80 -85 -83 16 -109 -64 -168 -292 -190 112 58 2 -110 -6 85 214 72 5 125 -250 41 205
6703 205 2 -87 -222 -43 -107 149 137 -67 -74 -244 -41 -94 -259 177 -110 -67 -24 37 -313 -193 212 38 -106
6726 -106 18 84 -62 -40 -37 147 66 -66 36 204 -27 -29 115 43 -33 91 12 -54 94 -21 20 58 -130 -112 -3
6751 -3 -58 -27 18 -52 77 53 13 102 226 32 -376 -108 -138 39 49 -77 -105 -34 161 94 98 205 -117 70 198
6776 198 242 -114 -123 -133 331 89 -135 26 -39 -74 74 -36 -91 -144 -265 -83 102 -307 98 118 -212 116 -71
6799 -71 -29 -277 -12 239 114 10 -16 -130 -112 -67 26 124 -362 -132 -107 -120 -134 104 -121 -33 -10 127 202 -14
6823 -14 69 69 272 -47 88 51 -243 231 -70 242 11 133 33 -9 19 -59 -123 -142 21 63 -67 -142 165 -44
6847d4J84j4P4k46j41M50k03j20K18k23P4L22n25J44J4j97L90n8j29o0j71J30
6869a31L12k8Nk04l3L26k17J31j30q4J66k04L6N1j8J68m71N35l64O00j89j58j43
6892d4j19Q8l2r1L22j0J11J20m64k34O60m43J53K8k8Nj28J71J74l72Q3r9P2j6
6916i3P8j56J04J26k5n1j60R3L29k88P6N3j08j03j9K02m8j59K62j22K07l28k17
6939c47N38j91K01j29J24Rk27R4l4o4K04m13J53O9j94J60Q7O4j86n3J3K76Q4k07
6963C1j12oj30L05j36l1pL68j75j21J58l21M28j22j42N6k21j61M98Q9l78M18l64
6986g6K14l7oRj45n5P8J13L21k75K7j40j29P5J30j39mM7j35K97o7p9n2l4K39J07
7012B84l92K90k29Q8P5j86l3K32j24Rn0N1J11j24o3p1K21j65P6j52J13K4N3l19
$$ plain form
6847 -44 140 126 200 -46 -187 263 60 -60 158 -65 9 331 -194 -50 -36 -233 157 99 -30 -90 -261 -131
6869 -131 181 153 158 -46 -79 247 30 161 31 -53 113 -91 -55 -4 -22 146 -325 210 -154 446 257 99 -44
6892 -44 -163 -75 -107 -198 124 114 225 345 -119 -353 307 -136 17 45 17 22 -106 65 239 -133 -50 -149 -77 -93
6916 -93 -15 -171 -67 59 34 -17 -177 -84 245 -43 33 86 -22 -125 -144 58 10 -149 113 -9 198 -130 -347
6939 -347 191 0 201 72 196 205 -22 72 38 -26 178 -235 -82 -13 -207 -47 40 104 -82 -135 -122 154 238 31
6963 31 -81 -87 -217 88 -48 -79 -86 282 107 -14 144 -177 251 129 -13 43 -178 -339 159 248 -130 288 -76
6986 -76 138 101 95 104 -41 -96 -18 95 416 141 168 28 -101 -26 104 -35 -39 8 -127 170 103 24 -28 -62 177 284
7012 284 -108 182 -47 41 116 -70 -103 129 5 14 -36 15 126 2 -61 -132 89 -76 0 -152 -39 -15 38 -281
7036b81L15n3K51l34K54n6o8m6J49r8k9n0J65q5J59N0l01J0j06J72k3O6j19K2
7060c6J14j78j5J64k13j74K26J13M02n63K60q9J59nj25k22Q9N3M0p0Q9K23m10
7083a68L44j35m7l2Lj92L81l30K16k00J08%J6J34n2l36J75K24k91K01k35K28J25
7106A37L9k04j2J79k68K08j56K11L7k57L4P8J24k09L13j17k40O6J7R5K3j66l1
7129i9J52J1R3jl4l61M17r8j33ML9j44L19j88k09K02j04K64p5J54j61Lj12MJ20
7154F3j87J8L79n1J19l15O6m12N48M6j96k49J7J68l9J69k82j35J33j39K13N6j46
7177a56Q7%J94l32K70j41l2J68o0K12m8k95K87l28J21p6L10l28O4M3l8Ll6J32
7201B1M1l7J47k43M4j46K79nj35j6k18J59j12K94j1k48J89K28j87M8j99k20N25
$$ plain form
7036 -281 34 -19 232 -102 152 96 28 -18 131 33 4 -46 119 34 193 243 -58 -48 -154 18 -5 61 -58 -36
7060 -36 78 -100 -115 49 -164 -338 -112 1 403 -160 100 11 170 165 40 -182 -93 -40 0 -70 19 242 -168
7083 -168 176 41 -6 -38 -35 -227 154 -176 40 -160 -52 -52 -36 98 46 -290 -115 109 -182 19 -216 12 137
7106 137 176 -28 -40 139 -129 79 -77 134 171 -86 -52 26 150 -59 254 137 -103 -37 -20 75 98 -68 -99
7129 -99 53 64 157 156 122 -239 178 80 -53 -49 -10 -154 165 -23 -232 -30 -134 130 55 209 48 51 -61 -57 63
7154 63 -124 -106 273 222 341 26 92 -320 228 274 78 -171 -154 14 -25 144 -138 -273 -140 -279 -66 -10 -156
7177 -156 -69 -69 125 -207 63 -78 -110 58 -2 210 162 -133 154 -174 -53 -129 181 -147 -83 -40 -78 -75 -111 21
7201 21 62 25 172 -71 -27 -173 106 101 -34 -50 -268 -109 -221 73 62 -186 3 231 44 92 -107 -327 198
7224A98q9Mm8l40K45M1%K62k85J0j08K47j1k86J26n9j26K29o9k4R1j29L00m0M2
7249A81j05j6o52R30o75M06J48j10m69M51n4j91K85M27j004M78K47l01O1M14o98
7270b47N29r3k68M5K7L87o29R46n31L88o92K0J85j95O86n98M15l80n53O29j73
7291a02J84M49n43n13O67k64l2N3N9J78k39k4L48j83J20j07O7j81P7q2k55J42
7313a81o6M73k90J77l70L69j45J75j70K99k71j13J41n1J30m7n3K31m10K84k06
7334i4p6K18qj61K21RL1l31O1J39j68o7J47Ok70K45k09M3O59j50Q5l47J58L77
7358E18l69k80K45q8l91M96k64L32j12l03p1J97K6J49O3m66M00M40j33p66K64
7379a13m4M52m46M41j38k18J38mJ7k06m6O6m7N00k85k10j47L93J55p4p4j09R8
$$ plain form
7224 198 109 113 65 -275 -30 11 11 273 -12 -2 -110 137 126 -160 -34 -93 -219 10 -59 -83 8 -121 179 139 181
7249 181 76 60 -592 338 -337 69 217 107 -362 89 35 -156 129 556 -448 30 277 -24 37 451 -247
7270 -247 282 189 -79 -34 -7 380 -249 697 166 554 -138 -118 67 -128 558 -40 375 -5 -558 71 -102
7291 -102 82 531 -12 -525 142 -122 -154 -101 -42 136 -103 -127 221 38 158 51 118 -63 14 -68 -323 -181
7313 -181 -247 226 -64 113 -257 112 -33 142 -28 271 0 -113 28 -23 107 60 7 238 -172 112 -94
7334 -94 -170 48 40 -121 100 109 140 -191 -130 9 -159 -226 -79 -73 -343 -98 -307 -264 395 245 330 -17 141 518
7358 518 149 -131 114 26 -365 131 -133 199 87 -216 -287 -90 -64 85 148 -318 82 522 389 -377 -113
7379 -113 -157 295 -151 290 152 -66 72 68 85 -121 -167 -101 -148 352 67 -143 -290 103 258 184 110 1 99
7402I9N1l45M60j58k88J43J3J03K0k55L9N6O1Mj98J89j27p8M20l01j72J10j23
7425b77L01J37O7p8J60K15o88L64K20n5M2n58q2L03J6j2O2j88J27o6K8m43K80
7448a25R8J20r6k16M37j16j37J17q9k12K81J8J9P2k18m6J69j00j26K80j11m0j23
7471a44L6M6l4J26k24L34j27J77k34J83k33j59K63l5k99L37k11K03J89j12l2j77
7493a27J68j55M51j52q2p5J5o1o8Q6O4nJ93l00j3j66M37k96L27k46j17J33j8k35
7517b42Q5L44l52J16J60j69J78k12j4J41k59K42k51K05J33k8l9P3j48P0J3k16
7539a70M44k10n8Q9o4J57n2l49m8L53j57J70N5m64L54L8KK16l36n4J66j6j6k64
7563b14J46J08o1J13M0k54K31lj76L3K34j67pn4q9J42j68q6J25r3J45K7n4j27
$$ plain form
7402 99 150 -195 265 107 -181 -38 -25 78 98 -157 -118 -62 -1 3 -195 -6 -133 -211 209 -92 -264 -154 -277
7425 -277 24 161 228 150 310 525 -163 201 421 366 408 -150 -232 71 87 75 137 -51 76 10 38 -405 -125
7448 -125 -27 93 -3 -219 218 102 -35 82 -7 -219 62 80 99 171 -47 -93 76 -24 -150 130 19 -21 -144
7471 -144 -108 -62 -96 30 -194 140 13 190 -44 139 -94 -253 10 -25 -324 13 -198 5 194 82 50 -127
7493 -127 41 -114 337 185 103 28 43 -18 -86 0 64 59 252 -48 -61 -227 210 -86 241 -5 -122 11 -7 -242
7517 -242 -157 187 -165 -49 111 -58 120 -92 -106 35 -224 18 -233 -28 105 77 38 111 -37 33 46 -170
7539 -170 274 64 6 95 31 188 136 -213 -261 92 -65 105 160 -304 50 88 90 306 -30 -84 82 66 50 -214
7563 -214 -68 40 -21 92 132 -122 109 106 -70 -37 197 30 23 -31 -120 22 -146 -232 -107 -200 -55 -28 -82 -209
7587b09j63L39R6Q3m0m1L7j59o8J48Ll1Mk69N67K2l09j1J07j73Qm3QR0K81k04
7613G3Jq2N2l18L59J24j6k27J26k06K02K4j60j14j07L36J68k11k3j10m2O4n8L4
7637a11K0K6m9O7l4q3K91j89J05Rj82K91k32j01M9J09j09K27k32L07j13j78J15
7660CJ62k40n5M5J93k02Q6q1K72j16K2N6k11K13J01k66j40K56p5m6j54K14j53
7683a16K11j09k5r7K67k13J55j8k36Q3J06k06Q2N0K69l40J05K31m9k34J15Lj30
7706i6R4j32mJ37mk55N2J93K17k4j09J77j81n8k65J18J75O4j31K51r9l08J95o9
7730f2L8L5k3L4j42J96k38M23m68L85r2k65K08p4J4KR0k08oJ48J60j36K80J1l90
7755h0K04j48J2p3J47N3r9m2Oj23%K16k6k72K69l4k11K55jp6n4j07J93k00J83
$$ plain form
7587 -209 -372 -33 63 146 106 65 102 -57 -125 23 26 -5 -1 -270 297 319 10 -1 106 -67 -59 -102 -94 -4 277 73
7613 73 74 -8 44 -274 85 209 193 -34 92 -114 88 112 -48 -162 -269 67 235 24 1 -109 -151 -87 -145 -111
7637 -111 -91 -65 -114 -47 -81 -164 127 -62 43 52 -130 161 -71 -172 -123 -14 -123 104 -128 179 66 -112 3
7660 3 165 -75 -130 -85 108 -94 -8 -89 183 67 89 145 -66 147 248 -18 -158 98 23 -23 -177 37 -116
7683 -116 95 -14 -39 -136 131 -82 73 55 -181 -98 8 -198 -116 -66 203 -137 -32 199 150 -84 31 34 -96
7706 -96 -2 -134 -138 -1 -5 -260 -208 -15 202 178 69 246 65 7 -258 -140 35 99 -32 219 120 -188 7 -62
7730 -62 -24 11 -12 22 -120 76 -162 261 -207 178 86 -179 29 -45 -31 -29 61 -147 -153 -5 155 19 299 310 -80
7755 -80 124 -24 -12 -85 62 115 16 -26 -20 -143 -143 73 47 -225 44 10 -201 54 53 -23 -77 -184 9 -191 -8
7780hm2KJ36k7k54Q2K01k15J59m6jJ14p0m3r9l8K42j20J31j39M5j38L90k24K40
7805B78n01K12N1k1K34k25R1j58r8R8L8p8J47q7J71l7k51J40k05K24o4J74j38
7828er6J48Q6l9Q2j44M3n4j76K1J81j68J14R6l04J27J31k33J50j61n7K61k4J2
7852ij27L01K36k00j42j16R4q3j30J68l2J13q8J0R9qk82K14Kj6JJ71k63j75L14
7877E2j57K04k16J11k51L33q7L0J05j00Q2N1j81J1l12L31j10K16j02R8nk51L53
7900B05l07m5J58j14K54r8j02K07k43K37j41J79j93r4J01n9J19j15j66J65lM4
7922a1p0R3M9j95K48k61K70j85j38L68l64K76k63L15J54j51r7j61J81J7j02K04
7944A77Kl47J30q5J37Q9r4p2J09j50J58RQ3j32j6Q3p1J63P0j29p6J31r8J58n8
$$ plain form
7780 -8 -50 -48 88 61 -193 -111 90 -125 34 -12 -13 101 31 -12 -111 -149 93 -27 104 -35 10 -128 262 38 278
7805 278 -223 -11 40 19 253 28 119 -39 -137 -39 -1 -79 68 -19 152 115 -136 4 -201 23 -41 133 -5
7828 -5 -101 47 133 94 176 32 75 21 -155 -134 47 -121 -7 89 -215 -88 43 -190 -40 -201 -258 3 -21 -9
7852 -9 -136 165 401 201 59 -57 37 -46 -176 -8 -40 73 -15 -5 94 86 -196 18 20 4 5 176 -87 -262 52
7877 52 -105 99 -117 -6 -257 76 -11 19 124 24 106 157 -24 -13 -325 6 -104 112 10 108 103 -148 205
7900 205 -102 -147 11 -103 151 53 -49 158 -85 152 11 190 -3 -97 4 -55 64 -51 -217 -52 -55 -11
7922 -11 -81 12 61 -134 114 -147 123 -62 -200 168 -196 80 -183 132 286 135 38 -123 58 75 -27 177
7944 177 179 -168 -38 -123 14 103 9 -63 46 -104 54 63 146 14 -2 81 10 173 243 114 38 169 71 229 171
7969A71j75o4k0M6N1J26k42J03J9J6k0j86J83j34L8J92M6m01O73m44L9l1L7k0
7993CO3R0J99k89k68L21k45K27n1J6j36j2J80j13M4R0j95J92o9O3l36L24j73J29
8017E4L6l09M36l44K30j94P4K15j81p1M0L1R2k0k23m0R1k43K55M6r9R8J17o0n2
8042b1J57j15R5o9P2Pj17j02OL8J13k33P1K66q4l0j34K95k42K55M0m09J31l15
8066c25O4K25n2O9j97M90n32J30L13l30O9o0L5J0j0O8j96K40k80K97J06p5j76
8089a17J84j89L90m61m7L38j36J72k31R9j49L00j70o6M0j37K04r5o5R7Oqj07J79
8113C1j65J61l8j34K48jp4J14OQ0Mj27j53n4j4J56k46PQ7K14J04j84J89l53K75
8138A33k06j09K28P3j72L7O1k08K48k4k85J32q3j01N36k00J8J7j3j36K32o5l58
$$ plain form
7969 171 -4 -68 -88 -42 9 135 -107 -4 15 31 11 -175 8 -126 -88 104 150 -251 422 -22 17 -14 23 3
7993 3 66 156 355 66 -202 119 -126 101 50 66 -70 -82 98 -15 29 119 -76 116 47 110 -226 98 -75 54
8017 54 90 -219 217 -127 103 -91 -17 198 17 -54 -14 17 109 89 -134 -174 -83 -326 -71 -25 -124 -26 91 31 -21
8042 -21 136 21 116 47 119 126 9 -93 -87 -49 64 -169 -98 168 84 54 -80 215 -27 228 268 -141 -10 -325
8066 -325 -261 -36 -88 -19 -216 274 -258 -128 185 -145 -76 -136 -101 -91 -101 -33 -229 11 -269 28 134 59 -117
8089 -117 67 -122 268 -193 -240 98 -38 134 -97 2 -147 153 -17 -83 -43 -180 24 -71 -136 -39 -33 -41 -148 31
8113 31 -134 27 -11 -145 103 102 28 142 148 228 232 105 -48 -102 -116 40 -206 -199 -112 102 206 22 211 -142 133
8138 133 -73 -182 46 119 -53 -16 45 -163 85 61 -224 -92 -175 -276 260 60 78 95 82 -54 178 113 -245
8161b45J57O6J24m1O9l00K39k22J02J37p8l88L64J25l37L04N2o4j1j25Q9nl0Q1
8185F3q6M0J20j07M3M0
$$ plain form
8161 -245 -88 -22 102 61 130 -170 69 -153 -51 86 8 -380 -16 109 -228 76 128 64 53 -72 17 12 -18 63
8185 63 -23 17 137 30 73 113
8191A13
$$ Imaginary data points
##PAGE= N=2
##DATA TABLE= (X++(I..I)), XYDATA
0@%%%%%%Qq%qJ6j6J6k4L2m0M8n6O4p4R2j11J33j57J81k08K42k82L26l69M21m80
32b54N44o14O92p78Q71r78J092j211J345j496J656j832K026k234K462k714K991
49A568l296L629l997M410m870N384n970O641p413Q321r400J0708j2336J4420j7187
64i388K1050k6824L6340n4675J02180m61216p68176J155505J001279o30680p37134
75c71739M11371M85561j46842j72754J29564K3976J0576P6111k19622l73504K11851
86F4549M68831k62089o86160M9505N35131o3180n29280q9173L13969J46258r4764
97a46403j89810k21218J16935N59055K27105n37840l90545M52603N32550j35464
107B66968k79461J12113J32641j01162j1078J27538K2775k1688j2260j93783j82389
$$ plain form
0 0 0 0 0 0 0 0 8 0 0 -8 8 -8 8 -16 16 -24 24 -32 32 -42 50 -61 72 -85 96 -112 130 -152 174 -195 226 -254
32 -254 290 -324 368 -410 461 -517 575 -636 709 -787 869 -963 1063 -1171 1291 -1423 1568
49 1568 -1728 1901 -2096 2314 -2556 2828 -3142 3499 -3914 4407 -4993 5715 -6621 7799 -9388
64 -9388 11662 -15162 21178 -33497 68683 -392533 -1160709 -5204 996075 365395 -371739
75 -371739 39632 525193 378351 205597 335161 359137 369713 445824 226202 -147302 64549
86 64549 533380 271291 -414869 -365364 169767 106587 -422693 -511866 -197897 -51639 -146403
97 -146403 -336213 -557431 -440496 118559 345664 -192176 -582721 -130118 402432 266968
107 266968 -12493 99620 232261 131099 120021 247559 270334 248646 236386 42603 -139786
118a39786K37534K96439k77704m43914J36748L41101j45343k68953J20987J08850
128c4041j72868M7195K54332j94312l65511L24147N67210k58034o29239J66085
138b95036O12292k5768m14566N1355K79222j03255k11855J09921J80278j9690
148A62898q5294j12069j40012J11025L27766k5606m25933j09701L71025J53793
158B27892k77415j26991J89206O5769j15481K985N2292p1532P161J54548k1100
169H7334k01381J0088J84771k3389j42504O9007J15585j26405j46411J05351J54716
180H6762j8436p9577n8113n9847O0260J90896K1141k10440n9850J80804M2265
191I5865j33290M8586J55752j04440j88303J25462K02153j28215j94135J19251
$$ plain form
118 -139786 97748 394187 116483 -327431 -190683 150418 5075 -263878 -142891 -34041
128 -34041 -206909 -159714 94618 -99694 -465205 -141058 426152 168118 -461121 -295036
138 -295036 317256 291488 -123078 -71723 207499 104244 -107611 2310 182588 162898
148 162898 77604 -34465 -174477 -63452 264314 238708 -187225 -296926 74099 227892
158 227892 -49523 -176514 12692 78461 -37020 -34035 18257 -53275 -46114 108434 87334
169 87334 -114047 -103959 80812 57423 -85081 -16074 99511 -26894 -173305 -67954 86762
180 86762 68326 -11251 -69364 -129211 -68951 121945 143086 -67354 -127204 53600 95865
191 95865 -37425 11161 166913 62473 -125830 -368 201785 73570 -120565 -1314
201a314J56589j32605j49688R3570R7180p5908n2196M4089k0243n5440M1726M7717
213f523l4536K613M6854o3687q4523J18931J68323p7963j71441M1375J36747q050
225F8120m5060N3448K479r8486Q213J13106j3489j04732K1723P5616o2394q8395
237f9851N5983O7992o2715n9726L5782J4974m0976K615L2207j4098n491L7508
249e796k3468o7905N0379J22868j7606j17310M903R7005M671m0775M4429L2407
261H3802p4338l7440P8210L7753o4126k1086M6969k0461o6737K0598N9766k4118
273A8792n7532K870J7927j5507j96J8439j6869j5488L2062M688n1164P595Q7587
286C3204J5552q5501k0795Q0279K8912m6454L659M6333j6634m8081J9112M2989
$$ plain form
201 -1314 155275 22670 -127018 -33448 63732 -12176 -64372 -20283 -40526 -95966 -54240 -6523
213 -6523 -41059 -38446 8408 -55279 -139802 -20871 147452 69489 -101952 -60577 76170 68120
225 68120 23060 76508 78987 -19499 -11286 101820 88331 -16401 5322 80938 18544 -69851
237 -69851 -13868 54124 -8591 -68317 -32535 -17561 -58537 -55922 -23715 -37813 -43304 -5796
249 -5796 -29264 -97169 -46790 76078 58472 -58838 -53935 43070 47741 6966 51395 83802
261 83802 9464 -27976 50234 87987 23861 2775 49744 29283 -37454 -16856 42910 18792
273 18792 -38740 -35870 -17943 -33450 -33646 -15207 -32076 -47564 -15502 -10814 -61978 -54383 33204
286 33204 48756 -36745 -57540 22739 51651 5197 8856 55189 38555 -9526 9586 52575
298E2575j1369k1611Q229j3388l3672J2685L6153j6075l9188L150J2202k1923
310c2232n660K8827K516k9221Q73K0260j0615q039L9025K3945m0415k4622M3015
323G657L2619k2693j0047K8054M86l2892J577L0898J369j8772k924o574k0277
336a1519J602K2478m243k7327m354P898j3196p985K1083J2157k0818j2354J6127
349b0451Q575m795J3533J7956j1481j5278J8174K2944o657p385J5599L525k1720
362A2539m576K0912P128j7300j0882q07q356p886O444L722r466j0334r160q788
376c6810M904K0676M301k2516j2301J9408J8084m766l920J3909R591o642n51J4338
390A7705R647j473k331J460K17k70o68l677j912K580o444j8696r070R411O324
$$ plain form
298 52575 41206 19595 27824 14436 -19236 -6551 29602 13527 -25661 -22511 -10309 -32232
310 -32232 -37892 -9065 -6549 -35770 -34897 -14637 -25252 -33291 5734 29679 -10736 -35358 7657
323 7657 40276 17583 7536 35590 36076 3184 4761 35659 37028 18256 15332 8758 -11519
336 -11519 -9917 12561 8318 -19009 -23363 -15465 -28661 -36646 -15563 -3406 -24224 -36578 -20451
349 -20451 -11876 -16671 -3138 14818 3337 -11941 6233 29177 22520 15135 30734 34259 12539
362 12539 7963 28875 36003 18703 7821 7014 -1342 -9228 -2784 938 -8528 -18862 -28022 -36810
376 -36810 -31906 -11230 -6929 -29445 -41746 -22338 -4254 -9020 -12940 969 10560 3918 3367 17705
390 17705 27352 25879 23548 25008 25225 24955 24287 20610 18698 21278 14834 -3862 -12932 -3521 2803
405B803q674j1307q353j1317r24K2278J7754j9125l1364O107L6690J7385j5473
418c520j2962R776J5836O713j0J51J313M737L353m757k886Q525J834j9036j3792
433d725J6882J9882k3332m4567L556M9136J5087n1683m6597K5511N5820N942m1399
446b0487k5210J6464K8828Q809r091p659M687Q485l204o251J5527K2932j4099
459A9731m0651j324N3161K4811n1764m9425K9962N6791n940m8912j4915K3359
471e116J4542L002K623j5926k9133Q029M9371J6346m7791l6525K6364L6869n237
484A7418k0238j148k938j6057M894K6572L683k5681j6795M582Q079J5678K2576
497B0625j5558n3323l594P9889N0752o6191q2570L9446J05231J1514q4932m2185
$$ plain form
405 2803 -5871 -17178 -25531 -36848 -37772 -15494 2260 -16865 -48229 -42122 -5432 11953 -3520
418 -3520 -16482 -6706 9130 15843 15833 15984 17297 22034 25387 20630 17744 26269 28103 9067 -4725
433 -4725 12157 32039 8707 -35860 -32304 16832 31919 -19764 -66361 -40850 14970 20912 -20487
446 -20487 -45697 -29233 -405 8404 -687 -8346 -3659 4826 1622 -4629 10898 33830 19731
459 19731 -20920 -22244 30917 55728 3964 -45461 -15499 41292 35352 -13560 -28475 -5116
471 -5116 9426 12428 15051 -875 -30008 -21979 27392 43738 -4053 -40578 -14214 22655 17418
484 17418 -2820 -3968 -6906 -22963 -18069 8503 12186 -13495 -30290 -25708 -17629 -1951 20625
497 20625 5067 -48256 -51850 28039 78791 12600 -69970 -30524 74707 86221 1289 -40896
509d0896N1157N2493j3951m0672j2431J1628Q612o613j4916j979J1721j0807m5457
522e2111j5646O2958N1542o5392j02444K8592J31004L2961j09856o8408P6740
533c0060R0102j4456n3003j566K4825J1431J6402J6598k2163l2339J4246L1090
545E1107j0849k5526Q111J332m2651j7922N0858K6590o6186o6210L1653O7295
557G602K424m7188l0033m40K6495N0689K3323n0749n8726L7505R5762J8906p2717
570B853m0065M9156N5156j0075l6000l955J5163j940j3290N58J1553l636k9213
583c735l0106O468M4021K0554n5993p5037K0159J05825L5349j03851r1259O6894
595f0711J24782k401j04866l2804P1498M8910k3282k4096J0317P374o579K487
$$ plain form
509 -40896 10261 62754 48803 8131 -4300 7328 15940 9327 -5589 -7568 4153 -6654 -52111
522 -52111 -67757 -4799 46743 -18649 -121093 -92501 38503 71464 -38392 -106800 -30060
533 -30060 60042 45586 -7417 -8983 15842 27273 43675 60273 38110 5771 20017 51107
545 51107 40258 14732 22843 24175 -18476 -36398 14460 41050 -25136 -91346 -59693 7602
557 7602 10026 -37162 -67195 -67635 -41140 9549 32872 -17877 -76603 -39098 56664 75570 2853
570 2853 -37212 11944 67100 57025 21025 17070 32233 30293 17003 17561 29114 25478 -3735
583 -3735 -33841 -27373 16648 37202 -18791 -93828 -73669 32156 67505 -36346 -127605 -60711
595 -60711 64071 61670 -43196 -76000 -4502 44408 21126 -2970 7347 14721 8142 10629
607A0629J1101L298N83j0403k9333o198N0957L5941n8378q1046K6706R7991J5704
620F7552q5641n7401L9833O4680J0909l9003m2018k355M1811L8140j6675m4985
632b5153p673L0489J6180j0916m281N878q309j6192N592K8054J4512k1153l5007
645b7979l811L9744L8666j6059n5528k0170M7217N5059r772o3193l2786M2296
657f316O0742o151o5133k8906M4671L9283k6087l8516J0520K4157j5809k4105
669c1650J7954K9766j2828l8983r274L5316L8310n451m5293k9048L6272O2761
681D7852J865o1617l0345M5267N0669j1349m3457j2854K1555K0000k244j8200
693G142j1920N053M976r829q464J2611Q046k5277k4919J9679L7023l741m0994
$$ plain form
607 10629 21730 25028 25611 15208 -14125 -20323 30634 66575 8197 -72849 -46143 51848 67552
620 67552 -18089 -75490 -35657 29023 39932 929 -41089 -43444 -1633 36507 19832 -25153
632 -25153 -32826 -2337 13843 2927 -1354 4524 -3785 -19977 -14385 13669 28181 7028 -27979
645 -27979 -31790 7954 46620 30561 -24967 -45137 2080 57139 47367 -15826 -48612 -6316
657 -6316 54426 48275 -16858 -45764 -1093 38190 12103 -26413 -15893 8264 -7545 -31650
669 -31650 -13696 16070 3242 -35741 -45015 -9699 28611 23160 -22133 -51181 -14909 47852
681 47852 49717 -11900 -42245 3022 53691 42342 -1115 -13969 7586 27586 25342 7142
693 7142 -4778 275 5251 -4578 -13042 -431 7615 -17662 -42581 -22902 14121 10380 -30614
706c0614j6563K9354L5757J619k8340k1836J5153L6643J4533k2766k3392R446
718a006K3722O207j0794r667k477K086L524j93n526m633l672q787n082J3390J1483
733H575j7660k6630N969L1631R028k4048j8530J2195K4206R461j0796j4090J581
746i108J7597J2976n634j0609J744N675j399j18M675k020j1756n361O850M672
760H184n756q087n890k190N948Q220n095j5432l356J5648J0942o839r435J509
774a1629R673O958R82k889k853L329P653K271l465j061K03k027r56M180J072p657
790C784o585R08K612r64k799l938m840j75P377J667r016m910P817Q272k470m381
806g641K685M972J420P60K313J274K77J373R48K64J238M23l893k623M267K422
$$ plain form
706 -30614 -47177 -17823 17934 19553 -8787 -30623 -15470 21173 35706 12940 -10452 -1006
718 -1006 22716 28923 18129 8462 5985 8071 11595 11402 5876 1243 -2429 -11216 -16298 -2908 8575
733 8575 -9085 -35715 -29746 1885 10913 -13135 -31665 -19470 4736 14197 3401 -10689 -9108
746 -9108 8489 21465 15831 5222 6966 12641 11242 11124 15799 13779 2023 -3338 3512 8184
760 8184 2428 -5659 -11549 -13739 -7791 429 -4666 -20098 -23454 -7806 3136 -3703 -13138 -11629
774 -11629 -1956 5002 5984 3095 242 3571 11224 13495 10030 8969 9172 7145 6189 10369 11441 3784
790 3784 -2801 -1893 719 -245 -3044 -6982 -11822 -11997 -4620 -2953 -11969 -16879 -9062 -790 -3260 -7641
806 -7641 -4956 16 1436 2196 4509 5783 6060 7433 8381 8645 9883 10306 6413 3790 8057 10479
822A0479p193p012K524L998m953m978J741J230m430k311K924J363j699m17J960
837f774J417J461K295o17n19N333M965k823l457M858O807l817n848L093M946k522
853H798m421l34J89k497o98j133m147j258L810j425p155k041O873K603o343k138
869a1317N833L626k234p04K261K921K696J789j385j565M806M306m102m356M656
884G231N058n138n945J790K532l568j893J26l722k996M371K348q416n912P913
899f221O638o111m913M990M550j996j23M024J184q41K354J152k152K834N242l922
915F689q160L732J0538k837j2877k407Q546L312n634o074k035K994M083p70p477
930h377r88P364Q72n803K210Q264l239r033N211J2922j711r571R53N085o36J949
$$ plain form
822 10479 3286 -3726 -1202 2796 -2157 -7135 -5394 -4164 -8594 -10905 -7981 -6618 -8317 -8734 -6774
837 -6774 -5357 -3896 -1601 -2218 -2737 2596 7561 4738 1281 6139 12946 9129 3281 6374 11320 8798
853 8798 4377 4043 4232 1735 1037 -96 -4243 -5501 -1691 -3116 -10271 -12312 -5439 -2836 -9179 -11317
869 -11317 -5484 -1858 -4092 -4796 -2535 386 3082 4871 3486 1921 6727 11033 6931 2575 7231
884 7231 12289 7151 1206 2996 5528 1960 67 193 -3529 -6525 -2154 194 -8222 -14134 -6221
899 -6221 417 -5694 -10607 -5617 -1067 -3063 -3186 838 2022 1181 3535 4687 2535 5369 10611 6689
915 6689 -1471 2261 12799 9962 -2915 -5322 3224 6536 902 -5172 -7207 -4213 -130 -900 -8377
930 -8377 -9365 -2001 -1129 -6932 -4722 3542 303 -8730 -3519 9403 7692 -1879 -926 4159 3523 5472
946E472M661o991j1310P718J5510p420j8076L414J2825m570r133Q263M227j4707
960a0117n034J8343Q620j6171r871J1378P924m003Q09K693p956m541J3164J0481
974A5719j0148j2689L715P786Q39j45l65q596o137P889J1294l329j2369n319N593
989f262R465M129p457j0146J745R282L928r55L13n565j0101Q575K1874k219k6868
1004a0262o265K3240J1078j4794q311N419l718l724J4557O850k0282j3164J6926
1017b450J2380j2300l478J1603q602j7728J7021L0433j4446l8760N700L8144P169
1030B4686k4648j1016O521N033O429Q132j0013j9754M795K0903l93j4996r30O690
1044A439p137m980J5689R626j7170j8614P872K2469Q477j2920k0113l030K1261
$$ plain form
946 5472 10133 3142 -8168 -450 15060 7640 -10436 -7022 5803 1233 -7900 363 4590 -10117
960 -10117 -15151 3192 11812 -4359 -14230 -2852 5072 1069 1878 4571 -3385 -7926 5238 15719
974 15719 5571 -7118 -3403 4383 5222 5077 4712 -3884 -10021 -2132 9162 5833 -6536 -11855 -6262
989 -6262 3203 7332 -125 -10271 -8526 756 4684 3729 4042 -1523 -11624 -3049 18825 16606 -10262
1004 -10262 -16527 6713 17791 2997 -5314 105 -3613 -7337 7220 14070 -6212 -19376 -2450
1017 -2450 9930 -2370 -5848 5755 -2847 -20575 -3554 26879 12433 -26327 -20627 17517 24686
1030 24686 38 -10978 -4457 576 7005 15137 5124 -14630 -9835 11068 10675 -4321 -5251 1439
1044 1439 -5698 -10678 5011 14637 -2533 -21147 -13275 9194 17671 4751 -15362 -18392 2869
1057B869K0188j0074k3762l371J5308J1368P98p004j4223p147J6531J7662j0523
1070H620k0361K648J0208m326o61J4011l705k6327k488L1162J2784k2726j5807
1083a6968P548P872P541J2778q294l1101k253M0955J7796l3570k5652J7884K0627
1096A5163o043o752J191q363p296J2770J1104r818j0848K750q09m193J4160J4380
1110A7396k0281k7874J4054L6678L437k9161j6472J1895K1646J1782j0857k4415
1122a2172m926K5045J7295j5087j8036M458P196l679K285Q042p504j6142J223
1135a2002J2847M257k210n507j3515n308K3321K2279j8887l3671O359L4092R695
1148B1750j7604j2870l01N955J5369R613j6597k0642R363K2197l078j4430J766
$$ plain form
1057 2869 23057 12983 -10779 -14150 1158 12526 13324 6320 -7903 -15050 1481 19143 8620
1070 8620 -11741 -9093 1115 -3211 -3872 10139 6434 -19893 -22381 8781 21565 -1161 -16968
1083 -16968 -9420 -1548 5993 18771 10477 -20624 -22877 18078 35874 2304 -23348 -5464 15163
1096 15163 9120 2368 3559 -4804 -12100 670 11774 1956 -8892 -6142 -6951 -11144 3016 17396
1110 17396 -2885 -30759 -16705 19973 23410 -5751 -22223 -10328 11318 23100 12243 -12172
1122 -12172 -17098 7947 25242 10155 -7881 -3423 3773 94 2379 10421 2917 -13225 -12002
1135 -12002 845 5102 2892 -2615 -16130 -21438 1883 24162 5275 -28396 -22037 12055 21750
1148 21750 4146 -8724 -9025 -3070 12299 21912 5315 -15327 -5964 16233 13155 -1275 491
1161D91K795j0565p75J8071L550k0993j1332J1040J1062K347j144j1555j5076
1174b2084R965L0414K144l2395j3784K4071K0231p195j2861m083J05P379J1740
1187A3647k148j5805k956J0761J365n838N045L509j4255r883J6373J6522j0654
1200E683j8976p18J1562R522L586q658j7210L77K3908J0999j9581j6583J0413
1213e676J4290j357m902o74m982l012Q554O728p218o004K353q51k738Q501Q574
1228A1586j2667j6163R818K0270j657j6149m666O152O093N904N45j2896q904J2319
1242d15J4585p418j4273L085Q008k728k419N094j218q951J33Q493J808m704j191
1257b111j557l552N905J1250m907j5295P76J5232M594r411n017K604J512K874
$$ plain form
1161 491 3286 -7279 -8054 10017 13567 -7426 -18758 -7718 3344 5691 4547 -7008 -22084
1174 -22084 -12119 18295 20439 -11956 -25740 -1669 18562 11367 -1494 -5577 -5472 1907 13647
1187 13647 11499 -4306 -7262 3499 4864 -974 4071 7580 -6675 -16558 -185 16337 5683
1200 5683 -13293 -14011 -2449 7073 10659 2001 -15209 -14832 9076 20075 494 -16089 -5676
1213 -5676 8614 7257 2355 1681 -3301 -6313 2241 8969 1751 -4253 -1900 -2751 -5489 3012 11586
1228 11586 -1081 -17244 -7426 12844 11187 -4962 -9628 -3476 2617 8521 9066 -3830 -12734 -415
1242 -415 14170 6752 -7521 -4436 3572 844 -1575 3519 2301 -6650 -6517 1976 3784 -920 -2111
1257 -2111 -3668 -7220 -1315 9935 5028 -10267 -9491 5741 10335 924 -4093 -1489 23 2897
1271B897M826m105r721J692J0194M03q070n9L412l127k097O384K179p833l601
1286f626N658K811j709M9p50m803P61R626J625j0363m580Q666N106m368k342J096
1302a43j315L55M544J162o337j914O278J410n005Q87L881l059m673M500N246m622
1318A195m974K477K746k230N10J356l767l385N533M496o198n280N121M989l473
1333h84k645L629Q12l133J516M709j523k884K252L098k287j667L092Q1l826K31
1349E71L916j467m376J29J563j912j179J448j346l107J592K614j830k899K523
1364c760L208j456q89K885J189j576J492L618j064j685L036K135l101j952L602
1379E682P56m843j084K900p11n013p47K496k086l072J058J184k899j037L760P04
$$ plain form
1271 2897 7723 3618 -6103 -4411 5783 6186 -1884 -1943 1469 -1658 -3755 2629 4808 -3025 -6626
1286 -6626 -968 1843 134 183 -567 -5370 -4609 5017 6642 -3721 -8301 365 5471 1103 -1239 -143
1302 -143 -1458 -1103 3441 4603 -1734 -3648 2630 4040 -965 -78 3803 744 -3929 571 5817 1195
1318 1195 -3779 -1302 1444 -786 -276 1080 -2687 -6072 -539 3957 -2241 -7521 -2400 2589 -884
1333 -884 -3529 100 912 -2221 -705 4004 2481 -403 1849 4947 2660 993 4085 4166 340 571
1349 571 4487 3020 -1356 -1227 336 -1576 -2755 -1307 -2653 -5760 -4168 -1554 -3384 -6283 -3760
1364 -3760 -552 -2008 -2897 -12 1177 -399 1093 4711 3647 1962 4998 7133 4032 2080 5682
1379 5682 6438 1595 511 3411 2700 -2313 -3060 -564 -2650 -5722 -4664 -3480 -6379 -7416 -3656 -2952
1395b952l038O45M757P37k569J630L796N66j326J780K215o86l46P00n53j241P52
1412D867N1k346k420N37j04k687j110K11j783j019J621L46k294o14L056O49j615
1429d654J963L376q75k364L287M643j154k532J493K303p31j12J164j721l557J350
1445A879L907k314o055k9L520j392l202M53J718k032k675K431L318j181k872N33
1461c993K873J975L66r90j847M61L445L109k189m020q83M375K664k278m198k90
1477a420L065N04k070o38P87j483k146K635L874j732n122k19M408K280q27j346
1493E50k508j074L423O132k648q423j534Q005M091n303m642R50J522m00K148J512
1509A801m173m116L197N323J99l174m77K01j77L835N321k707q481j196R869O545
$$ plain form
1395 -2952 -5990 -5345 -588 149 -2420 -790 3006 3572 2246 4026 6241 5555 5209 5909 5356 4115 4867
1412 4867 4918 2572 152 689 585 -2102 -3212 -3001 -4784 -5803 -4182 -3836 -6130 -6744 -3688 -3039 -4654
1429 -4654 -2691 685 -190 -2554 733 5376 4222 1690 3183 5486 4755 4643 5807 4086 529 1879
1445 1879 5786 3472 -2583 -2612 908 -484 -3686 -3233 -1515 -3547 -6222 -3791 -473 -1654 -4526 -3993
1461 -3993 -1120 855 1221 231 -1616 -1155 2290 5399 3210 -810 -1693 2682 5346 3068 -1130 -1420
1477 -1420 1645 2149 79 -559 228 -1255 -3401 -766 3108 1376 -3746 -3965 443 2723 1896 550
1493 550 -1958 -3032 391 6523 3875 -4548 -6082 1923 6014 711 -3931 -2981 -1459 -1859 289 1801
1509 1801 -2372 -6488 -3291 2032 2231 -943 -1420 -1219 -1396 2439 7760 5053 -3428 -4624 5245 11790
1525A1790n721r434l69O226L821j715n363l980J88M106K733k955n317j965K145
1540e810L371J076m59j829l416K53O962P174l337r651j330J1443Q633m362r435
1555g17j468O240O447J94n478p697o33P462M010o019p524j45K645n10k33J970
1571a456l070p545K3R852O261o158q729O61R282P556P83p045o829M471J3241M630
1587A5928r412r399K769R650K845n260n941k666P63K693J905k659n420m758J49
1602h813N103M664k432r358m186P107J0965J744q702p979M131J3276P779p172
1616F127j1309Q37J1947P082m723p076k386J981L727K400k053o484n100J299M029
1631B98K367k143o445o965J705J1525N774j0394j1807L583J4318O878o986q715
$$ plain form
1525 11790 6069 -3365 -3734 2492 6313 4598 -765 -4745 -4557 -451 2282 -673 -5990 -7955 -5810
1540 -5810 -2439 -1363 -1822 -3651 -7067 -6814 148 7322 3985 -5666 -6996 4447 13080 8718 -717
1555 -717 -2185 4055 10502 10696 5218 -2479 -3112 4350 8360 2341 -5183 -5328 -2683 -3193 -3426 -1456
1571 -1456 -4526 -12071 -12048 -2196 4065 -2093 -10822 -10161 -879 6677 7460 415 -6414 -1943 11298 15928
1587 15928 6516 -2883 -114 9536 12381 7121 1180 -1486 -723 1970 3875 1216 -4204 -8962 -8813
1602 -8813 -3710 954 -1478 -10836 -15022 -7915 3050 4794 -3908 -11887 -7756 5520 13299 6127
1616 6127 -5182 -4345 7602 14684 9961 2885 499 2480 6207 8607 6554 70 -5030 -3731 298
1631 298 2665 522 -5923 -12888 -11183 342 6116 -4278 -16085 -12502 1816 8694 1708 -7007
1645g007p21Q239R332M73p845n943M222P432J776l904l454k668o79K507M603r68
1661E395p937o399K576Q087L546o207j0669j559J0620R705m405j1582l478R258
1675c049R264N47p103n355K041P900M528l600n219j021K472K170K055J102m940
1690A792p168J037Q523M194o495r095j432O869P206p48r031o843M418J1133K470
1705F830q670p065L440P013K782j750l785k297J353M115L311r56l912k858R39
1720a510M425M319k252p373l279M963P959n81p438o164K146P860L605n407p966
1735f693l23O600M118k711m481j325J372K614K808l02l322k518J978M087K057
1750C959o09l687k912K118O410K707n855o550J800O878K387m494n311r35L601
$$ plain form
1645 -7007 -7728 511 9843 10316 2471 -3472 750 8182 9958 6054 2600 -68 -747 1760 6363 5395
1661 5395 -2542 -8941 -6365 1722 5268 -939 -11608 -13167 -2547 7158 2753 -8829 -12307 -3049
1675 -3049 6215 6762 -341 -5696 -3655 4245 8773 5173 -46 -1067 1405 3575 5630 6732 1792
1690 1792 -5376 -4339 4184 8378 1883 -7212 -8644 -1775 5431 4683 -4348 -11191 -6773 4360 6830
1705 6830 -1840 -8905 -5465 1548 4330 2580 -1205 -3502 -2149 1966 5277 4321 409 -2449 -1510
1720 -1510 2915 7234 4982 -2391 -5670 -707 7252 6671 -767 -6931 -4785 3075 6680 1273 -6693
1735 -6693 -7016 -416 3702 991 -3490 -4815 -3443 -829 1979 1677 -1645 -4163 -2185 1902 3959
1750 3959 3350 -337 -3249 -1131 5279 7986 2131 -4419 -2619 4259 6646 2152 -3159 -4094 -493
1765d93L611p06m242l485J433L717J052j581j586j094L98K462K577l04l025j447
1781b713J970M182J655k722m141l84M307L791k220n323j142L040K124l21k723
1796f20k562J9K573J861j737k549K89J298J197P32L45l61k051O12L327J474k110
1813A737k343J50K746J063j119k108j945O19K500L02l025k160M08K046P63q83
1829a249j253m46J586J018N51O5j81N4M96J519J311n48j991N21J421Q00j212j050
1847A412l19j085L72P60j750k468n04J819P03k334j396J477O37n96R21J196k7
1864a182p52J591K361r2j035J680J178l55oP34L1j682p7J212n33j859j221j5l44
1883c66j187q91l43p12n69L80O3j07l26K05J489R30K07K7R95J555M95j57J121
$$ plain form
1765 -493 3118 2412 -1830 -5315 -3882 -165 887 -694 -2280 -3374 -2976 -514 2063 1759 -1266 -2713
1781 -2713 -743 3439 5094 2372 -1769 -2153 2154 5945 3725 -1598 -2740 300 2424 2103 -620
1796 -620 -3182 -3163 -590 1271 -466 -3015 -2726 -1428 -231 501 846 485 -1566 -954 2373 3847 1737
1813 1737 -606 -456 2290 3353 2234 126 -1819 -1200 1300 1602 -1423 -3583 -3175 -1129 -366 -1249
1829 -1249 -2502 -2948 -1362 -344 207 272 91 145 641 2160 3471 2923 932 1453 2874 3674 2462 1412
1847 1412 1093 8 380 1140 -610 -3078 -3582 -1763 -1060 -3394 -4790 -3313 -2676 -3272 -2351 -1155 -1182
1864 -1182 -1934 -343 2018 1926 891 2571 3749 3394 3388 4122 4153 2471 2394 3606 3073 1214 -7 -22 -366
1883 -366 -1553 -2444 -2787 -3499 -4068 -3688 -3625 -3732 -4058 -3853 -2364 -1434 -1227 -1200 -205 1350 1845 1688 2809
1902B809P83j17m55P22R17j506r43Q18K66j893j566O60k86k001p94J304j029j761
1920d072K35J538m44j472Q58J842k81q36J820J559p32l68J504J282l48n66Q53
1937B372O55r18O0O60l18j268m72R46n04j293m34J12j83n07j57j77j8n43j0L64
1957a633J102n58r21J86J296N27n08L47N45m71K13J194P84k097p02J973J138j334
1975A081j046J195j29j637P30K034j166k434j18K829q2j639n05K67l95L39J778
1992A102n14k595n67K732J365j717j592O96O33j89O61N09r14j443J259J676J26
2009A228q84j059k73J094J606M78j822j834Q01K323J255j345k618n69K269K364
2025C014j017l071p87J576J064l1j97j434j863N20K823P50k336j778J011J019
$$ plain form
1902 2809 3592 3475 3020 3742 4659 3153 2210 3028 3294 1401 -165 495 209 -1792 -2586 -1282 -2311 -4072
1920 -4072 -3837 -2299 -2743 -4215 -3357 -1515 -1796 -2632 -812 747 15 -353 1151 2433 2085 1519 2372
1937 2372 3027 2109 2169 2829 2511 1243 771 1717 1213 -80 -514 -402 -585 -1092 -1249 -1426 -1444 -1987 -1997 -1633
1957 -1633 -531 -1089 -2010 -1824 -528 -1 -509 -162 383 -88 125 1319 2103 6 -696 1277 2415 1081
1975 1081 35 1230 1101 -536 194 2228 1062 -1372 -1490 1339 1257 -382 -887 -620 -1015 -676 1102
1992 1102 588 -2007 -2574 158 1523 -194 -1786 -1090 -457 -646 15 524 -390 -1833 -574 1102 1228
2009 1228 344 -715 -988 106 1712 2190 368 -1466 -665 1658 2913 1568 -1050 -1619 650 3014
2025 3014 1997 -1074 -1861 -285 779 748 551 -883 -2746 -2226 597 1347 -989 -2767 -1756 -737
2041g37O52J456r43l165o09M434L370k571m322O15L115J795m43j352k613j38L119
2058A663K313k078l447l45K152Q99R1n41k255k061J397L826N13l126l424R41L769
2075B87K457r47m141k100L297M393L91l754k577J174K532K680j002l155k031J864
$$ plain form
2041 -737 -85 1371 428 -2737 -3346 1088 4458 1887 -2435 -1820 1295 3090 2647 1295 -1318 -1456 1663
2058 1663 3976 1898 -1549 -1894 258 1157 1248 707 -1548 -3609 -2212 1614 2127 -999 -4423 -3482 287
2075 287 2744 1797 -2344 -4444 -1147 3246 3637 -117 -2694 -1520 1012 3692 2690 -465 -2496 -632
$$ [...]
8191B53
##END NTUPLES=NMR FID
##END=
