##TITLE=1H_Pr NCO
 CDCl3, 8 sc, 
 29.06.2021
##JCAMPDX= 6.0         $$ Bruker NMR JCAMP-DX V2.0
##DATA TYPE= NMR FID
##DATA CLASS= NTUPLES
##ORIGIN= UXNMR, Bruker Analytische Messtechnik GmbH
##OWNER= root
$$ XWIN-NMR		Version 3.5
$$ Tue Jun 29 13:28:56 2021 Russian Standard Time (UT+4h)  she@DPX200
##.OBSERVE FREQUENCY= 200.131506
##.OBSERVE NUCLEUS= ^1H
##.DELAY= (6, 6)
##.ACQUISITION MODE= SIMULTANEOUS
##.ACQUISITION SCHEME= undefined
##.AVERAGES= 8
##.DIGITISER RES= 18
##SPECTROMETER/DATA SYSTEM= spect
##.PULSE SEQUENCE= zg30
##.SOLVENT NAME= CDCl3
##.SHIFT REFERENCE= (INTERNAL, CDCl3, 0, 15.7039)
##AUDIT TRAIL= $$ (NUMBER, WHEN, WHO, WHERE, WHAT)
$$ ##TITLE= Audit trail, XWIN-NMR		Version 3.5
$$ ##JCAMPDX= 5.01
$$ ##ORIGIN= Bruker BioSpin GmbH
$$ ##OWNER= she
$$ F:/spectra/data/she/nmr/H-F/1/audita.txt
$$ ##AUDIT TRAIL=  $$ (NUMBER, WHEN, WHO, WHERE, WHAT)
(   1,<2021-06-29 13:27:46.73 +0400>,<she>,<DPX200>,
      <created by zg, POWCHK disabled, PULCHK disabled
       configuration hash MD5:
       00 E9 B6 7A A2 85 ED C7 34 08 36 98 17 FE 4E 26
       data hash MD5: 16K
       1D 33 48 EA 18 85 8C 2E 15 61 78 44 73 E8 E0 55>)
$$ ##END=
$$ 
$$ hash MD5
$$ 20 2C 67 1F 96 18 BB 82 B8 C0 E8 E5 DB 78 DD B8
##$RELAX= 
##$RELAX= 
##$RELAX= 
##$RELAX= 
##$RELAX= 
##$RELAX= 
$$ Bruker specific parameters
$$ --------------------------
##$DU= <F:/spectra>
##$EXPNO= 1
##$NAME= <H-F>
##$PROCNO= 1
##$TYPE= <nmr>
##$USER= <she>
##$AMP= (0..31)
100 100 100 100 100 100 100 100 100 100 100 100 100 100 100 100 100 100 
100 100 100 100 100 100 100 100 100 100 100 100 100 100 
##$AQSEQ= 0
##$AQ_mod= 1
##$AUNM= <au_zg>
##$AUTOPOS= <>
##$BF1= 200.13
##$BF2= 200.13
##$BF3= 200.13
##$BF4= 200.13
##$BF5= 200.13
##$BF6= 200.13
##$BF7= 200.13
##$BF8= 200.13
##$BYTORDA= 1
##$CFDGTYP= 0
##$CFRGTYP= 5
##$CHEMSTR= <none>
##$CNST= (0..31)
1 1 145 1 1 1 1 1 1 1 1 1 1 1 1 1 1 1 1 1 1 1 1 1 1 1 1 1 1 1 1 1 
##$CPDPRG= <>
##$CPDPRG1= <>
##$CPDPRG2= <>
##$CPDPRG3= <>
##$CPDPRG4= <mlev>
##$CPDPRG5= <mlev>
##$CPDPRG6= <mlev>
##$CPDPRG7= <mlev>
##$CPDPRG8= <mlev>
##$CPDPRGB= <>
##$CPDPRGT= <>
##$D= (0..31)
0 1.2 0 0 0 0 0 0 0 0.06 0 0.03 0 0 0 0 0.0002 0 0 0 0 0 0 0 0 0 0 0 0 
0 0 0 
##$DATE= 1624958866
##$DBL= (0..7)
120 120 120 120 120 120 120 120 
##$DBP= (0..7)
150 150 150 150 150 150 150 150 
##$DBP07= 0
##$DBPNAM0= <>
##$DBPNAM1= <>
##$DBPNAM2= <>
##$DBPNAM3= <>
##$DBPNAM4= <>
##$DBPNAM5= <>
##$DBPNAM6= <>
##$DBPNAM7= <>
##$DBPOAL= (0..7)
0.5 0.5 0.5 0.5 0.5 0.5 0.5 0.5 
##$DBPOFFS= (0..7)
0 0 0 0 0 0 0 0 
##$DE= 6
##$DECBNUC= <off>
##$DECIM= 32
##$DECNUC= <off>
##$DECSTAT= 4
##$DIGMOD= 1
##$DIGTYP= 9
##$DL= (0..7)
0 120 120 120 120 120 120 120 
##$DP= (0..7)
150 150 150 150 150 150 150 150 
##$DP07= 0
##$DPNAME0= <>
##$DPNAME1= <>
##$DPNAME2= <>
##$DPNAME3= <>
##$DPNAME4= <>
##$DPNAME5= <>
##$DPNAME6= <>
##$DPNAME7= <>
##$DPOAL= (0..7)
0.5 0.5 0.5 0.5 0.5 0.5 0.5 0.5 
##$DPOFFS= (0..7)
0 0 0 0 0 0 0 0 
##$DQDMODE= 0
##$DR= 18
##$DS= 0
##$DSLIST= <SSSSSSSSSSSSSSS>
$$ [...]
##$SUBNAM2= <"">
##$SUBNAM3= <"">
##$SUBNAM4= <"">
##$SUBNAM5= <"">
##$SUBNAM6= <"">
##$SUBNAM7= <"">
##$SUBNAM8= <"">
##$SUBNAM9= <"">
##$SW= 20.0188882624521
##$SWIBOX= (0..15)
0 0 2 0 0 0 0 0 0 0 0 0 0 0 0 0 
##$SW_h= 4006.41025641026
##$TD= 16384
##$TD0= 1
##$TE= 0
##$TE2= 300
##$TE3= 300
##$TEG= 300
##$TL= (0..7)
0 120 120 120 120 120 120 120 
##$TP= (0..7)
150 150 150 150 150 150 150 150 
##$TP07= 0
##$TPNAME0= <>
##$TPNAME1= <>
##$TPNAME2= <>
##$TPNAME3= <>
##$TPNAME4= <>
##$TPNAME5= <>
##$TPNAME6= <>
##$TPNAME7= <>
##$TPOAL= (0..7)
0.5 0.5 0.5 0.5 0.5 0.5 0.5 0.5 
##$TPOFFS= (0..7)
0 0 0 0 0 0 0 0 
##$TUNHIN= 0
##$TUNHOUT= 0
##$TUNXOUT= 0
##$USERA1= <user>
##$USERA2= <user>
##$USERA3= <user>
##$USERA4= <user>
##$USERA5= <user>
##$V9= 5
##$VALIST= <valist>
##$VCLIST= <CCCCCCCCCCCCCCC>
##$VD= 0
##$VDLIST= <DDDDDDDDDDDDDDD>
##$VPLIST= <PPPPPPPPPPPPPPP>
##$VTLIST= <TTTTTTTTTTTTTTT>
##$WBST= 1024
##$WBSW= 4
##$XGAIN= (0..3)
0 0 0 0 
##$XL= 0
##$YL= 0
##$YMAX_a= 734106
##$YMIN_a= -819969
##$ZGOPTNS= <>
##$ZL1= 120
##$ZL2= 120
##$ZL3= 120
##$ZL4= 120
##$ABSF1= 10
##$ABSF2= 0
##$ABSG= 5
##$ABSL= 3
##$ALPHA= 0
##$AQORDER= 0
##$ASSFAC= 0
##$ASSFACI= 0
##$ASSFACX= 0
##$ASSWID= 0
##$AUNMP= <proc_1d>
##$AZFE= 0.1
##$AZFW= 0.1
##$BCFW= 1
##$BC_mod= 2
##$BYTORDP= 1
##$COROFFS= 0
##$CY= 11.3945322036743
##$DATMOD= 1
##$DC= 2
##$DFILT= <>
##$DTYPP= 0
##$F1P= 15.9154993809931
##$F2P= -4.1035820241983
##$FCOR= 0.5
##$FTSIZE= 0
##$FT_mod= 4
##$GAMMA= 1
##$GB= 0.15
##$INTBC= 1
##$INTSCL= 1
##$ISEN= 128
##$LB= 0.24
##$LEV0= 0
##$LPBIN= 0
##$MAXI= 10000
##$MC2= 0
##$MEAN= 0
##$ME_mod= 0
##$MI= 1.114404
##$NCOEF= 0
##$NC_proc= 0
##$NLEV= 6
##$NOISF1= 3.799351
##$NOISF2= 2.8
##$NSP= 1
##$NTH_PI= 0
##$NZP= 0
##$OFFSET= 15.70392
##$PC= 1
##$PHC0= -11924.42
##$PHC1= 16.40101
##$PH_mod= 1
##$PKNL= yes
##$PPARMOD= 0
##$PSCAL= 0
##$PSIGN= 0
##$REVERSE= no
##$SF= 200.130013532006
##$SI= 16384
##$SIGF1= 3
##$SIGF2= 2
##$SINO= 400
##$SIOLD= 16384
##$SREGLST= <1H.CDCl3>
##$SSB= 0
##$STSI= 0
##$STSR= 0
##$SW_p= 3612.71676300578
##$SYMM= 0
##$S_DEV= 0
##$TDeff= 0
##$TDoff= 0
##$TI= <>
##$TILT= no
##$TM1= 0
##$TM2= 0
##$TOPLEV= 0
##$USERP1= <user>
##$USERP2= <user>
##$USERP3= <user>
##$USERP4= <user>
##$USERP5= <user>
##$WDW= 1
##$XDIM= 8192
##$YMAX_p= 0
##$YMIN_p= 0
$$ End of Bruker specific parameters
$$ ---------------------------------
##NTUPLES= NMR FID
##VAR_NAME=  TIME,          FID/REAL,        FID/IMAG
##SYMBOL=    X,             R,               I
##VAR_TYPE=  INDEPENDENT,   DEPENDENT,       DEPENDENT
##VAR_FORM=  AFFN,          ASDF,            ASDF
##VAR_DIM=   8192,          8192,            8192
##UNITS=     SECONDS,       ARBITRARY UNITS, ARBITRARY UNITS
##FACTOR=    0.0002496,     1,               1
##FIRST=     0,             0,               0
##LAST=      2.0444736,     0,               0
##MIN=       0,             -819969,         0
##MAX=       2.0444736,     734106,          0
$$ Real data points
##PAGE= N=1
##DATA TABLE= (X++(R..R)), XYDATA
$$ [...]
$$ plain form
2328 -3669 3651 2156 -3858 2309 3543 -3424 492 5004 -2576 -1732 5428 -646 -2799 3919 1040
2343 1040 -3378 2975 2497 -3420 1189 4277 -3149 -948 4491 -1468 -2279 3661 -348 -3483 2778
2358 2778 1210 -3768 1298 3003 -3179 -792 3327 -2560 -1828 3009 -1510 -3246 2672 -116 -3498
2373 -3498 1285 1524 -3449 -130 2434 -3122 -1342 2796 -2186 -2742 2256 -551 -3296 1432 1134 -3259
2389 -3259 584 1621 -2608 -457 2203 -2140 -1807 2387 -471 -2297 1775 642 -2428 1382 1684
2404 1684 -2509 231 2226 -1850 -963 2471 -520 -1319 2130 395 -1666 1727 1491 -1732 735 2088
2420 2088 -1286 111 2189 -698 -495 2100 233 -871 1774 981 -1244 1087 1721 -1358 201 1928
2436 1928 -806 -299 1825 -66 -516 1396 584 -1047 607 1260 -1012 -92 1120 -1169 -412 1006
$$ packed form
2328c669P320j495o014O167J234o967L916M512p580Q44P160o074k153O718k879
2343A040m418O353m78n917M609L088p426K201N439n959q11N940m009l135O261
2358B778j568m978N066J705o182K387M119n887P32M837m519j736N918k788l382
2373c498M783K39m973L319K564n556J780M138m982n56M998k807k745M728k98m393
2389c259L843J037m229K151K660m343L33M194k858j826M072j133l070L810L02
2404A684m193K740J995m076Q87L434k991p99L449j735k061L393k36l223K467J353
2420B088l374J397K078k887K03K595j867j104K645p93k225K331O34l079J559J727
2436A928k734N07K124j891m50J912q12j631J654O53k272R20J212k289P57J418
$$ plain form
2452 1006 -752 -596 896 -266 -1105 465 341 -1434 86 606 -1401 -250 872 -833 -982 480
2468 480 -628 -1452 -23 -111 -1123 -131 370 -1068 -436 484 -1166 -710 420 -954 -666 113 -240 -977
2486 -977 -60 325 -634 -114 434 -653 -146 594 -513 -429 492 -35 -536 547 485 -407 454 784 -196 249
2506 249 923 -60 245 681 180 199 694 576 -214 680 981 -337 352 1128 142 365 714 236 4 728
2526 728 434 -154 380 649 -184 282 420 -246 396 617 -57 26 172 -26 -296 306 386 -550 135 -40 -606
2547 -606 -44 134 -295 -421 263 -397 -428 318 -276 -799 -163 -74 -820 -57 98 -1064 -467 197 -700 -779 142
2568 142 -359 -833 -3 -232 -974 -172 -5 -1035 -109 414 -819 -177 533 -686 -678 571 102 -640 592
2587 592 310 -784 450 513 -765 470 543 -387 -180 1022 344 -506 998 -25 -514 1158 701 -592
$$ packed form
2452A006j758J56J492j162q39J570j24j775J520N20k007J151J122j705j49J462
2468D80j108q24J429q8j012R92N01j438O32R20j650M56J130j374K88P79l53p37
2486i77R17L85r59N20N48j087N07P40j107Q4R21n27n01J083o2q92Q61L30r80M45
2506B49O74r83L05M36n01J9M95j18p90Q94L01j318O89P76r86K23L49m78k32P24
2526G28k94n88N34K69q33M66J38o66O42K21o74Q3J46j98k70O02Q0r36O85j75n66
2547f06N62J78m29j26O84o60l1P46n94n23O36Q9p46P63J55j162N97O64q97p9R21
2568A42n01m74Q30k29p42Q02J67j030R26N23j233O42P10j219QJ249m69p42J232
2587E92k82j094J234O3j278J235P3r30K07J202o78q50J504j023m89J672m57j293
$$ plain form
2605 -592 816 1113 -530 409 1466 -86 -279 1424 488 -634 1523 359 -1044 906 783 -844
2621 -844 582 1163 -751 53 1570 -417 -816 1453 76 -1317 1010 553 -1198 418 994 -1372
2637 -1372 -338 1116 -1012 -894 1221 -473 -1767 1222 155 -1897 567 493 -1829 -182 1012 -1342
2653 -1342 -972 1312 -1019 -1553 1413 -389 -2042 977 423 -2349 491 973 -1896 -670 1570 -1184
2669 -1184 -1425 1756 -537 -1978 1411 135 -2116 1185 1391 -2006 133 1727 -1222 -508 2356 -706
2685 -706 -1248 2586 -101 -1977 1817 1341 -1681 1169 2053 -1787 158 2605 -1121 -866 2888 -25
2701 -25 -2024 2010 1108 -1745 1605 1729 -2087 828 2715 -1539 -571 2578 -520 -1854 2487 344
2717 344 -2002 1965 710 -2190 815 2162 -2251 -520 2696 -1336 -1513 2603 -705 -2367 2421
$$ packed form
2605e92J408K97j643R39J057j552j93J703r36j122K157j164j403J950j23j627
2621h44J426N81j914Q04J517j987l99K269j377j393K327m57j751J616N76k366
2637a372J034J454k128J18K115j694j294K989j067k052K464p4k322J647J194k354
2653a342L70K284k331n34K966j802j653L019n54k772K840M82k869J226K240k754
2669a184k41L181k293j441L389j276k251L301K06l397K139J594k949P14K864l062
2685g06n42L834k687j876L794m76l022K850Q84l840J945K447l726K55L754k913
2701b5j999M034r02k853L350J24l816K915J887m254R68L149l098j334M341k143
2717C44k346L967j255k900L005J347m413J731L216m032j77M116l308j662M788
$$ plain form
2732 2421 299 -2820 1141 1645 -2741 -82 1939 -2398 -1175 2596 -1345 -2285 2235 -258 -3103
2747 -3103 1356 877 -3053 368 1581 -2616 -748 2526 -1611 -2140 2801 -730 -2782 1997 452
2762 452 -3019 1002 1722 -3032 -80 2675 -1994 -1287 3001 -894 -2101 2462 307 -2157 1821 1561
2778 1561 -2689 694 2697 -2088 -441 3101 -1041 -1443 3050 -217 -2079 2429 1437 -2673 1193
2793 1193 2313 -2261 305 3107 -1671 -1056 3330 -912 -1960 2844 655 -2496 1832 1574 -2461
2808 -2461 698 2365 -2001 -522 3168 -1362 -1603 2777 -203 -2507 1881 1125 -2756 953 1972
2823 1972 -2612 -276 2608 -1860 -1490 2509 -1091 -1945 1798 32 -2775 1177 1286 -2705 -30 2133
2839 2133 -2341 -977 2255 -1332 -1654 1824 -473 -2336 1717 672 -2921 551 1657 -2445 -386
$$ packed form
2732B421k122l119L961N04m386K659K021m337J223L771l941r40M520k493k845
2747c103M459m79l930L421J213m197J868L274m137n29M941l531k052M779j545
2762D52l471M021P20m754K952K755m669P07M288l895j207M563k155k464L978k60
2778A561m250L383K003m785J647L542m142m02M493l267j862M508r92m110L866
2793A193J120m574K566K802m778O15M386m242j048M804k189l151M328k58m035
2808b461L159J667m366J479L690m530k41M380k980k304M388p56l881L709J019
2823A972m584K336K884m468L70L999l600q54L743j766k807L952J09l991K675K163
2839B133m474J364L232l587l22L478k297j863M053j045l593L472J106m102K059
$$ plain form
2854 -386 2297 -1488 -1192 1952 -805 -1711 1808 720 -2115 1040 1365 -2020 283 2113 -1797 -418
2870 -418 2540 -944 -1483 2368 190 -1469 1392 978 -1717 677 1820 -1503 -95 2264 -864 -1021
2886 -1021 2040 98 -1109 1700 688 -1728 984 1578 -1912 -34 2239 -1054 -510 1950 -705
2901 -705 -960 1754 -78 -1506 837 948 -1487 168 1119 -1379 -364 1435 -974 -1293 1261 -444
2917 -444 -1548 808 522 -1713 260 1041 -1550 -82 1160 -1582 -624 1117 -493 -1274 1088 32
2933 32 -1565 293 418 -1511 -84 898 -1332 -486 937 -793 -898 784 -131 -1119 611 540 -1122
2950 -1122 423 694 -949 -154 1076 -399 -162 999 18 -865 697 215 -779 575 1013 -1067 296
2967 296 1222 -514 -306 1208 -77 -225 1138 291 -496 736 1078 -424 556 821 -613 89 839 -270
$$ packed form
2854c86K683l785K96L144k757r06L519j088k835L155L25l385K303J830l910J379
2870d18K958l484n39L851k178j659K861m14k695K394J143l323J408K359l128j57
2886a021L061j942j207K809j012k416K712N94l490J878K273l293N44K460k655
2901g05k55K714j832j428K343J11k435J655R51k498J015J799k409l19K554j705
2917d44j104K356k86k235J973P81k591J468J242k742R58J741j610p81K362j056
2933C2j597J858J25j929J427R82k230Q46J423j730j05J682r15r88J730p1j662
2950a122J545K71j643P95J230j475K37J161r81q83J562m82r94J354M38k080J363
2967B96R26j736K08J514j285j48J363q47p87J232L42j502R80K65j434P02P50j109
$$ plain form
2985 -270 -337 961 34 -486 603 357 -606 374 769 -358 196 460 -406 -176 747 -228 -473 193 144 -364
3005 -364 213 375 -368 -238 300 -830 -444 350 -580 -446 477 -198 -622 326 -288 -595 -17 232 -633 -416
3025 -416 33 -420 -764 11 -86 -759 134 25 -424 -61 144 -620 -225 136 -202 -298 279 13 -506 237 82
3046 82 -196 148 506 61 323 388 -140 -26 399 9 95 388 369 -83 254 175 -118 495 420 -51 -152 450
3068 450 191 -95 746 185 196 331 623 -203 141 502 -177 220 474 -56 51 508 257 31 157 8
3088 8 -202 89 250 -5 114 318 -208 209 221 -194 -262 253 -198 -606 -31 -233 -642 68 230 -263 -217 143
3110 143 -404 -352 -42 -417 -396 123 -138 -486 42 -60 -647 -223 132 -603 -147 346 -396 -111 221 15 -673
3131 -673 497 -51 -433 233 370 -327 -107 264 -340 -87 546 -48 -290 619 -110 -344 347 168 -470 426
$$ packed form
2985b70o7J298r27n20J089k46r63R80L95j127N54K64q66K30R23r75k45O66m9n08
3005c64N77J62p43J30N38j130L86P94r30J34R23o75m24R48o14l07N78K49q65K17
3025d16M49m53l44P75r7o73Q93j09m49L63K05p64L95L61l38r6N77k66n19P43j55
3046H2k78L44L58m45K62O5n28J14M25l90Q6K93j9m52L37p9k93O13p5m71j01O02
3068D50k59k86Q41n61J1J35K92q26L44L61o79L97K54n30J07M57k51k26J26j49
3088Hk10K91J61k55J19K04n26M17J2m15o8N15m51m08N75k02m09P10J62m93M6L60
3110A43n47N2L10l75K1N19k61l48N28j02n87M24L55p35M56M93p42K85L32k06o88
3131f73J170n48l82O66J37o97K20L71o04K53O33n94k42R09p29k34O91j79o38Q96
$$ plain form
3151 426 489 -238 192 768 -158 117 658 141 -169 660 295 -484 642 498 -235 419 548 -263 -91 814
3171 814 236 -372 459 108 -526 542 413 -808 599 517 -738 -172 535 -160 -318 597 -380 -671 460
3190 460 -120 -860 37 537 -842 -232 359 -823 -116 509 -704 -805 860 -222 -707 543 -84 -1171
3208 -1171 211 215 -951 -177 630 -703 -511 673 -291 -957 722 111 -1098 741 377 -1170 320
3225 320 822 -791 -492 951 -237 -784 1105 -89 -948 845 482 -1148 378 735 -716 227 1044
3242 1044 -447 -637 1107 -431 -928 1078 228 -947 959 987 -674 429 1172 -572 -179 1618 -474
3259 -474 -636 1302 323 -938 753 479 -1126 635 1143 -927 -13 1510 -487 -469 1334 -227 -1185
3276 -1185 1159 262 -1184 749 797 -1125 -45 913 -1231 -426 1011 -557 -951 914 -217 -1535
$$ packed form
3151D26O3p27M30N76r26K75N41n17l10Q29l65p79J126j44p33O54J29q11J72R05
3171H14n78o08Q31l51o34J068j29j221J407q2j255N66P07o95j58R15r77k91J131
3190D60n80p40Q97N00j379O10N91j182P07O25j213j01J665j082m85J250o27j087
3208a171J382Mj166P74Q07j333J92J184r64o66J679o11j209J839l64j547J490
3225C20N02j613K99J443j188n47J889j194q59J793l63j630J526L57j451R43Q17
3242A044j491j90J744j538m97K006q50j175J906K8j661J103P43j744L93J797k092
3259d74j62J938r79j261J691k74j605J761N08k070R14J523j997J8J803j561r58
3276a185K344q97j446J933M8j922J080R58k144Q05J437j568l94J865j131j318
$$ plain form
3292 -1535 867 636 -1487 -140 937 -1179 -647 1044 -1191 -908 1230 -277 -1170 1045 268 -1507
3308 -1507 294 716 -1398 126 1294 -974 -601 1291 -650 -870 1321 27 -1179 735 759 -1183
3324 -1183 476 1029 -1063 -553 1391 -649 -846 1577 53 -1225 1170 406 -1172 616 1150 -1279
3340 -1279 133 1686 -528 -507 1455 -275 -1020 1452 352 -1009 730 838 -1009 210 1393 -1043
3356 -1043 -179 1505 -193 -880 1322 170 -1339 887 435 -1215 488 890 -1220 -181 1309 -974
3372 -974 -683 1327 -281 -938 894 320 -1219 648 533 -1577 -67 1046 -985 -585 1235 -759
3388 -759 -1003 1004 130 -1208 303 213 -1454 29 725 -1035 -340 1098 -547 -888 835 -164 -851
3405 -851 864 -179 -1148 249 699 -1236 -47 1175 -784 -435 1061 -329 -596 1289 27 -785
$$ packed form
3292a535K402k31k123J347J077k116N32J691k235K83K138j507q93K215p77j775
3308a507J801M22k114J524J168k268L73J892j941k20K191j294j206J914K4j942
3324a183J659N53k092N10J944k040j97K423j524j278K395p64j578J788N34k429
3340a279J412J553k214K1J962j730p45K472j100j361J739J08j847J219J183k436
3356a043Q64J684j698o87K202j152j509K226m52j650J703M02k110J039J490k283
3372i74K91K010j608o57J832n74j539J867j15k110J510J113k031M00J820j994
3388g59k44K007q74j338J511r0j667J483O96j760O95J438j645l41J723r99o87
3405h51J715j043r69J397M50j935J189J222j959L49J496j390k67J885j262q12
$$ plain form
3421 -785 760 707 -988 283 859 -608 -79 1054 -482 -584 1026 -94 -718 801 530 -839 621
3438 621 929 -422 251 1068 -611 -45 1136 -275 -567 975 311 -849 419 361 -909 57 934 -683
3456 -683 -218 616 -363 -256 794 -49 -710 538 339 -715 363 640 -915 -65 541 -505 -470 661
3474 661 -316 -586 629 -38 -852 195 319 -855 -290 572 -853 -168 531 -629 -538 196 29 -656 173
3493 173 170 -786 -263 282 -390 -3 475 -313 -440 520 191 -364 306 174 -471 242 591 -484 35 739
3513 739 -247 -16 634 -2 -562 346 252 -104 415 510 -451 142 473 -132 64 521 197 -93 375 110 -218
3534 -218 482 485 -376 132 598 -308 -199 376 19 -59 416 387 -247 586 137 -416 -34 333 -438 -21 216
3555 216 -124 -86 450 21 -149 145 64 -297 216 312 -488 -138 245 -171 -239 118 -457 -417 54 -167 -460 -108
$$ packed form
3421g85J545n3j695J271N76j467N29J133j536j02J610j120o24J519k71j369J460
3438F21L08j351O73Q17j679N66J181j411k92J542o64j160J268n8j270R66Q77j617
3456f83M65Q34r79J07J050q43o61J248j99j054J078K77j555Q50O06j046L5J131
3474F61r77k70J215o67q14J047J24j174N65Q62j425O85O99j160R1P34j67o85Q29
3493A73lr56N23N45o72L87M78p88j27R60l29n55O70j32o45P13L49j075N19P04
3513G39r86K31O50o36n60R08r4l56N19R5r61N93L31o05J96M57l24k90M68k65l28
3534b18P00Lq61N08M66r06J09N75l57p8M75k9o34Q33m49n53L82L67p71M17K37
3555B16l40L8N36m29j70K94q1l61N13R6q00L50L83m16o8L57n75M0M71k21k93L52
$$ plain form
3577 -108 56 -331 -57 212 -455 -263 4 89 -295 162 130 -273 73 161 -439 89 -20 -124 -244 88 -213
3598 -213 -81 119 -177 -115 320 83 -276 -25 233 64 52 347 -272 424 570 169 -46 194 285 44 369
3619 369 45 -223 323 722 -80 51 350 223 352 616 216 51 214 616 -180 192 189 -466 -26 169 -94
3640 -94 -12 325 99 -15 -86 -26 -483 -8 34 -233 241 178 -493 190 31 -278 -147 -14 -193 -377 53 123
3662 123 -239 12 -49 -337 -276 136 -565 -24 92 -330 -265 -1 -95 -462 13 -105 -595 -106 -48 -384 -91 159
3684 159 -259 -27 377 -122 -295 278 32 -260 397 -20 -166 -112 215 -381 8 420 104 -176 463 7
3704 7 -212 399 270 -20 288 450 -249 244 464 -251 -259 449 75 -323 507 433 -146 309 419 -624 29
3725 29 563 -401 -155 620 -359 3 420 121 -321 516 99 -563 456 453 -469 -41 360 -309 -332 239 -329
$$ packed form
3577a08J64l87K74K69o67J92K67Q5l84M57l2m03L46Q8o00N28j09j04j20L32l01
3598b13J32K00k96O2M35k37l59K51K58j69j2K95o19O96J46m01k15K40R1k41L25
3619C69l24k68N46L99q02J31K99j27J29K64m00j65J63M02p96L72lo55M40J95k63
3640i4Q2L37k26j14p1O0m57M75M2k67M74o3o71O83j59l09J31J33j79j84M30P0
3662A23l62K51o1k88O1M12p01N41J16m22O5K64r4l67M75j18m90M89N8l36K93K50
3684A59m18K32M04m99j73N73k46k92O57m17j46N4L27n96L89M12l16k80O39m56
3704Gk19O11j29k90L08J62o99M93K20p15qP08l74l98Q30p4n79M55J10j043O53
3725B9N34r64K46P75r79L62M17k99m42Q37m17o62J019lr22M28M01o69k3N71n68
$$ plain form
3746 -329 -544 491 -380 -485 390 -3 -812 343 46 -952 -92 282 -526 -377 628 -301 -848 442 29
3765 29 -798 227 246 -636 -161 408 -434 -384 846 -160 -479 503 172 -562 401 276 -846 232 356
3784 356 -358 -216 511 -264 -165 639 -69 -422 598 6 -734 448 829 -552 107 772 -269 -24 965
3803 965 -43 -429 635 -5 -573 640 393 -504 483 637 -470 -158 850 -158 -605 711 45 -684
3821 -684 723 221 -1141 350 720 -592 193 777 -278 -386 823 -385 -523 621 -161 -1084 301
3838 301 393 -936 277 661 -415 -503 581 -807 -631 337 -355 -819 747 83 -1024 193 447 -889
3856 -889 -119 590 -859 -446 773 -175 -872 436 -113 -986 583 461 -621 179 520 -614 -107 911
3874 911 -440 -595 777 2 -501 967 245 -599 522 620 -454 -29 1065 -454 -98 970 -219
$$ packed form
3746c29k15J035q71j05Q75l93q09J155k97r98Q60L74q08J49J005r29n47J290m13
3765B9q27J025J9q82M75N69q42N0J230j006l19R82l31p34R63j25j122J078J24
3784C56p14J42P27p75R9Q04p08l53J020n92p40J182L81j381O59O65j041K45R89
3803I65j008l86J064o40n68J213k47q97R87J54j107L12J008j008m47J316o66p29
3821f84J407n02j362J491L70j312P85N84j055j08J209j208j38J144p82r23J385
3838C01R2j329J213L84j076q8J084j388J76R68o92m64J566o64j107J217K54j336
3856h89P70P09j449M13J219r48o97J308n49q73J569j22j082Q00L41j134N07J018
3874I11j351j55J372p75n03J468p22q44J121R8j074M25J094j519L56J068j189
$$ plain form
3891 -219 -661 1069 119 -933 827 631 -746 236 955 -608 -17 965 -156 -315 859 1 -292 712
3909 712 464 -412 492 810 -412 -17 794 -463 -445 883 -445 -590 625 425 -799 199 346 -740
3927 -740 210 703 -784 -378 656 -506 -780 694 21 -936 502 150 -872 66 533 -941 -510 675
3945 675 -564 -824 481 -432 -980 514 163 -845 109 527 -905 28 545 -532 -366 627 -328 -648
3963 -648 716 -102 -694 670 182 -434 249 547 -503 37 794 -273 -530 947 -3 -501 868 204
3981 204 -595 480 648 -302 191 606 -499 -380 1122 -207 -287 713 367 -485 558 315 -559 316
3999 316 495 -392 68 910 -129 -203 869 86 -214 417 299 -441 71 575 -486 -263 482 -379 -465 505
4019 505 -137 -480 340 259 -559 101 354 -765 -320 287 -290 -362 196 -390 -332 344 -253 -500 71 238 -370
$$ packed form
3891b19m42J730r50j052J760j96j377R82P19j563N91R82j121j59J174q58k93J004
3909G12k48q76R04L18j222L95Q11j257J8J328j328j45J215k00j224R98J47j086
3927g40R50M93j487M06J034j162k74J474o73r57J438l52j022R38M67j474M31J185
3945F75j239k60J305r13n48J494l51j008R54M18j432R33N17j077J66R93r55l20
3963f48J364q18n92J364m88o16O83K98j050N40P57j067k57J477r50m98J369o64
3981B04p99J075J68r50M93M15j105J19J502j329q0J000l46q52J043k43q74Q75
3999C16J79q87M60Q42j039p4J072p83l00O31j18p40N12N04j061K23P45q61q6R70
4019E05o42l43Q20q1q18O60K53j119M45O07n77p2N58n86N8O76n97k47N71J67o08
$$ plain form
4040 -370 -118 246 -396 -418 603 -341 -116 337 -54 -448 277 265 -497 234 239 -615 12 303 -520 -289 391
4061 391 -28 -73 241 177 -131 175 303 -265 -41 333 -342 229 610 23 -220 377 107 20 612 325 -324
4082 -324 148 379 121 83 511 22 -106 498 163 -159 309 25 -139 96 538 -132 94 407 1 195
4102 195 214 9 -238 100 49 -306 160 395 -27 124 272 -445 38 -25 -397 -350 -247 -149 -384 -120 -265 -519
4124 -519 1 315 -189 -149 40 -299 -415 201 -92 -312 -35 -160 -455 -125 92 -203 -75 185 -161 -259 291
4145 291 16 -87 210 41 -135 153 345 -178 108 205 -161 178 368 60 -157 185 237 109 143 -71 -107
4166 -107 132 361 -176 108 260 -62 -22 401 435 -22 476 159 -328 127 114 198 158 563 -71 4 475 -75
4188 -75 52 102 35 -287 308 130 -187 143 226 -276 -96 109 -459 -169 322 -131 -372 215 72 -475 -32
$$ packed form
4040c70K52L64o42k2J021r44K25M53l91l94P25j2p62P31Nq54O27K91q23K31O80
4061C91m19m5L14o4l08L06J28n68K24L74o75N71L81n87k43N97k70q7N92k87o49
4082c24M72K31k58l8M28m89j28O04l35l22M68k84j64K35M42o70K26L13m06J94
4102A95J9k05k47L38n1l55M66K35m22J51J48p17M83o3l72M7J03R8k35K64j45k54
4124e19N20L14n04M0J89l39j16O16k93k20K77j25k95L30K17k95J28K60l46r8N50
4145B91k75j03K97j69j76K88J92n23K86R7l66L39J90l08k17L42N2j28L4k14l6
4166a07K39K29n37K84J52l22M0M23L4m57M98l17m87M55j3Q4m0M05o34P5M71n50
4188g5J27N0o7l22N95j78l17L30Q3n02J80K05n68K90M91m53k41N87j43n47M43
$$ plain form
4209 -32 -103 -272 -65 164 -494 102 108 -388 -362 128 -188 -449 127 37 -241 -35 203 -401 -150 -101 -12 -245 268
4232 268 -118 -299 -115 115 -356 121 178 -242 232 152 -190 129 317 -2 -316 112 -4 -324 605 69 2
4253 2 371 214 -147 307 510 -265 173 430 -83 -34 254 80 -246 460 231 -7 410 204 144 19 578
4274 578 -123 -23 585 91 -463 383 44 -347 217 -86 -348 13 256 -223 -127 377 -163 -386 418 -106
4294 -106 -379 31 48 -586 63 261 -579 17 413 -495 -358 300 -1 -539 219 -66 -583 36 158 -637
4314 -637 -234 279 -405 -277 298 -420 -291 414 -199 -757 299 227 -731 -20 283 -528 -42 409 -380 -143
4334 -143 449 -152 -338 762 199 -655 492 317 -133 207 546 -473 -133 807 -148 -583 888 138 -222
4353 -222 602 335 -482 483 608 -537 -5 543 -158 -310 553 -30 -426 651 327 -604 606 335 -582
$$ packed form
4209c2p1j69K07K29o58N96Om96K6M90l16k61N76r0k78K06K38o04K51M9Q9k33N13
4232B68l86j81J84K30m71M77N7m20M74q0l42L19J88l19l14M28j16l20R29n36o7
4253BL69j57l61M54K03p75M38K57n13M9K88j74l26P06k29k38M17k06o0j25N59
4274E78p01J00O08m94n54Q46l39l91N64l03k62L61K43m79R6N04n40k23Q04n24
4294a06k73M10J7o34O49J98q40N96L96r08J37O58l01n38P58k85n17O19J22p95
4314f37M03N13o84J28N75p18J29P05o13n58J056p2r58P11L03q11M86M51p89K37
4334a43N92o01j86J100n63q54J147j75m50L40L39j019L40R40r55m35J471p50l60
4353b22Q24k67q17R65J25j145N32N48p01j52Q63n83l96J077l24r31J210k71r17
$$ plain form
4372 -582 -142 235 -493 -252 579 -348 -698 576 131 -535 517 49 -712 90 265 -485 -150 759 -430
4391 -430 -590 450 -446 -472 469 -255 -690 541 274 -884 256 332 -768 -283 558 -217 -488 621 -220
4410 -220 -733 372 212 -752 -158 125 -594 -242 903 -223 -349 452 -206 -519 724 321 -728 368
4428 368 499 -568 -38 576 -295 -147 815 -407 -254 601 337 -658 588 189 -489 436 581 -368 45
4447 45 729 -299 -272 689 127 -528 486 257 -405 161 343 -421 268 579 -523 -146 716 -145 -232 844
4467 844 20 -453 583 226 -634 106 574 -619 -234 652 -632 -487 368 -127 -432 404 183 -814 276
4486 276 465 -876 -159 22 -576 -649 321 -394 -381 541 -171 -751 181 186 -568 -4 447 -519 -229 635 -383
4507 -383 -306 662 60 -609 547 100 -262 78 358 -480 23 362 -462 -87 573 -182 -394 313 574 -292
$$ packed form
4372e82M40L77p28K41Q31r27l50J274m45o66J052m68p61Q02J75p50L35R09j189
4391d30j60J040q96k6R41p24m35J231k67j158J140P6j100M85Q41p75k71J109q41
4410b20n13J105j60r64N94K83p19L52J145j126j26Q01o58l13J243m03j049J096
4428C68J31j067N30O14q71J48R62j222J53Q55k64r95J246l99o78R25J45r49M13
4447D5O84j028K7R61n62o55J014k29o62N66J82p64O89L11j102L77Q62q61q7J076
4467H44q24m73J036l57q60P40M68j193L85Q86j284J45Q55m95l05Q36k21r97J090
4486B76J89j341P17J81n98p3R70p15J3R22p12n80R32Np54N64M51r66K90Q64j018
4507c83P7R68o02o69J156m47l62L40K80q38N03L39q24L75O60p55k12P07K61q66
$$ plain form
4527 -292 147 382 -553 65 625 -289 32 829 -341 -248 691 -8 -60 128 300 -147 302 420 -588 19
4547 19 684 -163 -191 988 -190 -303 538 102 -406 320 434 -524 50 515 -380 -178 556 -78 -232 407
4567 407 -87 -442 213 218 -383 -17 365 -144 -69 173 -425 -259 260 -346 -414 -27 -56 -366 -129 76 -591 -112
4589 -112 266 -503 -365 312 114 -334 88 -215 -502 229 121 -317 -122 289 -298 -24 338 -228 166 399
4609 399 38 -147 161 217 27 216 384 -41 -7 341 -127 -172 466 297 -138 227 111 -56 117 383 -132
4630 -132 256 406 -44 182 740 -16 10 196 376 -207 89 140 -166 43 386 -263 181 438 -73 -61 -79
4651 -79 -157 -160 -54 41 -471 295 189 -459 115 229 -310 -175 33 -214 -339 -46 72 -590 117 53 -185 -74
4673 -74 -117 -496 -288 204 -165 -339 -200 -84 -509 -209 21 -112 -9 243 -212 144 110 -134 -226 -145 -16 -191
$$ packed form
4527b92M39K35r35O18N60r14L21P97j170R3R39o99n2J88J72m47M49J18j008O07
4547A9O65q47k8J179j178j13Q41m36n08P26J14r58N74M65q95K02P34o34j54O39
4567D07m94l55O55No01L66L82n09P5K42n98J66N19o06o8L87k9l10K37K05o67M79
4589a12L78p69J38O77j98m48M22l03k87P31j08m38J95M11n87K74L62n66L94K33
4609C99l61j85L08N6j90J89J68m25L4L48m68m5O38j69m35L65j16j67J73K66n15
4630a32L88J50m50K26N58p56K6J86J80n83K96N1l06K09L43o49M44K57n11J2j8
4651g9p8lJ06R5n12P66j06o48N74J14n39J35K08k47j25K93J18o62P07o4k38J11
4673g4m3l79K08M92l69j74J39J16m25L00K30j33J03K52m55L56l4k44r2Q1J29j75
$$ plain form
4695 -191 17 116 -533 256 -23 -88 40 404 -24 -205 321 108 -199 90 358 -8 149 415 -154 116 89
4716 89 -348 508 417 97 -130 477 131 76 362 209 145 204 506 -57 264 240 -89 81 341 -111 -26 219
4738 219 36 -14 -48 21 -136 -180 276 -166 -59 10 -274 -297 134 27 -195 -19 19 -513 89 109 -413 -13 -9
4761 -9 -348 36 136 -282 -455 8 -103 -623 284 -393 -592 54 -17 -418 -46 75 -275 -95 141 -247 -177
4782 -177 108 167 -149 68 122 -37 33 -77 -87 61 399 -92 -288 108 -131 -391 151 216 -217 196 269 -120
4804 -120 -47 492 187 -28 449 181 -65 340 127 -381 261 109 -134 344 485 10 179 501 179 -75
4824 -75 511 42 -254 357 64 -206 105 346 -177 29 132 20 -338 149 -170 -1 286 -170 27 432
4844 432 71 -465 50 112 -181 -22 148 -226 -235 171 -381 -357 81 19 -476 295 418 -334 -5 118 -296 -264
$$ packed form
4695a91K08R9o49P89k79o5J28L64m28j81N26k13l07K89K68l66J57K66n69K70k7
4716H9m37Q56r1l20k27O07l46n5K86j53o4N9L02n63L21k4l29J70K60m52Q5K45
4738B19j83n0l4O9j57m4M56m42J07O9k84k3M31j07k22J76L8n32O02K0n22M00M
4761il39L84J00m18j73M63j11n20R07o77j99O46p1m01L72J21l50J80K36l88P0
4782a77K85N9l16K17N4j59P0j10j0J48L38m91j96L96k39k60N42O5m33M13P3l89
4804a20P3N39l05k15M77k68k46M05k13n08O42j52k43M78J41m75J69L22l22k54
4824g5N86m69k96O11k93k70L11K41n23K06J03j12l58M87l19J69K87m56J97M05
4844D32l61n36N15O2k93J59J70l74rM06n52K4M38o2m95P71J23p52L29J23m14L2
$$ plain form
4866 -264 460 -379 -45 591 -257 -498 205 48 -334 68 214 -164 -267 202 -419 -280 569 -263 -528 556
4886 556 261 -355 98 185 -290 103 359 -176 -75 626 -96 -96 685 -51 -363 396 314 -93 302 477 -454
4907 -454 -42 469 89 105 554 167 -244 474 266 -446 277 353 -210 -15 494 -344 18 406 -81 -313 431
4928 431 -144 -459 308 350 -503 110 322 -437 -181 387 -553 -391 201 -193 -454 195 -103 -704 -59 197
4948 197 -462 -109 399 -451 -199 359 -397 -85 363 235 -657 162 157 -794 -15 255 -498 -249 425 -418 -119
4969 -119 568 -234 -294 347 213 -120 199 398 -531 36 539 -449 -18 514 -4 -241 677 92 -328 137
4989 137 355 -175 202 593 -427 20 705 -345 -380 818 -77 65 232 356 -320 271 449 -415 129
5008 129 425 -395 -230 384 56 -356 385 42 -312 213 345 -285 -18 417 -180 -26 470 -224 -339 522
$$ packed form
4866b64P24q39L34O36q48k41P03j57l82M02J46l78j03M69o21J39Q49q32k65J084
4886E56k95o16M53Q7m75L93K56n35J01P01p22%P81p36l12P59q2m07L95J75r31
4907d54M12N11l80J6M49l87m11P18k08p12P23P6n63J95N09q38L62L88m87k32P44
4928D31n75l15P67M2q53O13K12p59K56N68r40J62N92l94k61O49k98o01O45K56
4948A97o59L53N08q50K52N58p56L12M48j28q92Q19nr51P79K70p53K49O74q43K99
4969a19O87q02o0O41j34l33L19J99r29N67N03r88M31N32n18k37R18n85m20M65
4989A37K18n30L77L91j020M47O85j050l5J198q95J42J67J24o76N91J78q64N44
5008A29K96q20J65O14l28m12P41l43l54N25J32o30K67M35n97J54M96o94j15Q61
$$ plain form
5028 522 -178 -424 278 36 -301 -234 264 -547 122 304 -580 -214 502 -316 -278 416 64 -511 -49 30 -368
5049 -368 -141 258 -413 -136 322 -101 -372 201 -224 -499 460 37 -399 143 129 -396 57 694 -188 42
5069 42 165 -149 -59 140 289 -145 234 410 -207 42 420 -3 213 260 39 -7 455 287 -358 376 268
5090 268 -265 291 362 -74 -112 639 -274 -283 560 5 -398 398 247 81 211 144 -209 151 244 -250 -101 168
5112 168 -220 -236 148 52 -175 128 82 -191 59 155 -404 -230 120 -526 -236 25 -117 -302 84 72 -470 -184
5134 -184 171 -342 -164 1 -601 -193 363 -127 -174 169 253 -250 -186 -6 -229 -165 218 -172 -167 279 -202 -232
5156 -232 61 -52 -124 223 -8 8 147 116 -398 183 346 -143 242 527 76 212 438 111 58 491 172
5177 172 -148 271 298 -332 -30 402 46 -365 158 205 -183 374 238 -157 -30 83 -14 137 262 185 5
$$ packed form
5028E22p00k46P02k42l37O7M98q11O69J82q84L66P16q18L8O94l52n75M62P9l98
5049c68K27L99o71K77M58m23k71N73m25k75R59m23m36N42j4n25M53O37q82K30
5069D2J23l14R0J99J49m34L79J76o17K49L78m23K16M7k21m6M62j68o45P34j08
5090B68n33N56P1m36l8P51r13rQ43n55m03P96j51j66J30o7l53L60R3m94J49K69
5112A68l88j6L84r6k27L03m6k73K50R6n59J74L50o46K90K61j42j85L86j2n42K86
5134a84L55n13J78J65o02M08N56m90m7L43Q4n03O4J80k23O4L83l90NM46m81l0
5156b32K93j13p2L47k31J6J39l1n14N81J63m89L85K85m51J36K26l27n3M33l19
5177A72l20M19K7o30L02M32l56m11N23M7l88N57j36l95J27J13r7J51J25p7j80
$$ plain form
5198 5 177 63 -133 -74 24 -321 140 83 -270 49 3 -40 10 80 -133 -233 153 384 -296 -165 103 -442 -94
5221 -94 -349 -253 -337 -21 -456 -304 30 -46 -304 135 239 -435 39 -12 -323 17 -196 106 -154 21 -19 -87
5243 -87 306 -7 -185 326 46 30 94 -75 328 53 200 -130 243 71 191 113 237 254 75 365 117 235
5265 235 243 321 -35 67 255 31 -109 152 78 108 166 212 -126 -14 223 7 -83 52 79 -335 168 -152 -98
5288 -98 113 303 -190 26 -60 -342 -73 225 -173 83 -105 -35 -183 122 -297 -423 201 17 -211 66 153
5309 153 -216 -183 211 -184 -278 78 -21 -245 35 -345 -475 132 -129 -196 -345 187 -62 -11 80 -305 -354 59
5331 59 7 -153 112 -85 -214 154 21 -216 185 501 -59 34 187 85 -95 532 -110 -154 132 142 -3 76
5353 76 146 28 98 323 -196 -51 595 200 -88 273 36 -112 152 132 77 194 414 -209 67 447 17 22
$$ packed form
5198EJ72j14j96N9R8l45M61n7l53L19m6m3N0P0k13j00L86K31o80J31K68n45L48
5221i4k55R6q4L16m35J52L34p6k58M39J04o74M74n1l11L40k13L02k60J75m0o8
5243h7L93l13j78N11k80j6O4j69M03k75J47l30L73j72J20p8J24J7j79K90k48J18
5265B35QP8l56J02J88k24j40K61p4L0N8M6l38J12K37k16r0J35K7m14N03l20N4
5288i8K11J90m93K16q6k82K69K98l98K56j88P0j48L05m19j26O24j84k28K77Q7
5309A53l69L3L94l95r4L56r9k24K80l80j30O07k61o7j49N32k49N1R1l85m9M13
5331E9n2j60K65j97j29L68j33k37M01L16n60R3J53j02j80O27o42m4K86J0j45P9
5353G6P0j18P0K25n19J45O46l95k88L61k37j48K64k0n5J17K20o23K76L80m30N
$$ plain form
5375 22 5 -67 -312 85 197 -102 330 339 -227 -57 168 -60 -108 66 15 -176 149 -204 -576 123 -14 -140
5397 -140 -178 243 -224 -31 187 -303 -311 -243 -30 -312 -137 152 -208 -221 266 -222 -137 203 -446 -427 -241 -26
5419 -26 -127 187 206 -297 208 265 -285 189 538 -169 -171 461 -20 -172 272 243 -223 554 -1 -252 198 186
5441 186 -29 162 443 -258 133 508 103 -85 123 169 -13 197 341 263 -61 359 58 -156 370 -82 -250
5462 -250 318 85 -250 278 -135 -303 131 271 -165 -93 110 -64 -210 241 22 -321 23 -188 -207 -81 -153
5483 -153 -321 -33 248 -181 -52 326 -350 -378 142 -56 -332 -89 181 -642 169 274 -550 -97 230 -235
5503 -235 -180 -180 61 -395 168 206 -176 -91 235 -224 -62 -217 63 -184 265 -238 106 223 122 -201 230 354
5525 354 -442 312 386 -373 -157 386 -231 6 243 93 172 279 71 88 201 463 -165 -148 735 -207 -184 367
$$ packed form
5375B2j7p2k45L97J12k99M32Rn66J70K25k28m8J74n1j91L25l53l72O99j37j26
5397a40l8M21m67J93K18m90qO8K13k82J75K89l60j3M87m88Q5L40o49J9J86K15
5419b6j01L14J9n03N05N7n50M74L49p07kO32m81j52M44k9m66P77n55k51M50j2
5441A86k15J91K81p01L91L75m05j88K08M6j82K10J44p8l24M20l01k14N26m52j68
5462b50N68k33l35N28m13j68M34J40m36P2K03j74j46M51k19l43L44k11j9J26p2
5483a53j68K88K81m29J29L78o76k8N20j98k76K43K70q23Q11J05q24M53L27m65
5503b35N5%K41m56N63L8l82Q5L26m59J62j55K80k47M49n03L44J17j01l23M31J24
5525C54p96P54P4p59K16N43o17K37K37j50P9J07k08J7J13K62o28J7Q83r42K3N51
$$ plain form
5547 367 57 -38 308 200 -93 147 269 -343 92 284 -350 -296 173 -63 39 195 -196 -336 294 -11 -177
5568 -177 -288 109 -223 5 366 -233 -180 54 -391 -221 -38 -32 -391 9 -97 -130 -190 34 -283 -214 72 -135
5590 -135 -261 114 -189 -423 100 95 -433 -59 115 -159 -279 99 -105 -85 399 -226 -146 52 175 -391 233
5611 233 186 16 -71 293 70 -97 157 115 -328 509 50 -83 102 228 55 264 319 -80 -88 289 150 255
5633 255 365 -71 7 103 35 -407 202 119 -93 -31 -33 -157 -175 153 -407 127 306 338 -213 -115 312 -121 444
5656 444 150 -299 -252 241 -260 -143 149 111 9 136 -112 -224 28 168 -450 -99 77 -234 -224 220 -134
5677 -134 -200 139 17 -229 -206 -29 -167 -123 8 -344 -70 -191 -248 -100 323 -150 -129 -200 98 -100 94 11
5699 11 -80 71 84 -292 -61 256 211 -189 135 -4 -67 148 409 198 -27 315 14 171 383 94 337 237
$$ packed form
5547C67l10r5L46j08k93K40J22o12M35J92o34N4M69k36J02J56l91j40O30l05j66
5568a77j11L97l32K28L61n99N3K34m45J70J83Ol59M00j06l3o0K24l17O9K86k07
5590a35j26L75l03k34N23nn28L74J74k74j20L78k04K0M84o25Q0J98J23n66O24
5611B33m7j70q7L64k23j67K54m2m43Q37m59j33J85J26j73K09N5l99qL77j39J05
5633B55J10m36P8R6o8m42O09q3k12O2kj24j8L28n60N34J79L2n51R8M27m33N65
5656D44k94m49M7M93n01J17K92l8j02J27k48j12K52J40o18L51J76l11J0M44l54
5677a34o6L39j22k46K3J77j38M4J31l52K74j21n7J48M23m73K1p1K98j98J94q3
5699A1r1J51J3l76K31L17m5m00L24j39o3K15K61k11k25L42l01J57K12k89K43j00
$$ plain form
5721 237 -96 -101 278 197 79 185 129 46 -163 12 224 -59 125 20 -102 76 28 319 -53 -24 3 55 106
5744 106 53 65 84 33 -232 242 130 -110 152 -76 -38 119 7 -133 30 75 -173 -172 60 20 -227 -187 -117 -221
5768 -221 -67 -105 -381 -235 23 -174 -417 186 -109 103 79 279 -160 -287 132 -23 -80 -125 -338 59 159
5789 159 -55 29 -23 -159 135 76 90 -287 157 148 -145 -41 157 23 40 164 199 130 338 73 -48 219 425
5812 425 24 -71 280 218 12 136 8 -52 385 44 -149 -8 203 -217 232 216 -71 16 201 -105 207 14
5834 14 -2 -203 125 -78 -136 -86 -202 11 7 145 -219 59 89 -104 -182 10 -452 -134 -62 -39 -218 -238 -59 -112
5858 -112 -105 -50 -365 -354 -22 -265 -226 313 -75 -280 -30 56 -338 -157 97 -246 -202 137 -21 -281 174 9
5880 9 -47 194 -119 108 11 56 -227 -44 201 -76 -113 203 -165 289 315 -34 -117 126 208 -6 174 244 -118
$$ packed form
5721B37l33nL79q1j18J06n6q3k09J75K12k83J84j05j22J78m8K91l72K9K7N2N1
5744A06n3J2J9n1k65M74j12k40K62k28L8J57j12j40J63M5k48JK32m0k47M0P0j04
5768b21J54l8k76J46K58j97k43O03k95K12k4K00m39j27M19j55n7m5k13L97J00
5789A59k14Q4n2j36K94n9J4l77M44rk93J04J98j34J7J24L5o9K08k65j21K67K06
5812D25m01r5L51o2k06J24j28o0M37l41j93J41K11m20M49j6k87Q7J85l06L12j93
5834A4j6k01L28k03n8N0j16K13mJ38l64K78L0j93p8J92m62L18P2K3j79k0J79n3
5858a12PN5l15J1L32k43L9N39l88k05K50Q6l94J81K54l43M4L39j58k60M55j65
5880In6K41l13K27r7M5k83J83K45k77l7L16l68M54K6l49q3K43Q2k14J80P0l62
$$ plain form
5903 -118 485 300 156 -83 222 156 -92 61 68 100 230 5 104 12 168 -254 15 210 100 -42 486 -10
5925 -10 -98 266 -143 -315 -164 28 -147 -6 -14 37 -205 40 -76 207 -88 -75 -315 -91 82 -335 -167 24
5947 24 -282 -138 77 -105 -239 -235 -145 69 -105 -154 -322 -271 120 -160 4 99 -91 30 39 -60 -230 155 -108
5970 -108 -118 -70 -149 -146 197 144 -438 44 218 -182 228 231 207 -72 225 186 -145 -90 277 158 139 387 71 199
5994 199 472 142 160 201 154 -59 135 271 -170 -41 217 -23 -75 357 59 24 148 -50 -337 190 96 -332
6016 -332 -102 65 -102 46 208 -96 11 179 -65 -197 123 77 -351 75 -40 -358 -97 163 -305 -231 232
6037 232 -122 -352 119 -114 -230 10 -112 -500 -3 156 -329 -149 310 -207 -317 72 -297 -39 130 -166
6057 -166 -113 -1 -10 -380 -161 58 8 -76 435 -108 -147 168 65 43 316 153 -95 220 251 -129 2 263 56
$$ packed form
5903a18O03j85j44k39L05o6k48J53PL2J30k25R9r2J56m22K69J95j10j42N28m96
5925a0q8L64m09j72J51J92j75J41qN1k42K45j16K83k95J3k40K24J73m17J68J91
5947B4l06J44K15j82j34MR0K14j74m9j68N1L91k80J64R5j90J21Rr9j70L85k63
5970a08j0M8p9LL43n3n82M82J74m00M10Lk4k79K97l9l31N5L67j19j9K48l16J28
5994A99K73l30J8M1m7k13J94J36m41J29K58k40n2M32k98l5J24j98k87N27r4m28
6016c32K30J67j67J48J62l04J07J68k44j32L20m6m28M26j15l18K61K60m68P4M63
6037B32l54k30M71k33j16K40j22l88M97J59m85J80M59n17j10L89l69K58J69k96
6057a66N3J12rl70K19K19n0q4N11n43l9L15j03k2K73j63k48L15L1l80J31K61k07
$$ plain form
6080 56 190 249 446 -93 135 46 -122 56 306 73 304 363 38 20 138 180 -119 256 30 -298 -30 67
6102 67 -124 218 165 -142 -110 325 20 -65 68 3 -348 37 -105 -58 -90 67 62 -95 19 -281 -267 -25 89
6125 89 -270 108 -189 -200 66 -157 -230 -71 -21 -93 -85 -37 72 -52 -74 168 -270 181 -43 -264 40 -177 -33
6148 -33 39 152 -171 -213 254 22 -256 124 69 -49 21 266 -340 34 130 -103 142 -10 -24 -75 149 85 -114
6171 -114 48 83 -75 374 101 70 -128 425 -1 -39 -18 55 -132 335 53 126 452 211 -369 -9 325 3
6193 3 -142 296 -14 -258 -151 147 -404 159 239 -192 183 -60 -144 -26 161 -235 -404 -2 18 -40 237 25
6215 25 -392 -106 26 -104 17 -103 4 -35 -62 -96 -238 244 81 -376 34 -95 -302 134 -20 -15 32 -74
6237 -74 -145 -156 442 -142 -174 57 -179 -115 88 -220 4 98 252 21 48 -191 -64 -193 273 274 -323 238 157
$$ packed form
6080E6J34N9J97n39K28q9j68J78K50k33K31N9l25j8J18M2k99L75k26l28K68R7
6102F7j91L42n3l07L2M35l05q5J33o5l51L85j42M7l2J57nj57J14l00J4K42J14
6125H9l59L78k97j1K66k23p3J59N0p2QM8J09j24k2K42m38M51k24k21L04k17J44
6148c3P2J13l23m2M67k32k78L80n5j18P0K45o06L74R6k33K45j52j4n1K24o4j99
6171a14J62L5j58M49k73l1j98N53m26l8K1P3j87M67k82P3L26k41n80L60L34l22
6193Cj45M38l10k44J07K98n51N63Q0m31L75k43q4J18J87l96j69M02K0n8K77k12
6215B5m17K86J32j30J21j20J07l9k7l4j42M82j63m57M10j29k07M36j54NM7j06
6237g4p1j1N98n84l2K31k36O4K03l08K24R4J54k31K7k39J27j29M66Jn97N61q1
$$ plain form
6260 157 23 265 112 77 14 -13 -27 120 357 223 41 -102 18 155 154 91 -61 -41 87 -73 51 -85 -54
6283 -54 -62 -63 56 55 -185 -310 -271 63 45 -72 154 141 -24 -59 87 -274 -14 74 -113 -142 -280 -8 127 -219
6307 -219 -92 -82 -222 58 81 -119 186 152 0 -82 -118 -89 -21 -52 74 -50 -69 101 -118 269 -63 26 86 134
6331 134 -21 -9 11 29 -175 -58 -105 -226 -30 111 -109 200 139 -204 -162 -62 71 17 234 295 23 168 278
6354 278 -3 199 20 57 -222 141 14 67 217 130 -114 298 162 -134 159 -6 -73 124 233 -151 -83 33
6376 33 -44 48 114 64 68 -49 -2 -285 242 230 -243 -115 129 -70 -102 223 186 -12 125 -95 -185 64 142 9
6400 9 -89 -109 -395 186 212 -47 3 -2 -180 -102 -119 -42 -164 32 -17 70 -41 44 -278 104 230 -148 -56 4 -145
6425 -145 105 140 102 63 91 6 48 166 68 294 224 64 -271 157 12 189 -41 20 87 -7 -106 178 29 89
$$ packed form
6260A57j34K42j53l5o3k7j4J47K37j34j82j43J20J37jo3j52K0J28j60J24j36L1
6283e4qjJ19jk40j25L9L34j8j17K26j3j65l5J46l61K60Q8j87k9j38K72J35l46
6307b19J27J0j40K80K3k00L05l4j52q2l6K9O8l1J26j24j9J70k19L87l32Q9O0M8
6331A34j55J2K0J8k04J17m7j21J96J41k20L09o1l43M2J00J33n4K17O1k72J45J10
6354B78k81K02j79L7k79L63j27N3J50q7k44M12j36k96K93j65o7J97J09l84O8J16
6376C3p7R2O6n0Mj17M7k83N27j2m73J28K44j99l2L25l7j98J37k20r0K49P8j33
6400Ir8k0k86N81K6k59N0nj78P8j7P7j22J96m9Q7j11Q5l22L82J26l78R2O0j49
6425a45K50L5l8l9K8q5M2J18r8K26p0j60l35M28j45J77k30O1O7r4r9K84j49O0
$$ plain form
6449 89 94 59 28 80 23 124 172 60 8 -128 228 42 178 73 204 137 63 99 -79 -1 104 -65 240 -46
6473 -46 -126 129 -293 -274 -115 -22 64 53 94 -60 -23 -94 -60 69 113 -160 -559 -21 13 -137 -219 -170 -236 -180 -102 -164
6499 -164 -120 70 184 -120 -35 255 -253 31 -8 -23 -59 174 -84 -165 426 -37 -100 -16 46 -86 -243 99 -112
6522 -112 -135 164 -146 33 89 -5 -159 88 285 -102 -1 -83 14 171 233 -67 23 294 -34 -24 9 18 -285 113
6546 113 223 -53 -57 149 102 -33 285 -97 63 168 82 210 -144 29 -237 127 262 -205 117 48 -332 138
6568 138 120 -42 -188 30 -122 -170 35 -104 -107 -66 -280 57 65 -246 39 51 -56 -260 -26 -31 -148 -327 71
6591 71 -89 -177 -112 39 -44 -107 -55 -205 107 245 -103 -271 218 -47 -242 12 237 -221 -96 -10 -206 144
6613 144 257 -223 -104 239 147 -198 153 -57 -29 144 -35 -12 333 222 37 -100 80 44 -101 129 279
$$ packed form
6449H9Nl5l1N2n7J01M8j12n2j36L56j86J36j05J31o7p4L6j78P8J05j69L05k86
6473d6q0K55m22J9J59R3Q6j1M1j54L7p1L4J29M4k73l99N38L4j50q2M9o6N6P8o2
6499a64M4J90J14l04Q5K90n08K84l9j5l6K33k58q1N91m63o3Q4O2j32j57L42k11
6522a12k3K99l10J79N6r4j54K47J97l87J01q2R7J57O2l00R0K71l28J0L3Rl03L98
6546A13J10k76mK06m7j35L18l82J60J05q6J28l54J73k66L64J35m67L22o9l80M70
6568A38j8j62j46K18j52m8K05j39lM1k14L37Ql11K85J2j07k04K34nj17j79L98
6591G1j60q8O5J51q3o3N2j50L12J38l48j68M89k65j95K54K25m58J25Q6j96L50
6613A44J13m80J19L43r2l45L51k10K8J73j79K3L45j11j85j37J80l6j45K30J50
$$ plain form
6634 279 200 30 211 7 168 47 -2 -94 -227 114 -137 159 -51 -106 280 -24 140 -30 -249 89 37 -198
6656 -198 -204 -106 -12 -369 -126 34 -236 -3 232 66 -185 -294 16 -207 -245 61 -12 -428 -102 -64 -138 -132 253
6679 253 -362 -182 106 -238 -158 -114 -142 -16 -2 -229 -345 38 161 -45 232 22 -169 -222 -75 87 -192 121
6701 121 25 64 79 -3 22 185 76 -149 -59 -43 207 -45 119 -54 -114 90 145 -18 441 256 -123 145 117
6724 117 -150 173 -185 360 21 193 99 -278 279 127 48 -35 241 -26 271 2 -340 -92 262 -166 134
6745 134 242 27 -80 -189 184 -70 21 106 -204 86 -153 -190 -76 24 -268 -271 -326 -70 -90 -144 285 138 -42
6768 -42 -222 25 -10 -106 117 44 92 -220 -289 52 -219 -312 42 104 -40 36 72 168 -46 122 -210 -182 234 26
6792 26 -127 -60 -69 53 -3 -107 -82 158 -12 -196 57 288 -191 185 26 114 247 174 288 -114 -20 222 -110
$$ packed form
6634B79p9j70J81k04J61j21m9r2j33L41k51K96k10n5L86l04J64j70k19L38n2k35
6656a98oR8R4l57K43J60k70K33K35j66k51j09L10k23l8L06p3m16L26L8p4OL85
6679B53o15J80K88l44Q0M4k8J26J4k27j16L83J23k06K77k10j91n3J47J62k79L13
6701A21r6L9J5q2K5J63j09k25R0J6K50k52J64j73o0K04N5j63M59j85l79K68k8
6724A17k67L23l58N45l39J72r4l77N57j52p9q3K76k67K97k69l42K48L54m28L00
6745A34J08k15j07j09L73k54R1Q5l10K90k39l7J14J00k92ln5K56k0n4M29j47j80
6768d2j80K47l5r6K23p3M8l12o9L41k71r3L54O2j44P6L6R6k14J68l32K8M16k08
6792B6j53O7rJ22n6j04K5K40j70j84K53K31m79L76j59Q8J33p3J14m02R4K42l32
$$ plain form
6815 -110 82 -171 159 447 118 -95 -53 222 131 -11 198 36 -52 -126 155 -20 -144 -78 50 -18 187 -91
6837 -91 -49 61 -195 46 47 193 -86 60 112 -12 95 9 -70 -168 -158 -239 -139 -312 -178 38 -99 19 -57 -186
6861 -186 29 -244 4 -72 184 34 132 -54 -179 135 110 -189 0 -40 21 -135 273 -56 -270 -7 -197 -80
6883 -80 -189 26 -33 1 -74 81 50 89 60 12 303 5 -85 -50 28 -109 292 160 57 -116 -95 64 101 -107
6907 -107 157 -46 -127 176 -38 348 -89 -222 -129 172 114 17 52 21 -208 127 272 -18 -184 -59 -95 -37 107
6930 107 58 -93 -145 105 -126 -32 -215 -28 1 -77 -52 99 -414 49 -134 -184 -35 -145 -47 55 -101 -177 217
6953 217 131 126 -22 9 96 -20 -365 -52 -44 271 -142 41 130 168 114 -152 62 119 -228 23 99 -268 41 250
6977 250 -18 72 -155 146 287 85 131 174 80 121 -439 -51 70 69 160 -211 -145 148 -298 -109 48 -166 25
$$ packed form
6815a10J92k53L30K88l29k13M2K75r1j42K09j62q8p4K81j75j24O6J28o8K05k78
6837i1M2J10k56K41JJ46k79J46N2j24J07q6p9r8J0q1J00j73J34K16j37J18p6j29
6861a86K15k73K48p6K56j50R8j86j25L14k5k99J89m0O1j56M08l29k14K63j90J17
6883h0j09K15n9L4p5J55l1L9k9m8K91k98r0L5P8j37M01j32j03j73K1J59L7k08
6907a07K64k03q1L03k14L86m37j33R3L01n8r7L5l1k29L35J45k90j66J25l6N8J44
6930A07m9j51n2K50k31R4j83J87K9p8K5J51n13M63j83n0J49j10R8J02j56p6L94
6953B17q6nj48L1Q7j16l45L13QL15m13J83Q9L8n4k66K14N7l47K51P6l67L09K09
6977B50k68R0k27L01J41k02M6M3r4M1n60L88J21jR1l71O6K93m46J89J57k14J91
$$ plain form
7000 25 197 -168 -92 204 29 -39 141 -147 57 37 -101 251 109 235 -70 -95 119 127 -11 -121 -60 -194 61
7023 61 60 -334 -14 -45 -340 -163 -12 -264 49 -124 -375 14 -246 42 -51 36 -110 -6 132 -82 79 135
7045 135 138 -15 -61 -88 46 59 -96 -70 26 -160 68 -16 67 54 -51 -86 -7 -221 -141 158 -146 -5 -65 -26 -18 -55
7071 -55 27 9 -120 158 62 117 202 148 159 -107 303 -264 9 -82 9 -16 187 47 -26 96 -68 207 -92 174
7095 174 -191 -230 -25 -250 290 -86 25 84 13 -180 -109 -72 -254 -280 103 62 -53 149 14 -15 99 86 117
7118 117 12 -4 6 -42 -15 58 -83 37 -80 -90 230 77 -303 -179 11 61 -2 24 -172 -170 153 -43 200 -55
7142 -55 -156 -226 112 -66 -240 2 291 90 -29 252 122 -86 -22 -260 -215 227 4 -27 134 -36 -199 331
7164 331 148 73 149 104 414 -58 169 135 -224 59 288 65 181 219 2 -112 83 -147 -21 112 242 123
$$ packed form
7000B5J72l65P6K96j75o8J80k88K04k0j38L52j42J26l05k5K14Qj38j10O1j34K55
7023F1jl94L20l1k95J77J51k52L13j73k51L89k60K88r3Q7j46J04J38k14J61N6
7045A35Lj53m6k7J34J3j55K6R6j86K28q4Q3j3j05l5P9k14Q0K99l04J41o0L9Ql7
7071e5Q2j8j29K78r6N5Q5n4J1k66M10n67K73r1R1k5K03j40p3J22j64K75k99K66
7095A74l65l9K05k25N40l76J11N9p1j93P1L7j82k6L83m1j15K02j35k9J14j3L1
7118A17j05j6J0m8K7P3j41J20j17j0L20j53l80J24J90N0o3K6j96KL23j96K43k55
7142e5j01p0L38j78j74K42K89k01j19K81j30k08O4k38M5M42k23l1J61j70j63N30
7164C31j83p5P6m5L10m72K27l4l59K83K29k23J16L8k17j14J95k30J26J33J30j19
$$ plain form
7186 123 207 -17 113 -190 288 -24 186 62 140 -239 -3 -8 -88 -41 25 -59 -165 128 -147 -35 -18 -181 71
7209 71 103 -181 -47 -150 -164 -231 196 -238 -241 -56 -123 -31 -68 -121 22 -265 -111 26 -155 -256 -224 -263 -18 122
7233 122 -266 -49 -161 -162 -270 62 -130 -193 -48 -66 -177 -67 240 -38 -195 -116 -122 74 100 18 -41 69 -200
7256 -200 -114 33 94 -19 67 16 -27 134 204 6 -160 180 41 -179 -55 178 73 97 -207 -222 36 -124 -205
7279 -205 -39 -230 38 -35 161 284 90 111 -49 -53 147 228 240 -80 136 -138 222 109 -286 -141 -172 -95 -174
7302 -174 -28 36 -152 -245 153 -190 -402 101 85 -111 -133 340 -12 26 117 -272 79 150 -163 71 81 126 -182
7325 -182 -214 -66 -67 4 -182 -117 10 45 -9 -33 42 -70 -158 313 -46 -252 162 160 77 -32 -41 -32 234 -23 -149 94
7351 94 136 -39 192 140 51 40 64 180 -88 -140 77 -21 -181 42 196 189 297 1 10 132 51 -57 -93 36 26
$$ packed form
7186A23Q4k24J30l03M78l12K10j24P8l79K36nq0M7O6q4j06K93k75J12J7j63K52
7209G1L2k84J34j03j4o7M27m34lJ85o7R2l7n3J43k87J54J37j81j01L2l9K45J40
7233A22l88K17j12jj08L32j92o3J45j8j11J10L07k78j57P9oJ96K6q2n9J10k69
7256b00Q6J47O1j13Q6n1m3J61P0j98j66L40j39k20J24K33j05K4l04j5K58j60q1
7279b05J66j91K68p3J96J23j94K1j60mK00Q1J2l20K16k74L60j13l95J45l1P7p9
7302a74J46O4j88r3L98l43k12N03j6j96k2M73l52L8R1l89L51P1l13K34J0M5l08
7325a82l2J48jP1j86O5J27L5n4k4P5j12q8M71l59k06M14kq3j09rRK66k57j26K43
7351I4M2j75K31n2q9j1K4J16k68n2K17r8j60K23J54pJ08k96RJ22q1j08l6J29j0
$$ plain form
7376 26 90 65 116 -153 71 151 74 100 -29 21 68 13 -80 -85 5 91 -4 17 -45 -180 -100 -209 -266 42 -18 127 152
7403 152 -162 -74 -91 -185 -211 -179 102 24 187 153 -382 -56 -130 313 114 -40 109 47 61 -53 -111 -71 -212 63
7427 63 123 85 45 -110 270 129 -68 141 166 -127 -65 250 138 260 270 87 40 164 -282 28 136 59 7
7450 7 276 -235 117 -218 -110 42 252 73 126 58 46 -37 117 97 107 -35 -94 307 -13 -100 263 -7 132
7473 132 149 -148 -151 -84 108 -125 232 24 -38 -76 56 -98 -242 -179 62 -232 6 -101 39 6 -237 -365 200
7496 200 -17 -108 95 25 45 -93 79 11 -94 -161 -53 -384 -227 -305 -114 -105 67 57 -123 79 106 -167 57
7519 57 475 223 62 63 -4 -45 -2 224 52 -35 26 122 9 104 226 60 300 -302 9 1 -2 33 -56 150 25
7544 25 57 48 23 184 -144 61 -169 75 95 -25 -203 -162 80 18 243 -251 32 -187 -171 95 36 -163 -75 153
$$ packed form
7376B6O4k5N1k69K24Q0p7K6j29N0M7n5r3nR0Q6r5K1o2j35Q0j09n7L08o0J45K5
7403A52l14Q8j7r4k6L2K81p8J63l4n35L26p4M43j99j54J49o2J4j14n8M0j41K75
7427F3O0l8m0j55L80j41j97K09K5k93O2L15j12J22J0j83m7J24m46L10J08p7n2
7450GK69n11L52l35J08J52K10j79N3o8j2q3J54k0J0j42n9M01l20q7L63k70J39
7473A32J7k97lO7J92k33L57k08o2l8J32j54j44O3K41k94K38j07J40l3k43j28N65
7496B00k17r1K03p0K0j38J72o8j05o7J08l31J57p8J91RJ72j0j80K02K7k73K24
7519E7M18k52j61Jo7m1M3K26j72q7O1R6j13R5J22j66K40o02L11qlL5q9K06j25
7544B5L2rk5J61l28K05k30K44K0j20j78M1K42o2K25m94K83k19J6K66n9j99Q8K28
$$ plain form
7568 153 99 -11 87 -130 59 135 59 -90 -207 -236 -18 -4 -134 -21 -213 -16 119 38 284 -14 165 -76
7590 -76 -258 16 51 95 -219 -203 13 58 -26 -36 -96 -117 42 -159 -63 -114 146 -74 220 31 119 -12 69 -53
7614 -53 -119 252 9 194 159 197 -290 15 126 -62 -81 -87 16 106 186 -228 -14 -124 147 -100 155 285 -2
7637 -2 -130 190 102 161 -12 79 -19 34 -216 30 80 113 -88 -138 -68 -221 57 68 -81 -41 -20 -79 31 53 -15 111
7663 111 318 -177 83 -118 164 205 -50 -53 -308 -47 99 16 -157 -14 16 -19 -26 13 -4 -97 46 -95 -88 -106 -188
7688 -188 -191 -169 184 89 92 25 -163 -64 -263 -202 118 -27 80 90 -147 156 64 167 -140 -190 -186 264 -143 214 245
7713 245 13 -48 34 203 63 131 97 -36 -34 -21 302 79 83 -90 -112 -39 97 -185 40 119 -15 228 -91 249
7737 249 -76 -22 -141 344 230 -174 163 -159 48 244 -103 -100 -298 144 -268 -44 55 110 -38 -130 -358 -263
$$ packed form
7568A53n4j10R8k17J89P6p6j49j17k9K18J4j30J13j92J97J35q1K46k98J79k41
7590g6j82K74L5M4l14J6K16M5q4j0o0k1J59k01R6n1K60k20K94j89Q8j31Q1j22
7614e3o6L71k43J85l5L8m87L05J11j88j9oJ03R0Q0m14K14j10K71k47K55J30k87
7637bj28L20q8N9j73R1r8N3k50K46N0L3k01n0P0j53K78J1j49M0K1n9J10K2o8J26
7663A11K07m95K60k01K82M1k55lk55K61J46q3j73J43L0l5pL9j7r3J43j41Pj8q2
7688a88lK2L53r5Lo7j88R9j99O1L20j45J07J0k37L03r2J03l07n0MM50m07L57L1
7713B45k32o1Q2J69j40O8l4j33KJ3L23k23Mj73k2P3J36k82K25P9j34K43l19L40
7737B49l25N4j19M85j14m04L37l22K07J96l47Lj98M42m12K24R9N5j48r2k28R5
$$ plain form
7759 -263 55 -221 -199 79 1 -4 -319 88 78 -264 175 -119 -112 -36 -70 69 -12 -15 -34 -68 131 -34 -272 -164 72
7784 72 -56 -130 -107 120 3 -42 -95 -128 123 76 166 -89 -90 16 -217 -64 -25 133 93 -222 76 196 16 -26
7808 -26 68 143 108 137 4 -130 -184 -66 2 -3 143 68 141 188 -139 -162 -76 35 -33 -98 23 -142 -49 258 -37 -1
7834 -1 21 103 46 73 -44 -67 -198 30 -26 97 92 13 -55 -85 292 63 4 -164 -77 104 -212 -55 112 78 -95
7859 -95 52 -163 153 3 -228 -3 -267 -192 -241 180 -48 149 235 75 1 31 -280 -44 155 67 98 85 92 -81
7883 -81 90 40 -120 -14 -2 -352 114 -42 113 14 201 -61 148 306 -32 -243 61 191 58 -122 -101 20
7905 20 5 150 54 158 -67 69 -19 200 120 -132 28 -17 85 224 231 -19 215 90 -17 -86 54 -90 -181
7928 -181 -115 -93 46 215 208 16 -236 -174 296 -38 129 113 -27 129 -128 -115 58 -137 21 -153 -88 124 -105
$$ packed form
7759b63L18k76K2K78p8nl15M07j0l42M39k94PP6l4J39q1lj9l4J99j65k38J08K36
7784G2j28p4K3K27j17m5n3l3K51m7R0k55jJ06k33J53L9J58m0l15K98J20j80m2
7808b6R4P5l5K9j33j34n4J18O8nJ46p5P3M7l27k3Q6J11o8o5J21j65R3L07k95L6
7834aK2Q2n7K7j17k3j31K28n6J23np9o8l0L77k29n9j68Q7J81l16J57J67l4j73
7859i5J47k15L16j50k31K25k64P5m9M21k28J97Q6j60p4L0l11K36J99q8L1j3Pj73
7883h1J71n0j60J06J2l50M66j56J55r9J87k62K09J58l38k11L04J30j33j80K1J21
7905B0j5J45r6J04k25J36q8K19q0k52J60m5J02J39Pk50K34j25j07o9J40j44r1
7928a81O6K2J39J69pj92k52O2M70l34J67j6j40J56k57J3J73j95J58j74O5K12k29
$$ plain form
7951 -105 -166 -22 208 46 170 -225 -178 -48 -4 -180 -14 5 51 147 -150 -251 -205 -20 164 15 -93 -48 -106
7974 -106 36 -82 -114 105 -38 -53 -164 -161 223 -91 -6 -103 9 -131 234 75 -12 -96 143 127 142 181 -220 -175
7998 -175 -201 15 -168 -57 8 64 75 -61 -159 90 -49 378 -43 127 51 172 37 36 -225 -13 365 -10 7
8021 7 -153 -61 317 86 129 -3 -205 20 -78 -18 -23 288 -106 -11 33 -121 -18 -3 -15 144 41 -179 159 89
8045 89 -186 -317 166 -114 -9 -24 91 66 -51 -32 -148 16 111 -131 -63 -41 -224 -63 11 199 -135 87 77
8068 77 -198 66 -31 50 105 61 -128 -140 -82 266 118 -29 2 155 65 58 182 -109 434 42 -108 23 -61 -37
8092 -37 -3 -220 -29 122 329 116 164 -282 149 45 -2 -33 -228 -177 -219 -198 156 271 68 -54 59 139 42
8115 42 -74 -6 -46 13 -271 -34 124 213 73 58 7 -156 -40 -47 83 -142 -3 -51 -1 66 287 -166 -201 71
$$ packed form
7951a05o1J44K30j62J24l95M7J30M4j76J66J9M6R6k97j01M6J85J84j49j08M5n8
7974a06J42j18l2K19j43j5j11LL84l14Q5r7J12j40L65j59q7q4K39j6J5L9m01M5
7998a75k6K16j83J11O5N6J1j36r8K49j39M27m21J70p6J21j35jk61K12L78l75J7
8021Gj60R2L78k31M3j32k02K25r8O0nL11l94R5M4j54J03J5j2J59j03k20L38p0
8045H9k75j31M83k80J05j5J15k5j17J9j16J64R5k42O8K2j83J61P4J88l34K22j0
8068G7k75K64r7Q1N5m4j89j2N8L48j48j47L1J53r0pJ24k91N43l92j50J31q4K4
8092c7L4k17J91J51K07k13M8m46M31j04m7l1j95N1m2K1L54J15k03j22J13Q0r7
8115D2j16O8m0N9k84K37J58Q9j40j5n1j63J16pJ30k25J39m8N0O7K21m53l5K72
$$ plain form
8139 71 27 -56 12 -77 29 169 -229 74 -117 -230 -121 -99 17 -136 -206 -14 2 -55 169 27 -159 93 241
8162 241 -192 28 -1 160 11 113 -2 100 -85 223 224 -44 -68 212 211 53 230 79 -84 72 205 -72
8184 -72 -60 76 164 31 -25 33 -49
$$ packed form
8139G1m4q3O8q9J06J40l98L03j91j13J09K2J16j53p0J92J6n7K24j42j86K52J48
8162B41m33K20k9J61j49J02j15J02j85L08Jk68k4K80jj58J77j51j63J56J33k77
8184g2J2J36Q8j33n6N8q2
8191d9
$$ Imaginary data points
##PAGE= N=2
##DATA TABLE= (X++(I..I)), XYDATA
$$ plain form
0 0 0 0 0 0 0 0 8 -8 0 -8 8 -8 16 -16 24 -24 32 -46 48 -60 72 -88 104 -120 144 -164 191 -222 255 -292 332
31 332 -379 428 -483 546 -615 687 -769 860 -957 1062 -1178 1306 -1447 1599 -1763 1944
47 1944 -2141 2359 -2599 2865 -3153 3479 -3843 4251 -4714 5243 -5855 6574 -7432 8472
61 8472 -9766 11426 -13640 16744 -21404 29140 -44233 84100 -397916 -819969 606963
72 606963 425336 -499121 -213865 98884 -61669 319799 73281 -617477 33648 734106
82 734106 -155860 -538364 188426 225284 -82956 31072 -230899 -237428 403209 143652 -589997
93 -589997 -43431 486858 -111728 -257361 139857 -9660 50848 246743 -274743 -280275 476499
104 476499 166612 -528325 -27756 320315 -141172 -46040 106833 -278997 52220 464393
$$ packed form
0@%%%%%%Qj6QqJ6j6K4l2M0m8N6p8R4j08J32j60J92k24K64l08L55m13M77n47O24
31C32p11Q07r11J029j161J302j456J629j817K019k240K484k753L046l362L707
47A944m085M500m958N464o018O632p322Q094q965R957j1098J2429j4006J5904
61H472j8238K1192k5066L0384l8148N0544p3373J28333m82016m22053J426932
72F06963j81627r24457K85256L12749j60553L81468k46518o90758O51125P00458
82G34106q89966l82504P26790L6858l08240J14028k61971o529O40637k59557p33649
93e89997N46566N30289n98586j45633L97218j49517O0508J95895n21486n532P56774
104D76499l09887o94937N00569L48071m61487R5132J52873l85830L31217M12173
$$ plain form
114 464393 -241352 -387412 432014 242302 -357318 47777 192196 -204590 113214 232278
124 232278 -385741 -119258 489823 -74496 -425041 199867 255515 -142448 -5921 34421
134 34421 -77778 225761 140128 -338103 -22186 364949 -84961 -232046 111638 7679
144 7679 -52309 155507 -109695 -230834 273553 207586 -318437 -58177 281290 -35553 -79477
155 -79477 82761 -129296 -18062 251676 -147110 -310078 231855 190361 -294053 -70358
165 -70358 184948 -67364 -2070 112297 -183283 -47365 296200 -64254 -296020 135582
175 135582 165531 -178492 -55970 55101 -103619 52474 112312 -206129 -85406 243667
185 243667 7714 -185428 48114 79692 -26084 40781 -55901 -121075 147569 98940 -239920
$$ packed form
114D64393p05745j46060Q19426j89712n99620M05095J44419l96786L17804J19064
124B32278o18019K66483O09081n64319l50545O24908N5648l97963J36527M0342
134C4421j12199L03539q5633m78231L15917L87135m49910j47085L43684j03959
144G679n9988K07816k65202j21139N04387o5967n26023K60260L39467l16843m3924
155g9477J62238k12057J11234K69738l98786j62968N41933m1494m84414K23695
165g0358K55306k52312O5294J14367k95580J35918L43565l60454k31766M31602
175A35582K9949l44023J22522J11071j58720J56093N9838l18441J20723L29073
185B43667k35953j93142K33542L1578j05776O6865r6682o5174K68644m8629l38860
$$ plain form
196 -239920 -56040 207108 -33802 -123920 64486 5319 -24664 114608 -26038 -131837
206 -131837 134556 127682 -160707 -40478 140692 -28190 -50366 54748 -56075 -31150 131134
217 131134 -18528 -134165 100813 123102 -101869 -23375 108681 -6709 -12578 48306 -45982
228 -45982 -18844 92321 -22084 -92354 59030 52710 -72621 5571 57274 -32221 11579
239 11579 53533 -41887 -10188 70906 -16457 -47134 39943 -2404 -55625 30268 11967 -71205
251 -71205 15444 46647 -61253 -19119 60684 -16947 -34677 37652 -4232 -42911 29645 11254
263 11254 -60394 -169 22891 -48982 -18154 23712 -30427 -20850 28041 -15067 -33844 31537
275 31537 20679 -38178 -2721 21545 -17006 -8384 3264 -21107 -4672 8530 -23409 -16367
$$ packed form
196b39920J83880K63148k40910r0118J88406n9167k9983J39272j40646j05799
206a31837K66393o874k88389J20229J81170j68882k2176J05114j10823K4925J62284
217A31134j49662j15637K34978K2289k24971P8494J32056j15390n869O0884r4288
228d5982K7138J11165j14405p0270J51384o320j25331P8192N1703q9495M3800
239A1579M1954r5420L1699Q1094q7363l0677Q7077m2347n3221Q5893j8301q3172
251g1205Q6649L1203j07900M2134P9803p7631j7730P2329m1884l8679P2556j8391
263A1254p1648O0225K3060p1873L0828M1866n4139R577M8891m3108j8777O5381
275C1537j0858n8857L5457K4266l8551Q622J1648k4371J6435J3202l1939P042
$$ plain form
287 -16367 22112 5089 -20259 9055 16014 -4797 12730 14173 -8701 7018 13898 -9004 -3540
300 -3540 12651 146 -8069 7053 3410 -3226 19229 14171 -6669 13834 23333 2571 3690
313 3690 17366 10089 -3047 1810 6126 525 5103 2637 -5193 6656 8869 -173 5969 13043
327 13043 7968 -245 2777 10797 3474 -1650 -512 -3674 -3067 -4882 -5660 -1695 -3835 -3469 -3236 -5327
343 -5327 1772 3284 -918 -3771 -4676 -4 -3314 -9213 -5245 -7440 -9931 -9720 -12531 -7242 -2466 -5678
359 -5678 -10128 -7522 3774 -1140 -9403 818 954 -8341 -5719 -4111 -5866 -4047 -4191 -10249 -9860
374 -9860 2991 -1302 -9235 5313 4121 -5928 5352 6521 -1678 4825 8225 -4922 -4624 10783
388 10783 1182 -7910 8525 2304 -7298 13228 8126 -6853 13940 18221 -6364 1129 23019
$$ packed form
287a6367L8479j7023k5348K9314O959k0811J7527J443k2874J5719O880k2902N464
300c540J6191j2505q215J5122l643o636K2455n058k0840K0503R499k0762J119
313C690J3676p277j3136M857M316n601M578k466p830J1849K213r042O142P074
327A3043n075q213L022Q020p323n124J138l162O07j815p78L965k140L66K33k091
343e327P099J512m202k853r05M672l310n899L968k195k491K11k811N289M776l212
359e678m450K606J1296m914q263J0221J36r295K622J608j755J819j44o058L89
374i860J2851m293p933J4548j192j0049J1280J169q199O503L400j3147K98J5407
388A0783r601r092J6435o221r602K0526n102j4979K0793M281k4585P493K1890
$$ plain form
401 23019 3868 -4757 17386 995 -10158 20739 6389 -18973 15175 19978 -15773 659
413 659 25679 -3187 -3373 25709 -5434 -15527 31495 7089 -30486 13808 17803 -25234 -926
426 -926 17797 -20763 -4620 28586 -21665 -25616 38440 4310 -38056 16599 12413 -31189 9501
439 9501 14059 -40778 -3326 35277 -35184 -35690 37329 -3447 -37631 20469 -3442 -36297 32009
452 32009 14558 -59895 5252 49822 -40187 -35773 39237 -11060 -30627 31378 -19202 -44852
464 -44852 52149 19477 -71795 10737 58782 -35479 -22316 40864 -19602 -13639 50890 -30593
476 -30593 -49938 69004 22327 -74843 18179 52746 -37277 2012 42853 -40772 521 78395
488 78395 -37807 -56589 82526 26492 -70768 26470 38301 -42305 26291 40088 -66185
$$ packed form
401B3019j9151q625K2143j6391j1153L0897j4350k5362L4148M803l5751J6432
413F59K5020k8866j86K9082l1143j0093M7022k4406l7575M4294L995m3037K4308
426i26J8723l8560J6143L3206n0251l951O4056l4130m2366N4655m186m3602M0690
439I501M558n4837L7452L8603p0461n06P3019m0776l4184N8100k3911l2855O8306
452C2009j7451p4453O5147M4570r0009M414P5010n0297j9567O2005n0580k5650
464d4852R7001l2672r1272Q2532M8045r4261J3163O3180o0466N963O4529q1483
476c0593j9345J18942m6677r7170R3022L4567r0023L9289M0841q3625M1293P7874
488G8395j16202j8782J39115n6034r7260R7238J1831q0606O8596J3797j06273
$$ plain form
499 -66185 6619 91115 -45369 -55821 81572 11972 -54689 46766 8517 -59048 60635
510 60635 44536 -100275 2523 102138 -49045 -59195 67148 -6622 -39682 59577 -21232
521 -21232 -73437 81168 45322 -111682 -264 88315 -47403 -36361 47259 -45296 -20056
532 -20056 84595 -52359 -95910 96109 47233 -114962 1034 70151 -48563 -4574 43497
543 43497 -77960 -11256 109529 -58263 -105680 89904 42638 -92496 11157 32483 -53781
554 -53781 40397 44047 -109284 -289 128771 -58811 -93901 88491 21081 -69325 46732
565 46732 6503 -79152 70843 65813 -121221 -11808 126433 -38141 -66027 68466 -7180
576 -7180 -33211 80014 -22083 -91985 94177 69873 -118814 -4545 103768 -42460 -26867
$$ packed form
499f6185P2804Q4496j36484j0452J37393o9600o6661J01455l8249o7565J19683
510F0635j6099j44811J02798R9615j51183j0150J26343p3770l3060R9259q0809
521b1232n2205J54605l5846j57004J11418Q8579j35718J1042Q3620r2555K5240
532b0056J04651j36954m3551J92019m8876j62195J15996O9117j18714M3989M8071
543D3497j21457O6704J20785j67792m7417J95584m7266j35134J03653K1326q6264
554e3781R4178L650j53331J08995J29060j87582l5090J82392o7410r0406J16057
565D6732m0229q5655J49995n030j87034J09413J38241j64574k7886J34493p5646
576g180k6031J13225j02097o9902J86162k4304j88687J14269J08313j46228J5593
$$ plain form
587 -26867 66401 -49919 -24930 115527 -28564 -110942 91911 75770 -100405 -3786 70561
598 70561 -43142 8565 57589 -84066 -18509 127090 -38032 -110268 81777 53015 -79542
609 -79542 17457 30660 -63779 46266 62327 -117139 -21561 135539 -42149 -105561 69713
620 69713 26392 -63725 38324 2791 -83443 62227 66323 -119808 -23371 113500 -38983
631 -38983 -67415 55205 -18744 -41191 74738 -22753 -104706 75448 70894 -114398 -19632
642 -19632 91041 -39894 -32671 55489 -45759 -33570 93709 -19138 -100786 63681 61014
653 61014 -80780 -2262 52009 -46346 10706 59052 -72341 -26641 107746 -16635 -88595
664 -88595 58393 44131 -56572 22600 28129 -59840 36586 68122 -82275 -27082 104092
$$ packed form
587b6867R3268j16320K4989J40457j44091q2378K02853j6141j76175R6619P4347
598G0561j13703N1707M9024j41655O5557J45599j65122p2236J92045k8762j32557
609g9542R6999J3203r4439J10045J6061j79466R5578J57100j77688o3412J75274
620F9713m3321r0117J02049l5533q6234J45670M096j86131R6437J36871j52483
631c8983k8432J22620p3949k2447J15929r7491q1953J80154m554j85292R4766
642a9632J10673j30935P223Q8160j01248J2189J27279j12847q1648J64467k667
653F1014j41794P8518N4271r8355N7052M8346j31393M5700J34387j24381p1960
664h8595J46988j4262j00703P9172N529q7969R6426L1536j50397N5193J31174
$$ plain form
675 104092 -12284 -68719 49478 20337 -38206 44467 9955 -69410 48253 67741 -79282
686 -79282 -21416 84784 -19726 -42069 47137 -11673 -34871 63644 1789 -80147 43817
697 43817 63329 -68532 -17801 59617 -25085 -19511 40808 -33038 -30110 64299 -7545 -72750
709 -72750 36961 39920 -56670 -562 34657 -41290 245 44421 -47293 -31294 62103 -7879
721 -7879 -61155 28750 20780 -43349 13913 16871 -49781 13237 44897 -50734 -26927 55598 -8781
734 -8781 -43793 26676 6197 -31926 26748 8844 -50157 19768 42154 -43937 -17660 44699
746 44699 -10367 -23570 27852 -5167 -22907 35989 7621 -43587 20633 36824 -30789 -6578
758 -6578 30721 -12137 -5139 26356 -14294 -14321 38389 3052 -34628 22724 26256 -24587 4402
$$ packed form
675A04092j16376n6435J18197k9141n8543Q2673l4512p9365J17663J9488j47023
686g9282N7866J06200j04510k2343Q9206n8810k3198R8515o1855q1936J23964
697D3817J9512j31861N0731P7418q4702N574O0319p3846K928R4409p1844o5205
709g2750J09711K959r6590N6108L5219p5947M1535M4176r1714J5999R3397o9982
721g879n3276Q9905p970o4129N7262K958o6652O3018L1660r5631K3807Q2525o4379
734h781l5012P0469k0479l8123N8674j7904n9001O9925K2386q6091K6277O2359
746D4699n5066j3203N1422l3019j7740N8896k8368n1208O4220J6191o7613K4211
758f578L7299m2858O998L1495m0650k7N2710l5337l7680N7352L532n0843K8989
$$ plain form
771 4402 23040 -16530 1960 26365 -16212 -12606 31149 500 -24864 18372 13752 -20123 9977
784 9977 14431 -20759 3937 23312 -16635 -12257 22368 -1854 -18915 11817 4884 -16753 8220
797 8220 5946 -20405 3032 13703 -15846 -8026 13047 -7154 -12689 9077 -2554 -15373 6961
810 6961 2137 -17472 1828 6185 -13333 -3392 6254 -9938 -5946 8026 -6384 -11073 8103
823 8103 245 -13949 3775 5002 -10922 -320 5557 -7562 -3055 7123 -2920 -6415 6578
836 6578 1579 -6496 5097 4214 -6003 3264 6088 -3677 -22 7223 1081 -2623 4742 3995 -995
851 -995 4465 3574 -345 5280 4207 -657 3724 5615 1130 857 4327 3018 691 4095 2845 41
867 41 4176 2522 -554 3441 3123 363 1055 2452 772 -19 2635 680 -2416 1971 982 -3037 263
$$ packed form
771D402J8638l9570J8490K4405m2577L606M3755l0649k5364M3236m620l3875L0100
784I977M454l5190K4696J9375l9947M378L4625k4222j7061L0732o933k1637K4973
797H220k274k6351K3437J0671k9549P820K1073k0201n535K1766j1631j2819K2334
810F961m824j9609J9300M357j9518R941R646j6192L992J3972j4410m689J9176
823H103p858j4194J7724J227j5924J0602N877j3119M507J0178j0043l495J2993
836F578m999q075J1593q83j0217R267K824r765L655P245o142l704P365p47m990
851i95N460q91l919N625j073m864M381J891m485k73L470j309k327L404j250k804
867D1M135j654l076L995l18k760O92J397j680p91K654j955l096M387r89m019L300
$$ plain form
884 263 780 -1963 -1731 -865 -760 -2015 -820 -1309 -3454 -835 -1495 -4119 -1027 -1948 -4245 -2795 -2274
901 -2274 -2547 -3020 -2299 -2285 -3789 -1647 -2630 -3599 -23 -2547 -4215 -134 -1774 -3519 -775 -269 -3414
918 -3414 -2935 1718 -1802 -3408 2666 -648 -3365 2543 278 -2434 2652 2684 -3033 440 5345 -1149
934 -1149 -1861 6128 577 -2642 6049 2282 -2424 6120 4582 -3027 2980 7667 -1496 88 8480
949 8480 -322 -1813 9500 1162 -4135 9018 4505 -5705 4720 7954 -4356 1028 9105 -4143
963 -4143 -2136 11181 -2625 -7116 10617 1633 -10049 5779 6026 -9547 1133 8512 -9694
976 -9694 -3962 11882 -6853 -10182 11084 -1764 -12805 7096 1996 -14181 3662 7267 -16500
989 -16500 -3557 13731 -11319 -11480 12609 -5802 -13237 11169 -1954 -17315 9355 7303 -20873
$$ packed form
884B63N17k743K32Q66J05j255J195m89k145K619o60k624L092r21k297J450N21
901b274k73m73P21J4j504K142r83r69L576k524j668M081j640j745K744N06l145
918c414M79M653l520j606O074l314k717N908k265k712N086L2n717L473M905o494
934a149p12P989n551l219Q691l767m706Q544j538p609O007M687r163J584Q392
949H480q802j491J1313q338n297J3153m513j0210J0425L234j2310N384Q077j3248
963d143K007J3317j3806m491J7733q984j1682J5828K47j5573J0680P379j8206
976i694N732J5844j8735l329K1266j2848j1041J9901n100j6177J7843L605k3767
989a6500J2943J7288k5050j61K4089j8411p435K4406j3123j5361K6670k052k8176
$$ plain form
1002 -20873 -716 15423 -14508 -8762 15156 -9816 -11130 17515 -5135 -19246 16104 8454
1014 8454 -21947 4089 16365 -15244 -1906 17308 -14141 -6658 24834 -7674 -18950 22269
1026 22269 8115 -21261 10281 15073 -17089 5849 20249 -19267 -3699 30591 -9650 -18548
1038 -18548 24992 5458 -19253 16426 9876 -21128 13753 21258 -25576 -1662 32300 -13418
1050 -13418 -15553 26217 -3354 -17465 24266 1892 -28064 19912 20524 -32261 -563 30387
1062 30387 -18391 -11919 25256 -13586 -16207 29607 -5670 -32662 23446 16865 -34624 2791
1074 2791 23687 -23968 -3971 24224 -25129 -13815 35347 -12614 -35009 26394 11703 -34322
1086 -34322 7911 16940 -28713 4617 24663 -32557 -11048 38383 -15655 -31352 27279 5009
$$ packed form
1002b0873K0157J6139k9931N746K3918k4972j314K8645k2650j4111L5350p650
1014H454l0401K6036J2276l1609J3338J9214l1449P483L1492l2508j1276M1219
1026B2269j4154k9376L1542M792l2162K2938J4400l9516J5568L4290m0241q898
1038a8548M3540j9534k4711L5679o550l1004L4881P505m6834K3914L3962m5718
1050a3418k135M1770k9571j4111M1731k2374k9956M7976O12n2785L1698L0950
1062C0387m8778O472L7175l8842k621M5814l5277k6992N6108o581n1489L7415
1074B791K0896m7655J9997K8195m9353J1314M9162m7961k2395O1403j4691m6025
1086c4322M2233R029m5653L3330K0046n7220K1509M9431n4038j5697N8631k2270
$$ plain form
1098 5009 -28938 17063 8896 -32841 15436 26727 -37538 -6505 40357 -17513 -23684 30170
1110 30170 -3258 -23627 28413 4208 -36719 22855 28671 -37687 -2086 37196 -18712 -11808
1122 -11808 30865 -13648 -17023 37952 -1830 -37108 29031 25375 -35708 5300 30207 -23927
1134 -23927 167 32836 -25014 -15102 44270 -5550 -37526 28965 19133 -31988 11184 20106
1146 20106 -29343 8923 31775 -33079 -12767 43431 -10887 -32592 27620 7338 -28682 19254
1158 19254 10792 -36176 14538 30271 -38226 -11364 38950 -15552 -25501 26276 -4647 -25705
1170 -25705 25778 3217 -39975 18391 26333 -38528 -6221 31169 -20974 -13984 26415 -17042
1182 -17042 -21886 33507 -2642 -40134 22392 21735 -35700 1772 24799 -25422 -2676 28880
$$ packed form
1098E009l3947M6001q167m1737M8277J1291o4265L1033M6862n7870o171N3854
1110C0170l3428k0369N2040k4205m0927N9574N816o6358L5601L9282n5908O904
1122a1808M2673m4513l375N4975l9782l5278O6139l656o1083M1008K4907n4134
1134b3927K4094L2669n7850R912N9372m9820l1976O6491r832n1121M3172Q922
1146B0106m9449L8266K2852o4854K0312N6198n4318k1705O0212k0282l6020M7936
1158A9254q462m6968N0714J5733o8497K6862N0314n4502r949N1777l0923k1058
1170b5705N1483k2561m3192N8366P942o4861L2307L7390n2143O990M0399m3457
1182a7042m844N5393l6149l7492O2526o57n7435L7472K3027n0221K2746L1556
$$ plain form
1194 28880 -23556 -17820 37033 -3937 -34406 23316 15655 -28774 10936 17247 -27614 7285
1206 7285 29865 -26730 -12984 36939 -5184 -25779 23750 7555 -22743 18567 12349 -29152
1218 -29152 12729 28937 -26156 -8280 32225 -7677 -16688 23292 -1238 -18535 24218 7045
1230 7045 -29888 15531 24653 -25847 -3589 25619 -12983 -9269 23175 -9620 -17097 26594 2354
1243 2354 -29337 15376 17864 -24566 981 18243 -17856 -3837 21445 -15637 -16227 24694 -1241
1256 -1241 -26036 13742 9545 -22286 5814 11602 -21773 775 19213 -18498 -13300 20981 -4611
1269 -4611 -19823 13422 2643 -19102 10425 7213 -22024 4194 16638 -17520 -8259 17690
1281 17690 -6694 -12551 14084 -1945 -15457 13926 5332 -19569 7133 14543 -15002 -2795
$$ packed form
1194B8880n2436N736N4853m0970l0469N7722p661m4429L9710O311m4861L4899
1206G285K2580n6595J3746M9923m2123k0595M9529j6195l0298M1310o218m1501
1218b9152M1881J6208n5093J7876M0505l9902r011L9980k4530j7297M2753j7173
1230G045l6933M5419R122n0500K2258K9208l8602L714L2444l2795p477M3691k4240
1243B354l1691M4713K488m2430K5547J7262l6099J4019K5282l7082n90M0921k5935
1256a241k4795L9778m197l1831K8100N788l3375K2548J8438l7711N198L4281k5592
1269d611j5212L3245j0779k1745K9527l212k9237K6218J2444l4158R261K5949
1281A7690k4384n857K6635j6029j3512K9383q594k4901K6702P410k9545J2207
$$ plain form
1293 -2795 14899 -7326 -5819 15000 -4111 -11612 15921 4070 -15897 9118 11572 -11575 2079
1306 2079 12260 -7865 -1190 14199 -4956 -7745 14921 2507 -11055 9324 7102 -9196 5271
1319 5271 8726 -8610 1477 11721 -6120 -5314 12084 -152 -8497 8678 2798 -8555 5626
1332 5626 5065 -9244 1497 8145 -6691 -4203 8109 -2511 -6874 6310 -779 -8161 5011
1345 5011 2159 -8869 975 4906 -6967 -3453 5126 -4004 -5405 4467 -2209 -7301 3865 340
1359 340 -7742 979 2197 -5670 -1650 2672 -4050 -3449 3465 -2674 -5169 3542 -321 -5037 1920
1374 1920 1122 -3761 692 2259 -3021 -1165 3768 -1504 -2500 3472 384 -2535 2987 1534 -2205
1389 -2205 2131 2738 -1240 731 3847 -93 -661 3859 1117 -817 3173 1722 -827 2674 2733 -114
$$ packed form
1293b795J7694k2225J507K0819j9111p501K7533j1851j9967K5015K454k3147J3654
1306B079J0181k0125O675J5389j9155k789K2666j2414j3562K0379k222j6298J4467
1319E271L455j7336J0087J0244j7841Q06J7398j2236q345J7175n880j1353J4181
1332E626n61j4309J0741O648j4836K488J2312j0620m363J3184p089p382J3172
1345E011k852j1028R844L931j1873L514Q579r130j401R872o676n092J1166l525
1359C40q082Q721J218p867M020M322o722O01O914o139k495Q711l863m716O957
1374A920p98m883M453J567n280J856M933n272r96N972l088k919N522j453l739
1389b205M336O07l978J971L116l940n68M520k742j934L990j451k549L501N9k847
$$ plain form
1405 -114 1159 2915 948 133 2836 1312 -200 2684 1068 -370 1866 1088 -280 593 1125 59
1421 59 -365 1091 3 -679 1322 -391 -1203 858 -452 -1525 62 -162 -1515 -681 249 -1280 -1577
1438 -1577 250 -1451 -2293 122 -1281 -2314 -632 -946 -2407 -1341 -324 -2037 -1945 -148 -1934 -2464
1454 -2464 221 -1426 -2384 -21 -898 -2103 -448 -102 -1712 -983 655 -1430 -1401 1353 -975 -1407 1774
1471 1774 -39 -989 1548 365 -947 1467 1836 -1081 632 3002 -755 -270 3738 -248 -553 3962
1487 3962 898 -1243 2848 2669 -1223 1556 4276 -1184 349 4545 -808 -434 5074 -108 -1884
1502 -1884 4137 2063 -2621 2407 3639 -2880 719 4594 -2773 -1056 5436 -2093 -3285 4116 260
1517 260 -4433 2486 2062 -4926 1002 3734 -5603 -1615 5407 -4155 -4234 4456 -2042 -5413 3221 128
$$ packed form
1405a14J273J756j967q15K703j524j512K884j616j438K236p78j368Q73N32j066
1421E9m24J456j088o82K001j713q12K061j310j073J587k24j353Q34R30j529k97
1438a577J827j701q42K415j403j033J682l14j461J066J017j713R2J797j786n30
1454b464K685j647r58K363q77j205J655L46j610P29J638k085K9K754k328m32L181
1471A774j813r50K537j183j312K414L69k917J713K370l757M85M008l986l05M515
1487C962l064k141M091j79l892K779K720n460J533M196n353L74N508n182j776
1502a884O021k074m684N028J232o519L599L875p367J717O492p529j192P401l856
1517B60m693O919m24o988N928K732r337L988P022r562p9Q690o498l371Q634l093
$$ plain form
1533 128 -7275 2293 3385 -8332 -1218 5754 -6167 -4316 5559 -3973 -5854 5585 -1448 -8027
1547 -8027 3712 3246 -9160 461 6221 -7190 -2125 6957 -6082 -4309 8508 -2367 -8193 7081
1561 7081 3377 -9096 3553 5903 -8083 1303 9340 -7490 -2551 11348 -3262 -6927 9517
1574 9517 2233 -8015 6674 5534 -8903 4324 9878 -9288 -698 12867 -4571 -5738 11102
1587 11102 351 -7498 9475 3688 -10565 7043 9584 -11277 462 12622 -6955 -4395 11674
1600 11674 -3628 -7567 11478 568 -13129 8342 8129 -13474 1282 10713 -9983 -2471 11378
1613 11378 -8140 -7211 13244 -2834 -13662 9290 5068 -14386 3187 8155 -13283 383 11465
1626 11465 -12525 -6521 14521 -5386 -13515 10608 2124 -13998 6836 5411 -15353 3655 11107
$$ packed form
1533A28p403R568J092j1717P114O972j1921J851R875r532j881J1439p033o579
1547h027J1739m66j2406R621N760j3411N065R082j3039J773J2817j0875n826J5274
1561G081l704j2473J2649K350j3986R386Q037j6830M939J3899j4610l665J6444
1574I517p284j0248J4689j140j4437J3227N554j9166Q590J3565j7438j167J6840
1587A1102j0751p849J6973n787j4253J7608K541k0861J1739J2160j9577K560J6069
1600A1674j5302l939J9045j0910j3697K1471k13k1603J4756R431k0696P512J3849
1613A1378j9518R29K0455j6078j0828K2952m222j9454J7573M968k1438J3666J1082
1626A1465k3990O004K1042j9907q129K4123q484j6122K0834j425k0764J9008P452
$$ plain form
1639 11107 -14751 -4557 15060 -7151 -10607 12260 -1211 -12343 10828 3458 -15967 7026
1651 7026 11420 -15270 -1394 14803 -8359 -6585 13670 -4220 -10170 14776 1755 -15569 10033
1664 10033 10912 -14478 2339 13475 -10174 -1832 15090 -7814 -7983 17314 -189 -14800 12378
1677 12378 8352 -14167 5980 10768 -13050 1962 15322 -11102 -6758 17891 -2726 -13167
1689 -13167 12598 4165 -13810 8822 7686 -15068 4481 13986 -13944 -5218 16276 -5976 -10940
1702 -10940 12658 -554 -13217 10889 4269 -17257 5900 12195 -15437 -3489 13816 -8952
1714 -8952 -8424 12380 -4988 -12427 12518 1572 -17515 7454 9416 -15252 -370 11378 -11297
1727 -11297 -4367 12979 -8194 -10690 14329 -672 -15918 8850 6370 -14371 3528 9295 -12789
$$ packed form
1639A1107k5858J0194J9617k2211l456K2867j3471j1132K3171p370j9425K2993
1651G026M394k6690J3876J6197k3162J774K0255j7890n950K4946j3021j7324K5602
1664A0033Q79k5390J6817J1136k3649Q342J6922k2904j69K5297j7503j4611K7178
1677A2378m026k2519K0147M788k3818J5012J3360k6424M344K4649k0617j0441
1689a3167K5765q433j7975K2632j136k2754J9549R505k7930Q726K1494k2252m964
1702a0940K3598j3212j2663K4106o620k1526K3157O295k7632J1948J7305k2768
1714h952N28K0804j7368p439K4945j0946j9087K4969J962k4668J4882J1748k2675
1727a1297O930J7346k1173k496K5019j5001j5246K4768k480k0741J7899N767k2084
$$ plain form
1740 -12789 -548 13320 -9819 -7782 14845 -1868 -12534 10795 3826 -12225 8073 7415 -13363
1753 -13363 3351 13124 -10514 -4514 14219 -3252 -8659 12315 756 -10528 10630 5907 -12767
1766 -12767 5602 11662 -10115 -1779 12693 -4691 -5601 11771 -1732 -9037 11332 3004 -12293
1779 -12293 6368 8713 -10129 632 9676 -7062 -3206 11195 -4790 -8370 10913 940 -11160
1792 -11160 6514 5291 -10440 2316 7023 -9382 -1443 9350 -6896 -7235 9648 -1290 -9958
1805 -9958 6493 2008 -10003 3998 4443 -10285 50 8121 -7775 -5257 8317 -3146 -7622
1818 -7622 6595 -408 -8816 5408 2916 -9501 1874 6626 -7186 -2855 7448 -3716 -4874
1831 -4874 6788 -1446 -6640 6461 2106 -8068 3336 5425 -5979 -224 6376 -3610 -2139 7206
$$ packed form
1740a2789J2241J3868k3139K037K2627j6713j0666K3329o969j6051K0298o58k0778
1753a3363J6714R773k3638O000J8733j7471n407K0974j1559j1284K1158m723j8674
1766a2767J8369O060k1777Q336J4472j7384r10J7372j3503p305K0369q328j5297
1779a2293J8661K345j8842J0761R044j6738L856J4401j5985l580J9283r973j2100
1792a1160J7674j223j5731J2756M707j6405P939J0793j6246l39J6883j0938q668
1805i958J6451m485j2011J4001M45j4728J0335Q071j5896K518J3574j1463m476
1818g622J4217p003q408J4224k492j2417J1375M752j3812M331J0303j1164j158
1831d874J1662q234n194J3101m355j0174J1404K089j1404N755O600r986J471R345
$$ plain form
1845 7206 -1788 -4591 7114 1845 -5718 4157 4147 -4905 1770 5605 -3739 -334 6737 -2054 -3265
1860 -3265 6454 988 -4297 4398 2667 -4030 3076 3640 -3794 376 5465 -2424 -2389 5104 -242 -3414
1876 -3414 3960 658 -3732 2627 2409 -4165 284 3515 -3173 -1817 3628 -1817 -3060 2987 -756
1891 -756 -3419 1875 685 -4053 329 1694 -2919 -1142 2175 -2349 -2591 2262 -1723 -3289 1614
1906 1614 -88 -3206 225 1048 -2679 -1013 1381 -2246 -1501 1873 -1046 -2210 1671 -5 -2423
1921 -2423 1046 702 -1703 130 1507 -1489 -579 1888 -375 -1023 1901 348 -854 1307 822 -967
1937 -967 898 1482 -346 168 2132 146 156 2124 667 37 1715 936 -273 1265 1302 -89 431
1954 431 1781 200 237 1878 409 -293 1615 460 -496 1073 691 -344 341 1121 -494 -379 703
$$ packed form
1845G206q994k803J1705n269p563R875j0r052O675L835r344L405P071q791j211
1860c265R719n466n285Q695j731o697P106N64p434M170N089p889L5P493n346l172
1876c414P374l302m390O359k18o574M449L231o688J356N445n445j243O047l743
1891g56k663N294j190m738M382J365m613J777L317m524k42M853l985j566M903
1906A614j702l118L431Q23l727J666K394l627P45L374k919j164L881j676k418
1921b423L469l44k405J833J377k996R10K467k263o48K924j553j202K161m85j789
1937i67J865N84j828N14J964j986J0J968j457o30J678p79j209J538L7j391N20
1954D31J350j581L7J641j469p02J908j155r56J569l82j035O85P80j615J15J082
$$ plain form
1971 703 -274 -569 943 -287 -974 -21 -26 -739 -87 199 -1188 -712 154 -1095 -1159 79 -1028 -1359 100
1990 100 -497 -1172 -626 -379 -1311 -777 -252 -1199 -916 246 -1275 -1188 283 -951 -1044 115 -545 -1347 132
2009 132 554 -1362 -336 787 -750 -610 919 -566 -767 991 -3 -747 761 700 -743 596 1191
2026 1191 -698 74 1891 -305 46 1872 267 -169 1649 694 -565 1300 1469 -667 578 2054
2042 2054 -464 461 2300 -497 -122 2341 304 -811 1611 1214 -1347 1035 1724 -1621 372 1931
2058 1931 -1400 -580 2068 -849 -1500 1786 132 -2228 1058 945 -2561 343 1726 -2705 -851 1872
2074 1872 -2112 -2165 1673 -848 -2663 1515 266 -3837 761 1477 -3635 -100 2234 -2780 -1471 2249
2090 2249 -1808 -2794 2375 -327 -3992 1709 1592 -3933 225 2300 -3438 -573 3360 -2419 -2124 3528
$$ packed form
1971G03r77k95J512j230o87R53np13O52K86j387M76Q66j249o4J238j107l31J459
1990A00n97o75N46K47r32N34N25r47K83J162j521Q7J471j234r3J159o60q02J479
2009A32M22j916J026J123j537J40J529j485k01J758r94p44J508o1j443J339N95
2026A191j889P72J817k196L51J826j605m36J818r55j259J865J69k136J245J476
2042B054k518R25J839k797L75K463k037j115K422l97k561K382O89l345J993J559
2058A931l331Q20K648k917o51L286j654k360L286j13l506K904J383m431J854K723
2074A872l984n3L838k521j815M178j249m103M598P16n112L535K334n014J309L720
2090B249m057r86N169k702l665N701j17n525M158K075n738K865L933n779K95N652
$$ plain form
2106 3528 -674 -3338 2783 1487 -3641 1825 2872 -3556 776 3936 -2775 -1017 4644 -872 -2873
2121 -2873 3858 950 -3346 3431 2734 -3843 2077 4407 -3578 -379 5100 -1873 -1859 4935 -165 -3003
2137 -3003 4016 1617 -4559 2965 4180 -4422 379 5091 -3185 -1619 4940 -1554 -3602 4724 709
2152 709 -5672 3246 2938 -5307 961 4073 -4386 -689 4883 -3499 -3787 5404 -874 -5619 3565 1594
2168 1594 -5944 1749 2882 -6018 108 4408 -4833 -3242 5332 -2089 -5248 4322 428 -5976 3187
2183 3187 2313 -6630 1170 4752 -5637 -1894 5744 -2811 -4276 5128 -959 -5393 4625 1626 -6872
2198 -6872 3103 4664 -5506 -295 5468 -3732 -2130 6112 -1983 -4443 6165 1141 -6394 3929
2212 3929 4248 -5582 1534 5385 -4253 -561 6465 -2637 -3857 6874 344 -5574 5017 2842 -5643
$$ packed form
2106C528m202k664O121j296n128N466J047o428M332L160o711J758N661n516k001
2121b873O731k908m296O777o97o577N920K330p985L199N479o973J4O794n100k838
2137c003P019k399o176P524J215q602M801M712q276J566O559o494k048Q326m015
2152G09o381Q918l08q245O268L112q459L697N572q382k88R191o278m745R184j971
2168A594p538P693J133q900O126M300r241J591Q574p421l159R570l894o404R163
2183C187q74q943P800L582j0389L743P638q555j465R404o087m434J0018k999q498
2198f872R975J561j0170N211N763r200J602Q242q095k460J0608n024p535J0323
2212C929L19r830P116L851r638L692P026r102j220J0731o530n918J0591k175q485
$$ plain form
2227 -5643 3206 4715 -5258 448 6775 -3902 -2947 6979 -818 -4813 5258 1335 -5865 3891 3400
2242 3400 -6604 1274 5492 -5212 -2120 6116 -2589 -4142 5167 -994 -5903 4556 1784 -6972
2256 -6972 2099 4521 -5794 -992 5273 -3846 -3192 5372 -2120 -5262 5077 744 -6876 2557 3338
2271 3338 -6167 -59 4485 -4868 -2183 5751 -3073 -4935 5317 -152 -6088 3558 2233 -5681 1771
2286 1771 3935 -4924 -620 5516 -3564 -3498 6032 -785 -4708 4637 1166 -4976 3368 3365 -5132 712
2302 712 5632 -3394 -1690 5708 -1393 -3156 5287 516 -4345 4455 2796 -4700 2179 4702 -3679
2317 -3679 -261 5055 -2145 -2232 5080 -541 -3774 4761 1647 -4517 2182 3000 -3877 553 4075 -3024
2333 -3024 -1373 4741 -1437 -3775 4323 372 -4368 2524 1603 -4202 780 3238 -3849 -1204 3975
$$ packed form
2227e643Q849J509r973N706O327j0677R55R926p797l995J0071l923p200R756m91
2242C400j0004P878M218j0704L092Q236q705j553R309o161m909J0459k772q756
2256f972R071K422j0315M802O265r119O54Q564p492l142J0339m333p620R433P81
2271C338r505O108M544r353K685P934q824j862J0252n469n936R646j325p914P452
2286A771K164q859M304O136r080O6R530o817l923R345l471o142Q344lq497N844
2302G12M920r026J704P398p101j763Q443m771m861Q800j659p496O879K523q381
2317c679L418N316p200q7P312n621l233Q535l114o164O699Q18o877M430L522p099
2333c024J651O114o178k338Q098l951m740O892r21n805M982K458p087K645N179
$$ plain form
2348 3975 -2335 -2960 3556 -850 -3944 2270 563 -3916 1189 2002 -3938 -622 3267 -2858 -2148 3223
2364 3223 -1385 -2851 2755 -364 -3840 1973 1440 -3683 376 2649 -2703 -1038 3244 -1693 -2242
2379 -2242 3285 -570 -3205 2544 939 -3104 990 2253 -1950 -47 3005 -1599 -929 3334 -682
2394 -682 -1717 2684 743 -1999 1761 1983 -1690 607 2571 -1389 -388 3174 -544 -1218 2559 548
2410 548 -1606 1906 1220 -1610 1025 1896 -1700 -53 1992 -924 -954 2045 -210 -1345 1434 444
2426 444 -1712 780 1110 -1593 -80 1519 -1442 -991 1283 -866 -1522 1063 32 -1725 396 301
2442 301 -1645 -115 896 -1630 -649 980 -1108 -1155 849 -769 -1658 367 47 -1431 -144 321 -1474
2459 -1474 -505 581 -910 -814 969 -556 -1199 549 114 -920 55 539 -914 -63 1111 -524 -317
$$ packed form
2348C975o310o25O516m406l094O214j707m479N105Q13n940L316L889o125P10N371
2364C223m608j466N606l119l476N813n33n123M059K273n352J665M282m937n49
2379b242N527l855k635N749j605m043M094J263m203J903L052m604O70M263m016
2394f82j035M401j941k742L760K22l673K297J964l960J001L562l718o74L777k011
2410E48k154L512o86k830K635Q71l596J647K045k916l0K999k255j135K779r90
2426D44k156K492L30k703J513J599k961M51K274k149o56K585j031j757K121r5
2442C01j946J530J011k526R81J629k088m7K004j618q89K025l20j478J287M65j795
2459a474R69J086j491R6J783j525o43J748m35j034R75M84j453Q51J174j635K07
$$ plain form
2476 -317 1302 -187 -416 741 128 -719 380 669 -176 291 994 -281 -44 1075 18 -321 1123
2493 1123 424 50 821 296 -256 409 944 -276 160 1140 -43 -83 1294 154 131 797 205 -377 331
2512 331 747 -335 -31 870 -154 23 633 -246 -262 308 7 -358 -130 -186 -552 -29 218 -646 -250 529
2532 529 -768 -560 20 -280 -414 -173 -303 -673 -393 -88 -784 -271 49 -848 -661 318 -961 -704 257
2551 257 -433 -818 14 -236 -708 -243 73 -984 -339 472 -447 -240 485 -244 -433 499 245 -466 281 346
2571 346 -317 365 832 -330 158 999 -261 -3 895 237 -333 891 687 -481 453 1033 -530 346
2589 346 1043 -409 393 1070 -93 -51 867 477 -582 1056 553 -823 429 902 -934 281 941 -757
2607 -757 -117 965 -205 -652 775 142 -1040 427 602 -1329 147 826 -1297 -809 739 -687 -924
$$ packed form
2476c17J619j489k29J157o13q47J099K89q45M67P03j275K37J119j057l39J444
2493A123o99l74P71n25n52O65N35j220M36R80j183m0J377j140k3O66n92n82P08
2512C31M16j082L04R01j024J77O10q79j6N70l01l65K28n6l66N23K47q64L96P79
2532E29j297K08N80l00j34K41j30l70K80L05o96N13L20q97J87R79j279K57R61
2551B57o90l85Q32k50m72M65L16j057O45Q11r19K07P25p29j89R32k54p11P47O5
2571C46o63O82M67j162M88Q41j260K58Q98o58n70J224k04j168R34N80j563Q76
2589C46O97j452Q02O77j163M2R18l90j059J638n03j376J252M73j836J215O60j698
2607g57O40J082j170m47J427o33j182J467J75j931J476O79k123M88J548j426k37
$$ plain form
2624 -924 758 -385 -1476 876 45 -1979 152 825 -1759 -397 980 -1057 -719 873 -809 -1417
2640 -1417 885 -36 -1685 827 646 -1747 -17 1180 -1402 -609 1207 -947 -1099 1343 -45 -1798
2656 -1798 1119 825 -1731 894 1286 -1807 -93 1893 -984 -443 2034 -114 -1501 1613 932 -1574
2672 -1574 1845 1348 -1642 638 2037 -1121 81 2456 -523 -1042 2443 201 -1389 1856 1014 -1901
2688 -1901 1014 1575 -1701 -45 2477 -1136 -852 2297 -317 -1892 2201 398 -2484 1541 1230 -2263
2704 -2263 103 1770 -2111 -907 2253 -1226 -2141 2024 -206 -2592 1654 900 -2746 432 1882
2719 1882 -2406 -557 2059 -1900 -1849 2349 -652 -2469 1746 73 -2757 1590 1315 -2950 132 1789
2735 1789 -2182 -1057 2544 -1322 -2150 2553 -3 -2910 1812 648 -2831 898 1968 -2236 -192
$$ packed form
2624i24J682j143j091K352q31k024K131O73k584J362J377k037L38J592j682o08
2640a417K302r21j649K512j81k393J730J197k582P93J816k154j52K442j388j753
2656a798K917k94k556K625L92l093J714J986k877N41K477k148j387L114o81k506
2672a574L419m97k990K280J399l158J202K375k979n19L485k242j590L245q42k915
2688a901K915N61l276J656K522l613K84L149k614j575M093j803k882M025l11l493
2704b263K366J667l881J204L160l479r15M165k230k386M246p54l646L178J450
2719A882m288J849K616l959N1M198l001j817M215j673k830M347k75m265L082J657
2735A789l971J125L601l866q28M703k556k907M722j164l479L729J070m204K044
$$ plain form
2750 -192 2357 -1444 -1373 2825 -547 -2300 2739 940 -2515 1568 2266 -2589 579 2598 -1811 -840
2766 -840 3226 -886 -1748 2883 498 -2360 2185 1660 -2339 1016 2423 -1847 -284 3054 -1009 -1457
2782 -1457 3113 -331 -2155 2589 724 -2554 1784 2152 -2694 135 2647 -2163 -1280 2637 -815
2797 -815 -2205 2536 157 -2773 1882 1209 -2975 589 2109 -2665 -690 2220 -1610 -1752 2607 -682
2813 -682 -2560 1938 312 -3140 542 1444 -2701 -140 2037 -1957 -1457 2372 -1221 -2425 2269 48
2829 48 -2793 1609 996 -2841 671 1948 -2036 -703 2582 -1348 -1467 2528 233 -2085 1886 801
2845 801 -2481 1344 1899 -2131 103 2474 -1402 -1168 2566 -394 -1583 2253 405 -1878 1835 1616
2861 1616 -2001 532 2251 -1617 -188 2495 -1197 -999 2469 -101 -1905 1938 1040 -1973 647
$$ packed form
2750a92K549l801P1M198l372j753N039j799l455M083O98m855L168K019m409R71
2766h40M066m112q62M631k385k858M545n25l999L355J407m270J563L338m063m48
2782a457M570l444j824M744j865l278M338L68m846K829K512m810Q83L917l452
2797h15j390M741k379k930M655o73m184L564J520m774J975K910l830j42M359l289
2813f82j878M498j626l452L682R02m145K561K177l994N00L829l593j204M694k221
2829D8k841M402o13l837L512J277l984J333L285l930j19L995k295k318L971j085
2845H01l282L825N55m030K234K371l876K34L734k960j189L836j848k283L713k19
2861A616l617K533J719l868J429K683l692J98L468k570j804L843q98l013K620
$$ plain form
2876 647 1689 -1600 120 1870 -1593 -974 1902 -669 -1778 1660 479 -1993 986 948 -1826 204
2892 204 1334 -1853 -956 1728 -928 -1490 1444 -148 -2084 831 544 -2006 7 899 -1793 -728
2908 -728 1552 -1163 -1067 1412 -240 -1817 894 114 -1638 348 797 -1559 -316 1338 -1142 -564
2924 -564 1421 -521 -970 1219 -82 -1110 990 638 -1289 232 1303 -977 -236 1438 -635 -574
2940 -574 1424 -195 -808 1444 571 -603 759 1012 -879 201 1684 -523 -122 1279 117 -254
2956 -254 1172 411 -656 758 845 -914 303 1043 -539 -225 1298 -247 -456 1018 637 -644 519
2973 519 479 -766 290 778 -495 -327 927 -431 -465 503 -279 -865 298 76 -785 -65 118 -927
2991 -927 -435 489 -970 -489 393 -590 -623 223 52 -987 45 -129 -734 -303 269 -588 -428 340 -492
$$ packed form
2876F47J042l289J720J750l463O19K876k571j109L438j181k472K979l8k774K030
2892B04J130l187Q97K684k656n62K934j592j936K915k87k550K013Q92k692J065
2908g28K280k715R6K479j652j577K711p80j752J986M49k356J243J654k480N78
2924e64J985j942m49K189j301j028K100l52j927J521J071k280P41J674k073O1
2940e74J998j619o13K252q73j174J362K53j891J080J483k207M01J401j162l71
2956b54J426p61j067J414Q7j759J217P40j582L14J523j545k09J474l81j281J163
2973E19m0j245J056M88j273J68J254j358l4R68p82n86J163k22q61P20J83j045
2991i27M92R24j459M81Q82r83l3Q46j71j039J032j74o05M31N72q57J60P68q32
$$ plain form
3010 -492 -434 505 -200 -637 231 257 -564 -27 100 -694 -120 495 -268 -178 651 -145 -266 334 292 -256 17
3031 17 795 -269 58 516 -56 53 776 55 66 627 199 -111 319 670 73 -106 586 148 -71 647
3051 647 19 -69 653 257 23 424 300 -359 310 621 -251 100 419 -13 -171 442 43 -326 186 244 -149
3072 -149 58 -68 -510 -151 193 -96 -74 181 -342 -368 1 -14 -576 -163 2 -502 -180 157 -337 -121 293
3093 293 -374 -374 -195 -176 -117 -106 -236 -661 -130 498 -668 -154 275 -396 -270 213 -318 -201 233 385 -292
3114 -292 391 155 -198 131 317 -412 -85 678 -189 32 543 341 45 396 124 -172 311 494 -303 273
3134 273 607 108 296 768 -48 77 521 38 -68 312 440 -367 334 397 -332 -90 572 -229 31 746
3154 746 -124 -310 400 148 -595 443 416 -632 -143 517 -521 -32 457 -518 -469 654 -211 -1085 183
$$ packed form
3010d92N8R39p05m37Q68K6q21N37J27p94N74O15p63R0Q29p96j21O00m2n48K73
3031A7P78j064L27M58n72J09P23p21J1N61m28l10M30L51n97j79O92m38k19P18
3051F47o28q8P22l96k34M01j24o59O69L11q72L51L19m32j58O13l99l69N12N8l93
3072a49K07j26m42L59L44k89K2K55n23k6L69j5n62M13J65n04L22L37m94K16M14
3093B93o67%J79J9N9J1j30m25N31O28j166N14M29o71J26M83n31J17M34J52o77
3114b92O83k36l53L29J86p29L27P63q67K21N11k02k96L51k72k96M83J83p97N76
3134B73L34m99J88M72q16J25M44m83j06L80J28q07P01O3p29K42O62q01K60P15
3154G46q70j86P10k52p43J038k7j048M89O60j038M89M89r75M9J123q65q74J268
$$ plain form
3173 183 -63 -1010 99 199 -1120 -114 155 -975 -401 148 -376 -580 437 68 -884 148 373 -880
3191 -880 -30 218 -667 -118 742 -608 -587 787 -362 -927 752 491 -906 331 459 -828 -32 832
3209 832 -673 -118 954 -336 -576 794 507 -726 781 599 -766 449 919 -669 -84 1218 -298
3226 -298 -286 1034 269 -696 1014 641 -715 878 921 -965 333 1072 -651 -342 1254 -275 -741 1078
3244 1078 265 -1003 913 935 -1015 49 743 -937 -402 1123 -600 -729 1016 -100 -1211 742
3260 742 191 -1086 521 740 -1295 -304 978 -1101 -631 1138 -458 -1287 779 164 -1314 520 160
3277 160 -1443 -206 932 -1351 -473 1280 -624 -812 795 83 -1345 978 423 -1530 529 1018
3293 1018 -893 -148 1395 -769 -590 1138 -68 -1054 1096 330 -1228 768 782 -1093 283 1331
$$ packed form
3173A83k46r47J109J00j319J006K69j130N74N49n24k04J017l69r52J032K25j253
3191h80Q50K48q85N49Q60j350K1J374j149n65J679k61j397J237J28j287P96Q64
3209H32j505N55J072j290k40J370k87j233J507j82j365J215M70j588N85J302j516
3226b98J2J320p65r65J710l73j356J593M3j886J298P39j723L09J596j529m66J819
3244A078q13j268J916K2j950J064O94j680N35J525j723j29J745j116j111J953
3260G42n51j277J607K19k035R91J282k079M70J769j596q29K066o15j478J834l60
3277A60j603J237J138k283Q78J753j904j88J607p12j428K323n55j953K059M89
3293A018j911P45J543k164J79J728j206r86K150p66j558J996J4j875J376J048
$$ plain form
3309 1331 -873 -236 1413 -342 -928 1429 340 -1234 1121 997 -1195 766 819 -995 237 1387
3325 1387 -575 -678 1688 333 -989 1273 368 -1207 1228 798 -1084 314 1339 -790 -497 1573
3341 1573 -272 -1153 1040 89 -1403 734 519 -1376 453 1110 -1024 -745 1136 -779 -966 947
3357 947 -295 -1573 780 192 -1517 301 701 -1527 -307 980 -1341 -545 776 -457 -1134 945
3373 945 62 -1355 619 733 -1239 220 923 -1179 -573 1221 -574 -1044 997 -196 -1192 801 570
3390 570 -1217 435 1009 -1137 -106 1163 -708 -508 985 -224 -818 1170 357 -1151 994 682
3406 682 -1031 199 765 -746 -333 1368 -222 -660 1443 249 -825 983 520 -819 502 845
3422 845 -842 256 1484 -500 -462 1238 -180 -655 1181 159 -888 684 720 -939 -249 927 -692
$$ packed form
3309A331k204O37J649j755n86K357j089j574K355j24k192J961N3j814J232J150
3325A387j962j03K366j355j322K262r05j575K435m30j882J398J025k129K93K070
3341A573j845q81K193r51j492K137k15j895J829O57k134K79J881j915j87J913
3357I47j242j278K353n88j709J818M00k228J220J287k321P96J321j233o77K079
3373I45q83j417J974J14j972J459P03k102O06J794j795m70K041j193r96J993k31
3390E70j787J652N74k146J031J269j871K00J493j209n94J988q13j508K145l12
3406F82j713J230N66j511M13J701j590m38K103j194j074J808m63j339J321L43
3422H45j687J098J228j984L8J700j418m75J836j022j047J572L6j659O90J176j619
$$ plain form
3439 -692 -324 1088 -207 -484 739 -27 -1203 472 329 -1014 80 460 -709 -629 722 -656 -794
3456 -794 321 -196 -796 297 -2 -1039 -78 525 -851 -283 755 -793 -643 512 -550 -943 582
3473 582 -189 -764 261 509 -668 -2 624 -491 -198 631 -195 -315 724 -101 -496 461 416 -702 323
3492 323 468 -361 46 647 -194 -432 804 36 -393 813 265 -352 479 627 -503 402 766 -232 -83
3511 -83 910 161 -140 584 -38 -191 452 316 -501 84 785 -483 52 636 61 -264 522 -85 -404 251
3531 251 111 -415 139 181 -546 -188 277 8 -148 294 -124 -487 207 23 -390 -35 111 -600 -110 156
3551 156 -406 -233 231 -539 -474 166 -199 -358 231 -308 -609 -87 112 -445 -299 60 -119 -245 334 10
3571 10 -28 180 21 -190 124 125 -26 -101 305 -11 -258 351 107 -228 236 203 -233 151 304 -145 353 439
$$ packed form
3439f92L68J412j295k77J223p66j176J675j43j343J094L80j169Q0J351j378j38
3456g94J115n17o00J093k99j037R61O03j376N68J038j548J50J155j062l93J525
3473E82p71n75J025K48j177O66O26j115K93Q29q26j20J039q25l95R57m5j118J025
3492C23J45q29M07O01q41k38J236p68m29J206n48o17Q31J48j130R05L64r98J49
3511h3R93p49l01P24o22j53O43j36q17N85P01j268N35N84n75l25P86o07l19O55
3531B51j40n26N54M2p27L58M65k69j56M42m18l63O94j84m13L55J46p11M90K66
3551A56n62J73M64p70O5O40l65j59N89n39l01N22J99n57J46L59j79j26N79l24
3571A0l8K08j59k11L14Jj51p5M06l16k47O09k44l35M64l3m36L84J53m49M98Q6
$$ plain form
3593 439 -15 -244 528 31 -42 679 200 -209 237 257 -37 130 267 -2 138 544 170 48 342 172 -70
3614 -70 292 152 15 55 136 -67 -3 334 -531 -126 219 -94 -304 90 216 -128 -49 -157 -202 -289 170 -317
3636 -317 -25 72 74 -117 113 -25 -62 -77 -315 -542 -316 -60 -442 3 210 -315 -302 227 -146 131 76 -52
3658 -52 -320 -68 -119 -199 65 91 -331 -65 651 -31 -339 193 108 -66 203 148 82 53 338 -126 -75 641 -268
3681 -268 246 278 37 -61 551 254 51 318 218 -357 194 489 -103 23 619 -120 60 482 87 -98 92
3702 92 104 -190 240 392 -161 -69 558 -358 67 594 -35 110 147 -161 -347 170 108 -355 160 286 -383 -336
3724 -336 327 -603 -366 348 -182 -419 317 27 -497 -50 45 -675 43 232 -778 -301 269 -475 -570 308
3744 308 -126 -605 391 244 -710 153 440 -418 -82 565 -498 -373 393 52 -436 688 527 -264 413
$$ packed form
3593D39m54k29P72m97p3P21m79m09M46K0k94J67J37k69J40M06l74j22K94j70k42
3614g0L62j40j37M0Q1k03O4L37q65M05L45l13k10L94J26l44P9j08m5q7M59m87
3636c17K92R7Kj91K30j38l7j5k38k27K26K56l82M45K07n25J3N29l73K77n5j28
3658e2k68K52n1q0K64K6m22K66P16o82l08N32q5j74K69n5o6k9K85m64N1P16r09
3681b68N14L2k41r8O12k97k03K67j00n75N51K95n92J26N96p39J80M22l95j85J90
3702I2J2k94M30J52n53R2O27r16M25N27o29J45L7l08j86N17o2m63N15J26o69M7
3724c36O63r30K37P14n30k37P36k90n24M47R5p20P18J89j010M77N70p44r5Q78
3744C08m34m79R96j47r54Q63K87q58L36O47j063J25P66l41m88J124j61p91O77
$$ plain form
3763 413 45 -533 29 659 -374 23 557 -56 -179 732 243 -186 458 375 -726 648 578 -150 217 758
3783 758 -352 -336 765 176 -719 1072 496 -776 495 588 -386 106 698 -623 -131 686 -358 -273 892
3802 892 16 -586 695 340 -658 401 282 -660 196 632 -420 -617 440 -296 -758 605 36 -889
3820 -889 5 323 -746 -314 513 -899 -801 674 -360 -698 496 -167 -780 597 348 -970 239 606
3838 606 -747 -295 645 -440 -552 599 -19 -869 732 318 -848 494 622 -750 174 986 -484
3855 -484 -159 816 -341 -410 705 73 -1017 732 414 -765 431 714 -502 -65 828 -427 -350 799
3873 799 -43 -605 1021 298 -910 472 646 -622 43 672 -540 -511 839 -228 -700 930 2 -670
3891 -670 640 446 -831 267 730 -797 -169 811 -308 -416 775 -40 -1139 547 157 -790 426
$$ packed form
3763D13l68n78N62O30j033L97N34o13j23R11m89m29O44q3j101J374p0p28L67N41
3783G58j110J6J101n89q95J791n76j272J271R3r74M92N92j321M92Q17j044Q5J165
3802H92q76o02J281l55r98J059j19r42Q56M36j052j97J057p36m62J363n69r25
3820h89Q94L18j069M32Q27j412R8J475j034l38J194o63o13J377k49j318J209L67
3838F06j353M52R40j085j12J151o18q50J601m14j166J342J28j372R24Q12j470
3855d84L25R75j157o9J115o32j090J749l18j179J196K83j216M37Q93j255P7J149
3873G99q42n62J626p23j208J382J74j268O65O29j212K9J350j067m72J630r28o72
3891f70J310j94j277J098M63j527O28R80j119j08J191q15j099J686l90r47J216
$$ plain form
3908 426 445 -715 -308 784 -480 -338 500 -338 -762 355 -158 -1053 532 245 -1007 -176 639 -892
3926 -892 -396 483 -482 -623 646 80 -882 728 -80 -877 229 687 -588 -169 677 -722 -288 822
3944 822 -296 -432 926 267 -802 353 639 -675 225 804 -366 -3 904 -347 -449 622 184
3961 184 -528 713 460 -379 442 802 -610 95 860 -130 -363 671 206 -308 510 422 -822 365 650
3980 650 -439 -20 690 -349 -185 1052 9 -177 619 306 -414 496 501 -573 75 271 -581 -250 380
3999 380 -176 -476 266 -218 -710 269 -144 -783 -15 91 -638 -319 263 -489 -710 517 -639 -811 443
4018 443 -178 -479 33 320 -604 -5 336 -445 -232 415 -375 -361 485 98 -508 165 350 -559 15 605
4038 605 -470 -152 516 -80 -264 494 -82 -222 606 247 -484 200 184 -375 58 545 -122 277 629 186
$$ packed form
3908D26J9j160M07J092j264J42Q38q38m24J117n13q95J585k87j252Q31Q15j531
3926h92M96Q79r65j41J269n66r62J610q08p97J106M58j275M19Q46j399M34J110
3944H22j118j36J358o59j069J155K86j314R00N79j170L63R07j251j02J071m38
3961A84p12J241k53q39Q21L60j412P05P65r90k33J034m65n14Q18q8j244J187K85
3980F50j089M19P10j039J64J237j043j86P96l13p20R10Nj074O48J96q52L31O30
3999C80n56l00P42m84m92R79m13o39P68J06p29L19N82p52k21J227j156j72J254
4018D43o21l01N12K87r24N99L41p81K13O47p90J4Q46l87o06O73J85r09N74N90
4038F05j075L18O68n96j84P58n76j40Q28l59p31O84j6n59M33M87o67L99L52m43
$$ plain form
4058 186 160 367 52 -56 490 369 -160 81 588 -248 -167 476 -140 33 286 161 -299 123 542 -28 187
4079 187 63 -190 -62 214 -148 -367 423 -222 -405 473 -93 -456 74 -86 -346 -465 142 -104 -106 -2 -324
4100 -324 -155 350 -78 -389 -36 165 -489 -196 116 -253 -235 -93 -257 -127 162 -162 -178 108 3 -195 32
4121 32 105 -324 -329 254 -37 -242 182 8 56 184 176 -37 56 176 -235 303 41 18 -17 329 11 -32 220 249
4145 249 -379 426 268 30 261 278 70 386 517 80 -35 180 71 -97 363 -45 -294 -26 239 48
4165 48 -38 116 -233 -473 161 34 -172 105 -195 -401 303 179 -32 -83 61 -8 1 469 85 -195 239 140
4187 140 -186 122 -120 -365 116 34 -225 -197 -106 -150 -74 23 -54 -607 -79 -22 -499 -58 126 -186 102 332 -258
4210 -258 -253 175 -196 -349 324 18 -145 300 -85 -131 -37 -54 -232 214 358 -177 13 436 56 -167 67 -137
$$ packed form
4058A86k6K07l15j08N46j21n29K41N07q36Q1O43o16J73K53j25m60M22M19n70K15
4079A87j24k53J28K76l62k19P90o45j83Q78n66l63N30j60k60j19O07k46kJ04l22
4100c24J69N05m28l11L53K01o54K93L12l69J8J42j64J30K89l24j6K86j05j98K27
4121C2P3m29nN83k91k05M24j74M8J28qk13R3J20m11N38k62k3l5L46l18m3K52K9
4145B49o28Q05j58k38K31J7k08L16J31m37j15K15j09j68M60m08k49K68K65j91
4165D8q6J54l49k40O34j27k06K77l00k06P04j24k11n1J44o9RM68l84k80M34r9
4187A40l26L08k42k45M81q2k59K8R1m4P6R7p7n53N28N7m77M41J84l12K88K30n90
4210b58NM28l71j53O73l06j63M45l85m6R4j7j78M46J44n35J90M23l80k23K34k04
$$ plain form
4232 -137 -30 218 201 182 46 370 -102 59 686 -51 69 486 66 271 393 142 -169 321 205 -113 372
4253 372 285 -358 -138 472 -39 -314 241 97 -194 42 221 -295 173 341 -299 -214 155 -592 -29 555 -200
4274 -200 -392 144 76 -440 164 155 -482 23 602 -423 136 316 -487 -388 365 -35 -657 86 112 -536 -97
4295 -97 136 -362 51 328 -401 -177 182 -162 -119 463 -292 -312 408 231 -584 481 307 -496 -43 512 -277
4316 -277 178 506 88 -110 805 168 -468 176 639 -224 267 595 -181 -98 646 -296 -219 466 44 -189 745
4337 745 414 -552 86 481 -589 56 517 -247 -246 430 -29 -455 457 333 -439 382 117 -312 -10 457
4357 457 -262 -305 480 -12 -568 388 -6 -757 234 88 -976 -306 195 -778 -190 463 -218 -627 385 -249
4377 -249 -747 492 9 -619 276 326 -681 66 266 -371 -372 366 -338 -403 279 77 -752 467 -6 -644
$$ packed form
4232a37J07K48j7j9j36L24m72J61O27p37J20M17m20K05J22k51l11M90j16l18M85
4253C72q7o43K20O10n11k75N55j44k91K36J79n16M68J68o40Q5L69p47N63N84p55
4274b00j92N36o8n16O04ro37N05N79j025N59J80q03R9P53m00o22P43K6o48M39
4295i7K33m98M13K77p29K24L59l44M3N82p55k0P20j77q15J065j74q03M53N55p89
4316b77M55L28m18j98R15o37o36O44M63q63M91L28p76Q3P44r42P7O85m22k33R34
4337G45l31r66O38L95j070O45M61p64JO76m59m26R12j24p72Q21k65m29L02M67
4357D57p19m3P85m92n56R56l94p51R91j46j064O70N01r73N88O53o81m09J012o34
4377b49m98J239m83o28Q95N0j007P47K00o37jP38p04o5O82k02q29J219m73o38
$$ plain form
4397 -644 182 465 -767 -136 665 -161 -431 663 -55 -628 621 342 -512 283 702 -496 483 404 -329
4416 -329 -72 795 47 -317 662 148 -645 599 237 -681 393 496 -281 97 760 -581 -202 925 -117
4435 -117 -699 755 256 -515 262 368 -536 158 306 -446 -185 852 44 -402 480 386 -565 380 251 -775
4455 -775 400 544 -424 -270 351 -505 -552 714 125 -814 402 -20 -663 62 346 -764 -274 459 -567
4474 -567 -395 313 -214 -571 433 -55 -711 80 121 -966 143 432 -391 -212 417 -398 -701 327 -47
4493 -47 -503 385 462 -441 -39 273 -324 122 523 -119 -225 645 -76 -297 454 101 -387 586 414 -284 15
4514 15 601 -406 56 635 -155 -250 631 167 -444 681 353 -671 90 546 -168 -76 773 167 -571 604
4534 604 -28 -472 249 182 -729 423 369 -576 -63 389 -431 -514 564 -348 -356 467 -213 -478 -241 -20 -376
$$ packed form
4397f44Q26K83j232O31Q01q26k70J094p18n73J249k79q54P95M19j198R79p9p33
4416c29K57Q67p48l64R79n14p93J244l62r18J074J03p77L78O63j341L79J127j042
4435a17n82J454m99p71P77J06r04O94J48p52K61J037q08m46Q82r4r51R45j29j026
4455g75J175J44r68J54O21q56m7J266n89r39J216m22o43P25K84j110M90P33j026
4474e67J72P08n27l57J004m88o56P91M1j087J109K89q23J79O29q15l03J028l74
4493d7m56Q88P7r03M02L12n97M46M01o42j06Q70p21k21P51l53m88R73j72o98K99
4514A5N86j007M62N79p90r5Q81m64o11J125l28j024P61M56p14R2Q49o06p38J175
4534F04o32m44P21o7r11J152n4r45N13M52q20q3J078r12qQ23o80k65K37K21l56
$$ plain form
4555 -376 111 337 -504 -385 310 -414 -768 369 -160 -583 159 -247 -584 -155 -19 -650 -378 128 -280 -149
4575 -149 167 -172 -543 221 -106 -445 -257 202 -110 19 341 -270 -91 455 -269 -340 641 167 -232 245
4595 245 210 -246 294 251 -142 159 415 190 -112 268 -99 -118 407 171 -146 268 441 -69 -14 363 -63
$$ packed form
4555c76M87K26q41J19O95p24l54J137n29m23P42m06l37M29J36o31K72N06m08J31
4575a49L16l39l71P64l27l39J88M59l12J29L22o11J79N46p24p1R81m74l99M77
4595B45l5m56N40m3l93L01K56k25l02L80l67j9N25k36l17M14J73n10N5L77m26
$$ [...]
8191a26
##END NTUPLES=NMR FID
##END=
