##TITLE=1H_Pr NCO-xyl
 CDCl3, 8 sc, 
 28.07.2021
##JCAMPDX= 6.0         $$ Bruker NMR JCAMP-DX V2.0
##DATA TYPE= NMR FID
##DATA CLASS= NTUPLES
##ORIGIN= UXNMR, Bruker Analytische Messtechnik GmbH
##OWNER= root
$$ XWIN-NMR		Version 3.5
$$ Wed Jul 28 12:18:13 2021 Russian Standard Time (UT+4h)  she@DPX200
##.OBSERVE FREQUENCY= 200.131506
##.OBSERVE NUCLEUS= ^1H
##.DELAY= (6, 6)
##.ACQUISITION MODE= SIMULTANEOUS
##.ACQUISITION SCHEME= undefined
##.AVERAGES= 8
##.DIGITISER RES= 18
##SPECTROMETER/DATA SYSTEM= spect
##.PULSE SEQUENCE= zg30
##.SOLVENT NAME= CDCl3
##.SHIFT REFERENCE= (INTERNAL, CDCl3, 0, 15.7039)
##AUDIT TRAIL= $$ (NUMBER, WHEN, WHO, WHERE, WHAT)
$$ ##TITLE= Audit trail, XWIN-NMR		Version 3.5
$$ ##JCAMPDX= 5.01
$$ ##ORIGIN= Bruker BioSpin GmbH
$$ ##OWNER= she
$$ F:/spectra/data/she/nmr/H-F/1/audita.txt
$$ ##AUDIT TRAIL=  $$ (NUMBER, WHEN, WHO, WHERE, WHAT)
(   1,<2021-07-28 12:17:02.26 +0400>,<she>,<DPX200>,
      <created by zg, POWCHK disabled, PULCHK disabled
       configuration hash MD5:
       00 E9 B6 7A A2 85 ED C7 34 08 36 98 17 FE 4E 26
       data hash MD5: 16K
       CA 4B 20 9C BE 69 89 9A A9 31 6A 85 98 3E EC 54>)
$$ ##END=
$$ 
$$ hash MD5
$$ CA 2A 4A 34 98 89 13 28 03 15 A7 72 33 C8 07 DB
##$RELAX= 
##$RELAX= 
##$RELAX= 
##$RELAX= 
##$RELAX= 
##$RELAX= 
$$ Bruker specific parameters
$$ --------------------------
##$DU= <F:/spectra>
##$EXPNO= 1
##$NAME= <H-F>
##$PROCNO= 1
##$TYPE= <nmr>
##$USER= <she>
##$AMP= (0..31)
100 100 100 100 100 100 100 100 100 100 100 100 100 100 100 100 100 100 
100 100 100 100 100 100 100 100 100 100 100 100 100 100 
##$AQSEQ= 0
##$AQ_mod= 1
##$AUNM= <au_zg>
##$AUTOPOS= <>
##$BF1= 200.13
##$BF2= 200.13
##$BF3= 200.13
##$BF4= 200.13
##$BF5= 200.13
##$BF6= 200.13
##$BF7= 200.13
##$BF8= 200.13
##$BYTORDA= 1
##$CFDGTYP= 0
##$CFRGTYP= 5
##$CHEMSTR= <none>
##$CNST= (0..31)
1 1 145 1 1 1 1 1 1 1 1 1 1 1 1 1 1 1 1 1 1 1 1 1 1 1 1 1 1 1 1 1 
##$CPDPRG= <>
##$CPDPRG1= <>
##$CPDPRG2= <>
##$CPDPRG3= <>
##$CPDPRG4= <mlev>
##$CPDPRG5= <mlev>
##$CPDPRG6= <mlev>
##$CPDPRG7= <mlev>
##$CPDPRG8= <mlev>
##$CPDPRGB= <>
##$CPDPRGT= <>
##$D= (0..31)
0 1.2 0 0 0 0 0 0 0 0.06 0 0.03 0 0 0 0 0.0002 0 0 0 0 0 0 0 0 0 0 0 0 
0 0 0 
##$DATE= 1627460221
##$DBL= (0..7)
120 120 120 120 120 120 120 120 
##$DBP= (0..7)
150 150 150 150 150 150 150 150 
##$DBP07= 0
##$DBPNAM0= <>
##$DBPNAM1= <>
##$DBPNAM2= <>
##$DBPNAM3= <>
##$DBPNAM4= <>
##$DBPNAM5= <>
##$DBPNAM6= <>
##$DBPNAM7= <>
##$DBPOAL= (0..7)
0.5 0.5 0.5 0.5 0.5 0.5 0.5 0.5 
##$DBPOFFS= (0..7)
0 0 0 0 0 0 0 0 
##$DE= 6
##$DECBNUC= <off>
##$DECIM= 32
##$DECNUC= <off>
##$DECSTAT= 4
##$DIGMOD= 1
##$DIGTYP= 9
##$DL= (0..7)
0 120 120 120 120 120 120 120 
##$DP= (0..7)
150 150 150 150 150 150 150 150 
##$DP07= 0
##$DPNAME0= <>
##$DPNAME1= <>
##$DPNAME2= <>
##$DPNAME3= <>
##$DPNAME4= <>
##$DPNAME5= <>
##$DPNAME6= <>
##$DPNAME7= <>
##$DPOAL= (0..7)
0.5 0.5 0.5 0.5 0.5 0.5 0.5 0.5 
##$DPOFFS= (0..7)
0 0 0 0 0 0 0 0 
##$DQDMODE= 0
##$DR= 18
##$DS= 0
##$DSLIST= <SSSSSSSSSSSSSSS>
$$ [...]
##$SUBNAM2= <"">
##$SUBNAM3= <"">
##$SUBNAM4= <"">
##$SUBNAM5= <"">
##$SUBNAM6= <"">
##$SUBNAM7= <"">
##$SUBNAM8= <"">
##$SUBNAM9= <"">
##$SW= 20.0188882624521
##$SWIBOX= (0..15)
0 0 2 0 0 0 0 0 0 0 0 0 0 0 0 0 
##$SW_h= 4006.41025641026
##$TD= 16384
##$TD0= 1
##$TE= 0
##$TE2= 300
##$TE3= 300
##$TEG= 300
##$TL= (0..7)
0 120 120 120 120 120 120 120 
##$TP= (0..7)
150 150 150 150 150 150 150 150 
##$TP07= 0
##$TPNAME0= <>
##$TPNAME1= <>
##$TPNAME2= <>
##$TPNAME3= <>
##$TPNAME4= <>
##$TPNAME5= <>
##$TPNAME6= <>
##$TPNAME7= <>
##$TPOAL= (0..7)
0.5 0.5 0.5 0.5 0.5 0.5 0.5 0.5 
##$TPOFFS= (0..7)
0 0 0 0 0 0 0 0 
##$TUNHIN= 0
##$TUNHOUT= 0
##$TUNXOUT= 0
##$USERA1= <user>
##$USERA2= <user>
##$USERA3= <user>
##$USERA4= <user>
##$USERA5= <user>
##$V9= 5
##$VALIST= <valist>
##$VCLIST= <CCCCCCCCCCCCCCC>
##$VD= 0
##$VDLIST= <DDDDDDDDDDDDDDD>
##$VPLIST= <PPPPPPPPPPPPPPP>
##$VTLIST= <TTTTTTTTTTTTTTT>
##$WBST= 1024
##$WBSW= 4
##$XGAIN= (0..3)
0 0 0 0 
##$XL= 0
##$YL= 0
##$YMAX_a= 299096
##$YMIN_a= -360728
##$ZGOPTNS= <>
##$ZL1= 120
##$ZL2= 120
##$ZL3= 120
##$ZL4= 120
##$ABSF1= 10
##$ABSF2= 0
##$ABSG= 5
##$ABSL= 3
##$ALPHA= 0
##$AQORDER= 0
##$ASSFAC= 0
##$ASSFACI= 0
##$ASSFACX= 0
##$ASSWID= 0
##$AUNMP= <proc_1d>
##$AZFE= 0.1
##$AZFW= 0.1
##$BCFW= 1
##$BC_mod= 2
##$BYTORDP= 1
##$COROFFS= 0
##$CY= 11.3945322036743
##$DATMOD= 1
##$DC= 2
##$DFILT= <>
##$DTYPP= 0
##$F1P= 2.36226072786647
##$F2P= -0.459571619588291
##$FCOR= 0.5
##$FTSIZE= 0
##$FT_mod= 4
##$GAMMA= 1
##$GB= 0.15
##$INTBC= 1
##$INTSCL= 1
##$ISEN= 128
##$LB= 0.24
##$LEV0= 0
##$LPBIN= 0
##$MAXI= 10000
##$MC2= 0
##$MEAN= 0
##$ME_mod= 0
##$MI= 1.114404
##$NCOEF= 0
##$NC_proc= 0
##$NLEV= 6
##$NOISF1= 3.799351
##$NOISF2= 2.8
##$NSP= 1
##$NTH_PI= 0
##$NZP= 0
##$OFFSET= 15.70392
##$PC= 1
##$PHC0= -13006.8
##$PHC1= 25.20099
##$PH_mod= 1
##$PKNL= yes
##$PPARMOD= 0
##$PSCAL= 0
##$PSIGN= 0
##$REVERSE= no
##$SF= 200.130013532006
##$SI= 16384
##$SIGF1= 3
##$SIGF2= 2
##$SINO= 400
##$SIOLD= 16384
##$SREGLST= <1H.CDCl3>
##$SSB= 0
##$STSI= 0
##$STSR= 0
##$SW_p= 3612.71676300578
##$SYMM= 0
##$S_DEV= 0
##$TDeff= 0
##$TDoff= 0
##$TI= <>
##$TILT= no
##$TM1= 0
##$TM2= 0
##$TOPLEV= 0
##$USERP1= <user>
##$USERP2= <user>
##$USERP3= <user>
##$USERP4= <user>
##$USERP5= <user>
##$WDW= 1
##$XDIM= 8192
##$YMAX_p= 0
##$YMIN_p= 0
$$ End of Bruker specific parameters
$$ ---------------------------------
##NTUPLES= NMR FID
##VAR_NAME=  TIME,          FID/REAL,        FID/IMAG
##SYMBOL=    X,             R,               I
##VAR_TYPE=  INDEPENDENT,   DEPENDENT,       DEPENDENT
##VAR_FORM=  AFFN,          ASDF,            ASDF
##VAR_DIM=   8192,          8192,            8192
##UNITS=     SECONDS,       ARBITRARY UNITS, ARBITRARY UNITS
##FACTOR=    0.0002496,     1,               1
##FIRST=     0,             0,               0
##LAST=      2.0444736,     0,               0
##MIN=       0,             -360728,         0
##MAX=       2.0444736,     299096,          0
$$ Real data points
##PAGE= N=1
##DATA TABLE= (X++(R..R)), XYDATA
0@%%%%%%%%%%qJ6j6J6k4L2m0M8n6P2q8J04j23J47j76K08k40K74l16L67m21M80
32B56n46O20p02P91q92J002j122J254j397J553j723J911k116K339k582K849l142
49a647L462l815M201m628N104n634O229o900P667q554R587j0812J2291j4120J6453
64H884j9539K3843l0304M1205o4227J97097k62863j77003N27964j15005k39163
75a09111J00913l0524p4824K93634j13829l56433K67695L21575l42352j37055
85a80311K57208j3110q2011R0122j57004m6881L04903o7744l43782J93182K45654
96B00226k28807p9275J59086q0563J0806J49189j98555j15137L27288N208l35218
107a85752J07450K27380j60416m9229J11526j25676J6377K23997j69746k12587
$$ plain form
0 0 0 0 0 0 0 0 0 0 0 0 -8 8 -8 8 -16 16 -24 24 -32 40 -48 56 -67 80 -96 112 -128 146 -170 197 -224 256
32 256 -290 330 -372 419 -473 529 -593 661 -736 817 -906 1005 -1111 1228 -1354 1495 -1647
49 -1647 1815 -2000 2201 -2427 2677 -2957 3272 -3628 4039 -4515 5072 -5740 6551 -7569 8884
64 8884 -10655 13188 -17116 24089 -40138 156959 -105904 -282907 245057 130052 -109111
75 -109111 -8198 -38722 -113546 180088 66259 -290174 -22479 299096 -43256 -180311
85 -180311 76897 63787 -18224 71898 -85106 -131987 172916 105172 -238610 -45428 200226
96 200226 -28581 -107856 51230 -29333 -18527 130662 -67893 -183030 144258 149466 -185752
107 -185752 -78302 149078 -11338 -60567 50959 -74717 -58340 165657 -4089 -216676
117b16676K77416J22395k81153K301J83274r4031k1041J09489j47960n4249K51117
128A30882m1277k54249J24023J75667j36861m9678P8409n7981L2355J01781j51273
139d8202p8617K18355N669k04195P0591J19043r3703P212N3360j12792L7204J54156
151A28081j40400j26462J99178M3138j83796M8996R7994r5255L0750P6437j43385
162f4724l743J93151r0507j71834J52067Q7109j48455J5464P9127q3218L1663
173c900R1181j31854m3867J74244l1904j50103Q5292O9333q8795K7432L8989r2266
185e6218M5388R9813j17998n5615J38860j3933j03714O2978K5578o7726O0430
196A7843K7103j10997M1058J09763r8133o2207J11171o867p6248N6936Q269o7279
$$ plain form
117 -216676 60740 183135 -98018 -95717 87557 -6474 -27515 81974 -65986 -120235 130882
128 130882 89605 -164644 -40621 135046 -1815 -51493 26916 -31065 1290 103071 -48202
139 -48202 -126819 91536 97205 -106990 -36399 82644 -11059 -3847 49513 -63279 -26075 128081
151 128081 -12319 -138781 60397 103535 -80261 -31265 66729 -28526 2224 78661 -64724
162 -64724 -68467 124684 34177 -137657 14410 101519 -46936 -31472 47655 -35563 -3900
173 -3900 87281 -44573 -88440 85804 53900 -96203 -10911 58422 -30373 -2941 36048 -56218
185 -56218 -10830 88983 -29015 -84630 54230 40297 -63417 -439 25139 -42587 17843
196 17843 44946 -66051 -24993 84770 -13363 -75570 35601 28734 -47514 9422 17691 -49588
208d9588O4344L9483j04934J2955J03608n9984o1631P4374L51n1488M7301L653
220A8444o3249M8782M9509p7505j3394P6095k2124m5735L7851j165k6544L7453
232A8418k125n0649L5917M0874n3193j3435M9580j5298k5465K9203j0406k4591
244b1170L9261L099m7922K2438L7727l6695j2446L3902j4632j6833K9689j0383
256F035l1230L3617J7053m2465L968L4887j8327j5704K1496p068j4164K0921k005
269G014k5781J6907J8176k4254l052K0413q489q118J2485o419r615J4458O55j7144
283a2764Q320J0913j1461q01R156p416m80J0217q992p891J4068J286j5047N948
297d944J0226q430j913Q091m674k213P914m592o372Q064K574q966J041Q359l454
$$ plain form
208 -49588 14756 54239 -50695 -37740 65868 5884 -55747 18627 18978 -32510 14791 18444
220 18444 -44805 3977 53486 -24019 -37413 38682 16558 -29177 8674 7509 -19035 18418
232 18418 16293 -34356 1561 42435 -10758 -24193 25387 10089 -15376 13827 3421 -21170
244 -21170 18091 21190 -26732 -4294 33433 -3262 -15708 18194 3562 -13271 16418 6035
256 6035 -25195 8422 25475 -16990 -13022 21865 3538 -12166 9330 2262 -11902 9019 7014
269 7014 -18767 -1860 16316 -7938 -10990 9423 934 -7184 5301 -1118 -10733 3725 4380 -12764
283 -12764 -4444 6469 -4992 -5793 3363 -4053 -4533 5684 -3308 -11199 2869 4155 -10892 -4944
297 -4944 5282 -3148 -5061 3030 -1644 -3857 4057 -535 -6907 1157 3731 -5235 -4194 4165 711
312G11l857N390k26k806K612L50k837J177J630j579o60J899M04p58Q27K36m44
329B069O08q02q11J584o35j148Q39Q20m50l45J126l26r51J248j192j374J826m1
347B045k414Q63J221o85j293J353O00j771N31L20j371M08M25j798P10J009j650
364a497k4J700j178j188K017n74k777K602O83l969J928K385l690J100L676l773
380b579k044O314j505o553N166L646p346J869N091n941N74P201n955m718J0361
395C581l26j0415N948O049q784J813O926r101O95J2377q800q623J4555J895j4470
410f680N860P817j0662L644Q986j4503q9J9639j0215j6010J7907O013j7573N912
424D6Q684j4506O344J4111k1047m946K8002q683k3244J9237Q533j9449Q223R175
$$ plain form
312 711 -3146 2244 2018 -788 1824 2174 -663 514 2144 565 -95 1804 2208 1450 2277 2513 2069
329 2069 2677 1875 1064 2648 2013 865 1704 2524 2074 1729 2855 2529 1578 2826 1634 260 2086 2045
347 2045 -369 494 1715 1030 -263 1090 1690 -81 450 770 -601 -193 232 -1566 -856 153 -1497
364 -1497 -1521 179 -999 -2187 -170 -744 -3521 -919 -236 -4205 -2277 108 -3582 -2482 1194 -2579
380 -2579 -4623 1691 186 -6367 -1201 2445 -4901 -3032 2059 -3882 -3308 3893 -2062 -6780 3581
395 3581 3255 -7160 -1212 4837 -3947 -2134 4792 -4309 -3614 8763 -37 -8660 5895 7790 -6680
410 -6680 -820 6997 -3665 -21 8965 -5538 -5627 14012 3797 -12213 5694 11707 -5866 46
424 46 8730 -5776 568 14679 -6368 -11314 16688 8005 -15239 3998 12531 -6918 1305 10480
438A0480k1365Q223K3038k6184j2949L4020l620k8533J8160R808k1614J2763J1085
451A3312l0125P775L3635k7540k2684L6913K183l0292J7752P836k5793K0396J6268
464A9636m0826K637M6174k4520l2248L5827N771k9041K1710M411l5473K7051L0160
477C1269n1202r588N6083j5434l7796L1088M464k6787L0805K697m9913L0063M6066
490D1815n5361k1363N8228r814l5086L1833n124l1068M6800Q754p0120K5262O4545
503D9301n1237l3875N3183o092k6267L5118j7165m0622O0412K1219q2552J1676
515b6901P2825l9029l4877M2465j3756j7034M9696k4625o0291O5875M1477q4438
527b8613p350P0309k4456k8217L4174k4972j6595O6071k0447p8091N6194N9711
$$ plain form
438 10480 -10885 -2662 20376 -5808 -18757 15263 11643 -16890 1270 11078 -10536 2227 13312
451 13312 -16813 -9038 24597 -2943 -25627 11286 13469 -16823 929 8765 -17028 3368 19636
464 19636 -21190 -18553 27621 3101 -29147 6680 12451 -16590 5120 9531 -25942 1109 31269
477 31269 -19933 -29521 26562 11128 -26668 4420 8884 -17903 12902 15599 -34314 -4251 41815
490 41815 -13546 -34909 23319 13505 -21581 10252 5128 -25940 20860 29614 -40506 -15244 49301
503 49301 -1936 -35811 17372 11280 -14987 20131 2966 -37656 22756 43975 -38577 -26901
515 -26901 45924 6895 -27982 14483 727 -16307 33389 8764 -51527 14348 55825 -28613
527 -28613 -35963 34346 9890 -18327 15847 -9125 -25720 40351 19904 -58187 -1993 57718
539E7718p1811k2040N5611j6680j1982L4750m2625k5885Q4774l970r6473L6696
551b1917P3037n1494k7427L7532k0540J516N0718n1797n1439R0502K5668r7197
563d2838Q468O8716l0692j5523K6830m0813L118P6601m4656q0304P8981N2060
575E9948q3395r887N4508k3749r24L2494n5956j2612R2840k3536r4673N6161O3280
588E4499o3644j3070L7869l1042J3652M9237o8840l5966J03436K579j01770L1797
600b1263O3118m4066l738K4761n0043J9778P5426o8123o5337R5549K9092q6566
612c1412J2019M1481l5151K2677K5970p7386R036R9712n1136q1594P3377L5900
624D3493o2921J4679J9536m5888L9138M3574q7445j3018J02348k6328p9243M9996
$$ plain form
539 57718 -14093 -36133 19478 2798 -9184 25566 -17059 -42944 41830 37860 -58613 -21917
551 -21917 51120 -374 -27801 9731 -10809 -9293 41425 -10372 -61811 28691 54359 -42838
563 -42838 -34370 34346 3654 -11869 14961 -25852 -22734 53867 9211 -71093 7888 59948
575 59948 -23447 -33334 21174 -2575 -3499 28995 -26961 -39573 53267 29731 -64942 -8781 54499
588 54499 -9145 -22215 15654 -15388 -1736 47501 -21339 -57305 46131 48710 -53060 -21263
600 -21263 41855 -2211 -5949 18812 -31231 -11453 63973 -4150 -69487 26062 55154 -31412
612 -31412 -19393 22088 -13063 9614 35584 -41802 -32766 66946 15810 -65784 7593 43493
624 43493 -19428 -4749 14787 -31101 8037 51611 -35834 -48852 53496 27168 -52075 -2079
636b079K8572m2560K4795N194n7290M4228N7703q4128k9512R2996p965o6805L2603
649d248J6002l0416L6866K604o9555L6186P1916o6373m6001P0048Q292m3353K1450
662C418l413k8747N0670J3230p8267J4980P7248l9175m8811M3804Q500k4902K7379
675A5914j2034m1343N0051L1712p1284o681O7369j8581l8970K9528q78k0028L6772
688B1547p040n3204L8642M5218n7019k0681N3955p446k8537K4106q886k1425M2546
701B1776K298n9184K3244N1818l9814k6997L8579m367j6828K5480j5776k9392
713b9163M5095J5623n8587O716M9425k4798k1745K6432j0665j1194L3762j4452
725F449m0036L8651K6628m8053m183L8083j5774j2475K1613j7660j1485L8537
$$ plain form
636 -2079 26493 -16067 8728 13922 -43368 860 58563 -25565 -55077 37919 29954 -36851 -4248
649 -4248 11754 -18662 18204 20808 -48747 -12561 59355 -7018 -53019 17029 25321 -18032 3418
662 3418 5 -28742 21928 35158 -43109 -28129 49119 9944 -38867 4937 13437 -11465 15914
675 15914 3880 -37463 12588 44300 -26984 -33665 33704 15123 -23847 5681 4803 -15225 21547
688 21547 14507 -38697 -55 45163 -11856 -32537 21418 13972 -14565 9541 655 -20770 21776
701 21776 24074 -35110 -11866 39952 138 -26859 11720 7353 -9475 16005 229 -29163
713 -29163 15932 31555 -27032 -20316 29109 4311 -17434 8998 -1667 -12861 20901 6449
725 6449 -33587 5064 31692 -16361 -20544 17539 1765 -10710 10903 -6757 -18242 20295
737B0295r074m2449K8776K8903l6149o714K7808j4330m907K2161k0493j5362L8018
750A6483j635l8652J7815K4618k4351k774J7351j5685L2K4168j9586j8923L1765
763A0626M937l0310R148J7484j5948R58J2651j7070k11K4021j3353k0234K2387
776E086Q425k1256M523J1369j1684K959J1330j5568l442K0542o288j7454J3140
789A682P991j3298K818O594r816L406J0245j2164n860J6088j378j3918P020O404
803E814q153K645M267r127K254J0113q675o571J1148Q39r611M448L847o767K645
818h84M977p787k20Q369m323o177O944J419o251L043K951n248J483M501n325j727
834d255O812k089n150M664J238l759J026K620l577Q85L488l104j473M128j135
$$ plain form
737 20295 11221 -31228 -2452 26451 -9698 -16412 11396 -2934 -7841 14320 -6173 -21535 16483
750 16483 14848 -23804 -5989 18629 -5722 -8496 8855 -6830 -6798 17370 -2216 -21139 10626
763 10626 15563 -14747 -5599 11885 -4063 -3105 9546 -7524 -7735 16286 2933 -17301 5086
776 5086 13511 -7745 -3222 8147 -3537 -578 10752 -4816 -8258 12284 5996 -11458 1682
789 1682 9673 -3625 -807 5787 -4029 -623 9622 -2542 -8402 7686 6308 -7610 -590 5814
803 5814 -2339 306 4573 -4554 -2300 7813 -862 -7433 3715 4554 -5057 -609 3238 -3529 -884
818 -884 4093 -3694 -3914 4455 132 -6045 899 2318 -3933 -890 2061 -3187 -1704 2797 -2528 -4255
834 -4255 2557 468 -4682 -18 1220 -2539 -1513 1107 -2470 -1585 1903 -1201 -2674 1454 319
849C19k595K585N82k481J613J355k383L41K258j802r16K296o81j102J347M43j425
866b46J352L11j530K86J721j034j155J701n6j387P50O79q09K1M03m06J44M54m77
885G22m76M59K33q93M41M76o13j21K82j51k84P14m87o96M23K79q67M41M32j041
905g27L67O56j096L29R30j450n03J159K76j410O91N41j366J096P92j762n8K042
923E07j628j033J975j46j430J564J32k004J565J938l364l8L485j820k069L190
939H24m89k264K892M05m047K478L369m637q22M989k055k700L933j059l030M187
955A974Q65o378L199N056n185k065O224k458l300N590k320m766O283K459r102
970c924K628P369o311k816O669l110l485P939l096p799Q069M871j0987P93Q993
$$ plain form
849 319 -2276 309 891 -1590 23 1378 -1005 -664 1594 -208 -1124 1172 491 -611 736 1179 -246
866 -246 1106 1417 -113 173 1894 860 -295 1406 1350 -37 713 1392 583 604 1007 601 745 1199 722
885 722 246 705 938 45 486 962 349 228 510 359 75 789 302 -394 29 308 -559 -118 314 -727
905 -727 -360 296 -800 -471 459 -991 -1494 -335 -59 -1469 -778 -237 -1603 -507 285 -1477 -1535 507
923 507 -1121 -2154 -179 -325 -1755 -191 -59 -2063 -498 1440 -1924 -1962 1523 -297 -2366 824
939 824 335 -1929 963 1368 -2679 -201 3168 -1469 -2291 2698 643 -2057 1876 817 -2213 1974
955 1974 2839 -3539 -340 4716 -469 -2534 3690 1232 -2068 3522 1202 -3564 2719 5178 -3924
970 -3924 -1296 6073 -238 -3054 3615 505 -2980 4959 1863 -5936 2133 7004 -3983 -3190 5803
985E803n977k795P157m956m378J0930k487j2201R483P692j2609l96R473o015k311
1000c587R073p660o146J4703r20j6162Q330J0906j2145j232R113p694r44J2509
1014H144j0296j0155J8124L029j9526O058J2495j0648r96R289j0894m12J7390
1027A1602j0757j5916J8916P953j9802K834J2026r913J613J0413j5863k527K3581
1040A4160q807k1173J7010J1385j7618J981R307j2266N736J4818k1015p783K8264
1053A3999l337k5226J3175J2184j4950M629P232j7957P314K2352k2527j5506K9309
1066A0691K347k3936Q773R069j3168R874P503k5435O194K9851j9914k2404K6341
1079E786O997k0692P461M728j4972J5376J1493l0868k48L4797j2546k6209J8940
$$ plain form
985 5803 -174 -2969 4188 -768 -5146 5784 3297 -8904 579 8271 -4338 -4734 4739 -1276 -3587
1000 -3587 5486 -2174 -8320 6383 5463 -10699 -2369 8537 -3608 -4840 4273 -3421 -4365 8144
1014 8144 -2152 -12307 5817 8846 -10680 -4622 7873 -2775 -3771 5518 -5376 -5788 11602
1027 11602 845 -15071 3845 11798 -8004 -5170 6856 -3057 -1444 8969 -6894 -9421 14160
1040 14160 5353 -15820 1190 12575 -5043 -3062 6245 -6021 -285 14533 -6482 -14265 13999
1053 13999 10662 -14564 -1389 10795 -4155 474 7706 -10251 -2937 19415 -3112 -18618 10691
1066 10691 13038 -10898 -2125 6944 -6224 3650 11153 -14282 -8088 21763 1849 -20555 5786
1079 5786 12783 -7909 -448 4280 -10692 4684 16177 -14691 -14939 19858 7312 -18897 43
1092D3Q198j4060R659q30k0200J9366J9482l3186r070L5287m321k3978J2991L522
1106B903j0968J6742o74k9121J7020K8209k8687j6648K9804P52j7966J1136k050
1119D52j3291K2865N041l5575J0000L4190k1490k0389K2718J486j1755J4142p381
1132A013j9221K7495J2775l8544P63L5580j3023j9533J6037k218p843K1119r195
1145E205k8519K6708K3232l5687r147L0890n761j3365J2806r973q702K9332m588
1158A2431l6449J9007K9980k7209j2862K2562o001o032J6567j5307j5986L2981
1170A3682M567l8668J0030K9687j9020j0448J6188j0161k102K2758j7468k2509
1182b3464L2360J1352l5723L288K4814j2984m805J2446j5917j676K9461j5100
$$ plain form
1092 43 8241 -5819 3840 3010 -17190 2176 21658 -11528 -20598 14689 10368 -13610 -619 2903
1106 2903 -8065 8677 8003 -21118 -4098 24111 -4576 -21224 8580 9332 -8634 2502 452
1119 452 -12839 10026 15067 -20508 -10508 23682 2192 -18197 4521 6007 -5748 8394 1013
1132 1013 -18208 9287 22062 -16482 -15719 19861 6838 -12695 3342 1124 -6719 14400 5205
1145 5205 -23314 3394 26626 -9061 -18208 12682 6921 -6444 6362 -3611 -12313 17019 12431
1158 12431 -24018 -5011 24969 -2240 -15102 7460 1459 -4573 11994 -3313 -19299 13682
1170 13682 18249 -20419 -10389 19298 278 -10170 6018 -4143 -6245 16513 -955 -23464
1182 -23464 8896 20248 -15475 -12187 12627 -357 -5162 7284 -8633 -10309 19152 4052
1194D052k9349K7743J7525k8670j462J7094j0425K453J2866k1495n606L2908p020
1207A0614l1578J7500J8559j8565j153R725j3085O649J7716k2100j2383L0357
1219A2256J592k7659R071J4471j2223K595O818j6517N570K1556j7830j7282K3987
1232F405O950k1217M279R671j0104O666P233j9701J697K4677j2267k0142J7876
1245B023R112j5132K993M948j0988Q889J0942k0455m150K4360m808j9466J0602
1258a130Q170j0398M989K804j3864Q025J5326j7885r456K0775j09j4709O388L942
1272B868q138P744L740j6002M582J7495j2784j1199J5272J444j0670O697R25q995
1286g021R291N821j6244J249J6516q408j0186J0733R90p022O835n64r958R297
$$ plain form
1194 4052 -25297 2446 19971 -8699 -10161 6933 -3492 -1039 11827 -9668 -15274 17634 10614
1207 10614 -20964 -3464 15095 -3470 -4623 5102 -7983 -1334 16382 -5718 -18101 12256
1219 12256 13848 -13811 -4740 9731 -2492 103 6921 -9596 -4026 17530 -300 -17582 6405
1232 6405 13355 -7862 -3583 6088 -4016 2650 9883 -9818 -8121 16556 4289 -15853 2023
1245 2023 11135 -3997 -1004 3944 -7044 1845 12787 -7668 -11818 12542 7734 -11732 -1130
1258 -1130 7040 -3358 1631 4435 -9429 -1404 13922 -3963 -13419 7356 7247 -7462 -1074 2868
1272 2868 -5270 2474 6214 -9788 -5206 12289 -495 -11694 3578 5022 -5648 1049 1974 -7021
1286 -7021 2270 8091 -8153 -6904 9612 1204 -8982 1751 2741 -4281 2554 1990 -7968 1329
1300A329P404j4069j238J3611m684q002P770j014n388Q220m49j0708P107Q672
1314H561j1048k940J0011k971m388N538j760n384P934P56r825M494P661p339k549
1329c249O228k158k674N215k639m809O764J932p960J720O232m529k180M403k133
1344A63k005M503j529n074M667L126o112L33M380k740j130K860j697j887L757
1359A615m73m150K485K731l529o48L226j925j005K969j662j898K969J08l178J279
1375a086K173k106m42K173j291q66K344j103j672K144Q52k521K63K102j278n90
1391i04J787j196q98K179n55j386J038J009j667K24J356j067p5R83m21r15J134
1408F26J21j212O17R05j037M1Q24o91K5N63m77n13R30J1n56L61L73j149O06K34
$$ plain form
1300 1329 8733 -5336 -6574 7037 2353 -5649 2121 1107 -4281 3939 3490 -7218 -111 8561
1314 8561 -2487 -5427 4584 1613 -2775 2763 1003 -4381 3553 4309 -5516 -1022 6639 -700 -3249
1329 -3249 2979 821 -1853 3362 723 -4086 2678 4610 -3350 -1630 4602 73 -2107 2296 163
1344 163 -1842 2661 1132 -3942 725 3851 -2261 -1928 2452 -288 -1418 1442 -255 -2142 1615
1359 1615 1142 -3008 -523 2208 -1321 -1969 1257 -668 -1673 1296 -366 -2264 705 813 -2365 -1086
1375 -1086 1087 -1019 -1461 712 -579 -1445 899 -204 -1876 268 1120 -1401 -1138 964 -314 -904
1391 -904 883 -313 -1211 968 413 -973 65 1074 -593 -369 987 -80 -155 828 407 -508 626
1408 626 747 -465 152 1057 20 61 885 194 219 782 305 -208 722 733 177 538 911 -238 368 602
1428F02k96k64P42l60o83R43j29r00L12O76r21J77N76n42j36K73J5l07J61L97
1448C36j209O45K32p75K49Q75p33k11M39l55k14N96j03o12N69M52j145J17P50
1467i7m85j02Q47o42p87J378j87j207J018Q99j330N7J040r29m23J758j189j071
1485a452J957K79j903J010R51j346J10J649j633m10K620j320j707J935P08k054
1501f06R97J032k179J016J777k541p59L659j339k672K513R73k656J292J178l127
1517a442J326K898l317j504M261p53l243K322P54k968K434J364m116J094M196
1532C306l933k630N178p57l403K710M35l403L319J643n832J317N909l810l818
1547c769M713j2l228K939l5m491M257L508p291k34P384l286m280M706m67l192
$$ plain form
1428 602 306 42 784 424 -259 684 555 -345 -33 643 -278 -101 475 -67 -203 70 85 -222 -61 336
1448 336 -873 -228 4 -771 -522 353 -380 -591 -152 -507 -721 -125 -228 -840 -271 181 -964 -847 -97
1467 -97 -582 -684 163 -479 -1266 112 -75 -1282 -264 635 -695 -638 402 -527 -950 808 -381 -1452
1485 -1452 505 784 -1119 -109 842 -504 -394 1255 -378 -788 1832 512 -1195 740 1448 -606
1501 -606 391 1423 -756 260 2037 -504 -1263 2396 1057 -1615 898 1871 -785 507 1685 -1442
1517 -1442 -116 2782 -535 -2039 2222 1469 -1774 548 1302 -1666 768 2132 -1984 -890 3306
1532 3306 -627 -3257 1921 1164 -2239 471 906 -2497 822 2465 -3367 -2050 3859 49 -3769
1547 -3769 944 932 -2296 643 608 -3883 374 3882 -3409 -3643 3741 455 -3825 881 414 -2778
1563b778M794m41p009M963N976p996j919P652k231l864M442j673l527O979N7r154
1579e729M396P815o942m084P202j676k932N062l073n122Q618J959j0996K441R461
1594F400n585m401O162k684j893P180m065p854R564M781j1797j34R640m206l221
1609b113N283m759k108J0154l696j1080Q722P805j0670j942P612l734o71O001
1623D804p344l696J2953j450j4011O575R464q643k152O144n422J184Q444q815
1637a965p379J4171K189j4397L617Q879o580J81L991p557J581J1931q525j0818
1651a0681J2873N522j2458J089O702n342K432N067j0734n98J5199n438j3640R603
1665d04P481r361P72L991o630M813P578j2577m384J6559j735j4113O251O904o676
$$ plain form
1563 -2778 2016 1575 -5434 -471 5505 -2491 -4410 3242 1011 -2853 1589 -84 -3611 3368 3425 -5729
1579 -5729 -1333 6482 -460 -4544 2658 982 -1950 3112 39 -5083 3535 5494 -5502 -3061 6400
1594 6400 815 -3586 2576 -108 -2001 5179 1114 -6740 2824 7605 -4192 -4326 5314 1108 -2113
1609 -2113 3170 -1589 -3697 6457 2761 -8319 403 8208 -2462 -4404 3208 -526 -1197 4804
1623 4804 -2540 -6236 6717 5267 -8744 -2169 7295 -1348 -3500 2644 -2778 -1594 6850 -1965
1637 -1965 -9344 4827 7016 -7381 -3764 5115 -1465 -1284 2707 -4850 -3269 8662 137 -10681
1651 -10681 2192 7714 -4744 -3655 3047 -2295 137 5204 -5530 -6128 9071 3633 -10007 -404
1665 -404 7077 -2284 -1512 2479 -4151 662 8240 -4337 -8721 7838 6103 -8010 -1759 5145 -1531
1680a531K388K218r520N387J1870j2644q362J5515K004j2206L501M494n712N458
1694B860K662j3144L758J5048r782j1234J2066M010r020L095J229o897Q126N495
1708H272j4850k35J6025n530j1565Q332L286o239M708l83r365Q485Q743j4476
1722d792m150J5618k521r766N856P65m592P491o00j2769P593J2084j2278o737
1736h798J2197J13o924M959j993n542J0439J537j4489M086J3321q331p307Q411
1750A679l25l794O564l978p983J1033N027j4517O10J2397m807n674N842k454k384
1765b764Q118l783r701R718O926j1806j844R540k798l424M703l995k682R311j506
1780D013j1361O446Q575q414l429O660k243j219N034n334m271J0037Q02j0960
$$ plain form
1680 -1531 857 3075 -6445 -1058 10812 -1832 -10194 5321 7325 -4881 -1380 3114 -2598 2860
1694 2860 5522 -7622 -3864 11184 1402 -9832 2234 6244 -2776 319 1548 -5349 2777 8272
1708 8272 -6578 -6813 9212 3682 -7883 449 3735 -2504 2204 1821 -7544 941 9684 -4792
1722 -4792 -8942 6676 4155 -5611 245 1010 -3582 3909 3309 -9460 -1867 10217 -2061 -8798
1736 -8798 3399 3512 -3412 1547 -446 -5988 4451 5988 -8501 -4415 8906 575 -6732 1679
1750 1679 1354 -2440 4124 146 -7837 3196 8223 -6294 -5684 6713 1906 -3768 2074 -380 -2764
1765 -2764 5354 1571 -8130 1588 8514 -3292 -5136 4404 1606 -1818 2885 -1110 -3792 5519 4013
1780 4013 -7348 -902 7673 -741 -4170 2490 247 -972 4062 -1272 -5543 4494 5296 -5664
1794e664L062Q270n353k664M178l122k48O382m841o394Q550L348r135N19O261
1809C149l304j013L172m380r28P955l389p437O318M650p195l6M203k913K5M269
1825C146m989k225P868j513p380M117M494m803j86K861l523P95N189n055l205
1840d409O956L50o450K509L512l426P22K103l904P62M916l414m173N514J324m975
1856b083J409K523l264J645K403m485K41N073k504l919L863J194l071J466P90
1871A281k549J594K409l582q01M202j156l366K377J281k558J142P77k491J063
1886c77K554k704j226L249m71k162J454N52j537J031O76k378N87K281j581j561
1902a613J900J72j260Q40J59j216R08J087k057K18J994j200j171J413M2j100Q19
$$ plain form
1794 -5664 -2602 5668 315 -2349 1829 -1293 -1541 4841 0 -6394 2156 5504 -3631 -3112 3149
1809 3149 -155 -1168 2004 -2376 -3304 4651 1262 -6175 143 4793 -2402 -2438 1765 -1148 -1123 3146
1825 3146 -1843 -4068 3800 2287 -5093 -976 3518 -1285 -1471 1390 -2133 -1338 3851 -1204 -4409
1840 -4409 2547 2897 -3553 -1044 2468 -958 -236 1867 -2037 -1275 3641 227 -3946 1568 2892 -2083
1856 -2083 -674 1849 -1415 230 2633 -1852 -1611 3462 958 -2961 902 2096 -975 491 1281
1871 1281 -1268 326 2735 -847 -1648 2554 1398 -1968 409 1690 -868 274 1051 -1440 -377
1886 -377 2177 -527 -1753 1496 1025 -1137 317 869 -668 363 1039 -1339 -752 1529 -52 -1613
1902 -1613 287 459 -801 39 198 -1018 -110 977 -1080 -862 1132 -68 -1239 174 216 -884 -65
1919f5K45j132R30O59j393l23J734o13r85R07R4o19O94j09n62K96P22n99n55J362
1939F88l15p42O10r4o83P36N23r03J3R25m72m82O55L1p11L98M58p33M84K67p04
1960e1l21R92m89NL86j64m19K80J57o7k92N01m17j2L53k80k85M40k26r5K19J67
1982C82m37L29J71q45jN43k41k62N50j66m77K85K44m50J55M17m78l68Q08o13j14
2003e68O03k72l48J90J62j97J45J93l88l28R96m72k58N53j35k44L16K26p77L72
2023b31M09n11N2N86l81j77O51j69o35O34K69j040P22Q00r20m55Q80k77l44P17
2043E80m03o96J223j5j238M27J412j458n9Q59o83k83J377r48q10J425K66j502
2061e26L15J236r09m75R73p54n20J880q65j518J583P45j734K74R69j173K93J278
$$ plain form
1919 -65 180 -952 -22 637 -756 -1079 655 42 -943 -36 58 -561 133 24 -538 -242 480 -119 -674 688
1939 688 373 -369 241 147 -536 200 723 -180 -167 758 286 -196 459 490 -221 177 635 -98 386 653 -51
1960 -51 -372 620 131 136 522 358 -61 219 376 309 17 518 101 89 442 162 -123 317 91 -4 215 382
1982 382 -55 274 445 -400 -401 142 -99 -361 189 23 -454 -169 75 -375 -220 197 -281 -649 159 -454 -568
2003 -568 35 -237 -585 -395 -233 -430 -285 -92 -480 -808 188 -284 -542 11 -124 -368 -52 174 -603 -231
2023 -231 178 -333 -281 305 -76 -253 398 229 -406 228 497 -543 179 979 59 -396 484 207 -137 580
2043 580 177 -519 704 689 -549 -122 1290 -168 -227 632 -51 -334 1043 95 -715 710 976 -526
2061 -526 -211 1025 116 -359 614 -140 -660 1220 355 -1163 420 1165 -569 -295 674 -499 -206 1072
2079A072j915l23K358p02k433J725J365j574k04J088j215M15J584k075q48K580
2095H98%k687R97J661j787N74J071k069N81K653k215k020L483L4k633Q23J231
2112E95j465J058J364l121L75L479k136k751L242O47k442J150P40k241J922J727
2128B143l977n8M638j776l126K391J243k388J590N12l395K452K952m319j339M576
2144B119o38l205K031L06j727K760J09m373K065M274m296k416M423J47k765J839
2160F53k03k499L640J042n420J236N242l500l221L701Pj857K424j104l555M607
2176A193J984o199L35N606k318k658K638p05j179L490j597m538M302L466n735
2191a915j014M960j635j971K203j605j613N181j060n701L537M441m614j916L867
$$ plain form
2079 1072 -843 -1166 1192 490 -1943 -218 1147 -427 -631 457 -758 -343 1241 -834 -1682 898
2095 898 898 -1789 -792 869 -918 -344 727 -1342 -761 1892 -323 -2343 1140 1174 -1459 -636 595
2112 595 -870 188 1552 -1569 -1194 2285 149 -2602 640 1287 -1155 -5 735 -1506 416 2143
2128 2143 -1834 -1892 2746 970 -2156 235 1478 -910 680 1192 -2203 249 3201 -1118 -2457 2119
2144 2119 1481 -1724 307 613 -1114 1646 1755 -2618 -553 3721 -575 -2991 1432 1579 -1186 653
2160 653 450 -2049 1591 2633 -2787 -1551 3691 191 -3030 671 678 -1179 1245 141 -3414 1193
2176 1193 3177 -3022 -2687 2919 601 -2057 581 -124 -1303 2187 590 -3948 354 3820 -1915
2191 -1915 -2929 2031 396 -1575 628 -977 -2590 2591 1531 -4170 -633 3808 -806 -2722 1145
2206A145p75j238K918k763k546N716Q08o872J759N340l331k244L201j987q7M029
2222C073l017l966N653K389o775L97M724k197j043K335l421K44N649k987n397
2237d339M736L433n101m59L235k056O15K402m122j253O405j086o358L351L562
2252B965l607pJ784k490J274L656m696k758O709K08o067K032L123k652O48J216
2268A338l928J502M789l988m011N395J850n247J031K560k540J785J785n020M40
2283b259N851k656m891L987K264l409O53J020k672K746K262n243p12N976j185
2298A732m681K635J671k283J687L80l725K597L790m900k229N499k04l727J988
2313B30L66j677K718J25m715K078M613l736k455L771k1j980J412l77k010L338
$$ plain form
2206 1145 370 -868 2050 -713 -3259 2457 3265 -3607 -1848 3492 161 -2083 1118 -869 -956 3073
2222 3073 56 -3910 1743 4132 -2643 -2246 2478 281 -762 1573 -1848 -1604 4045 1058 -4339
2237 -4339 397 3830 -1271 -1730 1505 -551 64 2466 -1656 -2909 3496 2410 -3948 -597 2965
2252 2965 -642 -649 1135 -1355 -81 3575 -1121 -3879 2830 3038 -3029 -997 2126 -526 122 1338
2268 1338 -2590 -1088 3701 -287 -4298 1097 2947 -2300 -1269 1291 -1249 536 2321 -2699 -2259
2283 -2259 3592 936 -3955 32 2296 -1113 -460 560 -2112 634 2896 -2347 -3059 2917 1732
2298 1732 -2949 -314 1357 -926 761 1141 -2584 13 3803 -1097 -3326 2173 1969 -1758 230
2313 230 596 -1081 1637 1762 -2953 -875 3738 2 -2453 1318 1297 -683 729 352 -1658 1680
2329A680P50m665P12M719k475k773K502N29j508J698q64k408K593K305m375p53
2345b333M416j311k122J703k12j276K392l67l320K368K626l499q97K656l58j126
2361f60J471j378r42K659K09l573J210L116k374j369K208o24q47J707j168j547
2377a902K873N56l530Q25K699j364j375J802p77o26J923q85j980K269J161k500
2393h31J20K056j357j93R34j098n56K147l23k546J836J315k153P8J172j124K09
2410c14J161j107p56K181k41k157J084J316j492L42O98r37K5J185j221r17K149
2427I99j09j794Q76Q48j285M39O58p88l35J361p34q48J160J5r05N0Q19p13K0P92
2447E26r45n2J058m38j177J114K98q53K47O8k31R8N98o60n08J287n66m87M44L70
$$ plain form
2329 1680 2430 -2235 -1523 3196 721 -2052 450 979 -529 1169 305 -2103 490 2795 -1580 -2333
2345 -2333 2083 772 -1350 353 141 -1135 1257 890 -2430 -62 2564 -935 -1832 824 466 -660
2361 -660 811 -567 -1509 1150 1359 -2214 -1004 2112 -262 -1631 577 -47 -894 813 -355 -1902
2377 -1902 971 1527 -2003 -1178 1521 157 -1218 584 -193 -819 1104 219 -1761 508 1669 -831
2393 -831 -711 1345 -12 -205 729 -369 -925 1222 899 -1647 189 1504 -649 -571 601 -523 -314
2410 -314 847 -260 -1016 1165 924 -1233 -149 1167 -325 17 715 -222 -197 988 -233 -1150 999
2427 999 890 -904 -28 820 -465 -26 632 -156 -491 870 136 -712 448 463 -442 -392 427 -286 -266 526
2447 526 -419 -471 587 149 -1028 86 384 -469 -222 -154 -385 -287 311 -349 -857 430 -136 -623 -179 191
2467A91l36k07L64k86l44Q54l91l88P07J57p30K65K73m43L10J89k61J17K98l70
2487c1l50O26k56j03J32J86l64M1M29j84o2L41M4p78M56Kj67K63j52M7j70K11
2509A61P1m89M58q1j38J65J20k34n2M21n59J5N66m02l05M48o4l50N38j85l93J76
2531a13L61m13J16J16J2j60K56m45j3J91q2j30J31N67q28K54L43k58j98K30Lk95
2553c55K72Q1k75Q2K27n19L02K26m43J32L26J4k71L31p0j56J42J02l83J06J30
2574Ar6j11O66l67j77J26N88q59K27l3m69L80O42n43l47Q78k61l45M40j43o13
2595d16Q16K22m57n4L18l45k99M49p2l15O95l95m78K60M60p59J8P97k36l82L09
2616A36j70k85Q05j72p78M34N94j025j89J288p41k88Q47q32l29J159j48j360J056
$$ plain form
2467 191 -145 -352 12 -274 -618 236 -155 -543 164 321 -409 -144 129 -314 -4 185 -76 41 339 -31
2487 -31 -381 245 -11 -114 18 204 -160 -119 310 126 64 405 449 -329 127 129 -38 225 73 120 -50 161
2509 161 232 -257 201 120 -18 147 267 33 -19 402 -157 -142 424 22 -283 165 101 -249 289 104 -289 -113
2531 -113 248 -165 -49 67 79 -81 175 -270 -283 -92 -174 -304 -173 394 -434 -180 163 -95 -293 -63 -60 -355
2553 -355 -83 -2 -277 -195 32 -487 -185 41 -402 -270 56 70 -201 130 60 -96 46 148 -235 -129 1
2574 1 -95 -206 460 93 -84 42 630 -229 -2 -35 -504 -124 518 -25 -372 506 245 -100 340 197 -416
2595 -416 400 622 165 111 429 84 -215 234 162 -153 542 147 -331 -71 389 -370 -352 445 209 -173 136
2616 136 -34 -319 486 314 -464 -30 564 -461 -650 638 -103 -391 456 -376 -705 454 306 -1054 2
2635BM75q85o2R15p75j6P88p30o27J361L58j454J12J041r35K8P92q02j8J026o18
2656b4j067J245Q79j560J67R34o85l3P71j067j57J510m26j669J553R04j664LR97
2675F11r94J09J323j597n07K226m98j729J090R46j234K51O65j305O74J649j717
2692c7j260K277J63j967Q35N48r65R56N46j813J85K379j894j498J989P44j517
2709c29J74N34j059Q54J250k588l34K894p62k342J626J029j699J046j0j604J324
2726DJ601k479p10K624l92k156J580L24j011J231P6k500J384K283k357j459K660
2743G03j90j505Q27K2p43J661O71l082O82K911j883j593K310k35j270J368n51
2760A03j712K453J083l301J11L038j361j365J449m61n31J576n10k608K395J865
$$ plain form
2635 2 477 -408 -470 445 -330 -346 442 -288 -915 446 804 -650 -538 503 -432 -404 388 -414 -432 594 -24
2656 -24 -1091 154 1033 -527 -360 574 -111 -144 627 -440 -597 913 487 -1182 371 1275 -389 -386 611
2675 611 -383 -274 1049 -548 -1055 1171 673 -1056 34 980 -254 -3 662 -643 31 1680 -37
2692 -37 -1297 980 1143 -824 11 559 -406 550 1096 -717 -532 1847 -47 -1545 444 1188 -329
2709 -329 -155 379 -680 174 1424 -1164 -1498 1396 634 -1708 -82 947 -752 294 284 -1320 4
2726 4 1605 -874 -1584 1040 648 -1508 72 396 -615 616 692 -1808 -424 1859 -498 -1957 703
2743 703 513 -992 -165 -143 -886 775 1446 -1636 -954 1957 74 -1519 791 556 -714 654 103
2760 103 -1609 844 1927 -1374 -1263 1775 414 -951 498 37 -494 1082 572 -2036 359 2224
2776B224l106m81K553p62j263J505p81j090K743o50k706J421K588k659q56K338
2792A018j011m99J637j507j146K911o0l218J260K364j850o70J497j336K58J945
2808A593j847j838K958R02l361M59K360j117o41J284j638j57K753j284k517K401
2824C10J472k969O9J814j075K64J078k086k52K785n01k935J769J795k105J80Q92
2841E05j108N42J832k614q64L068l79k430Q89J710j750L88J113j936P19K150j619
2858B16j937K732R7k077P85J127j491Q45P59j756l9K589j316k099J955P98k020
2875h32N23J035j392J143P46k102j31K542o95j961J291M89q96N03l0j354J408
2892B87J061k070n73K159j25j588P32K90p52J034J57j707M82J743j341j434K127
$$ plain form
2776 2224 -882 -1363 1190 428 -835 670 -111 -1201 1542 892 -1814 -393 2195 -464 -1320 1018
2792 1018 7 -492 1145 -362 -1508 1403 1343 -1875 -615 1749 -101 -771 726 -610 -352 1593
2808 1593 -254 -2092 866 1768 -1593 -1134 1226 109 -532 752 -886 -1043 1710 426 -2091 310
2824 310 1782 -1187 -1118 696 -379 -115 963 -1123 -1375 1410 909 -2026 -257 1538 -567 -387 505
2841 505 -603 -61 1771 -843 -1707 1361 982 -1448 -559 1151 -599 -211 902 -1034 -315 1835 216
2858 216 -1721 1011 1108 -969 -184 943 -548 297 1056 -700 -739 1850 534 -1565 390 1188 -832
2875 -832 -309 726 -666 477 1223 -879 -1010 1532 837 -1124 167 656 -240 263 233 -1121 287
2892 287 1348 -722 -1295 864 739 -849 -117 173 -579 455 612 -1095 -613 1130 -211 -1645 482
2909D82l3j079N62M94j158Q54L87j428K93J694j256p12J231J59j023P16k61n37
2927f15O46R75j957K2J829o23r94J024j00p60J088J2j341R65R73j484n92J747
2945H15m64q75R53k01p56J003R6j318M49J274j207m49J113k11o55O35j20o13Q82
2964C51L57j274K30J118q10m61R51l06m47P53k40p82O91O46j180L11O64o92k39
2983c59N27k18m39P43l63k34L56J57o31O7R50o43p1M64m56j54O51l10o11N44N3
3004B3j76j40N50m64J75K52j30k92L78j63o12K61O89l93k44K97m0j59L21q1l54
3025c02M84j11j64K26r4o8J69j25J5l83L96P1n64N57J76l69J76L59m81K54r4m
3047A24J53K1j30l67K98R4q3K2J84k98K0K90k93j63L44q0L9j43J99l27L15J03
$$ plain form
2909 482 449 -630 -68 426 -732 122 509 -919 -626 1068 -188 -900 331 490 -533 183 -78 -615
2927 -615 31 1006 -951 -929 900 277 -717 307 207 -553 535 547 -794 171 1144 -340 -932 815
2945 815 351 -524 429 228 -528 475 571 -747 -298 976 -231 -680 433 222 -433 202 82 -531 351
2964 351 708 -566 -336 782 -28 -489 462 156 -291 462 222 -560 131 777 -403 -92 572 -120 -359
2983 -359 168 -50 -489 254 -109 -343 13 170 -461 -394 556 -87 -158 306 -150 -304 347 37 -574 -30 23
3004 23 -153 -293 257 -207 -32 220 90 -202 176 13 -599 -338 351 -42 -286 11 -29 -188 133 52 -302
3025 -302 182 71 -93 133 39 -29 140 15 30 -353 43 114 -450 107 283 -86 90 449 -32 222 128 124
3047 124 277 298 168 -199 99 193 110 132 316 18 38 328 35 -128 216 136 175 32 231 -96 219 322
3069C22l67oJ48k15j43L36m6k62L47n0k63K11q2R7k62M13k23n5J87j91j82M17
3091A31P6m81kM22m25J95K15j06j52J48J9n6j54L24l88J22L49k35rm3K83k45R5
3114H3j64p4J29K04k00j43J62O4P5J60l67NL27J39n71K14K46m39L5M79m04j41
3136a81P18p07j93K37K03l10J00M61q9oL03p16J81J44j65l30O06j89k81L16J60
3157B62l49j10M56l91k54R61m83k71K1J91l05L24M70q44J62P04n67l30N07M5p95
3178e96P06j97m27J86N06q92L50R60p82m80Q32j38m67O41j41n31J09R25j283K25
3198d94J052o62j35O57l74j89P33n67o83O52Q33j267N0O72k42k76O32m58j63P99
3218E70O7j397N84R81j208P9N91k6m97Q50p10n28J058M24j531O33N97n92j12O10
$$ plain form
3069 322 -45 -51 97 -118 -261 75 29 -233 114 64 -199 12 -70 27 -235 178 -45 -100 87 -104 -286 131
3091 131 207 -274 -276 146 -279 -84 131 25 -127 21 40 -16 -170 154 -234 -112 237 2 -7 -50 233 -12 83
3114 83 -81 -155 -26 178 -22 -165 -3 61 136 296 -71 -66 261 400 -171 43 289 -150 -115 364 -40 -181
3136 -181 537 -170 -363 -126 77 -233 -133 328 239 233 536 -180 1 145 -20 -350 256 67 -214 102 262
3157 262 -87 -197 259 -132 -386 575 92 -179 -158 33 -272 52 522 -322 -160 544 -23 -353 154 199 -596
3178 -596 110 -87 -514 -328 178 -714 -364 596 -186 -666 166 28 -439 202 61 -470 -361 564 -719 -494
3198 -494 558 -104 -239 418 44 -145 588 21 -662 -10 823 -444 -394 278 36 -240 392 -66 -229 570
3218 570 637 -760 -176 805 -403 -324 267 241 -256 594 -116 -644 414 838 -693 -60 537 -55 -167 443
3238D43o09j38R91n11q76J318K10j394M45M72l07l03P45p94k26J466o67j417J188
3257C6O38j027o1P84q78K68J158j221o59J758m32j369R03P04j008J51P00j370
3275i25Q48J190j453r47J809J23j583O45R68r87J20R18j509j1J798j057r86J699
3293F60K38j547O83P4q50R17O33j597j18J778n72j364J177O40j401R20j25j070
3311i24Q36J382j828k52K088p66j506J201J05q53Q53L88j679N86K000j829r10
3328a108J876m10p37M71L13j082J115N33k071P13J894j412j178J406J82j114R21
3345C12M9j439J483P88k259L54J776r71j204J201o7o65J288o37j278J393J032
3362A156k144K77J228k69j001J228n92p94J617j97j951J345J340j760l69J437
$$ plain form
3238 443 -166 -304 687 176 -700 618 828 -566 -121 351 44 -259 486 -308 -534 932 265 -1152 36
3257 36 674 -353 -414 370 -508 -240 918 -303 -962 796 364 -1005 -102 602 -406 -255 445 -925
3275 -925 -77 1113 -340 -1287 522 645 -938 -293 675 -312 -192 726 -783 -794 1004 -53 -1039 660
3293 660 898 -649 34 108 -742 175 808 -789 -907 871 299 -1065 112 752 -649 271 146 -924
3311 -924 -88 1294 -534 -786 1302 536 -970 231 336 -517 336 724 -955 -369 1631 -198 -1108
3328 -1108 768 358 -379 92 405 -677 438 971 -1100 -387 1507 95 -1083 323 505 -609 312
3345 312 361 -1078 405 1193 -1066 -712 1064 93 -1111 90 23 -642 646 9 -1269 124 1156
3362 1156 -988 -711 517 248 -753 475 -117 -911 706 509 -1442 -97 1243 -517 -886 551
3378E51o27l38J198j016n02J697l62j796O79J520j096l79R19n15m03J437q10j271
3396a114J477Q71k227O06J170j081l38J382q45k56J495n78j798J493R89j875J07
3413e22J084q62L6R00q78m33J558k40j627J079O39j203L2J006r42L4J334j042
3431d7r45J878j74j544J024O66j168J43O02r32J09J254o68j231J456N01j755N45
3449b86P91j081L30M59n26l56J397p82q14R31J84o37J14L85n01L35Q20j296k06
3468g39J328k31j045Q62K11n07M8L18o96K91Q17j107l16J177K12j371Q40M79q66
3487b95M08J28q22M37Q81r98l93J058l15l81N49O5n71M35M08q30L44O36o26l97
3507b79N21j34m57M47K08o36M79L02o82J20N27l48m57K40M69o14L77R8o64M85
$$ plain form
3378 551 -76 -414 784 -232 -734 963 601 -1195 -516 1004 -92 -471 448 -67 -470 967 157 -1114
3396 -1114 363 1234 -993 -387 783 -298 -636 746 -99 -355 1140 562 -1236 257 1246 -629 -522
3413 -522 562 -300 -264 636 -242 -675 883 643 -984 95 734 -469 -437 569 -373 -339 995 -47
3431 -47 -992 886 712 -832 192 858 -310 -167 435 -497 -388 866 198 -1033 423 924 -831 -286
3449 -286 505 -576 -246 213 -313 -669 728 -54 -868 63 247 -390 -276 109 -392 -57 763 -533 -739
3468 -739 589 358 -687 175 386 -121 -73 245 -451 -160 657 -450 -766 411 623 -748 92 571 -295
3487 -295 113 241 -581 -144 737 -261 -654 404 89 -292 257 322 -249 186 594 -236 108 744 118 -279
3507 -279 242 108 -349 98 306 -330 149 451 -231 -111 416 68 -389 -149 320 -294 83 181 -483 2
3527BK87m76j68N03r1j55J41J58m06J17J43m16L19J42l23K8K60n3j43J37j85k98
3549d77L87J65m01K46N38n30l05L93k22J31J58k6k15pK37j96j53P50k42l22J22
3570C1o6k05L46Ll11L99p8n7j26J18j7K46l24N2k21L64Jj62K2L47n97K31L22j39
3594A79p2K92k68Rj8K68n93J81J22Rl30K86P7j59J82l01k62L40K01l48L35k8m6
3617E6O4k7K28n59M93j05m69L26K29j83k16L90n23J35L75j48Mn8J1k16O8K22l22
3640b25J63J01n9l22M42N9k50K50J8k52P8J13k26j48L08J49l99RJ77l98N68j22
3662C4j03l9K16k51m5L30k54K7J17L36o26L33M6m88O02K23m91J93K21n51J41K78
3684B49j17k36K48L66q32M00M14k76k99J69j58J20M57l74m10L22J12o37O51j5
$$ plain form
3527 2 289 -187 -355 148 57 -98 43 201 -205 -88 55 -361 -42 100 -223 -195 65 12 -131 6 -179 -477
3549 -477 -90 75 -326 -80 458 -72 -377 16 -206 -75 83 57 -158 -165 72 -124 -277 473 231 -91 31
3570 31 -35 -240 106 109 -202 197 119 62 -64 54 37 283 -41 11 -210 154 155 -7 15 362 -235 -4 318 179
3594 179 107 399 131 140 122 390 -203 -22 100 109 -221 65 142 -17 165 -136 -398 -58 143 -205 130 102 56
3617 56 120 93 321 -238 255 150 -319 7 236 53 -163 227 -296 -161 214 66 70 12 23 -193 -125 97 -225
3640 -225 -62 39 -20 -342 100 159 -91 159 177 -75 3 116 -110 -258 50 199 -200 -191 -14 -412 156 34
3662 34 -69 -108 108 -143 -188 142 -112 -85 32 368 -258 75 121 -367 235 458 -33 160 381 -170 -29 249
3684 249 132 -104 144 510 -322 78 492 216 -83 86 -72 48 505 131 -279 43 155 -482 169 154
3704A54j87J1q5JJ1L64j70n17N24J72o91K70J42j69n1M71l84k2M15k04m85O59
3726B29l1m68J44N33o92J93K83n06m3O37J7r11M59K91o23O99L1n46J63M00l49
3747i0l84O52L01p46M18j68k40M50J74r27K18R90n51m29N65K2m95L17J29n51O64
3768C19J75o29K5P39l22o44O13k76l33P76j19p75N36M48o91m55R38q5n44P41l09
3789A28m82N91n8r36P37P28r57l34R13q1q53P65l2n37P87l3j226N02J087r01r3
3810b85M68k56j19K00p2p68J200J28r92J22P78l93l76P04o57r4J008k99j076P72
3830gP10r59k18J002p36j38O46o88k46R19J36j236N17Q16j032j7J222q06p7P25
3850E33p04o29J176M87j588N23J172j115M5O78q94P0J167q42r86R63O03j048K91
$$ plain form
3704 154 -33 -22 -107 -106 -95 269 99 -418 106 278 -413 -143 -1 -170 -221 250 -134 -156 259 55 -430 229
3726 229 198 -270 -126 407 -285 -92 191 -315 -358 279 296 -615 -156 135 -488 211 242 -304 -141 259 -90
3747 -90 -474 178 479 -267 151 -17 -257 193 367 -560 -342 648 97 -332 233 255 -240 77 206 -345 319
3768 319 494 -135 -110 629 307 -337 276 0 -333 443 324 -451 85 533 -158 -613 325 240 -304 437 128
3789 128 -354 237 179 -757 -20 708 -249 -583 330 249 -604 161 129 -408 379 346 -880 -378 709 -192 -285
3810 -285 183 -73 -192 8 -64 -832 368 496 -496 -374 404 11 -365 339 -318 -412 596 297 -779 -7
3830 -7 703 -256 -474 528 -208 -346 300 -388 -634 285 421 -815 -298 518 -514 -531 691 -115 -192 533
3850 533 -171 -800 376 863 -725 -202 970 -145 -100 578 -316 -246 921 79 -907 56 659 -389 -98
3869i8N03m22j66Q87j065j98J605j085r55J111N16r00K73J71n04K53M93p56l47
3888f84J482m12j311J005J01o15M80L94j034L31R90j002o51J700j88j402O42P18
3906E44q62N18M74j398K96J206n79p80N73N83r98N17J25r64P97M97j078j88J319
3925F02m46r53R59J50p87P19j1q73N69P72j314K01R70j17j006Q15J97n74L75J12
3945C60r12N23P55j031r3R43l38m88L10R1n81P51K65j366L93J421r33m38Q06n40
3965a02k63N40j88o69Q54M53j359R9J319o13n90Q16l01l69P90m92p66Q65O98j187
3985d65n4J013o46j78N79l42j16O91o0r46L39O74p09j03Q34o06k64K70J42j82
4005a29M27P6q88K60P51n23j52K36j24k96P21m80n49R27J45p59K73P03o58j51
$$ plain form
3869 -98 405 -17 -183 704 -361 -559 1046 -39 -994 117 633 -267 6 177 -327 -74 419 -337 -684
3888 -684 798 386 -925 80 181 -434 46 440 -594 -263 727 -275 -926 774 586 -816 -174 544
3906 544 -318 200 674 -724 -428 778 199 -581 -8 575 -423 94 219 -745 52 549 -529 -717 602
3925 602 156 -797 162 312 -475 244 233 -640 -71 701 -613 -412 558 441 -565 250 447 -127 248 360
3945 360 -552 -29 726 -305 -398 545 207 -281 29 120 -461 290 555 -811 -418 1003 70 -368 438 -102
3965 -102 -365 175 -13 -682 172 625 -734 -635 684 71 -519 297 -4 -373 417 -75 -841 24 722 -465
3985 -465 -519 494 -152 -330 249 -93 -209 482 422 -524 -185 489 -220 -323 511 -95 -359 -89 53 -129
4005 -129 298 374 -514 -254 497 -26 -178 58 -66 -362 359 -121 -670 257 402 -357 -84 619 -39 -190
4025a90L01r4m13Q75k23p97P00K70o42J00L28k33j08M96k42q0K76o4n22K62M82
4046D82p83L06K68k92p7O17p09l69J064m35n86L55L34j96j40K58n52L57N28m31
4066aj04K68O0n89L00K29l99J30L49l69L3L22j79k49M42j51k32J54K54m72O8L21
4088A85p3n69M19K22n18M23j25p8J43J78n10J87L95p7m25K74J82m21K82J12o22
4109d16N58j75J1k26O19k95j96M09m4n46K73L5j09r2K79m5j51M58m27JR9o5q1
4132a26K18O5k02q2N89l27k82Q2J07j69L00Nj94k3k1K6m8M76k58J3J12k63j28
4155a30J79J5o3q7K72k86o6K87k23K83k99m9K54M4r7j3k57L60j91j24M21k08k92
4178b70Q9R2j06J30J14J7n2j37J99j02J77m5j42M7M25m53J17l2k83P4L89n6k63
$$ plain form
4025 -190 111 17 -396 479 256 -541 159 429 -213 -113 215 -18 -126 370 128 48 324 260 -262 0 482
4046 482 -301 5 273 -19 -96 521 -188 -557 507 72 -514 -159 175 -21 -161 97 -455 -98 430 -1
4066 -1 -105 163 223 -366 -66 163 -236 -106 243 -126 -93 229 50 -199 243 92 -140 14 268 -204 -136 185
4088 185 112 -457 -38 184 -334 89 -36 -114 29 207 -303 -116 279 202 -223 51 233 -188 94 206 -416
4109 -416 142 -33 -22 -248 371 76 -120 289 245 -301 -28 7 -102 -194 85 40 -111 347 -80 -79 20 -45 -126
4132 -126 92 157 -45 -127 462 135 -147 -65 42 -127 173 178 -16 -39 -60 -34 -82 394 136 149 261 -2 -130
4155 -130 49 64 1 -86 186 -100 -166 121 -102 181 -118 -167 87 131 34 21 -236 124 -67 -191 230 22 -270
4178 -270 -181 -89 -195 -65 49 66 14 -123 76 -26 151 106 -36 11 436 -17 100 68 -215 -141 248 192 -71
4201g1M5k46K09K58l24O9J73K18k03j20L81p04L60P3j26j48K72K78l52L2J33K5
4223B32J58m12J2J15J14k23j49J73R6n48L46J35q4L59l12j48J11J20j08k88M16
4244A15p0k25L96J43n92J96K67k99R0L15l85p0J23n8LJ39k17k00M54J30k47O6
4266G4K49l94r7K13Q8k55Q1K74k60J61K5m17J22J90j97n0L27l02j22L97K10n99
4288b82J04L52l93Q1L39k07l52O26j40p54O61L77q01K47K46k38P6L80l71l01P47
4309C97m4n22M8N10n91L3j2J87r5N30l40o24R59o5n26O2L78m95K28M32p87J47
4331a90P20o99m36J065r3n32K17M7m18J04M14l19k62Q05k12p20O27j05k91L59
4351H1J39m80J8O36p05K33L39j56k87j65O34n56K58J96n11o7P69l34m10O60K5
$$ plain form
4201 -71 -26 -272 -63 195 -129 -60 113 331 128 8 389 -315 45 118 -8 -156 116 394 42 74 207 232
4223 232 390 -22 -10 105 219 -4 -153 20 116 -432 -86 49 -35 324 12 -136 -25 95 -13 -301 115
4244 115 45 -180 216 359 -233 -37 230 -69 21 336 -49 -119 4 -54 -51 88 -129 -329 125 255 8 74
4266 74 323 -71 -168 45 133 -122 -41 233 -27 134 159 -258 -136 54 -143 -193 134 -168 -290 107 317 -282
4288 -282 -178 174 -219 -138 201 -6 -358 268 128 -626 35 412 -389 -142 104 -134 -58 322 -49 -350 397
4309 397 353 -169 -121 389 -202 -169 -181 6 -89 441 101 -523 436 371 -155 -93 285 -210 18 450 -337 -190
4331 -190 530 -169 -605 460 367 -165 52 99 -319 -215 199 -120 -382 423 211 -509 118 13 -278 81
4351 81 220 -260 -242 394 -311 -78 261 105 -182 -347 287 -269 -11 185 -326 -393 376 42 -368 292 317
4372C17p10L07M85p27N39K12j036M27R40p29l46O72l40k80L37M52r08Q61q4q17
4392d28J70P13k67l48J07J90m66J036n35p18N65N19q58j07R35k31n04N58k51l49
4412b69M19n9m45L91O95q58k87P03j70k12M08j68p12R40Q8q95k3Q80o33k60O36
4433A69k19J3M28j97o13P68R3q62k0O32k7l94M89j38o12P92q1p67N63N21p04j61
4455c27M21J4n50P78n38p0P01k56q67Q40L41o88L12K24j46m88P63k94o75R00N3
4476D48q55J07Q60o16j65L89k45l40O30l13m40N27J49k27k60Q15n23j01L72m48
4496b36o9P26m01o54Q55J49m55P6R0l26K18L54n21j56Q19P9r23M43J50o02P5M69
4518A60m25K03L90k33n92Q69L22j065L89K11o54M41P0j79J00L48m32l68L85K96
$$ plain form
4372 317 -393 -86 399 -328 211 423 -613 -186 754 25 -321 351 11 -269 68 520 -388 473 389 -428
4392 -428 -258 455 188 -160 -53 137 -329 707 172 -546 19 538 -320 -427 508 277 -227 331 80 -269
4412 -269 150 91 -354 37 732 -126 -413 290 120 -92 316 148 -564 376 464 -431 -454 426 -207 -467 169
4433 169 -50 -37 391 194 -419 349 442 -420 -440 192 165 -229 260 122 -490 302 221 -546 17 538 -166 -327
4455 -327 94 108 -442 336 -202 -272 429 173 -694 146 487 -201 111 335 189 -299 464 170 -505 395 448
4476 448 -407 -300 560 -56 -221 168 -77 -417 213 -100 -540 -13 136 -91 -351 464 -59 -160 212 -236
4496 -236 -305 421 20 -634 221 370 -85 -9 81 -245 -27 327 -194 -350 469 548 -375 68 218 -384 -309 160
4518 160 -265 -62 328 95 -497 372 694 -371 18 229 -425 16 86 -93 7 355 -77 -445 -60 236
4538B36k92j55N01l01L7K65m63j56N32k83m54N32J12j69N8K27m83O4J12k90j2
4559c82N75l2n15L60n1r4J47j27j46L22K81m75k4L94l71j14J90J35m81M15J17
4580A24k49j9L66j70j99K70K4k48Q0Jj58R2N24n50J24J38k96J56L5L03m83P3R0
4603B8l23L35j4l05K69J07J08n29M64k65j05K62J41k38j41N18l37O0l7K60m32
4624a74L35k73q1J66K64l39o9J00J00l32M07M6l4L7m03O5J64K63k16k17K28j11
4646g4j97M06M8j15k48K41k84L8K50J9q1J4K2l8J62k41l2K55j05j53JM64m28J55
4670G9N8k61K00Q5k41O6L5K11l96Q0j8j3pM36k91k59M31l24Kj61O6K3P4J26k04
4695b03K00J32n3j85J60O3k10q2K54p9j35K11j29m1n2J55n2k7J02j84p9P2n1K86
$$ plain form
4538 236 -56 -211 290 -11 26 291 -172 -328 204 -79 -533 -1 111 -58 0 227 -256 -192 -80 -370 -382
4559 -382 193 161 -354 6 -45 -139 8 -119 -265 57 338 -137 -161 233 -138 -252 -62 73 -408 7 124
4580 124 -125 -144 222 52 -147 123 147 -101 -21 -20 -178 -86 438 -112 12 150 -146 10 45 348 -135 -62 28
4603 28 -295 40 26 -279 -10 97 205 -324 140 -125 -230 32 173 -65 -206 312 -25 35 -2 258 -174
4624 -174 161 -112 -193 -27 237 -102 -171 -71 29 -303 104 150 116 153 -250 -185 -21 242 26 -191 37 -74
4646 -74 -271 135 183 68 -180 61 -223 -185 65 84 3 17 39 1 163 -78 -110 145 40 -113 -112 352 -76 79
4670 79 137 -124 76 161 -80 -14 21 232 -164 -84 -102 -115 -122 314 23 -236 195 -129 -127 -288 -222 -199 -125 1 -203
4695 -203 -3 129 76 -109 51 114 -96 -178 76 -3 -138 73 -56 -97 -149 6 -46 -73 29 -155 -234 -162 -213 73
4719G3j11j60r2L10J62l44J55J48j44j21R4j04J75K40j49j74j22J12j06K14k14
4740a58K5K40k9j24q2K36j49j9l8J71j91M06j39k11jK01j30J8J12n2k04L06j77
4763A1l7K30j07k39N0J74j77L57ml52j3K09J17m18K75P2j69l12N48l55J15J94
4785A69Mk11K37j26l56J95N1k32J69J2Q2r5K18j82j80O14k75j30K43j44k05j49
4807b91J22L19m05J07J97j61K03J09m91L48j00kl4L03n39L55N3o2l5K09l75j11
4829b81J98L52l77K50j87K45J67r4m28q1M25l42K64j96K79n90O11j80k20J64K51
4850B30k48k09L34M5k87K51k06o6K76K20n82L9O15j15o94L04K14k74K83k02k40
4871c12P3N53j65k82N13l60k39L19l4k33K71K28m66K9M93o21J29J66j51m1L22
$$ plain form
4719 73 -38 -198 -290 20 182 -162 -7 141 -3 -124 -30 -134 41 281 132 -42 -164 -52 -158 56 -158
4740 -158 -133 107 78 -46 -128 108 -41 -60 -98 73 -118 288 149 -62 -63 138 8 26 138 86 -118 188 11
4763 11 -26 204 97 -142 -92 82 -95 262 258 -94 -107 102 219 -199 76 148 -21 -333 215 -140 -25 169
4785 169 173 -38 199 73 -283 -88 -37 -269 -100 -88 -6 -101 117 -65 -245 369 94 -36 207 63 -142 -291
4807 -291 -169 150 -255 -148 49 -112 91 200 -291 57 -43 -45 -79 224 -315 40 93 31 -4 205 -170 -281
4829 -281 -83 269 -108 142 -45 200 367 273 -155 -236 189 -153 111 -85 194 -396 215 35 -185 -21 230
4850 230 -18 -227 107 152 -135 116 -90 -156 120 340 -242 -203 412 297 -397 -93 121 -153 130 -72 -312
4871 -312 -239 314 149 -133 380 20 -219 100 66 -167 104 332 -134 -105 388 -233 -104 62 -89 -130 192
4892A92nl67K01J48k75j90K97J7l80L48p9r1J95r6j99N6O26q99M87M35l60l18
4914b57L03k43k36Q85j51o94P25M5m14k23K89l11K76J67l93k6N83o4n46J77N12
4935D04l61k5Lm72N29%O7n00P17K8m30j51N61l44J8K18m51j00O01J8o29K39K39
4958A79n76K03L36m18O6K20N7m31O51l29j83J68O5j11J80j1k89J74O31o19l58
4979c95P01j20j44K3l0k34K74K35n75J71N51p40K6N49j42m39L85Ml63J89J90m75
5001c59M40K54k13n12L04K33j50Q2q2k57L31M08o64m9O53n42k50N74k75R3j40
5022a21J89l49K01J93k12l09N88rm21L01r3J8J16J70n62K83L09l24l51N30J25
5043B72l05R7j33k12N75K43q67K34K63k91k81L87j59j10M30m50N1K92K23p32L66
$$ plain form
4892 192 187 -180 21 169 -106 -296 1 18 -362 -14 -93 -184 11 -85 -284 -228 398 -501 -14 421 61 -257
4914 -257 46 -197 -433 452 301 -393 332 377 -37 -260 29 -282 -6 161 -232 -258 325 261 -285 -108 404
4935 404 43 18 21 -451 78 78 145 -355 362 390 -40 -191 370 26 44 262 -189 -289 312 330 -299 -60 179
4958 179 -397 -194 142 -276 -210 10 67 -364 287 -42 -225 -57 8 -103 77 66 -223 -49 582 -37 -395
4979 -395 306 186 42 65 35 -199 75 310 -265 -94 457 -283 -257 292 150 -289 96 100 -263 -74 116 -359
5001 -359 81 335 122 -390 -86 147 -3 79 -3 -260 71 479 -185 -234 419 -123 -373 201 -74 19 -121
5022 -121 68 -281 -80 113 -99 -408 180 171 -250 51 -42 -24 92 262 -300 -17 292 -32 -383 147 272
5043 272 -33 64 -69 -281 294 537 -330 -96 167 -124 -405 -18 -177 -287 143 -307 -256 36 259 -473 -107
5064a07L96l36J36m7k85J47R2K18n94M51L65n86k8K56J60n50L32O9l69M96J69
5085C85p06L51J30l88J91Q8Kj8L6rk31J27L64o91K81L42k81l5K19n3k59L19j7
5108A47n77P09J86p45J53N53l23KJ08l08k8K70p2j54J54K44k91q1K73j4m02K38
5130D2q4j64K92j86k15K95P9J44k90L62l79j67L94j22q8L64j8k09j28J39j6j20
5152g5K91j03j69J93M1m69J56k2N3l9K46n33K88K53n69K49R7K19R5j1j56L3p8
5175a0j54K05j56R2j12M5J38Q7j96O1J16k29R7L30l81O9j79O0qL33J38n48K77
5198G5J07l77M38%l62J48J19k2j80j7K75k28Qk07K76r4Q7N6q9J14j92n7K78l7
5222A19l40L67n5k36K59k79j26j2M12j80O9P9j93q2K66N0k42K52j10P1m0n5R3
$$ plain form
5064 -107 289 -47 89 42 -243 -96 -4 214 -380 71 436 -150 -178 78 238 -312 20 89 -280 216 385
5085 385 -321 30 160 -228 -37 51 53 35 71 62 -169 -42 322 -369 -88 254 -27 -62 157 104 -155 164 147
5108 147 -430 279 465 -280 -127 426 103 105 213 -95 -123 147 75 -79 75 319 28 -53 220 206 -196 42
5130 42 -42 -206 86 -100 -315 -20 59 203 -87 275 -104 -271 123 1 -87 277 259 50 -78 61 45 -75
5152 -75 216 113 -56 137 178 -291 -135 -157 -104 -143 103 -430 -142 111 -458 -209 -112 107 202 191 35 68 -10
5175 -10 -164 41 -115 -23 -135 -90 48 135 -61 0 116 -113 -16 314 -67 2 -177 -117 -125 208 346 -202 75
5198 75 182 -195 243 243 -119 29 148 126 -54 -71 204 -24 -16 -223 53 -41 46 102 13 127 -65 -122 156 119
5222 119 -221 146 91 -145 114 -165 -291 -303 109 -71 -2 77 -116 -198 68 118 -124 128 18 89 49 -6 87
5245H7j55q9P5L33k65L6K60p2l17L08J14l55Q5n0j24Q3j99N6J82Q4r6J74N4m72
5269b63M84n57L95kk01n7M5K29l00n4L16J67k76p7n6L78k69J76j8j31q5j93M83
5292A34J95j99N1J46j84k00K56m2j26J53J00m58M73k19m5J07p2J45k46L22k91
5313@k8J06m1l60L22J91J08l62N7L0j02J20n2l36N12J89m19j20M72k64K59j03
5335A79j83j19l0J52K02q6Pl2o8j14q6K64j95N8k20J6L75j75q2M4J05k70P6mN9
5360a27J15J43l78J75K32r8j71J81k32J30L2Lj11J7k6qJ48N6J4J38j91j61J22
5383CQ2L1l39M44j39l06K51j31J77J6k60M7K85M4L3l63K88Q5n26K39l7N1j25K18
5407F8k34L9K42N8k93K78Q3j91j52K82n8j69J80l54L30p4J75m88J37J60j63P9
$$ plain form
5245 87 -68 -157 -82 251 -14 22 282 210 -107 201 315 -40 45 -5 -129 -46 -245 -189 -7 77 -19 155 209 -263
5269 -263 221 -336 59 57 -144 -201 -156 73 -227 -281 35 202 -74 -151 -207 171 -98 78 60 -71 -156 -349 134
5292 134 329 130 181 327 143 -57 199 157 31 184 284 -174 299 80 35 142 70 215 -31 291 0
5313 0 -28 78 37 -323 -1 190 298 -64 -7 23 -79 41 -11 -347 165 354 -65 -185 287 23 282 179
5335 179 -4 -123 -153 -1 201 115 122 90 22 -92 -178 86 -109 -51 -271 -255 120 -55 -137 -93 12 -258 -182 -186 -127
5360 -127 -12 131 -247 -72 160 62 -109 72 -160 -30 2 5 -106 -89 -115 -123 25 81 95 233 42 -119 3
5383 3 85 116 -223 221 82 -224 27 -104 73 89 -171 -124 161 205 238 -125 163 248 -278 -39 -76 -25 -150 68
5407 68 -166 -127 115 173 -120 158 241 50 -102 180 122 -47 133 -221 109 35 210 -278 -141 19 -144 -65
5429f5J71k13K96k00R3k68K26J58n26J89O4k8K25j86p3J72N3l3l45O7N1J01L0
5452d1qK18k81O90o20l3L84r4l37J27J20o6K28k55j8k01J58k03q4N94l19j37K10
5475C2J07j69J06j44j19m0M04j28l03M75k70q8K10J33l8k9L50o74M00J15k00m00
5497b70K50K8q4J20k80n0K50K72m27j31O35n2m52L15J07j29M3k5l85M69Ql60J14
5520c4N6Q0k27K55k7j50J85j00p4J05K34j5n63R5L32j95K06j89k64M00Lm93J02
5543b78Q23m98l23M16r3L9P5l08K20j61J91J9n2M4l80M66j08k44J8K76L14n62
5565a06N16P1n04J10l5m50K71L94o8k25J27j22k9o2j2J54k21J52N2Q8m7j19j84
5588b49N52O3n33J87J10m04K57J84l51M08M9n27N5K67N6l05J00K34j60k02J46
$$ plain form
5429 -65 106 -107 189 -11 82 -186 40 198 -328 -139 -75 -103 122 -64 -137 35 88 55 -290 -223 -172 -71 -41
5452 -41 -49 169 -112 578 -42 -75 309 215 -122 5 125 59 287 32 14 -187 -29 -232 -316 278 -41 -178 32
5475 32 139 -30 76 -68 -187 -227 177 49 -254 221 -49 -137 73 206 168 139 489 -185 215 330 130 -270
5497 -270 -20 8 -76 44 -236 -286 -36 236 -191 -322 313 261 -191 124 231 102 145 120 -265 204 212 -148 -34
5520 -34 22 102 -125 130 103 -47 138 38 -36 69 303 288 -275 -180 152 -43 163 -26 -290 110 113 -380 -278
5543 -278 545 47 -276 140 47 86 161 -147 73 -88 103 122 70 114 -266 200 92 -152 -134 142 456 -106
5565 -106 410 481 -23 87 52 -398 -127 267 199 -26 101 -21 -50 -112 -124 30 -191 -39 13 101 54 -65 -249
5588 -249 303 366 -167 20 130 -274 -17 167 -184 224 273 -254 -199 68 124 -181 -81 153 -7 -209 -63
5609f3q5k6K91o9j31k04L45l81J82J8K1J09j3j52Q4J39k85j08L22J81k6k74J05
5632b0P9j15L00m46j7L01L7j69L53l27J6n0j2l3o3N07j02l84K29J02n11K54j7
5655h8j68N02l9m74Q0L63l37J66N9L5j94L33k37l9K25j57O5M4j19J37l49K23J74
5678B05k36l6L64m62K40J29m37j49N89j17l79M53j25j88K95n3j2J1N4r8k45K39
5700D2o3j80L27l69k17L68J81K67o03L72n95L02N0K77k44J56j74j24J39j03J50
5721d1N5Q5l45J52j5m2K05l09K61k24J72N3j59J73P1K6l13J76K12o3m7l42K18
5744d1o0K00o8j86L27p5J06k69J15J16j96P6j72kN3kp6J62L1l7j18L79m67J52
5768e2J70o0p4L6o8Q7n3L20l48O2lJ57k29Q9O3j26M5J32l89J21K52k35L30j82
$$ plain form
5609 -63 -148 -174 117 48 -83 -287 58 -323 -141 -123 -102 7 -6 -158 -74 65 -220 -328 -6 175 149 -125 -20
5632 -20 59 -56 244 -202 -219 82 119 -50 303 -24 -8 -58 -70 -103 -166 341 239 -145 84 186 -325 -71 -88
5655 -88 -256 246 207 -267 -187 176 -161 5 64 99 -95 238 1 -38 187 30 95 139 20 157 -192 31 205
5678 205 -31 -67 297 -165 75 204 -233 -382 207 90 -289 164 39 -149 146 93 81 92 146 48 -197 42
5700 42 -21 -201 126 -243 -460 -92 89 356 -247 125 -470 -168 -118 159 -85 71 -103 -227 -88 -191 -41
5721 -41 14 99 -246 -94 -109 -151 54 -255 6 -218 -46 7 -152 21 92 118 -195 -19 193 130 83 -259 -41
5744 -41 -101 99 31 -155 172 97 203 -66 49 165 -31 45 -127 -129 -76 -78 -154 8 39 2 -116 263 -204 -52
5768 -52 118 58 -16 20 -48 39 -14 306 -42 20 17 174 -55 34 97 -29 16 148 -241 -120 132 -103 227 45
5792D5j76J20p1P4Rr5Q4l26K67J0j56K96j97L21r8k75Q3J18o4J56k66M2J62l08
5816b45J96J92o9N0r8j1n0J45q7q3L11j92r5P8n1k3p3M14q30N86j84p7P5J54L9
5841G2p8J30J30k41j9K95k59j60Q7K86Pk71k6K15j09R4p0k0L21j39m05N48m79
5864i1l1L52k4n32M69j93J94m1J72j08m2j16N4K6m2L22l72j6J35k30J63K3l8m4
5888a0Rj16RK63j20p4ML6j3L03r9n6k62Q3J83l84L82m7k08P2J27n0l23O55k73
5913I1k68%j7J80J74kj44L34k68K6m4j6R1j60J74j17k40J71q9N3l2l1Q5J63q9
5938B5J63l93K83p4l38N11m47L15K6K20l28l3J17M6j02J39l2Q3k28O0qL56j07
5961B54k42oQ7q8j55K91p4l92k6K00O4J33m8J95k83R4j40Q6O7Rk99J78K87m57
$$ plain form
5792 45 -131 -11 -82 -8 1 -94 -10 -336 -69 -59 -215 81 -116 205 107 -168 -85 33 -31 125 -141 -99 63 -245
5816 -245 -49 143 74 124 26 15 -35 110 23 -60 251 59 -36 42 -9 -32 -105 309 -521 65 -119 -196 -121 33 72
5841 72 -6 124 254 13 -6 289 30 -130 -43 243 250 -21 -47 168 59 153 83 63 384 245 -160 388 -91
5864 -91 -122 230 206 -326 143 -50 144 103 275 167 125 9 63 89 47 369 -3 -19 116 -114 49 72 34 -10
5888 -10 -1 -117 -108 155 35 -39 -35 1 -12 291 192 136 -126 -43 140 -244 138 91 -117 -45 82 32 -291 364 91
5913 91 -177 -177 -194 -14 160 158 14 348 80 106 62 46 137 -23 151 34 -206 -35 -124 -71 -103 -134 -49 114 25
5938 25 188 -205 78 4 -334 177 -270 45 71 291 -37 -70 47 93 -9 130 98 181 -47 13 5 361 254
5961 254 12 6 93 5 -150 141 67 -325 -351 -151 -87 46 -2 193 -90 4 -136 -50 17 26 -273 -95 192 -265
5985b65L48j97j27J31J81p4l86O17k28j59J58q7N1j15J10j4O4k0j87J09K71j25
6007E6j37j67J91k31L06j2k72L90Qj6k79L88J09n06M00J49n92K32k8k31J42K92
6029A92n2m27N42j43k95L81Q8o66N76O6j10k7M28n44l30K45o7J93J9j70L2J73
6051A04q9L4p2L74m69M8Q2K9q0J16Kk44J05K64l31K72j7k07n9P5L31o33L71O9
6075G5j32Q4Q6k34L6L5n8k7L0R6K6N8p4K13l22K66k74K02J04J24k18M6p1J41j42
6100G0l23J59J34j87Q2q9J74J64j65m7Q1M9KM3l09K1rK49k27M28k26l1j42P2J08
6125H1M9m7J02j04R3k14k00K76Ok03L76J76o15L05j17j02J36j25J10R8l3J17j82
6148a7J51k67p7L1M63l83j44K88p1k36l3K85k16J74k4M5L9M4m2j64K45j62k13
$$ plain form
5985 -265 83 -114 -241 -110 71 -3 -389 228 0 -159 -1 -88 -37 -152 -42 -56 8 -12 -199 -90 181 56
6007 56 -81 -248 -57 -288 18 6 -266 124 132 116 -163 225 334 -172 228 377 -215 17 -11 -242 -100 192
6029 192 140 -287 255 112 -183 198 286 -380 196 262 152 125 553 9 -321 -76 -143 50 69 -101 -69 104
6051 104 15 49 -23 351 -118 -70 12 41 -39 77 79 -165 -60 204 -127 145 128 -79 -138 -63 268 -365 6 75
6075 75 -57 27 113 -121 -85 -50 -108 -135 -105 -9 17 75 1 214 -108 158 -116 86 190 314 96 142 71 212 70
6100 70 -253 -94 40 -147 -65 -154 20 184 19 -28 53 102 104 147 -162 -141 -150 99 -128 300 74 43 -99 -27 81
6125 81 130 83 185 81 174 -40 -240 36 42 -161 215 391 -224 81 -36 -138 -2 -127 -17 81 48 165 -17
6148 -17 134 -133 -210 -179 284 -99 -243 45 -26 -262 -295 -10 -226 -52 -76 -31 8 52 10 -154 91 -71 -284
6171b84J95N5j04N1rR0j05K54j35j97L59l90K36j51k25M28k21L34l35q3K51J40
6193A54l42K18j63P8M00j30k42j08J24MM7J05j94q5J43n1m0K26Q3m6m2l04Q2J26
6217D3K6k7q8M55m04j64n1J65P5j15J26j58L18k74j59J45K68m14j06K37J07m0
6239c5j81J08j33L18K55n53K60J2j00j65K46M9r7L6K0P9N7k88K7L7k2J05k82K23
6263b4K92l22j7r9j07J80K81j46J08r2j95j10J35K04k06K05J61l11L5jJ32j2J7
6286A08j43K7o5J44Pq4R7k12J65J94l14L9l48N60j39l4J43k10K44l56J84O0R9
6309A66r8j55J12m3J57L6o4M2j28l7J04j14J62q6J79k31J40o2P7M5k63n9q9M4
6333a65L53j85j08R4O9K31m64J9K37j36J7M3kM7j04n1J6l4K16k4k02J85j25j77
$$ plain form
6171 -284 -89 -34 -138 -87 -96 -6 -111 143 8 -189 170 -220 16 -135 -360 68 -153 181 -154 -237 14 154
6193 154 -188 30 -133 -55 345 215 -27 -135 -11 -7 40 145 -49 -134 9 -42 -82 144 227 181 139 -165 -83 43
6217 43 69 42 -46 409 5 -159 -210 -45 30 -85 41 -117 201 -73 -232 -87 181 -233 -339 -102 5 -35
6239 -35 -216 -108 -241 77 332 -221 39 51 -49 -214 32 81 -16 20 40 119 176 -112 -85 -48 -70 35 -247 -24
6263 -24 268 -54 -71 -170 -277 -97 184 38 146 54 -141 -251 -116 88 -118 87 248 -63 -28 -29 103 91 108
6286 108 -35 -8 -73 71 78 -6 91 -121 44 238 -76 -37 -385 175 36 2 145 -65 179 -177 7 67 166
6309 166 68 -87 25 -18 139 175 111 153 25 -12 92 -22 140 54 233 2 142 80 157 202 -61 -120 -209 -165
6333 -165 188 3 -105 -11 58 289 -175 -156 81 -55 -38 5 3 50 -54 -105 -89 -123 93 69 -133 52 -73 -250
6357b50J77O4j73J60J11l2O0k68K54j2p6j22j3J73m8j8KJ44l11Q2L0L52k57J93
6381B22k33L3R1J61k49K8j44L9J70j14R1o6J01j85m8J05K02n46L41K6q1J36J0
6404I0r2O9O8J6j50j29lN9K79m4j13L9K21m09K27j18M4M4k20K07j74J20k6J0j95
6429a80J30L12r2r7k1q4q1L88k09J5q3j63J89k21M1K38k3j99K83k51J71j34P7
6452FQ4k08J27L4J43j45j3J16r5j34N2J06J3Nk35J6K31J10k42K56k20r5L9O1j37
6477a25K01J82k49j78k6K50Ok0J06k51M25m68L4K53k31L24j38K5j71J8K02q8p8
6500Cn3N2j63Q2J55j81n1O2K18l9k53r7K12Q3j30J18o3P1Q5Nj41j33J75N4j22
6525e1m5K75k31MJ06K37l35J15j91k58K98K09m3n0P6k69J18K04k87J42k23L13
$$ plain form
6357 -250 -73 -9 -182 -22 89 57 117 -151 103 91 15 -107 -120 53 5 -13 -11 133 -178 -96 -66 286 29 222
6381 222 -11 22 113 274 25 53 -91 -52 118 4 95 29 130 -55 -103 2 204 -342 -1 25 -56 80 90
6404 90 -2 67 135 151 1 -128 -131 -72 207 163 50 89 310 -99 128 10 54 98 -122 85 -89 31 5 15 -180
6429 -180 -50 262 170 73 52 -32 -113 275 66 81 -2 -165 24 -197 -156 82 59 -140 143 -108 63 -71 6
6452 6 90 -118 9 43 186 41 28 144 49 -85 -33 73 86 91 -144 -128 103 213 -29 227 7 -88 -49 12 -125
6477 -125 76 258 9 -169 -195 55 61 41 147 -104 321 -147 -113 140 -91 233 95 120 -51 -33 169 81 3
6500 3 -50 2 -161 -79 76 -105 -156 -94 124 85 -168 -265 -53 30 -100 18 -45 26 111 116 -25 -158 17 71 -51
6525 -51 -96 179 -52 -48 58 295 -40 75 -116 -374 -76 133 90 40 116 -153 -35 169 -118 24 -199 114
6547A14j74J86j31j42K6K06N6l47K06J2l5L1n5K20m53M84k65O4K06j68j60K45
6569A26J58l90n9K87L66n90J65j22J24k24J34k21K77R8j98r0J35J01q1O5j27J60
6591I4o9Q1K3k76J33kj29L52j18l23M17Ql25P1j7j46K33J06M7k92l2N49l96k15
6615b26Q4M1n2K40j87J26p5J01M7j57j6j80L17l07J20O9J39J53k46pj13K76j69
6638b2J03J5n1oj90o0L58q6j09j66P6J97j3j28rK63l68K49j99K22k07Q0k2K34
6662A61lN0j54j49L79j04k01J01j36Q6p6p4J90J47j44j94O7K62o9m68M10j81J30
6685C0J42j20O6j70q0J18j03K79l2l16K43j51L42j39Nj92J2J33j7J2l12L53n3
6708E0k41J90K3r2K53k82K25pJ0j61K34k05j04K31j93J36K5j06J40p1n2j49K82
$$ plain form
6547 114 -60 126 -5 -147 -121 85 141 -206 0 12 -23 8 -47 173 -280 204 -61 3 209 41 -119 126
6569 126 284 -106 -165 122 488 -102 63 -59 65 -159 -25 -246 31 129 -69 -159 -24 77 -4 61 -66 94
6591 94 25 106 129 -147 -14 -16 -145 207 89 -234 183 191 -134 -63 -80 -226 7 113 160 -132 -164 385 -11 -226
6615 -226 -142 -101 -153 87 -100 26 -49 52 99 -58 -74 -254 63 -244 -124 -55 84 237 -9 -16 -129 147 -22
6638 -22 81 96 45 39 -151 -211 147 61 -48 -214 -138 59 46 -82 -91 172 -196 53 -146 76 -131 -51 -73 161
6662 161 158 208 54 -95 284 180 -21 80 -56 30 -46 -120 70 217 73 -121 -54 208 139 -329 81 -100 30
6685 30 172 52 118 -52 -132 -14 -117 162 130 -186 57 -94 248 109 114 -78 -66 67 50 62 -250 103 50
6708 50 -191 -1 22 -70 183 -99 126 119 129 -32 202 -3 -107 124 -69 67 92 -14 126 55 3 -146 136
6731A36j12l8J67j61J37l58J73L3Q5j20J07j71K17j19j9J06j11Pp2J46j8P8j41
6754d8JJK36j15j45k62M4N04j58k41K99j60L41n16J24k5K81M7r4q8L1r0P7J30
6778A74m0k50J14j42P8j17J53p3J43K12k49K9K10l80J83j70L40j44M4M7k48J68
6800H2k39J74j73M1K49j19j25K21m8P4l0k26K03k63N7R5J6k37K60K13r3k27n7
6823a52J04k11J63K66n0j8k70N8K17l39N03j97l45J98Q2pP2o6k39K69r4j97M17
6846A64l3k86O9K58l9k10%O8M19m35K38j82PR9r6Kj00O2j45J45m3Rn5jJ3jK06
6873A33l76J20J14j23K38k24K8j5K37m20J12o5J30k2J56N4k34L68j34k64J25R7
6895C5J6K20j25k12K18k32K48m33M22j64J17N7J09l67K5P7N3q2l7J26j43K88L
$$ plain form
6731 136 24 -14 153 -8 129 -229 -56 -23 62 -58 49 -122 95 -24 -43 63 -48 -41 -113 33 15 93 -48
6754 -48 -47 -46 190 75 -70 -332 -288 216 58 -183 116 -44 297 -219 -95 -120 161 208 114 26 57 -33 44 174
6778 174 134 -116 -2 -144 -66 -183 -30 -103 40 252 3 32 242 -138 45 -125 215 71 115 162 -86 82
6800 82 -157 17 -156 -115 134 15 -110 111 63 137 107 -119 84 -179 -122 -27 -11 -248 12 225 132 -95 -152
6823 -152 -48 -259 -96 170 120 102 -168 -110 107 -232 271 74 -271 -73 9 2 74 8 -231 38 -56 -253 164
6846 164 131 -155 -86 172 133 -77 -77 -9 410 -25 213 31 38 137 41 43 -57 5 -140 5 -38 -29 -84 -85 -72 -73 133
6873 133 -243 -123 -9 -132 106 -118 -90 -105 132 -288 -176 -241 -111 -133 23 77 -157 211 77 -187 -62 35
6895 35 51 271 146 -66 152 -80 168 -265 157 -7 110 167 276 -91 -66 11 64 -18 -55 71 -72 216 219
6918B19j09L9l31K22l7r9L89j56o6j86N7rPk0M9J10m17j22O62j76p6J72r9P9l03
6943b01J79k78M81j02j5k8j21K35l48L85m19J95L4j21J3J75J21l12M3n3l3R3o9
6966a46J50J53k45j86L84j30m5k2l8K76k08j8o4J89j54L74l68QKR7j30K57n5j29
6990d8q5K92k99J56K14k66J03l56J77K44j90p7R0rJ01m28J19J44l4r6L71n6j87
7013a20R1J70j7r4k64L31k89K28j24p9K58q8K1l4J38O3k67M8q3K10Q8r4k3j56
7037h6lK02m71K70J6M92l89j02K5J1L07j66j89J57k34J19J31j14L39l23J41j72
7059c9K0J2l6j97J93K16k85J27p0N5j46l1J15J67l12K65J7o7l2k11K78L9k89P0
7083a41l3J81p8J90K04l57q0L22l27J1J89J04l21O7J39k25L2nQ9k69N26l6n9N7
$$ plain form
6918 219 110 149 -182 40 3 -96 293 137 71 -115 -58 -67 -60 -80 -31 79 -338 -460 202 26 -50 122 23 102 -201
6943 -201 -22 -300 181 79 64 36 -85 150 -198 187 -232 -37 -3 -124 -111 64 185 -127 -84 -137 -170 -77 -146
6966 -146 4 157 -88 -274 110 -20 -65 -87 -125 151 -57 -75 -139 50 -104 270 -98 -90 -88 9 -121 136 81 -48
6990 -48 -133 159 -140 16 230 -36 67 -289 -112 132 -58 -135 -45 -54 47 -381 -262 -118 -152 -248 123 67 -120
7013 -120 -29 141 124 30 -234 97 -192 36 -88 -167 91 3 24 -10 128 191 -76 -28 -111 99 187 93 70 -86
7037 -86 -89 113 -358 -88 -72 420 31 -71 -46 -35 272 106 -83 74 -160 -41 90 -24 315 -8 133 -39
7059 -39 -19 -7 -43 -240 -47 169 -116 11 -59 -4 -150 -181 -66 101 -211 54 71 4 -28 -239 39 78 -211 -141
7083 -141 -174 7 -71 119 323 -34 -114 208 -119 -108 81 185 -136 -69 70 -155 -123 -128 -39 -308 218 182 123 180
7107A80j05k30L38Jj99j90K03J1K7K9q7o3L89j34l43J87Rj60L31j97j86R4K34
7130A39j70J41K60k56k48L25k38Q5l0k26J11oJ53j58JLO3p5k26L72j47J24l3J1
7154b5j92K32P2j36K00Jj64j52J26L0M40l62RJ81k56j45J1K77k66k4M08k82J96
7177A79m32K88M6j26J91k84o5K96l4j94L18j32j63o0K93k8m09O35l10o4J1J89
7199A45j75L18j40j99O0k77L14j09L26k89p8K01M5j75N5J5j09J33k3Q8J69m18
7221a23N1O2j13M67l15M1L5k68L85l0k28p9q3M88o66L78N9p1r0P2q0K64k8j11
7245A7k79L27j50K05l39J27L76k95J37j97K07K6p7j02R2Nj94r4K24m6q8K6m3L45
7269B10n0k95J29J73k46o5K42l3j94J4P0lN2J55j60m0J93l28K47j0K6j3L8j68
$$ plain form
7107 180 75 -155 183 184 -15 -205 -2 9 36 65 -22 -85 304 170 -173 14 23 -137 194 -3 -189 -95 139
7130 139 -31 110 370 114 -134 191 -47 38 8 -218 -107 -113 40 -118 -117 -114 -51 -126 -352 20 -127 -3 -36 -25
7154 -25 -217 15 87 -49 151 152 -12 -164 -38 -8 432 70 79 260 4 -141 -130 147 -119 -143 265 -17 179
7177 179 -253 35 81 -45 146 -138 -203 93 59 -135 183 51 -112 -172 121 93 -316 319 9 -55 -44 145
7199 145 -30 288 148 -51 9 -268 46 -63 263 -26 -104 97 142 -33 22 37 -72 61 38 126 295 -123
7221 -123 -72 -10 -123 344 29 70 105 -163 222 192 -36 -115 -198 290 -376 2 61 -10 -100 -28 -108 156 128 17
7245 17 -262 65 -85 120 -219 -92 284 -11 126 -71 136 162 85 -17 75 80 -114 -208 16 -30 -118 -92 -135 210
7269 210 160 -135 -6 167 -79 -144 98 65 -129 -115 -45 -48 4 159 -1 -41 152 -176 71 61 87 74 112 -56
7293e6n2L55l02m9P3K74k50R0j95L5M82m79J93k28J43J4mj58K07j58Q8l0K1j64
7317a50J61j53R6K2K02l51L55nk12p4J88O0k94K61r0O2o5NP7j06J0J68r6k7J44
7342A88j78Mj06q6K77nl6j13K1J31MJ6k21O3J77j32J35K19l64L2n6m7m4J81o0
7367@pK60P4m37R7j20K24K17k81J06m6j25J17j4K05l43K06Lm2l40J88K18r3j2
7391E5j9q7O6K3j52K77k67K32q6l9J90j18q4M8l91K81M0o5L44k18k92L54l74L23
7415D1j43K77j59O9K06l78L28j68m30K08J63j03j1M29k70Q5rj32m6l17L62N7j42
7438h3R7k1J05p2J35j62j74J47r9K9J45j5K9k27J01K42N6j54j54J42q3j29M5J56
7462E6Q4l26L22j9J5Kk91J88j80K30r1J29K00k67k11L66k4p9j84K14j62o4k8L17
$$ plain form
7293 -56 -108 247 -55 -104 -31 243 -7 83 -112 -77 405 -74 119 -109 34 48 44 -114 93 -65 23 -7 14 -150
7317 -150 11 -142 -46 -24 178 -173 182 177 -35 -109 79 139 -155 106 16 78 13 18 95 -11 -1 167 71 44 188
7342 188 10 14 -92 -178 99 94 58 -55 -34 97 101 117 -104 -41 136 4 139 358 -6 26 -30 -77 -121 60 0
7367 0 -7 253 327 -110 -13 -133 91 308 27 133 87 -38 79 65 270 -73 133 136 94 -246 -58 160 67 55
7391 55 36 -51 15 38 -114 163 -104 128 42 3 193 75 -9 39 -352 -71 -31 -96 248 30 -262 92 -282 41
7415 41 -102 175 16 85 291 -87 241 73 -357 -149 14 -89 -100 329 59 144 135 3 -43 -360 2 59 -83
7438 -83 14 -7 98 26 161 -1 -175 -28 -127 -98 47 32 61 -166 -65 177 233 79 -75 67 -16 -145 -100 56
7462 56 140 -186 136 117 132 134 -157 31 -149 81 -10 119 319 52 -159 207 183 104 -80 134 -28 -92 -120 197
7486A97k4l43K70k55J0J09K96j47j49j0K39l81O2J41n1R6lk30rJ97j32J92k65
7509a90L42j84K27j21K04j90j23J72Qr8j21p1L31k05R9Q0j08j59J49k01K29K8
7531I8l61K43O9j30J67K3N5k55J96J07l20J39rl59M38p4k11Q3m2j07J81j25R6
7554i8Q5p3j0Lm1R1m7R0LoO4j59J06l57M0P2K12L3K7n6Q9qm4J50n6kl35J09J5
7583a03r8L02o1J83j54K4q1J84j05M6k90K60k90R6j7L08n31K05J25N4k01N2K1
7606g1J79O2l26K85p8Q4j88K85j98L1nj25M96l82J1K64m24Q3R5j7k5MK4j71M24
7631C17m24N7L6j20k8L97k21J53k78Q8JJ38J76j29j57K30j90p7N3m55K69q0J92
7654e2J12K24k03j39J0J94j08J84l80K7J00Nj08J35N7j51J84k38J83J1j6m97N84
$$ plain form
7486 197 173 -170 100 -155 -145 -36 260 113 -36 -46 193 -188 -126 15 -36 60 57 -173 -182 15 -117 75 -190
7509 -190 152 -32 195 74 278 88 -35 137 145 47 -74 -145 186 -19 80 160 52 -107 42 -159 70 98
7531 98 -263 -20 49 -81 86 109 164 -91 105 212 -108 31 22 -337 101 27 -184 -101 -143 -250 -69 -194 -98
7554 -98 -13 -86 -96 -93 -134 -43 -90 0 3 -3 61 -98 8 -349 -309 -237 -25 8 35 -21 68 60 16 166 110 108 -227 -118 -103
7583 -103 -201 101 40 223 69 93 12 196 91 137 -153 107 -183 -87 -104 204 -327 -122 3 57 -144 -92 -71
7606 -71 108 170 -156 129 51 135 -53 232 34 65 60 -65 431 49 60 324 -100 -17 78 61 36 40 64 -107 317
7631 317 -107 -50 -14 -134 -162 235 14 167 -111 -23 -22 116 292 163 6 236 46 -31 22 -433 -164 -244 -52
7654 -52 60 284 81 -58 -48 146 38 222 -158 -131 -31 -26 -134 1 58 -93 91 -147 36 47 31 -466 118
7677A18j93P6j65J04nK90k14P7j43J17Q5j24j31P8K69M9j47M2J51o55K56M2K85
7700B62l36K18j04n1K4J04j62K17k1j12j23m5J69j49L01n1r0N6j70L00l20K4R2
7723C3%j59J25j29K22L7k52O3K25Qr3J5j17j9J12N2m49M07k43Q4j69J54J06qj48
7748a43K70l20N66l58j63k11L18J01o4j21K57l77J33K58r9k46K9m5P4J46j27J28
7770Fj45l3J97O6j0k4n1J06p2J69m33M7J55K61p0n0j37R5j68K83q4j33o8K42k97
7795a48K59j78m1J52j9K3j2l9k8p3MjO5K54j80J28j1L2m54K13j14L37k87p3J39
7820e2J89j19L06k78o6Q6j20J3J60o6n7ol1J47l22j03M45l3r8l3p8K77M0l02l8
7845a39J24R3K75l48N0M9Qk47q0J95nL2k2p4J17p9P6l74K18Q1J08k18%J62p4j00
$$ plain form
7677 118 -75 1 -164 -60 -65 225 11 88 -55 62 147 23 -108 -30 239 288 141 183 334 -321 -65 -23 262
7700 262 -74 144 40 -11 13 117 -45 172 151 39 -84 -129 40 -109 192 141 51 107 -63 237 -83 -59 33
7723 33 33 -126 -1 -130 92 129 -123 -60 165 173 80 95 -22 -41 71 123 -326 81 -162 -78 -247 -93 13 5 -143
7748 -143 127 -193 373 15 -148 -359 -41 60 -4 -125 132 -245 -112 146 47 -199 -170 -215 -141 5 -122 6
7770 6 -139 -172 25 91 81 57 6 112 40 209 -224 -177 -22 239 169 119 -18 77 -91 192 108 -25 -93 149 -148
7795 -148 111 -67 -108 44 25 48 36 -3 -31 -104 -100 -101 -36 218 38 166 155 187 -267 -54 -168 169 -118 -191 -52
7820 -52 137 18 324 46 -20 66 -54 -41 119 53 -4 -10 -41 106 -216 -319 126 93 -5 -38 -116 161 201 -101 -139
7845 -139 -15 78 353 5 55 104 112 -135 -215 -20 -25 7 -15 -89 28 -51 25 -349 -131 -50 58 -160 -160 2 -72 -172
7871a72J68m5J1L1Pk01L6L8J00O5K21l76N5R2RK72l10M9k09R0L91n07J06J59j8
7896F2M4K58l47K9K01l60R4O6j7j23K21m44K79O1j10N4j85K37k6J66j98n7nK34
7920A34Q7j80o4j13K05J1j78J44J22j13P7l05N9%L21j34L1k18K13l03J72K48l01
7943h5K52j31l76L55j79L39k34N5j5j48M48k67J36o8j3N3l8p5rK34m10J49J37
7966A10M6j80q1O5K17nm07K92Qk74K13j31j29L04m3N9j67L4J00R2K0j66J97j78
7990dJ84J3k96O2K84k31l8R5j19l8J40j49J49k29K26n1K54l27m0O5L3L8J8Q1o1
8015E9n7M7j21L1O3j36K43j42j05J3K9j90L99j62L0k3J23K5k40K67j83l6N3m9
8039f2J6K04p9o3K38rj43L3J4k41J41k17J24j34K71j20J72j50o9K79k27J09j68
$$ plain form
7871 -172 -4 -49 -38 -7 0 -201 -165 -127 -27 38 259 -117 -62 30 39 311 1 50 -159 -69 322 -185 -79 80 62
7896 62 106 364 17 46 247 -113 -19 47 30 -93 128 -316 -37 24 -86 -32 -217 20 -6 160 -38 -95 -100 134
7920 134 221 41 -23 -136 69 80 -98 46 168 55 132 -173 -114 -114 207 73 104 -114 99 -204 -32 216 -85
7943 -85 167 36 -340 15 -164 175 -59 -4 -19 -167 281 14 150 82 69 122 84 9 0 234 -176 -27 110
7966 110 156 -24 -105 -40 177 172 -235 57 65 -209 4 -127 -256 48 5 64 -103 -69 31 123 143 -23 174 -4
7990 -4 180 193 -103 -41 243 12 -26 69 -50 -88 52 -97 52 -177 49 -2 252 -75 -115 -50 -17 21 39 120 59
8015 59 2 49 -72 -41 22 -114 129 -13 -118 -105 -76 -266 133 -29 1 -22 101 126 -114 153 -30 -66 -13 -62
8039 -62 -46 158 79 16 254 245 102 135 149 -92 49 -168 -44 -178 93 -27 145 -5 -74 205 -22 87 -81
8062h1M2K53k80j85K00j73N82m09K1Q2k21J48L3j60J89p6P3L07m41J19p7l5L15
8085B26P4k30O1k85P3K21j44q0Q7r1Q3Rlm8J54m40M15j6l93L37k62M6O5K49j62
8110e4j43m6K87j57p7J93K4J88j89lj46r1L26k22M5m4p6M89o77M23j12m9jL5n9
8135a36J61m04M64j43qM1j03K91l15J8J24pk16J84K3L7j7j50K9K26J16l64K66
8158A17l47K45j47L16k76K86J7j66l0m0J51k01J36r0J62J60j8p7j00K45l17L07
8180C33l51n0M9J04l0K5O7o0j42K0K66
$$ plain form
8062 -81 -39 214 -66 -251 -51 -224 358 -51 -30 52 -169 -21 12 -148 41 -35 38 345 -96 23 -54 -89 226
8085 226 300 70 131 -154 -81 140 -4 -84 3 -88 -5 4 1 -47 107 -333 82 66 -327 10 -252 -206 -141 108 -54
8110 -54 -197 -243 44 -113 -190 3 27 215 26 23 -123 -214 112 -110 -65 -109 -185 304 -373 50 -62 -111 -112 -77 -136
8135 -136 25 -379 85 -58 -66 -25 -128 163 -152 -134 -10 -17 -233 -49 -26 11 -6 -156 -127 99 215 -149 117
8158 117 -230 15 -132 184 -92 194 211 45 15 -25 126 -75 61 -29 133 293 275 198 98 343 26 333
8180 333 -18 -68 -19 85 55 80 147 87 -55 -35 231
8191B31
$$ Imaginary data points
##PAGE= N=2
##DATA TABLE= (X++(I..I)), XYDATA
0@%%%%%%%%%%%nJ3j6J6j6K4l2L2m0M8n6O9p7Q8j04J22j45J67j89K16k47K81l18
34a69L58m02M52n05N64o30O99p74Q61r54J053j163J281j411J556j713J886k078
52a089K292k532K800l102L447l846M311m862N529o353P398q779J0687j3493J8025
67A0433k6483M7217j84063k07832N80003l56l70709J10772J11930j20585J73103
78A23430l0570l50089J85086L57570l25342k28506L20661O5129j75243P3789l8172
89b2257p8756K40933o647l47255J32771L03505k26155j68407K09481o363p8772
100d7922J30501j04057j42811K76779O5666l47228N3726K93435j46349j43617
110a11877J47431m3813n4972J88146r3837k30454K34758J76290k93078n8984K43893
$$ plain form
0 0 0 0 0 0 0 0 0 0 0 0 0 -5 8 -8 8 -8 16 -16 16 -24 24 -32 37 -40 48 -56 66 -79 88 -101 115 -132 149 -169
34 -169 189 -213 239 -266 298 -332 367 -407 454 -500 553 -610 671 -740 816 -897 989 -1089
52 -1089 1203 -1329 1471 -1631 1816 -2030 2281 -2581 2948 -3405 3993 -4786 5901 -7592 10433
67 10433 -16050 31167 -152896 -360728 219275 218919 -151790 -41018 70912 -49673 123430
78 123430 92860 -257229 -72143 285427 -39915 -268421 52240 117369 -57874 15915 -22257
89 -22257 -101013 139920 133273 -213982 -81211 222294 -3861 -172268 37213 30850 -47922
100 -47922 82579 -21478 -164289 112490 178156 -169072 -115346 178089 31740 -111877
110 -111877 35554 -8259 -63231 124915 31078 -199376 35382 211672 -81406 -140390 103503
121A03503n5300j07186J11775o8281r0020K10384P602k65402Q8499K23850j39945
132A9479j13483J16446r059k6850Q9097r4863r9264J93329M4977k23021L5816
143f7396J69356r0456n6413Q1388o5411j2128J42690r1204j49424J76967Q8781
154A26750k02405M766J48964p9544l5482R4097r1867m5325J77533m4794j91904
165a39211J27195J34777j59605l4801J21262n5736k5474R5409q6161p3320J61323
176F5658N957j70530O3252J14605r4658j9590P0507o5906K162J04218q6017q3065
188i3407J35956K1088j28240M2696O7873p1384K0028N2881r1048O015J17596p3139
200F915r0521J10620K7753r9117L5597M4516o7271L0235N8428q9323j4060J10031
$$ plain form
121 103503 48203 -58983 52792 -15489 -105509 104875 112477 -152925 -64426 159424 19479
132 19479 -94004 22442 13383 -13467 75630 -19233 -118497 74832 119809 -103212 -67396
143 -67396 101960 11504 -44909 36479 -28932 -41060 101630 10426 -138998 37969 126750
154 126750 -75655 -70889 78075 -1469 -36951 57146 -34721 -80046 97487 52693 -139211
165 -139211 -12016 122761 -36844 -71645 49617 -6119 -31593 63816 -22345 -95665 65658
176 65658 71615 -98915 -35663 78942 -15716 -35306 35201 -30705 -28543 75675 -10342 -93407
188 -93407 42549 63637 -64603 -21907 45966 -25418 -5390 47491 -43557 -37542 80054 6915
200 6915 -83606 27014 54767 -44350 -8753 35763 -31508 -1273 57155 -32168 -46228 63803
212F3803l8959q6583P1663L1180o7484K6447K9445n9622K4710O0034o6675l2273
224d4314Q0697n850o4263L2868K2092l5979K1833J3664m7420K0549M8519m7412
236e016k7793N4158k283m0178K4359P140l0266K6886J4987m6169J0459M5677l1226
249G35k6521L7042j851k7459K3293K893l2647K2963K6230m0361n739M0596j2068
262G106k6370K1120M083j9757J5008O264k5220J0262K3641k1732j0385K3847k873
275D994j4568J1249M08j2221J0866N424j6491L946J5559j0088n617J1845l903
288A403m968R270m868r631J2153M064j4615K555J3882p527n581R661k009n396
302a607O955k073p675O625M567q984n11R378k292n906N142J811m872J532J200
$$ plain form
212 63803 24844 -61739 9924 41104 -26380 67 29512 -30110 -5400 54634 -12041 -44314
224 -44314 36383 30533 -33730 -862 21230 -14749 7084 20748 -26672 -6123 42396 -5016
236 -5016 -32809 21349 19066 -21112 3247 10387 -19879 7007 21994 -24175 -13716 31961 735
249 735 -25786 11256 9405 -18054 5239 8132 -24515 -1552 24678 -15683 -21422 19174 7106
262 7106 -19264 1856 5939 -13818 1190 7454 -17766 -7504 16137 -5595 -15980 7867 4994
275 4994 -9574 1675 2083 -10138 728 6152 -10339 -6393 9166 -922 -6539 5306 1403
288 1403 -3565 5705 837 -8794 3359 7423 -7192 -4637 9245 1718 -3863 5798 3789 -1607
302 -1607 5348 3275 -4400 2225 6792 -2192 -2703 6675 4383 -1523 3619 5430 558 2090 3290
317C290l365M52K002j559j103J947J166j135L46L10j055K63q69j495Q42j53j305
334a421R23J011k58k36N42j26j207O31n84j959Q78O13j905P50J868n99q09J019
352h69P40j866m22J233j576k05J039j286Q40J653r27j01J924r92j100J219j27
369h23k830J937J888l071R10L481k395l05L927k744k917N476J95p120L326N782
385D717o178r34P338m285k357P618l563o276P942K611j1100L028Q766p523k324
400b520Q983n404l571J1036m674j1255J1774N560j5186K042J1430q769k393J1063
414H116r397n070J7742n024j9408J4896J1167j9478L02J4016j0779j766J5798
427A1115j4016j0955K5956j753k7583J4190J6435k0830r0J5612j5558j011K3843
$$ plain form
317 3290 -75 377 2379 820 -283 1664 2830 1695 2041 2351 1296 1559 690 -805 37 -116 -1421
334 -1421 -498 513 255 19 561 435 -772 -141 -725 -2684 -1806 -1193 -3098 -2348 -480 -1079 -1888 -869
352 -869 -129 -1995 -2417 -1184 -2760 -2965 -1926 -3212 -2372 -719 -1646 -1747 177 -815 -1915 -696 -823
369 -823 -3653 -1716 172 -2899 -1989 1492 -903 -1208 2719 -25 -2942 2534 2729 -4391 -1065 4717
385 4717 -1461 -2395 4943 658 -1699 5919 2356 -3920 4022 6633 -4467 -1439 7327 -196 -2520
400 -2520 6463 1059 -2512 8524 3850 -7405 4369 9929 -5257 -3215 8215 -554 -2947 8116
414 8116 -1281 -6351 11391 6367 -13041 1855 13022 -6456 -6154 7862 -2917 -4683 11115
427 11115 -2901 -13856 12100 10347 -17236 -3046 13389 -7441 -7531 8081 -7477 -8488 15355
440A5355j7496j9323L1799M451l3420J1954J9707k1716J620J8279k2750j899L3705
453B0266j8158k9701L4212J2718l6014Q563K0934k3523N936K3470l2476p266M6730
466B5691j4448m1232L2223J9888l5212R088J8414l1043J1539L5792m0994k0958
478c1252N6576l116m9412K5454K1904l1633J4188J6610m2906J3532N1581m4825
490c299l5753O0195O228m9792K2528J6000l4301K7059K2122o1750P925P1155m0052
503H265n2022N5657J4076m2920K2596N845m1505M0162L3160p4885n622Q1844k7289
516A7362n6648M4109J0409l2852L4317k881n9021M6756N3792p8591k5585Q1626
528C2793j0549n1916L2900J351k8593M8377j222p6167L9826P2359o7417m2078
$$ plain form
440 15355 -2141 -21464 10335 14786 -18634 -6680 13027 -8689 -7069 11210 -11540 -13439 20266
453 20266 2108 -27593 6619 19337 -16677 -8114 12820 -10703 -4767 18703 -13773 -21039 25691
466 25691 11243 -29989 2234 22122 -13090 -4002 14412 -16631 -5092 30700 -10294 -31252
478 -31252 25324 22208 -27204 -1750 20154 -11479 2709 19319 -23587 -10055 41526 -3299
490 -3299 -39052 21143 27371 -22421 107 16107 -18194 8865 30987 -30763 -22838 48317 8265
503 8265 -43757 11900 25976 -16944 5652 11497 -30008 10154 43314 -31571 -37193 44651 17362
516 17362 -39286 4823 15232 -17620 16697 13816 -45205 1551 55343 -23248 -48833 32793
528 32793 22244 -29672 3228 4579 -24014 24363 23141 -53026 -13200 59159 -8258 -50336
540e0336O7936J396l6431K8587j5088l3863O6891J2338r5043K1376Q8965m7173
552I555n2171M8794K319k0500L8994k6916n4344P4220M0765r8121q575Q6941k1624
565A9337m4038L2377j3431j4661O2373k3351q2925O4322O9495q5854l1266P3425
577B5803r353k9563L1860k8562k5931P8513m415r8790M1785Q2346o4031l8670
589c9008N4834j1471j4197M4234m2511m6322R0061K0921j07494J5457Q6051m1433
601I122l4437L8511k5783m449O6912m5161p4741Q6042M8571r5720p552O7416k7083
614A648j0045L4523n2755j0930R3508l0892r5798O6085O0874p2774r786M4555
626A8213l3956R780M9175o6394l1142R9612o725r5072M1370N5711n0914p1K6996
$$ plain form
540 -50336 17600 18996 -17435 11152 -3936 -37799 29092 41430 -53613 -32237 56728 9555
552 9555 -42616 6178 8497 -12003 26991 75 -54269 19951 60716 -37405 -45980 40961 19337
565 19337 -24701 7676 -5755 -20416 41957 18606 -64319 3 69498 -16356 -47622 25803
577 25803 16450 -13113 18747 -9815 -35746 42767 38352 -60438 -18653 63693 -338 -39008
589 -39008 15826 4355 -9842 34392 -8119 -54441 35620 56541 -50953 -35496 50555 9122
601 9122 -25315 13196 -12587 -17036 49876 4715 -70026 16016 64587 -31133 -38685 28731 1648
614 1648 -8397 26126 -26629 -37559 55949 25057 -70741 -4656 56218 -16556 -26342 18213
626 18213 -15743 -5963 43212 -23182 -54324 45288 38563 -56509 -15139 40572 -10342 -10413 16583
639A6583m4521J9177O1560o6626m6295R2824J1087q3837K2964M2839l5025J1976
651B706J9019n6455J6605P4673n3338o1801P2629K7098o0457R112K1709k8307
663a6807K7978K3959o8118N56Q1591k8616o5682M4820K8721l7313J1317Q090l7556
676b7060L1734L9610o3443k0362P2654p281n5584K6589J9515k7660K0376Q017
688A7105m8046K3212N2324n0149l4519N8349O087m3699J7413J0327k5224K7089
700A0269J3527n3730J0543N8433l3994m0450M1520J0703k9485J6808Q42l0045
712b5059L1694K4263n4291m730N6838j7464l7144K7936N351k0831K4046j003l8987
725b9381K7529L5130m5153j6328M5454o516k6477K0766l060j8646L0380J828m2999
$$ plain form
639 16583 -27938 -8761 52799 -13827 -60122 32702 43789 -40048 -17084 25755 -9270 2706
651 2706 21725 -34730 -18125 56548 3210 -58591 14038 41136 -19321 -10209 11500 -16807
663 -16807 11171 35130 -32988 -32432 49159 20543 -45139 -319 28402 -8911 2406 10496 -27060
676 -27060 4674 44284 -19159 -39521 33133 25852 -29732 -3143 16372 -11288 9088 17105
688 17105 -30941 -7729 44595 -5554 -40073 18276 24363 -19336 -1923 8404 -16820 10269
700 10269 23796 -29934 -19391 39042 5048 -35402 6118 16821 -12664 4144 4986 -25059
712 -25059 6635 30898 -23393 -28123 28715 11251 -25893 2043 7394 -13437 10609 9606 -29381
725 -29381 -1852 33278 -11875 -28203 17251 10735 -15742 5024 1964 -16682 13698 15526 -27473
738b7473J9694L7949l4368j8258L3989m864j6981K0299q185k0668L0961P315m0016
751b0606J0356L3475k2877j4058K2444o737r957K1708j0124k3223K7209J2825
763B0435l3146K958K4975j3890q220J5317r867p105K1774o582k3340J8635J4946
776A6890k3682j067J7031r139m100J1849r718p808J9190j794k0276J0397J3268
789A1041j4178k640J0704p215j461J0847q360q592J4610K100j5358M412J0399
802F309q724j556P235o492j427J0142n747q489J0139L705j0788K242P179o413
816b685n31O611n821k614Q767k039p884O148L971p030P05N258m351l99N126l524
832b92l265O048L8n992L308L329m173M4L584l167k73L638j935k707L992K51l776
$$ plain form
738 -27473 -7779 30170 -4198 -22456 11533 6669 -10312 9987 1802 -18866 12095 19410 -20606
751 -20606 -10250 23225 348 -13710 8734 1997 -7960 13748 3624 -19599 7610 20435
763 20435 -12711 -9753 15222 1332 -6888 8429 -1438 -8543 13231 6649 -16691 1944 16890
776 16890 -6792 -7859 9172 33 -4067 7782 -1936 -9744 9446 7652 -12624 -2227 11041
789 11041 -3137 -5777 4927 -2288 -3749 7098 -1262 -9854 4756 6856 -8502 -4090 6309
802 6309 -2415 -3971 3264 -3228 -4655 5487 -260 -8749 1390 5095 -5693 -3451 3728 -2685
816 -2685 -3216 3395 -2426 -5040 3727 1688 -6196 -48 3923 -3107 -2402 2856 -1495 -1894 3232 -292
832 -292 -3557 2491 2529 -3463 -155 3174 -999 -955 2629 -538 -811 2827 892 -1815 2177 2428 -1348
849a348J922K105k784N33J732j914o38K758j132k097K463K61k187J205P63j865
865b23K55J803j618n12J390k65j461J499M27j551K99O62p88k12N42m23m03P59
883A80k76o22N09R0o75PO79q63r3M26m33j22N81m12p3J39N37o78J90N24q84J95
905a074J046r99j31J051o80k63P22K83j166M21J365j482M49J046j562p4J734l32
923C54j750J439J033j851J000J298k260N04K533k621q10L185n36k767K421O43
939A815k775J965J497l890J328L862l732k033M849n50m067L272O57l928K914K271
955C455n661R11O167m552l757O200m36n027M337K71n476M431L568p766j01Q542
971E106m280n820O621R0n710N619N81q506N908O468j0047j823J0478l826o080
$$ plain form
849 -1348 574 2679 -105 428 2160 246 -392 2366 1234 -863 1600 1861 -326 879 1642 -223
865 -223 32 1835 217 -295 1095 830 -631 868 1295 -256 43 705 -83 -295 247 -176 -579 180
883 180 -96 -718 -209 -119 -794 -787 -108 -971 -1064 -638 -1071 -1193 -612 -1024 -1097 -958 -421 -1099 -909 -385 -1269 -1074
905 -1074 -28 -1027 -1158 -107 -787 -1050 -328 -45 -1211 -790 575 -907 -458 588 -974 -1048 686 354
923 354 -1396 43 1076 -775 225 1523 -737 -233 2300 -321 -1131 2054 1518 -1249 1172 1815
939 1815 -960 1005 2502 -1388 -60 3802 70 -1963 2886 2336 -1731 1541 2198 -1730 1184 3455
955 3455 -2206 -1295 4872 320 -3437 2763 2327 -2700 1637 1908 -3568 863 4431 -3335 -3436 5106
971 5106 826 -4994 1627 1717 -3993 1626 2207 -6299 -391 6077 -3970 -5793 4685 859 -5221
986e221O986j073n952Q075R92j2240O208J0721j1670m219J1408k895o097Q305
1000C328l048p875J1649K818j6243M853J4367j0996o319J1707l546n494J0829
1013F030m611j2313J4926P272k0221K293J7159r501o933J0794n315n464J5450
1026I566n238j7867J5649J2671k0421k942J7032o897n269J0776q986o956K0629
1039A1747l246k3612J3468J7352j8542m968J4568p812k378J4988j4106j2227K5912
1052A1144K150k8238Q872J9511j4990l887J1678j2112J9K1160j5024k0397K7258
1065G144R084k8105L937J7333j2287P34J1058j8386j163K8717j3091k7444K4028
1078A559J5596k5290Q98J3174j2106N387J4652k4307o557L4661o757l1653J6789
$$ plain form
986 -5221 1765 692 -5260 2815 3807 -8433 -2225 8496 -3174 -7393 4015 1120 -4977 3328
1000 3328 280 -7595 4054 6872 -9371 -4518 9849 -1147 -7466 4241 695 -4799 6030
1013 6030 1419 -10894 4032 11304 -8917 -6624 10535 1034 -5899 4895 -420 -5884 9566
1026 9566 4328 -13539 2110 14781 -5640 -8582 8450 1553 -3716 7060 -1926 -8882 11747
1039 11747 8501 -15111 -1643 15709 -2833 -7801 6767 -1045 -3423 11565 -2541 -14768 11144
1052 11144 13294 -14944 -6072 13439 -1551 -5438 6240 -5872 -5853 15307 283 -20114 7144
1065 7144 16228 -11877 -7940 9393 -2894 -2160 8898 -9488 -10651 18066 4975 -22469 1559
1078 1559 17155 -8135 -7237 5937 -6169 -782 13870 -10437 -16994 17667 10910 -20743 -3954
1091c954J7782j7806J200P547j6086J0105K1154k6918j5345L5635K374l0812R789
1104e335J4559j3461P122O295k4481Q730L0573k3655k3953L0945Q988k5267O231
1117b709Q424j3745J3443J0083l0775K304L6517j6250k8833K4037J0773j8809
1129e540P182K544j7658J7843J7436l4557o689L8794p110k8938J5874Q533j3348
1142e634J2699k12k6184J8107K7367l2398j7087L5186Q33k3394J0692J959j2467
1155a0533K0487L224l4730J1749L4853k4126k1860K6105K925j5150J2297m801
1167D40j7773K5534J0901l7544K951L5792j5697k0905J9299m53j0421J8101p243
1180B982k4486K6043J7984l5637l987L1798r105j5642J4278n963q092K4445p106
$$ plain form
1091 -3954 13828 -3978 -2778 4769 -11317 -1212 19942 -6976 -22321 13314 15688 -15124 -5335
1104 -5335 9224 -4237 2885 9180 -15301 -6571 24002 347 -23606 7339 16327 -8940 -2709
1117 -2709 5715 -8030 5413 15496 -15279 -12975 23542 7292 -21541 2496 13269 -5540
1129 -5540 1642 4186 -13472 4371 21807 -12750 -19439 19355 12245 -16693 -819 7714 -5634
1142 -5634 7065 6853 -19331 -1224 26143 -6255 -23342 11844 12677 -10717 -25 1934 -10533
1155 -10533 9954 13178 -21552 -9803 25050 924 -20936 5169 8094 -7056 5241 440
1167 440 -17333 8201 19102 -18442 -15491 20301 4604 -16301 2998 2545 -7876 10225 2982
1180 2982 -21504 4539 22523 -13114 -17101 14697 5592 -10050 4228 -1735 -9827 14618 7512
1193G512l1098K2758K4585l0088r160K4515n645q023J3024j2465j0087K8929o03
1206A4154l3822J3053K5924j9268r635J4926o547j949J6251j4698j6212K7547
1218I724P680l0612M096K2184j1728o178J0563j0523j009K0457j2105k0492K1734
1231C791J2375k3880q16J6447q388j569R473j3701l198K3190p398k3324J5564
1244a434J5086j7462l000J1230q340J889J2303j5545q286K3867m96k3231Q737
1257d682J4029j1424j301P388j0194K352J5711j3487j2887J9993M662j8799M140
1270d499J0171q667K134P055j2908J5J7947r311j4600J4761O525j3811K833O436
1284D081q462M566P915j3301k654J7220m833j4098J0442N470r879L695M088r374
$$ plain form
1193 7512 -23586 -828 23757 -6331 -15491 9024 3379 -4644 8380 -4085 -14172 14757 14154
1206 14154 -19668 -6615 19309 41 -9594 5332 -1215 -3164 13087 -1611 -17823 9724
1218 9724 17404 -13208 -9112 13072 1344 -4834 5729 -4794 -5803 14654 2549 -17943 3791
1231 3791 16166 -7714 -8530 7917 -471 -2040 7433 -6268 -9466 13724 6326 -16998 -1434
1244 -1434 13652 -3810 -6810 4420 -3920 -2031 10272 -5273 -13559 10308 9812 -13419 -4682
1257 -4682 9347 -2077 -3378 4010 -6184 -3832 11879 -1608 -14495 5498 10160 -8639 -4499
1270 -4499 5672 -2995 -861 6194 -6714 -6699 11248 1937 -12663 2098 8623 -5188 -2355 4081
1284 4081 -4381 185 8100 -5201 -7855 9365 4532 -9566 876 6346 -3533 162 4250 -5124
1298e124M820R545j1949n369J5039j784j1342O842L494p252N075K888j0353L841
1312a629J0548r928n677J1028k98p804M997J212o123N525K918r349J879Q894n970
1327B23n505P448k19n136M711j94n575M874L875q114L6P475l471m038M462k19
1343F33l234L781J76n105K903M359n444j331N172j699l006L334n66k549L514L08
1359A246m214J724L811l431j680L575o91k032K345k96k537K705J003l294P01K981
1375A916j888j213K376n86j576K082j04k261J804J174k288LK078j065j058J585
1391I79j84j558J905K70k060Q39J344j438l07J398m25j185J252k00r77Q29K46
1408G28j422O83R96j162j08P98o09l61P73p2n39N31J43o82J8N49o66R6O37p28
$$ plain form
1298 -5124 -304 9241 -2708 -8077 6962 5178 -6164 678 4172 -3080 1995 4883 -5470 -1629
1312 -1629 8919 -1009 -6686 4342 4044 -3760 1237 2449 -3674 1851 4769 -4580 -2701 6193 223
1327 223 -5282 2166 1947 -3189 1522 1328 -4247 627 4502 -3612 -3576 3899 428 -3610 852 633
1343 633 -2601 1180 1356 -3749 -846 3513 -1931 -3262 1910 211 -2795 539 -27 -2576 938 1246
1359 1246 -2968 -1244 2567 -864 -2544 1031 340 -1692 653 357 -2180 525 1528 -1766 -1065 1916
1375 1916 28 -1185 1191 605 -971 1111 1007 -1254 550 1724 -564 -561 1517 452 -606 979
1391 979 795 -763 1142 1412 -648 191 1535 97 -210 1188 763 -422 830 630 -347 482 728
1408 728 -694 -11 985 -177 -285 513 -96 -457 316 244 -295 236 379 -303 -285 264 -402 -306 331 -397
1428c97l5M44k78l83M73L13o54l3O87n53k95N67j95l85O63l76l95L67L38n36N0
1449f13N22m02j79P90l90l00N78l68l16P95q7n45L33N96n53k82J146n97l45J004
1469G87m88m65Q07L68j566L66J203j079k68J075p11n72J585k6j828J483J040k123
1487d12L01J388j142l40J526j046j133K431o09k453J934J325k364L96J628j966
1503e36J77J904k017q60K715j96l152J744K052l418P99K139k653L49K833k410
1519e30k324M299L03m308J935K150k975P69K161l508K26M518k826l730M562J355
1535B077m402J701K117l434J479K622m672m10O434k743m918M635K068m544J707
1550b83J646m129K330M790o657j623P933j852n667L977J859m114K743J665o040
$$ plain form
1428 -397 -432 12 -266 -649 -176 137 -517 -550 137 -416 -711 -144 -339 -724 -61 -437 -832 -465 -127 -663 -613
1449 -613 -91 -493 -672 118 -272 -572 6 -362 -678 117 30 -515 -182 414 -139 -421 725 128 -217 787
1469 787 299 -166 641 1009 -557 -191 1012 -67 -335 740 29 -543 1042 1016 -812 671 1711 -412
1487 -412 -111 1277 135 -205 1321 275 -858 1573 964 -1489 445 1770 -594 -198 1430 -536
1503 -536 -359 1545 -472 -1332 1383 1187 -1965 -221 1831 -1587 -788 1351 -1302 -953 1880 -530
1519 -530 -2854 1445 1748 -2560 -625 1525 -1450 -681 1480 -2028 -1802 2716 -110 -3840 722 2077
1535 2077 -2325 -624 1493 -1941 -462 2160 -2512 -2922 3512 769 -4149 486 2554 -1990 -283
1550 -283 1363 -2766 -436 4354 -2303 -3926 4007 2155 -3512 465 2324 -1790 953 2618 -3422
1565c422K496O921o884l998Q306j63o134L890R39m698M588K090q347K242Q995
1580F821o075o233P736O08n105M070k28n765O428L622j0291Q2J0850m617o838
1595d935O145O22m449N320q58q221O996P146j1386k755J1243k454o603N225o03
1610D33m597P903k63j1606O484J0072j0276m995J0006j660m621N835l719n459
1624f463J0541J854j4407M366J2144q177n733P825k033k551P614n129q629J2221
1638C443N218j5171P49J2061n116m664O125m290k125J0782m507j2413J0983Q735
1652I810j3489k007J0288l892k292N966p214k983J3313k236j5059Q368J0507j0122
1666a042l194P124l872J02Q001r465o178J4979J606j5879L970J1192p336k125
$$ plain form
1565 -3422 -926 5995 -889 -4887 3419 3256 -2878 1012 1951 -2747 1841 3931 -4416 -2174 6821
1580 6821 746 -5487 2249 2857 -2248 1822 1594 -4171 2257 5879 -4412 -4330 6520 1903 -4935
1595 -4935 1210 1832 -2617 2703 1845 -6376 620 7766 -3620 -6375 4868 2414 -4189 1036 433
1610 433 -4164 3739 3476 -8130 -1646 8426 -1850 -6845 3161 1501 -3120 2715 -1004 -6463
1624 -6463 4078 5932 -8475 -4109 8035 -142 -5875 1950 -83 -2634 4980 -149 -8778 3443
1638 3443 8661 -6510 -5761 6300 1184 -3480 2645 -1645 -3770 7012 2505 -9908 1075 9810
1652 9810 -3679 -5686 4602 710 -1582 4384 -2830 -5813 7500 5264 -9795 -1427 9080 -1042
1666 -1042 -4236 2888 -984 -882 7119 -2346 -8524 6455 8061 -7818 -3848 7344 8 -2117
1680b117M850o254J502J1403r508j0799J4910N090j4453Q27Q536m691L02M787
1694D385r830L77J4622o950j4070J1750P762j1293QN477n610L301O993j2203l090
1709h371J6482k897j4956P871P730p890Q99L318p750M515J0088j2279o955J5907
1723E712Q40j3395M276O169o122L756K708j1098M143J3239j0326r746J2685L750
1737F591j0347K870K841o094O825M052j3451J328J5051p076j0622R060L270o345
1751b047L918j38q060P985P201j3826j832J3935l587q862N637J799m405N552n80
1766B690r472O599R077j1025m768J1147m56p077M201l33m194P115N11j0531M021
1781b495J0411p905o104Q022J73m202L605j679m654P357K801j0700R49R993m539
$$ plain form
1680 -2117 2733 -3521 -2019 9384 -124 -10923 3987 9077 -5376 -4549 3987 -704 -402 4385
1694 4385 -5445 -5068 9554 2604 -11466 284 8046 -3247 -3239 2238 -3372 -71 6922 -5281 -8371
1709 -8371 8111 5214 -9742 -1871 5859 -2031 -1132 2186 -5564 -1049 9039 -3240 -10195 5712
1723 5712 6552 -6843 -2567 3602 -2520 1236 3944 -7154 -3011 10228 -98 -9844 2841 6591
1737 6591 -3756 -886 1955 -4139 2686 6738 -6713 -5385 9666 2590 -8032 1028 4298 -2047
1751 -2047 1871 1733 -6327 1658 8859 -4967 -6799 7136 3549 -5313 324 2123 -2282 3270 2690
1766 2690 -6782 -183 8894 -2131 -6899 4248 3792 -3285 916 583 -3611 3504 4015 -6516 -2495
1781 -2495 7916 11 -6093 1929 2102 -2100 1505 -174 -4828 2529 5330 -5370 -4421 5572 1033
1796A033n301N199o39k482N273k338o826O846N068r343j153Q186k271m233M345
1811A364j951k378O221j254p797M828O353o839k470O318j713k323L941k915l424
1826d039P012M06q069L031O399m967k202M516k208j084M217k873m288O373J853
1841D077o982J138N137l248j263L062k646q47M964k271m843M670L015n548L09
1856a276L573k525l43K641k676j501M964j263m959L286K470l755M62K459k497
1871i40L20K833k903j552L846J52m066J942J980k460K91J568k182K64K497k137
1887e47j877L362K41k782J004J133j429L79J567j997l62K708j052k202K203L66
1903G15j760P79O25r62L90R90j330p19K236p15j679J479J044j583O49J08r28L30
$$ plain form
1796 1033 -4268 931 292 -2190 3083 745 -6081 765 5833 -3510 -4663 3523 1252 -2981 1364
1811 1364 -587 -2965 3256 2002 -5795 -967 5386 -1453 -3923 2395 682 -1641 2300 -615 -4039
1826 -4039 2973 3379 -4690 -1659 4740 -227 -2429 2087 -121 -1205 3012 139 -4149 2224 4077
1841 4077 -2905 -1767 3370 122 -1141 1921 -725 -1572 3392 1121 -3722 948 3963 -1585 -1276
1856 -1276 2297 -228 -571 2070 -606 -2107 2857 1594 -3365 -79 2391 -1364 -902 1557 -940
1871 -940 -620 2213 -690 -2242 1604 1756 -2310 -368 1612 -848 -557 1011 -1171 -907 1590 -547
1887 -547 -2424 938 1179 -1603 -599 534 -895 -516 1051 -946 -1308 1400 348 -1854 349 715
1903 715 -1045 -266 359 -603 -213 777 -553 -1272 964 249 -1430 49 1093 -490 159 267 -661 -331
1921c31J139j160n34J556J06j287M69Q78r85M87K79p88j41J124q52k07R10P2r79
1940b44O18M64q94L43L77p12K14N35k02r19P19J27p99M58J94o06L78L33n41k69
1960d26J128n42p31N62J25p66M55M25m92l1N30m58k9L00j95k24K88J24m47n0M90
1981C6k88m5M96l07n22O84k45m04M27J77o04M43L02o63J68L11Q2o00N64k23j89
2002d00L35J16j64J84O6l35L34J74l64n3O30k69n00O01K30l57M3K93n86J53O30
2023G61n16n18Q84m44n38R20r7m37L19L03p06K19P68q48l57R42l23o61O98K08
2043E77r26O72L60j406M79J240r76q88J374P4j071R55l87q70R41P67j653p6J729
2062I15j356j80R19o99m89J163j05j479J089J608k110n53J857q02o44J370p86
$$ plain form
1921 -331 808 -352 -886 670 776 -511 -42 836 -149 338 617 -171 -312 812 -40 -247 663 735 -244
1940 -244 374 838 -56 287 664 -48 166 701 499 -420 299 426 -373 85 279 -327 51 384 -157 -426
1960 -426 702 160 -571 -9 116 -650 -195 230 -262 -293 237 -221 -250 50 -145 -369 -81 43 -404 -454 36
1981 36 -252 -297 199 -108 -630 54 -191 -595 -168 9 -595 -152 150 -513 -345 -34 48 -552 12 -211 -400
2002 -400 -65 51 -113 71 137 -198 136 310 -54 -107 523 254 -246 355 585 228 271 564 -22 131 761
2023 761 245 -273 611 167 -371 549 452 15 334 637 -69 150 918 70 -287 655 332 -329 369 577
2043 577 -349 323 683 -723 -244 996 20 -868 506 580 -491 464 77 -793 148 915 -738 -814 915
2062 915 -441 -621 298 -401 -890 273 168 -1311 -222 1386 -724 -1277 580 -222 -866 504 -282
2079b82j038K081l94k098J298J609j857l38J580r35l28J771j285j618K947N59
2095A672l138O39K099j383p82J649j001n55K698j689k387K878J049l126N98K286
2111A507j691k87K000k163m99L412j273l422K862J876l279K73K022j846M61J970
2127A923k762j061M383r99m091K339K378k682O65J100k437P04L297l471k340M930
2143A876K38m196J349K110k363R54J287l489J128M261l120l369M337J265l746
2158a478J099J412k624J897J621m463J08N654k470m451L682J692k902J400K52
2173D29l002K816K894n409j088O348j428m402K916Q66k107K327J76m524K926M423
2189D161n397k494N780j96l571J769L95k271L786M24n813K180N946m524l509M699
$$ plain form
2079 -282 -1320 761 367 -1731 -433 1176 -681 -1019 561 -374 -702 1069 -216 -1834 1113 1672
2095 1672 -1466 -827 1272 -111 -893 756 -245 -800 1898 209 -2178 700 1749 -1377 -779 1507
2111 1507 -184 -471 1529 -634 -1133 2279 1006 -2416 446 2322 -957 -684 1338 -508 -47 1923
2127 1923 -839 -1900 2483 1484 -2607 -268 2110 -572 93 1193 -1244 -540 2757 -714 -3054 1876
2143 1876 2114 -2082 -733 1377 -986 -32 1255 -2234 -1106 3155 35 -3334 1003 2268 -1478
2158 -1478 -379 1033 -1591 306 1927 -2536 -2428 3226 756 -3695 -13 1679 -1223 177 429
2173 429 -2573 243 3137 -2272 -3360 2988 1560 -2842 74 940 -1167 1160 1336 -3188 -262 4161
2189 4161 -1236 -3730 2050 1854 -1717 52 447 -1824 1962 2386 -3427 -1247 4699 175 -3334 1365
$$ [...]
8191A36
##END NTUPLES=NMR FID
##END=
