##TITLE=1H_Pr NCO-maf
 CDCl3
 8 sc, 
 22.09.2022
##JCAMPDX= 6.0         $$ Bruker NMR JCAMP-DX V2.0
##DATA TYPE= NMR FID
##DATA CLASS= NTUPLES
##ORIGIN= UXNMR, Bruker Analytische Messtechnik GmbH
##OWNER= root
$$ XWIN-NMR		Version 3.5
$$ Thu Sep 22 14:07:38 2022 Russian Standard Time (UT+4h)  she@DPX200
##.OBSERVE FREQUENCY= 200.1313499994
##.OBSERVE NUCLEUS= ^1H
##.DELAY= (6, 6)
##.ACQUISITION MODE= SIMULTANEOUS
##.ACQUISITION SCHEME= undefined
##.AVERAGES= 8
##.DIGITISER RES= 18
##SPECTROMETER/DATA SYSTEM= spect
##.PULSE SEQUENCE= zg30
##.SOLVENT NAME= CDCl3
##.SHIFT REFERENCE= (INTERNAL, CDCl3, 0, 15.7039)
##AUDIT TRAIL= $$ (NUMBER, WHEN, WHO, WHERE, WHAT)
$$ ##TITLE= Audit trail, XWIN-NMR		Version 3.5
$$ ##JCAMPDX= 5.01
$$ ##ORIGIN= Bruker BioSpin GmbH
$$ ##OWNER= she
$$ F:/spectra/data/she/nmr/H-F/1/audita.txt
$$ ##AUDIT TRAIL=  $$ (NUMBER, WHEN, WHO, WHERE, WHAT)
(   1,<2022-09-22 14:05:46.43 +0400>,<she>,<DPX200>,
      <created by zg, POWCHK disabled, PULCHK disabled
       configuration hash MD5:
       00 E9 B6 7A A2 85 ED C7 34 08 36 98 17 FE 4E 26
       data hash MD5: 16K
       75 84 61 BA 62 F8 BB 02 D2 87 99 87 C5 77 9D 22>)
$$ ##END=
$$ 
$$ hash MD5
$$ 75 59 C1 1B 1F 5D 77 82 DA C0 D7 39 C2 FD 58 83
##$RELAX= 
##$RELAX= 
##$RELAX= 
##$RELAX= 
##$RELAX= 
##$RELAX= 
$$ Bruker specific parameters
$$ --------------------------
##$DU= <F:/spectra>
##$EXPNO= 1
##$NAME= <H-F>
##$PROCNO= 1
##$TYPE= <nmr>
##$USER= <she>
##$AMP= (0..31)
100 100 100 100 100 100 100 100 100 100 100 100 100 100 100 100 100 100 
100 100 100 100 100 100 100 100 100 100 100 100 100 100 
##$AQSEQ= 0
##$AQ_mod= 1
##$AUNM= <au_zg>
##$AUTOPOS= <>
##$BF1= 200.13
##$BF2= 200.13
##$BF3= 200.13
##$BF4= 200.13
##$BF5= 200.13
##$BF6= 200.13
##$BF7= 200.13
##$BF8= 200.13
##$BYTORDA= 1
##$CFDGTYP= 0
##$CFRGTYP= 5
##$CHEMSTR= <none>
##$CNST= (0..31)
1 1 145 1 1 1 1 1 1 1 1 1 1 1 1 1 1 1 1 1 1 1 1 1 1 1 1 1 1 1 1 1 
##$CPDPRG= <>
##$CPDPRG1= <>
##$CPDPRG2= <>
##$CPDPRG3= <>
##$CPDPRG4= <mlev>
##$CPDPRG5= <mlev>
##$CPDPRG6= <mlev>
##$CPDPRG7= <mlev>
##$CPDPRG8= <mlev>
##$CPDPRGB= <>
##$CPDPRGT= <>
##$D= (0..31)
0 1.2 0 0 0 0 0 0 0 0.06 0 0.03 0 0 0 0 0.0002 0 0 0 0 0 0 0 0 0 0 0 0 
0 0 0 
##$DATE= 1663841145
##$DBL= (0..7)
120 120 120 120 120 120 120 120 
##$DBP= (0..7)
150 150 150 150 150 150 150 150 
##$DBP07= 0
##$DBPNAM0= <>
##$DBPNAM1= <>
##$DBPNAM2= <>
##$DBPNAM3= <>
##$DBPNAM4= <>
##$DBPNAM5= <>
##$DBPNAM6= <>
##$DBPNAM7= <>
##$DBPOAL= (0..7)
0.5 0.5 0.5 0.5 0.5 0.5 0.5 0.5 
##$DBPOFFS= (0..7)
0 0 0 0 0 0 0 0 
##$DE= 6
##$DECBNUC= <off>
##$DECIM= 32
##$DECNUC= <off>
##$DECSTAT= 4
##$DIGMOD= 1
##$DIGTYP= 9
##$DL= (0..7)
0 120 120 120 120 120 120 120 
##$DP= (0..7)
150 150 150 150 150 150 150 150 
##$DP07= 0
##$DPNAME0= <>
##$DPNAME1= <>
##$DPNAME2= <>
##$DPNAME3= <>
##$DPNAME4= <>
##$DPNAME5= <>
##$DPNAME6= <>
##$DPNAME7= <>
##$DPOAL= (0..7)
0.5 0.5 0.5 0.5 0.5 0.5 0.5 0.5 
##$DPOFFS= (0..7)
0 0 0 0 0 0 0 0 
##$DQDMODE= 0
##$DR= 18
##$DS= 0
##$DSLIST= <SSSSSSSSSSSSSSS>
$$ [...]
##$SUBNAM2= <"">
##$SUBNAM3= <"">
##$SUBNAM4= <"">
##$SUBNAM5= <"">
##$SUBNAM6= <"">
##$SUBNAM7= <"">
##$SUBNAM8= <"">
##$SUBNAM9= <"">
##$SW= 18.0517283424941
##$SWIBOX= (0..15)
0 0 2 0 0 0 0 0 0 0 0 0 0 0 0 0 
##$SW_h= 3612.71676300578
##$TD= 16384
##$TD0= 1
##$TE= 0
##$TE2= 300
##$TE3= 300
##$TEG= 300
##$TL= (0..7)
0 120 120 120 120 120 120 120 
##$TP= (0..7)
150 150 150 150 150 150 150 150 
##$TP07= 0
##$TPNAME0= <>
##$TPNAME1= <>
##$TPNAME2= <>
##$TPNAME3= <>
##$TPNAME4= <>
##$TPNAME5= <>
##$TPNAME6= <>
##$TPNAME7= <>
##$TPOAL= (0..7)
0.5 0.5 0.5 0.5 0.5 0.5 0.5 0.5 
##$TPOFFS= (0..7)
0 0 0 0 0 0 0 0 
##$TUNHIN= 0
##$TUNHOUT= 0
##$TUNXOUT= 0
##$USERA1= <user>
##$USERA2= <user>
##$USERA3= <user>
##$USERA4= <user>
##$USERA5= <user>
##$V9= 5
##$VALIST= <valist>
##$VCLIST= <CCCCCCCCCCCCCCC>
##$VD= 0
##$VDLIST= <DDDDDDDDDDDDDDD>
##$VPLIST= <PPPPPPPPPPPPPPP>
##$VTLIST= <TTTTTTTTTTTTTTT>
##$WBST= 1024
##$WBSW= 4
##$XGAIN= (0..3)
0 0 0 0 
##$XL= 0
##$YL= 0
##$YMAX_a= 409627
##$YMIN_a= -482901
##$ZGOPTNS= <>
##$ZL1= 120
##$ZL2= 120
##$ZL3= 120
##$ZL4= 120
##$ABSF1= 10
##$ABSF2= 0
##$ABSG= 5
##$ABSL= 3
##$ALPHA= 0
##$AQORDER= 0
##$ASSFAC= 0
##$ASSFACI= 0
##$ASSFACX= 0
##$ASSWID= 0
##$AUNMP= <proc_1d>
##$AZFE= 0.1
##$AZFW= 0.1
##$BCFW= 1
##$BC_mod= 2
##$BYTORDP= 1
##$COROFFS= 0
##$CY= 11.3945322036743
##$DATMOD= 1
##$DC= 2
##$DFILT= <>
##$DTYPP= 0
##$F1P= 2.36226072786647
##$F2P= -0.459571619588291
##$FCOR= 0.5
##$FTSIZE= 0
##$FT_mod= 4
##$GAMMA= 1
##$GB= 0.15
##$INTBC= 1
##$INTSCL= 1
##$ISEN= 128
##$LB= 0.24
##$LEV0= 0
##$LPBIN= 0
##$MAXI= 10000
##$MC2= 0
##$MEAN= 0
##$ME_mod= 0
##$MI= 1.114404
##$NCOEF= 0
##$NC_proc= 0
##$NLEV= 6
##$NOISF1= 3.799351
##$NOISF2= 2.8
##$NSP= 1
##$NTH_PI= 0
##$NZP= 0
##$OFFSET= 15.70392
##$PC= 1
##$PHC0= -18036.55
##$PHC1= 14.00069
##$PH_mod= 1
##$PKNL= yes
##$PPARMOD= 0
##$PSCAL= 0
##$PSIGN= 0
##$REVERSE= no
##$SF= 200.130013532006
##$SI= 16384
##$SIGF1= 3
##$SIGF2= 2
##$SINO= 400
##$SIOLD= 16384
##$SREGLST= <1H.CDCl3>
##$SSB= 0
##$STSI= 0
##$STSR= 0
##$SW_p= 3612.71676300578
##$SYMM= 0
##$S_DEV= 0
##$TDeff= 0
##$TDoff= 0
##$TI= <>
##$TILT= no
##$TM1= 0
##$TM2= 0
##$TOPLEV= 0
##$USERP1= <user>
##$USERP2= <user>
##$USERP3= <user>
##$USERP4= <user>
##$USERP5= <user>
##$WDW= 1
##$XDIM= 8192
##$YMAX_p= 0
##$YMIN_p= 0
$$ End of Bruker specific parameters
$$ ---------------------------------
##NTUPLES= NMR FID
##VAR_NAME=  TIME,          FID/REAL,        FID/IMAG
##SYMBOL=    X,             R,               I
##VAR_TYPE=  INDEPENDENT,   DEPENDENT,       DEPENDENT
##VAR_FORM=  AFFN,          ASDF,            ASDF
##VAR_DIM=   8192,          8192,            8192
##UNITS=     SECONDS,       ARBITRARY UNITS, ARBITRARY UNITS
##FACTOR=    0.0002768,     1,               1
##FIRST=     0,             0,               0
##LAST=      2.2672688,     0,               0
##MIN=       0,             -482901,         0
##MAX=       2.2672688,     409627,          0
$$ Real data points
##PAGE= N=1
##DATA TABLE= (X++(R..R)), XYDATA
$$ [...]
1880E89p39N86N9q14N39K08j027J52O29o40j64N04M4l96J67K48m21J96L36m02
1900c46P2L76j36k04O31m17J45K50l8j03J5J51j14j18m3j01J74j22m33L06J81
1921A26l97R1J63n34J87N74n28k2L25j35m8L44N14r36N2P42m75k76R14l57o02
1942b78R01m7q94L53M31o51J84O80o82p77R75L79j340N43M06q62o5J255p30r01
1962a120J663l66j145J331L73j458K03J627j068l67J626j079j013J334N33j675
1978f01O27R59j388k68J703j183j020J599M26k116J022Q71j827M98J838j514r30
1995a304J783j99j314J673O51k205J80K021j171q55J959o24j518J860L46k336
2011a053N59J709j278n37J889j557j295K141L64k296Q01J147j859K39K326j728
$$ plain form
1880 589 -150 436 495 -319 220 428 -599 -447 182 -458 -622 -118 -74 -470 -303 -55 -476 -280 56 -346
1900 -346 -274 102 -34 -238 393 -24 121 371 333 230 245 396 282 164 121 20 194 72 -361 -55 126
1921 126 -271 -180 -17 -551 -364 210 -318 -340 -15 -150 -198 146 660 -276 -224 518 43 -233 681 324 -278
1942 -278 623 576 -318 35 466 -185 -1 679 -3 -780 195 574 -766 -223 183 -679 -744 511 -219 -1120
1962 -1120 543 177 -968 363 736 -722 -519 1108 40 -327 1299 220 -793 541 1074 -601
1978 -601 26 985 -403 -671 1032 -151 -1171 428 854 -1262 -240 631 -1196 -698 1140 -374 -1304
1995 -1304 479 280 -1034 639 1290 -915 -735 1286 115 -740 1219 595 -923 937 1283 -1053
2011 -1053 -494 1215 -63 -600 1289 -268 -1563 578 942 -1354 -553 594 -1265 -1026 1300 -428
2027d28j005K587n26j844J460O99j986P82K288j946j014K030q42j376K189L84
2043A452k158N38J562k002l60J733p58j230J954M0k296J021J407j494K89J550
2059A248j861j115K532N8j953J488P67k291J110J433j373j015K159m81j584J519
2075F41L83k417J111J882k030l87J389r81j094K383l92j735R53J219j916L56J533
2092H98j087j052K167k48j865J255R51j744P94J772j948q39K088m24j532J615
2108H01M34k451J191J554k110l70J747p58j118J711m09j798R77J656j755J99J396
2125H97j549l53J924l1j939J349O44j862J058J619k164o73K186l39j555J423J03
2142G38j766O96J936k128m74J871j162j066J918j42k030J085J818j825k58J621
$$ plain form
2027 -428 -1433 1154 628 -1216 244 943 -1043 -261 2027 81 -933 1097 255 -1121 1068 1452
2043 1452 -706 -168 1394 -608 -968 765 7 -1223 731 771 -1525 -504 903 -591 -302 1248
2059 1248 -613 -1728 804 862 -1091 397 1164 -1127 -17 1416 43 -972 1187 706 -878 641
2075 641 1024 -1393 -282 1600 -430 -817 572 -409 -1503 880 488 -1247 -294 925 -991 -635 898
2092 898 -189 -1241 926 678 -1187 68 1019 -725 69 1841 -107 -946 1142 718 -814 801
2108 801 1235 -1216 -25 1529 -581 -951 796 38 -1080 631 222 -1576 -599 1057 -698 -499 897
2125 897 -652 -1005 919 888 -1051 298 942 -920 138 1757 -407 -1080 1106 767 -788 635 738
2142 738 -1028 -332 1604 -524 -998 873 -289 -1355 563 421 -1609 -524 1294 -531 -789 832
2158H32j066j001K309Qk181J087J072j634N18J747j935q08K211j37k026J406M01
2175H03j905J046J373j789q50J802k37j640J712J35j781P28J526j412q05J947
2191F53o72q28J464J42j683Q89J361j573k8J352r66r07J696m2j665P07Q14j269
2209e55O1J189j182o09J559j10j486J141J87j012O06R12q72l66J049k10j012J047
2227C37L08r11N51O90j041n91J534p25q82J418j42j406N10J062j014n8J145j035
2245b50l95Q55o5j189R47M32r41K99R06j006k5P67j37r26J181M9r47N38R24r80
2265C7m13J229m95p02P17m7p94M31M90r96L02P15q53m64J022l29p27R68J6r02
2285g95M95R75j058J99P65n81k85P58k52n86N04N93o94j49O92n91k84J039l39
$$ plain form
2158 832 -234 -1235 1074 1082 -1099 -12 1060 -574 -56 1691 -244 -1052 1159 1022 -1004 402 803
2175 803 -1102 -56 1317 -472 -1322 480 243 -1397 315 450 -1331 -603 923 -489 -1294 653
2191 653 -19 -847 617 759 -924 -35 1326 -247 -275 1077 111 -796 900 858 -807 -100 714 -555
2209 -555 -494 695 -487 -1096 463 353 -1133 8 195 -817 -211 701 -171 -537 512 302 -710 337
2227 337 645 -266 285 975 -66 -657 877 152 -730 688 546 -860 -350 712 -302 -360 785 -250
2245 -250 -645 210 145 -1044 -97 335 -606 -307 599 -407 -432 335 198 -728 453 502 -445 93 1017 37
2265 37 -376 853 358 -344 373 326 -468 -37 453 -543 -241 474 -379 -843 179 -150 -877 91 107 -795
2285 -795 -300 675 -383 -184 581 0 -285 473 221 -365 139 732 38 -111 581 -10 -294 745 406
2304D06r51O63K96p09J50N38o89m1K26J23o40N66M03r33M96M73k30m15P47k93
2324A86n09O47k37k66K89L92q60K40N21m46m62J029j40n53K89K61o42r2P12o72
2344c13l09P59k73m64P48r3l91J51P42q34K8M43j32k45N88J09o61M64k7m95L42
2365A37L0K0k69K76o3l47J50R4j00r3L14k82k75K31J32m06L83J30k82P2N31l20
2387F3m3J23k48K3K43J09n81L53L45k50J9N3l12K23n3j17R2r7J4l67K35J98m22
2410c97K41K68k15k02L13O3k7j55L23j08L5L10m13j9L82k54n2M6l0j10O9m1P6
2433A03k45J30M2j66J8J41Q5l73J51o2p2L03J7o6n2K07n0j25O8J24J9j56J10N0
2457B01r8J94j54l0K06k96J2l50K88j37m2K08qj88K06m7j83nR1R5L3J01j9k24
$$ plain form
2304 406 -545 118 414 -295 -145 393 -296 -337 -111 12 -628 -62 341 -592 -96 377 147 -268 479 186
2324 186 -323 324 87 -179 110 502 -358 -118 403 -43 -505 524 384 -169 120 381 -261 -353 359 -313
2344 -313 -622 137 -136 -600 148 55 -336 -185 557 -277 -249 194 62 -183 405 514 -147 317 290 -205 137
2365 137 167 187 -82 194 131 -216 -66 28 -72 -165 149 -133 -408 -177 -45 -451 -68 62 -220 -148 383 63
2387 63 20 143 -105 -82 161 270 -311 42 387 137 156 209 -103 120 67 -50 42 -55 -41 -408 -173 25 -397
2410 -397 -156 112 -103 -305 8 71 44 -111 212 104 139 449 36 17 399 145 93 139 109 -1 68 27 103
2433 103 -142 -12 30 -136 -118 23 108 -265 -114 -176 -248 55 72 6 -46 161 111 -14 54 178 197 41 151 201
2457 201 103 297 143 113 319 23 35 -315 -27 -164 -206 2 -6 -194 12 -35 -218 -223 -132 -37 -4 97 78 -146
2481a46l6L71l86K53M6k44o0O92j68m24K27K84j84NK06m90k02O05k62m09M53K06
2503C37p92q4P47l09l07L37J40l02L42pn16K58O19l84k62L60q7k24K27L89o53
2524a71L01J52o27L67N12n24n75P63J86r59M29M18m12k45O34m95k77P19r7n95
2544d96Q23Kr30M31O41m23n15J101m43k67M59K13j163M16R52q41j53O51p22l20
2564e84N83K14o19J86P15j040j95J045l62n84P55L49j035L99N86j034N18J037
2582I34m76r15P01J61r59R17N57j086r3Q78p04k83J109l32r41M94M68j078K24
2601d24P37m51m14Q37m66m08N47L10o83K39P08p74J9J132r09m51J096l36p38N87
2621A58J96o65l4Q51k51r78R79j82m09M01L87r65K60M04n86j64J110l93o65O43
$$ plain form
2481 -146 -182 189 -197 56 102 -142 -202 490 322 -102 125 409 225 230 436 -54 -256 349 87 -322 131 337
2503 337 -455 -539 208 -101 -408 -71 69 -233 109 102 -414 -156 463 79 -183 177 90 -134 93 482 -171
2524 -171 130 282 -345 22 534 10 -565 198 384 -575 -146 272 -140 -385 249 -246 -523 196 99 -496
2544 -496 327 329 -601 -170 471 48 -467 634 191 -76 383 596 -567 -151 801 -40 -193 458 -264 -584
2564 -584 -1 213 -406 -220 495 -545 -740 305 -57 -641 114 463 -572 -173 413 -621 -103 934
2582 934 458 -457 244 405 -554 363 920 -166 -259 619 -85 -368 741 409 -532 -38 430 -648 -424
2601 -424 313 -138 -552 285 -181 -589 -42 268 -415 -176 532 -242 -223 909 0 -451 645 309 -429 158
2621 158 354 -311 -345 506 255 -723 256 74 -335 66 453 -512 -252 152 -434 -598 512 119 -546 97
2641I7qm15M0O34o85J67R80n07l77K83L32q28O43J13r03K73Q15o18m76Q50p23
2662c13k38R08P4j129M54P42p17m0O17l88m23N26L98q48K06L08m36J34M82m51
2682a34m4N76o9n06J69O46r02j1P11m14m39M98j65m38P70M1p73K20M66o37J13
2703c22N34j52o39R32k9p15N51J61m96K0O87o11j41O63l53l02M14J60l93J29J72
2724B70o32L47L44l34m10L82K18o49K38L93m92Q1P69n82k47K67O3m51N02L39m54
2745c8j36M42k31q6M54k82m15M01O6m30O07O0n27j24L91k05j80L66Q5p23J93K57
2767e5j79n3M05j16m13N28q2m37N10K48o74L55N03m87R4K96k28p26O10r4k29J15
2789a09N66o13K31K86p49K26J09M1q2l6J37l47M08L41o27j6N99m42k51N25ql60
$$ plain form
2641 97 89 -326 -286 348 -337 -170 810 303 -74 209 541 -287 356 469 -434 -161 654 36 -440 410 -313
2662 -313 -551 357 431 -698 -244 498 -219 -259 358 -30 -453 73 471 -377 -171 137 -299 -165 317 -134
2682 -134 -178 398 329 -177 -8 638 -264 -275 436 22 -417 81 -84 -522 248 289 -484 -264 202 -435 -322
2703 -322 212 60 -579 353 324 -391 160 321 -175 -155 532 -79 -220 443 90 -212 202 362 -31 98 270
2724 270 -362 -15 329 -5 -415 -33 185 -464 -226 167 -325 -244 525 -57 -304 -37 26 -425 77 416 -38
2745 -38 -174 268 37 -49 405 123 -292 109 175 -255 352 412 -115 -239 152 -53 -233 133 218 -505 -312 -55
2767 -55 -234 -287 118 2 -411 117 35 -402 108 356 -318 37 540 53 147 443 215 -511 99 5 -224 -109
2789 -109 457 -156 75 361 -388 -162 -53 -12 -94 -130 7 -340 68 409 -218 -234 365 -77 -328 197 189 -171
2811a71L71K0k37J38J34j92j74L04q2j80j1K87n29n7N25k65j28K66J4k68L55O5
2833A85n19J56N26l80k01L76K1k10R1M1l15L82l5j25K71P2l61P2J27k05qp8K24
2856A07j21m1K38l51l7K37J24l56K15J44o07K55J35j53J04K42l40J22L70n5k27
2877EJ24J25k14o1m6N46o11J50j27q7J22L57n49p0M86l57J85q5k3j76K38K3j47
2900a92J5L81n84J97K24J5mP6o4k1p4O9l1j19K42J35l86K10r5J12j69J8n9p6J18
2925f2J54j99J14n4k88L12K35j30j62J41j04m3K36r6K67j82j44R9j89L54l55O
2947i0L02l89J10j96L43j34O9m9l1k34J77k68M82j37j92Q7p1P2K09J01m25K70
2969FJ04k37J50O0q6K37J29k42j95K03j39p1J88k38P6o0Q8M7Pl55L17j80QJ98
$$ plain form
2811 -171 200 220 -17 121 255 63 -111 193 111 -69 -80 207 -322 -379 146 -119 -247 19 33 -235 120 185
2833 185 -334 -178 348 -32 -233 143 164 -46 45 86 -229 153 118 -7 264 336 -25 47 174 -31 -39 -117 107
2856 107 -14 -55 183 -168 -205 32 156 -200 15 159 -448 -193 -58 -211 -107 135 -205 -83 287 232 5
2877 5 129 254 40 -21 -67 479 -132 18 -109 -196 -74 283 -266 -336 150 -207 -22 -107 -130 -306 -68 -45 -192
2900 -192 -177 204 -380 -183 41 56 52 128 64 43 -31 38 7 -112 130 265 -121 89 -6 106 -63 -45 -104 -180 -62
2925 -62 92 -107 7 -47 -335 -23 212 82 -80 61 -43 -86 150 54 321 139 -5 94 -95 259 -96 -90
2947 -90 212 -177 -67 -263 80 -54 15 -34 -65 -299 -122 -390 92 -45 -237 -150 -221 -149 60 161 -264 6
2969 6 110 -127 23 83 -3 234 363 121 -74 129 -10 -81 107 -131 -55 -115 -27 20 27 -328 -11 -191 -183 15
2993A5k27M44j79q3J04J82l26M2LJ13k02J77J65l32m2K91J2k33K37P3l12R5J03
3016A20J3l57L68Kj82o4j71p9J73N12m36OJ21Rl49M46p5n6K7M2mk31K48J52k77
3041d2L24j49k43K59p1l4j50L36m05N6K02M9m79K61M1k02L97l8o8o6K52l85k0
3064a75J69J16oj38J04J8n6N0o3K9R8m5j72J10L40o27K53J35n2k39K42m1l34J20
3088a64K37j12L1J24l29K5K22K36n29K1K06k4J59P7o7l36K82%k14K05K36l72R0
3111Dr7K24m56M68j03m02N38k95k57K70J54k48K64k78J32j49N5J15j70J67K16
3132A52k14J37J03j69j4J18n5K48j44j26J22j18J81l66k1M03k31j75k4J39J02
3153D8j81J41k27L72l08j21L05p5K63k24j80k3r5M35J86k42j9K62l28j30M34l19
$$ plain form
2993 15 -212 232 53 -30 74 256 -70 -28 -25 88 -114 63 228 -104 -146 145 157 -76 161 234 -78 17 120
3016 120 133 -224 144 146 -36 -100 -271 -350 -177 335 -101 -95 26 35 -314 132 57 1 28 70 66 -165 83 235 -42
3041 -42 282 133 -110 149 78 44 -106 230 -175 -119 83 132 -347 -86 -45 -247 150 112 44 -22 230 -155 -175
3064 -175 -6 110 104 -34 70 88 32 82 19 48 146 101 -71 39 379 -248 5 140 88 -151 91 50 -284 -164
3088 -164 73 -39 -8 116 -213 -188 34 270 -259 -238 -32 -56 103 180 113 -223 59 59 -155 50 286 -86 4
3111 4 -93 131 -325 143 40 -362 176 -119 -376 -106 48 -200 64 -214 -82 -231 -176 -61 -231 -64 152
3132 152 -62 75 178 9 -5 113 58 306 162 36 158 40 221 -145 -166 237 6 -169 -193 -54 48
3153 48 -133 8 -219 153 -155 -276 29 -46 217 -7 -187 -210 -305 130 316 74 55 317 -11 -141 293 -26
3175b6n4l7K83m25M48O5o05K24K02k20j9j3J91j92J16J09k74L22L8j08p1K43J64
3198C61m89J91J27k27k8J31j02J20K27k46k30L21k85k49L05O5N4k03K38j84k8
3219a31J85L6m91N64Q9o48K01J91n8J25J34j58r4O3J98l42L48nj86o1K53k90J3
3242f4J63J5j79M5j15J13K6q3j46J25k64N58m23J74J5l10M89N1p5j59K46k75k00
3265b73J96K15j27P5K4P9m46L53j55j9r0L48j88J05K8j18K9j00J46l22M23p9j74
3288g0J53J80n39J59L41l31L19j91Kj95J32M09n53M41R9k32j34K66k46m4M7j41
3310a28lj10K04N7q8J8J7j80J28L42l05J08n0k40J67J52M5j92R3l7J48j20q9q1
3334a44J90M5L42n73K49m6P2q2j48N9K44k15K7l25L74j93Q5%K9k3k5J74j2J42
$$ plain form
3175 -26 -80 -117 166 -259 189 254 -351 -127 75 -145 -164 -177 14 -178 -62 47 -227 95 133 25 -46 197 361
3198 361 -128 63 190 -37 -65 66 -36 84 311 65 -165 156 -129 -378 -73 -8 46 -157 81 -103 -131
3219 -131 54 90 -401 163 252 -396 -195 -4 -62 63 197 39 -55 8 206 -136 212 207 21 -40 213 -77 -64
3242 -64 99 114 -65 -20 -135 -22 4 -79 -225 -100 -364 194 -229 -55 -40 -350 139 190 115 -44 202 -73 -273
3265 -273 -77 138 11 86 110 189 -257 96 -59 -78 -168 180 -8 97 125 7 36 -64 82 -240 183 104 -70
3288 -70 83 263 -276 -117 224 -107 212 21 23 -172 -40 369 -184 257 356 124 -10 256 10 -34 13 -128
3310 -128 -131 -241 -37 20 -68 -50 -33 -213 -85 257 -48 60 10 -230 -63 89 134 -58 35 -2 146 26 -63 -144
3334 -144 46 91 433 -140 109 63 135 53 -95 -36 208 -7 20 -305 69 -124 -39 -39 -10 -33 -58 116 104 246
3358B46m07J46j10K80l22K93P0j70r7J64j78k94L98K47l97m7M09l87o9P2k9Q7
3380i5J78k0J2l21L99o0j64K4K19p3j1n4l03L68l40M61q8j63M6J03j40J06k39
3403a55L55J1J44k71K21j15J3k65oJM6K43j59j92J12K19m93K80R0l0m1q2L56r2
3427A90j41j31J69J03k45K3K00l53J01K06p5K4k66J05J51j32K10k91R6K04k88
3448a40p8M37l65K93j71L03k25k6rn7K15k58Q5j61k48M50j02J8J57J22r0k77J67
3471D0j65M95l62p5k78L68l6p7k8K5Q0N1n1K0j10K31j76j25K53J6J3o6L8j61J02
3496B2K95l54K31J01j42J34m59L38l87K09l7J45l41K34j47N6k55L97J04j71l3
3517f0o8K11j28K77p7j32K34N8l09Q6L6j3l24K58N2p4j18M37l55j20o9J01k3J21
$$ plain form
3358 246 -161 -15 -125 155 -167 126 196 26 -71 93 -85 -379 19 266 -131 -178 231 -156 -225 -153 -182 -95
3380 -95 83 63 75 -246 153 93 -71 -47 172 99 88 34 -269 99 -241 220 132 -31 15 118 -22 84 -155
3403 -155 200 211 355 84 305 190 203 -62 -68 -67 -21 222 63 -129 -17 202 -291 -11 79 49 8 -74 282 190
3427 190 49 -82 87 190 -55 -32 168 -185 -84 122 47 71 -195 -90 61 -71 139 -152 -56 148 -140
3448 -140 -218 219 -146 147 -24 279 54 28 19 -38 177 -81 4 -157 -405 45 -57 -39 118 240 150 -127 40
3471 40 -125 370 8 -67 -345 23 -13 -90 -118 -93 -13 38 -13 7 -103 128 -48 -173 80 96 109 43 81 -80 22
3496 22 317 -37 194 295 153 287 -172 166 -221 -12 -49 96 -245 -11 -158 -102 -357 40 144 -27 -60
3517 -60 -128 83 -45 232 155 23 257 315 6 92 128 115 -209 49 101 27 -91 346 -9 -129 -198 -97 -120 1
3541Ao1J11k0P5j67J91Q4l99l0L04L02m69J45k6k4Q5K9Ok1q3Qp8O4K72k58k92
3567b51Q8J67p9J29J13P5m30K23n3k15K60r4J98j70J5NJ49k83J49j9Q5M3r5j47
3591a37L39k40P8J75n1k7Q5l92K77j35j4p6L29k79j22L1M19m42K2L76k10j26K15
3614I5Q2j52J80N8l71M03m9k25M3R7k17p5K13q4K96k64N9k56l6j9Q7j98K92jm1
3639h3K3K05j63m8N9K47n36N37k21j52L45j22j66J00j2J58p5M0K4p2J45j55m51
3662c73N45j19N0l8j22J40m34K59J72k22J52j85K43n4J21p6J17r7J22m23K8L28
3684A34l3k94L27k06J28l7J39l6l74J75J20k01R9LK12j0j58P5J46m3m66nL81j25
3708d9L13k32L8j11O5P7k48L00j81K1P4mj0M5K17k17Qj60P0K6J00j98J82q0K4
$$ plain form
3541 1 -60 51 31 106 -61 130 214 -185 -215 89 391 -78 67 41 17 102 131 137 116 33 41 -37 27 299 41 -251
3567 -251 -163 4 -75 54 167 242 -188 35 -18 -233 27 -67 131 -39 -24 -19 130 -153 -4 -23 62 105 10 -137
3591 -137 202 -38 40 215 164 137 222 -170 107 -28 -42 -118 211 -68 -190 -159 260 -182 -160 216 6 -120 95
3614 95 177 25 205 263 -108 295 246 21 64 161 -56 -131 82 -2 294 30 89 -167 -203 -222 -135 -333 -41 -42 -83
3639 -83 -60 145 -18 -66 -7 240 -296 241 20 -132 213 91 -75 25 13 171 96 136 160 88 233 78 -373
3662 -373 172 53 103 65 -57 83 -351 -92 80 -142 10 -175 68 14 135 59 176 79 201 -222 -194 134
3684 134 101 -193 134 -72 56 19 158 122 -252 -77 43 -158 -59 -56 156 146 -12 63 209 166 -300 -305 76 -49
3708 -49 264 32 70 -41 24 101 -147 153 -28 -7 67 63 53 98 315 98 106 -54 16 42 142 -56 126 46 70
3733G0k41J17L5j52J63j52L03j81P5J40k69J00L17j56k84J39M4l0p4K23J14j69
3755A32j41l8l31M23J31l38K87j69l2J94p1n8Nj85K77k19J33o8N3j8K10L2k20
3778a1m8J63J87k58O3J8Noqj68J83j70K36l1j45m1J21K0j85J35LK4Jj06R6n7J82
3805B03j5j93o5K36r9k31L04k61K82k17Q3J6l1K68k90j32PK92k00k25M03j44n
3828a4R0k5k05J43Q0L2j18O6k27Q7L8J35O9Pp5k64L38j68o0L0L47o55M26J31j41
3853F7k4P7p3j44K31J02k12o3n0k79L52j08R3p3J60m2j21K38j49o7R9K44k90J56
3877A24j34K12k91j20N74l80o6L82n99L33P8k6p9J02J9k07M1K68k26k86K89k4
3899a6o9n2ol04P49K7m35L7J3jj6K15j00l5J74J6k27O1P0k31K1j06Q6K78L9l33
$$ plain form
3733 70 -171 -54 -19 -171 -8 -160 143 -38 37 177 -92 8 325 169 -115 24 68 38 -36 187 301 132
3755 132 -9 -47 -378 45 176 -162 125 -44 -76 118 47 -11 -6 -191 86 -133 0 -68 -15 -33 177 209 -11
3778 -11 -59 104 291 33 96 114 119 113 105 -63 120 -50 186 155 10 -31 90 110 -75 60 63 87 88 -18 78 21 203
3805 203 188 -5 -70 166 67 -164 140 -121 161 -56 27 43 12 280 -10 -142 -135 157 -43 -268 135 -9 -14
3828 -14 76 51 -154 -11 69 101 -17 49 -178 -91 -53 82 151 158 83 -181 157 -11 -71 -41 306 -349 77 208 67
3853 67 43 120 47 -97 134 236 24 -39 -89 -368 -16 -124 -31 -104 56 14 -107 131 -18 -85 14 258 -32 124
3877 124 -10 202 -89 -209 365 -15 -81 301 -298 35 113 87 8 110 129 -78 -37 231 5 -281 8 -16
3899 -16 -85 -137 -143 -447 302 329 -106 -69 -56 -57 -73 142 42 7 181 197 -30 31 101 -130 -109 -215 -129 149 188 -145
3925a45O2K39m1j33J48j16R6j21k74J11J34K04k73K5L11k26K06k83j9j01J88O0
3947E2O6k09K29m4j96j08K75j06Q1M5k49N14l61K3j14J03K12j94p0J47j07q3J65
3970G1q5m1M8J94j75JQ6l44M03j41L0J37j03k18K85q0k72M3J9Q5M2k49M84k00
3994B0k91K04J41k71J66Q1R6J58l30j66M81j67R8J15j64j55j76J62m7J02M4j00
4016Ao6M3n1J19j11J01j54K45j37o2m6pK02r3P8q0L7l0n4l5m5n3J12R%J44l68
4043c01L64rm1pj77K55j61j27N11l32r9q9K36n0N0j92Q7N8J43k81N09l44k42J59
4067h0O3K2j12K06l4J63k14l1l9k21K24K16J15j35j66jL8K73j92j72J04l3J10
4090A04J5j80R8k13K15J8K9j7r0k6J99k33N0P0j23QJ2K29j25j69K12l26J92Q8
$$ plain form
3925 -145 -83 156 115 -18 130 14 110 -11 -285 -174 -40 164 -109 -84 227 1 207 -76 -95 -196 -8 52
3947 52 118 -91 138 94 -102 -210 65 -41 40 85 -164 350 -11 12 -102 1 213 19 -51 96 -11 -94 71
3970 71 -14 -55 -7 187 12 13 99 -245 158 17 47 184 81 -137 148 68 -204 -161 -142 -57 -15 -264 220 20
3994 20 -271 -67 74 -197 -31 50 146 304 -26 -192 289 122 220 335 171 16 -160 2 -45 57 101 1
4016 1 -65 -22 -73 46 -65 36 -118 127 -10 -72 -118 -125 77 -16 62 -18 19 -11 -65 -100 -145 -198 -86 -77 -77 67 -301
4043 -301 63 54 13 6 -171 84 -77 -204 307 -25 -124 -213 23 -27 23 -169 -82 -24 119 -162 347 3 -239 -80
4067 -80 -17 5 -107 99 65 228 14 -17 -56 -277 -53 163 278 143 -23 -24 14 287 95 -77 27 -6 104
4090 104 119 -61 37 -176 39 57 86 69 -21 -47 152 -81 -31 39 -84 -76 -64 165 40 -129 83 -243 -51 37
4114C7O8j35j8l7l75M24k57L44Rj42M5q2p5K81k61M01l20O2K8O1J29j82n0m3J50
4139F2l9K60P1m31K78j25j81K17k27RJ3J18M2r1j4J53j78QJ18p4K13k02j84K52
4163F8j9k49J67N5L9m0O7n1N6N0j30J55m6q9L2o7%N4Kj44K22j72j72K4L60J59
4189C31k88o9J72k77J70k20K45n8Q9K6k70l9J05K42jj25jJ80j1J9j48k28J64k4
4213a6J47J03N6k11k65K46l05J25m2Q3pj80K42L52l78J89q9J35k4q1J70q6P1n24
4237b89J45J57PNn6r5ON0K18k14l3R9N9k55Q7J97j10J68k38j16J71J93r7J08K5
4262A92j09l9J14o4k98L11M2j24Q5j50mk8n8K23j66J08j55k41M08N8P6k07j24
4285a50R1P0q8Qj63K65j27j8J51q9P5J48k91M18j56j85O0n6j7M8J42l8K2j97J0
$$ plain form
4114 37 105 -30 -48 -85 -460 -36 -293 51 60 -82 -37 -119 -194 87 -174 227 -93 -31 -3 58 187 5 -45 -88 62
4139 62 23 283 354 -77 201 76 -105 112 -115 -106 -93 25 67 -24 -38 115 -63 -55 63 -11 202 0 -184 68
4163 68 49 -200 -33 22 61 21 88 37 93 143 13 168 122 33 65 -2 -2 52 54 -90 132 -40 -212 -188 172 331
4189 331 43 -26 146 -131 39 -181 64 6 95 121 -149 -188 -83 159 158 33 32 212 201 220 72 -156 8 -16
4213 -16 131 234 290 79 -186 60 -245 -120 -162 -79 -86 -266 -24 328 -50 139 50 185 161 80 250 164 235 -289
4237 -289 -144 13 20 25 -31 -126 -120 -70 148 -66 -99 0 59 -196 -109 88 -22 146 -92 -208 -37 156 59 167 192
4262 192 83 44 158 94 -204 107 149 25 110 -40 -44 -72 -130 93 -73 35 -120 -361 47 105 181 -26 -150
4285 -150 -59 11 -77 -69 -232 33 -94 -112 39 -50 25 173 -118 300 144 -41 19 -37 -54 -6 136 98 120 -77 -67
4310f7j7K63j83l0J10k82l9K89K9o3P8k30K95j29J13l02J21J96k26J2Rj37L69
4333A79l00M8J33M2O7m7k39J12J85j15N2j80K34l36M1J09J1J46k29JO6qN3l5q9
4358i9l3O4J92j42P6k42K05m04M71j38J26j09n7l48P92l25o7P1O2L9l17K81Qk22
4382a16O6K62l14K10K3j85J50j37lK0J02n8lK47o0j83L26n42K21K9o4K9j1o4K0
4407c5O6K85m11Q0J7qq9L6q3J95j13k19K05P4K56k71o6PjJ57m3J69k4q0j1R2j39
4434D6R6k66N0K12j67J8J1k07P3L18l10J02k50K17k7O2j72q7K76J43j30J08J42
4457B58l52K98k13l3J71k6j53J9J17j50K0p4J59l25M14j66k2J89j08r1q7P4p2
4480a53Q1J38l21M08l86K71j91K51j49J8j42L66o9N2J08j78k9J90k82K9N7k48
$$ plain form
4310 -67 -84 179 -4 -34 76 -206 -245 44 73 10 88 -142 153 24 137 -165 -44 152 -74 -62 -53 -190 179
4333 179 -121 -73 60 102 169 122 -117 -5 180 65 117 -63 171 -165 -124 -15 -4 142 -87 -86 -20 -28 25 -10 -99
4358 -99 -132 -68 124 -18 58 -184 21 -383 88 -50 76 -33 -90 -438 354 29 -38 33 95 134 -183 98 106 -116
4382 -116 -50 212 -102 108 131 -54 96 -41 -44 -24 78 20 17 264 204 21 347 -195 26 55 -9 20 9 -55 -35
4407 -35 31 316 -95 -15 2 -6 -95 -59 -142 53 -60 -279 -74 0 256 -15 -81 -74 -75 82 39 208 184 104 93 185 46
4434 46 142 -124 -74 138 -29 -11 0 -207 -134 184 -126 -24 -274 -57 -84 -22 -194 -281 -5 138 8 116 258
4457 258 -94 204 -9 -42 129 103 -50 -31 86 -64 -44 -118 41 -284 130 -36 -58 131 23 -68 -155 -81 -153
4480 -153 -72 66 -255 153 -233 38 -153 98 -51 -33 -175 191 122 174 282 104 75 265 -17 12 69 -179
4502a79j09KK89J76K34o65J21J19k55J25K6J47m0Q7j7Rj83J38l58R5L08k85K93
4525G8j77J33m9R5J88j23J4k1j13N4m23J04J73j0j97L50j41J2O2j%J01j38N0K1
4550D2k16K80pj58j36J15K44l9K52o63L88k15K24J0j12N6k33L46j38J69j88J0
4572C1q2k38L31j01j5P6L0q6K7o0q3J89lJ44Jk27q7K24j10L8L9Rq9j75K58J85
4598B26j14O8j07%K5j50J65j63j23J11q0J46p8O7J08o7J14k14p7P6K28k9L6p8
4622I0l3k9M4q7J32j4j6n9Mo0M53m18k4k4O9j73O5J66k79L18j57J17p9J37M8j15
4648G6L7o3j5R7j79j2K25k59L4J29n3j6k22L23q3q7L01l87K48k18K55o6J78q7
4672A56j26l5q1j27J61M5j57J79k46K54K7m1p2J06J25p7r7J64j64N0o5Q8K6M5
$$ plain form
4502 -179 -288 -286 3 179 413 -252 -131 -12 -267 -142 -116 31 -9 78 61 70 -113 25 -333 -238 70 -215 78
4525 78 -99 34 -15 80 268 145 159 138 25 79 -344 -240 -67 -77 -274 76 -65 -53 9 8 8 109 -29 21 42
4550 42 -174 106 99 -59 -195 -80 164 125 377 -286 102 -113 111 121 9 65 -168 178 40 209 21 31
4572 31 -51 -289 42 -59 -74 2 32 -54 -27 -87 -170 19 16 160 161 -66 -153 71 -39 -1 38 47 -42 -217 41 226
4598 226 112 180 73 73 98 -52 113 -50 -173 -62 -142 4 -74 -7 101 34 148 -66 -143 -67 161 132 168 90
4622 90 57 28 72 -15 117 103 87 28 32 -28 425 7 -17 -41 28 -145 -80 86 -193 125 -32 85 6 143 191 76
4648 76 113 50 35 132 -47 -59 166 -93 -59 70 17 1 -221 102 19 -68 233 -154 94 -124 131 65 243 156
4672 156 30 -5 -86 -213 -52 -7 -164 15 -231 23 50 9 -63 43 168 91 -6 158 -6 44 -21 67 93 138
4696A38l7j66J38k06M0j16J30R1j63R3P5n1K08m58L3L27P5j00j54J33K4J6j04
4719c4L0P1O5j4n9j27p2M16m00L57j48j07J05P9j06r4l3M9j33J11pN5J50j31r3
4744g0J22L2j6r7j8J00l7o0M5J06m1j04J07l8j3N1q9j7j83j6L90m55L73j20J76
4769A28k88Q1J41JO5l31K00JK31K2k11J3j09L31j32o1J36l16O3j45M27j88j25
4792f6R2L7J25m32K96mk38K46j61N0K03k18J76l22J2J43K49k17J22P3j50qJ29
4815A37j16J22k15N8J81j23l23J69k1L53k94J35J86l24J99k55K22k53M04l35J57
4836F4M0j86p6J56J18j37j8k67L44m17J16J57J59p5L3L6j84K95l71K16Lj07Q0
4859b1J63j51j18QJ05J92k52J33k81R8J48J36k45J23n7J06K70k68j09J54j14J58
$$ plain form
4696 138 101 -65 73 -133 -93 -209 -79 12 -151 -58 17 -34 174 -284 -251 76 151 51 -103 30 54 70 -34
4719 -34 -4 67 132 118 59 -68 -140 276 -124 233 85 -22 83 162 56 -38 -71 -22 -155 -44 -51 4 154 23 -70
4744 -70 52 84 68 -29 -47 53 16 -44 1 107 66 -38 69 31 18 69 -20 -37 -220 -236 154 -301 72 -48 128
4769 128 -160 -79 62 63 128 -203 -3 -2 229 251 40 53 -56 275 143 82 218 -98 -35 -180 247 59 -66
4792 -66 26 63 188 -244 52 48 -190 56 -105 -55 148 -70 106 -216 -204 -61 188 -29 93 166 16 8 137
4815 137 21 143 -72 -14 167 44 -279 -110 -131 222 -72 63 249 -75 124 -131 91 -162 242 -93 64
4836 64 104 -82 -158 -2 116 -21 -39 -306 38 -379 -263 -106 53 -22 11 47 -137 158 -213 3 6 -101 -21
4859 -21 142 -9 -127 -119 -14 178 -74 59 -222 -124 24 160 -85 38 -19 87 357 89 -20 134 20 178
4881A78l0J9o5m9j59K22j01K3K03k64K22m04L00j00p5k42K65M5r2r1L30l30M79
4904B84j4k5n2j87m8j32M30o0Pk39K94k11l3k9J45k61L71k08l2j5k53M14J2m09
4928b51N05j67N1j88J94k2R3k01k55Q5L26k43J20j74K32j13J34j36n5J94k28J90
4950I1o6q9K32m0l54N06k69j64K33m3m7o8P8j71K33j20k66L31J6k5K8oK5J36j3
4975A68l70K22j92K49k36p4L46j17Q5O9l1L13l69j57J44L8k56K30j04j06J27R9
4997G8j47nj23J67K74j03l57J97K69j43j88n2j53N37n0j88n5k1K07n8j29j16K27
5020F8k41K72kn9k94L48k98J95O3qj04L42j86l6l18K49j12J45nP2K9j47J14Jj05
5045a7N9l5l2J86k63Q9m6j02K25N4m7o8m9J2k41L57j94R8J81l78K50P5l70M19
$$ plain form
4881 178 148 167 102 53 -106 116 15 38 241 -23 199 -205 95 -5 -80 -322 -57 -12 -104 -195 135 -195 284
4904 284 270 245 193 6 -42 -174 256 196 203 -36 258 47 14 -15 130 -131 240 32 0 -15 -268 146 158 -251
4928 -251 254 87 138 -50 144 122 215 14 -241 -156 170 -73 47 -127 105 -8 126 -10 -65 129 -99 91
4950 91 25 -64 168 128 -226 280 11 -153 80 37 -10 -78 0 -171 62 -58 -324 7 23 -2 26 20 45 181 168
4975 168 -202 20 -172 77 -159 -233 113 -4 81 150 119 432 63 -94 50 88 -168 62 -42 -148 -21 78
4997 78 -69 -74 -197 -30 244 141 -216 -19 250 107 -81 -133 -286 251 201 13 -42 -63 144 86 -43 -159 68
5020 68 -173 99 97 38 -256 92 -206 -11 52 44 -60 282 96 60 -258 -9 -121 24 19 91 120 -27 87 88 -17
5045 -17 42 7 -25 161 -102 -13 -59 -161 64 118 71 3 -46 -34 -275 82 -112 -14 167 -211 39 114 -256 163
5069A63r3n7O4J7J7m7l5J03Lk17J23o1K3N2J29Oj91k82L22l04L32Mj57J82P5k69
5095i8N1K6O4qj08K37n0k38K33k80K61Rj28R4k70K65J08r1q3K38l29Q8O4R2q4
5120F3j30k53M7J18J99K32j63K5k29M14n29J89J04j18j28J24l1nJ29k21N1K56
5142A44j17O5j23Q1o6p2K02o1N9k20m6J71j56L2M02l87J10J59j08l52L49o4m2
5165d0j8o3N1J68Q7j28k70L62j99K6K82k08k9LJ18k34J7J27k28K27N8j51J32k00
5189a10K8j65J69J85j71J11j76L12k17J20q8o5J69j07K2j0Q4j80L02k21P0J4j58
5212h2L74o18M36j51J44j03j60P0R3m9K25j25J39j86k08L89k35m5J1q8M0J03R7
5235G1j39J45M0J27p6q6Q6k70J39j37m8J0qP7Qm2k24J64M2J89J27j54N3M8j25
$$ plain form
5069 163 70 13 77 94 111 64 29 132 135 -82 41 -20 3 55 184 190 -1 -283 39 -265 67 71 -86 96 171 -98
5095 -98 -47 -21 43 35 -73 164 114 -124 109 -171 90 99 -29 65 -205 60 168 77 -6 232 -97 -9 55 147 63
5120 63 -67 -320 -273 -155 44 276 113 138 -91 323 -206 -17 87 -31 -159 -35 -66 -71 58 -163 -112 144
5142 144 27 92 -31 50 -16 -88 114 53 112 -108 -154 17 -139 -107 295 -92 18 177 69 -283 66 2 -40
5165 -40 -58 -121 -70 98 185 57 -213 149 -50 -24 258 50 21 24 142 -92 -75 52 -176 51 109 -42 90 -110
5189 -110 -82 -247 -78 107 -64 47 -129 183 -34 86 -2 -67 102 -5 17 7 91 -89 213 -8 62 76 -82
5212 -82 292 -326 110 -41 103 0 -160 -90 3 -46 179 54 193 7 -201 188 -47 -92 -81 -169 -129 -26 71
5235 71 -68 77 117 244 168 82 168 -102 37 -100 -148 -138 -146 -69 -61 -103 -327 -163 -121 68 195 41 94 142 17
5260A7j64J49j8L72m13o1M5K65j22q7oJ72j77K09L7l41R4q2l2J71l2K2k54J62
5284g4K93j43N0k98K25k9k04J91M7L9j97J92j59J61j29K06k9n6J78m33K27j81
5306a23J68j36n1J78J00j6j61L9o1j13J25N3J10l21K42k75L72m46N16n1j52m6
5328d9j45M50k28j04L07l08K6J86qJ15n11N25j98n5l2M01l65n0L70l08J9o0o9
5351i1Q1q0m1K7J12M6j19j58L00j92K53l34P5J35K1k3k33K04J91K3l44J38rJ73
5375A55o6J52n07K86k14K51k14K26p5j01j01K41r1j65L02l9J63k01l4j68J27K59
5397A86j82K2nJ52j95J29j49Q1O5m4j27P5l9j5J26j32l58M34j70J0R2q0J36k5
5421a3r6Q0K9r4Q0J41j8k1L9p9k1j61K84j50mO2M9k06L13k49O4j67N9j31P7M3
$$ plain form
5260 17 -147 2 -16 356 -57 -118 -73 192 70 -17 -23 149 -28 181 218 -123 -29 -111 -143 28 -4 18 -236 -74
5284 -74 219 76 126 -172 53 24 -180 11 58 97 -100 92 -67 94 -35 171 142 86 264 -169 58 -123
5306 -123 45 -91 -142 36 136 120 -41 -2 -63 -176 -51 2 112 -209 33 -242 130 -316 200 149 -3 -49
5328 -49 -194 256 28 -76 231 -77 -51 135 127 242 -269 256 58 3 -29 372 7 -43 327 19 38 -22 -91
5351 -91 -10 -90 -131 -104 8 54 -65 -223 77 -115 138 -196 -121 14 35 12 -221 -17 174 197 -147 -9 -18 155
5375 155 89 241 -266 20 -194 57 -157 69 -6 -107 -208 33 -58 -223 79 40 203 2 -32 -200 -73 186
5397 186 4 26 21 173 -22 107 -42 39 104 60 -67 8 -31 -46 80 -52 -410 24 -146 -136 -44 -124 12 -13
5421 -13 -109 -29 0 -94 -14 127 109 88 127 48 27 -134 150 0 -4 58 107 -99 214 -35 29 -138 -79 -210 -133 -90
5447i0n9L8K2J28n0o6J00j34J6M63l50J78k40n1K25J08k54O0n8k70K68k4J65q2
5471D3l4k32L60j61j84q6L40m9l16M34KpLp1R1k60l2J62N8qM6pj30l0J50k76M9
5498a45K00K98j24j51k4k52N03k79q4m5j69K35P6P6J35l12K47p0k95j12J53K02
5520F3k27k0M25j18j42O8k05J3N7K83l65L25k33OL7j18j36J35K58j47Mj58J13
5543h2Q3J82l00Q7k09L66J1j47j26R9L7J49K8j23K33j98r5l23K83K7J23K8j18
5566A5o5O3K2K5n0K73l36K32n0j04q2J20kK6j97j65J28K9J01j64K50k36K51M5
5590A29j03M9J01k39kJ34m2j21L82m75J34J62j30rj0P0l2J91j60q9O2K05q6K8
5614A49j38p0L7Q7k37L55l43R6M05j67lj73j19J05K00qr1r4J92j43k64J58J18
$$ plain form
5447 -90 -149 -111 -89 39 -11 -77 23 -111 -95 368 18 196 -44 -95 130 238 -16 44 -14 -284 -16 -40 125 43
5471 43 9 -223 137 -24 -208 -294 46 -3 -319 115 117 110 113 42 133 -127 -159 3 61 53 99 92 -38 -68 82 -194 -145
5498 -145 55 353 229 78 54 -198 305 26 -58 -103 -272 -37 39 115 250 -62 185 115 -180 -292 -139 63
5520 63 -164 -184 241 123 -19 49 -156 -143 -86 197 -168 157 -76 -70 -33 -151 -287 -152 106 -41 -37 -195 -82
5543 -82 1 183 -117 -30 -239 127 138 -9 -135 -36 1 150 178 55 288 90 -5 -328 -45 -18 105 133 15
5566 15 -50 13 35 60 10 283 -53 179 129 25 -57 63 61 87 -110 -275 -147 -118 -17 -181 69 -167 84 129
5590 129 26 75 176 -63 -65 69 27 -94 288 -187 -53 109 -21 -30 -40 30 -2 189 29 -60 2 207 121 149
5614 149 11 -59 -22 65 -172 183 -160 -64 341 174 171 -2 -121 -16 184 176 85 -9 183 40 -224 -66 52
5637E2l4L4oj61Q1n8P1j19J52j42K83n4l17J46o1M9m7L37L6k76j10J00N8o6J49
5662I7K0p5Ql13K20l5l64L40R4r1L67k60r2N3j89K70k8K3Op8o2L3N2M2J2j64Q8
5689b6O5j83K00O9j53J39M4j53M7Q5Mj52k36L07j76L7O3R6n3J58l41J66R4k32
5713a31J55j90N7K52n4J72m29P0J81l0j61J02J04k37Q6l6n1M8O3R8qk9j80K43
5737I5k14K69o6j06P8k8p2K07k82K01m9k0J21k29L74m07J56j78m2J18j82L65l74
5760b65L21k14K04O1k75J42M8rj45K11l89L71o8j53J28K21k77n4J23M3r4J19K16
5783B65O8k00R2j16j75J47L10j80k33R6N1j48m5P8J32k56j49N17%n88K27j10K46
5806B9k42J72KK9J63j58j28J77k49k3R1K37r3Q0o9l4k32K47n4m1K66ok80J9K08
$$ plain form
5637 52 18 52 46 -115 -34 -92 -21 -140 12 -130 153 99 -218 -72 -133 -84 -131 206 242 -34 -144 -44 14 -52 97
5662 97 117 42 50 -263 -43 -78 -442 -102 -8 -99 268 8 -84 -31 -220 50 22 45 51 -27 -89 -56 -4 38 50 -114 -26
5689 -26 39 -144 56 125 -28 111 155 2 49 134 138 -14 -250 57 -119 -82 -19 77 24 182 -159 7 101 -131
5713 -131 24 -166 -109 143 89 261 -168 -98 83 53 -108 -6 98 -139 -53 -89 -140 -92 -29 69 61 32 -148 95
5737 95 -119 150 84 -22 56 28 -44 163 -119 82 33 13 134 -95 279 -128 28 -150 -192 -74 -256 109 -265
5760 -265 56 -158 46 107 -168 -26 22 13 -132 79 -310 61 -7 -160 -32 189 -88 -142 -19 24 -70 49 265
5783 265 333 133 225 109 -66 81 391 211 -22 74 125 -23 -68 10 142 -114 -263 254 254 -334 -107 -217 29
5806 29 -213 -41 -39 -10 153 -5 -133 44 -205 -228 -137 100 7 87 18 -16 -248 -1 -55 -96 170 164 -116 -97 111
5831A11j34j56K83o3j35k74L81j31K64r7j12J13o7J23j30J9K05j1r0l1m2R0j4
5854A02j45J43k98N30q1l43J63j31J37j88K04j12J01k47J65j39J48p1L9o0j13
5875a96K39ok44N0J85L39l41q6K91k18qj94K28J6J70n4k76M0J74k55J64q2P8k46
5899b32L12L0k05J88j16N4j50K68j73j45K34p8k3J40j0mm4L0J24O7k07j53j75
5922b68M98K7k08n3k6K36j95j31J09L5j21J21q4m8J62j41J13n7o8J75j72K49K3
5945A76ol9j35K7n8Q4J81k76J00N3j76m3m5J8J54J9p5P2m34K99R8L3J28l67L43
5970A31k10R1p9J18Qm09O11J8k64j36J70J32l67K56Kj3kmj38J9j9K93j13p0q7
5995f2J16j59K1L02j70J83l30m0J86jr4o6P2j35m5K75M7K16k95L8J2j47N9N8P8
$$ plain form
5831 111 -23 -179 104 41 -94 -368 13 -118 146 49 -63 50 -17 106 -24 -5 200 189 99 68 26 116 102
5854 102 -43 100 -198 332 251 -92 71 -60 77 -111 93 -19 82 -165 0 -139 9 -62 -23 -83 -196
5875 -196 43 37 -207 -157 28 367 26 -60 231 13 5 -189 39 55 225 171 -105 -65 109 -146 18 -64 14 -232
5899 -232 80 110 -95 93 -23 31 -119 149 -24 -169 65 -13 -36 104 94 90 46 76 200 267 60 -93 -268
5922 -268 230 257 49 -4 -30 206 11 -120 -11 24 -97 24 -60 -108 54 -87 26 -31 -99 76 -96 153 176
5945 176 170 131 -4 23 -35 49 230 -46 54 107 -69 -112 -157 -139 15 34 -41 31 -403 -104 -6 27 155 -212 131
5970 131 -79 12 -67 51 59 -350 261 279 15 -121 49 181 -186 70 72 59 57 53 -85 -66 -85 208 95 25 -62
5995 -62 54 -105 -84 218 48 231 -99 -139 47 46 -48 -114 -42 -177 -222 53 100 316 21 59 71 -76 -17 41 119
6020A19pj4O6j30M6LM0k44J81J27q5q2p2J48k72K31j26j09L56j70m4j41L12j61
6044b8L44k36k7O7o7N0j32l4L9j07J4J85j1N6k23J97nj0j98k12K11K4N6l7J2J34
6070F2R4j39J42j02k74L21j26K14k14K11K9k72k20M23J61j83Rk22J97j61J08j64
6092a06J76p9R5q5j50J97m9L70k99k16K94l28J72O2K14p9k23oK93k97K6P3l6L8
6116E7o5n4o4J84Q5l52r4K40J53j89N7p7J67j86L12l22k7J15l2rJ18K84j96j4
6140I1L1J44k78J68j68Q0j41k15J2J04N5O5J48k47L64l72K50j72O3k68K26L42
6162B82l04J1j09L02k88J92K7j81R3P3l27J48J10oq0J37q2L51m03j78M02j6k03
6185d9k13J51K53j84J17k69J07l09J69J20L11j00k49Oj7L90q0q2r3P9K2N0Ll10
$$ plain form
6020 119 112 98 164 34 80 83 123 -121 60 187 102 20 -52 96 -176 55 -71 -180 176 6 -38 -179 133 -28
6044 -28 316 80 53 120 53 103 -29 -63 -24 -131 -117 68 57 113 -110 87 82 72 -126 -338 -127 -103 -47 -84 -72 62
6070 62 156 17 159 57 -217 104 -22 192 -22 189 218 -54 -274 149 310 127 136 -86 111 -50 58 -106
6092 -106 70 -9 86 1 -149 48 -1 369 70 -146 148 -180 -8 54 268 189 -34 -40 253 -44 -18 55 19 57
6116 57 -8 -62 -126 58 143 -209 -303 -63 90 -99 -42 -119 48 -138 174 -148 -175 -60 -92 -101 17 301 105 91
6140 91 122 266 -12 156 -12 68 -73 -288 -276 -172 -117 -52 96 -151 213 -159 91 -81 -18 -286 -60 282
6162 282 -22 -11 -120 182 -106 86 113 -68 25 98 -229 -81 29 23 -57 80 -2 349 -54 -232 170 154 -49
6185 -49 -262 -111 142 -42 75 -194 -87 -396 -227 -107 204 104 -145 -139 -156 234 154 72 -21 58 80 130 133 -177
6209a77J3M42k94J10j05L0k0j09O0Oo4J39o1L2J14j26J30j77K41l72K30J62k11
6232gNj61L27k1k23J70k12j4K4L4J94l9K6p8l6J6j83L14j20J55r0q0j11JL19J0
6258B20k61j9l36N42k25o3p6K06K84k78R5p6J36k8j35N0J03k36L08l12N2n7K47
6281A41j17r6n3L06l60L43l01N0K57l92J36M9k4K2P6M7Q1o7Ll88K19J98j34O9
6305F5l8j82L32j85M0m4N4nq9J16m01M49j72P6L6j51R9L2k29L29p0k11O7L54k17
6330E5P3k36K14n9j10P9j74K86j34M1K01j08j98M4k2o6J87k00L13j82rj01J36
6353C0j11J76l5j72K62m25K54J90j85q4O2O5j1J73j20j73J83K23l02J8L2M3j02
6376ij76J40n5q6J25J20o2j16J20m8K66l77L31l55K84k26J06J62l40K42jj39J07
$$ plain form
6209 -177 -164 278 -16 94 -11 19 -1 -110 -50 -44 -108 31 -30 2 116 -10 120 -57 184 -188 42 204 -7
6232 -7 -2 -163 164 143 -80 90 -122 -136 -112 -78 116 77 103 25 -11 5 -178 136 16 171 81 1 -110 -109 210 220
6258 220 -41 -60 -396 146 -79 -142 -218 -12 272 -6 89 13 149 121 -14 36 139 -97 211 -101 -49 -106 141
6281 141 24 -72 -125 181 -179 164 -137 -87 170 -222 -86 -37 -61 -39 37 84 165 98 101 -287 -68 130 -4 65
6305 65 27 -155 177 -8 32 -12 42 37 -52 64 -337 112 -60 16 52 -99 0 32 -197 132 62 -149 -82 272 55
6330 55 128 -108 106 47 -63 16 -158 128 -6 35 236 128 -70 -26 -48 -114 73 -127 186 4 -5 -106 30
6353 30 -81 95 60 -112 150 -275 -21 169 -16 -100 -38 27 16 189 69 -104 79 302 0 18 50 93 -9
6376 -9 -185 -45 -100 -186 -61 59 -3 -119 1 -47 219 -158 173 -182 102 -124 -18 144 -196 46 45 -94 13
6399A3J11j83N1K45j59J39m73Q6Q3J00k48J9L89l70L56o9k19j10L86j07k67K61
6421C4o2Q6q6rj83L88M2j93L9P2J44l61Q3K8J59J49n74J70NN5J7j76K68l1j83
6446a19J70k9j75K01L2j19j94J19j61L37m5j42J44L32j01j18k83J62J34o1j92
6467a08m7J84m1J30j61n0K52K59l18j69K09j29j17J25k19J24j40K06Q1j77k8k7
6489a61k3L89j96J23j00Jr4KO5Q9Q7k14o6K7J23K09n5l53N7K2k1J14n8N7j48J
6515a23J93j02J62pj75Q0J91k24m6L8j2M2k19L82j51p3Q4R8j11l05Q4J56m3J77
6539I6p9q8K72n58M50p7oJ6K59k18J12j24o9L12k72Q0N1l20P1r1N2j04L79j28
6563A6J63k11JN0j59J83Kr2N5O7j76J88j11O8PL6k79J94N41o55K06M1k33J67k11
$$ plain form
6399 13 124 -59 -8 237 78 217 -256 -170 -87 13 -235 -216 173 -197 159 90 -129 -239 147 40 -227 34
6421 34 -28 58 -28 -37 -220 168 210 17 56 128 272 -89 -6 22 181 330 -244 -74 -69 -14 3 -173 95 64 -119
6446 -119 51 22 -153 48 80 -39 -233 -114 -275 62 17 -125 19 351 250 132 -151 11 145 84 -108
6467 -108 -155 29 -12 118 -43 -93 159 418 100 -69 140 11 -106 19 -200 -76 -216 -10 71 -106 -134 -161
6489 -161 -184 205 9 132 32 33 -61 -59 6 95 182 -32 -98 -71 52 261 206 -147 -90 -68 -89 25 -33 24 -124 -123
6515 -123 70 -32 130 123 -52 28 219 -5 -51 -13 -25 17 -202 180 29 -44 40 138 27 -278 -194 -38 -81 96
6539 96 17 -71 201 -357 93 16 10 26 285 67 179 55 -14 298 26 106 157 -163 -92 -183 -131 -235 144 16
6563 16 179 -32 -31 19 -140 43 45 -47 8 75 -101 87 -24 44 51 87 -192 2 543 -112 94 135 -98 69 -142
6588a42J56j89K53O2J13l13J83l1j3k99J87J36l1J08j76k74K87P1p1J80l59K8
6610a34o8R8J33j17P6K42j94J9R7r2R7j39j22K07m7j29M47k34O6l8l04o0K09N6
6634F9Q9k33J88j22J68k3J8j36j56K87j28K42k50j18M08m46P6q8L09k09p8K79
6656A46j34O5r9ml8L11k10J3J9k31J19J62r1J1n1m5j15K70j65rL99n46K94j59
6680h8R4N1k11j34J54nL44r2J58k32K01k61k8K53l47L27j10k35K75r9Q5Oj97J51
6704F0k86L18j13j88K46P9l45J97j31J43q1L3n9K72j40K81m73L94k16k02L25j11
6726CK46k07j53J49J62j02o5j64K20j32K14k52j0R8P6j08R8R6J34k72rK11n19
6749b86L75r7O0o9J47L2j44k28L11R5j95j58M9J91j62K8J86k73o3J54l49K93K89
$$ plain form
6588 -142 14 -175 78 140 253 -60 123 92 79 -220 -33 103 72 180 4 -270 17 88 17 197 -162 -134
6610 -134 -202 -104 29 -88 -12 230 36 55 152 60 157 18 -104 103 56 -73 374 140 206 168 -136 -196 13 69
6634 69 158 -75 113 -9 159 136 154 18 -138 149 21 263 13 -105 303 -143 -67 -155 154 -55 -133 146
6656 146 12 77 -22 -26 -64 247 37 50 69 -162 -43 119 28 39 -12 -57 -172 98 -67 -76 323 -223 71 -88
6680 -88 6 57 -154 -288 -134 -139 205 113 271 39 240 -21 -49 204 -143 184 74 -161 114 15 100 106 -91 60
6704 60 -226 92 -21 -209 37 116 -229 -32 -163 -20 -101 -68 -127 145 5 286 -187 207 -9 -211 114 3
6726 3 249 42 -111 38 200 98 33 -131 89 -43 171 -81 -91 7 83 -25 73 169 303 31 22 233 -286
6749 -286 89 -8 52 -17 130 162 18 -210 101 196 1 -157 -108 83 -79 -51 135 -138 -201 -47 -396 -103 186
6772A86p9r3j91O0k5P7N5o8j46K45J50k71K97k8j04k9qj13K22n5Mk6n0K08j22
6797I6l97K86j9K51r9k70L26l60o3J43J23J53k73k2J51j18L9Ln9J01L71m18k9
6820h4R8l22K72m0O8j59M57m58K19J1K8j42J27j12k7J87p0jj77N2Q8k93K80j01
6844i9K42j57K1K29k97N8j15Q9R8J35k89J94n0n08L92j06K48k47K56o0j12J81
6866A03k64K8P2J37l15K49j45K77j72n0K22l06J28J58M9Rj73P6j97J02J64N6l39
6889a31J82j99O5K17k58J70k55p7J49jJ99m4j04j32o6N99l62J97n3j84J87q1r4
6912g6K24l86L58j13J52j14pJ51k8k8r4N5l0j12n5K31k16Q5Q1l80K10K41L5pn0
6937A27M0k95K12N2j95O8O7r7O6j16j28L62k37L00L5l62K80m84L39n6n8j6K91
$$ plain form
6772 186 107 14 -177 -117 -142 -65 -10 -78 -224 21 171 -100 197 169 65 36 28 -85 137 82 86 60 10 218 96
6797 96 -301 -15 -34 217 118 -152 174 -186 -249 -106 17 170 -103 -125 26 -92 -53 -50 -109 -8 363 -55 -84
6820 -84 14 -308 -36 -76 -8 -167 290 -168 51 62 90 -52 75 -37 -64 123 53 52 -125 -73 15 -278 2 -99
6844 -99 143 -14 7 236 -61 -3 -118 -29 69 204 -85 109 59 -449 -57 -163 85 -162 94 34 -78 103
6866 103 -161 -133 -61 76 -239 10 -135 142 -30 -80 142 -164 -36 122 171 180 7 83 -114 -12 152 208 -131
6889 -131 51 -148 -83 134 -124 46 -209 -286 -137 -138 61 17 -87 -219 -285 314 -48 149 96 -88 99 18 -76
6912 -76 148 -238 120 7 159 45 38 189 161 133 39 94 64 -48 -103 128 -88 -3 78 -302 -92 149 184 177 127
6937 127 167 -128 84 136 -59 9 76 -21 45 -71 -199 163 -74 226 261 -101 179 -305 34 -22 -80 -96 195
6960A95l07J37q7j79J22P9n6J5K54k57J55l16K44k9J21m0PJ60j46r1Q9j46j58
6983b34J66L77k51M5k28K24K6k09J00j5p8L0N7J6J50k46M7k2o9J93j3r5j04o3
7007a96L05j11p1K76J4m52K25n1L2J15L6L9k33K54j92J62o3k67L58j5J2j27K11
7030B61l10j3r8K20O1o9j55L36k09Jn3k84K63m2K66mj02l12K71O8j16J27q4j36
7054a13L6L7l4M1K2j50K54j37j03J21O0k25L4J71lj02J1R8J72k31l2J03j81J23
7078b8K00l72M11k20j88M42l48M2Q5j35P7K54k89J51j43j45O2L78l76K26j49j35
7100b00K40r2K80n14L49o1j23K86m8p8p2O7j56M8R2K57l13K59k22q1K53l87K39
7123B3o6L01l35k4K67r7J02l91L4L4J63K13k10o1J17J11j96L2J1j25J76J95k11
$$ plain form
6960 195 -112 25 -62 -241 -119 -40 -96 -81 173 -84 71 -245 -1 -30 91 51 58 218 72 -19 70 -76 -234
6983 -234 -68 309 58 103 -125 99 125 -84 16 1 -77 -47 10 26 176 -70 -23 -45 -114 79 66 -29 -133 -196
7007 -196 109 -2 -73 203 217 -235 -10 -61 -29 86 122 161 -72 182 -10 152 89 -178 180 165 177 50 261
7030 261 -49 -62 -160 60 121 52 -103 233 24 25 -28 -312 -49 -91 175 171 69 -243 28 96 -20 107 23 -113
7054 -113 -77 -40 -74 -33 -11 -161 93 -44 -147 -26 34 -191 -157 14 11 -91 -80 18 190 -41 -73 30 -151 -28
7078 -28 172 -200 211 -9 -197 245 -103 -61 24 -111 -34 220 -69 82 -61 -206 -144 234 -142 84 -65 -200
7100 -200 40 -52 228 -286 63 2 -121 165 117 39 -33 34 -122 -74 18 275 -38 221 -1 -82 171 -216 23
7123 23 -43 258 -77 -101 166 69 171 -220 -186 -152 11 224 14 -47 70 181 -15 17 28 -97 79 274 63
7146F3qJ8jo7J54j7nj62j96J25J08J34j50r2L14k74NJ21L2j64j45K40J86j80O8
7171A07J04RO6m08P2o4M4R7j05J57j68j60L21K6M0l02N9M8Qo1p0J00R8l02M51
7196A67j77J8j27L78k88n2J03k46L83p5p8k95M85k18P7j50L43m8l74J80J23n6
7218G3r8N2J10p5l85M06k9K7L5q7kK1J1j52N6J6M1p4O5j39K18q0j03J33M5j72
7244h7j98K98K05l95J40J2O0M9k51k3J34j95L50j38J77j3j33N8j26K57k15L2k4
7267b6O1j0Nj04M7P6K15j90J40j84J59l13J01J02j52p3J06J19l98K09j58L34n9
7290GL8k04L28j10M7q1k25K56l8j92J62K9qk52K67n0j9o0J90o8M4J09k90oJ26
7315@M0Pn5K5k36K14K76l89K43L4k4q4K0K1j56J9pP9J28k9l11K61j25M8J01J37
$$ plain form
7146 63 55 73 72 5 159 142 137 -25 -221 -96 12 146 -4 -96 218 -56 -51 70 102 -62 -207 33 219 39 107
7171 107 211 220 286 -122 -50 -114 -70 27 -78 79 -89 -249 72 98 138 -164 -105 -57 -49 -110 -180 -80 18 -284 167
7196 167 -10 8 -119 259 -29 -81 22 -224 159 84 6 -289 196 -22 55 -95 248 200 -174 6 129 73
7218 73 -25 27 137 62 -323 83 54 81 116 29 27 48 59 -93 -37 -21 20 -54 11 -128 90 10 -93 40 85 -87
7244 -87 -285 13 218 -177 -37 -25 35 84 -167 -190 -56 -251 99 -39 138 125 -8 50 -76 181 -34 -2 -26
7267 -26 35 25 30 -74 -27 49 264 74 214 30 189 -124 -23 79 -73 -146 -40 79 -319 -110 -268 66 7
7290 7 45 -159 169 59 106 25 -200 56 18 -174 -12 17 9 -243 24 -26 -45 -105 85 17 61 170 -120 -126 0
7315 0 40 47 -8 17 -219 -5 271 -118 125 159 135 51 71 92 -64 -45 -52 27 155 126 -185 76 -49 -1 100 237
7341B37k53j1M9J16j97J5K56k14J28j55j13L02Pj17n3k3Nk2P2K97j56j27N0k67
7365a74R0p3K05j54k50M18J6r8j86J66J26j27j67J34j13j7J29J87k98M9M6O2j41
7388a70j7L56j57J70Q6l93L28o16M91o6L6k0J6J63l10K55j14j23J0Q3J27j02%
7411C3kJ43q0r9m4l0M0J08P1j71K21j82k62M55m22J94O3J01L4j38J59o2j3J5j84
7436e2L9l8J27l9K9j02M2R6j16J00k9j05p6L02l06J42J35j83J22p4N0K33k56J37
7460A78k48p0K29j59K4L0j1Q6j18J19p7L94l13J58j83j03R3j55MJ40N2J54k60
7483c6N0j18n8K46j89J14Q6P7k35K92j71o5N0n5P7q1k13L35l0k8k07K4L66o3%
7508A68n71K26K1O3J18J6J76Q1j97q4j4l9J83m16N41n53M17j72K09k37j57Q4O1
$$ plain form
7341 237 -16 -27 22 138 -59 -44 212 -2 126 -29 -142 160 167 50 -3 -26 -21 -43 29 326 170 43 93 -174
7365 -174 -84 -157 48 -106 -356 62 78 -20 -206 -40 86 -41 -208 -74 -187 -204 -75 112 -186 -137 -91 -29 -170
7388 -170 -187 169 12 182 268 -125 203 -413 78 12 48 28 44 207 -103 152 38 -85 -75 8 135 33 33
7411 33 31 174 94 -5 -49 -79 -39 69 140 -31 190 8 -254 201 -221 -27 36 137 171 33 192 130 117 132 -52
7436 -52 -13 -51 76 37 66 -36 6 102 -14 86 57 -48 -124 178 -128 14 149 -34 88 14 64 297 41 178
7460 178 -70 -140 89 -70 -46 -16 -27 59 -59 60 -17 377 64 222 39 -64 29 -126 -122 18 70 224 -36
7483 -36 14 -104 -162 84 -105 9 95 172 -63 229 58 -7 43 -12 65 -16 -229 106 76 48 -159 -135 231 168 168
7508 168 -403 -177 -156 -93 25 41 217 298 101 17 3 -36 147 -269 272 -281 136 -36 173 -64 -221 -137 -76
7531g6j17J72r8L03j62M0J36j01k41L33k84r2M09k18rj15O8l5J90l12Q1n5j5K54
7555E6J96n8M9k27jN7J52J2j95L8P1k06K03M0j76J55j34n3l92M93J2k08J35R2
7579A11R5l73K17J23j58J44j50M4O0R3l29J25k18L80j53qr9j74K90N0q0j04J65
7602E1k1K10k0k6j86j34J46J36j59J53k12k03N1K65J2j34J27m5q8l4J97j55L01
7625B32k73k1k5j69J96j18K39J31m03J55J20n0r0J99j50n0k70M67n9M9l34K27
7647Ck5R9j65K15k74K67K02m70QM7J54J26m4j04R1k78J21Q0j20m7K98j38L4k15
7671a35J47N9k47K05n1J05r2j99M73l93K17M4l62K24R1P7k01M7K02l91K96k2K9
7694A23j32k4J12j17M2J83j36j26K98l61j4RK77q2n3n1r4K35RMn0J19l80N17k98
$$ plain form
7531 -76 -193 -21 -119 184 22 62 198 97 -144 189 -95 -187 222 4 -5 -120 -52 -87 103 -209 -128 -183 -198 56
7555 56 252 194 243 16 15 72 224 236 41 79 150 -56 147 187 11 166 32 -21 -413 80 92 -116 19 111
7579 111 206 -167 50 173 15 159 9 53 113 206 -123 2 -216 164 11 3 -96 -270 20 70 -10 -114 51
7602 51 30 240 220 194 8 -126 20 156 -3 150 -62 -265 -214 51 63 -71 56 11 -77 -111 86 -69 232
7625 232 -41 -62 -87 -256 -60 -178 61 192 -211 -56 64 14 -76 123 -27 -77 -347 120 61 110 -224 3
7647 3 -22 77 -88 127 -147 120 322 -148 -140 -93 61 187 143 39 130 -148 -27 53 -67 -114 184 46 80 -135
7671 -135 12 71 -176 29 -22 83 -9 -208 265 -128 89 133 -229 -5 86 163 -38 9 211 -180 116 94 123
7694 123 -9 -33 79 -38 4 187 51 -75 223 -138 -152 -143 134 52 -1 -52 -146 89 98 102 52 171 -209 308 10
7719A0o8l0Q4j46N9L2k2j63K03k7K7kM3R0k26J04J50o3j35K27m02L96R4k7j53
7744E5o4j42J58M3j94J37Q5K9R1J2j38o1j61L64k97K25k49K19K2O9k53K27k67
7767i0K1K89k44Nm4N00k93q4j01J19M5m17J35K43L1KN6k05J15r8l7p1p4M74k95
7792a8O6m5J89j82j16J66r0J50j20r8N3j40P3K03o4P1L09k41m15L30R3k92K04
7815H6j35m7J26m7j0o0J7lJ71m1k23O1n3K69j25J10j25J7K49q2l5k87K02l2j84
7840a81J4L43l33J03J26j2j29P8p3j65O2K28j42J52q3N8k6K9j89K31ll67K74j35
7864a40M5R0k58K62K17l03P8K8j50m0K81j15Pp7o4J49j13J51r7j39L35L3k76j16
7888b12K01O7j0p4k0j68K40l2j23J26N3j64l7J37k29K78KJ15k30J28L4J10j35
$$ plain form
7719 10 -58 -88 -4 -150 -91 -59 -81 -244 -41 -68 -41 -43 0 90 -136 -32 118 55 -80 147 -255 141 235 208 55
7744 55 -9 -151 7 50 -144 -7 78 107 198 210 72 11 -150 214 -83 142 -107 112 134 203 -50 177 -90
7767 -90 -69 220 -24 -19 -63 437 144 60 -41 78 123 -294 -159 84 115 117 173 -32 83 -15 -52 -123 -197 277 -18
7792 -18 48 3 192 10 -106 60 -30 120 0 -98 -45 -185 -112 91 27 98 407 166 -249 81 174 -118 86
7815 86 -49 -96 30 -17 -27 -87 -70 -73 98 57 -166 -105 -158 111 -14 96 -29 -12 237 155 120 -167 35 3 -181
7840 -181 -167 176 -157 -54 72 60 -69 9 -64 -229 -167 61 -81 71 -12 46 20 49 -140 91 88 -279 -5 -140
7864 -140 -95 -5 -263 -1 216 -87 -9 19 -131 -171 110 -5 2 -75 -139 10 -103 48 -49 -188 147 180 -96 -212
7888 -212 -11 56 46 -28 -48 -216 24 -8 -131 -5 48 -116 -153 -16 -245 33 35 150 -80 48 82 192 57
7911E7J17j98K03Lk26p4J27P8j37j83J73J0oL28k87L7j41J84%k44M1J69j5j87
7935a71O7K00j37K16l53J38qJ89j42L1p7P1j47M35k62k35M5J61K4J62l9k00J43
7958A11r1J14l09M09l31L32l8k84K71j83m7J32l20K40j24l3K52J68j82J24o9j87
7980d5M1kj04L60k04j09K11k54J23J66j80j77K09j33K15j99j71K93L0J78k61m5
8002e8O5j03K07l0j42K45j5j57K24j88k2r7J61k17J16Q5N7j65J7j28K07p8k15
8025b31K88K15l24n9K7K75k03j43L39j94O9m1J78k20J62j31k94K76K65k49k86
8046b81M05op2R7J14l61K31j07j30K87j17j09k14L77j40J77N7l89J51J11l1q7
8068c7L7L21m16N0O9n5j85J89K61l47j19L35Q3j34p3k8mJ88m43K32M9k50M56k11
$$ plain form
7911 57 174 -24 179 182 -44 -118 9 87 -50 -233 -60 -50 -56 272 -15 22 -119 65 65 -179 -138 31 16 -171
7935 -171 -104 96 -41 175 -178 -40 -48 141 -1 30 -47 24 -123 312 50 -185 -140 21 45 207 168 -32 111
7958 111 20 134 -175 234 -97 235 197 -87 184 1 -46 86 -234 6 -118 -151 101 269 87 211 142 -45
7980 -45 -4 -6 -110 250 46 -63 148 -106 17 183 3 -174 35 -98 117 -82 -253 40 70 248 -13 -58
8002 -58 7 -96 111 81 -61 184 169 12 236 48 26 -71 90 -127 -11 74 131 -34 -17 -145 62 -16 -231
8025 -231 57 272 -52 -111 -84 191 -12 -155 184 -10 59 18 196 -24 138 7 -287 -11 254 5 -281
8046 -281 124 118 46 143 257 -104 127 20 -110 177 60 -49 -263 114 -26 151 208 -181 -30 81 50 -37
8068 -37 0 321 -95 -45 24 -31 -216 -27 234 -113 -232 103 186 52 -21 -49 -53 135 -308 -76 -27 -277 179 -32
8092c2Q3k17kK46j66J74j89J44j87o7M32k03J92j85r9n6J12J57k81K17k01K88
8114A60j52r5K78k13M4j84J72k19J83j22J58J72j69j73K34j61K24l19K96k27j02
8135b15K55j55L72j53o7j36L29l74L7J74O0j10K59l09J33n5k00M3K59J33l13m6
8157g9L26k10k01L69k6j75r1J6J02L5k92L77pM4n6n3l91P03p8l71l1n0k1m3P3
8182a30J02L10j74J9k33Q9j48J04l3
$$ plain form
8092 -32 51 -166 -168 78 -88 86 -103 41 -146 -213 219 16 208 23 -76 -132 -20 137 -144 73 -128 160
8114 160 8 -87 191 -22 22 -162 10 -209 -26 -148 10 182 13 -160 74 -87 137 -182 114 -113 -215
8135 -215 40 -115 257 104 37 -99 230 -144 -107 67 127 17 276 -33 100 45 -155 -112 147 280 -33 -79
8157 -79 247 37 -164 205 179 4 -87 -71 31 66 -226 151 144 188 132 79 -312 391 313 -58 -89 -139 -160 -203 -130
8182 -130 -28 282 108 127 -106 -17 -165 -61 -94
8191i4
$$ Imaginary data points
##PAGE= N=2
##DATA TABLE= (X++(I..I)), XYDATA
0@%%%%%%%%%%%qJ6j6J6k4L2l4M2m8N6p2Q8j04J20j36J57j83K10k39K73l11L54
33A89m01M49n05N69o36P10p90Q75r72J078j191J314j450J602j766J945k142K358
51A236k599K867l166L500l879M313m815N401o097O942p988R321j1084J3532j7151
66i667K3020l4039O1193k38725k84683P62268j26608m39373M79897M4563o31123
77c93277L61304M41600o02226r8574N97867k68681k87815N21795j28219n88376
87d44602M37767L64879n23621N0378M21490m48408j71568O14908j47072n12012
97c57861M11466K01241m87681J87130L59715m95546r3841N81247j87105l98436
107b79671L87859L9694m32979L22409L10332n18092n8179M69080k26223k24218
$$ plain form
0 0 0 0 0 0 0 0 0 0 0 0 0 -8 8 -8 8 -16 16 -18 24 -24 32 -40 48 -56 64 -72 85 -98 112 -127 146 -165 189
33 189 -212 237 -268 301 -335 375 -415 460 -512 566 -625 689 -761 841 -925 1020 -1122 1236
51 1236 -1363 1504 -1662 1838 -2041 2272 -2543 2858 -3239 3703 -4285 5036 -6048 7484 -9667
66 -9667 13353 -20686 40507 -198218 -482901 279367 152759 -286614 193283 237846 -393277
77 -393277 -31973 409627 -192599 -291173 306694 38013 -249802 271993 143774 -444602
87 -444602 -6835 358044 -165577 -115199 306291 -142117 -313685 301223 154151 -357861
97 -357861 53605 254846 -232835 -45705 314010 -181536 -275377 305870 118765 -279671
107 -279671 108188 147882 -285097 37312 347644 -170448 -228627 240453 14230 -209988
117b09988M11051r7226m03317L62351K08258m73035O4181L69806l03717r9898
127a71534M23446j95065l70065L72392J41593l86155J61082K63634l72772m5845
137a79289M01725j90145k63223L37164L4078l17348K08075J61562l60105L9689
147a27817L38406k12045j54717L03820q5323k74431K62989J16857l22528R2235
157f2554K50117k50841p3653K94767j34734k20867K74427O1227k81989J26526
167a7574J72465k55685j203K66823j58754j55527K48253j6721k28311J72830J11194
178A37790k48115M7585K11379j78213q3483K25955p8325j78397J97567N6216k28710
189a18751Q4581J58686j85757k7209K05569j06314j38261J86227J4276j81617
$$ plain form
117 -209988 201063 103837 -299480 62871 271129 -201906 -137725 232081 -71636 -171534
127 -171534 251912 56847 -313218 59174 200767 -185388 -24306 239328 -133444 -179289
137 -179289 222436 32291 -230932 106232 140310 -177038 31037 192599 -167506 -127817
147 -127817 210589 -1456 -156173 147647 62324 -212107 50882 167739 -154789 -62554
157 -62554 187563 -63278 -136931 157836 23102 -197765 76662 137889 -144100 -17574
167 -17574 154891 -100794 -101997 164826 6072 -149455 98798 82077 -146234 26596 137790
178 137790 -110325 -62740 148639 -29574 -113057 112898 34573 -143824 53743 109959 -118751
189 -118751 -34170 124516 -61241 -88450 117119 10805 -127456 58771 73047 -108570
199a08570J10416J04080j78862J3345J68942j16420q6305J62965k8399j35333
209i4141J27416N2709j66126M7121J28188j23985l7140J45711o4917j07180J32644
220D0300K2866j41485O4777Q9028j21106j296J24857q1955p6923J24031L69j09022
232f5559P3832N0269j09952K5846R7525q5428m2187J05858k7632p8861Q1563K0403
244D5677r7893M1327P0092q2101j4255Q4791m6099n4122Q1304K293q1068M6145
256c909M5978p1682M827O5210m8442l2329O8420j0504n6080M7121K2042n9731
268b9079K0025M6913m8075j4760N3997k0604l5923M5112L357m8916K8030L0604
280C0681m6317k165M2962k5708k4116L9786m440l6305K7161J7491l6273O565K9584
$$ plain form
199 -108570 1846 105926 -72936 -59591 109351 -7069 -93374 69591 41192 -94141
209 -94141 33275 85984 -80142 -33021 95167 -28818 -65958 79753 14836 -92344 40300
220 40300 63166 -78319 -13542 75486 -45620 -46916 77941 -4014 -80937 43094 43463 -65559
232 -65559 8273 58542 -51410 -25564 71961 -13467 -55654 50204 22572 -56289 25274 45677
244 45677 -52216 -10889 59203 -22898 -37153 47638 1539 -52583 28721 31014 -50054 -3909
256 -3909 42069 -29613 -24786 40424 -8018 -40347 28073 17569 -38511 8610 30652 -29079
268 -29079 -9054 37859 -10216 -24976 29021 8417 -27506 17606 20963 -27953 77 30681
280 30681 -15636 -17801 25161 -547 -24663 15123 10683 -25622 1539 19030 -17243 -10678 18906
293A8906k4632j1560L1067q241k2574K3138O516k5245J1911J7023k1919k292K2358
306A4456j1889j3210J9221j96j8402J0519R726j6277N82J3066r748o850J2564
319C562j108j0677O272N234q029J195N748l389k278M609l0k665K173J535j218
334I34m53R86J731j120k123K325J123l852J063L914n522j995O863l247o881P777
350A523J510j0896N241Q916j1781j981J4121o708j0109J4653J588j6044J0197
363B30J1435j7699l34J9082j1844j0968K0394k416k0269J5981J0758k4067M311
376e406K1073j9752r787K6754p735k3467K2339Q277k8992J0763K3121k6749o084
389a5645L1818j4025k2382L0251K996l3254J9552K3406l3601j232L4139k2351
$$ plain form
293 18906 -5726 -17286 13781 5540 -17034 6104 12620 -12625 -714 16309 -5610 -7902 14456
306 14456 2567 -10643 8578 8382 -10020 499 10225 -6052 -5470 7596 -2152 -9002 3562
319 3562 2454 -8223 -1951 3283 -4746 -3551 2197 -1192 -3470 1139 1109 -1556 617 2152 934
334 934 481 1467 3198 2078 -45 2280 3403 -449 614 4528 -994 -2989 3874 627 -6254 1523
350 1523 3033 -7863 -2622 6294 -5487 -7468 6653 -55 -10164 4489 6077 -9967 230
363 230 11665 -6034 -6368 12714 870 -10098 10296 7880 -12389 3592 14350 -9717 -5406
376 -5406 15667 -4085 -13872 12882 5147 -18320 4019 12296 -16696 -5933 17188 -9561 -15645
389 -15645 16173 2148 -20234 10017 13013 -20241 -689 22717 -10884 -12116 22023 -328
401c28j8818L7588m664l7043K7259J9298l9381O845L4072l2286j4596M3346j2884
414H408l6757L4996J2701m3637J7600L4037m1042r503M6721j8912l1696M1690
426A4606L378m6773K7757L2531m6661k851M6004k8261k4998M9553p642n0315L6310
439B638K8866m9522N820M1236m0747j7747N7872j3964n0390M0062J9709m9949
451b6116J9819L9290n2248j2154O3356j9282m5022M4201O593n2299L6096M0400
463D2634o0376j0565N9070k5301l1914N1231q609n7104M4938L8502o1136l544
475b2174M9528l6701j8036O2075j9473o2233M7196L3028n5131J1377M1888n1975
487b0631j2321P0314j9163n7304M3435J8661m9228L0133L7206o5372j1308P0927
$$ plain form
401 -328 -19146 18442 13778 -23265 3994 23292 -16089 -9244 24828 -7458 -22054 21292 8408
414 8408 -28349 6647 19348 -24289 -6689 27348 -13694 -23197 23524 4612 -27084 14606
426 14606 17984 -28789 -1032 31499 -15162 -18013 27991 -270 -25268 24285 16643 -33672 2638
439 2638 31504 -18018 -12198 29038 -11709 -29456 28416 14452 -35938 4124 23833 -26116
451 -26116 -6297 32993 -19255 -31409 31947 12665 -32357 11844 18437 -33862 2234 42634
463 42634 -17742 -28307 30763 5462 -26452 24779 16170 -40934 4004 42506 -18630 -22174
475 -22174 27354 -9347 -27383 34692 15219 -47014 182 33210 -21921 -10544 31344 -20631
487 -20631 -32952 37362 18199 -39105 4330 22991 -26237 3896 41102 -24270 -35578 35349
499C5349j8172m3531M2340l388n2848M6770M1940o8764j2818N9893k3081k7345
511b3655M9423j7306n7916N2467M2792o1495o480M3043l6699j0192O5312k1185
523A8109o2093M5420L1840n2352J1080L7592m8936q049O8933j9108n7512L4760
535c16J5217m0730L3554L4615o2152j4734O0523j6557l6351L9998j805m5899M0713
548F076L5860o2193j4285N2733j4686j9758M3869j4818n3340L7856L6646m4833
560a0873j310L6715l2790j4157N2492j4727n0416L5854K6929m1478Q977L0538
572B5754m4080j1706N7885q725m4444K6632R476l8161K5419L5195m4109j3610
584b4474M5535j5968l1005L6587M261l9951K8373L1879m5512j2727L8071j6582
$$ plain form
499 35349 17177 -26354 15986 12598 -40250 6520 48460 -20304 -33122 26771 3690 -23655
511 -23655 25768 8462 -49454 3013 45805 -15690 -22170 20873 -15826 -26018 39294 18109
523 18109 -43984 1436 33276 -19076 -7996 29596 -19340 -27389 41544 22436 -35076 -316
535 -316 14901 -25829 7725 42340 -19812 -34546 25977 9420 -26931 13067 11262 -34637 6076
548 6076 41936 -20257 -34542 18191 3505 -16253 27616 12798 -40542 -2686 33960 -10873
560 -10873 -12183 24532 -8258 -22415 30077 15350 -35066 788 27717 -13761 -4784 25754
572 25754 -18326 -30032 27853 19128 -25316 1316 10792 -27369 -1950 33245 -10864 -24474
584 -24474 21061 5093 -25912 10675 14936 -25015 3358 35237 -10275 -23002 15069 -1513
596a513j6745M3798l281m6812J8575K3253l4123O735L7427k8270k1195M0097p102
609A0844m0300K5224K1721l1662J1764L2483l8495k2849M1129j15k6244K9346
621A2846P474m2138J2736L3288l1114j0899L8376j3052k7155L3300L937m3412
633b5813J6905L3605k9188o453L1211k4777k4508M1960P398l9277J4410K0356
645A5829l2402N032L6057k6550k3219L8888J877l4100J9392J4634l3843J1575
657f830L7698k9296k4167L1886k954k3515K9716Q908m1378R557L3035k7554j2697
670a7591L2140j1813k3229L3718M916m2137J1679K9560k3648k473L0331k3278
682a825k4450L6345O283l3525J5885J9217k9554M393L1369k6466k0588L5065J545
$$ plain form
596 -1513 -18258 25540 22259 -24553 -5978 17275 -16848 -10113 27314 -956 -22151 17946 10844
609 10844 -29456 -4232 17489 -14173 -2409 30074 -8421 -31270 9859 9744 -16500 12846
621 12846 20320 -21818 -9082 24206 -6908 -17807 20569 7517 -19638 13662 17599 -25813
633 -25813 -8908 24697 -4491 -10944 20267 -4510 -29018 12942 20340 -18937 -4527 15829
645 15829 -16573 -11541 24516 -2034 -25253 13635 15512 -18588 804 15438 -18405 -6830
657 -6830 30868 1572 -22595 9291 6337 -17178 12538 21446 -19932 -10375 22660 -4894 -17591
670 -17591 14549 2736 -20493 13225 18141 -23996 -12317 17243 -6405 -8878 21453 -1825
682 -1825 -26275 10070 16353 -17172 -1287 17930 -11624 -7231 24138 -2328 -22916 12149 13694
695A3694k8011K0007R971l4201R172L2157k4725j5712K9650p764k2822K6768O472
708A4656l4679J1577K7473k4103p712K6578j4314j7979K9883L174l1412J3719
720c139J9649k4149L95K5099j8873j5717K8626o71k5598J6525J1283k5477O846
733e201K2746k2166j1144K6297n915j9247J9911M626k5105J1249J8802k1392m202
746a0741K2884j1778j3622K1996P83k3288J3940J3727k0375J272J8704j5109r570
759a1177K1694l864j8867J4725P893j9559N434J5298j6423n147J9094p442j3431
772a1772J5761K318j7264R328J1349j6110m33J6457j0045q634J5982j895j4418
785i376J1596P396j5535L269J2726j1392n117J4355n028j1293J1944K731j3507
$$ plain form
695 13694 -14317 5690 15661 -18540 -9368 22789 -1936 -17648 12002 4238 -18584 8184 14656
708 14656 -20023 -8446 19027 -5076 -12788 13790 -524 -18503 11380 14554 -16858 -3139
720 -3139 16510 -7639 -7244 17855 -1018 -16735 11891 11220 -14378 2147 13430 -12047 -5201
733 -5201 17545 -4621 -15765 10532 4617 -14630 5281 9907 -15198 -3949 14853 -6539 -10741
746 -10741 12143 365 -13257 8739 9522 -13766 174 13901 -6474 -5202 13502 -1607 -11177
759 -11177 10517 6653 -12214 2511 10404 -9155 -3721 11577 -4846 -9993 9101 1659 -11772
772 -11772 3989 6307 -10957 -1629 9720 -6390 -6823 9634 -411 -9045 6937 5042 -9376
785 -9376 2220 9616 -5919 -2650 10076 -1316 -6433 7922 2894 -8399 3545 6276 -7231
798g231N603R283j1921j643J2488p007p448J1095k52j0696P750N745j0606J416
812c424R859p557m156J0510k196q308P494L364q917K679O667p271j889Q011l276
827A590n644O215N98o965L375M154o273l4N421l376l093N145j80m737L234K738
843B168l967N43L714k789j066L643p91k430K337Q24k290O41J380j173j171J415
859I88j34j222m9R36p67q71N96N79j098o88J870l52k026K042J010k549N83K978
877A826k177j478L480j76l391L372J958n071J339L775l285j981N404k351m843
892c599N165J879o785J883N077o428p59P561m306n676P437R89p624M827M898q971
908d432J032R450n976n603R733j295q480Q384L995j1752K383J0606q879m019J1369
$$ plain form
798 -7231 -1628 7655 -4266 -5909 6579 -428 -7876 3219 2967 -7729 21 5766 -4840 -3424
812 -3424 6435 -1122 -5278 5232 3036 -5272 2222 5586 -3331 -652 6015 -1256 -3145 4866 1590
827 1590 -4054 2161 2759 -4206 -831 3323 -2950 -2984 2437 -939 -4032 1113 933 -3804 -570 2168
843 2168 -1799 -1256 2458 -331 -1397 2246 1455 -975 1362 2186 -104 537 1917 744 -427 988
859 988 854 -368 -417 519 -248 -1119 -523 56 -1042 -1730 140 -212 -2238 -196 814 -1735 -1152 1826
877 1826 -351 -1829 1651 1475 -1916 1456 3414 -1657 -318 3457 172 -1809 3595 1244 -3599
892 -3599 1566 3445 -3340 -1457 3620 -2808 -3567 3994 -312 -5988 1449 2438 -5186 -359 4539 -4432
908 -4432 -3400 6050 74 -5529 4204 2909 -5571 2813 6808 -4944 -2561 8045 -834 -4853 6516
923F516m985r437J1275L229j3574M545R457j1538p83J3192q601r710J4561J641
937E788j4208P759Q160j4617K275J5558j0549j0033J5793q04j2659J1429N435
950I327j8104N061J5599j2983o918J5955o109j2526J6713K985k0239O700J5133
963A0594j5234k654J7322j1288j2280J9574K362j9271R740J0591j7861L290J8802
976A3687j5105j1027K0979j046j7874J3914O657k1163P082J9804j7433r745J9925
989H655n997j4639J8806L022k3637R742J7048j8228m015J9794j1610j3148K2581
1002H374J151k3401J1428J3961j8869J965J9796j6397j1810K3054r23j9442J4631
1015C518P241k1771P615J9259j9306q883K2903o489j6857J9303L297k4773J0701
$$ plain form
923 6516 1531 -7906 3369 6598 -6976 -2431 7026 -4512 -5295 7897 -704 -10414 4147 5788
937 5788 -8420 -661 7499 -7118 -4843 10715 166 -9867 5926 5122 -7537 3892 9327
950 9327 -8777 -3716 11883 -1100 -8018 7937 1828 -10698 6015 9000 -11239 -4539 10594
963 10594 -4640 -7294 10028 -1260 -13540 6034 8396 -10875 -1135 9456 -8405 -5115 13687
976 13687 -1418 -12445 8534 7488 -10386 3528 10185 -10978 -3896 15908 -1525 -11270 8655
989 8655 2658 -11981 6825 9847 -13790 -4048 13000 -5228 -9243 10551 -1059 -14207 8374
1002 8374 9525 -13876 -2448 11513 -7356 -5391 14405 -1992 -13802 9252 8329 -11113 3518
1015 3518 10759 -11012 -3397 15862 -3444 -12327 10576 4087 -12770 6533 9830 -14943 -4242
1028d242J9096k0170m436K0733j2222j3732K3251J287k3159J2375J3508k0417
1040h128K481K0274j7221j1283K4751j903k0821J4663P876k2629Q169K0599j9721
1053b893r750K2830o316j6892J9071L390k4238J0744J9527k0169n693K0701j1684
1066a372j3237K3937J576k4831J1026J5187j9041P29K0022j6363j1519K5130j527
1079I717k1477J3271Q198k0954Q595K0207k0434j1616K3375m205j6634J7608L783
1092I434k4162J0172K0548k0071q149K0694q235j2084K1388K26k5261J1595J7641
1105A3736j7820j374J7753j5180j1140K4392M81k2778J1198J1611j8510L942J7454
1118A3765j8209r837K3986j411j8475J1281N018j8895R084J9595j8324r567J8840
$$ plain form
1028 -4242 14854 -5316 -9752 10981 -1241 -14973 8278 9565 -13594 -1219 12289 -8128
1040 -8128 -5647 14627 -2594 -13877 10874 8971 -11850 2813 10689 -11940 -3771 16828 -2893
1053 -2893 -12643 10187 3871 -13021 6050 9440 -14798 -4054 15473 -4696 -10389 10312 -1372
1066 -1372 -14609 9328 10904 -13927 -2901 12286 -6755 -6026 13996 -2367 -13886 11244 9717
1079 9717 -11760 1511 9709 -11245 -2650 17557 -2877 -14493 8882 4677 -11957 5651 9434
1092 9434 -14728 -4556 15992 -4079 -12228 8466 231 -11853 9535 9761 -15500 -3905 13736
1105 13736 -4084 -5458 12295 -2885 -14025 10367 10848 -11930 -732 10879 -7631 -3689 13765
1118 13765 -4444 -14281 9705 8294 -10181 1100 6118 -12777 -3693 15902 -2422 -11989 6851
1131F851m727j3097J6203K810j9990J0273J5838j7063n652J5932q305p945J9973
1144A1101j273k1450Q998J1750j4399J554J4682j3021q565J8645k114j6809R790
1157a111P946j3555N127J2140j5173o712J7397j897j1241J0859J658j4835P822
1170a575J1931j3219l398J3803n716q372J2170o96j3943Q745R695j2269r88R678
1184E846q335n204J4102j665j2785P592N324j0511K909R442r361l438J1918l263
1198B571r542Q420K337r197O088P615j0877k157J0123m778n190R507p24r970O414
1213F40N010r653P45Q474o340l158Q788l165p830O586L751p999K915N622p329
1228b943j238Q060l237n337P001P22o746M080M473p759M69P556m535l793O699
$$ plain form
1131 6851 2124 -10973 5230 8040 -11950 -1677 14161 -2902 -8554 7378 -927 -8872 11101
1144 11101 9828 -11622 -2624 9126 -5273 -3719 10963 -2058 -10623 8022 5908 -10901 -1111
1157 -1111 6835 -6720 -1593 10547 -4626 -11338 6059 4162 -7079 3780 5438 -9397 -1575
1170 -1575 10356 -2863 -6261 7542 1826 -6546 5624 4928 -9015 -270 9425 -2844 -3832 5846
1184 5846 -2489 -7693 6409 4744 -8041 -449 4875 -5636 -2727 6715 -2646 -6084 5834 2571
1198 2571 -6971 1449 3786 -5411 677 8292 -2585 -4742 5381 603 -4587 4920 4196 -5774 640
1213 640 5650 -4003 -3258 5216 -1124 -4282 4506 1341 -6489 97 3848 -4151 -1236 4386 -2943
1228 -2943 -4181 3879 642 -4695 2306 3028 -3718 362 4835 -2924 -2455 5101 566 -3227 3472
1243C472j200o241M894L339p312J478N340n056k113O483k217n047N086J117n540
1258c517K404M049n200l91N809l245l323N539j38m908L965K649n384N23M723l349
1274B06k458N103j436m078L733J368m601R37L582l217j529M422j974l328L821
1289E51P69m052J848K945l370m92L905k128k348L843J49l486K789J416l569P80
1305d50L088k511j321K945q98k422K343Q83l176Q57K266k610k85K224r78j880
1321a925K046L10k230J453J277j955Q7K489j532r94J831k3j402J124J244j989
1337a89J71J503j187q24J601n06j422J050N96j776P44N20j058l80R41L4j042Q50
1355c74P10j383M30J060q60MO71K64p80P02K9l88L36K88l89k56M80O6l38LR5q03
$$ plain form
1243 3472 2272 -3969 925 4264 -3048 -1570 3770 -1286 -3399 3084 867 -4180 906 2023 -3517
1258 -3517 -1113 2936 -2264 -2655 3154 -91 -3414 2125 1987 -2921 1044 3693 -1691 -1168 3555 206
1274 206 -2252 2851 1415 -2663 1070 2438 -2163 -1226 2356 -861 -2390 2032 58 -3270 551
1289 551 1320 -2732 -884 2061 -1309 -1801 2104 -24 -2372 1471 1620 -1866 923 2339 -1230 -450
1305 -450 2638 127 -1194 1751 853 -1569 774 1657 -1519 -662 1604 -1006 -1291 933 -45 -1925
1321 -1925 121 431 -1799 -346 931 -1024 -937 1552 20 -974 857 834 -568 556 1800 -189
1337 -189 -18 1485 298 -526 1075 569 -853 197 793 -983 -239 281 -777 -1157 -216 -182 -1224 -374
1355 -374 336 -1047 -617 443 -417 -413 258 522 -258 444 473 85 421 709 320 64 544 610 272 275 370 -433
1377d33K26L62l23k45j25Q4R2q5M20m79l66P52J26q6k93M80K8l93O88J10n84K31
1399A87O11m30j34Q92p55q12J239k60r41O38J95j196N2J715j270j132J236J79
1417A4j313J269P51j841L21J706j027r84J931m57j372J672R88k465N35K011j774
1434c5m58K055j085k244K637Q49l115O51K211k681J0K831j792k520L013Q62l230
1451b041J504K047l392J60L729k090k393L605J30l303K925J928l886j24M002k002
1467G99k326L517q42l991L754K204m905N24L757l574j153M881k095m327M689J299
1483B211n504K132M132n196m61N907k615m444N016J284n143L443L236o415q6O681
1499D178l259m161N707m07n843M596L437p150%O445m088k843O414k231o309O033
$$ plain form
1377 -433 -207 155 -168 -413 -538 -454 -362 -447 -27 -506 -872 -120 6 -80 -373 107 135 -258 430 540 -44 187
1399 187 798 368 234 1126 371 -441 798 538 -403 235 430 -766 -714 1001 -269 -1401 -165 14
1417 14 -1299 -30 721 -1120 -799 907 -120 -1104 827 370 -1002 670 1658 -807 -272 1739 -35
1434 -35 -493 1562 477 -1767 870 1719 -1396 -745 1466 -1215 -1205 1626 -166 -2686 327 1189 -2041
1451 -2041 -537 1510 -1882 -1722 2007 -83 -2476 1129 1259 -2044 881 2809 -1077 -1201 2801 799
1467 799 -1527 1990 1148 -2843 911 3115 -1790 -1266 2491 -1083 -2236 2645 550 -3777 912 2211
1483 2211 -3293 -1161 2971 -2225 -2686 3221 606 -3838 1178 2462 -2681 762 3998 -2417 -2503 4178
1499 4178 919 -3242 2465 2058 -3785 811 4248 -2902 -2902 3543 -545 -3388 3026 795 -5514 519
1515E19L726p328J493M849n497j431Q213l071o424O257K484p074L058M502o969
1530b693k51Q632l781o247O123M61o369N622L857q901m99Q232m421m172P824j865
1546A552p328O510M346r278Q52P429m767k658Q470l547q340P994L763q063K406
1561f59N719p506q71R280m196p397P759J872p800M215M161r007J71R779m372n886
1577d738O920j083p127P177M268r607R10Q091n417l557Q135l039p018Q359L811
1592F085r391J123O993o559j047Q877m468p395P758J934p630L417M593q154M84
1607c380Q968n267n935P686j05o703O172L010q950J289Q377n434l499P408k458
1622A179o233P197K935r270K602O380n976j138P291m123o337P715J582p543L266
$$ plain form
1515 519 4245 -3083 -1590 3259 -2238 -3669 4544 1473 -4951 1306 3790 -3284 -226 4276 -2693
1530 -2693 -2944 5688 1907 -4340 1783 2244 -4125 1497 5354 -3547 -4046 4186 -235 -4407 3417 1552
1546 1552 -5776 734 5080 -4198 -3346 4083 -684 -3342 5128 1581 -6759 1235 4998 -3065 -659
1561 -659 5060 -2446 -3317 5963 1767 -5630 2129 4001 -3799 416 4577 -4430 -4259 5520 1148 -4738
1577 -4738 2182 1099 -6028 1149 5417 -4190 -3280 4811 -606 -4163 3972 933 -6085 2274 6085
1592 6085 -3306 -2183 4810 -1749 -2796 6081 1613 -5782 1976 3910 -3720 -303 4290 -3864 -3380
1607 -3380 5588 321 -5614 2072 1967 -4736 1436 4446 -4504 -3215 5162 -272 -3771 3637 1179
1622 1179 -5054 2143 5078 -4192 -1590 4790 -1186 -2324 4967 844 -5493 2222 3804 -3739 -473
1637d73M154o744L77P057m846m480P230k70o173M944K854q002K144P249n564k778
1653c321O759k465n374O621J774p284K777N286o261j198O779m068m231P305j4
1668C085o952L698L150o336J408O321n192l364O501j191n856N579K036o156K077
1683a192N531n732j789O259k310l859N736N87o714K909M124n169N3N784m274l305
1699c361N514m58n408M034K612n729J135M872m513k315N802j077m408M391J094
1714B185n722K481M570m608j074N538k647l892N104M05n145L106L400n184J69
1729a314M284l825j834N039q08m594L588J555m880J779L741m122j377N192j732
1744F92l896M044P16l993K132L296m150m80M034k002k397M107m9m300K730K125
$$ plain form
1637 -473 3681 -3063 -2686 4371 -475 -4955 2275 2005 -4168 776 3630 -4372 -2228 5021 -543 -3321
1653 -3321 3438 973 -4401 2220 3994 -3290 -513 4773 -1488 -2686 4093 25 -4206 3099 3085
1668 3085 -3867 -169 2981 -3355 -1947 4374 -818 -4182 2319 1128 -4728 851 2887 -3269 -1192
1683 -1192 4339 -1393 -3182 3077 767 -3092 2644 3231 -3483 -574 3550 -1619 -1566 4218 -56 -3361
1699 -3361 2153 1695 -3713 321 2933 -2796 -1661 3211 -1302 -3617 2185 1108 -3300 1091 2185
1714 2185 -3537 -1056 3514 -1094 -2168 3370 723 -3169 1935 2340 -2805 301 3701 -1483 -1314
1729 -1314 2970 -855 -2689 2350 1542 -3052 536 2091 -2789 -1010 2731 -1391 -2768 2424 692
1744 692 -3204 840 1556 -2437 -305 2991 -1159 -1639 2395 393 -2004 2103 2054 -2246 484 2609
1760B609m009M54L431k679j725L785j334l406L455J247m172J712K644l303o66
1775a957L546j262k771L288O97l412J994J775l081L51L069k055j797L178m23k788
1791a648K337J297l109M28K374k226j076L010j300k356K676N18k765J177J934
1806A271k453j31K506j076j562K199K20k457J765J298k596O77K053j937r61K618
1822A434o30k032J877N90k213P62J712k135n51K482j576j468K311J31j947O48
1838f05J464j890K77J633j265p59K177n99j501J433O63j354L06R32r53o2R64n56
1856C05q94J037L00j788R38R27j349j20J189n08r22J051Oj174Q60L12q08K15Q67
1875D44n66l15P50l6m63M65L90q32N7R02q26J58L85q3p75O08J45p01K84J02m63
$$ plain form
1760 2609 -1400 -946 2485 -194 -1919 1866 532 -2874 581 1828 -2344 -632 2012 -1291 -1957
1775 -1957 1589 327 -2444 844 1541 -1871 123 1898 -1183 -832 2237 182 -1615 1563 1140 -1648
1791 -1648 689 1986 -1123 -695 1679 -547 -1623 1387 87 -2269 407 925 -1840 -663 1271
1806 1271 -1182 -1313 1193 117 -1445 754 974 -1483 282 1580 -1016 -339 1714 -223 -1184 1434
1822 1434 804 -1228 649 1239 -974 -212 1500 -635 -1186 1296 -280 -1748 563 694 -1253 -605
1838 -605 859 -1031 -754 879 -386 -1145 1032 433 -1068 365 1028 -326 -20 912 -41 -103 861 305
1856 305 -589 448 748 -1040 -102 825 -524 -644 545 37 -885 166 172 -1002 -142 170 -638 -423 444
1875 444 -122 -437 313 277 -186 279 669 -163 -106 796 -30 128 513 430 -345 263 408 -293 -9 93 -370
1896c70o4M56j11n63L90m8j88OL05mO4P9kJ21R9l31M29J28k39j70L55l51L19J62
1920D72l01l3K81k66m08N05j92n82N38o2l43l02O74o30j33Q69o3q25R27p0r27
1941h71Q40O64r93K4Q75m03k05P72j88j303J387L00j191K19N15o56m71J613n90
1960C38j325R30L06q51J93Q40j304J6J515q92n73J189j41j107J248Q72j790K76
1978b60J302r66o49J824o33j682J571R19k054K51J440j311n19J621r01j365J624
1995B12O10j985R00R41j636j81K217j094j244J884J2j680J311Q85j993O2K092
2012A313r54j112J472q3k057K065J209k694L82J353j355m39J912p25j839J822
2028B70N35k027O73J484j790J12J986j423j666K071N77j807J749N27k345M74K085
$$ plain form
1896 -370 -434 22 -89 -652 -262 -310 -498 -492 -187 -191 -127 -48 -50 71 170 -161 268 396 157 -13 342 -9 310 472
1920 472 171 138 419 153 -255 250 58 -524 14 -48 -391 -693 -19 -649 -782 87 24 -801 126 56 -871
1941 -871 -31 633 -360 -336 539 136 -69 703 515 -788 599 899 -292 -73 442 -214 -685 928 338
1960 338 -987 -57 249 -602 -409 431 -873 -857 658 -234 -807 382 241 -866 382 1254 -536 -260
1978 -260 1042 76 -573 1251 618 -1064 507 1426 -628 -377 1063 -248 -767 854 -47 -1412 212
1995 212 822 -1163 -263 678 -958 -1139 1078 -16 -1260 624 636 -1044 267 1152 -841 -779 1313
2012 1313 359 -753 719 636 -1421 644 1853 -841 -459 894 -461 -900 1012 287 -1552 270
2028 270 805 -1222 -549 935 -855 -743 1243 -180 -1846 225 802 -1005 744 1271 -1074 -600 1485
2045A485j344q70J677k95j627J482P11k506M55K164j281p14J615j077j761K279
2061C93Q41k478P22J120j639L48J774j209j189J999K75j855R29J302j948L33J866
2078A584j120j238J567k68j526J972K39k389N17J945j894m10J485n52j319J810
2094D03O39k594J136J131j137K02J489j640j096K078K82j789J350P56j984M83
2110b91J874j501j105K042j42j742J410M56k509R56K006j536p08J367p45j374
2126a542K127L13k384R89J428j535j56J759q89j399K132k2j795P34J486k060L39
2143d75K271j614j314J940j8j708J304O54j985L36K087j808q26K004p79j641K138
2160E66M78k407M10J953j372o15J945j005j099J824P21k132N54J484j894K85J915
$$ plain form
2045 1485 141 -729 948 653 -974 508 1219 -1287 -832 1332 51 -663 952 -125 -1886 393
2061 393 1234 -1244 -522 598 -1041 -693 1081 -128 -1317 682 957 -898 31 1333 -615 -282 1584
2078 1584 464 -774 793 525 -1001 971 1210 -1179 -662 1283 -611 -1021 464 -88 -1407 403
2094 403 1042 -1552 -416 715 -422 -220 1269 -371 -1467 611 893 -896 454 1210 -774 -291
2110 -291 1583 82 -1023 1019 877 -865 545 1001 -1508 -552 1454 -82 -790 577 -168 -1542
2126 -1542 585 898 -1486 -497 931 -604 -760 999 110 -1289 843 821 -974 -240 1246 -814 -475
2143 -475 1796 182 -1132 808 790 -918 386 1040 -945 -609 1478 -330 -1156 848 69 -1572 566
2160 566 1044 -1363 -953 1000 -372 -987 958 -47 -1146 678 1399 -733 -179 1305 -589 -304 1611
2177A611j410j371J872P9j342P60P52j822J46K055j787p76J816m44j192J068N15
2194E30j678L75J761r99q67J426m19j040J329R29k082M42J498j124n85J370o88
2211A78j294J671L13j469N85N23j009L1J178p11j052J381j37j162J084L12j038
2228f16K63J127j247n25J568j73j067J111L17j190L25R89q44m29J227q23m99R07
2246D21J62r70L32Q31j170p7J044o08p78Q53K47r10L15P38j009N1J102p67m29
2265f22J195l38m60N90K52j303O52J050j397Q4Q05l12p83J011N8j095N72K55q92
2284f78L28Q53p24k45O91k99m99L77M89j010L71P61p21j44P27j72l22N73J91r72
2304d25O10L89q31nQ16n28j30K92o1o31M05M29p09j20Q79p31K7L48j12m61M14
$$ plain form
2177 1611 201 -1170 702 781 -561 199 951 -871 -725 1330 -457 -1233 583 139 -1053 15 530
2194 530 -1148 -773 988 -11 -878 548 129 -911 418 1347 -735 -293 1205 81 -504 866 178
2211 178 -1116 555 868 -601 -16 507 -502 -471 707 -4 -1056 325 188 -974 110 422 -616
2228 -616 -353 774 -473 -998 570 397 -670 441 758 -432 -107 882 38 -391 836 13 -486 421
2246 421 583 -387 -55 776 -394 -471 573 -35 -813 40 287 -623 -308 430 -579 -528 574 -193 -622
2265 -622 573 235 -225 365 617 -686 -34 1016 -381 -297 508 196 -587 424 482 -613 -41 214 -678
2284 -678 -350 503 -221 -466 225 -74 -573 -196 293 -717 -346 415 -306 -450 277 105 -217 356 547 -425
2304 -425 185 574 -257 -262 554 26 -104 188 127 -504 -99 330 -379 -499 380 -351 -324 24 -88 -549 -135
2325a35L24n42J81O16o53p7O13q9m30M08J52m81N5P79q66K4N53k07l76M92j79
2346A62o79M82J64m36j02M69n85m9Q10k1q30Q58k26m29O01j08j12nK71O5o90Q93
2368E03j52o22K65K26k54j48N61l71l31N23M8n73M43k1m05J69K46l73R4M58l28
2389d2l01N65M4o02L64R3k32K30J1o9j23P8M41m34K48N9k03Q2j58l06J5L00p7
2412a7j74k15K97j5j3j88J04R2k7J71p4K3J15K44k69K5r7j00L33k54L92m21K60
2435A92k34K19J26j92N7k34K13k32M8N2k41J41r3J28k62J55j23J55P5P1J71k48
2457e6j77L11k47J59K65r3j52P5Q8j07K25k4j21P4o3J54m10J22j64J61j53K4j8
2480a27m39N27L5m12N76j76m33K06M64m19L64J32L1k07K46m6n79O34L2m84L63
$$ plain form
2325 -135 189 -353 -172 444 -209 -286 327 238 -192 216 368 -113 -58 721 -145 -121 432 225 -151 341 162
2346 162 -517 -35 129 -307 -409 60 -525 -574 236 215 -615 243 17 -412 189 81 -31 -36 235 300 -390 503
2368 503 351 -271 -6 220 -34 -182 379 8 -323 200 248 -325 118 97 -308 -139 107 -266 -172 286 -42
2389 -42 -343 222 266 -336 28 121 -111 119 130 61 -62 16 457 23 271 330 127 209 51 -255 -240 60 -17
2412 -17 -191 -406 -109 -124 -137 -325 -221 -129 -156 15 -59 -36 79 323 54 79 -18 -118 215 -39 353 -68 192
2435 192 -42 177 303 111 168 -66 147 -85 -37 15 -226 -85 -178 -50 -312 -157 -280 -125 -50 21 192 -56
2457 -56 -233 78 -169 -10 255 162 10 85 173 66 291 267 146 220 157 311 -99 23 -141 20 -133 -109 -127
2480 -127 -566 -39 -4 -416 160 -16 -449 -243 221 -198 166 298 329 122 368 322 -257 377 409 -75 288
2501B88K21n68p0M98m4o61N50j07o49M39J20n13K79L63k58n43N43J9j16L99K60
2522D50p69K37M18j81n58P55J20q55N34K36p64L69M66l62l45P48n54o87J150n6
2542C52n25j8N61o45l10J021k61o61O32n4n94L73M55o63J10J019l35o68O32q5
2562C36p32P47O01j054j77R06o33k19N50k56o78P06N25j228L11R66j197K94N06
2581B74J01q43N08L88q62K62Q17q83j72J090m05n47P38K75j229L02Q04r91p3J175
2601G29n71p38N51O5p80R57L95r83J6P22p39P5P97n87n46O97L49p13M6J046r72
2622a84rR77k48r94N41K78p22M64P85j434K36N37j67n20O82K8q91P69K95r55K34
2643b98N18l68j59O54l17p09P12M33o20l2M83n57j62P95L1o35M51K19q16N09L53
$$ plain form
2501 288 509 -59 -129 369 325 -336 214 107 -542 -103 17 -496 -217 146 -112 -655 -112 -93 -209 190 450
2522 450 -319 -82 336 155 -403 352 472 -383 151 387 -377 -8 458 96 -249 499 -55 -742 408 352
2542 352 -173 -191 370 -275 -585 436 175 -486 146 92 -502 -129 326 -337 -227 792 457 -211 421 336
2562 336 -396 351 952 -102 -279 627 -6 -225 325 69 -609 97 622 -606 -295 671 -526 -232 274
2581 274 375 -468 40 428 -434 -172 645 -238 -410 680 275 -272 466 741 -488 -186 618 -373 -446 729
2601 729 158 -580 -29 36 -744 213 608 -375 -359 363 -376 -301 496 -91 -637 60 409 -304 -258 788 -184
2622 -184 -193 784 536 -458 83 361 -361 103 888 -546 -310 227 60 -460 222 250 -641 128 423 -532 -298
2643 -298 220 -148 -307 347 30 -679 33 466 -154 -186 297 -260 -422 373 404 -231 220 439 -377 132 485
2664D85q85J04P81k78m92Q21n09n69O85L21j017K75K91l66J86K56k2n25R33j12
2684C63p96J46O66n31K39N50l81p99R88J6n17L29j15m95J84M67q1m84L52p3k35
2705b07K57K01p17L99K59l39l33M59j66j07M37M4l86M80J22o33J54M78j30k97
2725b5L01om58K28K94o23P0N53o47o6O37n07q8L85L9n32L22L17n19K6O49m39k20
2748c09M50j87q1M59p0k30k42O42n62J07L58Q4n32K45J84m32J32N9k77M1J31r8
2770a28r6K28J95l97%M31n04Q5N61m98j98M74l7m25O37q3k29Q1M34n95K93k30
2792aK41l92K4O71r39N04J14m85J23L25k12k31L05j52k80k3M49l86K25J39O2k30
2814a49L2J20p2J09OO9j47K68l83l4L08l23l5J34K57l15OK68l08J43K09l41pL28
$$ plain form
2664 485 -400 -296 485 207 -285 536 27 -542 143 464 -553 -278 13 -353 -167 89 67 -458 475 363
2684 363 -433 -287 379 -152 87 637 256 -543 445 461 -56 273 158 -337 -153 314 233 -251 101 28 -207
2705 -207 50 251 -466 -67 192 -147 -480 -21 -187 -294 143 187 -199 281 403 -230 -76 402 272 -25
2725 -25 276 270 -188 40 334 -289 -219 334 -313 -379 258 -249 -337 48 87 -445 -123 194 -325 -299 350 -89 -309
2748 -309 141 -46 -127 332 262 32 -210 432 -130 -23 335 419 -113 132 316 -116 16 75 -202 -161 -30 -128
2770 -128 -224 4 199 -198 -198 233 -271 -186 375 -123 -321 153 116 -309 328 245 16 97 531 -64 229 -1
2792 -1 240 -152 -128 543 -396 108 222 -263 -140 185 -27 -258 47 -105 -385 -408 41 -345 -120 19 81 -149
2814 -149 -117 3 -69 40 46 115 -32 236 -147 -181 127 -196 -231 -97 160 -155 -149 119 -189 -46 163 -178 -185 143
2838A43L1l26%r1l8Q3L97o3j83L52j69k93P2L36l38J50K1RM2L41o15n3K42j84
2862a34j87M39p8l00j1J67J18j14K04j75k79L80n3r4Q3K6j72M04J94m43k1J75
2884A29k7kk3L80l51m6j4j19J29Pn0k09J52K14k60p1J36K0j32J76j80K44j07k97
2908c01M38j9j7J63j86J47k02Q2k7K5p9K18L7m22J48K21L1Km60L28k95n8J09N4
2932f3q9o2K76k80J27N8r4J15k09K73j06j77J79J21r0J53l58K5L97j47J58j56
2954E1n5n5J49N6o6m3k7P1Q1m25J14OM3o9J18J59n1J10l71O1l0J22P3J41K54l42
2980G5M4j52K0J96O9k50j25Q1J75m47L69j5K33l61L09m28J89p0p3p2L38J52l54
3003i7K4q0m8J57J13K64m19K8J60m0N7N6r7k1J88j02l06J40J80l77K69R6k03r4
$$ plain form
2838 143 174 -152 -152 -243 -281 -198 199 136 -47 305 136 -157 -85 251 -87 63 84 93 135 476 -139 -192 50 -134
2862 -134 -321 118 40 -260 -271 -104 14 -100 104 -71 -350 30 -23 -117 -34 -8 -180 224 418 -25 -46 129
2884 129 102 100 77 457 106 60 46 -73 56 63 13 -196 -44 170 -90 -161 -25 -5 -137 39 -141 103 -4 -301
2908 -301 137 118 101 264 78 225 23 105 78 103 24 242 279 -143 5 226 257 259 -201 127 -168 -226 -117 -63
2932 -63 -152 -214 62 -218 -91 -33 -127 -12 -221 52 -54 -231 -52 69 -21 132 -226 -201 196 49 207 51
2954 51 -4 -59 90 146 80 37 10 81 162 -263 -149 -143 -100 -169 -51 108 57 167 -204 -143 -173 -51 22 163 417 75
2980 75 119 -33 -13 183 252 2 -123 -42 133 -314 55 40 273 -88 221 -207 -18 -88 -161 -233 105 257 -97
3003 -97 -73 -153 -201 -44 69 333 -86 -58 102 62 119 175 78 57 245 143 -163 -23 157 -220 49 145 -58 -152
3027a52J97L9k34K19L9l11K56P0l68J90J04l4o9K00m45J89J97M36n84m1K38j4
3049A22j54L71l38J38k12L33l71j4M54l82l2j40L54k73j13L82n82L19L89l47j97
3070b93M69Ql03J06K66k01K25o0l90K96l6J63k34K14l77j74L56o1l2k09M88k56
3092c5j74M4R0j45K55M8p1q9J97l45K20K5j22K67m5j04j55K54J27O9m04L68k21
3115E4j0K8J97n08J81J15j06r0J48lj62p0lJ47k15K59o5J74j88m2N1q0J87k00
3139b01J44k17L97J7n4k00J40K80l60M34k72n6M1J96j84j72K22k34K50l7k70n8
3161a94J25J87j66j95Q6O4j23L57J8j74j00L48k64j52L76p7k26Q6L68n85M42J59
3183C60l46j94K45J09m16K60M7k20nJ94j00l7Q3q8J75m8J38k90L90j79j0Q1j55
$$ plain form
3027 -152 45 84 -150 69 108 -203 53 123 -245 -55 49 15 -54 146 -299 -110 87 523 -61 -102 136 122
3049 122 -32 339 1 139 -73 260 -111 -125 329 -53 -85 -225 129 -144 -257 125 -457 -138 251 -96 -293
3070 -293 176 184 -119 -13 253 52 277 217 -173 123 87 250 16 230 -147 -321 35 -26 -58 -267 221 -35
3092 -35 -209 -165 -75 -220 35 83 12 -77 120 -225 -5 20 -102 165 120 16 -139 115 242 311 -93 275 54
3115 54 44 72 269 -239 -58 57 -49 -139 9 6 -156 -226 -229 -82 -297 -38 -103 71 -117 -159 -108 -188 -1 -201
3139 -201 -57 -274 123 140 86 -114 26 306 -54 380 108 52 93 289 105 -67 155 -79 171 134 -136 -194
3161 -194 -69 118 -48 -243 -157 -93 -216 141 159 -15 -115 233 -31 -183 193 116 -110 -24 344 -241 201 360
3183 360 14 -180 65 174 -242 18 65 -155 -160 34 -66 -103 -20 -108 67 19 157 -133 257 78 68 149 -6
3206foj01M30J33m86Q1R1k34l6K22Q0m76J08M61m01j85L12j02j52L44r1k1o2P8
3230a9k07M4K34rJ25j5K42k96R2J3l00K17j89nJ62K1k56O9L26j68l31J79kJ58
3254H5l08Q7j05N9N9J26j59K77n1j92R9K26k08R0M5q7P7J1j03k35M79k2L4n23
3278b39l2J40K33J02J7l79K04J08m62L43N7l50L01l3r2Q2k72K98o8p4L24m07Q7
3301a12J35j35M5L05l59K94N5l23R2j48K75k39K51J24j09k81K17M6k32O4m0k79
3323c54N12k38j7O5Q5k7j93K39J45j25j94K09j45M6J41j62mj8J53M9k07J3K7J60
3347A60j91pm0j27K46q8O8l6o8J2K11k22J63l5l24P7rL23o2m4L5k04K64J76l64
3372h6MJ31qo0J96J82m60O9l08M12k36J95l2j24L02l87J87j88J44j05L41j21R7
$$ plain form
3206 -6 -12 -113 317 450 -36 45 136 -98 -134 88 168 -308 -200 261 -140 -325 -13 -115 -267 77 -14 -35 -97 -19
3230 -19 -226 -182 52 43 168 153 395 99 191 204 -96 121 -68 -73 89 110 -146 -77 249 81 -250 -71 -73 85
3254 85 -223 -136 -241 -182 -123 3 -156 121 70 -122 -23 203 -5 85 130 43 120 131 28 -207 272 250 284 -239
3278 -239 -271 -131 102 204 221 -158 46 154 -308 35 92 -258 43 10 -82 0 -272 26 -42 -116 208 -199 -112
3301 -112 23 -112 -67 238 -121 173 228 -95 -3 -151 124 -115 136 260 151 -130 87 133 -99 -35 -75 -354
3323 -354 158 -80 -97 -32 53 26 -167 72 217 92 -102 107 -38 8 149 -13 -17 -35 118 167 -40 -27 0 160
3347 160 -31 -38 -78 -205 41 -47 21 -15 -83 -71 140 -82 81 46 -278 -201 -210 113 51 7 42 -162 102 278 -86
3372 -86 -82 49 41 -19 177 359 -101 -32 -340 72 -164 31 -1 -125 177 -210 -23 -211 -67 -172 169 48 145
3395A45k81M12o8j63o8J57j15J9oK02l58K58k34J5P6J99k85L7p3m5K91q0k67J69
3419f3m0J48O7j23k79L16N1m5m9j01j4K32j36R1pK1j89O1J68j74J87O7j33q8%
3444c2k2Q8k34J82J66j29P6l54K82k64K9P9K58l08J83N6l07K16L4j59J67j2J33
3467A28n7n0K56k63L8j00J79N9j70j8Q2j74J94L7k45k66M33j30Qk72J23K89j33
3490e2J49J39jj25k98K98l0Jr6K41k72j55J77J1j27K87m09L47J92l97J5o2K64
3513I7j46j0k00L74n7j10j36N46m42O7J88m60K33K31m2J10k84K64k61L5J15k49
3535a37L36k03K75k21j15ok27J61J45j07m5nJ30j30j05J91p8L14m10K29j59K53
3557H6j98Q1L09k63J11J20m8k85K23k5l03K97p5j02J10o4o5N1m3O5j45P4M75m16
$$ plain form
3395 145 -136 276 208 45 -23 134 19 38 32 234 -124 134 -100 -85 -9 190 -95 -58 -131 -176 115 35 -232 -63
3419 -63 -103 45 112 -11 -290 26 77 32 -17 -118 -132 100 -36 55 48 69 -120 -59 109 -65 122 189 56 -32 -32
3444 -32 -54 34 -200 -18 148 19 95 -259 23 -241 -212 -133 125 -183 0 56 -251 -35 -1 -160 7 -5 128
3467 128 71 21 277 14 52 -48 131 190 20 2 84 -90 104 141 -104 -370 63 -67 -59 -331 -208 81 -52
3490 -52 97 236 235 110 -188 110 80 81 -15 226 -46 -201 -24 -13 -140 147 -262 85 277 -120 -105 -167 97
3513 97 -49 -59 -259 115 58 -52 -188 358 -84 -17 171 -289 -56 175 133 243 -41 223 -38 -3 112 -137
3535 -137 199 -4 271 50 -65 -71 -298 -137 8 -99 -144 -149 -19 -149 -254 -63 -141 173 -237 -8 -167 86
3557 86 -112 -31 278 15 126 246 198 -87 136 111 -192 105 30 -72 38 -26 -91 -40 -83 -18 -163 -89 386 -30
3581c0J2l3P1j56L46j85j55M9J80p8m4J13Q1l21J13K68j06m44M42L2j74K73K7
3604B81l45l5Q2J33n15N78q6n50L68K75k83J50J4n6QK09l75p2L77K83l23l27M77
3627B68m36J01j1j29J45J41n1k45K75j53J54j48L90k30l50K85l3q4j71L99l97
3648b80L02l6r3K5Q3qQL07k98j80L68k52j39J09K53k39j55L42J24k23r6K62j87
3671cJ13Jl3J64m78K53J55p1k68J2O4J05j83J55N0p3J3m9J77k3N6qk31j48M67
3696B17j01Q1j16j34J2R0P2l89J95J25o9j93N6L07k72L21j16n7J6m8Mk72L66j41
3720d6N2j13Q6Q6j11J06jQ9j26J34j56O5j20j27K24J65o4j03R3k58K9J06q6k3
3744i9L3J05m9O8j63J89j66K90k62j7L50k91J83k28J65k04M35k30Q3l23j86L64
$$ plain form
3581 -30 -18 -51 20 -136 210 25 -130 -81 99 21 -23 90 171 -150 -37 231 125 -319 123 155 -19 254 281
3604 281 -64 -99 -17 116 -399 179 93 -457 -89 186 -97 53 67 11 19 228 -147 -219 158 441 118 -209 268
3627 268 -168 -67 -78 -207 -62 79 28 -217 58 -95 59 -89 301 71 -279 6 -27 -111 -282 117 -280
3648 -280 22 -14 -107 -82 1 -7 1 308 10 -170 198 -54 -193 -84 169 -70 -225 117 241 18 -78 184 -3
3671 -3 110 111 78 242 -236 17 172 101 -167 -155 -91 14 -169 -14 36 -37 -24 -73 104 81 137 129 -102 -250 217
3696 217 116 197 81 -53 -41 49 121 -268 -73 52 -17 -210 -154 153 -119 202 86 29 45 -3 1 -271 95 -46
3720 -46 6 -107 -21 65 -46 60 59 148 22 156 0 65 -55 -182 42 207 143 40 133 -125 -96 10 -76 -99
3744 -99 -66 39 -10 58 -105 84 -82 208 -54 -71 279 -12 171 -57 108 -96 339 109 192 -131 -317 47
3766D7q3j23J84J28l40J1K58j61K90j91q6j32O1o6J75rj44J82J35j24jR0p5K8
3790E4K1j43N0K56l59QQq3J53j64J34m7o1L32k93l39N15j7k84K01j9J51r3o4J09
3815B6n1J10O4k94K81k9J6L3o2Qk77N5K98k78J41O7J46M0m61L21l5m4L2j02P1
3840G6m9j6j59J20K45j89J48r3L4k37J86n2oJ56Lj51O5K5n8N7k03J27J82l57O6
3865h0o0j00L54j29p9K70k9j07k07J22J52j04j22k0O0P5P0L1j42n0L68k40J57
3888A90k91j8L49N6l23j35Q4p5pK53l0j30K52q9L1j67J6O5o5ol86K03K93m1j19
3913i0m3J61K37k00L1j23L1p7q3K22J55k23l4j10J15j45k8O5p3L37m77O67l40
3936b5j8j9j57K66j59L9L00k01j74K09mK14k42jl3O8nJ5J9k43K28L4O1p7k04J60
$$ plain form
3766 47 -36 -159 25 153 -187 -176 82 -79 211 20 -66 -198 -137 -203 -28 -37 -181 1 136 12 11 101 26 54
3790 54 75 -68 -18 238 -121 -113 -105 -188 -35 -199 -65 -112 -173 159 -134 -473 42 25 -259 -58 -77 74 -19 -83 26
3815 26 -25 85 149 -145 136 107 123 156 94 102 -175 -120 178 -100 41 108 254 294 -167 154 119 75 107 5 76
3840 76 27 11 -148 -28 217 28 176 83 117 -120 66 14 8 164 167 16 81 106 48 105 -98 29 211 -146 -80
3865 -80 -140 -240 114 -15 -94 176 147 40 -167 -45 107 3 -119 -139 -79 -4 66 97 -45 -95 273 33 190
3888 190 -101 -119 230 286 -37 -172 -88 -163 -170 83 53 -77 175 86 117 -50 -34 31 -34 -40 -426 -223 70 29 -90
3913 -90 -133 28 265 65 96 -27 4 -73 -156 66 221 -2 -36 -146 -31 -176 -204 -139 -212 125 -352 315 -25
3936 -25 -43 -62 -219 47 -112 -73 227 26 -148 61 57 271 29 28 -5 63 58 73 92 -151 77 111 172 95 -109 51
3962E1r2Q6k97K69q3Q1J5J12l96K45j3j17K30o8k51L98k6k21K83k48K40m18L19
3985I9K58n17J84P5Q5kj87J02j72MM5rR5J1J81l19j69L12k6j60O0K35l97L32j17
4010CJ80m5j41O6J09l01K35k9j49K83q4k50l6N7R9l8M2k7K11j02j32J14j12j3
4034f0P3k7J5L1n9k1Q7j52m9L08j28j37M36j55j5j41J97l5k43J78J36l19Q2K85
4058B87k73J34rk75K11j82k5J60j17Q2k87Q7K49j99K39l4M8J97k73J71k54j2K07
4081A32j01p5O1O9J16k10N5J16J34l85nK09j52j4j70L86l68n1L10j96K63Q9o5
4104A48j82L1M48n11R6k29K46k45p3M37k39J24J46l7k36K33l5j41R6j3k75M65
4126B54j12l77J60r3L05l08Q1P9QL68l63J37k07j61L44k84K28q2J67M2q9n8L2
$$ plain form
3962 51 -41 45 -252 17 -66 15 30 142 -254 -9 -22 -139 91 23 -228 170 144 -77 206 -42 198 -220 99
3985 99 357 -160 24 99 184 182 -5 97 -75 -71 -26 -35 60 71 252 -67 -236 76 50 -110 -50 185 -212 120 3
4010 3 183 138 -3 63 172 -129 106 77 -72 211 127 -123 -159 -102 -3 -41 1 -26 185 83 -49 65 -47 -60
4034 -60 13 -14 1 32 -27 -48 39 -113 -162 146 18 -119 317 162 147 6 203 168 -75 103 239 -80 2 287
4058 287 14 148 139 -136 75 -107 -132 28 -89 -7 -294 -207 42 -157 82 48 96 293 20 191 -63 -75 132
4081 132 31 -44 17 86 202 -8 47 163 297 -88 -93 116 -36 -50 -220 166 -202 -253 57 -139 124 213 148
4104 148 -34 -3 445 -66 30 -199 47 -198 -271 166 -73 51 197 160 -76 157 122 -19 77 64 -211 254
4126 254 142 -235 -75 -168 137 -171 -90 -11 -3 365 2 139 -68 -229 115 -169 59 -23 144 186 97 39 71
4149G1k00J70p8J64rr0k21J76L4o0K5j19J37k4n6N0j37O6Q4J08j84J70j57L05
4173B25j22K47j74l3k34J32R6M3j59j42R0N3P4l8k15m6K0J84j5J77n2j80p0O6
4197g3r5K86j94l2L79m45L82k17m8J41M1k42J52j24M00p3l34Q6m5P9O2R8r5R5
4221A84k75Q8m9K0OJ22n8K1j47j5L9OQ0m6j2j50L7K6j45L25Q7m79K74M0J88q4
4247H3np1j87L17j0lm6R4k10J17j3O7k23m5J53l00M76Q0l77L63P7o17K30O0j37
4272a27K85l7J7j42R0k7k5p2J11j3j64M8n8J3L0q6J38J25l00J68l16K46l0J37
4296A1j01k26L96j04m9j19K01k53L40j81K88o5j31n7K9j13K06j61J76j2J4K10
4318B99m49K03o0j18K1L03j75m4j23N5J92J42o6j53Q4M8l21J67K48m50l1L70L4
$$ plain form
4149 71 -129 41 -37 127 118 28 -193 -17 17 -43 -18 -137 0 -24 -80 -30 -167 -101 -17 91 -93 77 -80 225
4173 225 103 350 176 143 -91 41 137 180 21 -121 -31 22 96 58 -157 -203 -183 1 -14 163 111 -69 -139 -73
4197 -73 -168 118 -76 -108 271 -174 208 -9 -57 84 125 -117 35 -89 311 238 -96 -10 -55 24 86 184 89 184
4221 184 -91 -3 -52 -32 -26 96 38 59 -88 -103 -64 -58 22 -24 -36 -186 -149 -123 -268 57 144 -335 -61 -21 167 83
4247 83 78 7 -180 137 127 124 78 172 -38 79 66 133 -90 -135 18 -282 194 274 -103 260 337 -280 -50 10 -127
4272 -127 158 121 138 -4 86 59 34 -38 73 60 -104 -56 -114 -101 -71 -157 -19 106 -194 -26 -342 -96 -126 11
4296 11 -90 -316 80 -24 -73 -192 9 -244 96 -85 203 138 7 -50 -21 -134 72 -89 87 75 89 299
4318 299 -150 53 -7 -125 -104 199 24 -20 -143 -88 104 246 180 27 111 159 -162 5 253 -197 -228 142 176
4341A76j44j55J27Q1m1J50j96O4L1j53J47j28N6j15j9O2J13k20K40j76n0J02k9
4364g7J80n4j03p8J3J81j70J02n6J40k69K06J92j74q7Q6j84K07k08R3lp9J21k05
4388b26O3pj48J39J11MM9J68k69j54Q3K1L30l62L28j41j88K60J60m81L28j13J17
4411G2p0L14k97k53M11k59J08k27K07k5j71N2j20R1J08Q5q8J85q3P6j11n7J27
4434G5j2J15k36k0j30K47qn7K29l09P2L8j39O0J28Jr9j24O7K8j45K96l2R7j55
4459a3l8m5j06N4K12k03L08j22j13q7K22l46L90p4N4j1Q8k60J11o2K16l06R5L3
4483cK53k15j02J48j85K1oJ8j30L12n2P3l00RP6l4m7J62k2J10J0K01o9j8R4k55
4509D9j32q1J91p3oJ9k98L45l53L98J7k8J75l17M7N9o0K02j11j44P0J80Kr6k5
$$ plain form
4341 176 32 -123 4 85 44 194 -2 62 93 -60 87 -41 15 -100 -119 -57 56 -164 76 -100 -150 -48 -77
4364 -77 103 49 -54 -132 -119 62 -108 -6 -62 78 -191 15 207 33 -54 32 -152 55 -153 -60 -63 -142 -21 -226
4388 -226 -163 -170 -318 -179 -68 -64 -15 153 -116 -270 -187 -166 164 -198 130 -11 -199 61 221 -260 68 -45 72
4411 72 2 316 19 -234 177 -82 26 -201 6 -19 -190 -138 -258 -167 -59 26 -62 123 40 116 5 -52 75
4434 75 63 178 -58 -78 -208 39 31 -26 203 -106 -34 4 -135 -75 53 54 -45 -169 -102 -74 -219 77 45 142 -13
4459 -13 -51 -96 -202 -148 64 -139 169 47 -66 -153 69 -277 113 39 93 82 170 -90 21 -41 175 -131 -36 -3
4483 -3 250 35 -67 81 -104 -83 -89 -71 -201 111 59 132 -168 -159 -83 -117 -164 -2 -24 86 96 297 228 210 304 49
4509 49 -83 -164 27 -46 -52 -33 -331 14 -339 59 76 48 223 -94 -47 12 -48 154 43 -101 -31 149 151 55 30
4534C0J09k82J93J71m58K54J8m2k7N8k6O1J4k25K73j62L61k52j7k38L66j38j70
4557a29K38k10L1K08m3m7j46N2J46k65M29k18J28p0J73j25N0j98J07j38jK20l4
4580A58j49j34L45l59J92r0j82L21m8j41K1K71k88k20O23l12l29N16r3M6k00j86
4602b38J8L38j62J21P9M4Mk03j21J10J89j56N0K5k39J91lp9j60K71r4J41m35N45
4626B36k36j07L24l18j04J73n7J19r8j00J73L0J8j17M3lm6J75j48J10k72J18K68
4649A81j34Pj29R2n8n1K72Qr0K43m12J41j54K84l18L5K40k16J60m3J33j96Q9m3
4673D1j02m1l3J80R3k12K0J47p9j19L9J16P2k51J12O6J59j74J41p1m2j55J95R
4697A11K50j50k65ML41k85k9L4qj12j09J73q2L09k55K2j13K88r7l15L2K08q7J15
$$ plain form
4534 30 139 -143 50 221 -237 17 35 -7 -34 24 -2 59 73 -152 121 -41 320 68 51 -187 179 41 -129
4557 -129 109 -101 -70 138 95 48 -98 -46 100 -165 264 46 174 104 277 152 202 4 111 -27 -28 192 158
4580 158 9 -125 220 -139 53 -37 -219 102 54 -87 -66 205 -83 -303 320 8 -321 195 102 148 -52 -238
4602 -238 -220 118 -44 77 156 200 204 1 -120 -10 179 23 73 98 -141 50 47 -32 -192 79 -15 126 -309 236
4626 236 0 -107 217 -101 -205 -32 -89 30 -68 -168 5 35 53 -64 -21 -24 -70 105 -43 67 -205 -87 181
4649 181 47 54 -75 17 -41 -92 180 188 98 341 -71 70 -84 200 -118 -83 157 -59 101 58 191 -5 84 41
4673 41 -61 -102 -135 45 138 -74 -54 93 14 -105 -66 50 122 -129 -17 49 208 34 175 104 62 -93 102 111
4697 111 361 211 -54 -50 291 6 -23 11 3 -109 -218 -45 -127 182 -73 -51 -164 124 27 -288 -256 -48 -135 -20
4721b0m2m3m7L93j77j2j10m3M30m29j85J10M45k43K9j93Q0J89j85p9P8J3k19j
4745b61K09j38M8j68L32Qo9j09K79j3k45K36j9l5n4np6k56J46J87O4j84Q8J37
4769A02k74K98m8j48N1Q3P1j93J97K13m04J52l16pL84k93l2K05j18K45k58r6N1
4792a35o5J85j02K07o5j56L23J31n9j52L0j37jj99K50KK20m52P5O7M8J19o8k85
4816b19J97K46j46k24P7L85j38l03K07p7K3J81j94j91K69j36r0K65k61L3j3L00
4838A91j75N4J0n4J38j10k07K5J37j22L21k4j32K4J62k91qL0M9J44k17J81j3n2
4862F1j57lJ44J29r6k29O6J84K18m79n5L13p2ln2P1jJ21j16J64l40K93k53K13
4886A21r5p7K41k96O0J65j17J7K02k37O5k87K65k13K04J3Mk64N55l25J43m34N49
$$ plain form
4721 -20 -62 -105 -152 241 64 52 -58 -101 329 -100 -285 -175 270 27 56 -137 -57 132 -53 -132 -54 -41 -260 -261
4745 -261 -52 -190 -142 -310 22 30 -39 -148 131 118 -127 109 90 55 1 -4 -80 -336 -190 -3 61 -123 -35 102
4769 102 -172 126 78 -70 -19 64 135 -58 139 352 -52 100 -216 -223 161 -132 -164 41 -77 168 -90 -186 -135
4792 -135 -200 -15 -117 90 25 -131 192 323 264 112 142 5 4 -195 55 57 277 -175 -100 -33 15 134 66 -219
4816 -219 -22 224 78 -146 -69 316 178 -125 82 5 28 209 15 -176 93 -43 -133 132 -129 -96 -109 191
4838 191 16 70 80 26 164 54 -153 -128 9 -113 208 184 52 76 238 -53 -61 -31 18 162 -55 126 113 61
4862 61 -96 -99 45 174 78 -151 -85 99 317 -162 -217 96 24 21 -31 40 39 160 44 208 -132 161 -92 121
4886 121 26 -51 190 -106 -46 119 2 19 221 -16 49 -238 27 -186 18 31 35 -229 326 1 144 -290 259
4909B59j94k0Jj24k49O8K67q5j07L29j08P4o6M0M4j1J15l49O0J21j04J52j4n53
4933d54N34p9q5J86q8L3O2j00n2J43k49K56k92R8n1L17j32j29j3J23k37K37j49
4956a21M88k6m92M03p56M44J45j80J42j2K34n39K19J33Q7n01L37J95j62j84N3
4977i3j84J80K92l52M0K11k95K57j35K05N6J0j89j16K31q0j91k4K10j12MR6K4
5000D5k30%J31j23K27j25k7P2j4M9j4k66L19J1J03j87J5n9K24Q8m06L30J46m62
5024a53J40M8r1J2K50j3k43k4J53q1m7M7r6J92P5j43p5M8j54J60K8O9j04MMJ34
5050A40k8l0J47j76j99K57l27K89k8l6r0j6K85j35j84K04n5j80M2J08j02k6L10
5073A70K8j31R0r3k04L10n4k58K28J08k25R0Qo8p7Q0O6k6j81J28P5o7J41k10j15
$$ plain form
4909 259 65 45 46 -78 -327 -259 8 -77 -184 145 37 111 45 85 129 118 233 -116 -56 65 -39 113 99 -454
4933 -454 80 1 -84 102 14 47 109 9 -43 100 -149 107 -185 -87 -138 179 47 -82 -95 28 -209 28 -121
4956 -121 367 341 -151 252 -504 -60 85 -95 47 35 269 -270 -51 82 169 -332 5 200 38 -146 -93
4977 -93 -277 -97 195 -157 -117 94 -201 56 -79 126 182 192 3 -113 118 38 -153 -177 33 -79 -75 21 45
5000 45 -185 -185 -54 -177 50 -75 -102 -30 -44 5 -9 -275 44 55 158 -29 -14 -73 151 239 -167 163 309 -153
5024 -153 -13 35 -56 -44 206 193 -50 -74 79 -2 -49 -2 -98 94 169 26 -49 -1 -155 5 33 102 -2 2 6 140
5050 140 112 82 229 53 -146 111 -216 73 45 9 -81 -97 188 53 -131 73 18 -162 -120 -12 -114 -140 170
5073 170 198 67 157 64 -140 170 116 -142 86 194 -31 59 67 -1 -78 2 68 42 -139 -11 64 -3 138 -72 -187
5098a87O2R2j50L90j71q5j76J16J83k29J66J2m5p6k0J37lP5J37j42j17pOJ44j6
5123I6n7R0j92n9JM04o51K13K19r6P6J77k09l42L12L7j85K72l40K86Nk24L02m7
5147H8M8o2j94J25P8q7p2J59L3j88K68k24j26J32N1r5k75L50J42k87J85r6K1K00
5171A74j28j01O7J03k45J83M5m5L24l10j67J97q8Q6j44m7K31N5k88K18Q4j08P
5194A03J3l79K42j50J46k55K36J08j77M2N5j15K28p5pp8rJ85k48L24j20j2m3k3
5218ir6m7K07J25k30m5j13J14J71k61J95K0L5j50j30J07K15o2j24L55m17K57K9
5241A46k20Q0qj8n8J36K07K1j92k05J66J89l08J60k29K95j40J27j59j02J38K6
5263E2J0j99L03J38l01r4Q2p0J62l3J52k37o7M05m64K05j45q2J26N6Qr7K10l4
$$ plain form
5098 -187 -125 -33 -183 207 36 -49 -225 -109 74 -155 11 23 -22 -98 -118 19 16 91 228 86 -31 -38 -32 112 96
5123 96 39 129 -63 -122 -121 283 -368 -155 64 -32 44 221 12 -330 -18 19 -166 106 -234 52 57 -167 135 88
5147 88 136 74 -120 5 83 -4 -76 83 116 -72 196 -28 -154 -22 29 -66 -341 9 151 -136 49 -47 -26 174
5171 174 46 -55 12 115 -130 53 98 53 377 67 -100 97 9 95 -49 -96 135 190 -98 120 204 96 103
5194 103 116 -263 -21 -171 -25 -280 -44 64 -113 -71 -16 -131 97 22 15 -63 -72 113 -135 189 69 57 14 -9
5218 -9 -105 -152 55 180 -50 -95 -208 -94 77 -184 11 31 66 -84 -214 -107 108 46 -78 277 -140 117 146
5241 146 -74 6 -2 -20 -78 58 265 286 94 -111 55 244 -64 96 -133 162 22 149 -10 -112 26 52
5263 52 62 -137 166 304 3 -91 -9 -79 83 50 202 -35 -102 303 -161 44 -101 -183 -57 -1 7 -90 120 86
5287H6k75K84j06o5j20M17Lj41q1j85rK96j76J7m2L1J25k61J08QJ48P0J13l62
5311a17l3L45l32K42O4l14j85L00k1J43j51J98j40j39Q6o7J61k9K3r3J7j29K17
5334D6k32J15j09J94K2j1j77P3R1J0K08l43L65j12j68o0p0K09m4j0N0LK0k43K40
5359F7r2J7j62K60p4r8J82k41O0n1j77K16M3K8K58m08K06K05o09L21M7j25J15
5382a2m9j68lJ77M8J5j48L91l83m4J22o7k1J12j50L45n4k85J13N8m1n1K81k34
$$ plain form
5287 86 -189 95 -11 -76 -196 221 224 83 2 -183 -192 104 -72 -55 -97 -66 59 -202 -94 -86 62 132 245 -117
5311 -117 -150 195 -137 105 169 -145 -330 -30 -51 92 -59 139 -1 -140 -54 -121 40 11 34 -59 -42 -171 46
5334 46 -186 -71 -180 14 36 25 -152 -79 12 22 230 -113 252 140 -28 -88 -158 51 7 -3 47 50 70 -173 67
5359 67 -25 -8 -170 90 16 -82 100 -141 -81 -132 -309 -93 -50 -22 236 -172 34 239 -370 -49 -2 -127 -12
5382 -12 -61 -229 -232 -55 -7 8 -140 251 -132 -176 -54 -121 -142 -30 -180 165 111 -174 -61 -3 -44 -95 186 -48
$$ [...]
8191F8
##END NTUPLES=NMR FID
##END=
