##TITLE=1H_Pr NCO-dep
 CDCl3
 8 sc, 
 2.11.2024
##JCAMPDX= 6.0         $$ Bruker NMR JCAMP-DX V2.0
##DATA TYPE= NMR FID
##DATA CLASS= NTUPLES
##ORIGIN= UXNMR, Bruker Analytische Messtechnik GmbH
##OWNER= root
$$ XWIN-NMR		Version 3.5
$$ Sat Nov  2 14:31:29 2024 Russian Standard Time (UT+4h)  she@DPX200
##.OBSERVE FREQUENCY= 200.1318
##.OBSERVE NUCLEUS= ^1H
##.DELAY= (6, 6)
##.ACQUISITION MODE= SIMULTANEOUS
##.ACQUISITION SCHEME= undefined
##.AVERAGES= 8
##.DIGITISER RES= 18
##SPECTROMETER/DATA SYSTEM= spect
##.PULSE SEQUENCE= zg30
##.SOLVENT NAME= CDCl3
##.SHIFT REFERENCE= (INTERNAL, CDCl3, 0, 15.7039)
##AUDIT TRAIL= $$ (NUMBER, WHEN, WHO, WHERE, WHAT)
$$ ##TITLE= Audit trail, XWIN-NMR		Version 3.5
$$ ##JCAMPDX= 5.01
$$ ##ORIGIN= Bruker BioSpin GmbH
$$ ##OWNER= she
$$ F:/spectra/data/she/nmr/H-F/1/audita.txt
$$ ##AUDIT TRAIL=  $$ (NUMBER, WHEN, WHO, WHERE, WHAT)
(   1,<2024-11-02 14:30:21.34 +0400>,<she>,<DPX200>,
      <created by zg, POWCHK disabled, PULCHK disabled
       configuration hash MD5:
       00 E9 B6 7A A2 85 ED C7 34 08 36 98 17 FE 4E 26
       data hash MD5: 16K
       AB F4 8F 7A CD DB 54 F3 C8 19 41 5D F4 BC 78 21>)
$$ ##END=
$$ 
$$ hash MD5
$$ BE FD E6 E4 E4 BD 75 57 34 D5 37 2A 87 96 CA EC
##$RELAX= 
##$RELAX= 
##$RELAX= 
##$RELAX= 
##$RELAX= 
##$RELAX= 
$$ Bruker specific parameters
$$ --------------------------
##$DU= <F:/spectra>
##$EXPNO= 1
##$NAME= <H-F>
##$PROCNO= 1
##$TYPE= <nmr>
##$USER= <she>
##$AMP= (0..31)
100 100 100 100 100 100 100 100 100 100 100 100 100 100 100 100 100 100 
100 100 100 100 100 100 100 100 100 100 100 100 100 100 
##$AQSEQ= 0
##$AQ_mod= 1
##$AUNM= <au_zg>
##$AUTOPOS= <>
##$BF1= 200.13
##$BF2= 200.13
##$BF3= 200.13
##$BF4= 200.13
##$BF5= 200.13
##$BF6= 200.13
##$BF7= 200.13
##$BF8= 200.13
##$BYTORDA= 1
##$CFDGTYP= 0
##$CFRGTYP= 5
##$CHEMSTR= <none>
##$CNST= (0..31)
1 1 145 1 1 1 1 1 1 1 1 1 1 1 1 1 1 1 1 1 1 1 1 1 1 1 1 1 1 1 1 1 
##$CPDPRG= <>
##$CPDPRG1= <>
##$CPDPRG2= <>
##$CPDPRG3= <>
##$CPDPRG4= <mlev>
##$CPDPRG5= <mlev>
##$CPDPRG6= <mlev>
##$CPDPRG7= <mlev>
##$CPDPRG8= <mlev>
##$CPDPRGB= <>
##$CPDPRGT= <>
##$D= (0..31)
0 1.2 0 0 0 0 0 0 0 0.06 0 0.03 0 0 0 0 0.0002 0 0 0 0 0 0 0 0 0 0 0 0 
0 0 0 
##$DATE= 1730543420
##$DBL= (0..7)
120 120 120 120 120 120 120 120 
##$DBP= (0..7)
150 150 150 150 150 150 150 150 
##$DBP07= 0
##$DBPNAM0= <>
##$DBPNAM1= <>
##$DBPNAM2= <>
##$DBPNAM3= <>
##$DBPNAM4= <>
##$DBPNAM5= <>
##$DBPNAM6= <>
##$DBPNAM7= <>
##$DBPOAL= (0..7)
0.5 0.5 0.5 0.5 0.5 0.5 0.5 0.5 
##$DBPOFFS= (0..7)
0 0 0 0 0 0 0 0 
##$DE= 6
##$DECBNUC= <off>
##$DECIM= 24
##$DECNUC= <off>
##$DECSTAT= 4
##$DIGMOD= 1
##$DIGTYP= 9
##$DL= (0..7)
0 120 120 120 120 120 120 120 
##$DP= (0..7)
150 150 150 150 150 150 150 150 
##$DP07= 0
##$DPNAME0= <>
##$DPNAME1= <>
##$DPNAME2= <>
##$DPNAME3= <>
##$DPNAME4= <>
##$DPNAME5= <>
##$DPNAME6= <>
##$DPNAME7= <>
##$DPOAL= (0..7)
0.5 0.5 0.5 0.5 0.5 0.5 0.5 0.5 
##$DPOFFS= (0..7)
0 0 0 0 0 0 0 0 
##$DQDMODE= 0
##$DR= 18
##$DS= 0
##$DSLIST= <SSSSSSSSSSSSSSS>
$$ [...]
##$SUBNAM2= <"">
##$SUBNAM3= <"">
##$SUBNAM4= <"">
##$SUBNAM5= <"">
##$SUBNAM6= <"">
##$SUBNAM7= <"">
##$SUBNAM8= <"">
##$SUBNAM9= <"">
##$SW= 24.0689170037331
##$SWIBOX= (0..15)
0 0 2 0 0 0 0 0 0 0 0 0 0 0 0 0 
##$SW_h= 4816.95568400771
##$TD= 16384
##$TD0= 1
##$TE= 0
##$TE2= 300
##$TE3= 300
##$TEG= 300
##$TL= (0..7)
0 120 120 120 120 120 120 120 
##$TP= (0..7)
150 150 150 150 150 150 150 150 
##$TP07= 0
##$TPNAME0= <>
##$TPNAME1= <>
##$TPNAME2= <>
##$TPNAME3= <>
##$TPNAME4= <>
##$TPNAME5= <>
##$TPNAME6= <>
##$TPNAME7= <>
##$TPOAL= (0..7)
0.5 0.5 0.5 0.5 0.5 0.5 0.5 0.5 
##$TPOFFS= (0..7)
0 0 0 0 0 0 0 0 
##$TUNHIN= 0
##$TUNHOUT= 0
##$TUNXOUT= 0
##$USERA1= <user>
##$USERA2= <user>
##$USERA3= <user>
##$USERA4= <user>
##$USERA5= <user>
##$V9= 5
##$VALIST= <valist>
##$VCLIST= <CCCCCCCCCCCCCCC>
##$VD= 0
##$VDLIST= <DDDDDDDDDDDDDDD>
##$VPLIST= <PPPPPPPPPPPPPPP>
##$VTLIST= <TTTTTTTTTTTTTTT>
##$WBST= 1024
##$WBSW= 4
##$XGAIN= (0..3)
0 0 0 0 
##$XL= 0
##$YL= 0
##$YMAX_a= 134936
##$YMIN_a= -153935
##$ZGOPTNS= <>
##$ZL1= 120
##$ZL2= 120
##$ZL3= 120
##$ZL4= 120
##$ABSF1= 10
##$ABSF2= 0
##$ABSG= 5
##$ABSL= 3
##$ALPHA= 0
##$AQORDER= 0
##$ASSFAC= 0
##$ASSFACI= 0
##$ASSFACX= 0
##$ASSWID= 0
##$AUNMP= <proc_1d>
##$AZFE= 0.1
##$AZFW= 0.1
##$BCFW= 1
##$BC_mod= 2
##$BYTORDP= 1
##$COROFFS= 0
##$CY= 11.3945322036743
##$DATMOD= 1
##$DC= 2
##$DFILT= <>
##$DTYPP= 0
##$F1P= 15.6554695791079
##$F2P= 12.8336369535428
##$FCOR= 0.5
##$FTSIZE= 0
##$FT_mod= 4
##$GAMMA= 1
##$GB= 0.15
##$INTBC= 1
##$INTSCL= 1
##$ISEN= 128
##$LB= 0.24
##$LEV0= 0
##$LPBIN= 0
##$MAXI= 10000
##$MC2= 0
##$MEAN= 0
##$ME_mod= 0
##$MI= 1.114404
##$NCOEF= 0
##$NC_proc= 0
##$NLEV= 6
##$NOISF1= 3.799351
##$NOISF2= 2.8
##$NSP= 1
##$NTH_PI= 0
##$NZP= 0
##$OFFSET= 15.70392
##$PC= 1
##$PHC0= -26354.34
##$PHC1= 21.18743
##$PH_mod= 1
##$PKNL= yes
##$PPARMOD= 0
##$PSCAL= 0
##$PSIGN= 0
##$REVERSE= no
##$SF= 200.130013532006
##$SI= 16384
##$SIGF1= 3
##$SIGF2= 2
##$SINO= 400
##$SIOLD= 16384
##$SREGLST= <1H.CDCl3>
##$SSB= 0
##$STSI= 0
##$STSR= 0
##$SW_p= 3612.71676300578
##$SYMM= 0
##$S_DEV= 0
##$TDeff= 0
##$TDoff= 0
##$TI= <>
##$TILT= no
##$TM1= 0
##$TM2= 0
##$TOPLEV= 0
##$USERP1= <user>
##$USERP2= <user>
##$USERP3= <user>
##$USERP4= <user>
##$USERP5= <user>
##$WDW= 1
##$XDIM= 8192
##$YMAX_p= 0
##$YMIN_p= 0
$$ End of Bruker specific parameters
$$ ---------------------------------
##NTUPLES= NMR FID
##VAR_NAME=  TIME,          FID/REAL,        FID/IMAG
##SYMBOL=    X,             R,               I
##VAR_TYPE=  INDEPENDENT,   DEPENDENT,       DEPENDENT
##VAR_FORM=  AFFN,          ASDF,            ASDF
##VAR_DIM=   8192,          8192,            8192
##UNITS=     SECONDS,       ARBITRARY UNITS, ARBITRARY UNITS
##FACTOR=    0.0002076,     1,               1
##FIRST=     0,             0,               0
##LAST=      1.7004516,     0,               0
##MIN=       0,             -153935,         0
##MAX=       1.7004516,     134936,          0
$$ Real data points
##PAGE= N=1
##DATA TABLE= (X++(R..R)), XYDATA
$$ plain form
0 0 0 0 0 0 0 0 0 0 0 8 -8 8 -8 9 -16 16 -24 24 -32 33 -41 48 -56 65 -74 87 -97 112 -128 144 -162 184
32 184 -204 231 -258 287 -321 356 -396 438 -486 538 -595 659 -730 811 -897 998 -1111 1244
50 1244 -1396 1576 -1795 2062 -2399 2844 -3454 4346 -5786 8553 -25344 134936 67938 -139535
64 -139535 9938 87496 -19505 -32446 18092 -5820 11752 3076 -35499 12223 40833 -38970
76 -38970 -29789 39889 14239 -22042 -1707 10645 19473 -6494 -30418 16013 14409 -49464 4340
89 4340 57808 -33289 -47224 56045 27464 -44916 1613 16702 -9416 23637 -6004 -48349
101 -48349 30972 36688 -59613 -14465 59811 -7516 -32783 25956 14156 -9489 4233 -17943
113 -17943 -11406 32786 -9769 -46002 22176 34673 -25989 -18026 17809 12528 1685 -5361 829
$$ packed form
0@%%%%%%%%%Qj6J6j6J7k5L2m0M8n6O5p4Q9j04J21j39J61j84K09k40K72l06L46
32A84l88M35m89N45o08O77p52Q34r24J024j133J254j389J541j708J895k109K355
50A244k640K972l371L857m461N243o298P800j0132J4339l3897J60280o6998k07473
64a39535J49473P7558j07001j2941N0538k3912J7572q676l8575M7722K8610p9803
76c8970R181O9678k5650l6281K0335J2352Q828k5967k3924M6431j604o3873N3804
89D340N3468r1097j3935J03269k8581p2380M6529J5089k6118L3053k9641m2345
101d8349P9321N716r6301M5148P4276o7327k5267N8739j1800k3645J3722k2176
113a7943O537M4192m2555l6233O8178J2497o0662P963L5835n281j0843p046O190
$$ plain form
126 829 11059 -8673 -10906 13870 -9183 -26558 19842 19740 -24105 5077 25169 -16931 -397
139 -397 23217 -23588 -9614 32692 -19816 -30048 35007 3843 -47211 14440 41083 -19027
151 -19027 -18727 22774 11143 -6008 -4328 -10710 -952 9103 -6554 -7223 4888 2244 2178 1237 -2053
166 -2053 7920 2932 -10515 7443 11482 -18053 -10268 14335 -7983 -13721 16406 2797 -14936
179 -14936 16070 13451 -16915 -910 10975 -9251 -1234 7040 -11591 -3856 14402 -3828 -12024
192 -12024 8811 7470 -4045 2559 4025 -1974 -1748 -4289 -3287 178 -3761 -2387 4979 2146 446
207 446 3710 -638 572 5044 -3365 -4887 5430 -1681 -8497 4292 754 -10493 6610 12030
221 12030 -7416 -1398 13176 -405 -7780 1773 -935 -6676 -997 -47 -1978 1661 -415 -659 5730
$$ packed form
126H29J0230j9732k233K4776k3053j7375M6400j02m3845K9182K0092m2100J6534
139c97K3614m6805J3974M2306n2508j0232O5055l1164n1054O1651K6643o0110
151a9027L00M1501j1631j7151J680o382R758J0055j5657o69J2111k644o6r41l290
166b053R973m988j3447J7958M039k9535P785K4603k2318n738L0127j3609j7733
179a4936L1006k619l0366J6005J1885k0226Q017Q274j8631P735J8258j8230q196
192a2024K0835j341j1515O604J466n999K26k541J002L465l939J374P366k833j700
207D46L264m348J210M472q409j522J0317p111o816J2789l538j1247J7103N420
221A2030j9446O018J4574j3581p375R553k708n741N679R50j931L639k076k44O389
$$ plain form
236 5730 2671 -3256 2273 4532 -475 -3686 -4139 -933 112 -6071 -2105 8028 1007 -4433 8519
251 8519 7528 -7681 -1991 6983 -4256 -4978 2500 -4194 -3984 3594 -1872 -3613 6185 3407 -2297
266 -2297 5382 4812 -5153 -1983 2655 -3977 -4376 587 -319 735 1757 284 2078 2074 35 1390 1463
283 1463 -1620 -351 -665 -3702 -1484 861 -3189 -1121 6160 1760 -2231 4236 2696 -3325 -463
298 -463 -747 -3045 41 -62 -3212 702 3377 -1660 -1178 5152 2204 -2877 1594 2140 -2981 -3239 -1414
315 -1414 -932 -1425 -1301 1589 2790 769 1184 1647 1096 -612 -1333 -543 -432 -1811 -2198 -1318 926 222
333 222 -1447 3231 4294 -194 586 2921 -1007 -2799 -1464 -1483 -2789 -1297 848 -127 676 2519 1078
350 1078 707 2844 533 -669 109 -841 -2217 -2673 -1276 -842 -1105 1522 2140 1162 2546 1907 -47
$$ packed form
236E730l059n927N529K259n007l211m53L206J045o183L966J0133p021n440J2952
251H519r91j5209N690Q974j1239p22P478o694K10P578n466j741R798k778n704
266b297P679n70r965L170M638o632l99M963r06J054J022j473J794mk039J355P3
283A463l083J269l14l037K218K345m050K068P281m400l991O467j540o021K862
298d63k84k298L086j03l150L914K675n037M82O330k948n081M471N46n121k58J825
315a414M82m93J24K890J201k021M15M63n51j708p21P90J11j379l87Q80K244p04
333B22j669M678J063m488P80K335l928j792J335j9j306J492K145r75Q03J843j441
350A078l71K137k311j202P78r50j376m56J397M34k63K627O18r78J384o39j954
$$ plain form
367 -47 305 -554 -1361 -1756 -1350 -315 -1858 -1185 1646 581 322 2571 2415 935 211 229 -637 -2755 -1858
386 -1858 -823 -1649 10 998 504 1955 1880 157 1193 804 -259 -1126 -649 -218 -2420 -1957 701 -752
404 -752 -174 2239 1526 1342 1042 256 -8 -1134 -1145 -1068 -2039 -366 217 -470 937 1457 939 1508 916 1048
424 1048 -25 -1177 -645 -2068 -1886 -612 -1176 -268 1516 1365 1143 1917 1187 171 -506 -124 -884 -2174
442 -2174 -962 -1020 -1163 275 -58 729 1685 1184 1312 1416 601 -678 -1743 -1271 -1351 -2123 -1027 390 615
461 615 719 1017 1414 1954 319 197 255 -922 -1283 -1173 -1733 -1134 -695 -577 876 2119 1809 351 1297
480 1297 2129 -488 -1298 -623 -1304 -1287 -746 -1048 319 548 129 973 1695 1190 333 690 474 -1781 -1493
499 -1493 -550 -1444 -829 -130 -60 1927 1434 266 1689 1383 -994 -827 530 -333 -2086 -1440 -278 305
$$ packed form
367d7L52q59q07l95M06J035j543O73K831j065k59K249j56j480p24J8q66k118Q97
386a858J035q26J659R88m94J451p5j723J036l89j063q67M77M31k202M63K658j453
404g52N78K413p13j84l00p86k64j126j1P7r71J673N83o87J407N20n18N69n92J32
424A048j073j152N32j423J82J274n64R08J784j51k22P74p30j016o77L82p60j290
442b174J212n8j43J438l33P87R56n01J28J04q15j279j065M72q0p72J096J417K25
461F15J04K98L97N40j635j22N8j177l61J10n60N99M39J18J453J243l10j458R46
480A297Q32k617q10O75o81J7N41l02J367K29m19Q44P22n05q57L57k16k255K88
499a493R43q94O15O99P0J987m93j168J423l06k377J67J357q63j753O46J162N83
$$ plain form
517 305 -36 -685 914 3537 672 -1004 1426 338 -2221 -1065 -268 -1985 -808 229 -276 1205
533 1205 1805 -676 542 2780 -205 -1814 818 -690 -2181 -699 -910 -998 761 479 1126 2333 703
550 703 -2 2023 901 -2865 -1404 512 -1951 -1288 165 -909 508 1850 -62 511 3168 665
566 665 -1758 1089 217 -3190 -1809 -11 -71 -780 -437 876 2724 1096 -483 1301 1387 -1165 -424
583 -424 -57 -2315 -1973 -368 -423 -237 720 88 942 2813 980 -1213 -152 755 -263 -2316 -2132 571
601 571 618 -1041 666 1148 -156 1130 2202 342 -490 -361 -835 -1298 412 -1312 -2668 598 2623
618 2623 438 326 700 504 1637 156 -1269 -576 -2138 -721 1779 -958 -3948 1106 3897 -518
634 -518 -624 2168 498 116 1456 -2321 -1986 1195 -2055 -2282 2798 1198 -2554 582 3493 1684
$$ packed form
517C05l41o49J599K623k865j676K430j088k559J156P97j717J177J037n05J481
533A205O00k481J218K238k985j609K632j508j491J482k11q8J759k82O47J207j630
550G03p05K025j122l766J461J916k463O63J453j074J417J342j912N73K657k503
566F65k423K847q72l407J381J798o0p09L43J313J848j628j579J784Q6k552P41
583d24L67k258L42J605n5J86R57o32Q54J871j833k193J061R07j018k053J84K703
601E71M7j659J707M82j304J286J072j860q32J29m74m63J710j724j356L266K025
618B623k185j12L74j96J133j481j425O93j562J417K500k737k990N054K791m415
634e18j06K792j670l82J340l777L35L181l250k27N080j600l752L136K911j809
$$ plain form
650 1684 -797 -2207 -100 3540 -963 -6019 81 3412 -2105 -1012 1595 -486 2371 3257 -2170
665 -2170 -691 3084 -1836 -2431 1605 -1180 -2978 1648 267 -1382 2114 1185 -962 2816 1541 -2180
681 -2180 594 -1804 -2789 2689 -370 -6741 624 6781 -949 -2869 1567 1111 2548 2256 -5617 -2154
697 -2154 6062 -2245 -6735 2932 2354 -3422 1074 2562 889 1779 -1783 -2155 5027 1298 -7906 -523
713 -523 4541 -2886 -964 2194 -3913 1299 6981 -2782 -3322 4184 -147 -1790 3018 -4052 -4980 5610
729 5610 1387 -6300 2216 4845 -3346 648 3461 -1666 1140 38 -5176 3075 4224 -7863 -3139
744 -3139 7546 929 -3642 1457 404 1317 4598 -3687 -5441 5741 1478 -7152 887 2985 -3405
759 -3405 1534 2888 -2818 2080 3118 -3177 36 3306 -3367 -2174 2217 -2291 -1519 2994 -2529
$$ packed form
650A684k481j410K107L640m503n056O100L331n517J093K607k081K857Q86n427
665b170J479L775m920n95M036k785j798M626j381j649L496r29k147L778j275l721
681b180K774k398r85N478l059o371P365O157p730j920M436m56J437k92p873L463
697b154Q216q307m490R667n78n776M496J488j673Q90l562l72P182l729r204P383
713e23N064p427J922L158o107N212N682r763n40P506m331j643M808p070r28J0590
729E610m223p687Q516K629q191L994K813n127K806j102n214Q251J149j2087M724
744c139J0685o617m571N099j053R13L281q285j754J1182m263q630Q039K098o390
759c405M939J354n706M898J038o295L213L270o673J193M391m508P72M513n523
$$ plain form
774 -2529 -2075 6237 884 -4389 2035 2007 -1057 1624 -2668 -4853 3900 2568 -5865 -1159 4910 3
790 3 -376 1776 -624 901 2115 -2917 -584 2166 -3381 -2562 3222 34 -1872 2072 -125 44 4181
807 4181 -563 -4238 1625 2438 -2085 -991 -603 -1931 2534 1825 -3641 353 4412 -831 -683 1618
823 1618 -1006 -656 708 -1771 -601 1293 -1773 -999 3453 798 -1415 1718 1102 -981 1429 -719
839 -719 -3304 906 1573 -2209 -977 1085 123 1419 1134 -1354 611 2508 -1116 -1942 776 -938
855 -938 -1270 611 -913 -422 1961 -92 -486 2283 619 -1608 377 745 -1262 -1285 -689 -971 614
872 614 655 -1226 529 2080 420 109 548 -460 -60 302 -959 -1102 -661 -558 622 560 -492 274
890 274 1939 711 -276 792 -374 -1002 -353 -551 -703 -172 -594 181 1836 293 -805 1137 1417 71
$$ packed form
774b529M54Q312n353n273O424k8l064K681m292k185Q753j332q433M706O069m907
790Cl79K152k400J525J214n032K333K750n547Q19N784l188j906L944k197J69M137
807D181m744l675N863Q13m523J094L88j328M465p09n466L994M059n243J48K301
823A618k624L50J364k479J170J894l066P74M452k655k213L133o16k083K410k148
839g19k585M210O67l782J232K062r62J296k85k488J965J897l624q26K718j714
855i38l32J881j524M91K383k053l94K769j664k227J985L68k007k3N96k82J585
872F14M1j881J755J551j660l11M39j008M00L62j261j43M41J03J180o2j052P66
890B74J665j228r87J068j166o28O49j98j52N31m22P75J655j543j098J942K80j346
$$ plain form
908 71 -414 -271 -1057 -444 -151 -1113 -72 503 -376 692 1427 -270 -52 1123 -404 -557 -173 -867 -624
927 -624 247 -534 -635 1139 773 -212 1531 896 -640 219 273 -957 -299 -190 -1562 -106 868 -503
945 -503 360 1513 106 -48 938 -57 -993 -33 -551 -1083 -19 -710 -683 522 789 198 908 1026 10
964 10 -78 127 -614 -749 -199 -942 -189 338 -511 370 1328 259 -12 1175 298 -318 -332 -152 -812 -528 -372
985 -372 -403 73 617 4 717 1173 -100 238 338 -567 -491 -318 -600 -515 -236 2 391 709 749 381 787
1006 787 285 -20 -214 -330 -807 -382 -434 -587 29 -186 135 561 710 497 -66 8 -251 -377 -404 -489 -628
1027 -628 -302 -245 -170 636 450 428 476 226 -14 -22 -362 -428 -868 -673 -18 -434 208 572 118 755 743 365 607
1050 607 -124 -316 -138 -773 -642 -377 122 80 -33 328 629 370 493 107 -334 126 -564 -641 -270 -392 -354
$$ packed form
908G1m85J43p86O13K93r62J041N75q79J068P35j697K18J175j527j53L84o94K43
927f24Q71p81j01J774l66r85J743o35j536Q59N4j230O58J09j372J456R74j371
945e03Q63J153j407j54R86r95r36R60n18n32J064o91K7J205K67n91P10J18j016
964A0q8K05p41j35N50p43P53N27q49Q81R58j069k71J187q77o16j4J80o60K84J56
985c72l1M76N44o13P13M56j273L38J00r05P6J73k82Q5K79K38L89L18M0l68M06
1006G87n02l05j94j16m77M25n2j53O16k15L21M26J49k13n63P4k59j26k7q5j39
1027f28L26N7P5Q06j86k2M8k50k40ql40o6m40J95O55m16O42L64m54O37j2l78K42
1050F07p31j92J78o35J31K65M99m2j13L61L01k59J23l86m41M60o90p7L71j22L8
$$ plain form
1071 -354 52 214 531 342 522 545 165 249 -331 -345 -464 -694 -536 -215 -89 330 599 550 380 289 117 -11
1093 -11 -258 -217 -215 -544 -594 -205 -191 565 285 418 712 702 305 339 -31 -401 -372 -468 -94 164 -268 -9 431
1116 431 490 709 590 409 -121 -228 -199 -409 -827 -622 -361 -93 -194 52 315 633 538 401 -124 -52 122
1137 122 -491 -176 -552 -348 -320 -235 501 -83 36 683 622 179 -246 -299 -389 -394 -310 -469 -131 67 92 53 861
1160 861 381 179 707 371 -56 -369 -252 -482 -538 -418 -223 439 517 434 434 447 -50 -85 60 -459 -581 -341
1182 -341 -214 -484 -58 -246 278 545 282 247 444 463 -376 -37 -182 -461 -670 31 -72 -54 288 176 574
1203 574 862 407 157 283 -137 -401 -668 -661 -376 -5 -223 -192 537 645 119 485 726 -295 -271 30 -551
1224 -551 -580 -278 -43 -333 406 324 224 509 587 252 315 -37 -476 -259 12 -685 -477 -282 -138 454 660
$$ packed form
1071c54M06J62L17j89J80K3l80Q4n80j4j19k30J58L21J26M19K69m9j70r1j72j28
1093a1k47M1Kl29n0L89J4P56k80J33K94j0l97L4l70l70K9r6L74K58m32K59M40
1116D31N9K19j19j81n30j07K9k10m18K05K61K68j01K46K63L18r5j37n25P2J74
1137A22o13L15l76K04K8Q5P36n84J19O47o1m43m25n3r0nQ4j59L38J98K5l9Q08
1160H61m80k02N28l36m27l13J17k30n6J20J95O62P8q3%J3m97l5J45n19j22K40
1182c41J27k70M26j88N24K67k63l5J97J9q39L39j45k79k09P01j03J8L42j12L98
1203E74K88m55k50J26m20k64k67PK85L71k18L1P29J08n26L66K41j021K4L01n81
1224e51k9L02K35k90P39q2j00K85P8l35O3l52m39K17K71o97K08J95J44N92K06
$$ plain form
1245 660 263 232 485 154 -344 183 -259 -939 -149 -13 -498 -253 160 345 460 613 3 -23 344 103 -438
1266 -438 -387 -169 -415 53 48 -268 285 376 736 330 -1 -408 162 194 -385 -881 -465 -269 -100 533 -148 -269
1288 -269 596 981 -111 -480 300 183 -748 11 -307 -699 -101 728 562 344 372 -67 249 545 -242 -502
1308 -502 -560 -337 -99 -365 -808 -353 709 565 204 204 297 -5 1086 -321 -1354 233 287 -831 -703 411
1328 411 43 279 612 144 165 438 -433 -216 646 -1065 -1166 125 311 -125 69 -82 495 1673 318
1347 318 -937 504 861 -854 -333 -242 -1192 -72 1045 -538 -284 1176 163 166 755 -112 -542 205
1365 205 -672 -250 319 -840 -789 1236 1193 -386 183 159 -132 1838 362 -2390 261 1595 -1330 -1195
1383 -1195 813 -169 234 1007 -319 -346 1214 -273 -1069 1203 -116 -1770 106 291 -818 929 -40
$$ packed form
1245F60l97l1K53l31m98N27m42o80P90J36m85K45M13J85J15J53o10k6L67k41n41
1266d38N1K18k46M68nl16N53R1L60m06l31m07N70L2n79m96M16J96J69O33o81j21
1288b69Q65L85j092l69P80j17r31P59l18l92N98Q29j66k18K8m39L16K96p87k60
1308e02n8K23K38k66m43M55J062j44l61%R3l02J091j407j033J587N4j118J28J114
1328D11l68K36L33m68K1K73q71K17Q62j711j01J291J86m36J94j51N77J178j355
1347C18j255J441L57j715N21R1r50J120J117j583K54J460j013LN89q67m30P47
1365B05q77M22N69j159N1K025m3j579N69k4k91J970j476k752K651J334k925J35
1383a195K008r82M03P73j326k7J560j487p96K272j319j654J876J85j109J747r69
$$ plain form
1400 -40 -1001 1511 1210 -1486 208 1112 -481 -336 534 -1830 -535 1753 -1054 -1350 1696 599 -393
1417 -393 916 -181 -703 948 -187 -1595 809 305 -1776 357 1161 -545 -119 1075 42 434
1433 434 1109 -1496 -908 1735 -532 -1695 223 -87 -326 1019 -19 -1106 1285 1127 -602 -59 427
1450 427 -636 48 131 -1293 -99 728 -511 351 1110 -268 -325 779 36 -35 23 -1385 -573 1343 -233
1469 -233 -1736 281 916 31 430 -15 -590 664 739 -858 -638 -146 -689 101 560 -420 299 646 -113
1488 -113 403 644 -689 -593 635 254 -538 -248 -658 56 988 -337 -545 774 836 -27 6 -9 -276 188
1508 188 -20 -1132 -185 301 -377 -89 614 178 282 657 -52 300 43 -616 -381 349 -311 -780 -38 454
1528 454 141 348 38 -392 332 229 -478 -502 -128 -295 30 24 -498 368 527 42 460 249 190 322 383 -225
$$ packed form
1400d0r61K512l01k696J694R04j593J45Q70k364J295K288k807k96L046j097r92
1417c93J309j097n22J651j135j408K404n04k081K133Q04j706M26J194j033L92
1433D34O75k605N88K643k267j163J918l10k39J345j038j087K391j58j729N43M86
1450D27j063O84Q3j424J194Q27j239Q62P59j378n7J104p43p1N8j408Q12J916j576
1469b33j503K017O35q85L99m45n75J254P5j597K20M92n43P90M59r80P19L47p59
1488a13N16K41j333R6J228l81p92K90m10P14R32j325k08J319O2q63L3j5k67M64
1508A88k08j112R47M86o78K88P03m36J04L75p09L52k57o59K35P30o60m69P42M92
1528D54l13K07l10m30P24j03p07k4L74j67L25on22Q66J59m85M18k11n9J32O1o08
$$ plain form
1550 -225 -719 -454 -529 -113 132 -23 -33 568 466 413 341 -278 34 68 -128 -536 -668 -470 -110 469 117 -231
1572 -231 378 342 -52 680 -59 -826 229 -307 -677 -209 90 -259 422 483 56 179 568 -85 59 -168
1592 -168 -469 -203 171 -424 -702 376 38 64 793 310 242 209 199 -175 -171 -441 -709 -67 220 -417 123 595
1614 595 346 219 380 -48 38 110 -335 -235 -196 -113 -250 97 156 -196 295 626 -39 256 175 -427 -357 -18
1636 -18 -540 -431 70 -158 -83 -102 291 146 510 133 -57 -155 -176 -171 -37 -7 -418 -30 164 -116 348 247 -6
1659 -6 435 136 -157 -197 -20 -181 -358 263 -367 -13 492 211 104 521 206 -57 -198 -393 -123 -214 -162 -243
1681 -243 -397 -9 196 -100 300 254 71 285 198 -120 107 -240 -310 -246 -333 -148 60 -88 407 315 168 149
1703 149 155 -53 -227 -339 -137 -179 -227 -179 -59 254 203 413 144 245 187 -188 -161 -239 -293 37 -186 87 -283
$$ packed form
1550b25m94K65p5M16K45j55j0O01j02n3p2o19L12L4j96m08j32J98L60N79l52l48
1572b31O09l6l94P32p39p67J055n36l70M68K99l49O81O1m27J23L89o53J44k27
1592a68l01K66L74n95k78J078l38K6P29m83o8l3j0l74Mk70k68O42K87o37N40M72
1614E95k49j27J61m28Q6P2m45J00L9Q3j37L47N9l52M91L31o65K95q1o02P0L39
1636a8n22J09N01k28P5j9L93j45L64l77j90r8k1NJ34L0m11L88J94k80M64j01k53
1659fM41k99k93m0J77j61j77O21o30L54N05k81j07M17l15k63j41j95K70r1N2q1
1681b43j54L88K05k96M00m6j83K14q7l18K27l47p0O4q7J85K08j48M95r2j47j9
1703A49Ok08j74j12K02m2m8M8J20L13n1K10k69J01n8l75K7p8n4L30k23K73l70
$$ plain form
1726 -283 41 27 372 80 200 216 -230 -85 -38 -445 -109 -130 -394 128 -81 257 414 81 235 -136 77
1747 77 211 -34 65 -30 -184 -113 6 -124 243 332 373 302 370 189 68 3 26 -187 -146 -204 -198 81 356 43 432
1772 432 295 250 13 130 -185 -51 -455 -182 -345 -71 -119 315 125 304 243 123 41 12 -146 -1 11 -221
1794 -221 86 -244 -53 -36 359 54 172 263 496 -208 -233 25 -25 -267 -134 85 -166 242 144 -80 435 302
1816 302 64 254 16 -371 73 -246 -227 -421 -277 114 145 484 234 138 168 -156 16 -140 -147 -283 -420 168
1838 168 -148 50 70 249 297 1 329 96 -24 25 -16 -54 -401 -198 -236 -22 226 283 465 -8 495 164
1860 164 -14 -147 -24 -119 -435 -216 -242 10 406 123 278 192 167 448 338 -236 -124 74 -96 -258 -191 -20
1882 -20 270 396 519 163 474 2 -204 261 -48 -292 -101 -345 -548 -203 -2 -125 176 605 155 211 -105
$$ packed form
1726b83L24j4L45k92J20J6m46J45M7m07L36k1k64N22k09L38J57l33J54l71K13
1747G7J34k45R9r5j54P1J19j30L67Q9M1p1O8j81j21o5K3k13M1n8OK79K75l13L89
1772D32j37m5k37J17l15J34m04K73j63K74m8M34j90J79o1j20q2k9j58J45J2k32
1794b21L07l30J91J7L95l05J18R1K33p04k5K58n0k42J33K19k51M08r8k24N15j33
1816C02k38J90k38l87M44l19J9j94J44L91L1L39k50r6L0l24J72j56pj36j37N88
1838A68l16J98K0J79M8k96L28k33j20M9m1l8l47K03l8K14K48N7J82m73N03l31
1860A64j78j33J23r5l16K19k6K52L96k83J55q6k5K81j10n74J12J98j70j62O7J71
1882b0K90J26J23l56L11m72k06M65l09k44J91k44k03L45K01j23L01M29m50N6l16
$$ plain form
1903 -105 -218 -133 -54 -393 -271 257 5 -165 251 -50 -18 310 364 -201 375 170 -285 -225 -179 -335 -526 69
1925 69 -132 235 38 127 24 276 -28 45 -110 -162 -204 -89 -171 -117 192 58 50 290 260 123 156 318 35 -188
1949 -188 -43 -141 -155 161 -130 144 585 147 -38 99 190 -161 18 48 -412 -245 -432 -155 209 192 201 -71
1971 -71 362 280 73 67 89 -93 -12 -337 -468 63 33 -156 -123 62 152 324 241 -51 -366 80 -81 -294 -208 -247
1995 -247 -339 103 327 67 116 54 442 323 -126 -285 -151 98 -127 -185 130 285 307 495 48 -139 215 385
2017 385 -231 56 -91 -877 -177 441 -29 -250 -62 89 101 482 314 -256 628 454 -77 -356 -681 -279
2037 -279 552 3 -336 201 215 47 247 303 -393 -85 91 -487 -218 273 -137 -382 368 -97 -97 129 119 -374
2059 -374 423 -346 -636 35 326 -544 -153 359 -204 256 491 -304 1 804 -105 -272 274 -469 -476 211 -337
$$ packed form
1903a05j13Q5P9l39J22N28k52j70M16l01L2L28N4n65N76k05m55O0M6j56j91N95
1925F9k01L67j97Q9j03K52l04P3j55n2m2J15q2N4L09j34qK40l0j37L3J62k83k23
1949a88J45r8j4L16k91K74M41m38j85J37R1l51J79L0m60J67j87K77L64j7Rk72
1971g1M33q2k07oK2j82Q1l25j31N31l0j89L3J85R0J72q3k92l15M46j61k13Q6l9
1995b47r2M42K24k60M9o2L88j19m49j59J34K49k25n8L15J55K2J88m47j87L54J70
2017C85o16K87j47p86P00O18m70k21J88J51J2L81j68n70Q84j74n31k79l25M02
2037b79Q31n49l39N37J4j68K00N6o96L08J76n78K69M91m10k45P50m65%K26j0m93
2059c74P97p69k90O71K91q70L91N12n63M60K35p95L05Q03r09j67N46p43pO87n48
$$ plain form
2080 -337 -518 307 -53 -368 581 196 -338 323 546 -369 -162 -108 -589 58 474 -600 -520 669 368 -8
2100 -8 156 -158 61 460 -7 -837 134 28 -647 62 105 -128 216 577 59 52 340 -590 190 337 -361 -435
2122 -435 -243 -303 42 175 -227 -337 603 325 -621 -99 -127 -281 323 103 -743 405 228 102 223 605
2142 605 178 -54 634 116 -337 217 -337 -165 427 13 -460 246 41 228 209 -111 -463 372 272 -664
2162 -664 -56 -114 -174 -304 265 -52 212 495 -180 91 226 12 -176 364 -210 -20 -95 154 -242 348 -302
2183 -302 104 383 305 35 -404 83 -55 123 -151 -527 123 402 -204 73 29 -144 472 207 144 -277 39
2204 39 -404 -301 -263 1 -8 115 52 242 -6 13 -125 365 32 -275 -244 -292 47 21 -15 -147 178 201 -46 -45
2228 -45 184 129 101 263 -266 -108 -201 -79 15 -57 -117 -245 695 242 -136 328 284 -96 -36 -135 -259 146 -123
$$ packed form
2080c37j81Q25l60l15R49l85n34O61K23r15K07N4m81O47M16j074Q0J189l01l76
2100hJ64l14K19L99m67q30R71j06o75P09M3k33L44L61n18pK88r30P80J47o98p4
2122d35J92o0L45J33m02j10R40k78r46N22k8j54O04k20q46J148j77j26J21L82
2142F05m27k32O88n18m53N54n54J72N92m14m73P06k05J87j9l20l52Q35j00r36
2162f64O08n8o0j30N69l17K64K83o75K71J35k14j88N40n74J90p5K49l96N90o50
2183c02M06K79p8k70m39M87j38J78k74l76O50K79o06K77m4j73O16k65o3m21L16
2204C9m43J03L8K64rJ23o3J90k48J9j38M90l33l07L1m8L39k6l6j32L25K3k47J
2228d5K29n5k8J62n29J58r3J22R4p2o0j28R40m53l78M64m4l80O0r9j24M05k69
$$ plain form
2251 -123 78 -19 207 91 122 -43 -1 131 -95 -68 -67 1 -242 -108 77 14 39 139 85 127 212 -50 -46 163 -211
2276 -211 -141 -259 -175 -184 233 98 49 281 12 296 224 -8 -382 -117 -135 -412 -116 -36 -205 216 198 50 197
2299 197 300 294 -145 322 -346 -284 156 -94 -478 -43 -37 -195 353 -60 183 35 -15 -272 129 -144 -216 -14
2321 -14 -14 20 6 151 8 -3 363 64 -11 75 -141 -99 -113 -307 -70 196 -38 35 -92 317 173 247 -33 -146
2345 -146 -160 -79 -238 -83 22 -180 -143 73 36 355 -55 56 -110 -107 285 -145 -83 -32 -30 24 -151 -81 358 186
2369 186 386 106 52 63 -149 12 -368 -253 -10 -331 36 64 291 -72 381 183 -90 309 -3 -179 -112
2390 -112 -179 -247 -181 -255 201 48 195 -84 -32 392 96 -26 25 -88 72 266 4 -301 161 -55 161 130
2412 130 139 205 184 4 -249 1 -334 39 -538 -103 -359 120 304 31 54 371 -53 -279 167 -212 -178 -279
$$ packed form
2251a23K01r7K26j16L1j65M2J32k26K7JO8k43J34J85o3K5J00n4M2Q5k62MK09l74
2276b11P0j18Q4rM17j35m9K32k69K84p2k32l74K65j8k77K96Q0j69M21j8j48J47
2299A97J03om39M67o68O2M40k50l84M35Oj58N48m13K43j48n0k57M01k73p2K02
2321a4%L4j4J45j43j1L66k99p5Q6k16M2j4j94K37K66k34P3j27M09j44P4k80j13
2345a46j4Q1j59J55J05k02L7K16l7L19m10J11j66LL92m30O2N1KN4j75P0M39j72
2369A86K00k80n4J1k12J61l80J15K43l21L67K8K27l63M53j98k73L99l12j76O7
2390a12o7o8O6p4M56j53J47k79N2M24k96j22N1j13J60J94k62l05M62k16K16l1
2412A30RO6k1j80k53K50l35L73n77M35k56M79J84k73K3L17m24k26M46l79L4j01
$$ plain form
2434 -279 100 -164 -125 280 115 112 123 -18 -81 -122 12 -54 -214 -34 -53 5 -87 10 -71 199 -274 9 286 72
2458 72 122 129 -6 7 -185 -146 -119 64 -5 337 94 157 -264 104 166 30 -102 -225 -241 -174 -8 145 -21 -134
2482 -134 242 148 110 -31 247 -125 186 54 -142 -170 100 -296 -175 -56 58 107 243 -135 6 354 68
2503 68 -29 -281 -165 -103 131 67 -119 193 252 357 78 112 26 -314 -121 4 -211 -208 -144 -2 -261 -18 -29 -69
2527 -69 331 19 273 -161 -62 -66 -222 68 139 -179 -151 108 -38 -190 244 67 -74 231 298 -46 68 -14 80
2550 80 -57 126 -69 213 262 -195 121 350 -242 30 165 -52 -171 -65 -330 90 13 315 224 223 -36 -48
2572 -48 155 -124 84 140 -140 -142 -27 189 -52 347 306 387 -40 121 -44 -66 92 -119 -57 -170 184 -169 141
2595 141 -2 -155 136 207 129 -87 -187 -222 -74 -111 -250 -111 337 -453 98 342 304 -1 167 130 160 42
$$ packed form
2434b79L79k64L9M05j65lJ1j41o3m1J34o6j60J80j9N8r2R7q1K70m73K83K77k14
2458G2N0Pj35J3j92L9K7J83o9L42k43O3m21L68O2j36j32j23j6O7J66J53j66j13
2482a34L76r4l8j41K78l72L11j32j96k8K70l96J21J19J14M9J36l78J41L48k86
2503F8r7k52J16O2K34o4j86L12N9J05k79L4q6l40J93J25k15LO4J42k59K43j1m0
2527f9M00l12K54m34R9mj56K90P1l18K8K59j46j52M34j77j41L05O7l44J14q2R4
2550H0j37J83j95K82M9m57L16K29n92K72J35k17j19J06k65M20p7L02r1jk59j2
2572d8K03k79K08N6k80kJ15K16k41L99m1Q1m27J61j65k2J58k11O2j13L54l53L10
2595A41j43j53K91P1p8k16j00l5J48l7j39J39M48p90N51K44l8l05J68l7L0j18
$$ plain form
2617 42 -208 180 86 -121 -301 -35 20 -79 27 -90 129 89 375 -50 -77 66 22 188 296 210 -114 265 244
2640 244 -387 389 -260 -266 316 253 -253 -193 -26 -1 147 -65 359 -23 47 -328 131 -50 -123 136 -67 -34 8
2663 8 7 -44 -232 56 127 31 -99 270 27 261 203 -183 -70 27 -485 -476 411 -31 -18 -151 128 12 268 10
2687 10 -411 35 126 -292 -38 -61 130 -37 401 156 58 136 323 175 -123 -96 -263 89 45 73 174 -72 -355
2710 -355 341 138 -381 82 -1 48 -15 -43 -44 -10 149 -196 107 -36 40 -4 221 -26 -27 134 -11 -377 42 -494
2734 -494 -39 299 135 25 -2 100 6 277 -62 127 -95 -41 -147 -442 -249 -41 -449 180 195 -237 247
2755 247 164 -106 -263 -11 -33 -153 199 -45 -311 260 256 -63 264 64 -140 281 77 -171 230 -181 -342
2776 -342 -66 68 -241 -4 419 191 -12 44 -15 -64 3 0 -33 -73 -27 -51 -271 181 183 -74 116 24 95 -35 -512
$$ packed form
2617D2k50L88r4k07j80K66N5r9J06j17K19m0K86m25k7J43m4J66J08q6l24L79k1
2640B44o31P76o49oN82o3n06O0J67K5J48k12M24l82P0l75M59j81p3K59k03L3M2
2663Hjn1j88K88P1r6j30L69k43K34n8l86J13R7n12RQ87m42J3j33K79j16K56k58
2687A0m21M46R1m18K54k3J91j67M38k45r8P8J87j48k98K7j67L52m4K8J01k46k83
2710c55O96k03n19M63q3M9o3k8jL4J59l45L03j43P6m4K25k47jJ61j45l66M19n36
2734d94M55L38j64j10k7J02r4K71l39J89k22N4j06k95J93K08m08O29J5m32M84
2755B47q3k70j57K52k2j20L52k44k66N71ml19L27k00k04M21k04k48M01m11j61
2776c42K76J34l09K37M23k28k03N6n9m9O7ll3m0M6k4k20M52Kk57J90r2P1j30m77
$$ plain form
2801 -512 87 275 -41 -203 -19 -55 133 154 91 225 317 217 24 -209 65 32 -252 23 -34 -138 186 -45
2823 -45 -78 80 -169 219 -5 111 -36 1 -73 -226 -26 -95 -121 -145 -95 78 -37 -209 -156 469 272 -3 -63
2846 -63 256 -189 -133 -109 125 52 182 38 -8 207 143 -189 -87 25 -217 -7 -110 211 59 11 -51 219 281
2869 281 24 -40 299 -9 -214 -259 -168 -267 34 47 52 375 312 -88 187 -62 -21 -133 -4 -109 -37 -220 -271 185
2893 185 -117 102 76 -84 -50 -191 -49 -115 -279 -1 132 -93 -137 224 -229 126 -17 -166 -33 58 -145 -126
2915 -126 -5 -26 -115 -33 249 -298 139 -59 -94 -17 65 26 242 248 296 -346 154 53 -91 15 -174 -74 172
2938 172 120 225 -49 -18 -82 -50 -98 -191 12 6 -52 -64 274 16 188 295 183 -443 30 160 -208 -84 -159 -123
2962 -123 31 -174 324 91 -49 73 60 6 -289 -34 -49 -287 -336 215 161 -126 -243 -198 10 243 65 65 265
$$ packed form
2801e12N99J88l16j62J84l6J88K1o3J34R2j00j93k33K74l3k84K75n7j04L24k31
2823d5l3J58k49L88k24J16j47L7p4j53K00o9k6k4N0J73j15j72N3O25j97k75o0
2846f3L19m45N6K4K34p3J30j44m6K15o4l32J02J12k42K10j03L21j52m8o2K70O2
2869B81k57o4L39l08k05m5R1r9L01J3NL23o3m00K75k49M1j12J29j05P2j83n1M56
2893A85l02K19k6j60L4j41J42o6j64K78J33k25m4L61m53L55j43j49J33R1k03J9
2915a26J21k1q9Q2K82n47M37j98l5P7Q2l9K16OM8o42N00j01j44J06j89J00K46
2938A72n2J05k74L1o4L2m8r3K03on8j2L38k58J72J07j12o26M73J30l68J24p5L6
2962a23J54k05M98k33j40J22j3n4k95K55j5k38m9N51n4k87j17M5K08K33j78%K00
$$ plain form
2985 265 72 -148 -138 -334 158 -178 201 -238 141 125 -260 -48 240 -51 103 -301 -40 -69 -68 -206 -239 -91
3007 -91 -70 7 125 23 -192 127 49 -108 -178 22 -225 -183 -105 -136 -68 233 214 59 -120 -142 132 -119 -1 -502
3031 -502 245 21 32 -137 -10 227 192 299 67 -4 -277 160 21 -113 -5 -42 -332 -119 -33 -221 218 -155
3053 -155 -174 68 -244 -110 6 -146 158 -156 169 -52 10 173 -24 48 80 22 97 3 -26 -290 -220 -190 -51
3076 -51 85 -105 318 -121 48 133 195 206 185 291 -65 -285 29 -43 10 110 99 181 -287 147 -20 242 -227
3099 -227 -74 196 63 -74 21 85 89 130 -214 -64 309 -239 -79 -122 -28 11 15 146 -73 -246 -45 102 36 306
3123 306 87 -57 331 -13 98 -20 -52 9 -323 272 -217 113 -127 157 403 -171 -155 -183 -115 101 -55 -1
3145 -1 143 -159 0 91 166 95 216 -9 -19 137 -93 -16 -125 -87 8 -151 -157 -432 456 48 -10 -163 134 252
$$ packed form
2985B65j93k20J0j96M92l36L79m39L79j6l85K12K88k91J54m04K61k9Jj38l3J48
3007i1K1P7J18j02k15L19p8j57p0K00k47M2P8l1O8L01j9j55j79k2K74k51J18n01
3031e02P47k24J1j69J27K37l5J07k32p1k73M37j39j34J08l7k90K13Q6j88M39l73
3053a55j9K42l12J34J16j52L04l14L25k21O2J63j97P2L2n8P5r4k9k64P0L0J39
3076e1J36j90M23m39J69Q5O2J1k1J06l56k20L14p2N3J00j1Q2m68M34j67K62m69
3099b27J53K70j33j37R5O4MM1l44J50L73n48J60m3R4L9MJ31k19j73K01J47o6K70
3123C06k19j44L88l44J11j18l2O1l32N95m89L30k40K84K46n74J6k8O8K16j56N4
3145aJ44l02J59R1P5p1J21k25j0J56k30P7j09L8R5j59ok75Q88m08n8j53K97J18
$$ plain form
3169 252 -205 -226 -65 -123 -212 -8 -110 -91 201 165 294 48 -304 -125 -345 24 64 139 -184 -206 -130 -173 -26
3192 -26 -84 -59 63 38 44 -166 -422 46 -113 57 -193 -72 -160 -113 -99 -82 57 75 -60 145 -157 -112 66 34
3216 34 -85 -196 -125 -120 -77 33 16 74 201 -277 79 136 18 422 -170 -82 129 5 189 100 -91 77 -21 -236
3240 -236 2 138 224 244 109 133 -147 35 -65 -58 96 -30 -58 -186 28 -43 -95 -10 -110 -11 70 -58 269 237
3264 237 90 19 -20 16 34 -129 -100 64 298 152 -22 287 -20 -37 140 284 116 14 -230 65 -182 -146
3286 -146 -227 181 97 -187 62 -10 3 221 127 -192 -160 -259 -2 4 -20 234 -228 -140 -13 149 -6 -595 -116 140
3310 140 -87 22 152 -43 -10 -9 -25 17 180 -56 77 31 -9 142 238 124 -34 -41 140 -55 115 -174 -91 -143
3334 -143 -73 241 9 245 107 -51 -4 44 57 -193 21 177 2 -124 -77 -14 -7 71 29 125 -6 -108 -186 -64
$$ packed form
3169B52m57k1J61n8q9K04j02J9K92l6J29k46l52J79k20L69M0P5l23k2P6m3J47
3192b6n8K5J22k5Ok10k56M68j59J70k50J21q8M7J4J7J39J8j35K05l02M5J78l2
3216C4j19j11P1NM3J10j7N8J27m78L56N7j18M04n92Q8K11j24J84q9j91J68r8k15
3240b36K38J36Q6K0j35K4k80J82j00PJ54j26k8j28K14p1n2Q5j00R9Q1j28L27l2
3264B37j47p1l9L6J8j63K9J64K34j46j74L09l07j7J77J44j68j02k44K95k47L6
3286a46q1M08q4k84K49p2J3K18r4l19L2r9K57Ok4K54m62Q8J27J62j55n89M79K56
3310A40k27J09J30j95L3Jj6M2J63k36J33m6m0J51R6j14j58pJ81j95J70k89Q3n2
3334a43P0L14k32K36j38j58M7M8J3k50K14J56j75j26M7O3PP8m2R6j31j02p8J22
$$ plain form
3358 -64 68 321 -20 393 46 198 -42 142 237 -71 168 -248 -82 -68 -69 -278 -57 112 253 -89 109 115
3380 115 159 194 -4 30 -117 259 -368 -266 -2 -220 15 178 -219 113 162 11 -32 278 38 24 -95 -80
3402 -80 328 -342 -43 -63 113 -87 -65 120 167 -110 181 63 -88 -212 274 57 -165 -108 -70 -156 289 106
3424 106 39 -40 216 -112 -138 150 -166 -34 57 320 -85 -70 -256 -177 123 -6 -329 27 125 -122 221 -86
3446 -86 -76 226 -87 -60 163 29 -202 -5 14 -118 30 -265 184 113 80 -81 -222 290 150 146 248 -74 146
3469 146 106 -268 -151 -236 -110 -209 -187 170 135 163 264 78 70 48 442 -26 131 -49 -204 110 -72 -43 24 -90
3493 -90 114 82 138 38 -74 39 -137 -141 8 77 -57 23 -122 -2 196 57 168 194 -4 81 116 -60 69
3516 69 253 -148 36 204 170 -91 -190 147 20 -8 -49 -19 41 102 9 -166 -52 -99 -149 203 167 90 174 -6 183
$$ packed form
3358f4J32K53l41M13l47J52k40J84R5l08K39m16J66J4jk09K21J69J41l42J98O
3380A15M4L5j98L4j47L76o27J02K64k18K35J63l97L32M9j51m3L10k40j4j19J5
3402h0M08o70K99k0J76k00K2J85M7k77K91j18j51j24M86k17k22N7L8q6M45j83
3424A06o7p9K56l28k6K88l16J32R1K63m05J5j86P9L00j29l23L56R8k47L43l07
3446h6J0L02l13K7K23j34k31J97J9j32J48k95M49p1l3j61j41N12j40mJ02l22K20
3469A46m0l74J17q5J26r9K2L57l5K8J01j86qk2L94m68J57j80j55L14j82K9O7j14
3493i0K04l2N6j00j12J13j76mJ49O9j34Q0j45J20J98j39J11K6j98Q5L5j76J29
3516F9J84m01J84J68l4k61r9L37j27k8m1L0O0O1r3j75J14m7n0L52l6p7Q4j80J89
$$ plain form
3541 183 -168 -160 -163 -238 -343 46 -200 25 1 -108 -71 79 9 -102 214 -292 109 86 109 -102 32 222 117
3564 117 26 176 -71 110 -100 -231 241 -20 73 -114 -65 -184 -27 -82 -195 63 74 -38 129 8 138 -71
3586 -71 -25 -460 -71 383 33 118 -389 237 -161 23 18 24 -181 -109 -209 11 246 51 28 -52 -249 -15 119
3609 119 235 54 -240 -184 -304 -142 141 -49 -82 99 -82 306 56 208 -129 59 99 206 19 -228 2
3630 2 -31 317 236 -152 -176 2 -15 181 -41 -203 -270 -92 -46 -142 -213 -54 -168 -17 72 -99 225 30 248 342
3654 342 32 -159 208 -11 -60 87 35 83 -201 166 -47 101 -16 87 -112 -119 90 32 -502 -76 391 31
3676 31 -14 -42 175 166 68 290 -135 7 -302 -113 -112 -73 21 -90 -47 53 -80 351 -7 158 70 -40 227 187
3700 187 148 -25 125 -155 -20 162 146 232 159 60 -205 -73 -7 -151 -98 -126 149 315 20 157 -82 113 265
$$ packed form
3541A83l51Qlp5j05L89k46K25k4j09L7J50p0j11L16n06M01k3K3k11J34J90j05
3564A17r1J50k47J81k10j31M72k61R3j87M9j19J57n5j13K58J1j12J67j21J30k09
3586g1M6m35L89M54l50Q5n07O26l98J84nOk05P2j00K20K35j95k3q0j97K34J34
3609A19J16j81k94N6j20J62K83j90l3J81j81L88k50J52l37J88M0J07j87k47K30
3630Bl3L48q1l88k4J78j7J96k22j62o7J78M6r6p1J59j14J51Q9j71L24j95K18R4
3654C42l10j91L67k19m9J47n2M8k84L67k13J48j17J03j99pK09n8n34M26M67l60
3676C1m5k8K17rr8K22m25J42l09J89JL9R4j11M3J00j33M31l58J65q8j10K67m0
3700A87l9j73J50k80J35J82j6Q6p3r9k65J32O6j44N3k8K75J66k95J37k39J95J52
$$ plain form
3723 265 -119 257 -260 159 180 112 -56 -46 -74 -57 -5 186 91 197 135 -172 -188 -30 -111 -218 161 -113 -67 -48
3747 -48 -35 40 -52 22 -27 8 -36 -86 -93 148 -1 -108 -250 -197 178 242 -223 69 114 -208 54 76 223 129 -250
3772 -250 -22 38 -90 213 -139 -108 246 30 -143 158 214 -216 -280 -18 -164 -76 253 218 15 -11 186 95 -133
3795 -133 153 -119 57 -166 -4 -357 -219 36 -19 -25 282 148 91 -103 15 110 -17 295 238 172 -102 123
3817 123 163 -284 -49 -101 195 -47 129 77 -101 -5 -19 -76 240 -115 -197 195 86 -95 93 -89 -158 60 47
3840 47 29 109 -148 -149 85 -128 57 87 -156 -70 -409 264 42 -44 104 -166 -35 92 -31 -8 213 65 -177
3863 -177 141 -17 -329 -3 -107 67 -46 282 -40 -226 -58 214 -271 -92 298 173 -311 58 64 -29 189
3884 189 -115 90 -157 64 216 89 13 -7 43 150 -18 -89 -377 -226 405 -79 -14 6 -149 128 184 -87
$$ packed form
3723B65l84L76n17M19K1o8j68J0k8J7N2J91r5J06o2l07j6J58q1j07L79k74M6J9
3747d8J3P5r2P4m9L5m4n0pK41j49j07j42N3L75O4m65K92M5l22K62K2J47r4l79
3772b50K28O0j28L03l52L1L54k16j73L01N6m30o4K62j46Q8L29l5k03k6J97r1k28
3795a33K86k72J76k23J62l53J38K55n5oL07j34n7j94J18R5j27L12n7o6k74K25
3817A23M0m47K35n2K96k42J76n2j78R6j4n7L16l55q2L92j09j81J88j82o9K18j3
3840D7j8Q0k57jK34k13J85L0k43Q6l39O73k22q6J48k70J31J27j23K3K21j48k42
3863a77L18j58l12L26j04J74j13L28l22j86J68K72m85J79L90j25m84L69Or3K18
3884A89l04K05k47K21J52j27p6k0N0J07j68p1k88J51O31m84O5K0j55K77N6k71
$$ plain form
3906 -87 33 -119 -58 -107 -45 263 -193 140 -32 -142 -50 71 41 26 -141 96 264 -19 337 111 -120 -215 -139
3929 -139 60 97 149 -176 107 177 -241 52 43 83 99 77 125 -184 -161 47 -93 19 -40 120 19 -137 43 36
3953 36 -354 -4 -23 -246 -141 70 -219 163 213 -237 86 125 -249 -176 182 -128 108 -102 1 146 -226 84
3975 84 -35 39 9 16 122 197 79 -2 -238 90 90 -27 -15 -58 -110 -80 -118 -69 42 124 -85 -79 112 -120 95 116
4001 116 -112 -82 -335 185 -28 -44 128 59 95 11 88 -178 267 32 -29 -131 150 -75 102 -51 58 303
4023 303 103 -122 -310 0 -78 -152 120 229 -151 138 82 -89 25 -122 353 152 -199 -246 185 38 299
4044 299 -83 -45 170 -167 169 388 175 -29 109 186 275 69 182 56 -168 -158 59 -84 39 -82 -79 -118
4066 -118 -76 -11 -19 66 -199 91 -111 85 -84 -108 -282 101 68 72 -48 -214 120 -131 -19 -231 -16 -213 -7
$$ packed form
3906h7J20j52O1m9O2L08m56L33j72j10R2J21l0j5j67K37J68k83L56k26k31r5P6
3929a39J99L7N2l25K83P0m18K93rM0J6k2M8l09K3K08j40J12n9J60j01j56J80p
3953C6l90L50j9k23J05K11k89L82N0m50L23L9l74P3L58l10K36k10J03J45l72L10
3975H4j19P4l0PJ06P5j18q1k36L28%j17J2m3n2L0l8M9J11Q2k09OJ91k32K15K1
4001A16k28L0k53N20k13j6J72o9L6q4P7k66M45k35o1j02K81k25J77j53J09K45
4023C03k00k25j88L10p8p4K72J09l80K89n6j71J14j47M75k01l51m7M31j47K61
4044B99l82L8K15l37L36K19k13k04J38P7Q9k06J13j26k24J0K17j43J23j21Ll9
4066a18M2O5qQ5k65K90k02J96j69k4j74L83l3Mj20j66L34k51J12k12K15j97K06
$$ plain form
4089 -7 131 -109 80 -21 -167 250 -114 -35 -62 -113 18 -337 -311 -47 -11 50 -260 -98 86 271 209 161 -290
4112 -290 -84 87 -51 401 -142 263 9 -127 -24 108 -70 -96 47 102 157 -78 -8 76 -21 21 -50 -271 -43
4135 -43 150 -147 66 65 49 -223 -103 -122 71 54 438 82 -235 95 -155 -8 181 -180 307 45 1 44 172
4158 172 -162 182 -375 -56 73 147 -102 -64 -82 -134 89 -90 110 -286 -73 -211 53 82 310 287 289 -239 -56
4181 -56 -77 -119 -206 86 59 -118 78 -104 -62 189 90 -140 408 -139 -132 -114 -165 83 -50 290 -9 -9 -147 112
4205 112 -81 497 173 67 88 -168 -348 -114 73 66 -108 -8 -22 54 252 36 139 86 -166 329 100 121
4227 121 183 59 -108 -31 70 -153 112 -88 -263 -255 90 -89 -103 9 -106 -68 -41 -17 -29 -167 56 -112 105
4250 105 125 -9 22 57 -188 -87 222 3 -62 -165 -182 63 172 128 14 99 420 -15 299 -209 -301 -330 8
$$ packed form
4089gJ38k40J89j01j46M17l64P9k7n1J31l55K6K64L6O1l10J62J84J85o2m8m51
4112b90K06J71j38M52n43M05k54j36J03J32j78k6J43N5N5k35P0Q4r7M2p1k21K28
4135d3J93k97K13jj6k72J20j9J93j7L84l56l17L30k50J47J89l61M87k62m4M3J28
4158A72l34L44n57L19J29P4k49L8j8n2K23j79K00l96K13j38K64K9K28k3Kn28J83
4181e6k1m2q7K92k7j77J96j82M2K51r9k30N48n47PJ8n1K48j33L40k99%j38K59
4205A12j93N78l24j06K1k56j80K34J87pj74J00j4P6J98k16J03n3k52M95k29K1
4227A21O2j24j67P7J01k23K65k00j75QL45j79j4J12j15L8K7K4j2j38K23j68K17
4250A05K0j34L1L5k45J01L09k19o5j03j7K45J09m4j14Q5L21m35L14n08r2k9L38
$$ plain form
4273 8 -1 56 -35 -223 11 -140 -144 -30 33 -12 -106 -45 75 -446 -306 84 285 -62 -41 -237 -229 93 -55 -237 104
4298 104 -4 30 -91 53 396 120 -149 -143 389 -110 117 -48 246 -146 -60 -115 126 1 302 167 109 -75
4320 -75 207 305 390 218 -202 236 -15 102 -307 -89 -84 -169 -70 -55 203 -158 146 -122 -95 -197 173 175 -130 -113
4344 -113 41 135 181 -1 243 -28 -84 -143 -95 -87 -5 -130 -235 -25 -204 133 145 151 -43 280 -107 96 -87 -401
4368 -401 183 142 -1 59 -166 70 140 -153 -104 -285 92 121 117 97 11 -44 -95 -51 -101 -24 -91 152 -83 34 284
4393 284 113 -116 -169 -116 162 -170 179 334 -381 -377 -6 -138 -84 -106 187 78 -10 -51 -32 100 -399 -78 50
4416 50 -227 -313 44 101 58 -171 18 -103 19 140 -7 77 -122 -79 -43 306 -205 -61 -16 -51 90 -18 9
4439 9 20 129 -33 -192 -209 -66 -169 186 -192 -81 -87 -19 10 -252 100 258 288 -124 81 -143 292 122 -126
$$ packed form
4273HrN7r1j88K34j51mJ14O3m5r4O1J20n21J40L90K01l47K1j96QL22j48j82L41
4298A04j08L4j21J44L43k76k69ON32m99K27j65K94l92Q6n5K41j25L01j35n8j84
4320g5K82R8Q5j72m20M38k51J17m09K18Nq5R9J5K58l61L04k68K7j02L70Kl05J7
4344a13J54R4M6j82K44k71n6n9M8QQ2j25j05K10j79L37J2Oj94L23l87K03j83l14
4368d01N84m1j43O0k25K36P0k93M9j81L77K9mk0q6n5n1M4n0P7o7K43k35J17K50
4393B84j71k29n3N3K78l32L49J55p15ML71j32N4k2K93j09q8m1J9J32m99L21J28
4416E0k77q6L57N7m3k29J89j21J22J21j47Q4j99M3L6L49n11J44M5l5J41j08K7
4439IJ1J09j62j59j7J43j03L55l78J11oO8K9k62L52J58L0m12K05k24M35j70k48
$$ plain form
4462 -126 -39 -80 102 18 -151 203 -249 -435 -201 -19 21 251 -100 -254 227 -9 206 28 59 102 18 8 15
4485 15 115 100 -203 -19 -207 136 220 218 -4 -10 -165 -208 -101 -307 -111 197 -28 3 158 -26 -2 -51 -58 349
4509 349 100 18 221 175 121 -12 -140 -20 -201 -123 250 115 106 52 208 154 40 115 -199 116 -218 -122 297
4532 297 -84 -83 7 -181 -161 186 -18 -348 294 -79 215 -170 -62 -197 -204 -103 97 90 -57 198 -127 -114 -342
4555 -342 36 55 -114 20 167 183 -14 98 100 -151 166 -187 -49 121 -188 -66 -112 39 118 -283 -21 202
4577 202 -138 -152 -24 -14 179 14 -231 86 137 -38 95 40 68 185 185 -141 -63 -56 1 415 -219 -108 21 -47
4601 -47 -164 -84 -114 -70 -14 113 29 -223 156 -52 -225 72 61 -86 -109 -136 14 278 392 103 59 109 57 112
4625 112 59 -52 -220 234 349 -1 -13 16 170 8 84 -142 76 154 147 197 74 -436 17 -20 88 178 -128
$$ packed form
4462a26Q7m1J82q4j69L54m52j86K34J82M0K30l51j54M81k36K15j78L1M3q4j0P
4485A5J00j5l03J84j88L43Q4kk22oj55m3J07k06J96L08k25L1J55j84K4m9pM07
4509C49k49q2K03m6n4j33j28J20j81P8L73j35rn4J56n4j14P5l14L15l34R6M19
4532B97l81JR0j88K0L47k04l30O42l73K94l85J08j35pJ01K00pj47K55l25J3k28
4555c42L78J9j69J34J47J6j97J12Kk51L17l53J38J70l09J22m6J51P9m01K62K23
4577B02l40j4J28J0J93j65k45L17N1j75J33n5K8J17%l26P8PN7M14o34J11J29o8
4601d7j17Q0l0M4N6J27q4k52L79k08j73K97j1j47k3k7J50K64J14k89m4N0n2N5
4625A12n3j11j68M54J15l50j2K9J54j62P6k26K18P8pN0j23n10M53l7J08R0l06
$$ plain form
4648 -128 74 -163 238 162 -150 141 -261 -49 88 54 -230 238 -185 -122 -44 -118 57 16 -344 142 -125 59
4670 59 -324 -207 2 -152 277 -212 127 33 279 195 -59 144 175 40 447 -120 -39 -19 55 96 104 -81 45
4693 45 122 72 -8 -204 173 124 -92 -27 134 249 185 122 218 219 -337 -135 44 -210 31 -97 -167 -176 -119 -12 -197
4718 -197 -44 -25 34 -225 -153 -199 -120 80 -55 107 -146 -184 12 78 -57 79 106 -156 -72 228 135 -93 -259
4741 -259 -8 -46 -37 107 66 -26 193 367 175 322 131 177 6 -145 -119 23 172 -337 45 31 -7 229 122
4764 122 -95 -55 136 -69 -158 20 -123 210 -23 194 232 104 -209 -7 307 17 -32 11 -12 189 -161 -105
4786 -105 -282 -64 88 -105 -50 75 85 -90 257 55 -178 209 18 256 -100 -56 107 86 -46 339 -59
4807 -59 -73 -180 -285 54 -51 46 -88 -40 158 -54 228 268 10 26 -72 102 146 74 18 -156 135 56 -54 115
$$ packed form
4648a28K02k37M01p6l12K91m02K12J37l4k84M68m23O3P8p4J75m1l60M86k67J84
4670E9l83J17K09j54M29m89L39r4K46q4k54K03L1j35M07n67Q1K0P4M1Qj85J26
4693D5P7n0q0j96L77m9k16O5J61J15o4o3R6Jn56K02J79k54K41j28p0rN7J07j85
4718a97J53J9N9k59P2m6P9K00j35J62k53l8J96O6j35J36K7k62Q4L00r3k28j66
4741b59K51l8RJ44m1r2K19J74j92J47j91M6j71j51K6J42J49n09L82j4l8K36j07
4764A22k17M0J91k05q9J78j43L33k33K17L8j28l13K02L14k90m9M3k3K01l50N6
4786a05j77K18J52j93N5J25J0j75L47k02k33L87j91K38l56M4J63k1j32L85l98
4807e9j4j07j05L39j05R7j34M8J98k12K82M0k58J6r8J74M4p2n6j74K91p9j10J69
$$ plain form
4831 115 -104 72 -93 -219 21 237 132 219 122 52 -142 -106 46 127 -101 -112 -75 -70 -200 137 75 -386 25
4854 25 -5 -90 45 61 288 -1 104 -24 72 78 252 47 -315 -313 -47 341 -289 -197 -195 -77 331 199 52 80
4878 80 108 37 240 83 -142 13 -53 185 79 1 66 73 -216 -58 -248 65 -180 69 5 -45 -26 -156 -244 35
4902 35 144 30 114 315 178 99 192 -216 242 -191 29 64 -127 -33 66 69 51 67 106 -56 -42 27 198 90 -63
4927 -63 -36 86 -414 87 -10 85 -186 255 389 -249 150 22 127 348 -176 -123 -38 -277 72 281 64 14
4949 14 -4 -85 -62 64 -96 0 -15 103 74 98 256 49 -132 36 52 -9 58 8 -173 -1 132 -240 -114 182
4973 182 -56 -35 193 255 63 -103 -24 -99 70 233 -121 -83 -95 -9 66 -90 163 -278 -134 475 -19 -177 -58
4996 -58 156 85 -115 -182 46 174 -54 207 65 -155 50 -183 104 68 -7 45 54 49 34 10 27 58 -51 42 -97
$$ packed form
4831A15k19J76j65j26K40K16j05Q7r7p0j94L6J52Q1k28j1L7Nj30L37o2m61M11
4854B5l0q5J35J6K27k89J05j28R6OJ74k05l62KK66L88o30R2KJ18M08j32j47K8
4878H0K8p1K03j57k25J55o6K38j06p8O5Pk89J58j90L13k45K49o4n0J9j30q8K79
4902C5J09j14Q4K01j37p9R3m08M58m33K20L5j91R4R9Lj8J6L9j62J4O9J71j08j53
4927f3K7J22n00N01r7R5k71M41J34o38L99j28J05K21n24N3Q5k39L49K09k17n0
4949A4j8q1K3J26j60R6j5J18k9K4J58k07j81J68J6o1O7n0j81J72J33l72J26K96
4973A82k38K1K28O2j92j66P9p5J69J63l54L8j2Q6P5j56K53m41J44O09m94j58J19
4996e8K14p1k00o7K28J28k28K61j42k20K05k33K87l6p5N2Rnj5k4J7L1j09R3j39
$$ plain form
5021 -97 -30 357 39 -77 -128 -13 -143 42 253 11 83 -165 52 -17 -390 180 -242 -113 -161 190 26 -174
5043 -174 -273 -15 -84 130 37 35 -42 -76 24 66 94 -203 -98 -138 194 189 -196 -374 84 72 161 -57 -121 -315 193
5068 193 -115 -147 6 4 344 17 -197 -7 -47 -2 -52 -7 144 -128 36 167 146 -122 -87 -219 406 -98 263
5091 263 62 -6 61 -103 171 -105 375 -181 -25 179 -40 15 189 -170 88 93 16 255 66 -15 374 -37
5113 -37 -139 -62 33 -199 67 -27 464 49 -100 -115 266 -360 -152 -269 -55 51 -128 -103 31 39 -200 -76 -108
5136 -108 156 -74 -223 -207 -42 14 -38 5 -62 -21 377 -124 93 -160 -231 -216 91 -168 125 19 -123 -260 97
5159 97 40 44 -8 -50 56 -37 221 -431 92 80 -41 105 -46 169 21 255 -15 39 -71 105 -54 -46 7 218
5183 218 -262 -131 29 276 -125 -4 -34 5 -12 -155 31 -121 163 -35 -209 -37 -371 184 -80 -237 209
$$ packed form
5021i7O7L87l18j16n1J15j30J85K11k42P2k48K17o9l73N70m22J29m8L51j64k00
5043a74r9K58o9K14r3kp7l4J00M2K8k97J05m0L32nl85j78M58j2Q9k18o4j94N08
5068A93l08l2J53kL40l27k14J90m0M5n0M5J51k72J64J31k1k68L5j32O25n04L61
5091B63k01o8O7j64K74k76M80n56J56K04k19N5J74l59K58Np7K39j89q1L89m11
5113c7j02P7R5k32K66r4M91m15j49j5L81o26K08j17K14J06j79K5J34Qk39J24l2
5136a08K64k30j49J6J65N6n2M3o7M1L98n01K17k53p1J5L07k59K93j06j42j37L57
5159I7n7Mn2m2J06r3K58o52N23j2j21J46j51K15j48K34k70N4j10J76j59QN3K11
5183B18m80J31J60K47m01J21l0L9j7j43J86j52K84j98j74J72l34N55k64j57M46
$$ plain form
5204 209 -92 -8 214 247 40 -149 -27 -21 -384 157 -49 380 24 12 -118 -98 -49 172 22 -94 -268 -221 -108
5227 -108 -54 3 -90 78 236 51 99 145 -43 75 -217 195 -9 126 417 127 140 0 -183 -247 -147 -45
5249 -45 -304 -86 45 -22 117 -147 108 226 -179 -131 152 -153 81 -106 47 106 69 32 93 52 15 -103 -365
5272 -365 -129 114 204 -18 -32 202 -58 -109 45 -48 -78 -60 185 102 -62 124 -26 199 -269 -46 129 -204
5294 -204 167 39 -197 -28 150 94 100 122 104 132 -220 13 19 -97 56 8 -70 -12 68 130 -21 -39 -35 66 48 -158
5320 -158 63 -330 -142 57 -110 100 197 -286 20 -274 107 112 -11 -32 150 -63 -45 -240 -288 181 -213 -298
5342 -298 74 -89 -7 143 -19 8 -124 -91 36 -28 -30 -170 181 -122 -56 -149 60 -206 99 44 -35 48 -72 102
5366 102 -82 -69 66 95 146 -37 130 131 101 -147 144 157 217 76 63 -23 78 -25 -37 198 -61 -122 68 335
$$ packed form
5204B09l01Q4K22L3k07j89J22Ol63N41k06M29l56j2j30K0M9K21j50j16j74M7J13
5227a08N4N7r3J68J58j85M8M6j88J18k92M12k04J35K91k90J3j40j83o4J00J02
5249d5k59K18J31o7J39k64K55J18m05M8K83l05K34j87J53N9l7l7O1m1l7j18k62
5272c65K36K43R0k22j4K34k60n1J54r3l0J8K45q3j64J86j50K25m68K23J75l33
5294b04L71j28k36J69J78n6OK2j8K8l52K33Oj16J53m8p8N8Q0O2j51j8MJ01j8k06
5320a58K21l93J88J99j67K10R7m83L06k94L81Nj23k1J82k13J8j95m8M69l94q5
5342b98L72j63Q2J50j62K7j32L3J27o4kj40L51l03O6r3K09k66L05n5p9Q3j20J74
5366A02j84J3J35K9N1j83J67Jl0k48K91J3O0j41j3q6J01j03j2K35k59o1J90K67
$$ plain form
5390 335 280 -60 32 195 -44 221 144 -4 -19 72 -109 34 -79 -89 77 6 14 -244 -206 -71 55 -255 -80
5413 -80 106 145 -69 -138 184 -114 -131 -137 192 46 -79 -24 -140 -89 46 289 90 -278 -33 260 245 -240 92
5436 92 26 -24 -52 -187 285 -167 163 -137 57 95 26 -149 -5 248 36 -46 91 -162 -122 84 -278 -45 78
5459 78 286 17 104 286 55 183 304 91 100 -47 -129 120 -129 365 -81 120 30 86 -7 -114 -16 10 58 -84
5483 -84 -337 -7 -29 25 50 69 227 60 35 119 -347 9 -124 -127 -324 -192 65 -124 12 35 -88 -307 -104
5506 -104 100 45 -92 -225 -67 4 -22 47 155 113 -18 127 205 279 364 237 -129 -7 90 -134 102 -147 59
5529 59 -52 53 -108 63 99 -65 -121 23 -101 51 125 -126 196 92 86 75 161 -106 -89 91 208 -94 -119
5552 -119 108 24 48 -166 132 -44 26 -5 -125 -11 131 -205 85 -77 130 -148 -15 164 -58 186 -11
$$ packed form
5390C35n5l40R2J63k39K65p7j48j5R1j81J43j13j0J66p1Qk58L8J35J26l10J75
5413h0J86L9k14o9L22k98j7oL29j46j25N5j16N1J35K43j99l68K45K93j5m85L32
5436I2o6n0k8j35M72m52L30l00J94L8o9j75J44K53k12q2J37k53M0K06l62K33J23
5459G8K08k69Q7J82k31J28J21k13Rj47q2K49k49M94m46K01r0N6r3j07R8K6M8j42
5483h4k53L30k2N4K5J9J58j67k5Q4m66L56j33lj97J32K57j89J36K3j23k19K03
5506a04K04n5j37j33J58P1k6O9J08m2j31J45P8P4Q5j27l66J22R7k24K36k49K06
5529E9j11J05j61J71L6j64n6J44j24J52P4k51L22j04oj1Q6k67J7J80J17l02k5
5552a19K27q4K4k14K98j76P0l1j20J14J42l36K90j62K07k78J33J79k22K44j97
$$ plain form
5573 -11 -221 40 109 -125 -105 -283 -53 -96 -116 -263 -5 154 116 -111 237 51 -149 -279 92 47 179 -86
5595 -86 39 59 72 164 -29 -336 -16 -18 -58 -148 86 -57 -311 -140 153 -10 245 12 83 39 -295 -40 -27 -64
5619 -64 49 55 -229 52 86 -180 123 -19 72 274 151 45 153 1 159 178 -64 -230 151 -167 -41 -84
5641 -84 128 -129 34 155 192 189 168 3 -157 139 9 85 -273 63 257 90 -191 -22 73 28 9 -118 -43
5664 -43 97 -142 76 235 175 53 80 164 150 3 144 7 37 148 76 20 21 -23 307 -186 -81 112 277 -93
5688 -93 -81 -19 66 -241 268 -341 145 -47 -61 -70 -13 1 -10 -46 -86 89 -179 158 439 109 65 -236 -126 73
5712 73 -87 299 -46 -179 252 258 -23 57 50 -92 3 -1 25 -216 444 20 -89 280 -232 -256 107 23 -472 -68
5736 -68 -121 237 164 -66 249 -3 171 -15 102 131 0 157 -238 -262 55 -108 -143 -113 -35 -196 121 70 110
$$ packed form
5573a1k10K61O9k34K0j78K30m3k0j47K58J59l8k27L48j86k00j30L71m5J32k65
5595h6J25K0J3R2j93l07L20km0r0K34j43k54J71K93j63K55k33P1m4l34K55J3l7
5619f4J13Ok84K81L4k66L03j42R1K02j23j06J08j52J58J9k42j66L81l18J26m3
5641h4K12k57J63J21L7lk1j65j60K96j30P6l58L36J94j67k81J69R5m5j9j27P5
5664d3J40k39K18J59o0j22K7Q4j4j47J41j37L0J11p2n6Jm4L30m93J05J93J65l70
5688i3J2O2Q5l07N09o09M86j92j4rN7J4j1l6m0J75k68L37K81l30m4l01J10J99
5712G3j60L86l45j33M31Ok81Q0pj42R5mK6k41O60m24j09L69n12k4L63q4m95M04
5736f8n3L58p3k30L15k52J74j86J17K9j31J57l95k4L17j63l5L0P8j61L17n1M0
$$ plain form
5759 110 347 75 -14 103 -120 -124 4 -207 54 -201 -148 90 181 243 -16 -272 249 38 -21 -46 30 98 179 -180
5783 -180 -138 229 -37 -74 -280 104 130 328 -184 -14 121 -272 19 20 -41 -11 198 180 -158 242 397 -16 103
5806 103 23 290 -144 7 -149 -82 270 127 226 -71 -157 60 75 9 44 -111 198 6 274 -212 -133 286 -40
5829 -40 -38 -34 70 89 232 166 -103 -55 -158 -138 -49 134 -293 138 142 -97 223 93 -139 104 158 -252 21 -96
5853 -96 67 -39 255 11 91 48 -198 74 314 -140 -50 -95 -180 73 -311 -8 233 -79 12 82 167 -101 -11
5876 -11 -214 45 17 154 217 -22 160 -203 -332 -107 -52 215 502 -252 -46 -114 -267 113 8 -148 104 37
5898 37 64 150 -126 -37 -231 63 51 -74 -62 -26 6 196 -282 97 -84 72 34 -121 -123 -148 131 168 13 -83 -112
5923 -112 -172 159 -63 -77 37 -129 79 414 -155 -103 -151 -99 -218 231 -295 -163 52 -20 -158 415 -36 -33 -198
$$ packed form
5759A10K37k72q9J17k23mJ28k11K61k55N3K38R1O2k59k56N21k11n9k5P6O8Q1l59
5783a80M2L67k66l7k06L84K6J98n12J70J35l93K91Jo1L0K09j8l38M00J55m13J19
5806A03q0K67m34J51j56O7L52j43R9k97q6K17J5o6L5j55L09j92K68m86P9M19l26
5829d0KMJ04J9J43o6k69M8j03K0Q9J83m27M31Mk39L20j30k32K43N4m10K73j17
5853i6J63j06K94k44Q0m3k46K72K40m54R0m5q5K53l84L03K41l12R1P0Q5k68R0
5876a1k03K59k8J37O3k39J82l63j29K25N5K67K87p54K06o8j53L80j05j56K52o7
5898C7K7Q6k76Q9j94K94j2j25J2L6L2J90m78L79j81J56l8j55kk5K79L7j55r6k9
5923a12o0L31k22j4J14j66K08L35n69N2m8N2j19M49n26J32K15p2j38N73m51Lj65
$$ plain form
5946 -198 130 201 -89 -166 -170 46 -136 -87 20 126 212 -131 228 109 -27 -15 92 -7 -88 55 86 50 -135 3
5970 3 -66 77 -124 -77 -135 106 149 191 138 -181 -178 -61 2 -115 -370 25 -131 278 19 104 120 32 -90 -240 228
5995 228 109 306 29 -95 13 123 209 125 -131 108 122 197 86 -98 -264 102 21 -99 -69 -86 4 410 -202
6018 -202 -4 -184 66 -87 -129 108 392 -74 -125 -32 140 -51 -123 -94 271 -238 -318 174 -31 -6 -128 10
6040 10 14 250 -137 42 98 -181 -131 120 115 24 -29 -81 -136 -212 193 -145 -111 200 -195 120 -28 -41 -166 -311 206
6065 206 27 -22 251 353 -64 146 84 23 59 -44 153 -74 -18 8 -92 -286 35 190 228 237 82 221 -79
6088 -79 79 -119 -346 190 -89 57 55 98 153 -53 -27 14 51 138 -344 -115 -194 -165 -47 -20 -93 -90 -272 -183 -117 290
6114 290 153 202 63 44 -226 4 28 84 56 -206 34 -131 69 -114 -246 195 74 -208 -10 61 202 -1
$$ packed form
5946a98L28P1k90p7mK16j82M9J07J06Q6l43L59j19j36J2J07r9q1J43L1l6j85J38
5970Co9J43k01M7n8K41M3M2n3l19LJ17O3j17k55L95j56M09k59Q5J6q8j22j50M68
5995B28j19J97k77j24J08J10Q6q4k56K39J4P5j11j84j66L66q1j20L0j7R0M06o12
6018b02J98j80K50j53m2K37K84m66n1R3J72j91p2K9L65n09q0M92k05K5j22J38
6040A0MK36l87J79N6k79N0K51nr1n3n2n5p6M05l38L4L11l95L15j48j3j25j45N17
6065B06j79m9K73J02m17K10o2o1L6j03J97k27N6K6j00j94L21J55L8Rj55J39l00
6088g9J58j98k27N36k79J46kM3N5k06K6M1L7Q7m82K29p9K9J18K7p3Lj82Q9O6M07
6114B90j37M9j39j9k70K30K4N6k8k62K40j65K00j83j32M41j21k82J98P1J41k03
$$ plain form
6136 -1 46 37 111 176 18 -174 -180 10 -149 -179 -353 129 -57 128 -207 29 -28 36 129 -22 81 66 96 -137 30
6161 30 -30 -124 -62 -71 64 -225 11 -45 253 -191 214 33 186 -385 22 37 113 247 68 283 108 162 -155
6184 -155 4 305 -146 96 266 -233 -100 -245 -32 -187 132 121 -286 -40 222 -86 232 235 -33 69 208
6205 208 -75 261 72 227 120 -9 -313 67 -234 -139 -289 20 147 133 12 -200 -86 164 408 -206 -133
6226 -133 -21 -256 19 -173 -184 -107 183 -53 5 -143 -335 -70 136 -76 -554 -116 365 -62 31 420 -14
6247 -14 -68 -74 261 74 -69 140 -110 95 40 -150 -345 16 123 -105 271 172 98 106 174 -277 -12 225 25
6270 25 -11 -135 -11 19 50 39 -85 -216 -99 55 -24 -263 65 108 -105 339 61 -25 -91 70 6 145 123 35
6294 35 -68 -23 -72 301 134 -518 -147 290 -391 -154 -127 191 34 197 -141 -129 39 -153 -21 -380 79 85
$$ packed form
6136aM7rP4O5j58j92oJ90j59l0j74M82j86J85l35K36n7O4R3j51J03j5L0k33J67
6161C0o0r4O2rJ35k89K36n6K98m44M05j81J53n71M07J5P6J34j79K15j75N4l17
6184a55J59L01m51K42J70m99J33j45K13j55L19j1m07K46K62l08L18Lk68J02J39
6205B08k83L36j89J55j07j29l04L80l01R5j50L09J27j4j21k12J14K50K44o14P3
6226a33J12k35K75j92j1P7K90k36N8j48j92K65K06k12m78M38M81m27R3L89m34
6247a4n4oL35j87j43K09k50K05n5j90j95L61J07k28L76r9p4QO8m51K65K37k00
6270B5l6j24J24L0L1j1j24j31J17J54p9k39L28M3k13M44k78q6o6J61o4J39k2q8
6294C5j03M5m9L73j67o52L71M37o81K37K7L18j57J63l38J2J68j92J32l59M59O
$$ plain form
6316 85 -9 6 151 81 -85 -198 82 18 -138 -68 -200 174 240 -9 121 271 112 170 -2 -271 -370 -292 -444
6339 -444 -64 11 91 -103 -87 -313 124 -40 -136 -150 8 49 1 -79 38 16 34 171 116 13 125 136 98 -62
6363 -62 -90 -99 -3 -124 -23 115 118 -51 -65 -56 -42 277 1 -30 -177 127 2 106 284 -3 -53 -166 108 -58
6387 -58 -286 -5 -20 125 -54 93 168 -40 56 86 131 332 -231 -166 74 -189 -209 111 -96 16 -267 -144 -155
6410 -155 -128 46 -17 -124 278 77 316 402 55 -344 -93 -45 127 -82 -103 -140 -97 133 204 -119 27 23 52 156
6434 156 -37 -243 -41 -30 69 379 127 206 -5 -112 434 -204 -120 206 20 -136 -79 -145 -97 -229 28 -63 114
6457 114 -68 67 -47 -42 223 301 -100 -185 -196 116 154 231 234 -75 57 -242 179 170 -253 117 91 71 94 222 414
6482 414 74 36 1 -48 -50 -23 13 -67 -195 193 -19 504 49 112 133 -3 52 -58 49 212 209 55 80 -32 91
$$ packed form
6316H5r4J5J45p0j66j13K80o4j56P0j32L74O6k49J30J50j59N8j72k69r9P8j52
6339d44L80P5Q0j94J6k26M37j64r6j4J58M1m8q0J17k2J8J37n5j03J12J1l8j60
6363f2k8rR6j21J01J38Lj69j4RJ4L19k76l1j47L04j25J04J78k87n0j13K74j66
6387e8k28K81j5J45j79J47P5k08R6L0M5K01n63O5K40k63k0L20k07J12k83J23j1
6410a55K7J74o3j07M02k01K39Q6l47l99K51M8J72k09k1l7M3K30P1l23J46mK9J04
6434A56j93k06K02J1R9L10k52P9k11j07N46o38Q4L26j86j56N7o6M8j32K57r1J77
6457A14j82J35j14NK65P8m01q5j1L12L8P7Ll09J32k99M21rm23L70k6k0K3J28J92
6482D14l40l8l5m9kK7L6q0j28L88k12N23m55O3K1j36N5j10J07J63lj54K5j12J23
$$ plain form
6507 91 291 27 351 -239 257 -134 -275 68 -62 223 -188 79 -169 -190 140 -126 26 82 -49 177 120
6528 120 88 90 262 -116 199 -77 -43 53 29 -256 78 -157 -259 82 243 238 159 22 55 18 -56 179 143 -24
6552 -24 -257 -9 -59 -46 149 -121 120 243 -106 102 92 -154 -367 212 -24 32 154 -131 377 169 -99 249
6574 249 -162 57 -251 205 -166 123 -143 80 -78 41 -74 10 -93 -166 -265 211 80 128 -293 -202 61 -49
6596 -49 103 -148 -154 79 -86 112 49 22 -73 172 220 249 81 -281 204 160 353 -145 230 -322 -58 -122 8
6619 8 35 -46 -112 137 26 -260 37 -129 58 119 67 36 143 175 165 -445 -40 -83 -67 -189 -4 -35 -87 372 199
6644 199 210 115 -140 20 -27 -187 190 15 46 216 27 111 -264 -47 -188 -321 303 -472 48 47 -136 -76 -58
6667 -58 -69 100 -15 84 -254 -132 31 82 98 65 -46 -11 67 167 126 254 326 -44 169 -110 43 44 -193 76
$$ packed form
6507I1K00k64L24n90M96l91j41L43j30K85m11K67k48k1L30k66J52N6j31K26n7
6528A20l2KJ72l78L15k76L4R6k4k85L34k35j02L41J61np9j37L3l7p4K35l6j67
6552b4k33K48n0J3J95k70K41J23l49K08j0k46k13N79k36N6J22k85N08k08k68L48
6574B49m11K19l08M56l71K89k66K23j58J19j15Q4j03p3r9M76j31M8m21R1K63j10
6596d9J52k51oK33j65J98o3k7r5K45M8K9j68l62M85m4J93m98L75n52K64o4J30
6619HK7q1o6K49j11k86K97j66J87O1n2l1J07L2j0o10M05m3J6j22J85l1n2M59j73
6644A99J1r5k55J60m7j60L77j75L1J70j89Q4l75K17j41j33O24p75N20jj83O0J8
6667e8j1J69j15R9l38J22J63N1J6l3j11L5P8J00m1J28P2l70K13k79J53Jk37K69
$$ plain form
6691 76 52 16 -54 124 -114 176 29 -45 -20 173 10 74 -111 63 263 56 -41 -10 -159 27 43 -172 -75 49
6715 49 2 -14 -188 19 186 -96 136 -262 -216 -74 166 69 -36 -63 -198 -89 -168 244 219 -22 23 -145 25
6738 25 203 75 47 270 263 29 -184 9 -76 2 -222 68 -149 239 -84 -9 32 160 72 26 11 32 164 -24
6762 -24 131 -199 286 201 104 1 -59 -190 386 -90 82 168 152 120 -67 -34 -19 -38 -20 -96 -275 -88 -8 -69 294
6787 294 -102 81 136 -81 -104 54 142 -166 51 -62 33 -54 -5 242 227 42 -143 101 -55 320 -24 98
6809 98 118 87 112 -151 -276 -119 352 -3 44 171 27 62 37 -102 -64 57 -113 -61 -14 -129 -83 75 -98 -100
6833 -100 -29 26 -58 39 -6 62 -250 -72 38 -138 -29 5 51 -126 -138 185 270 151 300 -91 202 10 -36 -38
6857 -38 -217 19 -59 25 -320 -69 -162 -22 48 -88 59 -77 -131 -80 -200 -53 -113 233 -366 144 112 -105 238
$$ packed form
6691G6k4l6p0J78k38K90j47p4K5J93j63O4j85J74K00k07r7L1j49J86J6k15R7J24
6715D9m7j6j74K07J67k82K32l98M6J42K40r7j05k7j35J09p9M12k5k41M5j68J70
6738B5J78j28k8K23pk34k13J93q5P8k24K90k17L88l23P5M1J28q8m6j5K1J32j88
6762b4J55l30M85q5r7j03o0j31N76m76J72Q6j6l2j87L3J5j9J8p6j79J87Q0o1L63
6787B94l96J83N5k17k3J58Q8l08K17j13R5q7M9K47j5j85j85K44j56L75l44J22
6809I8K0l1K5k63j25J57M71l55M7J27j44L5k5j39L8J21j70N2M7j15M6J58j73k
6833a00P1N5q4R7m5O8l12J78J10j76J09L4M6j77j2L23Q5j19J49l91K93j92m6k
6857c8j79K36p8Q4l45K51r3J40P0j36J47j36n4N1j20J47o0L46n99N10l2k17L43
$$ plain form
6880 238 16 192 91 -178 -120 -95 37 197 192 -111 94 112 -62 22 -65 -47 150 4 91 158 -7 -47 -247 46
6904 46 26 269 117 -107 -132 -66 80 -101 117 44 -342 -216 -46 44 -23 -113 -76 235 -20 72 -259 -79 -24 -272
6928 -272 -40 -103 -36 -326 172 68 115 135 87 -85 -167 -184 131 375 -118 17 -268 -131 -134 -69 -88 -186 14 -19
6952 -19 -102 -115 -162 150 176 142 66 42 -4 159 139 -308 -10 172 179 53 170 -134 306 297 116 523 41 -33 -66
6977 -66 44 39 -101 -268 46 207 -191 -129 202 96 109 -5 -169 -19 -40 195 -101 -262 -16 311 204 214
6999 214 94 191 -158 -51 312 -126 3 -192 -207 -324 73 -32 -143 -54 -396 226 99 172 24 -81 116
7020 116 -65 -56 93 -95 -43 -78 -28 -4 217 -257 143 -109 -31 114 83 36 -149 -102 -24 183 142 25 4 36 150
7045 150 -5 -304 -126 -169 -40 -38 -117 -205 31 -427 13 126 -103 -11 -40 -179 -159 -27 52 -32 -211 95 -104
$$ packed form
6880B38k22J76j01k69N8K5J32J60nl03K05J8j74Q4q7J8J97j46Q7O7j65m0k00K93
6904D6k0K43j52k24k5O6J46j81K18p3l86J26J70R0o7r0L7L11k55R2l31J80N5k48
6928b72K32o3O7k90M98j04M7K0m8j72q2j7L15K44m93J35k85J37lO5j9r8K00l3
6952a9q3j3m7L12K6l4p6k4m6J63k0m47K98J82Pj26J17l04M40rj81M07m82p4l3
6977f6J10nj40j67L14J61l98O2L31j06J3j14j64J50k1K35k96j61K46L27j07J0
6999B14j20R7l49J07L63m38J29j95j5j17L97j05j11Q9l42O22j27P3j48j05J97
7020A16j81RJ49j88N2l5N0K4K21m74M00k52P8J45l1m7j85M7P8K07m1j17k1L2J14
7045A50j55k99J78m3J29Kp9q8K36m58M40J13k29R2k9j39K0J32P9q4j79L06j99
$$ plain form
7068 -104 -121 -213 -159 84 -56 30 0 -99 123 233 298 -153 -102 124 -149 111 72 -96 29 113 38 -279 -253 -24
7092 -24 204 -79 269 -150 -6 -29 12 -74 79 57 151 95 58 -58 -51 -20 213 -150 150 -159 -117 -4 469 142
7116 142 -85 238 -174 -35 -51 -190 -103 344 119 -227 -146 36 -93 140 -271 -109 31 -165 -178 178 59
7137 59 -61 121 -96 -6 225 -105 226 151 -301 -65 -14 38 159 329 -320 65 -61 219 34 -132 102 -129
7159 -129 -89 -26 164 216 -75 -237 175 132 -5 152 21 -296 -230 156 -130 -71 -313 -230 -86 138 99 2 141
7182 141 75 -13 46 26 -166 358 133 323 113 182 -173 128 -86 108 -5 381 113 54 -28 -85 -73 -61 -17 303
7206 303 118 168 24 246 -146 -302 -68 37 186 0 -231 5 -144 -308 153 74 311 -99 45 14 166
7227 166 109 -113 -2 -172 -172 -29 -9 -143 -17 163 -150 19 -177 141 -23 124 -164 155 -29 6 -265 164
$$ packed form
7068a04j7r2N4K43j40Q6l0r9K22J10O5m51N1K26k73K60l9j68J25Q4p5l17K6K29
7092b4K28k83L48m19J44k3M1q6J53k2R4n6l7j16PL1K33l63L00l09M2J13M73l27
7116A42k27L23m12J39j6j39Q7M47k25l46Q1J82j29K33m11J62J40j96j3L56j19
7137E9j20J82k17R0K31l30L31p5m52K36N1N2J21J70o49L85j26K80j85j66K34k31
7159a29M0O3J90N2k91j62M12m3j37J57j31l17O6L86k86N9k42Q3J44K24l9r7J39
7182A41o6q8N9k0j92N24k25J90k10O9l55L01k14J94j13L86k68n9q2n7J2J2M4L20
7206C03j85N0j44K22l92j56K34J05J49j86k31K36j49j64M61p9K37m10J44l1J52
7227A66n7k22J11j70%J43K0j34J26J80l13J69j96L18j64J47k88L19j84L5k71M29
$$ plain form
7249 164 -171 -132 35 -43 -103 -59 35 73 -49 19 182 114 84 54 -32 -146 -33 27 -160 -342 40 40 -40 131 126 -18
7275 -18 -134 -159 -228 -45 53 -94 319 169 -186 -220 -18 -8 -74 166 224 -145 -162 56 -375 -20 109 -279 22
7298 22 7 161 -79 -32 -302 -66 -85 -393 -238 -133 35 -55 -152 -205 -71 -196 24 -3 -20 247 203 94 -40
7321 -40 -133 17 4 -58 -22 125 48 230 172 262 6 -163 -144 104 274 181 99 -60 -138 -18 -115 165 133 249 38
7346 38 143 54 -168 27 165 240 -84 -45 -20 -104 42 -57 -69 -96 -188 -197 -15 -17 102 23 302 52 291 37 361
7371 361 -102 152 -53 -11 183 -220 -318 -12 317 -29 192 -101 -125 125 255 -69 -95 -174 -25 -340 374 -8
7393 -8 16 182 33 -33 154 -25 -18 161 40 -337 -81 -111 126 254 40 79 15 309 67 -107 -76 -89 -113 -191
7417 -191 -162 -53 -202 -41 -91 -162 -162 53 12 228 -196 52 -217 -59 -33 37 14 44 154 154 -156 57 -170 -309
$$ packed form
7249A64l35L9J67p8o0M4R4L8j22O8J63o8l0l0q6j14J13O0j87j82L82%q0J71nj44
7275a8j16k5o9J83R8j47M13j50l55l4K02J0o6K40N8l69j7K18m31L55J29l88L01
7298B2j5J54k40M7k70K36j9l08J55J05J68r0r7n3J34j25K20k7j7K67m4j09j34
7321d0r3J50j3o2L6J47p7J82n8R0k56j69J9K48J70r3q2j59p8J20r7K80l2J16k11
7346C8J05q9k22J95J38P5l24L9K5q4J46r9j2k7r2rJ82kJ19p9K79k50K39k54L24
7371C61m63K54k05M2J94m03r8L06L29l46K21k93k4K50J30l24k6p9J49l15P14l82
7393hK4J66j49o6J87j79PJ79j21l77K56l0K37J28k14L9o4K94k42j74L1j3k4p8
7417a91K9J09j49J61n0p1%K15m1K16m24K48k69J58K6P0k3L0J10%l10K13k27j39
$$ plain form
7441 -309 101 -107 28 57 -244 -17 -146 126 116 -404 -167 2 201 173 50 47 -74 -315 -120 -211 -116 -88 -44
7464 -44 -77 -42 131 69 97 -210 16 54 -233 -40 189 311 0 183 -78 -320 0 155 99 123 -203 360 -70
7487 -70 -313 8 -169 -54 -82 -138 -159 -37 -176 -75 54 -87 31 41 -38 119 -103 131 82 61 -121 -187 -116
7510 -116 252 -236 -165 -352 175 290 198 97 -83 -55 31 140 -70 0 -120 -100 -151 -181 88 -2 48 7 -100 -127
7534 -127 37 -266 -112 136 -4 79 33 -112 62 213 235 54 -196 -50 279 104 112 -414 135 -162 -102 -122
7556 -122 -80 -342 -159 -168 199 -275 89 -172 216 25 -16 -15 -287 137 -69 -25 -35 222 80 258 -143 105 395
7579 395 -32 45 80 -79 -103 -131 0 167 59 164 -161 -180 82 131 -100 212 238 100 -40 -273 72 -134
7601 -134 144 114 -227 20 -294 70 55 65 310 -118 155 -53 101 -191 -103 183 -170 -205 -159 133 274 349
$$ packed form
7441c09M10k08J35K9l01K27j29K72j0n20K37J69J99k8j23lj21k41J95r1R5K8M4
7464d4l3L5J73o2K8l07K26L8k87J93K29J22l11J83k61k42L20J55n6K4l26N63m30
7487g0k43L21j77J15k8n6k1J22j39J01J29j41J18J0p9J57k22K34m9k1j82o6P1
7510a16L68m88P1j87N27J15r2j01j80K8Q6J09k10P0j20K0n1l0K69r0N0m1j07k7
7534a27J64l03J54K48j40Q3m6j45J74J51K2j81k50J46L29j75Qn26N49k97O0k0
7556a22M2k62J83rL67m74L64k61L88j91m1Jk72M24k06M4j0K57j42J78m01K48K90
7579C95m27P7L5j59k4k8J31J67j08J05l25j9K62M9k31L12K6j38j40k33L45k06
7601a34K78l0l41K47l14L64j5J0K45m28K73k08J54k92Q8K86l53l5M6K92J41P5
$$ plain form
7623 349 -152 -22 -23 27 -251 -64 -89 -100 -6 -22 23 -287 62 -65 223 -255 -281 -13 112 130 -64 253 -34
7646 -34 -77 103 -80 -28 -238 63 209 -40 -4 -170 -4 48 234 71 12 289 -118 71 -1 2 -186 219 -185
7669 -185 -262 -61 85 71 21 12 48 32 -157 372 -272 59 219 -124 44 -116 157 177 -175 -23 237 122 399
7692 399 -65 47 73 -258 130 68 -319 -3 133 84 88 18 -256 82 -95 192 -71 -140 -123 -16 187 -43 -104
7715 -104 -16 -363 -27 -38 -303 47 -299 92 -161 85 -11 13 -132 45 22 -113 7 -141 -152 -42 211 -33
7737 -33 -180 -70 133 16 -27 229 138 -7 -13 -228 -37 104 309 79 174 -112 -110 72 230 142 76 -328 228
7760 228 315 65 20 -179 -119 -4 200 240 236 -116 -192 291 -395 -201 -110 -60 87 77 -148 274 97 -167 -27
7783 -27 -126 19 78 -104 80 3 -270 4 260 -144 -174 73 -60 -88 -120 -198 -58 141 -15 124 135 -63 316
$$ packed form
7623C49n01J30jN0k78J87k5j1R4j6M5l10L49j27K88m78k6K68J25J8j94L17k87
7646c4m3J80j83N2k10L01J46k49L6j66J66N2J86j63n9K77m07J89p2Lj88M05m04
7669a85p7K01J46j4n0rL6j6j89N29o44L31J60l43J68j60K73K0l52J52K60j15K77
7692C99m64J12K6l31L88o2l87L16J36m9Mp0k74L38j77K87k63o9J7J07K03k30o1
7715a04Q8l47L36j1k65L50l46L91k53K46r6K4j45J77k3j35J20j48j1J10K53k44
7737c3j47J10K03j17m3K56r1j45ok15J91J41K05k30R5k86KJ82J58q8o6m04N56
7760B28Q7k50m5j99O0J15K04M0ml52p6M83o86J94R1N0J47j0k25M22j77k64J40
7783b7r9J45N9j82J84p7k73K74K56m04l0K47j33k8l2p8J40J99j56J39J1j98L79
$$ plain form
7806 316 -117 -81 -137 15 -94 -148 272 128 136 0 10 -8 222 200 -90 -110 -68 -75 293 48 -138 96 -301 -179
7830 -179 -18 -207 -103 -11 -110 197 -116 -14 -379 41 -5 2 254 356 133 65 61 -79 78 -83 323 111 -202
7853 -202 -123 -75 0 -188 -68 151 -109 105 200 89 58 108 180 262 94 -19 -182 70 -72 -73 -113 -37 -64 -54 -87
7878 -87 -107 -77 -174 -69 -59 121 -243 -42 97 97 -214 77 -64 63 -9 216 140 -194 220 306 28 224 -23
7901 -23 -326 -101 134 113 -2 33 97 64 -47 68 -43 -35 -33 90 -252 193 199 -48 108 -91 206 234 -357 -199
7925 -199 -109 -314 -100 59 327 -15 -5 -14 135 2 -78 107 89 1 257 -227 -189 -180 -135 97 -123 -303 -112 24
7949 24 -105 -124 -23 -120 -165 -178 -166 -4 196 167 -29 -190 26 115 -46 -91 -187 -266 346 -325 -97 31 -67 133
7973 133 79 241 -280 -219 -85 45 213 76 69 -5 126 252 -50 108 -210 -197 -117 -380 363 132 -32 132
$$ packed form
7806C16m33L6n6J52j09n4M20j44Qj36J0j8K30k2k90k0M2pL68k45j86K34l97J22
7830a79J61j89J04R2r9L07l13J02l65M20m6PK52J02k23o8mj40J57j61M06k12l13
7853b02P9M8P5j88J20K19k60K14R5j11l1N0P2Q2j68j13j63K52j42jm0P6k7J0l3
7878h7k0L0r7J05J0J80l64K01J39%l11K91j41J27p2K25p6l34M14Q6k78J96k47
7901b3l03K25K35k1j15L5O4l3j11J15j11QKJ23l42M45Ok47J56j99K97K8n91J58
7925a99R0k05K14J59K68l42J0rJ49j33q0J85j8q8K56m84L8RM5K32k20j80J91J36
7949B4j29j9J01r7m5j3J2J62K00k9j96j61K16Q9j61m5r6p9O12o71K28J28r8K00
7973A33n4J62n21O1J34J30J68j37pp4J31J26l02J58l18J3Q0k63P43k31j64J64
$$ plain form
7995 132 32 -4 -110 266 -216 131 -160 -43 -64 107 -64 21 -62 -229 23 46 114 77 -66 73 -31 283
8017 283 21 231 64 6 135 -33 253 253 62 -105 142 -171 -93 -136 -146 165 171 66 -194 -143 239 39 -109
8040 -109 -139 126 35 -65 57 -165 50 28 61 1 -300 27 322 190 80 -220 92 84 102 -75 -187 191 111
8063 111 155 -22 0 -171 271 277 42 -55 -47 -36 -254 109 -175 123 -127 -23 12 -57 -148 -3 85 178 160 -20 19
8088 19 315 137 41 -117 -193 -189 113 -123 -168 192 43 -108 304 -117 -37 281 -1 98 -43 -161 77 18 -142
8111 -142 24 -7 25 -71 -83 -225 22 213 173 68 -139 -23 114 -139 13 -92 -306 -114 -14 148 -128 -8
8133 -8 -142 -58 -116 33 -6 -86 30 -4 82 30 188 -161 -213 -267 73 2 -69 -156 -236 -119 93 26 -27 -58 -60 24 -170
8160 -170 105 68 -23 170 139 -192 38 143 91 320 -99 136 -11 125 238 239 129 -9 109 94 75 179 -38
$$ packed form
7995A32j00l6j06L76m82L47k91J17k1J71j71Q5q3j67K52K3O8l7j43J39j04L14
8017B83k62K10j67n8J29j68K86%j91j67K47l13P8m3j0L11Oj05k60N1L82k00j48
8040a09l0K65r1j00J22k22K15k2L3o0l01L27K95j32j10l00L12qJ8j77j12L78q0
8063A11M4j77K2j71M42Ok35r7QJ1k18L63k84K98k50J04L5o9r1J45Q8R3j8j80L9
8088A9K96j78r6j58p6ML02k36m5L60j49j51M12m21Q0L18k82R9j41j18K38n9j60
8111a42J66l1L2r6j2j42K47J91m0j05k07J16J37k53J52j05k14J92J00J62k76J20
8133hj34Q4n8J49l9q0J16l4Q6n2J58l49n2n4L40p1p1q7q0J17K12o7n3l1kQ4j94
8160a70K75l7r1J93l1l31K30J05n2K29m19K35j47J36J13Jj10j38J18j5j9J04k17
$$ plain form
8183 -38 -146 169 -172 -95 -2 0 -57 -387
$$ packed form
8183c8j08L15l41P7R3Kn7l30
8191c87
$$ Imaginary data points
##PAGE= N=2
##DATA TABLE= (X++(I..I)), XYDATA
$$ plain form
0 0 0 0 0 0 0 0 0 -8 8 -8 8 -15 16 -16 24 -28 32 -40 48 -56 64 -75 87 -100 115 -131 150 -170 194 -218 243
31 243 -274 307 -344 383 -427 474 -527 584 -648 717 -794 877 -973 1078 -1195 1329 -1482
48 -1482 1657 -1862 2103 -2397 2757 -3213 3813 -4644 5863 -7835 11550 -20894 87850 110268
62 110268 -153935 -15361 110554 -15678 -65099 23386 3734 -3714 4684 -23723 1460 43403
74 43403 -26664 -33996 43907 24769 -31663 -4388 13476 7242 -10172 -29209 5530 23717 -33838
87 -33838 -5097 58159 -16031 -52325 50068 40467 -52753 -12045 32683 -9658 1995 2408 -41316
100 -41316 15980 45555 -47348 -25083 65336 4886 -46037 20320 22864 -21402 -5443 -6028 -11851
113 -11851 25060 1234 -41685 17302 43073 -24913 -25033 24686 15113 -6541 -7477 -2314 7436
$$ packed form
0@%%%%%%%qJ6j6J6k3L1l2M0n2O0p2Q8j04J20j39J62j87K15k46K81l20L64m12M61
31B43n17N81o51P27q10R01j001J111j232J365j511J671j850K051k273K524k811
48a482L139l519L965m500N154n970P026q457J0507j3698J9385l2444J08744K2418
62A10268k64203J38574J25915j26232m9421Q8485j9652p448Q398k8407K5183M1943
74D3403p0067p332P7903j9138n6432K7275J7864o234j7414j9037L4739J8187n7555
87c3838K8741O3256p4190l6294J02393r601r3220M0708M4728m2341J1653M13m3724
100d1316N7296K9575r2903K2265R0419o0450n0923O6357K544m4266J5959n85n823
113a1851L6911k3826m2919N8987K5771o7986j20M9719r573k1654r36N163R750
$$ plain form
126 7436 -5235 -13745 10524 1329 -21052 15708 26627 -21979 -7865 26419 -12316 -15107 21099
139 21099 -13425 -19218 29538 -5233 -33462 29197 18445 -41915 7515 47206 -17015 -30054
151 -30054 21816 13038 -16615 -8341 -4089 710 11723 -1555 -7131 7902 5651 -610 305 -3241
165 -3241 2213 1661 -11320 107 10459 -14268 -12280 17473 2776 -13533 15196 11124 -15784
178 -15784 7610 14755 -19415 -9006 13176 -6545 -7194 8568 -5616 -5026 15352 1576 -11932
191 -11932 8482 11090 -6585 -2491 2716 -4922 -4745 -3228 -2403 2325 753 -212 6625 4188 -939
206 -939 2234 -171 -2313 2769 -2545 -6724 3593 707 -8487 2767 6031 -7028 4450 13839
220 13839 -6014 -6657 10557 -544 -12157 -36 2086 -5387 46 3726 -400 1524 1824 -882
$$ packed form
126G436j2671q510K4269r195k2381L6760J0919m8606J4114L4284l8735k791L6206
139B1099l4524n793M8756l4771k8229O2659j0752o0360M9430L9691o4221j3039
151c0054N1870q778k9653Q274M252M799J1013j3278n576J5033k251o261R15l546
165c241N454n52j2981J1427J0352k4727J988K9753j4697j6309K8729m072k6908
178a5784K3394P145l4170J0409K2182j9721o49J5762j4184N90K0378j3776j3508
191a1932K0414K608j7675M094N207p638J77J517Q25M728j572r65O837k437n127
206i39L173k405k142N082n314m179J0317k886r194J1254L264j3059J1478R389
220A3839j9853o43J7214j1101j1613J2121K122p473N433L680m126J924L00k706
$$ plain form
234 -882 4168 2510 -4442 276 3224 -2769 -5038 -2517 672 2273 -2031 -428 8146 2819 -6070
249 -6070 4001 5946 -9559 -5816 6899 -2234 -6539 3545 274 -3206 5335 1923 -3475 5052
263 5052 4128 -4374 644 2988 -6697 -4665 3104 -1170 -3104 3713 3109 1184 2207 436 289 1025
279 1025 -1949 -1460 102 -3153 -2200 -153 -1925 -164 3261 813 806 6099 2616 -4267 879 1500 -5483
296 -5483 -2926 -225 -2295 407 2186 -1193 1472 4847 -185 -1447 4264 2079 -4583 -1407 1117
311 1117 -3937 -4278 270 825 217 842 2798 3577 626 -465 718 -465 -1916 -1977 -724 -220 -1393
328 -1393 -1279 401 1873 1404 117 2552 3918 -1330 -1999 1024 -1579 -4076 -1168 547 -1073 16
344 16 2329 1267 258 2134 806 -904 1383 -412 -2060 -253 -976 -1455 -1203 364 1170 1198 2003
$$ packed form
234h82N050j658o952M718K948n993k269K521L189J601m304J603Q574n327q889
249f070J0071J945j5505L743J2715r133m305J0084l271l480Q541l412n398Q527
263E052r24q502N018K344r685K032P769m274j934O817o04j925J023j771j47P36
279A025k974M89J562l255R53K047j772J761L425k448pN293l483o883N146O21o983
296e483K557K701k070K702J779l379K665L375n032j262N711k185o662L176K524
311A117n054l41M548N55o08O25J956P79k951j091J183j183j451o1J253N04j173
328a393J14J680J472m69j287K435J366n248o69L023k603k497K908J715j620J089
344A6K313j062j009J876j328j710K287j795j648J807p23m79K52J567Q06K8Q05
$$ plain form
361 2003 2503 292 371 20 -2136 -1417 -948 -1462 -1297 160 854 291 194 2860 1751 -436 1329 720
379 720 -1585 -1835 -1226 -989 -2336 -1211 1458 1042 1358 2968 984 1253 1106 -1255 -878 -203 -1487 -1783
397 -1783 -993 -191 -984 -617 2511 1518 654 2457 1507 -575 -416 -1394 -1918 -1985 -1601 -483 -202 607 1435
416 1435 1082 1092 1491 582 686 -48 -634 -1116 -2207 -1096 -1093 -1416 451 914 739 2610 1709 520 732
435 732 279 -1338 -1890 -685 -565 -1606 -665 532 -155 990 1639 793 1563 930 -34 -73 -900 -1717 -1703
454 -1703 -959 -369 -661 285 1755 1401 1014 567 487 474 -721 -1362 -18 -1119 -1669 -334 -480 250 1170
473 1170 939 1291 1718 1130 -713 -763 11 -1636 -2328 -220 -333 -360 888 350 943 2115 358 215 1152
492 1152 -333 -1382 -540 -537 -2092 -1338 486 219 698 1455 1226 1765 1117 -660 -121 453 -2260 -1999 100
$$ packed form
361B003N00k211P9l51k156P19M69n14J65J457O94n63r7K666j109k187J765o09
379G20k305k50O09K37j347J125K669m16L16J610j984K69j47k361L77O75j284k96
397a783P90Q02p93L67L128r93q64J803r50k082J59r78n24o7L84J118K81Q09Q28
416A435l53J0L99r09J04p34n86m82j091J111Ll23J867M63j75J871r01j189K12
435G32m53j617n52J205J20j041R41J197o87J145O49q46P70o33r64l9q27q17J4
454a703P44N90k92R46J470l54l87m47q0j3j195o41J344j101n50J335j46P30R20
473A170k31L52M27n88j843n0P74j647o92K108j13k7J248n38N93J172j757j43R37
492A152j485j049Q42Lj555P54J824k67M79P57k29N39o48j777N39N74k713K61K099
$$ plain form
511 100 -486 -1827 -274 1668 998 893 224 929 2825 202 -2998 -421 -106 -3232 -1379 517 -627
528 -627 139 1978 501 1456 1934 -534 -657 1997 -706 -3087 -306 -260 -2163 -157 863 -91 1147
545 1147 1763 1192 1256 -98 -1244 423 205 -3000 -1693 1421 -545 -828 1355 491 623 2431 396
562 396 -574 1720 -326 -3088 -255 280 -2762 -1481 1976 1219 670 866 1042 1988 587 -2033 -341
579 -341 518 -1764 -1386 127 -1223 -416 1146 990 543 1136 814 457 1384 -144 -2670 -1109 874 -278
597 -278 -1830 -900 1818 1971 31 395 1914 -67 -46 1099 -1047 -2349 -726 -531 -1015 589 -3
614 -3 -1230 1455 3626 476 -600 27 162 557 -832 -2395 -1248 -574 -263 1875 47 -2208 1775
631 1775 4577 -441 -1796 1584 97 -1759 148 -1717 -2925 1692 18 -1569 2769 2369 -2081
$$ packed form
511A00n86j341J553J942o70j05o69P05J896k623l200K577L15l126J853J896j144
528f27P66J839j477R55M78k468j23K654k703k381K781M6j903K006J020r54J238
545A147O16n71O4j354j146J667k18l205J307L114j966k83K183q64J32J808k035
562C96r70K294k046k762K833N35l042J281L457p57n49J96J76R46j401k620J692
579c41Q59k282L78J513j350Q07J562j56m47N93l22l57R27j528k526J561J983j152
597b78j552R30K718J53j940L64J519j981K1J145k146j302J623J95m84J604n92
614cj227K685K171l150j076O27J35L95j389j563J147O74L11K138j828k255L983
631A775K802n018j355L380j487j856J907j865j208M617j674j587M338m00m450
$$ plain form
646 -2081 658 3332 482 -2538 -2141 -35 2394 -889 -5222 136 5032 -1138 -1661 2883 379 394
662 394 2360 -2231 -2449 2043 -1370 -3482 1306 608 -2861 1905 2373 -1286 1256 1972 -1973 762
678 762 1424 -3181 -854 68 -2309 2098 1540 -5033 738 7824 -324 -4304 1668 1748 -195 441 -4614
695 -4614 -3083 5966 209 -6380 2932 4587 -2930 292 3704 -383 -42 -1474 -2980 3012 1435
710 1435 -7493 -1348 6651 -854 -2108 3431 -890 -433 6170 -2349 -6084 3336 935 -3918 1629
725 1629 -1209 -4369 4906 3759 -5868 1153 6249 -2775 -1817 3479 -2185 -1550 544 -4023 907 5214
741 5214 -5854 -3687 8889 2680 -5129 989 2230 -347 2217 -2671 -6238 4108 3501 -7255
755 -7255 94 6114 -2420 -123 4166 -2021 -544 3410 -2823 -1917 3203 -2219 -3252 2746 -418
$$ packed form
646b081K739K674k850l020L97K106K429l283m333N358M896o170n23M544k504J5
662C94J966m591k18M492l413k112M788o98l469M766M68l659K542P16l945K735
678G62O62m605K327R22k377M407n58o573N771P086q148l980N972Q0j943O36n055
695d614J531R049n757o589R312J655p517L222L412m087L41j432j506N992j577
710A435q928O145P999p505j254N539m321M57O603q519l735R420k401m853N547
725A629k838l160R275j147r627P021N096r024R58N296n664O35K094m567M930M307
741E214j1068K167J2576o209p809O118J241k577K564m888l567J0346o07j0756
755g255P349O020q534K297M289o187J477L954o233R06N120n422j033N998l164
$$ plain form
770 -418 -2073 3288 -77 -2753 4805 2243 -5930 390 3060 -2673 -824 -1122 -3519 3442 3943 -4873
786 -4873 -1868 5861 728 -2700 905 -469 -981 1173 -2331 -2049 2808 -1456 -2683 3907 1326 -1874
802 -1874 1511 1015 -966 2065 -519 -4773 1048 3268 -2573 -2061 1223 -222 2003 2209 -2916 -457
818 -457 4174 -771 -3021 795 -1200 -1991 394 -467 -873 2079 173 -570 3176 1119 -2862 532
834 532 1093 -2070 -457 -264 -3092 493 2632 -1191 -933 2389 1079 709 890 -1707 -632 1715 -1221
851 -1221 -2849 533 -24 -1188 870 556 -455 1839 631 -558 1317 379 -2173 -364 852 -1296
867 -1296 -1202 230 -92 847 1274 -851 185 1950 270 -867 95 -807 -550 126 -711 -581 345 678
885 678 992 1029 5 -45 1429 39 -1251 -386 -546 -1274 136 76 -595 394 115 558 1580 273 -1228
$$ packed form
770d18j655N361l365k676P558k562q173O320K670n733J849k98k397O961N01q816
786d873L005P729n133l428L605j374n12K154l504K82M857m264j227O590k581l200
802a874L385m96j981L031k584m254N821K220n841N12L284j445K225K06n125K459
818d57M631m945k250L816j995p91K385q61m06K952j906p43L746k057l981L394
834E32N61l163J613J93k828L585K139l823K58L322j310l70J81k597J075K347k936
851a221j628L382n57j164K058l14j011K294j208j189J875r38k552J809J216k148
867a296R4J432l22R39M27k125J036J765j680j137R62r02K57O76q37J30R26L33
885F78L14L7j024n0J474j390j290Q65j60p28J410o0o71R89k79M43J022j307j501
$$ plain form
904 -1228 185 1091 -900 -1027 -265 -537 152 152 -372 277 1271 178 546 1298 -793 -685 324 -205 -1038
923 -1038 -603 -142 -225 838 194 -366 1461 1174 -381 469 423 -1546 -483 52 -889 -327 536 -460 385
942 385 1348 302 412 1270 332 -783 291 -370 -1180 -126 -187 -882 143 593 318 872 476 -89 490
961 490 571 -411 -442 -114 -531 -789 -73 -415 405 1069 567 197 1381 205 -599 251 -158 -1024 -477 -419 -706
982 -706 -38 202 423 635 1160 395 441 597 -538 -614 -261 -549 -818 86 -185 267 109 336 410 552 436
1003 436 276 -108 -124 -703 -584 -271 -470 -279 145 249 789 386 171 508 471 -109 -124 -404 -469 -471 -310 -163
1025 -163 -80 180 624 310 754 555 23 -96 -354 -634 -419 -689 -472 -248 -228 487 62 512 828 446 230
1046 230 39 -604 -237 -256 -729 -406 -283 -183 387 337 403 592 355 486 189 -265 -258 -830 -457 -323 -438 103
$$ packed form
904a228J413R06j991j27P62k72O89%n24O49R94j093L68P52k091J08J009n29q33
923a038M35M61q3J063o44n60J827k87j555Q50m6j969J063N35r41N62Q63r96Q45
942C85R63j046J10Q58r38j115J074o61q10J054o1o95J025M50k75N54l96n65N79
961D90Q1r82l1L28m17k58P16l42Q20O64n02l70J184j176q04Q50m09q66N47N8k87
982g06O68K40K21K12N25p65M6J56j135p6L53k88k69R04k71M52j58K27P4J42j16
1003D36j60l84j6n79J19L13j99J91M24J04N40m03k15L37l7n80j5k80o5kJ61J47
1025a63Q3K60M44l14M44j99n32j19k58k80K15k70K17K24K0P15m25M50L16l82k16
1046B30j91o43L67j9m73L23J23J00N70n0O6J89k37J31k97m54Pn72L73J34j15N41
$$ plain form
1068 103 21 443 898 335 373 685 -19 242 -224 -745 -688 -699 -129 42 -231 495 513 212 657 240 131 191
1090 191 -260 -417 -435 -736 -423 -803 253 559 463 678 379 205 371 -87 -179 -259 -463 -761 -508 -305 -16
1111 -16 111 375 518 414 537 407 -212 86 -265 -432 -264 -354 -185 -123 -13 605 866 581 652 185 53
1132 53 -142 -587 -248 -637 -467 81 -150 13 540 296 390 492 13 23 213 -627 -492 -337 -422 -213 -546
1153 -546 404 433 433 252 589 556 88 -655 -203 -305 -730 -571 -444 -436 176 39 264 302 627 631 299 117 -192
1176 -192 -202 -228 -593 -873 61 -12 148 492 281 587 881 233 -301 -129 -23 -418 -577 -353 -362 -317 82 281
1198 281 -23 190 92 264 753 -348 -691 -143 -357 -547 -134 -178 -299 450 829 104 664 647 -242 -59 261
1219 261 -366 -858 -48 -536 -422 239 285 56 373 607 9 87 298 -274 -342 -488 -892 -568 -98 -49 169
$$ packed form
1068A03q2M22M55n63L8L12p04K61m66n21N7j1N70J71k73P26J8l01M45m17j09O0
1090A91m51j57j8l01L13l80J056L06r6K15k99j74J66m58r2q0k04k98K53K03K89
1111a6J27K64J43j04J23j30o19K98l51j67J68r0J69O2J10O18K61k85P1m67j32
1132E3j95m45L39l89J70N48k31J63N27k44R4J02m79J0J90q40J35J55q5K09l33
1153e46R50K9%j81L37l3m68p43M52j02m25J59J27QO12j37K25L8L25Ml32j82l09
1176a92j0k6l65k80R34p3J60L44k11L06K94o48n34J72J06l95j59K24rM5L99J99
1198B81l04K13r8J72M89j101l43N48k14j90M13m4j21P49L79p25N60j7q89J83L20
1219B61o27m92Q10m88J14O61M6k29L17K34n98P8K11n72o8j46m04L24M70M9K18
$$ plain form
1240 169 562 428 375 639 -39 -62 176 -11 -860 -230 -207 -416 72 341 -199 107 879 406 268 413 -269
1261 -269 -685 -213 -160 -806 -760 88 408 354 118 322 370 338 214 -59 -532 -795 3 54 -129 -536 157 414
1283 414 289 464 336 -518 287 901 -461 -741 -246 -83 -833 43 361 -435 79 1142 423 -100 291
1302 291 -58 21 -24 -481 -621 -332 8 -66 207 -90 189 784 427 -311 -41 54 -718 150 -445 -1377 -65
1323 -65 630 -370 -645 874 606 39 392 93 -525 173 -682 -522 367 -659 -943 379 951 161 336
1342 336 185 273 1055 -226 -1201 103 557 -1127 -842 277 -583 237 1340 206 -487 1145 -13 -357
1360 -357 138 -707 -1111 101 -367 -335 537 141 -771 1477 1615 -662 -399 870 -618 322 21 -2481
1378 -2481 -155 1905 -791 -1040 1093 348 -207 1389 32 -693 919 -175 -1383 421 131 -1742
$$ packed form
1240A69L93j34n3K64o78k3K38j87q49O30K3k09M88K69n40L06P72m73j38J45o82
1261b69m16M72N3o46M6Q48L20n4k36K04M8l2j24k73m73k63P98N1j83m07O93K57
1283D14j25J75j28q54Q05O14j362k80M95J63p50Q76L18p96N14J063p19n23L91
1302B91l49P9m5m57j40K89L40p4K73k97K79N95l57p38K70R5p72Q68n95r32J312
1323f5O95j000k75J519k68n67L53k99o18O98q55J60Q89j026k84J322N72p90J75
1342C36j51Q8P82j281r75J304M54j684K85J119q60Q20J103j134o93J632j158l44
1360c57M95q45m04J212m68L2Q72l96r12K248J38k277K63J269j488R40l01k502
1378b481K326K060k696k49K133p45n55J596j357p25J612j094j208J804k90j873
$$ plain form
1394 -1742 -37 1278 -616 169 586 -414 1113 1486 -1499 -696 1130 -683 -760 373 -939 -362 1812
1411 1812 66 -1656 1739 1546 -1321 285 400 -1121 183 125 -1750 135 882 -1128 -172 2006
1427 2006 28 -667 905 146 -358 450 -1570 -1287 1655 378 -2078 588 975 -358 774 -85 -1122
1444 -1122 579 1019 -875 -989 288 -352 -247 751 -763 -353 1019 55 100 1351 -453 -986 693
1461 693 63 -589 -129 -572 -381 1257 455 -1145 274 1673 -87 -264 -211 -619 87 563 -1203 -733
1479 -733 392 -103 -205 812 65 27 746 176 2 427 -577 -912 118 200 -690 -125 233 204 1167 61
1499 61 -631 439 1082 -610 -592 -80 -458 -124 317 -700 40 1034 -7 -460 1059 94 -295 424 -199
1518 -199 -410 -176 -256 -292 246 317 -382 306 829 596 188 -24 -186 -124 525 -815 -609 -258 152 232 236 -17
$$ packed form
1394a742J705J315j894P85M17j000J527L73k985Q03J826j813p7J133j312N77K174
1411A812j746j722L395j93k867J606J15j521J304n8j875J885P47k010R56K178
1427B006j978o95J572p59n04Q08k020K83K942j277k456K666L87j333J132q59j037
1444a122J701M40j894j14J277o40J05R98j514M10J372r64M5J251j804n33J679
1461F93o30o52M60m43J91J638q02j600J419J399j760j77N3m08P06M76j766M70
1479g33J125m95j02J017p47l8P19n70j74M25j004l35J030Q2q90N65L58k9R63j106
1499F1o92J070O43j692J8N12l78L34M41j017P40R94j041m53J519r65l89P19o23
1518a99k11K34q0l6N38P1o99O88N23k33m08k12j62O2O49j340K06L51M10Q0Mk53
$$ plain form
1540 -17 442 466 72 -78 290 67 -484 130 -380 -673 33 192 192 351 12 -122 132 325 -78 -477 -673
1561 -673 -110 -52 -87 -199 -261 90 254 435 290 -83 366 617 -511 -57 12 -624 151 -177 -588 -17 397
1582 397 200 304 409 -120 -134 407 90 -311 -167 -214 -396 47 115 -346 516 423 47 355 104 -346 1
1603 1 238 -491 -566 -242 -369 -289 501 335 -79 553 302 -72 631 -437 -626 -137 -399 -493 113 256 -325
1624 -325 140 477 155 434 285 -315 -388 -33 -83 -191 -86 -261 21 114 337 293 420 183 -272 178 153 -226
1646 -226 -194 98 -393 -310 -135 -444 293 319 447 414 375 -283 154 -21 -556 -306 -400 -21 -246 108 230 157
1668 157 340 475 -166 296 197 -548 -12 -33 -246 -134 -136 -207 31 364 177 122 354 465 -279 136 -179 -345
1690 -345 -124 -219 -206 38 5 394 437 77 290 45 105 -380 -166 -236 -628 -145 -164 -350 103 463 10 217
$$ packed form
1540a7M59K4l94j50L68k23n51O14n10k93P06J59%J59l39j34K54J93m03l99j96
1561f73N63N8l5j12o2L51J64J81j45l73M49K51j128M54O9o36P75l28m11N71M14
1582C97j97J04J05n29j4N41l17m01J44m7j82M43O8m61Q62r3l76L08k51m50L47
1603AK37p29p5L24j27Q0P90j66m14O32k51l74P03j068j89M89k62r4O06J43n81
1624c25M65L37l22K79j49o00p3L55n0j08J05j75K82R3K23m4J27k37m55M50k5l79
1646b26L2K92m91Q3J75l09P37K6J28l3l9o58M37j75n35K50r4L79k25L54J22p3
1668A57J83J35o41M62r9p45N36k1k13J12kp1K38L33j87n5K32J11p44M15l15j66
1690c45K21r5J3K44l3L89M3l60K13k45O0m85K14p0l92M83j9j86M53L60m53K07
$$ plain form
1712 217 394 152 -141 -50 -31 -171 -373 -7 29 -227 349 82 -37 167 148 93 370 -55 115 34 -533 -455
1734 -455 -457 -390 -53 -124 199 381 324 51 118 230 -85 -278 -21 -75 -297 -15 119 -52 441 43 35 269 291
1757 291 14 -271 -447 37 -105 -238 -12 -234 128 181 213 210 -75 77 73 34 0 -126 -424 -119 -154 162 -90
1780 -90 81 366 211 172 431 206 76 -56 -334 -8 -99 -103 -216 -103 67 279 131 240 148 49 31 136 -208
1803 -208 -367 -416 -318 -280 -25 348 619 297 186 158 67 159 123 -145 -85 -314 -254 110 -41 -61 401 210 307 126
1827 126 198 31 -144 -313 -205 -232 -49 -206 45 31 -47 264 81 377 202 -17 -249 -83 -154 -356 -89 -64
1849 -64 -98 -123 154 87 225 229 341 -174 -25 -123 -381 -281 -498 -127 -152 -3 235 7 322 219 125 132 -131 129
1873 129 -329 -499 -367 -25 -254 -2 197 15 377 637 -7 -231 188 50 -299 -39 -139 -459 22 -294
$$ packed form
1712B17J77k42k93R1J9j40k02L66L6k56N76k67j19K04j9n5K77m25J70q1n67P8
1734d55kO7L37p1L23J82n7k73O7J12l15j93K57n4k22K82J34j71M93l98qK34K2
1757B91k77k85j76M84j42j33K26k22L62N3L2lk85J52ml9l4j26k98L05l5L16k52
1780i0J71K85j55l9K59k25j30j32k78L26r1mj13J13J70K12j48J09r2r9j8J05l44
1803b08j59m9R8L8K55L73K71l22j11k8r1R2l6k68O0k29O0L64j51k0M62j91R7j81
1827A26P2j67j75j69J08k7J83j57K51j4p8L11j83K96j75k19k32J66p1k02K67K5
1849f4l4k5K77o7J38MJ12n15J49r8k58J00k17L71k5J49K38k28L15j03r4Pk63K60
1873A29m58j70J32L42k29K52J99j82L62K60o44k24M19j38l49K60j00l20M81l16
$$ plain form
1893 -294 -181 162 388 50 52 463 -21 40 152 -47 -95 -175 -235 -85 4 222 204 512 365 -90 31 135 -240
1916 -240 -25 -190 -462 22 300 -65 -97 99 368 248 269 92 -44 168 -254 -348 5 -77 -235 191 75
1937 75 -181 237 399 -33 176 -4 -250 -218 177 -182 -404 -224 113 93 220 244 -52 45 221 -62 -258 -116
1959 -116 -78 -485 -84 -229 -100 218 141 25 544 -96 167 140 -69 -231 -142 271 -99 -101 -75 -89 131 318 402
1982 402 193 299 185 -313 98 -152 -344 -284 56 -143 -466 123 200 150 111 233 -267 90 -83 -248 -305 -472
2004 -472 -165 275 225 -122 -55 55 376 418 245 -475 134 46 -468 -139 -127 -382 -139 744 -146 29 216 57
2026 57 177 458 -31 -714 -96 174 -292 -68 -105 17 376 356 -406 18 191 -102 -215 50 -425 -333 304
2047 304 -359 -207 209 147 -496 280 444 -287 332 118 -181 82 -139 -559 152 385 -679 -92 168 24
$$ packed form
1893b94J13L43K26l38KM11m84O1J12j99m8q0o0J50Q9K18j8L08j47m55J21J04l75
1916b40K15j65k72M84K78l65l2J96K69j20K1j77j36K12m22r4L53q2j58M26j16
1937G5k56M18J62m32K09j80k46L2L95l59k22J80L37k0J27K4k96R7J76k83j96J42
1959a16L8m07M01j45J29L18p7j16N19o40K63k7k09j62Q9M13l70kK6j4K20J87Q4
1982D02k09J06j14m98M11k50j92O0L40j99l23N89P7n0l9J22n00L57j73j65n7j67
2004d72L07M40n0l47O7J10L21M2j73p20O09q8n14L29J2k55K43Q83q90J75J87j59
2026E7J20K81m89o83O18K70m66K24l7J22L59k0p62M24J73k93j13K65m75R2O37
2047C04o63J52M16o2o43P76J64p31O19k14k99K63k21m20P11K33j064N87K60j44
$$ plain form
2067 24 77 388 -311 -118 714 -502 -703 169 -48 -145 328 -122 -222 427 373 -102 133 540 -349 -80 524
2088 524 -620 -404 86 -160 -27 561 -367 -470 991 169 -121 55 -170 -411 191 78 -820 253 402
2107 402 -196 228 658 -90 34 680 -202 -258 566 -476 -246 530 -226 -400 699 364 406 -43 -192 -778
2127 -778 360 451 -744 -39 15 -232 74 -34 -263 221 450 -49 80 637 -528 -368 62 -450 -174 100
2147 100 8 -143 468 -54 -347 167 514 8 -76 234 -76 -6 -27 -325 -60 294 -242 72 307 198 -51
2168 -51 402 -113 -68 101 -270 -163 208 -131 51 36 188 132 373 109 -178 376 293 10 -297 -76 -186 25
2190 25 -135 -160 241 437 54 24 42 71 189 94 -482 -295 197 -297 -246 -63 145 -55 25 219 -133 469 -32
2213 -32 32 196 180 -281 -297 -241 -106 -68 247 219 226 314 362 -5 -207 -164 -63 9 -93 25 12 41 56 213 209 35
$$ packed form
2067B4N3L11o99J93Q32j216k01Q72k17r7M73m50j00O49n4m75K35M07q89K69O04
2088E24j144K16M90k46J33N88r28j03J461q22k90J76k25k41O02j13q98J073J49
2107D02n98M24M30p48J24O46q82n6Q24j042K30P76p56j74J099l35M2m49j49n86
2127g78J138R1j195P05N4k47L06j08k29M84K29m99J29N57j165J60M30n12K76K74
2147A00r2j51O11n22k93N14L47n06q4L10l10P0k1k98K65L54n36L14K35j09k49
2168e1M53n15M5J69l71J07L71l39J82j5J52n6K41k64k87N54q3k83l07K21j10K11
2190B5j60k5M01J96l83l0J8K9J18r5n76J87M92m94N1J83K08k00Q0J94l52O02n01
2213c2O4J64j6m61j6N6J35L8L15k8PQ8M8l67k02M3J01P2j02J18j3K9J5J57mj74
$$ plain form
2239 35 178 103 -123 0 -4 -250 -257 -87 -137 217 105 377 176 14 -13 35 89 -114 50 96 -110 85 -64 -205
2263 -205 115 390 -222 144 152 5 53 2 -52 -119 -20 -282 -305 169 35 73 507 32 156 302 207 -252 127
2286 127 51 -115 -85 -5 -262 -8 205 45 453 276 54 -43 426 -56 161 212 -24 -182 101 225 -269 312
2308 312 107 -209 229 240 -218 175 -18 -227 -244 188 -196 -183 -171 103 315 218 -117 -254 101 -45 -212 113
2330 113 -64 -243 -246 76 -11 67 137 184 49 119 373 -227 -93 153 -3 134 69 -77 108 219 173 97 111 -7
2354 -7 171 -7 149 23 184 -359 -135 -53 -102 25 122 -28 281 184 215 199 107 164 -44 4 -30 -503 93 18
2378 18 211 -103 244 443 300 -20 -136 -91 -20 -70 34 9 -121 0 62 134 349 204 90 188 10 108 -67
2401 -67 -321 -136 52 -100 38 237 236 304 248 188 111 -50 -142 -194 -146 -328 140 6 -105 538 496 9 106 121
$$ packed form
2239C5J43p5k26J23mk46pJ70n0L54j12K72k01j62k7M8N4k03J64M6k06J95j49j41
2263b05L20K75o12L66Qj47M8n1n4o7R9k62k3M74j34L8M34m75J24J46r5m59L79
2286A27p6j66L0Q0k57K54K13j60M08j77k22r7M69m82K17N1k36j58K83J24m94N81
2308C12k05l16M38J1m58L93j93k09j7M32l84J3J2K74K12r7l35j37L55j46j67L25
2330A13j77j79lL22q7P8P0M7j35P0K54o00J34K46j56J37o5j46J85J11m6p6J4j18
2354gJ78j78J56j26J61n43K24Q2m9J27R7j50L09r7L1j6r2N7k08M8l4m73N96p5
2378A8J93l14L47J99j43l20j16M5P1n0J04k5j30J21O2P2K15j45j14R8j78R8j75
2401f7k54J85J88j52J38J99jO8n6o0p7j61r2n2M8j82M68j34j11O43m2m87R7J5
$$ plain form
2425 121 45 -193 -323 -141 -176 -99 -20 8 -154 44 23 266 -34 353 47 335 32 -277 -37 -384 286 -41
2447 -41 91 73 353 133 -120 119 62 190 179 -290 41 -207 -30 -16 146 -109 197 172 -15 305 -19 -6
2469 -6 -268 -216 -80 -18 144 -484 -83 14 314 -39 237 115 -90 162 125 -288 -200 -71 -43 452 -56 -79 91
2492 91 268 -139 175 254 110 180 141 112 -283 321 42 -60 85 -20 129 315 38 271 -345 36 270 -33
2514 -33 -60 -104 -112 127 173 355 -20 -258 237 58 51 85 56 -223 -94 58 77 134 -334 -173 304 84 398 -173
2538 -173 49 -111 159 242 -45 -1 -84 -5 175 54 166 -128 145 -67 -7 399 25 -28 156 10 -253 -103
2560 -103 2 -63 81 81 -84 208 149 42 -60 20 -70 -101 -214 80 -26 190 62 122 467 261 131 292 82
2583 82 -161 75 -49 -421 91 -67 -33 88 166 175 69 212 189 -123 114 137 -99 -116 -76 -276 -7 175 -132
$$ packed form
2425A21p6k38j30J82l5P7P9K8j62J98k1K43l00L87l06K88l03l09K40l47O70l27
2447d1J32j8K80k20k53K39n7J28j1m69L31k48J77J4J62k55L06k5j87L20l24J3
2469fk62N2J36O2J62o28M01R7L00l53K76j22k05K52l7m13Q8J29K8M95n08k3J70
2492I1J77m07L14P9j44P0l9k9l95O04k79j02J45j05J49J86k77K33o16L81K34l03
2514c3k7m4qK39M6J82l75k38M95j79pL4k9k79J29J52J9N7m68J61M77k20L14n71
2538a73K22j60K70Q3k87M4q3P9J80j21J12k94K73k12O0M06l74n3J84j46k63J50
2560a03J05o5J44%j65K92n9j07j02Q0r0l1j13K94j06K16j28O0L45k06j30J61k10
2583H2k43K36j24l72N12j58L4J21P8Rj06J43k3l12K37K3k36j7M0k00K69J82l07
$$ plain form
2606 -132 183 -24 209 164 108 -129 135 19 -237 -345 -186 -70 -15 95 -123 -36 493 214 -127 46 -276
2627 -276 -58 367 -357 -335 36 -336 -251 18 102 72 194 174 -78 -61 6 192 -171 39 -68 114 103 -10 187
2650 187 86 165 17 110 126 -257 -24 -235 -33 108 -116 -78 -6 108 35 74 503 198 229 167 -296 -292 278 -89
2674 -89 -434 -98 -32 99 249 57 -433 41 -92 -164 246 -4 -185 -134 15 -194 -44 5 -21 61 78 176 208
2697 208 -61 108 102 194 -56 60 136 19 117 87 -209 129 312 255 -208 -27 -48 -203 -138 -122 -87 -228 159 -97
2721 -97 -173 160 51 -74 -148 -125 -254 268 246 -296 155 223 98 -112 -120 141 146 -248 -153 -136 -118 -22 -222 -254 306
2746 306 1 -174 113 -64 98 148 -314 284 -52 -151 41 230 -7 0 -84 -24 -167 380 302 -159 70 196
2768 196 -250 150 490 -222 -204 -178 33 284 23 -84 141 93 0 8 126 -54 -167 162 -344 -292 -230 117 135
$$ packed form
2606a32L15k07K33m5n6k37K64j16k56j08J59J16N5J10k18Q7N29k79l41J73l22
2627b76K18M25p24K2L71l72Q5K69Q4l0J22k0k52J7O7J86l63K10j07J82j1j13J97
2650A87j01P9j48R3J6l83K33k11K02J41k24L8P2J14p3L9M29l05L1o2m63MN70l67
2674h9l45L36O6J31J50j92m90M74j33p2M10k50j81N1J49k09J50M9k6Q2J7R8L2
2697B08k69J69oR2k50J16P6j17R8l0k96L38J83n7m63J81k1j55O5J6L5j41L87k56
2721i7p6L33j09j25p4K3j29N22k2n42M51O8j25k10qK61Nl94R5J7J8R6k00l2N60
2746C06l05j75K87j77J62N0m62N98l36r9J92J89k37Pq4O0j43N47p8m61K29J26
2768A96m46M00L40p12J8K6K11K51k61j07K25m8r3QJ18j80j13L29n06N2O2L47J8
$$ plain form
2791 135 109 244 -103 128 66 -194 -412 -178 66 -126 123 -155 41 195 -68 -128 166 88 -63 47 167
2812 167 -397 -31 -151 -116 93 -14 -172 10 400 -85 -6 244 -1 -32 364 -38 -44 -162 -34 -10 137 295
2834 295 -169 145 367 67 -207 280 -53 179 -135 -154 -96 149 2 194 64 -85 -24 309 -101 -140 4
2855 4 41 -137 -119 85 211 176 216 58 -105 253 3 298 127 -226 -78 -48 16 33 92 -191 41 173 -267
2878 -267 83 33 367 64 10 -139 -229 -129 192 -414 -153 132 90 184 -125 188 -102 267 -170 -116 -156 -110 -250
2901 -250 -295 -106 44 -83 182 -13 -1 219 -98 132 -34 -45 -156 -105 -67 52 -79 258 148 102 125 263
2923 263 362 213 20 43 -249 -193 -135 -183 121 34 -95 38 33 49 35 -107 -84 105 -113 -15 -79 -62 -28 128 59
2948 59 117 25 157 -141 95 280 -50 -251 -224 -16 129 250 -117 95 -45 151 326 51 115 -303 110 2
$$ packed form
2791A35k6J35l47K31o2k60k18K34K44j92K49k78J96J54k63o0K94p8j51J10J20
2812A67n64L66j20L5K09j07j58J82L90m85P9K50k45l1L96m02oj18J28K4J47J58
2834B95m64L14K22l00k74M87l33K32l14j9N8K45j47J92j30j49O1L33m10l9J44
2855DL7j78J8K04J26l5M0j58j63L58k50K95j71l53J48L0O4J7N9k83K32J32m40
2878b67L50n0L34l03n4j49r0J00L21o06K61K85m2R4l09L13k90L69m37N4m0M6j40
2901b50m5J89J50j27K65j95J2K20l17K30j66j1j11N1L8J19j31L37j10m6K3J38
2923B63R9j49j93K3k92N6N8m8L04q7j29J33nJ6j4j42K3J89k18R8o4J7L4J56o9
2948E9N8r2J32k98K36J85l30k01K7K08J45J21l67K12j40J96J75k75O4m18M13j08
$$ plain form
2970 2 -97 69 144 -66 -182 -88 188 185 533 170 107 50 72 -195 75 -148 71 -95 -83 -52 -43 11 202 -93 39
2995 39 35 -338 47 291 -23 -124 -155 -10 179 -6 -126 62 119 -101 150 84 251 146 -54 -190 100 225
3017 225 -90 154 256 177 190 125 139 -53 -3 -166 153 163 110 202 27 -104 322 359 10 -82 76 -86 -7 -47
3041 -47 54 125 143 -46 131 82 -80 68 -180 111 -96 -308 66 204 42 -397 40 -47 156 67 -63 -17
3063 -17 48 7 3 -36 -189 -126 166 -192 -241 -249 70 -283 207 49 -24 -64 -115 -42 -58 196 -226 -181 -289 6 -47 51
3089 51 211 118 212 127 64 108 -25 274 62 132 -25 -145 43 -91 -224 -183 -353 128 220 -104 230 -126 72
3112 72 -135 -318 6 -293 153 -89 92 2 142 133 139 343 66 -199 -359 195 6 161 65 34 349 -2 59
3135 59 -108 126 252 40 -28 -84 -282 100 -103 142 -73 -195 17 -54 32 -47 -91 104 -212 -209 -27 -171 104
$$ packed form
2970Br9J66P5k10j16R4K76lL48l63o3n7K2k67K70k23K19j66J2L1RN4J91k95J32
2995C9ml73L85K44l14j01l1J45J89j85j20J88N7k20K51o6J67j05k00j36K90J25
3017B25l15K44J02p9J3o5J4j92N0j63L19J0n3R2j75j31M26L7l49r2J58j62P9m0
3041d7J01P1J8j89J77m9j62J48k48K91k07k12L74J38j62m39M37q7K03q9j30M6
3063a7O5m1ml9j53O3K92l58m9qL19l53M90j58p3m0n1P3j6K54m22M5j08K95n3R8
3089E1J60r3R4q5o3M4j33K99k12P0j57j20J88j34j33M1j70M81R2l24L34l56J98
3112G2k07j83L24k99M46k42J81r0J40rOK04k77k65j60N54j89J55r6l1L15l51O1
3135E9j67K34J26k12o8n6j98L82k03K45k15j22K12p1Q6p9m4J95l16LJ82j44K75
$$ plain form
3158 104 -128 101 5 -71 -164 -80 89 -326 13 212 -95 -40 -220 -135 -63 276 -234 -53 -39 -79 65 -23 30 384
3182 384 -205 -170 76 -32 -364 38 69 -309 -60 -212 66 -58 132 -40 -343 -284 -101 196 78 -47 70
3203 70 81 287 98 -162 -29 -120 -129 96 -55 85 14 -11 -143 139 -284 281 -38 -139 106 -30 49 -54 -52
3226 -52 -148 -73 112 17 -207 444 -71 311 -39 50 86 -34 -94 -17 -133 -3 4 101 80 167 81 100 83 80 244 167
3252 167 -291 14 -93 -40 -36 178 51 19 132 53 74 -223 65 -269 -145 -82 114 -224 169 50 183 -134
3274 -134 91 -86 131 70 165 -4 135 -48 -8 -10 250 20 -242 300 34 -120 -222 86 73 133 -98 112
3296 112 73 -309 34 19 13 -93 -178 16 66 285 147 -8 -99 -182 81 -298 -98 -313 -124 -76 -129 155 125 78
3320 78 14 24 -42 -6 -79 -238 -52 -335 427 -48 251 -276 -105 325 -142 94 379 35 137 67 179 -50
$$ packed form
3158A04k32K29r6p6r3Q4J69m15L39J99l07N5j80Q5P2L39n10J81J4m0J44q8N3L54
3182C84n89L5K46j08l32M02L1l78K49j52K78j24J90j72l03N9J83K97j18j25J17
3203G0J1K06j89k60J33r1rK25j51J40p1k5j32K82m23N65l19j01K45j36P9j03K
3226e2r6P5J85r5k24O51n15L82l50Q9L6j20o0P7j16J30PR7k1Q7q6J9j7lJ64p7
3252A67m58L05j07N3MK14j27l2J13p9K1k97K88l34J24O3J96l38L93j19J33l17
3274a34K25j77K17o1R5j69J39j83M0kK60k30k62N42k66j54j02L08j3O0k31K10
3296A12l9l82L43j5oj06q5J94N0K19j38j55r1q3K63l79K00k15J89M8n3K84l0m7
3320G8o4J0o6L6p3j59J86k83P62m75K99n27J71M30m67K36K85l44J02p0J12k29
$$ plain form
3342 -50 -218 -234 29 75 251 -8 14 68 -184 285 74 -237 69 217 -219 -233 87 -110 -105 -113 129 -106 -198 -102
3366 -102 136 159 -267 -119 -242 220 -116 5 148 127 68 149 214 73 144 -47 -197 12 111 -53 -453 -201
3388 -201 -126 64 210 -28 -176 -124 -223 -313 -44 99 294 -73 -283 -10 -142 65 -28 -329 141 -8 -20 -234
3410 -234 -66 -318 238 -201 -183 163 -214 -78 379 -335 228 108 -61 6 129 64 -69 -10 62 330 -103 -8
3432 -8 16 252 104 252 32 29 -32 -65 -133 64 -110 168 -184 120 153 69 -43 296 -13 18 34 52 -216 -27
3456 -27 -207 29 94 170 155 85 59 275 80 -90 -35 125 26 -110 -250 331 196 17 161 -191 -69 248 4
3479 4 -40 174 16 68 -14 252 -148 339 420 -123 -83 175 138 -220 -223 220 176 92 -261 -302 108 -218 -239 266 79
3504 79 17 61 201 -284 76 174 -126 -29 66 55 103 125 -77 184 439 152 42 -37 -171 43 112 -586 -267 111
$$ packed form
3342e0j68j6K63M6J76k59K2N4k52M69k11l11L06J48m36j4L20j97NqK42k35r2R6
3366a02K38K3m26J48j23M62l36J21J43k1n9Q1O5j41P1j91j50K09R9j64m00K52
3388b01P5J90J46k38j48N2r9r0K69J43J95l67k10K73j32K07r3l01M70j49j2k14
3410b34J68k52N56m39J8L46l77J36M57p14N63j20j69O7J23o5j33N9P2K68m33R5
3432hK4K36j48J48k20lo1l3o8J97j74K78l52L04L3q4j12L39l09L1J6J8k68J89
3456b7j80K36O5P6j5p0k6K16j95j70N5J60r9j36j40N81j35j79J44l52J22L17k44
3479Dm4K14j58N2q2K66m00M87Q1n43M0K58l7l58lM43m4q4l53m1M10l26k1N05j87
3504G9o2M4J40m85L60R8l00R7R5j1M8K2k02K61K55k87j10p9j34K14O9o98L19L78
$$ plain form
3528 111 173 -36 -77 -289 -17 -48 4 -56 -57 51 -97 58 -87 -214 -9 217 288 -66 50 -46 400 182 -49
3551 -49 190 249 12 -208 -121 110 -76 -121 -85 -80 142 -59 -102 210 -254 259 -13 -138 94 15 -29 23 -199 223
3575 223 -19 92 -95 -69 116 34 -153 -117 -14 -60 183 -268 -129 -15 -88 130 2 178 124 -11 120 -66
3597 -66 33 -42 -153 -284 283 -235 -109 16 114 -81 -99 -40 264 2 -48 -36 63 -14 -137 -310 -105 -60 -234 -231
3621 -231 -145 -189 113 126 -382 57 -136 -85 6 11 -77 -65 -130 153 161 157 -131 -24 37 -132 -116 -249 -3 2 231 -29
3647 -29 176 284 -223 -5 -182 -97 22 60 102 -151 78 54 228 175 60 -150 223 230 -37 -21 29 -126 -368
3670 -368 -17 -111 122 38 264 -195 -49 -28 96 99 -397 -59 215 7 19 -76 14 64 -70 50 215 180 191 -24
3694 -24 27 -57 191 33 -222 -152 -108 47 65 -93 197 -22 220 91 103 91 -128 -206 109 140 -147 83 353
$$ packed form
3528A11O2k09m1k12K72l1N2o0jJ08j48J55j45j27K05K26P1l54J16r6M46k18k31
3551d9K39N9k37k20Q7K31j86m5L6NK22k01m3L12m64N13k72j25K32p9m4N2k22M22
3575B23k42J11j87K6J85q2j87L6J03m6K43m51J39J14p3K18j28J76n4j35J31j86
3597f6R9p5j11j31N67n18J26J25R8j95j8N9L04k62n0J2R9p7j23j73K05M5j74L
3621b31Q6m4L02J3n08M39j93N1R1Nq8J2o5K83Qmk88J07O1j69J6j33K46NK29k60
3647b9K05J08n07K18j77Q5J19L8M2k53K29k4J74n3j15k10L73Pk67J6N0j55k42
3670c68L51r4K33q4K26m59J46K1J24Lm96L38K74k08J2r5R0N0j34J20J65l5J1k15
3694b4N1q4K48j58k55P0M4J55J8j58K90k19K42j29J2j2k19p8L15L1k87K30K70
$$ plain form
3717 353 80 209 -208 -232 117 -156 166 -112 52 417 -114 -235 43 -53 203 -37 6 60 -61 -23 317 -94
3739 -94 65 63 -145 101 -362 -86 -51 -16 69 -31 10 227 -15 51 -41 -94 4 -61 94 -148 226 -192 -190 236 145
$$ packed form
3717C53k73J29m17k4L49k73L22k78J64L65n31j21K78r6K56k40M3N4j21L8L40m11
3739i4J59kk08K46m63K76L5L5Q5j00M1K17k42O6r2n3R8o5J55k42L74m18KM26r1
$$ [...]
8191A12
##END NTUPLES=NMR FID
##END=
