##TITLE=1H_Pr NCO-Na
 200.13MHz,CDCl3 ,
 8 sc
 
 4.4.2025
##JCAMPDX= 6.0         $$ Bruker NMR JCAMP-DX V2.0
##DATA TYPE= NMR FID
##DATA CLASS= NTUPLES
##ORIGIN= UXNMR, Bruker Analytische Messtechnik GmbH
##OWNER= pz
$$ XWIN-NMR		Version 3.5
$$ Fri Apr  4 13:59:18 2025 Russian Standard Time (UT+4h)  she@DPX200
##.OBSERVE FREQUENCY= 200.1313
##.OBSERVE NUCLEUS= ^1H
##.DELAY= (6, 6)
##.ACQUISITION MODE= SIMULTANEOUS
##.ACQUISITION SCHEME= undefined
##.AVERAGES= 8
##.DIGITISER RES= 18
##SPECTROMETER/DATA SYSTEM= spect
##.PULSE SEQUENCE= zg30
##.SOLVENT NAME= CDCl3
##.SHIFT REFERENCE= (INTERNAL, CDCl3, 0, 14.3821)
##AUDIT TRAIL= $$ (NUMBER, WHEN, WHO, WHERE, WHAT)
$$ ##TITLE= Audit trail, XWIN-NMR		Version 3.5
$$ ##JCAMPDX= 5.01
$$ ##ORIGIN= Bruker BioSpin GmbH
$$ ##OWNER= she
$$ F:/spectra/data/she/nmr/H-C/1/audita.txt
$$ ##AUDIT TRAIL=  $$ (NUMBER, WHEN, WHO, WHERE, WHAT)
(   1,<2025-04-04 13:57:32.45 +0400>,<she>,<DPX200>,
      <created by zg, POWCHK disabled, PULCHK disabled
       configuration hash MD5:
       00 E9 B6 7A A2 85 ED C7 34 08 36 98 17 FE 4E 26
       data hash MD5: 16K
       B4 16 CF 4C 90 E4 52 51 A0 32 F9 DB B4 39 16 F7>)
$$ ##END=
$$ 
$$ hash MD5
$$ EC DD D1 F2 D3 B4 9A 36 BA 92 F7 75 78 4A FB 3E
##$RELAX= 
##$RELAX= 
##$RELAX= 
##$RELAX= 
##$RELAX= 
##$RELAX= 
$$ Bruker specific parameters
$$ --------------------------
##$DU= <F:/spectra>
##$EXPNO= 1
##$NAME= <H-C>
##$PROCNO= 1
##$TYPE= <nmr>
##$USER= <she>
##$AMP= (0..31)
100 100 100 100 100 100 100 100 100 100 100 100 100 100 100 100 100 100 
100 100 100 100 100 100 100 100 100 100 100 100 100 100 
##$AQSEQ= 0
##$AQ_mod= 1
##$AUNM= <au_zg>
##$AUTOPOS= <>
##$BF1= 200.13
##$BF2= 200.13
##$BF3= 200.13
##$BF4= 200.13
##$BF5= 200.13
##$BF6= 200.13
##$BF7= 200.13
##$BF8= 200.13
##$BYTORDA= 1
##$CFDGTYP= 0
##$CFRGTYP= 5
##$CHEMSTR= <none>
##$CNST= (0..31)
1 1 145 1 1 1 1 1 1 1 1 1 1 1 1 1 1 1 1 1 1 1 1 1 1 1 1 1 1 1 1 1 
##$CPDPRG= <>
##$CPDPRG1= <>
##$CPDPRG2= <>
##$CPDPRG3= <>
##$CPDPRG4= <mlev>
##$CPDPRG5= <mlev>
##$CPDPRG6= <mlev>
##$CPDPRG7= <mlev>
##$CPDPRG8= <mlev>
##$CPDPRGB= <>
##$CPDPRGT= <>
##$D= (0..31)
0 0.7 0 0 0 0 0 0 0 0 0 0.03 0 0 0 0 0 0 0 0 0 0 0 0 0 0 0 0 0 0 0 0 
##$DATE= 1743760651
##$DBL= (0..7)
120 120 120 120 120 120 120 120 
##$DBP= (0..7)
150 150 150 150 150 150 150 150 
##$DBP07= 0
##$DBPNAM0= <>
##$DBPNAM1= <>
##$DBPNAM2= <>
##$DBPNAM3= <>
##$DBPNAM4= <>
##$DBPNAM5= <>
##$DBPNAM6= <>
##$DBPNAM7= <>
##$DBPOAL= (0..7)
0.5 0.5 0.5 0.5 0.5 0.5 0.5 0.5 
##$DBPOFFS= (0..7)
0 0 0 0 0 0 0 0 
##$DE= 6
##$DECBNUC= <off>
##$DECIM= 32
##$DECNUC= <off>
##$DECSTAT= 4
##$DIGMOD= 1
##$DIGTYP= 9
##$DL= (0..7)
0 120 120 120 120 120 120 120 
##$DP= (0..7)
150 150 150 150 150 150 150 150 
##$DP07= 0
##$DPNAME0= <>
##$DPNAME1= <>
##$DPNAME2= <>
##$DPNAME3= <>
##$DPNAME4= <>
##$DPNAME5= <>
##$DPNAME6= <>
##$DPNAME7= <>
##$DPOAL= (0..7)
0.5 0.5 0.5 0.5 0.5 0.5 0.5 0.5 
##$DPOFFS= (0..7)
0 0 0 0 0 0 0 0 
##$DQDMODE= 0
##$DR= 18
##$DS= 0
##$DSLIST= <SSSSSSSSSSSSSSS>
$$ [...]
##$SUBNAM0= <"">
##$SUBNAM1= <"">
##$SUBNAM2= <"">
##$SUBNAM3= <"">
##$SUBNAM4= <"">
##$SUBNAM5= <"">
##$SUBNAM6= <"">
##$SUBNAM7= <"">
##$SUBNAM8= <"">
##$SUBNAM9= <"">
##$SW= 18.0517328524113
##$SWIBOX= (0..15)
0 0 2 0 0 0 0 0 0 0 0 0 0 0 0 0 
##$SW_h= 3612.71676300578
##$TD= 16384
##$TD0= 1
##$TE= 0
##$TE2= 300
##$TE3= 300
##$TEG= 300
##$TL= (0..7)
0 120 120 120 120 120 120 120 
##$TP= (0..7)
150 150 150 150 150 150 150 150 
##$TP07= 0
##$TPNAME0= <>
##$TPNAME1= <>
##$TPNAME2= <>
##$TPNAME3= <>
##$TPNAME4= <>
##$TPNAME5= <>
##$TPNAME6= <>
##$TPNAME7= <>
##$TPOAL= (0..7)
0.5 0.5 0.5 0.5 0.5 0.5 0.5 0.5 
##$TPOFFS= (0..7)
0 0 0 0 0 0 0 0 
##$TUNHIN= 0
##$TUNHOUT= 0
##$TUNXOUT= 0
##$USERA1= <user>
##$USERA2= <user>
##$USERA3= <user>
##$USERA4= <user>
##$USERA5= <user>
##$V9= 5
##$VALIST= <valist>
##$VCLIST= <CCCCCCCCCCCCCCC>
##$VD= 0
##$VDLIST= <DDDDDDDDDDDDDDD>
##$VPLIST= <PPPPPPPPPPPPPPP>
##$VTLIST= <TTTTTTTTTTTTTTT>
##$WBST= 1024
##$WBSW= 4
##$XGAIN= (0..3)
0 0 0 0 
##$XL= 0
##$YL= 0
##$YMAX_a= 214107
##$YMIN_a= -242312
##$ZGOPTNS= <>
##$ZL1= 120
##$ZL2= 120
##$ZL3= 120
##$ZL4= 120
##$ABSF1= 10
##$ABSF2= 0
##$ABSG= 5
##$ABSL= 3
##$ALPHA= 0
##$AQORDER= 0
##$ASSFAC= 0
##$ASSFACI= 0
##$ASSFACX= 0
##$ASSWID= 0
##$AUNMP= <proc_1d>
##$AZFE= 0.1
##$AZFW= 0.1
##$BCFW= 1
##$BC_mod= 2
##$BYTORDP= 1
##$COROFFS= 0
##$CY= -3
##$DATMOD= 1
##$DC= 2
##$DFILT= <>
##$DTYPP= 0
##$F1P= 0
##$F2P= 0
##$FCOR= 0.5
##$FTSIZE= 0
##$FT_mod= 4
##$GAMMA= 1
##$GB= 0.15
##$INTBC= 1
##$INTSCL= 1
##$ISEN= 128
##$LB= 0.25
##$LEV0= 0
##$LPBIN= 0
##$MAXI= 10000
##$MC2= 0
##$MEAN= 0
##$ME_mod= 0
##$MI= 1.114404
##$NCOEF= 0
##$NC_proc= 0
##$NLEV= 6
##$NOISF1= 3.799351
##$NOISF2= 2.8
##$NSP= 1
##$NTH_PI= 0
##$NZP= 0
##$OFFSET= 14.38212
##$PC= 1
##$PHC0= -827.1793
##$PHC1= 7.792207
##$PH_mod= 1
##$PKNL= yes
##$PPARMOD= 0
##$PSCAL= 0
##$PSIGN= 0
##$REVERSE= no
##$SF= 200.129724274929
##$SI= 16384
##$SIGF1= 3
##$SIGF2= 2
##$SINO= 400
##$SIOLD= 16384
##$SREGLST= <1H.CDCl3>
##$SSB= 0
##$STSI= 0
##$STSR= 0
##$SW_p= 3205.1282051282
##$SYMM= 0
##$S_DEV= 0
##$TDeff= 0
##$TDoff= 0
##$TI= <>
##$TILT= no
##$TM1= 0
##$TM2= 0
##$TOPLEV= 0
##$USERP1= <user>
##$USERP2= <user>
##$USERP3= <user>
##$USERP4= <user>
##$USERP5= <user>
##$WDW= 1
##$XDIM= 8192
##$YMAX_p= 0
##$YMIN_p= 0
$$ End of Bruker specific parameters
$$ ---------------------------------
##NTUPLES= NMR FID
##VAR_NAME=  TIME,          FID/REAL,        FID/IMAG
##SYMBOL=    X,             R,               I
##VAR_TYPE=  INDEPENDENT,   DEPENDENT,       DEPENDENT
##VAR_FORM=  AFFN,          ASDF,            ASDF
##VAR_DIM=   8192,          8192,            8192
##UNITS=     SECONDS,       ARBITRARY UNITS, ARBITRARY UNITS
##FACTOR=    0.0002768,     1,               1
##FIRST=     0,             0,               0
##LAST=      2.2672688,     0,               0
##MIN=       0,             -242312,         0
##MAX=       2.2672688,     214107,          0
$$ Real data points
##PAGE= N=1
##DATA TABLE= (X++(R..R)), XYDATA
0@%%%%%%%%%%%%%%%%%%Oj4J6j6J6j6J8k4L0l2L7m5M9n5O3p1Q2r1J00j13J26j40
40g4J56j72J91k11K33k58K85l15L46l80M17m59N08n62O21o89P69q59R65j095J252
61F69j446J697k038K523l261M512p011J3778o5748j85987J97690K25023j11343
74F9058j42170M3137N7563j7449M279K5119p8409l9523Q3858Q2535l9609r8368
86d9979k0250N1332N5782k4068m3147J9782K9665m850j4957K3317j8401m4020
98c9794L8953O0804l5999o4656M2236L5145n1773j2568N8304j029p9099J3452
110c6024P3793k2036o1304L4885O5955l6896n3810K9445M8560l2267n4641M1924
122b416O6245k3813p2028Q120O0798j9610o2865J9468O7083k1915n3824K9113
$$ y = [0, 0, 0, 0, 0, 0, 0, 0, 0, 0, 0, 0, 0, 0, 0, 0, 0, 0, 0, 6, -8, 8, -8, 8, -8, 10, -14, 16, -16, 21, -24, 25, -30, 33, -38, 44, -47, 53, -60, 66, -74, 82, -90, 101, -110, 123, -135, 150, -165, 181, -199, 218, -241, 267, -295, 326, -363, 406, -453, 512, -583, 669, -777, 920, -1118, 1405, -1856, 2656, -4355, 9423, -56325, -242312, -44622, 180401, 69058, -73112, -29975, 27588, 10139, 14418, 39537, -38872, -78395, 5463, 87998, 48389, -49979, -70229, -18897, 36885, 12817, -30330, -10548, 19117, 14267, -690, 22627, 4226, -39794, -841, 59963, 23964, -40692, 1544, 36689, -15084, -27652, 30652, 29623, -49476, -36024, 37769, 15733, -45571, -10686, 55269, 18373, -35437, -5992, 42568, 10301, -44340, -2416, 63829, 40016, -32012, -23892, 36906, 17296, -45569, -26101, 40982, 19067, -34757, -5644]
134e644L9736l1649l6343L3879K7160k4888n506K4761n317k3312J7876J7809k3010
147E552k1552J1677J9999q922j7399K961J6563M935j6133j0672R664P175j0953
160g105R033K5862j1910k2967J4872J8700k4951j9455K8774J4233k9140l624L3455
173B5777j3044m5458J1802M4903m489m0479J242L5649O059k2572p691J1024Q109
186A0832L467l06n998r259l999J4744J0954j5234j8026P838J6730o111j7444O07
200a1205J2783O44N9Q532n260j3016M716J6637J597j3961k384J2479K839j1050
214C410m435K012l16j102J412K293n177o771N283P614m596l816Q805N302p977
229A941n036J1054O616j4052m866J5484M998j3983q596N658M052m969k519K953
$$ y = [-5644, 34092, 2443, -33900, -21, 27139, 2251, -3255, 21506, 16189, -7123, 10753, 28562, 5552, -16000, -4323, 15676, 6754, -10645, -7684, 8879, 13814, -2319, -12991, -3327, 3848, -7105, 1928, 27790, 15880, -7087, 7785, 26485, 1534, -17921, 10853, 25086, -4054, -7678, 25777, 12733, -32725, -20923, 23980, 19491, -20988, -19746, 15903, 21962, -610, -8301, 2723, 10832, 14299, 13993, 7995, -1264, -5263, 9481, 20435, 5201, -12825, -4987, 11743, 5632, -11812, -11205, 1578, 2222, 2281, 10813, 5553, -7463, -2747, 13890, 15487, 1526, -858, 11621, 14460, 3410, -1025, 987, 671, -431, 981, 3274, -1903, -8674, -3391, 4223, -373, -4189, 4616, 9918, 1941, -3095, 7959, 14575, 523, -4343, 11141, 16139, 2156, -6440, -782, 3270, -1699, -4218, -1265]
243a265j457m93N663r91o491J264P322L256l395k351M882L446l977m065Q89K292
259D529m01n600j092L212j684l117J540J053j596K4K875J801l168O37O962q9l852
276B034K130K696k934l480J225J682l349l220L687J086n226k291J875K223p3j480
292c415J554L414O90L58k2j189J267J805j12j288k196j54J744k191l400L73N63
309b199p36j021k85J818k06o02L303K074j169M27P72O36K43o69J00J58j572P12
327A784p00l518j261j07P68N54j692K86K427M28o15O48P37J378J025M23Q87n39
345B913j494J042l22k175qj151j331k3n92n7r39j00K564Q52j185M09P75J098K034
364B310l1m57P54O30k16j982j979M24n87q56J081j540j974J117Q44j388l3J648
$$ y = [-1265, -2722, -3215, 2448, 1457, -5034, -3770, 3552, 6808, 3413, 1062, 5944, 9390, 5413, 1348, 2237, 4529, 4128, -1472, -2564, 648, -1036, -4153, -2613, -1560, -3156, -3132, -257, 1544, -1624, -987, 5975, 5886, 2034, 4164, 6860, 3926, 446, 1671, 3353, 4, -3216, 471, 1557, -3669, -5960, -4085, -1862, -1935, -3415, -1861, 1553, 2243, 2601, 2579, 1390, 2657, 4462, 4350, 3062, 866, 712, 2456, 265, -3135, -2762, -2199, -2935, -3956, -4241, -2423, -2629, -3231, 72, 2146, 977, 1404, 2176, 2812, 3055, 2386, 2486, 2644, 1072, 1784, 1084, -2434, -3695, -3802, -3034, -2480, -4172, -3886, -1459, -1031, -1646, -998, -261, 1117, 2142, 2565, 3452, 2913, 1419, 2461, 2139, -36, -44, -1195, -2526, -2549, -3141, -3198, -4137, -4237, -1673, -821, -2006, -1597, -822, 276, 2310, 2279, 1822, 2576, 3206, 2990, 1008, -971, -547, -1134, -1990, -909, -2449, -4423, -3306, -2462, -3850, -3883, -2235]
382b235J893K41M10J450m38p33K607L67k456j54N09r74r27j347m26p36k69J209
400b009q51j812J452J457M73J563K84n93J107J421j76k69n40J95l46r4j22k890
418a750j638J296j55n34J340j627k515K247L797j15k367J358L650k53n95P50l191
435c02r11M823O89m869r95J202k399r56L011m20n707J560P917j889n834L879L629
452B428k675J232M091k983m429M211L551n219j091M782m241o111M482K474o230
467e728P91O982k409m942N289M481q380l073J0047M399m626M6l17m596K447N118
483E529n447p514M929O773l603m192J685l820k491R850N246r672n871Q090P939
498G431j159m733l557k70N851M470o834p400M355M708j356k48k527p746J33J0264
$$ y = [-2235, -342, -101, 309, 1759, 1321, 588, 3195, 3562, 1106, 952, 1461, 487, -440, -1787, -2213, -2949, -3218, -2009, -2860, -4672, -3220, -1763, -1290, 273, 557, -36, 1071, 2492, 2316, 2047, 1507, 1702, 1356, 1262, 1140, -1750, -3388, -2092, -2247, -2781, -1441, -3068, -5583, -3336, 461, 346, -2021, -663, 2987, 2734, 2139, 2889, -302, -1213, 3610, 4299, -570, -1565, -363, -2762, -3718, -707, -1127, -6834, -5274, 2643, 754, -5080, -1201, 2428, -247, 985, 5076, 2093, -2336, 1875, 5426, 207, -884, 3898, -343, -6454, -1972, 502, -5728, -4937, 2045, -364, -5306, -17, 4464, -3916, -6989, 3058, 7457, 2831, 2877, 2560, -2036, 411, 5529, 82, -7432, -2503, 4270, 667, -3525, -1840, -5660, -8151, 1699, 6945, -2727, -8598, -508, 7431, 6272, 1539, -2018, -2288, 3563, 8033, 1199, -6201, -1846, 2862, 1506, 1258, -1269, -9015, -8882, 1382]
514A382L813p337k933N973K669j742q52l185p6P787K492o180j501J699m201l038
530e230O152K473p628j167P589j763o699L526L496k208J938M197l732k682N337
545C599K73o123M118Q450q366j1014P530O716q059k775P689L52o143N59K239m362
561e317N81Q307J382l061K490j062o984J364O140k168k546O411K295r990n257
576g415N132M50l554L853M801k654j759R66k075j801L782L829j3m00J600k890
592A852l993K276K408k087r44Q92J49k450k625M99L515J341j474q30K387K28m467
609c323O51P160J781l931J4M98l103j624J758p6j182K843J920m705l463J866q26
626c742o19N410L305m064p79L421j573l459L207K886l360J00N089k951p102K012
$$ y = [1382, 5195, -2142, -5075, 898, 3567, 1825, 973, -2212, -2288, 5499, 7991, 1811, 310, 2009, -2192, -5230, 922, 3395, -4233, -5400, 2189, 426, -6273, -2747, 749, -1459, 479, 4676, 944, -1738, 3599, 3872, -2251, 1867, 10317, 1951, -9063, -1533, 5183, -2876, -5651, 2038, 2390, -3753, -3194, -955, -5317, -4736, 3571, 4953, 1892, 4382, 3320, -3664, -2300, 3840, 1672, -874, 5537, 7832, -2158, -7415, -2283, -1833, -5387, -1534, 3267, 613, -1146, -180, -2255, -4056, -274, 3555, 3542, 3142, 4742, 1852, -2141, 135, 2543, 456, -488, 404, 553, -1897, -4522, -4023, -508, 833, -641, -1471, 916, 1144, -3323, -2672, 4488, 6269, 2338, 2352, 2850, -253, -1877, -119, -195, -1377, 1466, 3386, -1319, -4782, -2916, -3742, -4361, 1049, 4354, 290, -489, 2932, 1359, -2100, 1107, 3993, 633, 733, 5822, 2871, -4231, -2219]
642b219L710l428j082L845j284m474L481M465m581k658P028J554o069R62N161
657D411k011k891L203J735m530j689K487j729k631L447J503l633j1K298j608j365
673c014K511J801j009P23L043j708l107J913R52j826P53J869k982k412J895R20
689C22k610j379K732Q19j644J066Q72j454J290K093l49j062O10J031o83j193O49
706A110O0p61k70j256j068J001N7j398R32J684m83q83O83R96n08O98J900k40j497
725G57J472L83k433n51J154o14j400M47M69j209j088J230M56q66J087R90m71O68
743D81J160n99m18J042M83r83r93R79m30j416L97L4j670L63J072r80r82J085J594
762B19k41p83J307P08q80R43P17o66n89N49qn75p88l78m19k65J14O6o96j0O31
$$ y = [-2219, 1491, -1937, -3019, 826, -458, -4932, -1451, 3014, -1567, -4225, 2803, 4357, -1712, -750, 4411, 2400, -491, 2712, 4447, -83, -1772, 715, -1014, -3645, -198, 1305, -2328, -2339, -41, -1649, -3014, -503, 1298, 289, 1012, 4055, 2347, -760, 1153, 2105, 279, 1032, 2901, -81, -2493, -598, 322, -2288, -3667, -935, -116, -1760, -694, 178, -1276, 14, 2107, 1758, 696, 1306, 2337, 1654, 461, 1110, 1170, 409, 139, -1117, -2185, -1184, -1127, -2525, -1593, 91, -392, -1275, -592, 404, -104, 594, 2494, 2254, 757, 2229, 2612, 179, -372, 782, 168, -1232, -785, -316, -1525, -2613, -1383, -927, -1793, -706, 284, -187, 481, 1641, 1042, 624, 1666, 2149, 1166, 173, 1152, 722, -694, -297, -263, -1933, -1570, -498, -1478, -2460, -1375, 219, -22, -805, 502, 1210, 330, 1273, 1990, 1324, 735, 1284, 1276, 701, -87, -465, -884, -1149, -1035, -969, -1665, -1675, -1044]
783a044J22N50J14j04Q89O03J62j76k28P71p6r70O1l12p98j64J05o27j88l45J78
804a477N21p5K42L18K12N96P49j40J54p7P3O52p08p42M1j63l86o52m04J71l0l71
826a496L56j0O9Q23K79J40L91J62L97L04l34r6L8l52o6l14o13j79k69k10m2j47
848a169k36K36K05O48J16j68O01P34M1L16j09l37K05K38l92m34p09r0j73n42J39
869h80j41n32K96Q20j35j46O30K12M93L19K69km77L93L20q71j43k96n80q8l9m41
891a019l68n1N41Qj85N64N69l20P59M83j97N32o9m30J37P6m21o12m19K91l15q34
913a280O25l63j082J160J001n68j69P66M98j85M25N65q94l38J867k2k211m4M84
932B35r36k08J099q61j407M83J793r55j253J831O77q97J130R89j483l51K004k7
$$ y = [-1044, -922, -372, -258, -362, 527, 1130, 1292, 1116, 888, 1659, 1583, 613, 674, 362, -436, -600, -495, -1122, -1310, -1655, -1477, -956, -1031, -789, -471, -259, 337, 1086, 946, 1100, 1023, 1096, 1748, 1040, 298, 339, 176, -210, -862, -1266, -1095, -1125, -1496, -1140, -1150, -1081, -258, 21, 161, 552, 714, 1111, 1415, 1081, 985, 1023, 671, 605, 291, -322, -501, -770, -980, -1022, -1169, -1405, -1169, -964, -316, -200, -368, 233, 967, 1008, 1324, 1215, 878, 1083, 1321, 929, 495, -214, -304, -477, -1019, -880, -1021, -1553, -1257, -437, -572, -718, -88, 124, 617, 936, 1205, 1203, 726, 1119, 1439, 568, 425, 129, -451, -539, -578, -1019, -1387, -1438, -897, -889, -1074, -510, 59, -261, 498, 981, 784, 1316, 1247, 817, 954, 1030, 609, -3, -422, -131, -446, -1280, -655, -1018, -2100, -940, 61, -507, -676, 90, 588, 403, 828, 1393, 499, 161, 2028, 2006, -205, -249, 235, -701, -909, 190, -671, -2078, -1595, 198, -757, -2010, -179, 498, -399, 731, 1720, 237, -114, 1890, 1863]
950A863j894L75J089j615j221J748q9k329P67J798j522j516J756J008r78M02K014
967A656j08j639P33N91j365N64J563r99r09L57j60j829l83R85K26n32J148N10
985D09j540k08J314J04R5Q50K77r6J57k13q83l61O12N8j005J32l10n15L7P8j94
1006a202O89M61q09K6J138L40o01R78J480j528j724J686M65k123L52J733j030
1023C31j446Q41m4j926M9K244k72j240K257O05k296L50K326p14j318J580R90k144
1041A73p62J955j001k087J488R13k453k45J738l15j111K086J047k485n24K662
1057A079j22j936K055K252k057j186J158j073k429R79K246n64j108Q17l66k213
1073b468L88J442k65O88J959j43j197P5j53n44J55J627K81j050n9m58j718k37
$$ y = [1863, -31, 344, 1433, -182, -1403, 345, 256, -2073, -1306, 492, -1030, -2546, -790, 218, -760, -358, 1656, 1548, -91, 642, 1233, -132, 432, 1995, 996, 87, 444, 284, -1545, -1928, -943, -717, -1249, -101, 409, -1131, -1339, -25, 79, 174, 1024, 1301, 1205, 1362, 1149, 266, -95, 517, 575, -430, -298, -608, -1123, -1086, -1008, -1202, -513, -52, -861, -835, 303, 643, 42, 1020, 2500, 972, -752, 934, 1399, -724, -372, 1361, 331, -1115, -274, -318, -2244, -2195, 49, -223, -1463, 794, 1399, -897, -547, 1779, 1065, -253, 1327, 2317, 173, -589, 1366, 365, -1722, -234, 679, -1774, -2019, -281, -596, -1707, 379, 1426, -1059, -1583, 1079, 957, -979, 1076, 3328, 1271, 85, 1243, 170, -2259, -1280, 966, 402, -706, 111, -255, -2468, -2080, -638, -903, -215, 1744, 1601, 404, 479, 326, -218, -63, 1564, 1845, 795, 736, 278, -1440, -1677]
1091a677J301j81jM51p7j030k7Q75J45J16J663L23j487l14M54n50M45J035l31
1110A133j040qn09j399k36J614J21j73J382J75k592l94K201K33q25J797J658j982
1128A156j408R38l73j983J412K087j714j099J214p76j720K82K091n43m86J752
1144H30L65j886L62J827q71o08J482k3j502k20J320j426j085J620M14k092k27
1161a720J785q80q81J825R44j392k25J633l88j177J092J409j132o79R95r84j183
1178i58J58O56o01k52P79k13o07J26N22o3J92Q56r9j05M88q7n45M21M09n75m68
1199C4K69k02q22J25K85m47j89N12l34j66M38K59K40M88M53k77k61J44L07p85
1219G1P17J80j031r2L92o33p17K33P16n91k5R20q8r90O19R50l68j80R23J10p67
$$ y = [-1677, -376, -557, -558, -107, -184, -1214, -1241, -366, -221, -105, 1558, 1881, 394, 80, 534, -16, 429, 1464, 1133, 93, 85, -424, -1823, -2059, -445, -324, -497, 885, 1060, -1532, -1926, 275, 508, -317, 1480, 3138, 1156, -252, 686, 313, -1670, -258, 1829, 115, -984, 230, -546, -2266, -1984, 107, -436, -922, 830, 1195, -691, -329, 1498, 627, 19, 1501, 1478, -24, -244, 1076, -350, -1435, 185, 599, -1493, -1720, 65, -815, -1696, 129, 1073, -319, -544, 1089, 701, -476, 616, 2025, 893, 214, 1209, 225, -958, -800, -144, -745, -997, -218, -431, -1038, -912, -390, -453, -261, 595, 496, 391, 879, 792, 247, 668, 1077, 502, 34, 303, 101, -721, -596, -311, -758, -947, -435, -769, -935, -497, -238, 2, 490, 943, 666, 405, 549, 856, 71, 788, 968, -63, -155, 237, -396, -1113, -880, -164, -755, -780, 140, 52, -938, -319, 631, 263, 83, 1006, 1116, 349]
1240C49R1N62n79n07K11K24r18j7K04m89j45O92j42j15L68M12p3o0Q43k5o64L79
1262F01L96o60k54J62k26k96p5Kr8n95L36M00k72LN10N5j1L56N8R7J90j04J20
1285F95k20j92K9k71j36o5l59P4ql45N1K95j34J90K17L94j4l4L88L45l84n3K4
1308D87j26j94mk41k10j6k9j64j47K15p7J59K0K21Q6K42K03j46L75K5q8J2j23
1331D80j17j00k69r8L0l05l29K72o7lJ04p5K39R1K06K64K6K22j31M4J51O6k93
1354D08k56j6k91r6J2j35j62j40J73K27l55J85M30m7K36K34J42q7M6K6K16l74
1376C76j63J69m10j44j11j28q6j5PM5J61m6J78K06n5M35n6K5J68n8p1N3k73o0
1400A47L4k61n5k83R5o6j43J67j03L9Q5O22k85J27L51P1j26J17J23k14k93K39
$$ y = [349, 440, 1002, 423, -84, 127, 351, -567, -584, -380, -869, -1014, -322, -464, -579, -211, 201, 128, 68, 911, 886, 222, 601, 997, 337, 83, 245, 19, -277, -352, -350, -448, -1043, -707, -307, -579, -576, -66, -11, -22, 334, 392, 489, 679, 575, 695, 475, 283, 312, 41, -95, -160, -519, -445, -453, -798, -747, -452, -586, -396, -179, 215, 201, 167, 555, 900, 516, 463, 487, 361, 167, 163, -78, -288, -304, -333, -497, -644, -429, -506, -347, -327, -106, -20, 222, 425, 279, 654, 679, 591, 603, 480, 363, 263, -6, -104, -74, -379, -708, -436, -503, -506, -402, -477, -238, -147, 59, 323, 349, 571, 440, 484, 635, 701, 408, 152, 136, -155, -251, -239, -374, -536, -676, -503, -276, -631, -446, -16, -63, 173, 407, 549, 462, 508, 534, 750, 376, 213, 382, -28, -172, -283, -411, -497, -512, -505, -460, -299, -345, -167, 39, -16, 419, 363, 388, 556, 498, 427, 480, 207, 147, 181, -80, -135, -418, -323, -389, -532, -365, -468, -429, -344, 278, -7, 120, 471, 542, 416, 533, 656, 442, 149, 388]
1422C88l9o21P2K76m14m68K08K06j76J52M71j17j51N12R4l32J86N59k20l84K14
1443D16Q0m80j16O9k4n99K27K30m38j81N98j76J58K55N5j83K77L29Q9l16L68N5
1465F93k91l87J9l39j19J99oo4J84k47k72J01K41J98R2N11J05k02k15J74q5k49
1487D1N46j0l71k32P2o02j17L35ml11M38K89n25j03Q91K4o11M91O22l29m66M02
1509D70Q2m73K43M76r57n42N81j23p32K85J087n26r80R76M50j163N99J348k33
1528H68r61Q94K14j008l77Q03n7j002N11O16j102l65J000l88p70Q88P17q23j53
1547d95J151J12j023O97O16q29m80R03R6j118M82O04r51o39M71J31q67N62J201
1566F24o36m89N79L74j076M40P80J33k81K38K42r00m51O40n30j38O73l4n81m3
$$ y = [388, 349, -272, -200, 76, -338, -806, -598, -392, -568, -416, 55, -62, -213, 299, 393, 61, 247, 806, 586, 202, 416, 496, 16, -100, -31, -55, -654, -427, -197, -635, -816, -218, -394, -236, 19, 74, -109, 168, 497, 586, 270, 638, 693, 402, 15, 34, -305, -424, -225, -231, -295, -111, -358, -630, -529, -288, -90, 2, 513, 618, 416, 201, 375, 290, 41, 587, 577, 206, -26, 46, -556, -673, -338, -342, -653, -215, 74, -451, -554, 337, 361, -250, 241, 863, 534, 68, 470, 552, 79, 322, 798, -159, -701, -120, -243, -975, -690, 397, -129, -1109, -133, 317, -846, -247, 1101, 868, -93, 801, 1015, 7, -370, 433, 376, -626, -115, 501, -601, -966, 34, -354, -1124, -236, 481, -342, -495, 656, 768, -255, 442, 1058, 229, -251, 652, 748, -370, 112, 716, -235, -874, -403, -272, -1139, -577, 624, -12, -501, 78, 452, -624, -184, 596, 729, 448, 686, 928, 28, -423, 217, -313, -451, 222, 188, -393, -436]
1586d36J7m35J01Q84o2p8N04j48k61j35P50k11j80L02j91o58J14J26m26j24O39
1607I2O1o52O6J14m19J62J061L08m60L87qr35R4N61l3k14M56J51j098n53O80m57
1629f36n60J073P64j061j83O38j88p14P75R55k71l66P26m76q87N55J44m48j3M36
1649B63k12p42J76M57o47J49P83l65l15M05L70j58r1P22N4q46L59N1n65r1L94
1670A51k4k78P1k44l97j7M72j4R0M12J02n45L78K48k68K9N54k57l38L76j66n04
1692a69k49M82l89j96M73o2k81k32P31k95j89O77J53o41L68N21l21k97L00J58
1712E42p45J42L20n06l46O02l9m93JL80o9k95K93O14l96J11N64m83l21N13J52
1733E41m56j00J72Q1q39L46O6m52J92N65l20l10L83J97j89K36R8M15m87J01K91
$$ y = [-436, -419, -854, -753, 131, 69, -9, 495, 347, 86, -49, 701, 490, 310, 612, 421, -237, -123, 3, -423, -547, 92, 153, -499, -433, -319, -738, -576, 485, 793, 333, 720, 712, -223, -129, 432, 399, 185, 641, 792, -306, -859, -179, -636, -1196, -123, 641, -420, -603, 35, -153, -867, -92, 863, 592, 226, 952, 476, -411, 144, 288, -160, -173, 263, 51, -691, -515, -58, -705, -556, 227, -138, -453, -48, 322, 164, 73, 795, 849, 3, 362, 413, -152, -243, 151, 127, -151, -80, -324, -721, -738, -266, -280, -190, 222, 324, -221, 157, 405, 137, 166, 720, 463, 125, 501, 335, -169, -418, 64, -325, -521, -48, -110, -391, -623, 108, -187, -376, 301, 454, -187, 181, 702, 381, 84, 384, 542, -203, -61, 259, -247, -593, 9, -30, -523, -522, -142, -211, -506, -213, 401, 5, 116, 680, 197, -124, 389, 541, 85, -15, 157, 238, -601, -255, -189, -641, -449, 116, -204, -514, -131, 66, -123, 113, 211, 626, 139, 240, 531]
1754E31l50j16K76j49k90J58j08k07r2N2J65k99L6L96m1M0J56Q5N9L50k69o7j37
1777A79J66k02j43L4j03N9l49J04j29k5J99r7JJ77J94r7K30j2P0K4jJ72k78Q0
1801B53O1j60j86k53k8J4P%K6j00J19J35L7N8K55r1L8J33L4p7m1J79k93j03L5
1826E2K8k41j30J03l16J80J56k2j2J34qN2J07K4K07J11k17o4J43j5L2l27%r3j21
1851b37j49Q6J64j13j6j7J42R3k34M06O2M3J0O6J81k96l4j28l0Q8k78J66q1k16
1875c22k6rJm2K26Q2O8J12N0J29R8o1r1q2J41j19P8j95j41J7j02Lm8n3o0l7J59
1902b24J96O4j07K35K61j60oQ3j48M2k5l00J21k37L68m76P5J92k69KJ87J7l5q7
1926b31K47L03j81LK22k1l14J20K2l03J57J70k63q3o1K28m45RM22j58j53M68O4
$$ y = [531, 181, 65, 341, 192, -98, 60, -48, -255, -347, -295, -130, -429, -393, 3, -38, 2, 158, 243, 302, 652, 383, 316, 179, 345, 143, 0, 34, -69, -10, -359, -255, -384, -409, -210, -307, -306, -129, 65, -32, 198, 186, 256, 280, 279, 451, 173, 253, 314, 154, -32, -285, -313, -299, -292, -292, -266, -366, -247, -112, -75, -17, 238, 147, 185, 318, 352, 275, 234, 413, 120, 17, 52, 80, -161, -291, -188, -504, -324, -168, -190, -202, -68, -76, -24, 83, 107, 314, 425, 208, 144, 287, 272, 304, -23, -23, -116, -237, -386, -300, -136, -249, -265, -282, -140, -47, -281, 125, 187, 230, 240, 306, 487, 191, 157, 29, -1, 87, -191, -25, -106, -322, -348, -357, -356, -398, -172, -90, -22, 90, 140, 269, 367, 306, 215, 133, 274, 155, 233, 38, -103, -86, -188, -185, -233, -286, -346, -383, -224, -28, 36, -71, 164, 425, 265, 259, 342, 194, 236, 211, -89, 32, -205, 163, -313, -238, -46, -315, -313, -126, -109, -144, -231, 16, 319, 138, 141, 363, 342, 28, 148, 170, -133, 24, 194, -69, -152, -213, 15, -430, -421, 1, -157, -310, 158, 222]
1949B22l09K54rJ02n5J1J20j03k89J40J0o8j19M9l75p3J76J02N2oK92r6r5O0M3
1974C6m6J06M15k25m3K44m01j42j98K14O7l9J3j95k65K19j30J02K36pJ78K6J22
1997B87j29m9K7K26l92K71L1l33l35K51J13j84J05L8l7k09L91O9k47J18K65p1
2019B06k13K94P1n37K87M08k94j36k0K39o74J5Q3J66k86K98L51m74J6L43j43j13
2041a13K86L13j12k27K88l10l88J28J64j32j51J32Pj03k59L18L0n8K58m4j45L05
2063A87K42k22m9J05j34j17J56oj65mj25k51J36J40k09K3K73jk30L65J20l92Q2
2086g6L43Q2l26N4L87n52j32K06J19l30K23Q8m44j3K50q4k19M31L48n03R2M20
2108C64m9m87N56K74l54k75M28k62n60pO07k36k95M04j57p18N40L33k19j93P67
$$ y = [222, -87, 167, 158, 260, 205, 216, 336, 233, -56, 84, 94, 26, -93, -44, -419, -492, -316, -214, -162, -168, 124, 28, -67, -7, 36, -10, 96, 511, 286, 243, 487, 86, -56, -254, -40, 27, -12, 1, -194, -459, -240, -370, -268, -32, -39, 139, 165, 287, 158, 109, 136, 362, -30, 241, 272, -61, -396, -145, -32, -216, -111, -73, -110, -319, 72, 141, -106, 12, 277, 206, -7, 287, 358, -179, 108, 516, 222, 86, 66, 305, -369, -354, -271, -105, -391, -93, 258, -216, -200, 143, 0, -113, 173, 486, 374, 147, 435, 125, -263, -135, 29, -103, -254, -122, -115, -218, -477, -159, -129, -187, 71, 27, -118, 187, 429, 207, 158, 263, 129, 12, 168, 162, -3, -7, -132, -383, -247, -107, -316, -293, -20, -21, -251, 114, 234, -158, -76, 267, 349, 23, 77, 464, -88, -220, -14, 105, -225, -2, 86, -358, -371, -121, -205, -424, 7, 355, -148, -56, 364, 315, -172, 384, 658, 304, 29, 457, 195, -365, -372, 235, -1, -296, 108, -49, -767, -227, 106, -113, -306, 461]
2129D61O0m32q7K67l10k12N52K59p70J95M05o21j78M03Q2l31N2N15m56k98L18
2150a26L0J20rN26m03kQ5ol11J36K08j85k66K58k96l68K92K08p6o9J80j4j08K46
2174E0N9R4j16L43k18k10K4M9k70J15L67m69j64K23k7j39J69M5L29m70K79J33
2196A96k60K36J77j77j02J91p1k63R0nO2m11K53J14l74J0L62j49j69L10R8r2M
2219C0J32J08l92M16R7k72lM9l24J2O5J2P5j16j77J00j77J65K87j67J47K1R4j31
2243E1J36R4o8j19rM5k10M0J49k98mj4J44j92M5L9M3M1P4J85j59N3J06k3R8k1
2269B26j77oL0N5j48p4J12k92J47nJ27k12K9J27j20L27K0j11K17L5j05k2J38j25
2293A93r9j78J09j8k97K65j00n9J43j5q4r5L28K38k42M5p8L4r3J53j48K05k2j28
$$ y = [461, 521, 89, 2, 269, -41, -253, 299, 558, -212, -17, 388, -233, -411, -8, 74, -257, -205, 310, -146, -444, -126, -96, 24, 15, 541, 138, 136, 221, 215, -96, 40, 248, 63, -203, 55, -241, -609, -317, -109, -185, -254, -74, -88, -196, 50, 109, 203, 87, 430, 212, 2, 26, 75, -195, -80, 287, -182, -346, -123, -150, -289, -120, -75, 254, -216, 63, 196, -64, 172, 349, 172, 70, 261, 190, -73, 17, 12, 74, -337, -84, 30, -344, -334, 28, -121, -290, 20, 118, 26, 30, 162, 270, -122, 294, 391, 119, 116, 165, -159, -147, -82, -70, 5, -111, -288, -188, -365, -200, 87, -80, 67, 88, 182, 51, 187, 281, 213, 94, 85, 130, -80, -40, 109, -189, -193, -207, -63, -255, -210, -171, -128, -87, -13, 172, 13, 66, 172, 149, 247, 226, 49, 43, 73, 128, -20, -94, 18, -274, -127, -132, -5, -217, -188, -61, -181, 146, 166, 55, 272, 307, 202, 180, 318, 193, 94, -84, 25, 7, -290, -25, -125, -184, -41, -56, -140, -235, 93, 331, 89, 134, 56, 90, -3, 150, 2, 207, 185, 57]
2317E7j92J32j26o3P3p8Q6j16J36J1j4J50n0N0O9L6o9K10j73l3M3j78M8P6l19
2342b34J03j59K40j60K23p5OK2nQ7L6K5k87J86j4K37j82k0l3M5j6j67J1N7m4n2
2368a70R2r6Rl4K22k8rjK7P5o2J2J5N2R5j58j87K5J5j74K75j32L5J8o1Q3j69K90
2396E9J9J94k50J09l6L7r3J41r6K9j76m4R0L9rm3j36MJ49J15k21J33P3j55K1J99
2422A52l3p0l1J51j75J84r9Q1l58J9J26j25K41mj70q8R1J8J31k4P5l3r0K01p9
2447I1k0K4k04MO6k4J47j20r6p5J79j33j9Q2K7J52J01r9J1n0O7n9Q4qk12Q6J30
2474A32r2n6M0r9o2mJ04j40J97J86j98q7J73p3k8kJ25NNJ73Pm05j29K25l2p0J83
2501G8Jm11J78P0Q1Q1J00lj10l3M2j61R5J59R7k63j53L00l19P0J27N3qj76O7j60
$$ y = [57, -135, -3, -129, -192, -119, -197, -111, -227, -91, -80, -94, 56, 6, 56, 125, 161, 92, 302, 129, 96, 139, -39, 9, 85, -234, -131, -290, -50, -210, 13, -62, -56, -34, -39, 48, 84, 109, -178, 8, -6, 231, 49, 29, -4, 41, 25, -142, -131, -74, -118, -170, -78, -174, -165, -199, 23, -5, -14, -15, 12, 87, 25, 37, 52, 104, 199, 41, -146, -121, -106, -280, -5, -137, -102, -84, -145, -62, -231, 59, 78, 272, 22, 131, 95, 132, 39, 180, 84, 113, -63, -107, -17, 22, 13, -30, -166, -162, -13, 102, -119, 14, 87, -68, -47, 152, 119, 49, 18, 169, -6, 178, 79, 160, -198, -179, -53, -178, 63, 59, -111, -199, -108, -90, 41, 17, 92, 59, -31, 170, 91, 71, 95, -109, -105, -39, -63, 84, -36, -132, -207, -28, -161, -180, -98, -71, 81, 182, 83, 94, 44, 111, 52, 136, 128, -84, 2, 132, 40, -16, 24, -75, -137, -141, -37, -177, 20, 206, 8, -79, 94, 21, -7, -9, 116, 121, 126, 299, 306, -99, -228, -3, -35, -105, 78, 79, -332, -154, -84, -3, 78, 178, 175, 65, 32, 74, -87, 8, 167, 264, 1, -152, 148, -171, -101, 26, 79, 71, -105, -38, -198]
2527a98J63l0J73r7J56J32k39j59J01J67k11O4M9j8j62K8J66k75J30nQ5j46J82
2550E6j36j13J57J55O3j12o6J2j33J15K49j98n9M2J17k05q9K46k26O1J39J0k54
2573a69qP7j9N4K28M0j90M5O7j95J41L2j10o1P6J13k19j55J74R5k24J35J28j05
2597e0P9PJ04l52K60J92k81P2K78k27k93K82j57J2j42J53j48R8r7J87J89k43Q6
2620IQ1l35K76R6n3k2J04k40Q3j81J98o3Q3l16K97p1k9O1j45J99k00K80j30o0
2644g8N7J90j7l8R1j65j26O1j3R3jl6r5M6K2m1L9j90J49nJ28Oj23J29N2k53J07
2671a1J9J22kj00R9j51k0Np4R8r1MJ05k38K69K4j95K77j13nJ97j21j04LJ39j27
2697Ip1J80r1k08J6L4J17j66R5Q9j09K03N3k21J11J47m9J4N6j68M8k14J60J53
$$ y = [-198, -35, -65, 108, 11, 167, 299, 60, -99, 2, 169, -42, 22, 71, 53, -109, -81, 85, -190, -60, -65, 20, -126, 56, -80, -193, -36, 119, 182, 70, 4, 16, -117, -2, 247, 49, -10, 32, 149, -56, -145, 101, -125, -64, 75, 85, -169, -177, -100, -119, -65, 163, 203, 13, 58, 125, -70, 71, 103, -7, -68, 8, 121, -98, -253, -79, 16, -208, -73, 55, -50, 29, 36, 140, -212, 48, 240, -41, 31, 309, 82, -211, 71, -86, -74, -216, -63, -211, -113, -210, -23, 166, -77, 9, 90, -245, 31, 127, 74, 52, 156, -84, -1, -182, 16, -47, 36, -280, 17, -54, -83, -22, -167, 32, -168, 112, -18, -78, -21, 169, 152, 114, 205, 40, -86, -25, -38, 55, 54, 18, -77, -31, -9, -50, -11, -201, -52, -57, 71, 77, -46, 83, 135, -118, -11, 8, 130, 128, 28, 127, -24, -44, -39, -113, -15, -106, -102, 3, -235, 34, 58, -137, 140, 27, 22, 219, 98, -6, -3, 136, 9, -62, 118, 27, -181, -165, -131, -14, -180, -85, 4, -105, 98, 151, -70, 41, 188, 139, 153, 209, 41, 89, -125, 35, 188]
2721A88k49r5L43k29j06R3o6J12j61K13q5MJ02n2R1l29K34L0P2nQ5k61QQ4j24
2746a03j67J03K94j13n3j46J37J00L9k88K95k01J20j15J97j35J4kJ48j34L3q3
2768f0J11r0J0q7n7J71PK0q2n3L79j67j20Q3j62K02p4j41J85j11j13J47k25J28
2792i9o6J7L9j60K92j29O4L6K16l19L2kK42j94NJ09j7m5p9Q6J3m0K9m2r6J87q4
2819eQM1J45j83l8R7p1M8n4Q0j51J12m3K2n4p4Rj82M38j85j81J55J20J07k11j9
2845f9J66J4p6L8n4r3J64Q7p5p1j08m6J07l6j4p1jN0J73j70J49k1l2j0R9q3Q2
2872I9K7j62M7K8j09j4J70k19K52k45o8K15r8K17o5k16J40k0J7J5p4p2K71j49
2896a3J1j5P0l4j40J04kM4j60n1J17k1K04j89K11k1o1l8j73J11L1r2O9O9r5l0
$$ y = [188, -61, -156, 187, -42, -148, -55, -121, -9, -170, 43, -42, -38, 64, 12, 103, -226, 8, 38, 110, 105, 190, -71, -63, 21, -103, -270, -167, 127, 14, -39, -185, -48, 52, 91, -197, 98, -103, 17, -98, 99, -36, -22, -24, 124, -10, 23, -60, 51, -39, -29, -116, -173, -2, 5, 25, -57, -110, 269, 102, -18, 65, -97, 105, 31, -110, 75, -36, -149, -2, -227, -99, -165, -148, -109, -269, 23, -106, -42, -6, 210, -109, -77, -79, 163, -31, -26, 83, 66, 21, -58, 28, 41, 1, 30, -12, -108, 79, -5, 3, 44, 189, 6, -32, 65, -6, 42, -12, 68, -83, 29, -14, 8, -46, -120, -111, -293, 145, -40, -221, -66, 54, 161, -50, -69, 97, 111, 35, 73, 19, -74, 90, 177, 102, 31, -77, -123, -16, -52, -66, -137, -138, -88, 85, -85, 64, 43, 11, 1, 100, 17, 99, 126, -36, 11, 39, -70, -84, 86, -133, 119, -126, -194, 21, -77, 140, 75, -141, -1, -21, -4, 11, -63, -135, 136, -13, -2, -17, 53, 19, -121, -17, -19, 25, -135, -186, -69, -90, 114, -75, 136, 115, 54, 16, -157, -46, -15, -107, -38, 31, -64, -94]
2922i4lJ49k93J79J51k11m7J57L6J29r3j55Q3R9Q4j73m4J87l9j23Nk3J14r7J90
2947A68l83J26q8K6J84j68J71O2k1j06m2J97k26PR2P7r5K01k50o6K28L4k59l7
2971a68K40j99K11k3J5o6n5l2K79j48l8J24O0l03J02R5j27l4J33j78J79j34J84
2994A17k87J66J7k3N0M6J51k53Q5j19R6j41K94k41K2J01J08j57j60J39Q0q0Qo0
3018d1M5k33K88pk3j56N1K12k15K2j4J27j76Q3J14k8k4q5l3km6q2K65L6k92J55
3044e9P6n3L2J21k09R9J72n8m5j04%j25J44P5m5K4j46J23P3J5j27O0R9q8K5q4
3070ej8P5j4j02K3J08r1p1PK18k03O5j04J70k7Kr5j33K09j4lm3J02l1n1K22j47
3097D9R6k39J88k23K31q3k2L1j10L6J4q8l0K60j77J57j31J42j05p0J49L8j27O6
$$ y = [-94, -97, 52, -241, -62, 89, -122, -169, -12, 24, 153, 60, -95, -12, 87, 171, -2, -46, 141, 102, -21, -16, -39, 75, -22, 168, -215, -89, -177, -151, 33, -135, 36, 98, 77, -29, -71, 126, -100, -93, -1, 76, -19, 182, -68, -134, 94, 128, -131, -168, 72, -127, 84, 61, 76, 10, -45, -77, 202, 54, 16, 140, 200, -103, -1, 94, -33, -67, 66, -112, 67, -67, 117, -170, -4, 13, -10, 40, 86, 237, -16, 69, -50, 46, -95, 199, -42, -20, 81, 189, 32, -128, 11, 91, 11, 19, -41, 4, -229, 59, 52, 29, -127, -76, 136, -79, -57, -71, 56, -120, -37, 77, 49, 25, -60, -93, -95, -141, -223, 42, 78, -214, -59, 17, -36, -4, 117, -92, 7, 179, 121, 76, -28, -28, -153, -9, 66, 21, 45, -101, 22, 95, 110, -17, 43, 142, 54, 79, -5, -23, 52, 38, -64, -41, 67, -24, -95, -88, 130, -73, -8, -112, 58, 31, 33, -62, -195, 14, 0, -3, -46, 56, 25, -26, 196, 49, 145, -94, 94, -129, 102, 19, -3, 28, -82, -46, -32, -120, -150, 110, -67, 90, -41, 101, -4, -74, 75, 113, -14, 52]
3121E2q4J6K1k62J68O4m9J30R5l92J3L13m5n9P6j76J18J76k68J01Ro9J68j34P6
3146E8m4Jj55Q5L7qJ33m7j4K30l11K40j29j10J29k00L10j93j42Q4J32j5j58J44
3170E7j13J7N9o3kJ05J02k54M8M2K19j50ok6J9J8Q6l14J54J91j83j38Q8Q3J2j15
3196f4N5j22J40P5j41P7j23O9K5RN7K4m3n0p8k7J47j85q3K29N0l7M9j41J10J66
3222A88m1n3j23M6P7j6k6j6J2r4N3n7J91k42l2R8n4j8P7O7J67j34j47m5K00n2
3248B6M3qn6KN2j29Q8J17k21n9L1J97j60R4k0m1m5J65k61J45P6l8o2J53J39k18
3274A0j20j13J06J02J03k15J10j86J37J12Rj33p2K94o3Mm0M4j32J38j51P2j33
3297a17K05j98j28J41P9L0J38k13M6j04J45J0l5J19j27J22k6o5J16nj59l0K21
$$ y = [52, -32, -16, 5, -257, -89, -25, -74, 56, 151, -241, -228, 85, 40, -19, 57, -119, -1, 175, -93, 8, 17, -52, 116, -18, 58, 14, 15, -140, -55, -18, -26, 107, 60, 46, 276, -35, 205, 76, -34, 95, -105, 205, 12, -130, -46, 86, 71, -87, 57, -56, -39, 20, -43, -45, 60, 162, -92, -44, -2, 217, 67, 61, 35, 54, 72, 158, -156, -2, 189, 6, -132, -44, 39, 51, -64, -9, -131, 9, 84, -57, 20, -103, -34, -9, 0, 57, 81, 38, -12, -90, -117, 30, -155, -238, -9, 41, 4, 53, -88, 22, 188, 147, 94, -29, 17, 94, 78, 52, 36, 48, -46, 7, -50, 141, -101, -133, -35, -89, -107, -30, 37, 204, 70, -77, -122, 78, 26, 69, 61, 5, 7, 59, -70, 18, 135, -86, -145, -114, 83, -77, 17, -3, -44, -89, 76, -185, -40, 36, -2, -64, 89, 228, 10, -110, -223, -117, -15, 88, -127, -17, -203, -66, 46, 55, -78, -150, 144, 81, 85, 45, 89, -43, 95, -56, 16, -117, 88, -110, -238, -97, -18, 12, 150, -63, -17, -121, 24, 34, -1, 118, -9, 113, 87, 22, 138, 133, -26, -56, 165]
3320A65k15j1J12r9n2M8J77j33J67J27j92k24K16k21J91j07J36k64J93n8J62K9
3342A47j65K19k13p5J87j41K1n0J71j88kJ56l4N7q3l2J70q1j24K06p0l1J50k49
3366e4l7J72j07L2p4J08Pj95J9J35L0n8n0K18j07m5q7J50J23j20j43Q1p5Qj23
3391a92J85Nj06o2K30R5j82J20K7r9K7j01Nj46K18P4j17r1K42j17j48K45j76j65
3415b29J12K49j7j88J24k40J47rK0K5q5K35l18K74k10K18j75o5J71QJ16k14k26
3438b77J86q9J09K30j17Q3j08M4k9O1m3Mj63Q9N0j05K94m29J57J6J38m9k54L63
3462A61n7j07q9J43J9O7k74L08j32O3j80J6K45k74K4K3P3j69J49l1p3Q0J00k35
3486a50M8J51j04J68O2n4j22kk9K14k35rp2Q6R4o2J3n0J06j73K86k46J88k16K99
$$ y = [165, -50, -61, 51, -48, -100, -52, 125, -8, 159, 286, 94, -130, 86, -135, 56, -51, 85, -179, 14, -44, 118, 147, -18, 201, -12, -87, 100, -41, -20, -70, 101, -87, -89, 67, 33, 90, 7, -25, 145, 64, -60, 146, 76, 45, 195, -54, -91, 81, -26, 6, -68, 40, 47, -148, -129, 6, 36, -22, -72, 146, 39, -6, -93, 57, 180, 60, -83, -2, -77, -69, -192, -7, -2, -108, -170, 60, 155, -27, 93, 120, 21, 48, -53, -48, -194, 24, 98, -19, -110, 132, 15, -133, 112, -64, -229, -117, 132, 115, -73, 51, -189, -42, -51, -31, -6, -91, 144, -174, 100, -110, 108, -67, -132, 39, 47, 163, -51, -277, -91, -180, -71, 159, 42, 125, 17, 61, 32, 93, 50, 54, -109, -20, 30, -75, 219, -210, -53, -37, 101, 52, -202, 161, 104, -3, -92, 51, 70, 137, -137, 171, 39, 102, -78, -62, 183, -91, -67, -44, 29, -140, 9, -22, -95, -15, 85, -150, -102, 49, -55, 113, 175, 121, -1, -3, -32, 182, -53, -62, -134, -48, 46, -16, -3, -53, 53, -120, 166, -80, 108, -108, 191]
3511A91l34J95j80J06P3Q6lj02K5j9k02J48J62j06j20J0K5N9M6p3K7n5J55j49
3535c5K7M8K7k25K92k87J86L3MM8k38J43O5q9m2l9J5L01j62o6J86k20mP7J05q1
3561F9o2J08J76m24J81k6j4J12j19j3p9K35j66m7L7R7n3o4Q6N3p0j03j7J58N4
3586A09l8j99J88k7j51J31j05K8J57r9N6k6j17J30j81L13p5j06k6Q9o6n6K12j58
3610a7m3O8P8k21m0K00j66J39n3L71k81J19j40j64K67J3j65K55k71J44n2r2K6
3633b5R5jj9j89J24M9kjj09R1PL9k46J87K8j15k5Q5L2r6J20n5J0k2N8L7m0j17
3661a00j39K89p2k1j48K02m3%j4J14kj0JQ3j59K5Q2J36k63M8P9R7k19r6N3m4N5
3688f6L7J09j33MJ6J05Q5Q8j22k4j7j06Pj27O7J68j73Q0J16k88J45J82j59k11
$$ y = [191, -143, 52, -128, -22, 51, 137, 134, 32, 57, 38, -164, -16, 146, 40, -80, -70, -45, 14, 60, -13, 14, -41, 114, -35, -8, 40, 67, -158, 134, -153, 33, 66, 70, 118, -120, 23, 88, -1, -43, -82, -67, 234, 72, 6, 192, -28, -32, 45, 150, 69, 7, 115, 291, -133, 48, 22, 8, 120, 1, -12, -91, 144, -22, -69, -32, 65, 12, -52, 34, 87, 17, -86, -103, 55, 109, 71, -128, 60, 33, -118, 13, -92, -64, 93, -6, 50, 24, -93, 37, -144, 169, 94, -12, -38, 51, -15, -71, 141, -17, -60, 8, 86, -135, -175, 25, -141, -2, -55, 316, 35, 154, 14, -150, 117, 130, -35, 220, -51, 93, 41, -51, -25, 70, 69, 50, -139, -15, 34, 32, 31, -78, 13, 20, 59, -187, 0, 28, -87, -112, -27, 5, -91, 29, -26, -16, -38, 20, 57, 17, -100, -239, 50, -22, -43, -191, 11, -32, -32, -46, 68, 66, 56, 57, 140, -19, 6, 88, 224, -39, 9, 88, 185, -34, -130, -77, -121, -66, -29, 80, -53, -49, -33, 72, 157, 245, 123, 99, 82, -24, -17, -144, -77, 91, -82, -2, 114, -174, -29, 153, -6, -217]
3712b17L50k21J60L3l8L1k54M8L4J39q2R7k84J76m3J39j07J09o6m7P1j1l3L5R1
3737A10j0k52K02J24j56Q3p8J2l7q8J78o3k6P3j96M0K5K57k36m9J39J5LL5j31
3762b6J91j57Q0L0j17O3M2n9j11M0q7J0N7K53l96O4P6L5j9J65J12k20Lj82N3K45
3788A45Kk4k35P1j25K25j0j97J60Oj72n8L48n2r2l4K97k34O2j7j06R0O5m1o7k
3814EMk00M2J74m2M9n9j43Q6J26j16N8K03k35J54k26K52j68J14l4rR6rl7J7j44
3840d2j10R2m1o2K79r3r8j7J85k6j19R1L9O5k47JRK47k47J04j37J8J93k99K15
3865@j23N2J66p0J06M1j09J07j7L0j37J15j69j62K66mK9k43L2J30p0Q2j23O2j52
3890a61K21k13J98J9K8k21J85j14J11M6k21J20j9j16J07p1k1J59m6K6j47o2J62
$$ y = [-217, 133, -88, 72, 105, 67, 98, -156, -108, -74, 65, -17, 80, -204, -28, -71, 68, -39, 70, 4, -43, 28, 17, -16, 19, 110, 100, -152, 50, 174, 18, 101, 23, 35, -2, -90, 88, 25, -1, 72, -124, -84, -59, 198, -38, -87, 52, 67, 70, 105, -26, 165, 8, 88, 118, 1, 64, 106, 47, -64, -24, -111, -101, -44, 209, -187, -123, -47, -12, -31, 134, 246, 26, 29, -153, -100, 145, 147, 123, -112, -41, -166, 59, 49, -148, 12, 18, -154, -212, 136, 84, -8, -42, 255, 21, 83, 66, -40, 50, 115, 74, 7, 5, 9, -191, -149, 25, -17, 32, -27, -170, -84, 42, -74, -16, 187, -48, 106, -120, 132, -36, 78, 44, 35, 131, 122, 85, 102, -42, -152, -60, -101, -163, 116, 23, -75, -92, 93, 67, -52, 39, 78, 143, -104, -103, -94, 153, -94, 10, -127, -109, 84, -215, 0, -123, -71, 95, 25, 131, 172, 63, 170, 153, 183, 46, 161, -8, -170, 96, 92, 121, -122, -90, 40, -30, 52, -71, -9, -161, 60, -153, 45, 64, 92, -129, 56, -58, 53, 99, -122, -2, -21, -137, -30, -101, -122, 37, -9, 17, -130, -192, -30]
3913c0QO7Kk02J29o0O4K6n7O6p5j5M1L0q4J37j87J02P2n3N5L6l8j6N9r3q4P5R
3942a6J93k44J33n4k30L74k20M0r4Q9Lk0n1l2L9j0K23l0m5K40r9j80J54L9j23
3967G9j01q8L7J07j33J55j09r2J69P4o6j21J63K7Q7j04k8j2j97Q7K00Pk74K33
3991A00j46j6J09p5l9J29j06K6Qj65K44m7J82j72O6j41n1J2J80n1J2n4j51J23
4015b3j29K30j44k3n8J18o4L8O4k07K15jN9o5Lm5J35k02K94j96m7J36j53J58k29
4040a36K63k54J22j29J67l2r8N7L2J20j21j4J56k4J1%o0j25J38j05k8N4j91J56
4064d1LN2J02l9N0j68O9O5M4k64Q7R4P1l2o2o2q3K75m1j11j66J22L4M5q2J96k10
4091e2K3N6N0j43n7L73k02Rlo5lm3J18K3j38J19r4n0J37n5j9J8O3o7nK04j66O1
$$ y = [-30, -22, 45, 47, -155, -26, -86, -22, 4, -53, 13, -62, -77, -36, -6, -90, 47, -140, -38, 34, -19, 36, 72, 34, 18, 77, -16, -100, -25, -16, 177, -67, 66, 12, -218, 156, -64, -24, -118, -29, -26, -46, -97, -129, -90, -100, 123, 93, 48, 288, 189, 9, 163, 202, 79, -22, -110, -73, 34, -99, 56, -53, -145, 24, 98, 32, -89, 74, 101, 188, 84, 56, 44, -153, -66, 134, 141, -133, 100, -46, -62, 47, -28, -67, 62, -44, -18, -10, -175, 69, 22, 204, 32, 98, -43, -94, -82, 98, 47, 59, 5, -146, -23, -152, 78, -66, -89, -147, -29, -93, -55, 9, -198, 17, 16, 75, 10, 13, -32, 103, -99, 195, -1, -48, 88, -65, 93, -136, 127, -127, -5, -134, 33, 1, -97, -40, -8, 112, -9, -23, 133, 109, 120, 120, 60, -65, 73, -32, -60, -6, -197, -41, -38, 14, 116, 77, 127, -41, 28, 93, 137, -127, -40, 54, 125, 93, 31, -31, -114, 161, 120, 9, -157, -35, -1, 44, -38, 158, -52, -29, 27, 77, -66, -123, 250, 48, 57, 54, -11, -14, -57, 61, 84, -54, 65, -29, -79, 58, 3, -16, 2, 65, -2, -7, 197, 31, 92]
4119I2j81R0nq5J60m9j40K88j36L2k72J97J9j43J80j84J73q6J0J24j20k8K21j73
4143a6O0j58M3L7P6n9m8O9O3q4j1P6K9L5rL8k8L5j05j32J81o0p2j03K38K8n8j9
4171D6n8n9J46k02K17o2q5L25l46K6p5M5J44O4k30K2jl3J20o0j10J02J38r0j39
4196a55J41r1j82L33l5L3K0j18J63L0j24qQ3Q9j98P6R0k06j3M1o3K11j22j16P6
4221d5J13j10q7J64JJ97j74M8l42J68J63j4O5r4r1J75k14J82l45P9K45j91k8N3
4245h2K11l0p3J45j91J9lk01J48R0j57J37P6rr7m0K4k8o4J83o2k19K27j04N2J47
4271I9k1l1N5N0j63j2J58p8L1j15o7K30l74K20Q4k3L4j57J10j42J20j30O2n6J04
4296a2P7J62r2j53Q5J4j37j6J1O5P5j23M2J2j37n6J05P5MJ5J74k15J14Q4k38O8
$$ y = [92, -89, 1, -4, -89, 71, 22, -118, 170, 34, 66, -206, -9, 10, -133, 47, -137, 36, -50, -40, 84, -36, -64, 157, -16, 44, -114, -71, -34, 42, -17, -65, 4, 67, -17, -28, 48, 77, 112, 103, 141, 113, 148, 43, -89, 92, 32, -40, -143, 95, 123, 65, 46, -12, -71, 75, -127, 90, 28, -57, 268, -78, -52, -127, -82, 62, 126, -104, -82, -83, -116, 4, -56, -166, -64, 74, -16, -155, -14, -105, -287, 46, 11, 44, 64, -54, 109, 139, 15, 7, 90, 179, -19, 57, 147, -59, -72, -31, -94, 117, -5, -121, -45, 68, -42, -129, 35, 36, 233, 59, 107, -235, -67, 96, 82, 147, 53, -38, 137, -77, 105, -240, -161, 84, -107, -135, -82, 129, 99, 26, 171, -20, -1, -4, -205, -57, 33, -124, 13, 89, 80, -17, -57, -33, -61, -125, 58, -4, -223, 4, -100, -48, 99, 78, 47, 102, 152, -11, -23, 135, 57, 88, -27, -94, 136, -238, -18, 66, 43, 77, -80, 30, -112, 8, -122, -60, -116, -12, 65, 227, 135, -18, 67, 81, -56, -72, -61, 4, 79, -44, -2, 10, -127, -183, -78, -3, 1, 16, 190, -25, 89, 173, -65, 3]
4322CJ34j84r3P3O4n4po2K39n3j53J96m8j78J6K03nP3k80J57j30K41j36K9L3n5
4348B3q1Q1J00m61L00l8P2K4j5j3J7R6M0j02j42K77l07K15K08j89j76N1o5NJ21
4373D1O4j08Mj15J31j17J07k7j61J90q5J7Q0r4J67jL8j46P8j40q8J57O3nk9M3
4399F4j81k5pJ47J11j98R2n1k1K59j84P3O1j21J35k62k3kK00n8O7K0j8r7k2J39
4425I8j69k2J0J51n4K51p0j41j38M5L7j31Q7Pk7l0J90r0j41P5R6M7n9K14k41J32
4451A27j29M2J75l82P6J68j38J31J11j71J0m7n5P4J69j06r5M0K0j20J79M1j17
4474CK2l7P0n9K5M6j10J01n6K3N2P5j74j16J15J46k39J26J25q6M9l5O1j85K21
4499A63j19Rl3Jk30J35m9p9J69J09j1m3j37KO6k8j14K43r2J6J10k6J58k59p5J06
$$ y = [3, 137, -47, -140, -67, -3, -57, -64, -126, 113, 60, -93, 103, 55, -123, -107, 96, 91, 164, -116, 41, -89, 152, 16, 45, 78, 23, -58, 23, 123, -338, -38, -76, -4, 20, 5, -8, 9, 105, 145, 43, -99, 178, -129, 86, 294, 105, -71, -20, -85, -80, 41, 105, -3, 1, -114, 17, -100, 7, -20, -181, 9, -76, -59, 21, -73, 94, 93, 131, -15, 63, -77, -165, -8, 55, 50, 21, 64, -117, -142, -149, -2, 109, -89, 3, -48, -69, 190, 6, 79, 140, 19, 154, -108, -131, -133, 67, 9, 76, 96, 78, -19, -41, 98, -71, -93, -83, 68, 14, 265, 195, 54, -84, -39, -2, -133, -46, -39, -66, -96, 94, 4, -137, -62, 34, 81, 22, 236, -5, 127, -2, 40, 215, -167, -91, 77, -61, 70, 181, 10, 20, -27, -82, -8, 161, 55, -40, 0, 20, -100, 79, 120, 3, 25, -12, 58, -1, 24, 70, -40, 61, 5, 28, 80, 155, -19, -135, -20, 126, -113, 13, 138, 52, 101, 66, 127, -58, 163, 44, 53, 20, 21, -209, -74, -123, -202, -33, 76, 65, 22, -115, -113, -47, -75, -189, 54, -38, -22, 88, 62, 220, -39, -114, -8]
4525hj06K7O5k8nJ39l08J10K25k34P5P2J20k64J40j24O9L6M1k11O3m6M8R6J25
4550A17j20k7Q7j22L5Q9R4j29N7p2R4k05K46j16%K3l7N7r9J7n2n7L0J61L6k2m9
4577C6j69KJ47J11j10J10j59J11o8o8K80k9p3m5J75k81p1N9Kk0J30m5m3Q1o8J00
4603I5m1Jj38l8M7J02p4N3k0l5J45jj62M6j51R2M2J76k50J6m9R5M7l5O6J28Lk01
4631d1om9J77k1n2J5j9j03J14L2j08M7m3K1j30M58k83P4l7l0q6J53J9k44J94P3
4657A25Mj32R5j19Lp6R4j47R0L0j0l2j11K25Qn7l8J45o3j32j60K31j1rO5j20K70
4684A68j51K6j00j01Q4K18j24K5j92J89j05J8P5J37j33k8Q2p1J47p6r3k7j19P
4708a44Pok8J76j11K43j27qR5j27j57R3Q9L0O2j37M7l4K39j27k66n1J80P8M1m3
$$ y = [-8, -114, -87, -22, -50, -55, 84, -224, -114, 111, -123, -48, 24, 144, -120, 20, -104, -35, 1, 42, -169, -106, -152, -104, -8, 117, -3, -30, 57, -65, -30, 59, 153, 24, 81, 9, 103, -102, 144, 28, 28, 51, 14, 71, -28, -11, -63, -120, -90, 71, 107, 85, 36, -133, -131, 16, 127, 17, 127, -32, 79, 11, -57, 223, 194, 121, 76, 251, -30, -101, -42, -40, -60, 70, 25, -18, 63, -5, 95, 54, 55, -83, -121, -74, 28, -46, 7, -13, -48, 97, 96, -66, -20, -171, -79, -37, 139, -111, -95, -144, -49, -2, -37, 29, 157, 160, -41, -47, -96, 81, 60, 8, 23, 4, -99, 15, 47, -61, -14, -57, -36, -166, 292, 9, 83, 46, 16, -70, 83, 102, -142, 52, 125, 129, -3, 92, -27, -24, -100, -6, -153, -63, -33, -43, -75, -186, 39, 47, -10, -48, 97, 34, -98, -258, -27, -38, -47, 18, -102, 168, 17, 43, -57, -158, -74, 144, 20, 45, -147, 42, -63, -45, 30, 167, 34, 6, 88, 17, 164, 88, -5, -32, -151, -144, -137, -143, -171, 5, -106, 137, 10, 2, 97, -30, -187, -94, -5, 25, 87, -50, -3, -37, 202, 75, -191, -242, -62, 16, 57, 14]
4734A4Pl3Q1o8L9k2J07j92J23j52J0J60k0j49M3Rl8k0K7j62K20L8J20k03L8j35
4760a58J3K46m2oJ2k41J22J48j5j12J98j51q2J15k20J04L18j82q3k4j15L5O7O7
4784A4k21K82k55K59m5M3r6LK4n5j4j15k6R9J09j85K68o3L3m9J17j35J29o9k4
4809B8K8MK9J8j26l6O6q4M7K23l21J71k09J52j37P8J28j30Q8Jl1j35R2L6qp9J46
4836C9N6r1P0l9M3j2r0J55j30p4M2L0J34q6Mj20o2P8N0J13j66J06M1k4j13J21
4862G5R5j84k12J24rP2j8J45j76K10k79P4p3J46P0lP9r8k03J65M3q4J08j14l7
4887h4J67k75K30j38J73N2j75M1RM9j5l5J47k99J30j89K50k3rq1O0j5J07q2P3
4912F8j14JJ62j45PJ58j25l3O5j79Q6K99l68K06k03k9P9Q3j06O6N4rmj41O9R6
$$ y = [14, 21, -12, 69, 1, 40, 18, 125, -67, 56, -96, -86, 74, 54, -95, -52, -43, -81, -101, -74, -236, -16, 22, 142, -61, -23, -158, -145, 101, 59, 53, 65, -176, -54, 94, 79, -33, 165, 14, -68, 47, -173, -69, 249, 67, -16, -40, -155, -120, -53, 14, -207, 75, -180, 79, 34, 77, -19, -16, 8, -47, -61, -176, -202, -103, 6, -179, 89, 26, 59, 10, 127, -8, 121, 52, 28, 56, 60, 89, 107, -19, -55, 11, -73, -26, 197, -124, 47, -162, -10, -147, -69, 59, -71, 17, 18, -13, -148, -56, -20, -28, -107, 39, 95, 4, 74, 35, 78, 66, -24, 131, 1, -73, -31, -1, 133, 47, 51, -69, -131, -53, -3, 110, -56, 50, 91, 67, -46, 75, 170, -14, -226, -102, -111, -39, -57, 88, -88, 122, -157, -83, -156, -10, 60, 57, 136, 38, -165, 0, 43, -41, 67, -47, -84, 83, -192, 38, -100, 73, 125, -50, -9, 0, 49, 34, -1, 146, -153, -23, -212, 38, 15, 6, -75, -15, -30, 77, -5, 68, -46, -45, 117, -28, -21, 137, 12, -21, 44, -135, -49, 250, -118, 88, -115, -144, -65, 18, -88, -22, 32, 23, 19, -122, -53, 43]
4938D3r8RJ35k4J7r1J5J57j11o8rL5Q9j66K03l06L67k64k2J87o8l1Lj26M2L17
4964B35j66k1J08j44l6J10q0o8k3K8rJ29p1J03o3j44J45k9P7K0j1j20J0J50r4
4989C6k9QR5k02J8k5J85k21K94p6Jq9RJ10j85K95l21R7j5O1Mn5J66j10Q5o4k37
5016a65K65j06J0pjm6N9l9j6J14J2kk14J94R5k09O0J29k7j52K37j21r2K21l56
5041a57K32o5M7k0K9M2k13K29Rm15M14k54Q1J43N0k67J02Lj6j8jl2J72k13Qk2
5067a32J09J41j80J13r7P4k78K54K2L0L1j72M4J9Q9N5J63m19J14L9J2j40k6Q1
5091e4R4oj31R8Q1O6j53R9j62rP7m1j60J53r3OJ28j48J10nO8L8j07K3N6o2P1M6
5119H3J4kl1J19j40j13N4m7k2J16J08j36R6p9n5J78j64j35K31j10Q2K9j07P5L4
$$ y = [43, -55, -46, 89, 65, 82, -9, 6, 163, 52, -16, -25, 10, 99, -67, 136, -170, 197, -67, -89, 98, 30, -1, 2, -124, -82, 235, 69, 48, 156, 12, -24, 86, 6, -62, -85, -57, -66, 63, -8, 95, 32, -112, 33, 4, 81, 101, 90, -30, -20, 130, 36, 7, 15, 110, -92, -74, -99, 86, -135, 159, 83, 84, -5, 4, 114, -71, 224, -97, 0, -15, 46, 50, -5, 161, 51, 136, 72, -165, 100, -6, 4, -3, -4, -50, 9, -30, -46, 68, 80, 78, -136, 58, 153, -56, 4, 133, 106, -46, 191, 70, -22, 199, -157, 75, 10, 57, 37, 66, 108, -105, 124, 133, -282, 132, -122, -41, 102, 152, -115, -13, -10, -26, -44, -45, -77, 95, -118, -110, -132, -23, 118, -62, 51, -46, 28, -250, 4, 26, 56, 87, -85, -41, -22, 67, 122, 285, -134, -20, 19, 31, -109, -135, -54, 40, 34, -97, 1, 82, 148, -5, 94, -68, -77, 0, -41, -201, -48, -141, -135, -7, -155, -45, -50, 18, 56, -51, -28, 28, -34, 37, 83, 97, 95, 64, 183, 43, -70, -16, -63, -85, 31, 139, 3, 99, 20, -35, 143, -21, -156, 75, -35, 47, 76, -31, 44, 78]
5144G8n1k5k61K02K56j38K35j79r4j03j07J02JNJ37M3j05M3j05R9j51J24R0q6
5168A0O8r5k8j18J43j3L4j06l2J25J94k38o8J52J3J16j9j81J26r1K5o7K25k67
5192i2M8j17P2L38l04K41j93Q8j99K48j05N6k43J92o5K19j76j38K55j5o1j07J84
5215A26j09O6r6M9j63K52j35Q6j00r6P9j00j1J92q6J21j9l2j58R9N3o2R7O3k65
5240a49m0J23L30l22MN8j76J18J14M2m7rk0J23j92J93K9mj58o8m2R2K05k92J70
5265H2j33nn0J34j29j19J58R9p8K2J9K8q2K24J6k29J40N0q1m1K1J55k64J71j05
5290CP0M7j85J74m5j36k9l4J19K8K24l61J80j78K07j27K29j94rr8J17Q3k24K85
5314A46j79K2j14L7J08n0J12mJ16j30j45j69J52J6j2J44j37L03k95M6l2P7P6J00
$$ y = [78, 27, 2, -259, -57, 199, 61, 296, 117, 23, -80, -187, -85, -84, -79, 58, 101, -4, 39, -66, 33, -118, 6, 96, 10, 78, -17, -45, -163, -20, -33, 1, -105, -137, -12, 182, -56, -124, 28, 41, 157, 138, -43, 83, -8, 17, -50, 175, -92, -44, -161, -89, 249, -55, 186, -7, 81, -118, 130, 25, 81, -162, 30, -35, 184, 8, -130, 125, 110, 49, -58, 126, 17, 83, -13, 36, -127, 125, -10, 76, -24, -120, -41, -141, -152, 40, -46, 75, 56, 24, -134, -35, 18, -44, 53, 116, -149, -189, -66, 264, -58, -54, 4, -172, -54, 60, 102, 55, 46, 26, 149, -43, 150, 179, 175, 17, -51, -93, -1, 204, -88, 82, -51, -56, -106, 28, -101, -220, -62, 37, -41, -19, 0, 28, -54, 170, 186, -43, 97, 147, 66, 25, 46, 201, -63, 108, 3, 73, 120, -65, 109, 64, -72, -101, -135, -16, 12, 236, -125, 55, -123, 84, -43, 186, -8, -17, -115, 2, 85, -139, 146, -33, -11, -125, -88, 20, -30, 82, 78, 194, 64, -81, -250, -98, -82, -94, 50, -87, 216, -79, -33, -65, 12, 88, 188]
5338A88j85M9j58O1J44N3k18J36j10L1J07qr5j10O9Q5R4O7l64K02q7J96o1n7j20
5363i1J43j46j35L82j2j06j60J23r3J61j21RJ0M4o8oo9J38n3mO7M5O2j65j14L01
5389A42j02q6K4M6j9l7j8P4o1K4m5%Q9j66J29j3M5q0K19j02J18L8j93Jo4J4J14
5416I1o3J87q6k21J2K08j34M8j86J00K40k17j25J2R4R3J50j23M2j85J85p5lo5
5440b1O1L1N3k16J35K9j73K80k99J15r2K23n3j60R8O6j34j3J28m1o4J53L0j59
5464b3l9K75r6j36l4J45j28Q9L5m3k4l0m3%J56k16J62j26J23l3j30K31j4j64J44
5489H1P1j63r3N5l5j21K36j80N2J85n8kK6P7j81n3j05K17m2J76l7p8p9r4J7K4
5515a04K4J01l3Q0ljm1j19K09k00M0j02J01N9J62j21k39J62J20p9N9n0j3p1J33
$$ y = [188, 3, 52, -106, -45, 99, 152, -66, 70, -40, -9, 98, 90, -5, -115, -46, 39, 133, 200, -164, 38, -49, 147, 86, 29, -91, 52, -94, -229, 153, 141, 35, -125, -2, -95, 66, -55, -46, -36, 8, -60, -66, -135, 3, -50, -54, 13, 58, 120, -45, -159, 142, 40, -46, -22, 24, 5, -32, -50, 24, -37, -13, -58, -58, 31, -135, -6, -19, 26, -54, 165, 63, 181, 219, 26, 27, -37, -23, 91, 28, 215, 129, -92, -80, 128, -6, 42, -144, -44, 196, -21, -146, -134, -40, 53, 203, 80, 122, -63, 122, 47, 44, -21, 40, 71, 124, -92, 43, 72, -101, 179, -120, -5, -97, 126, 73, -87, 11, 77, -57, -70, 58, 17, -47, 106, 136, -23, -62, 213, 117, -19, -53, 92, -36, 53, 88, 45, 21, -9, -52, -52, 104, -112, 50, -76, 47, 14, -116, 115, 101, -63, 81, 152, -11, -104, -49, -84, -205, 31, -149, -97, 88, 30, 28, 54, 131, -50, -103, -208, 9, -33, 143, 106, 28, -51, -145, -128, -104, -80, 21, -12, 68, 65, 64, 23, -96, 113, -87, -47, -149, -48, 11, 173, 52, -187, -25, 95, 16, 75, 25, 12, -59, 74]
5540G4J74k47N4k46L59k41n6J34k6q4R3K47l01L7p0J31j22K07j67K4J55r4Qk47
5564b04K04L8M1n9o1M3M9P2j69J05q6q5J5k5K15N9j42p1OQ5p8K9M8j77K13k18
5590a53K32l1r7K09j38j36K54l30K39M0k68K51j91K8J04p7J45n0J06M0j74r7R0
5613do1J09p9K16Jj76j0M7j52O2K0N4N5j55J60n6N7j13J36O2j33Q3k93L07j17
5638B0j23K62j03q3P4p2K2N4p9n1j7p9J51k2J26N2kj41P3Ojl19K02j69J94Q9k6
5665C8j75K86j90R2K5j80J90r5L4j26M0J9O8n8J11m7r3L5P5k7j09J70j13K09k15
5690c6P7m7j97K88j74J38p5J16k56K79q1j9N1q4p0M0j4jl9J08l6K2lj11K12M0
5716A28j30l4r9L24k09L8l7o9R5j4L7L9k75K16j19J96j36pPK04k55j04L32ML7
$$ y = [74, 248, 1, 55, -191, 168, -73, -129, 5, -21, -105, -12, 235, -66, -29, -99, 32, -90, 117, -50, -26, 129, 35, 43, -204, 0, 38, 79, 20, -41, 2, 51, 123, -46, 59, -27, -112, -97, -122, 93, 152, 10, -61, -55, 30, -48, -19, 29, -148, 65, -153, 79, 48, -49, 160, 22, -114, 140, -190, 49, 89, -179, 72, -119, -91, 13, -64, 81, 31, 137, 177, 3, -94, -4, -65, 44, -35, 181, 182, 6, -4, 43, -109, -47, -27, 27, 82, -73, 87, 31, 88, -25, 111, 173, 40, 123, -170, 137, 20, -103, 159, 56, -27, 47, -25, -3, 51, -28, -79, -96, -175, -24, -46, 80, 132, 130, -11, 62, 68, 67, -252, -50, -219, -25, 64, 38, -137, 149, -41, 51, 76, -104, 86, -9, 25, -101, -61, -42, 26, -32, 79, 32, -61, -26, 49, 22, -87, 83, -30, 179, -36, 41, -6, -203, 85, -89, 49, -26, 90, -166, 113, 32, 13, 64, -20, -90, -50, -64, -65, -104, 4, -32, -10, -13, -124, 88, 128, -2, -36, -135, 189, -20, 18, -19, -88, 7, -7, 30, 69, -206, 10, -109, 87, -49, -56, -49, 155, -100, -204, 128, 132, 169]
5741A69j73j2kK7M7Nj19l8p6J23Kl7J7P0j25J21j15N4q0J55q1Q1K0J8j7O0j57
5768f3J17r6J00J55j65M2j28Q2j07J88j22j20O3K02k36J97j28J76j81q1K46j62
5790b1J67k62J24k15N6O0J69j57K57k78K9K2j0K4j45K33K0l7N1j09J57k14J77
5813I8j3k10KK10p8J6k2O1pj59J97j19j82J00J92k06J61R8k84J83O6j64R9n7M4
5838B6j46Q2R3N7p4j78K65k96K47m7j22Q9P6r1J27n2Rj17J13j21q5PJ74lj06J32
5864E9j40J90n0r5M7l5J79j70N3m5qO4j78K28k08J00%L9j35j32K51j64O2O1P5
5889D8j85R4j42J7J51O7k40J59M8N4m2j20L5j15J72n7R7j84N8L9K02j77nP8j22
5914g0Q2M4j13M8j7P7Q4j24j22J60J70k06j07J36r7k0J02N1q8q8J94p8m3L8o5
$$ y = [169, -4, -16, -18, 9, 56, 61, -58, -96, -172, -49, -47, -84, -67, 3, -122, -1, -116, -62, -142, 13, -68, 13, 33, 51, 34, 94, -63, 54, -42, 58, 213, 48, 90, -38, 44, -63, 125, 3, -117, -54, 148, -88, 109, -19, 157, -24, -105, 141, -21, 146, -116, 8, -207, -151, -91, 78, -79, 178, -100, -71, -49, -59, -35, -180, 53, 73, 36, 87, -22, 135, -79, 98, 85, -125, -123, 87, 9, 25, 3, 64, 57, -102, 95, -24, -206, -106, 86, -120, 41, 139, -145, 38, 104, -60, 39, -18, 26, -120, -38, 55, 112, 38, -140, 125, -171, 76, 29, -93, -4, 72, -19, 108, 56, 65, -52, 61, -60, -145, -138, 36, 33, -73, 59, -81, 109, 59, -36, 11, -24, 155, -15, 38, -7, -15, 49, -129, 99, -109, -9, -9, 30, -105, -237, 14, -150, -88, -27, 48, -137, -43, -185, -168, -17, 50, -190, -31, 17, 71, 29, -91, -56, -171, 1, -56, 41, -143, -85, -46, 156, -21, -26, 52, -70, 12, 56, -57, -9, -26, 51, 135, 11, -111, 49, 219, 13, -94, 42, -55, -75, 27, 78, -10, -98, 96, 18, -25, 13, -52]
5939e2N3l6j06K02o7J44j43p4N2J2q8R8P9Q2j40K8R9L3q0o8K5q0m6p2J70q4J44
5966H5j85J81r9l8J17p6J53k82K11l2j57K69j22n1L7J34k21J57M2p3l6j9j8l3
5990e6J18r4r4J84p7m7J3m0K12o7j79M8J7qJ13M6o3P1o0n2K5J6j38J22j03L21
6016B28j97j43p4O6M2Q9m3K6j21K38k28K44k33K69L6j85J78l71K63%k02P0K00
6039A52k34p6K44r0j53qK54j15K1j6l4O1k9L0K6j32K52j20j61K16k27J20N9j32
6063i2Q2P7N3j08KJ24M0l52K35m5R1p6j0nj9M6j45o2l6J42K6o0J11j35J69j28
6089g5j4J64p2k8m8J14r2j06Q9j1L6P6r6J3q8K29j23oJ67j20j8o6n9M9J05l4O1
6116D7q6p8K52l4j1n6m9J52n3j10q0o5J71j32r1J85M3r1L4o8n5K52L5k18J76o9
$$ y = [-52, 1, -35, -141, 61, -6, 138, -5, -79, -27, -15, -103, -5, 74, 156, 16, 44, 143, 176, 96, 28, 53, -27, -73, -145, 25, -59, 85, -100, 81, -18, -56, 61, -15, 138, -144, 67, 35, -122, 147, 25, -26, 11, 145, -76, 81, 123, 50, 14, -5, -23, -56, 62, -32, -126, 58, -19, -66, -53, -93, 119, 52, -127, -79, -62, -70, 43, 89, 26, 97, 37, -15, 10, 26, -112, 10, -93, 228, 31, -112, -186, -120, -78, 11, -32, -6, -127, 111, -117, 127, -106, 163, 199, 14, 192, -179, 84, 84, -118, -48, 152, -82, -158, 86, -4, -157, -165, 89, -26, -5, -21, -55, 6, -23, 7, 33, -99, 153, 33, -128, 88, -139, -19, 40, -92, -10, 67, 120, 12, 14, 138, 178, -174, 61, 16, 107, 31, 21, 16, -3, 43, -102, -164, -200, -58, -32, -92, 19, -116, 53, -75, -89, 75, 3, -25, -73, 41, -51, -157, -68, -79, -43, 33, -63, -50, -138, 91, -32, -38, 129, 9, -9, -75, -134, -85, 20, -14, 47, -39, -117, 135, 101, 90, 34, -15, 137, 84, -26, -106, -171, 0, -132, -223, -38, 5, -86, -52, -120, -175, 77, 112, -106, 70, 1]
6142AqK48k79J03j86o7L46l18J92KN3mk07J42j01n7J35j01J62m7Mp5J46j55l5
6167a06Q3k10K08k1k5J93j97J71j54K29l58J06J53k20L40l53J85O0J19k38r9L63
6189B29j17k7r9J60k11Q6k55K13L1k5M9o9O3j00j14K11k94K77qO1p7N7J3O8j64
6214d2N2K7J91j13k69J94l5j51J45k10J77J60Kj19Q3p6J42k85J18P7j34J54j9
6237F9O4k00M5O9J07k14K97l47K64j98Jj01L1ql0J94K3j05J88J3l1m2j17o0J06
6262A8J63l37J55J11K8o1j77L2k8j1J91j56J34P5j94m1J22M2M1j05j01M8O9K5
6286D3k1k26K33lj2j79J4J45k83L79j20J49k03J39Q3j03l1J00N3k78J18r0N3k4
6310f4K1o7P8N8J19j21%J42j94N5j36K07m9P6j21m8mJ11m3j30J43j11R5l9k03
$$ y = [1, -7, 241, -38, 65, -121, -188, 158, -160, 32, 34, 87, 83, -124, 18, -83, -140, -5, -106, 56, 9, 13, -62, 84, -71, -106, -23, -233, -25, -46, -71, 122, -75, 96, -58, 171, -187, -81, 72, -148, 192, -161, 24, 84, 203, -35, -134, 229, 112, 85, -14, 146, -65, 21, -234, -21, 10, -15, 34, -35, 28, -72, -186, 25, -269, 8, 0, 61, -16, 41, 54, 122, -42, 10, 37, 228, 115, -154, 40, 5, -146, -1, -211, -34, 126, 128, 9, 92, 16, 158, -127, -9, 68, -66, 88, 69, 133, -67, -22, 47, 154, -60, 237, -110, 154, -44, -43, -144, -113, -121, -151, 43, 66, -39, 149, 162, 131, 89, -28, -88, 18, 181, -156, -1, 110, 138, 77, -100, -68, -96, -107, 84, -72, 62, 137, -57, -98, 24, 66, 107, 2, -99, -51, 18, 43, 22, -204, 29, 26, 14, -165, -151, -6, -289, 90, -30, 119, -84, 55, 138, 35, 4, 104, 157, -121, -3, -93, -40, -64, -43, -110, -32, 26, 145, 24, 24, 166, -28, 27, -109, 98, 49, 125, 4, -44, -48, 63, 20, -110, 33, -78, 17, -22, -225]
6335b25N40l46L2l5J16mr4R7m7L3r8M1m5L14l73J3J9K9jp1R7o8J66m9l2P0j40
6362f1L0J47j71J29k9m1M6k2L6m9J39o8q8Mj41K36nj57R1J9K5j37J44j25J14J17
6388A83j13r7J43j99K30m6j21M6J01k09M9J17k98K09o4Q3Q1j94K0K87k01J21o7
6411F1o2J06p1n2J17m8j81J49pQj26k4j21J01J9P8J30o0J03j48j8j11J62o1L6
6436b0Q7q6Q7r0K2j53L6M4K4N4P0j1k01K02n7JJ02m7L3j26oJ07j25j0J04K3j96
6463a32K98n3j73J70k42J25Oj8j6K1p7J36k6r5K97j34p2l1j3L2J60r9p0J86j55
6488B5P1k51J15J7k11K10O8ll2O1j79J14q3M0J41j67q6K35lj78K69k24R5k11R4
6513g3Q7Q3j33L9mJ39q1QMn8J34j08n7pL2j17Lk2K04k81J07j0J72m4l5M7J02J9
$$ y = [-225, 315, -31, 1, -34, 82, 78, -16, 81, 34, 67, -31, 10, -35, 279, -94, -81, -62, -33, -34, -105, -8, -76, 90, 41, 9, 79, -61, -31, 116, -55, 74, 45, 4, 50, 28, 64, 15, 154, 86, -2, 2, -139, 97, 92, -65, 26, 45, 70, -67, 77, -48, 66, 183, 70, -27, 116, -83, 147, 101, -20, 26, 127, -82, -33, 84, -214, -5, -69, 14, 95, -99, -79, 208, 7, 128, 61, -1, 105, 34, -18, 99, 51, -130, 19, 12, 20, -106, -130, -251, -150, -131, -53, 77, 17, 120, -28, -46, -157, 5, -56, -20, 67, -19, 68, -22, 0, -153, -117, -73, -49, 5, 75, 64, -137, 65, 8, 9, 111, 64, 97, -29, -35, 72, -53, -63, 41, 64, -132, 166, 113, -60, 110, -132, -7, -1, -19, -35, -14, -91, 45, 19, -76, 221, 87, 15, -16, -29, 3, 163, 64, -6, 180, 25, 96, -155, -40, -23, -234, -24, 44, 41, 9, 70, -109, 5, -78, -38, 103, -64, -150, 85, 82, -96, 173, -51, 44, -167, -73, 14, 97, -36, 3, -1, 138, 57, 65, 69, 11, 145, 37, -20, -27, 5, -112, -109, -131, 73, -208, -101, -111, 61, 17, -18, 29, 131, 150]
6541A50r4k3Q1j33O6r0K07j96o8J08j09l1J29j44J68q7O6J41k70O2pQ2R2J4O1
6566A75j97J5M5K9lj65J90o5m9j13j1J54J00j79K32j61j21K59k71J08N3j17R5
6589CL1j5j79K19k33L57j42j49J56r5J6LN0Q5j17J47r3K19k88j10J93j8J22j60
6613Bn0L8O2J02k76J52r2J02j17K11k40n9R9j2P3J72j43M2k6j68J58j64J39n0
6637d5l6n1K34j2k24J28NR5m7j25k4K6M4Q8o9j8j21J41n1kN6J83j12j06n4K20
6663A23k1k22K08j62L8o9R7K37k73r1Q9J12j26M1J05m2%J29j68l8l2qj2J38j5
6688C8j33P2Q8r3RJ90k52M8j35L12n4k15J14J72kk61P8J56k57J20K04k94K91j37
6712E9Jo6L9q7k5K37m5j44J6R0m4m9Q1j44K12j69j5L8k17L54j77J70j90L16j62
$$ y = [150, 56, 33, 114, -19, 47, -43, 164, -32, -100, 8, -101, -132, -3, -147, 21, -66, 0, 141, -129, -67, -74, 8, 100, 114, 175, -22, -7, 38, 67, 64, -101, 89, 24, -25, -138, -149, 5, 105, -74, 158, -3, -124, 135, -136, -28, 25, -92, 3, 34, 19, -160, 59, -174, 183, 41, -108, 48, -47, -31, -28, 22, 107, -10, 137, 44, 263, -25, -135, 58, 40, 162, 2, -48, -10, 52, 154, -122, 30, -62, 40, -77, 134, -106, -165, -66, -78, -5, 167, 24, 66, 40, -128, 30, -134, 5, -45, -81, -132, 102, 90, -134, -6, -1, 94, 47, -78, -102, -76, -32, 56, -13, -31, -152, -11, -62, -64, -8, 175, 63, -43, -97, 123, 102, -120, 88, -74, -36, -105, -8, 229, -44, -135, -46, 66, -60, -19, 86, 44, 44, 173, 5, -33, -65, -73, -85, 53, 38, -95, -23, 65, -28, -19, 171, -81, -33, -168, 144, 90, -125, -11, 161, 159, -102, -24, 132, -125, -5, 199, -95, 196, 59, 60, -6, 33, -54, -79, 158, 113, -31, -15, 75, 31, -18, 63, -81, 131, -38, -53, -15, -232, 122, -55, 115, -75, 241, 79]
6737G9K8m8j8o7k1L7P3O2q1K7p3Jnq5K24j84m9J77o9j71J63j6N5m8J32O0k92O7
6765d2J05j34N5J54j22L3j04mj3O8L1j93J96J4l1j46J86J19k96J35q9J7M6J24
6789A09m7J58o3j7j94J39j35N8p5Mj09K11j37O0R2j02J14p2k4JJ51j27N5l4M2
6814E8k08K63j23q5K3J50j56J52j34N1N4R3o7m3j89M6J11Op0J50j52K30j64N3
6838D9L8j14P1q5q7M4K48j0k04jK23j64oJ09j59K16k07K5m0N5k5P1j22P2l6Q2
6864D3j92K06o0J34n7Rl35J58m2qK49o3K9l2k25J47j4K02J15k63J50kk31J05N1
6889G4j73P1n8j5r1Q9P2J39k78J39L18l22j49K33P1k53J13n7Q0m7m1J3Q7Q0p6
6914A9J88k73j24K91P8j38m0k3k2P7l0L5K1j91J36j00K0R2q2k7J16j89J26R8J2
$$ y = [79, 107, 59, 41, -26, -47, -10, 63, 125, 44, 71, -2, -1, -6, -91, 133, -51, -100, 77, 8, -163, 0, -16, 39, -9, 123, 183, -109, -42, 63, -71, -16, 138, 16, 49, -55, -59, -72, -4, 27, -166, 30, 44, 13, -133, 53, 172, -124, 11, -78, -61, -15, 109, 62, 220, 157, 140, -54, 85, -50, 8, -67, -63, -172, 39, -98, -38, 54, -48, 66, -6, -30, -29, 122, -5, 50, 16, 58, -150, 113, -10, -95, -72, 78, -78, 74, -60, -9, 45, 138, 71, 28, -161, -115, -4, 2, -68, 82, -70, 160, -4, 49, 87, -27, 44, -41, -128, -84, 164, 154, -50, -51, 172, 8, 2, 111, -48, 168, -39, -14, -54, 1, -24, 47, -75, -3, -39, 43, -149, 57, -3, 131, 74, 83, -252, -94, -136, -144, 105, 42, 71, 39, -186, -39, -53, 149, 264, 1, 151, 149, -82, 23, 74, -99, -28, -86, -101, -192, -103, -31, 108, -170, -31, 287, -35, -184, 49, 120, -133, -20, -77, 3, -44, -85, -72, 15, 95, 19, 207, -66, -190, 101, 179, 41, 1, -22, -44, 33, 3, 38, 59, -132, 4, -96, -76, 16, -66, -93, 23, -166, -40, 58, 70]
6939G0o5J0R3O0k12Q5%J9Q6j83J60j05p6n5O1Q2Q5k14l8J19n9j23K77Kn6Q4j14
6966gR0j67j6J82o5nL7j09q5O2K86l66R8n9L31k09p7J10j31J92j67p4L63j86j58
6991a30Q0J83j07ol5J69j68R3j02j31J46j14J05l3kp8L4O2J88k33M6P9r2J60r8
7016A6k2j31J92r9K7k4R5j04J20l9o0KK44j12j59j14j5L57j35P1j34L7j04rJ47
7041D7p3l2M8mJ38j67j27J69q2K6J67n9j53J43n2J9m4m4Q1J82j23M8O5k43J1J18
7067E9n6o7R2q6J75k18J54K7q1N0rr2N9r5R6O5pO2k97J02j0Q3Qm2oj7N1j31J70
7096C9j21J99r8k0K3N5j38J37k54J85J3L3Jmp8j01P2r0J23p0J47p3j13M5J94j63
7122e7J94Q7l12N6J28j61J48Q0j80j19K47k37J02J35j26R0m2n8p6J09m7J13o4
$$ y = [70, 5, 15, 108, 168, -44, 41, 41, 60, 146, -37, 123, 18, -58, -113, -52, 30, 115, -99, -137, -18, -77, -200, 77, 79, 23, 107, -7, 83, -84, -100, 82, 17, 12, 49, -60, -145, -83, 203, -163, -65, -124, 207, -2, -79, 31, -100, 92, -75, -149, 214, 28, -130, -50, 133, 26, 20, -15, 154, -14, 79, -23, -154, -8, -122, -17, -50, -52, -130, -96, -34, 154, -79, -33, 46, -46, 114, 16, -6, -137, 55, -44, -17, -41, 54, -50, 70, 31, -29, -27, 217, 105, -54, -168, -183, 174, 39, 110, -24, 13, -91, -100, 47, -26, -58, -10, -14, 124, -43, -170, -1, -83, -57, 110, 51, -102, 41, -11, 8, -36, -80, 1, 183, 60, 108, 173, -70, -59, 59, 3, -64, 28, -58, 117, -101, 53, 80, -1, 49, 40, -52, 7, -88, 8, 73, 66, 128, -169, -67, -77, 6, 14, -28, -34, -51, 0, -131, 39, -82, 117, 19, -1, 22, 77, -61, 76, -178, 7, 20, 53, 54, 50, -28, -129, -57, -147, -24, -94, 53, -20, -133, -88, 106, -57, 137, 224, -88, -32, 96, -65, 83, 163, -17, -136, 111, -126, -24, 111, -15, 75, 33, -25, -101, 8, -39, 74, 10]
7145A0P8j77R0j18J90j64q6J43J38k8j56j02j8J90J80l11K41J3K1j48K23r9qm1
7169F1m8M8j4j0k1n6o7K08l09K70k2k19J40r4J1L7R7p1J03k5j17J01K6lJ27j12
7195D1K4J9k24L8K19k14J75j28O6p8Q5oj63O8J55j51K8J63k8o6k00J55o2P9n8
7220f3K39k67K8J05j69o7Q7J50l7J7j2n4R1k12L17k23J95k4L2j98P0L4o5J93k79
7245a12m3j12K47m2O2k0n5K42k08K47j22Kn7Q3m5Q6j62n7K24j59n0MJ67j73r3
7270a46J24K4j07J10M8%j22L0K72j34j78PP4O7M3n0m5O0j23J1K6MJ11j56l9K60
7296A71j74L2L1N7j02N4p3J65j82Q2k8K3R1m1j0O5k21J4K0J22j08M1Q8j07j01
7321i1K25L7l2j37l0J17j16K06j34M2kj19Q2p3M5M0j75R6J17q6k8K12j80r2O0
$$ y = [10, 88, -89, 1, -117, 73, -91, -177, -34, 104, 76, -80, -182, -200, -10, 170, -141, 100, 113, 134, -14, 209, 110, 102, 61, 13, 61, 47, 37, 16, -40, -107, 101, -208, 62, 40, -179, -39, -133, -122, -85, 12, -59, 44, 19, -98, 3, 29, 26, 153, 41, 65, 84, -140, -102, 117, -97, 78, -50, 16, -62, 23, 17, -146, -78, 77, -74, -46, 117, 89, 23, -177, -22, -84, -5, -63, 176, -91, -63, 42, -127, -194, -107, 43, 6, 23, 11, -43, 48, -164, 153, -70, 125, 101, 133, -65, 5, 39, -26, 167, -112, -155, -267, -20, -62, 0, -20, -75, 167, -41, 206, 84, 86, 29, 112, 67, 153, -9, -66, 158, -1, -51, -47, 120, -53, -146, -22, 2, -105, 5, 53, 53, -69, -39, 233, 99, -79, -72, 2, 69, 112, 62, 17, 77, -46, -35, -9, -5, 106, -50, -89, 171, -3, 29, 60, 117, 15, 69, -4, 161, -21, 61, 33, 56, 147, 106, 96, 161, -60, -46, -26, 96, -12, 29, 117, 10, -91, 134, 171, 139, 2, -28, 89, -27, 179, 45, 87, 85, -34, 48, -25, 20, 60, -115, -19, 98, 12, -16, 196, 16, -76, -16]
7346a6j03L2M9P7n3m7J0k7l6J30M3j69M5J8m9j52K55N4kQ2l7p3j27K83j31j10
7372e4K11k25K8N1j15M2m2J64qj49P3m5Ml3J44K1P5j22j21K31k00J25j97J42J11
7397A11j99J05k63L19k63K64j08n9j04J81O6j09J11J44l04jL28j01k93J02P1l4
7419c6J75l01K0J49j5J29q1k51K41R1k13J08J6L5J09j54J7J27j63j37L7J69j42
7442g0No6K23k5p7j50J78Q1o8M4N4p8k5J0k04K51k2Q3k09J66k30J81j00m2J02
7467A2N9k13j3K38k15J44m9K5j34K36j15j52K14j07J8J56n4j4j20Q1n4Q7j25K48
7491A53j37j53J98r2k3K38j89O3l2M9q2m7J16J7p5K07j23j97L17l39J57j09K56
7514A73l65K55j30P3j55K54J15k42N7L3K7k06K38r1m0l7m2%J94K7l28J24n5K30
$$ y = [-16, -119, -87, -38, 39, -14, -61, -51, -78, -114, 16, 59, -110, -65, -47, -96, -248, 7, 61, 59, 141, 104, 31, -96, 187, 56, -54, 157, -68, -40, 11, -104, -62, -104, 60, 52, -97, -24, -69, -65, -98, 46, 67, 142, 20, -101, 130, -70, 55, -142, 0, 111, -88, 17, -246, 73, -190, 74, -34, -93, -197, -16, 50, -59, 52, 196, -108, -109, 219, 118, -175, -73, -2, -36, 139, -162, -142, 7, -8, 121, 40, -211, 30, 121, -92, 16, 32, 67, 176, 22, 39, 166, 3, -134, -97, 72, -70, -65, -131, 92, 67, -10, -160, 18, 99, 31, 75, 129, 51, 26, 36, -168, 83, 61, 144, -65, 101, -129, 52, -48, -90, 12, 71, -142, -155, 83, -132, 12, -37, -12, -146, 90, -25, -177, 37, -70, -52, 104, 50, 36, -84, -3, -57, 30, -95, 153, 16, -137, 61, -31, -54, 184, -5, 58, 26, 75, -7, -54, 62, 79, 4, 211, 88, -109, 208, -131, 26, -83, 173, -192, 63, -67, 6, -149, 105, 220, -22, 35, 68, 95, -111, 127, 36, -4, -41, -83, -83, 111, 138, -190, -66, -121, 109]
7538A09j12P1l1r8J0J68j71P7J01lpj22N9j54M7P4K11j39j56J18q1n1J2J59O1
7563A52k32J10j03O9K0J6r5J2J9j36K93l6j23j9j41K58j53P7k2J63k17nK49j62
7587fnQ3o8M0k3R5l7L1j5j49Kl00K19J80q6Q0J9o0m3R4L7l2Rj94J92R4j95J40
7615A02j11j03J27Jj37K81j03p4J43r1R8k54P5m7M6J77n8j7j33J47l3L4j04k8
7639f2K76k03N1k34K43n9J6j19J65K1j88J93j87K40k13Q8p8J55j59J30L1q1N0
7662G6o9L8k02K59j23R6j49N1Q8j36L1p9L04j27p3N8q9K4QQ8P3j17q1Q6Pn4J60
7689A48j20k9P4J15k07m2k17K60j29J19N5j23J97j70P1o2o8J92o8LN8j10J7P0
7713C4j0PL3l8k91J90K2K6nN9j49J49K8n2O2J54l24J06O2r6k1Q6k46O3L52r8k32
$$ y = [109, -3, 68, 37, -61, -51, 117, -54, 23, 124, 121, 114, -8, 51, -103, -56, 18, 229, 90, -66, 52, -29, -80, -68, 91, 152, -80, 30, -73, -4, 16, 32, -63, -51, -32, -168, 125, 89, -34, -53, -194, 64, -89, -12, -34, 129, -88, -93, 156, -6, -11, 72, 4, 44, 21, 116, 79, 110, 95, -54, -52, -352, -133, 47, -39, 41, 60, 0, -43, 51, 88, 56, 65, -129, 63, 157, -38, 102, -9, -112, 15, 16, -121, 160, 57, -17, 126, 35, 133, -121, -46, -93, -47, 130, 72, 55, -78, 69, 36, 70, -34, -62, 214, 11, 62, -172, 71, 12, 28, -91, 74, 95, -93, 100, -87, 153, -60, 28, -50, 105, -54, 76, 107, 26, 76, 7, 45, -157, 102, -21, 75, -74, -23, 65, -71, -40, -119, 185, 58, -15, 43, -46, -22, -14, 74, 147, 30, -51, 35, 42, -12, 148, 28, -1, 73, 188, -19, -61, -278, -18, -147, -28, 27, -96, 101, -69, 2, -60, -128, 64, -4, -1, 57, -53, -36, 34, 24, 31, 64, 26, -265, -75, -53, -27, -32, 27, -122, 27, 55, 3, 65, 219, -105, 1, 63, -33, -54, 32, -214, -151, 201, 103, -129]
7740a29J21k46J70J05j12M9l6R6r5n0K18P8k13O8j17l2LPM7J93j62J48O0m0r5
7765C6k5j2K2R5k42K21j97J54r4j12J71M2j2j36K06k09jn9J53p4P9Nj01O7j0%
7791c3K17n9j3q5o3K5L1P5r7J3l9j54K37K4j59J09O8p3j88J54m1J59m3m0L7p7
7817a5L7J12k56J24Q7j51P4J8m5j18M8J8P1K0k0j3P6p9j09L18k79M6M5J17l2j55
7843f1J72L2r6M8j38O9j04J48l4M0K0r7K3o8J52k52J54q4q0L3n0pQ0L7j36K15
7869A6N2r7Q3j77O5J17l3n0P4J10j30k53J46J7J40J31k26J21j03O8j4j24O3j50
7893a54L61k33j7o5J04mR7K5o4k1n0N7k7nJ0m7m7L3P5Om6rl1J20J5p4j21K57j52
7922gJ05m7pMm8M9J6RL7j27j5J06j56r1M27k58j42K5K2J75j09J28k3j69N2kj5
$$ y = [-129, -8, -254, -84, 21, -91, -42, -78, 18, -77, -127, 91, 169, -44, 24, -93, -125, -122, -115, -68, 125, -37, 111, 171, 131, 36, 11, -1, 21, 116, -126, 95, -102, 52, -42, -154, 17, 59, 47, -89, 117, -92, -93, -152, 1, -73, 6, 11, -90, -23, -33, -33, 184, 125, 112, 27, -36, -11, 20, 95, -2, 11, -28, -182, 55, 79, -80, 29, 97, 24, -164, -10, -51, 108, 65, 25, 62, -15, 22, 134, -122, 2, 89, -62, 12, 30, -15, -133, -85, -67, 4, 24, 4, -9, 67, -12, -121, 197, -82, -36, 9, 126, 94, -61, 111, 143, 47, 95, -43, 26, -78, 70, 36, 76, 96, -1, 22, -46, 106, -146, 8, -76, -156, -123, -173, -180, -100, -63, -199, 16, 68, -29, 54, -123, -58, 59, 26, -24, 50, 160, 30, -223, -77, -60, 80, 211, -15, 106, 3, 71, 57, -67, -4, -154, 207, -26, -43, -108, -4, -8, 89, 114, 50, 29, -21, 36, 9, 4, 14, -33, -80, -47, 28, 34, -12, -21, -52, 68, 83, 9, -112, 145, -7, 98, 51, 44, 48, 0, 49, 65, 74, 111, -16, -31, 75, -81, -172, 255, -3, -145, -120, -98, 77, -32, 96, 73, -96, -44, -46, -61]
7949f1R9j20J84k37Q4N2JK9O6n5k6J2m2j34J33M6M6O8j22m9J4n4J02q8J8k3L5
7976b2K0k8J07J40k47L0l7j19L6n2K57k09K2J64j64O6m0J86k80J67j58Q9m4J59
8000D3j04OJ71p1n3q6O1l5J81j64L1r0K17n3%k71J63nN5P5j61K13P4j72j89rK66
8027I3j66J89J3j66n9J56j50R0J56l13J86q6J11j27L8O9n9N3J45kk36K89k21J
8051Dq5M3Q5j14M2J73j96K5L9J3j0K05j76M9r5l4M1o1n6J12K3o7J89l18K29r4
8077c4j4J21j51%R9j10J65npj12L6l8n2J55Mk0j58K09L2l6j03K0J4p3%J38o4J85
8105B01k25J58p9j37J44j7l9J7Qq9J1m3J04p0rJ60k23J01k3O3R1o7ql0P4n6Mq4
8133f3j8O3RkJ65r2j46Q9L5o3J20j82k7J08J8l2K02j35k56J83K3r2J36pj52J91
$$ y = [-61, 38, -82, 102, -135, -51, 1, 2, 31, 97, 42, 16, 28, -14, -148, -15, 31, 77, 145, 23, -26, -12, -66, 36, -52, -34, -57, -22, -2, -30, 77, 217, -30, 0, -37, -156, -120, -172, 85, -124, -102, 62, -102, -36, -76, 110, -170, -3, -161, -72, -116, 43, -61, -55, 116, 45, -8, -94, -33, -68, 113, -51, -20, -110, 107, 54, 54, -217, -54, -59, -4, 71, -90, 123, 197, 25, -164, -173, 93, -73, 116, 129, -37, -96, 60, -90, 0, 156, -157, 29, -57, 54, -73, -35, 34, -25, 28, 173, 171, -65, 224, 3, 4, -81, -38, 47, -67, -25, 148, -48, -23, 16, 29, 19, 224, 48, 97, 2, -32, 9, -52, -108, 4, 27, -40, 149, -169, 60, -34, -48, 73, -78, -78, 21, -89, 76, 71, 64, -48, -12, -50, -102, 53, 57, 37, -121, 88, 120, 84, -19, 1, 15, -58, -58, 80, 16, 201, -24, 134, 55, -82, 62, 45, 6, 23, 31, -58, -47, -90, 14, -56, -65, 95, -128, -27, -50, 13, 104, 37, 29, -1, 73, 17, 21, -63, -81, -18, -9, -11, 154, 62, -84, 5, 40, -23, 97, -85, -112, -4, 14, -18, 184, 49, -207, -24, -1, -93, 43, 36, -116, 75]
8159G5P2j28J4j37j14K56l3k9Pq9J02J3j3n3J89j85L6Kj20K18j11O2k3l1N1j06
8185g5R0J8Rn2J15q1
$$ y = [75, 147, 19, 33, -104, -218, 38, 5, -24, -17, -106, -4, 9, -4, -57, 132, -53, -17, -15, -135, 83, -28, 34, 11, -20, 31, -75, 15, 33, 42, -10, 105, 24]
8191B4
$$ Imaginary data points
##PAGE= N=2
##DATA TABLE= (X++(I..I)), XYDATA
0@%%%%%%%%%%%qJ6j6J6k2L0l2M0m9N7p2Q8j04J20j37J61j92K22k54K89l29L76
33B00m25M79n40O09o84P66q57R55j062J177j304J444j595J761j944K143k361K601
51A363k864L156l483L847m254M715n241N849o563P412q441R720j1360J3551j6646
66i239K1381k9616M7978j64419O3252K84770j71901j57395N1537J24350n4272
77F426j4759J067l2711k6151R2758P0462o9200r4439O09O7151M5755m6583m4327
90d3942P943M6561j3612j9553J4046k386k4159K5999N6269m2609o5752M4650M9312
103C2767l5120k3118O2033j917p7596J915O8998j6726p1784L7349O7950l4491
115A0260o0399K5682N1174l6321m7811M0881O8538k5385p0236J8108O2566j2512
$$ y = [0, 0, 0, 0, 0, 0, 0, 0, 0, 0, 0, 0, -8, 8, -8, 8, -14, 16, -16, 24, -25, 32, -40, 48, -56, 64, -73, 88, -104, 118, -136, 153, -176, 200, -225, 254, -286, 323, -361, 405, -452, 503, -559, 618, -686, 758, -837, 924, -1020, 1123, -1238, 1363, -1501, 1655, -1828, 2019, -2235, 2480, -2761, 3088, -3475, 3937, -4504, 5216, -6144, 7407, -9239, 12142, -17474, 30504, -133915, -70663, 214107, 42206, -115189, -63652, 60698, 6426, -8333, -7266, -39977, -66128, 26630, 97092, 27892, -66547, -65938, 1213, 46968, 385, -43942, -35999, 10562, -3050, -22603, -8557, -10943, -35102, -9103, 47166, 4557, -61195, -16545, 32767, -2353, -25471, 36562, 34645, -42951, -41036, 27962, 11236, -60548, -23199, 44751, 10260, -50139, -24457, 26717, -9604, -57415, -16534, 52004, 26619, -43617, -25509, 37057, 24545]
127B4545o5851J6271O7172k2233n9509K0597M6647l2406l9012L3356K9873k5972
139f522j8467K5249p79k1181J8398K2165j6846j8509J9921J7834j4968k0784M524
152i965J8829K52j4522q689J0431O141j5328N40J7858q693k2321J7866K5975j9716
166a342j8466K6058J9002k8837j0042L2581m624l8922J0717M4678j0179m5273
178b4649Q55L5278K609l0481p147J7105J0577J339k957m528m311L004J2119O615
192A5428j4567j3299J4917J7416p455j9626l01J1516l618o825M753j911j0046
205a3618O955J6496k540j6277k319J5967N783j0371j707Q218L138l101j081J71
219E714m336o301L092P213o090o718N637M613o796m968R626N902j1200m272J6075
$$ y = [24545, -41306, -25035, 42137, 19904, -39605, -19008, 27639, -4767, -43779, -10423, 19450, -6522, -24989, 260, -519, -21700, -3302, 18863, 2017, -16492, 3429, 21263, 6295, -14489, -9965, 8864, 9116, -5406, -14095, -3664, 2477, -12851, -12311, 5547, -3146, -25467, -7601, 18374, -1342, -19808, 6250, 25252, -3585, -13627, 18954, 14330, -24592, -13875, 30803, 20624, -24649, -23794, 11484, 14093, -16388, -23535, -6430, 4147, 5486, 2529, -1999, -6310, -3306, 8813, 15428, 861, -12438, 2479, 19895, 12440, -7186, -7487, 4029, 411, -6414, -1661, -3572, -13618, -6663, 9833, 7293, -8984, -11303, 4664, 10447, 76, -1631, 6587, 9725, 6624, 5543, 5714, 1378, -4923, -1831, 5382, -708, -7426, -1789, 2824, -3972, -8940, 686, 6588, -4612, -8884, 7191]
234G191P103j2387m706R841N343o733n526J751r63j470M231n49p889o5N689m19
250D42n799j951O681N794k928k246L208L835o08m262k5N284n65n152N48J015k995
267B76k095J210Q49l383j738M574L21m303K530N299m61q87K211J900k329k614
283A360L733K469m847j743K787M4l654l579k72K456m21m23J087n43Q38K446K14
300A952m58O9J694L436p50l413R62J395r77k089j211L53r04k956K62J445j594
317b784K6J752J065Q57m01M1J369O90J578J370j540m30Q47o23j898k035j223J717
335C78n12k121K14j31k04K19M96J254O55j08K427J359j173N33O40l09K45o54j164
354B044j057j522K62K29k254m35P09j00O56l03j020J539K417J484k74m37J396
$$ y = [7191, 14294, 1907, -2799, 7042, 12385, 5652, 126, 1877, 914, -556, 3675, 3126, -4763, -4828, 861, 442, -5357, -7308, -627, 5167, 2239, -7, 3201, 7036, 6428, 2166, 2141, 7425, 6860, 1708, 2256, 3271, 276, -1819, -609, 240, -3143, -4881, -307, 14, -4289, -1759, 3540, 3079, 2192, 4403, 6303, 3974, 1360, 5093, 7562, 2715, 972, 3759, 3803, 149, -3430, -3702, -1246, -1667, -2090, -1003, -1546, -708, 1738, 1952, 1494, 1563, 3257, 6693, 5943, 2530, 3492, 4887, 3910, 1821, 610, 963, 59, -2897, -2635, -1190, -2784, -2758, -1006, 59, 916, 515, 556, 1925, 2615, 4193, 5563, 4023, 3593, 4440, 3817, 1919, -116, -1339, 378, -134, -2255, -2041, -2172, -2376, -2157, -1661, -407, 248, 140, 2567, 3926, 2753, 3286, 3926, 3617, 3862, 3208, 2044, 987, -535, -273, -44, -2298, -2733, -2024, -2124, -1468, -1771, -2791, -1252, 1165, 2649, 2375, 1938, 3334]
371C334P66j100P7q34j616J278L25k604j434J44P4j223m82R26M75p90K473J939
389A728j871N04K391O11l19n25j55j12l13kr66j959J70L96j805n36k64j118J255
408b890K272M95J40j42N79J027K76O95o05k18K363J52k429n02j835l197J266L130
426E77j331l279L87K666Q3j594J035k72L64N316J417m922m58L162n94j432K088
443C213k86n828m37O018k154p334K958M870l452p25L088k028l239N310N274l475
459A773j838N276k004o354M057M193n698j268N994k295p139K325L827o911l170
474i232J0221M446p193j525K579k028K759N837l177n960N083P226n061p104J623
489a506M6k104O304L125j1245n821Q736P154m179n636l82L071N885L361o174o251
$$ y = [3334, 4100, 3000, 3077, 2243, 627, 1905, 2230, -374, -1808, -1664, -1590, -2813, -3295, -2369, -1894, -2684, -211, 1728, -143, 361, 2752, 3363, 3044, 2519, 2364, 2252, 1939, 1937, 971, -988, -818, -422, -2227, -2763, -3027, -4145, -2890, -618, -123, 17, -125, 454, 1481, 1757, 2452, 1847, 1629, 3992, 4144, 1715, 1213, -622, -3819, -2553, 577, -754, -4033, -3646, -980, -897, -2491, -1456, -1728, -1364, 3952, 5369, 447, -11, 3151, 2557, 1125, 3213, 2927, -2901, -3338, 2680, 526, -6808, -3850, 1020, -2432, -3157, -69, -2097, -5336, -26, 5248, 1773, -65, 5211, 3207, -3147, 910, 5103, -595, -1863, 4131, 1836, -5303, -2978, 849, -6062, -9232, 989, 5435, -1758, -3283, -704, -2732, 27, 5864, 2687, -3273, 1810, 9036, 3975, -3129, -1506, -1460, -3564, 2740, 5865, -5380, -11201, -2465, 4689, 510, -5126, -5508, -2437, 3448, 6809, 635, -5616]
505e616O523O776k961l392j465m617J248Q649P84r557m025O127K214m063j133
520d508J65J192O847K637o895k399M177o62j940N698K629o934k573O598j670q599
536f237K185N186l273o88L507l009l400N201K310m813K289Q049n696r258Q400
551G53R157p693n028P176M89q284n06L310k992m61O867M35o428K45R90m538K331
568d177Q191m65l068M644J821q711m382P265L044m672J799L800m540m695J116
583c030p22j495L100L847j014k001J188p66k077L355L894j707j355J386l7k238
599C28j762R32K680j84l168j743Q03J46k946Q85O523R51n386k2K445j427o9L279
617B265J509j330J057J072m700l860K791J270j937K969J603n429k176L406j52
$$ y = [-5616, 907, 7683, 4722, 1330, -135, -4752, -3504, 5145, 5929, -3628, -7653, -1526, 688, -3375, -4508, -4343, -3151, 3696, 6333, -562, -2961, 1216, 554, -1386, 4312, 6941, 7, -2566, 4032, 2362, -6237, -4052, 1134, -2139, -2827, 680, -2329, -5729, -528, 1782, -3031, -742, 7307, 1611, -7647, 753, 9910, 2217, -2811, 4365, 4854, -3430, -3936, -626, -3618, -4079, 2788, 3223, -3205, -2960, -1970, -6508, -4177, 4014, 3549, 481, 5125, 6946, -1765, -6147, 1118, 4162, -510, 1289, 5089, 549, -4146, -3030, -3752, -5247, -2147, 1700, 686, -1315, -127, -893, -2970, 385, 4279, 2572, 1217, 2603, 2566, 328, -1434, -502, 2178, 1994, -1174, -2917, -2114, -1968, -4914, -4029, 2494, 3445, -1941, -1963, 482, -945, -1014, 2265, 3774, 2444, 3501, 4573, -127, -3987, -1196, 74, -1863, 1106, 2709, -2720, -4896, -1490, -1642]
632a642k613L019M468k600q93M549j453o273K888N819k927k794K967n88m963J539
648a497M015m489m039O050J642o156L66O094j018l402L499K665l665j338L821
663B548K97k530K189J459m366j856K472j320k006K006J415j891m74K165r29k815
679c636K713L021j456P24K301j972k195K045J735k782j616K213M65k785n84R16
695h93j436L32J735p02j330R63J801K7l87J146J132n80n49l47m60R50L68j739
713C1J6J111j632k093K43J011n63L06J626nj276J124J531j403p0K379K48j205
731A379O4O48j464j270Q78K41j608k61P39j118l9Q93n65q4J447Q19n41m80J744
750A422L59p02N18N04j166k05J088j651j556N06J238j267j346P43R01j057J75
$$ y = [-1642, -4255, -1236, 3232, 632, -261, 4288, 2835, -3438, -550, 5269, 2342, -452, 2515, 1927, -3036, -1497, 2518, -1971, -6010, 40, 1682, -4474, -4108, 1986, 968, -2434, 1065, 3730, 65, -1273, 2548, 2845, 315, 2504, 3963, -403, -2259, 213, -1107, -3113, -1107, 308, -1583, -2057, 108, -821, -3636, -923, 2098, 642, 1366, 3667, 1695, -500, 1545, 3280, 498, -1118, 1095, 1560, -1225, -1809, -893, -2329, -1997, -262, -964, -2294, -1331, 470, 497, 110, 1256, 2388, 1808, 1259, 912, 452, 1402, 1770, 31, 47, 1158, -474, -2567, -2324, -1313, -1876, -1570, 56, 51, -1225, -101, 1430, 27, -43, 2336, 2584, 1379, 1443, 2091, 627, -643, 235, 476, -1132, -1393, -654, -1772, -1811, -918, -1483, -1567, -120, 699, 158, -322, 1422, 1781, 1079, 1597, 2101, 935, 730, 1818, 167, -1389, -883, 355, -912, -2258, -1515, -614, -1671, -1496]
767a496J518j76j88J179M59n0k14L80L14n85J3J27j193o78M54n36n64l6l48M14
787a206L55j25RK13Q30O70k89L25O39j13O4J74m40m63l4l90p4p83m28K11m71j32
809a458N37k20K52K43M68P13J90l10M24P82o1l00l07k1j36n08m86j95m06n7j16
830i72n49l5M46K74K86M1M54P33Q3K30K01j1j00J39k77J03o53p71n2j98jl63n84
853a576K04O64l70K24L76Q8O95P12j58p4J12L99M41r26j37K47j000L7l0q69l23
874a264j1j7K55R4K25K19n3P16O36l12L05N14j68J17K01p95l64l01K73l24p12
895g66p0K2o89J63O70l02O1N48O3N74O41r5j22J85N77j29o81m8p1j034L79O14
917D90j147j074N55K55k94K04M35r0J7J721K41j626J79J615k68k89Q11o38j592
$$ y = [-1496, 22, -154, -342, 837, 1296, 1246, 1032, 1412, 1726, 1141, 1154, 1281, 88, -590, -136, -672, -1236, -1272, -1620, -1206, -851, -976, -967, -754, 76, 746, 457, 782, 1421, 1308, 1372, 1546, 1106, 643, 609, 219, 145, -638, -1066, -855, -1326, -1458, -921, -1141, -889, -646, -178, 535, 725, 415, 839, 1621, 1560, 1260, 953, 932, 796, 288, -198, -393, -799, -856, -972, -1521, -1556, -1110, -836, -550, -509, -55, 678, 761, 991, 1192, 1181, 1081, 1220, 943, 1046, 393, -378, -430, -628, -629, -992, -1576, -1372, -708, -1078, -854, -478, -390, 305, 1017, 859, 785, 897, 1296, 1737, 811, 674, 921, -79, -42, -72, -941, -1264, -1275, -1292, -1037, -943, -718, -499, -552, 164, 800, 488, 793, 1307, 1139, 1256, 1457, 662, 298, -3, 270, -54, -766, -836, -814, -1503, -1340, -670, -972, -911, -363, -300, 274, 915, 820, 698, 883, 1460, 1331, 650, 602, 531, -503, -124, 490, -657, -1731, -1176, -921, -1215, -1011, -576, -666, -649, 1072, 1313, -313, -134, 1481, 1213, 924, 1735, 1097, -495]
936d95K95J209j177j752Q19R74j259M4J134j117m22K226O80j582L03J827n85j282
954a60J676Q10k426k09K008j551k191J414J200j533o12J557m32j761R73J431q75
971f81O04J916o54j158J038K93j318p1J266J81j234Q0J70j931m66J134R7l80O86
990d28J53k20L33oN9lJ345M13q55qM79n42o47K89o27rJ80r53o26Q66M48j079P21
1013g17J107p77j370J940J466j519L00K072r46j829Q85N23j849k71K065n32k179
1030a631J059R57k632O8K501m01j334J397J652j647n54K216j1j971J265J219k205
1047e2j003K235o39j610R03N32k444q17K624O46k010J243K576j851j632J598L40
1064F39j449J369K448n00k171J21m6k135k8J869k20m37J028n62j745k2R58N2O76
$$ y = [-495, -200, 1009, -168, -1920, -1101, -127, -1386, -1342, -208, -1325, -1747, 479, 1159, -423, -120, 1707, 1122, -160, 1516, 2326, -100, -309, 1699, 148, -2043, -629, 571, -962, -1574, -17, -449, -2210, -1237, 194, -681, -77, 1839, 1185, 27, 1065, 1358, 40, -31, 1235, 1416, 182, 262, 432, -1499, -1965, -831, -734, -1114, -428, -275, -495, -162, -168, -109, -112, 1233, 1646, 791, 783, 1262, 720, 73, 362, -265, -274, -94, -1047, -1673, -807, -359, -1438, -717, 390, -387, -1757, 183, 1649, 130, 430, 2502, 1556, -273, 612, 1135, -714, -985, 1080, 548, -1631, -572, 385, -2247, -2179, 322, -79, -1413, -16, 1636, -11, -565, 1651, 1640, -331, 934, 2153, -52, -1055, 1180, 541, -1069, -166, 366, -2078, -2895, -271, 375, -1635, -392, 2184, 333, -1299, 299, 639, -810, 559, 3007, 2507, 336, 457, 411, -1724, -1752, 117, -103, -540, 488, -74, -1819, -1841, -883, -831, -155]
1083a55J449M88j238j18J71r64K81J789k99j046K46n72j311j31Q52n2k00P96J18
1102A04j606MJ165K46P02J171l56j023J90o1q52J83J600Q6j628J75m2k553l23
1121b818K494M27j204J248R86j617j184J496Q95j083J356K187j678j909J014j3
1137E97j851M49J963p45j522P87L17k093J16K197m29j005J680Q84j735J04J778
1154A492n70q30J210N53k312l05J730o99j433R65O75j824n07J428K7r40J087J541
1172A288r24j140J616o5q94O71J077o67n61J35k8j134j07M79k86k84L08k18k90
1191a024O03q8k38P50M81O0j72L00K43k95j13N65o33m48K4l45j83k6j0pr8K61
1213c93l63j1N87J84m5P57N80p46m01Q93l58o78N60K10n91n75L93j54j192L11
$$ y = [-155, 1294, 1782, 544, 426, 597, -367, -86, 1703, 1404, 358, 604, 32, -1279, -1410, -558, -610, -810, -14, 104, -1502, -1498, -333, -87, 615, 1786, 1430, 407, 597, 536, -316, -133, 1467, 1553, -75, 100, 58, -2495, -2818, -324, 103, -1101, 147, 1133, -484, -1668, -172, 723, -360, 996, 3183, 1505, -404, 610, 597, -1254, -805, 1158, 413, -1109, -322, -5, -2098, -1982, 215, -214, -1219, 461, 1345, -390, -286, 1492, 922, 92, 1302, 1855, -457, -762, 968, 269, -1164, -199, 476, -1348, -1855, -427, -400, -1340, -253, 1288, 364, -776, 840, 775, -119, 552, 1629, 962, 401, 536, 508, -626, -733, -254, -540, -824, -516, -734, -1024, -421, -509, -747, 3, 484, 544, 372, 672, 915, 620, 507, 1072, 439, -9, 15, -330, -513, -539, -549, -556, -654, -393, -756, -767, -180, 4, -41, 716, 1296, 550, 149, 1042, 684, 6, 566, 776, 185, -390, 3, -151, -1343, -1032]
1233a032R64o76m30J108K77n48J73O44jk09O45L8l56JK12n11o37N73k79o85J56
1254e73M2l52K4N17K26n69K95Q30k68j52Q20K7m83K87M70m93n77rJ40m93k08J40
1276c59o9m53L28j33O6L29M3K51K18RM64j48J00J88m99J92qm43k03J98l98k71
1298e98J54K3l24P6O5M02j03L9M45m6O8L13K35j41q5j2j77k7j79j75l18n5J84
1321b36n45J61J71j46K12K33L0L44l7J53K70j32M9K49k58k42J47l23K7m06k2l0
1343c31k37J17j33J47l0P6O2O9N76j51q3N46J4j45J25j09m2l01j13L1m74j98L8
1366e46k2j25J21Q7N8Q3M41Q8J63n0J85J69k81J48L9j32k54k52M1j1l21l1L7k23
1390e88q1J75M3K08j00K11L32J16p7J53K1N8J74k59Q9l63j28O1m98k2J27j51r5
$$ y = [-1032, -68, -744, -1174, -66, 211, -337, -164, 480, 479, 270, 915, 953, 597, 598, 810, 299, -338, 235, -44, -729, -573, -531, -883, -859, -342, -116, -685, -390, 440, 172, 20, 840, 867, 384, 671, 1141, 648, 71, 62, 202, -291, -499, -359, -428, -881, -553, -686, -620, -291, -248, 3, 221, 230, 694, 546, 646, 834, 335, 527, 519, 76, -127, 71, -327, -598, -444, -421, -745, -669, -604, -202, -305, -266, 179, 133, 201, 514, 749, 608, 523, 511, 334, 307, 128, -47, -365, -420, -236, -781, -620, -449, -595, -383, -150, -120, 224, 187, 340, 610, 478, 527, 776, 518, 276, 423, 100, 127, -279, -301, -331, -568, -451, -584, -437, -467, -391, -329, -260, 316, 165, 82, 628, 642, 497, 622, 513, 471, 170, 57, 88, -386, -584, -546, -568, -693, -572, -485, -427, -344, 97, 185, 348, 298, 483, 652, 371, 519, 558, 426, 172, -80, -39, -50, -371, -402, -365, -588, -669, -494, -451, -243, -343, -132, 200, 316, 239, 392, 413, 471, 645, 386, 475, 112, -16, 45, -453, -475, -348, -499, -594]
1413e94M08k43K1J38L13o5J02J32M59k43k5L89o10m44N68rl59k82R0p9m47L10
1435d70K04k92J47N57p2k61M94J51k67l3N90j54l40j03R7k74k72M55k02o14Q1
1456e78J14l91J57O41j77o5L87J59o0k35M43K44k68J67P4k00m71k27rj24J33l7
1478c23n7j31L18l58k2L32J14K67L46J69l63J44j41o8j36L83Q2m93j38L40o98
1499d33m21N68Q3n90L51N93m44l20N66O84o18J49P33l91m91M78K05o99p3N56m40
1520D6q94M55L37j013J86J356k95j017Q00L24o06j20J165L0o54M94O13j154n15
1539d62J099m12r90N27Q88j028p43R48L33j065K26J146o02m40R34M25q83L76Q44
1558A121p73o65O26J22p64L65N30n89r80O58q9n34K59R89j5n08O35J60p46k1O65
$$ y = [-594, -186, -429, -408, -270, 43, -22, 80, 212, 671, 428, 403, 792, 182, -262, 306, 297, -62, -344, -254, -333, -780, -470, -266, -558, -411, 146, 74, -187, 307, 458, 191, 158, 748, 594, 254, 151, 248, -26, -298, 157, -45, -659, -578, -464, -855, -698, -57, -234, -299, 88, 247, 187, -48, 395, 639, 371, 538, 612, 412, -59, -286, -295, -419, -286, -323, -380, -511, -193, -551, -573, -241, -127, 140, 486, 655, 292, 436, 295, 227, 91, 474, 556, 63, -75, 265, -433, -854, -286, -203, -793, -442, 151, -293, -613, -47, 637, 19, 168, 901, 510, 19, 497, 702, 3, -70, 486, 46, -848, -393, -56, -1069, -883, 473, 178, -839, -39, 285, -321, -441, 724, 754, 100, 594, 1207, 53, -462, 637, 225, -765, -238, 650, -378, -1121, -173, 160, -905, -679, 467, -135, -575, 359, 784, -99, 277, 1121, 348, -317, 309, 431, -333, 32, 562, -27, -1007, -349, -438, -972, -713, 276, 261, -247, 388, 548, -198, -219, 446]
1579D46Q9l44O42j65n93k40K8l23l4L16O9j35k06J27l28L9O30M9K01M7k6k54J43
1602A78L17j78j3K64k02o88j01L52m29mQ36j76p33J22J18m30P4J053O38o08K91
1623F81J27q14o57J134J28o69N16L51p65r98M29J18n11M28Q40k47p09P36j1p51
1643f44O28Q94m67kL81j04q66R1L71k77n31P83p0j140K15M84j75j9N90n7l19J72
1665f2M22l57J73M56o7l27Q5j57k95p9J61K5k10j50K74o77K07M74k95J01O78L2
1687D12n35M70N6l70J76L48m5n01J88O5n19o6L89j73m23L22K64n82J30N19k92
1708a67k31O39J90l16j28O56k43m62N76P3o64j95J91j62n38O01K20m85j79N51
1728g3K0m04N64L07k72j5N31j10p52L52J61j05k68L75k05o58M03J06m51j45N21
$$ y = [446, 535, 191, 833, 668, 75, -165, -137, -460, -494, -178, -109, -244, -450, -323, -651, -612, 18, 67, 268, 315, 289, 35, 178, 495, 317, 304, 568, 366, -322, -423, -71, -500, -504, 332, 156, -577, -455, -337, -767, -693, 360, 998, 390, 681, 808, -6, -663, 471, 599, -70, 446, 797, 32, -966, -537, -419, -930, -502, 338, 91, -618, 118, 107, -644, -16, 878, 411, 409, 790, 686, -180, -89, 282, 5, -526, 257, 187, -953, -738, -254, -429, -448, 142, 85, -234, -62, 360, 3, 176, 632, 565, 238, 323, 166, -129, -208, -47, -22, -232, -382, -108, -785, -578, -104, -399, -298, 380, 412, -123, 347, 403, 33, 209, 557, 512, 11, 199, 264, -255, -321, 68, -105, -528, -206, 58, -524, -394, 125, -167, -398, 241, 431, 115, -13, 643, 400, -62, 514, 587, -77, -272, -81, -243, -781, -180, 40, -445, -624, -73, -53, -457, 107, 414, 142, 127, 658, 548, -204, 148, 309, 204, -64, 311, 106, -552, -149, -43, -494, -639, -118]
1749a18l6k71K43M18k83l2L97j3j84L23m7k57k29N09l89k63R0K7j39o5L9k70J25
1772d25K62J54k99K81J64J05M6J03J11l56N3Q7k26o2k69J3j05P8O4j12N4M0n5
1795b94K0J46J98L8K1k9K67j22J45N0m13R5Q2j86m6r3j95L57m31oK20o9Q3N6M2
1820f4J37P7k5K80j68RJ8K2k12K0p7o9q4N3j24j28O9L58l58J62P9j42K54k9J69
1845B27J72P9j80j03J08j90q5k1O5k12j04K3M8q9k02K03M3j1J04J47R3k4J6K41
1869C48j88K34j90j39K30j36k18K2r3q1K20l50K17j56L0J3qK38P1P0J09O5N1p1
1893B88j24PJ35j75o0o6j63q9M7l1j91L59j51q9J87J13k3K6K14j46K56k63K91
1916C52j38j58M6Q6m03N5K6j35j58J78M3j60R8R9J22p5J56K27l6LpJ01j91J7M3
$$ y = [-118, -154, -425, -182, 236, -47, -79, 318, 305, 121, 444, 397, 140, -89, 420, 31, -232, -142, -115, -254, -319, -280, -550, -425, -163, -9, -308, -27, 137, 242, 288, 391, 502, 146, 199, 286, 60, -2, -271, -258, -363, -285, -221, -333, -279, -239, -294, -274, -128, 70, 108, 129, 100, 367, 245, 390, 440, 27, 122, 204, 18, -28, -121, -316, 41, -390, -396, -176, -245, -162, -106, -64, 73, 150, 125, 405, 237, 246, 264, 286, 74, 94, 17, -52, -136, -83, -207, -335, -266, 92, -266, -104, -25, -167, 87, 58, 227, 399, 478, 298, 195, 303, 113, 28, 7, 72, -140, -244, -221, -173, -262, -464, -261, -218, -229, -125, 22, 115, 91, 107, 348, 160, 394, 204, 65, 295, 159, -59, -37, -130, -211, 9, -341, -124, -280, -250, -237, -245, -7, 64, 134, 243, 308, 359, 288, 164, 171, 306, 131, 71, 5, -158, -247, -200, -231, -422, -63, -214, -303, -116, -3, -26, 0, 214, 68, 324, 61, 352, 214, 56, 102, 188, -215, -160, -134, -269, -427, -249, -206, -366, -268, -169, -47, -122, 34, 261, 225, 228, 221, 322, 131, 148, 191]
1941A91j27j55J95K8m65J68N6j87k97L99Q6j10J54P5Q9N0J40r7j29J94j07l9r9
1964A3R2J53m24K12j46j65j37J40L1j74L25J55kJ28o9j81L8K49k2k5KJ76j02n94
1988c27K48j31P3OJ72k58NJ52J42k01R7K13m6n7J74m9l89L63J47j50j16J24j48
2011D4l69n6M79k15l30N22n7m30J96M00l84K44M48M1l92p9K99k96k61M23K27n15
2033f1K52j59m76R5J22l8o9K11L30q7l62K22J53j82L07K86j02k59P2L2l05R6j5
2056F3k48K2N0M1l46N5L58k43l1R6J25R0L14J2k0Pr8j09q1Mrj89L37j55m60J88
2082b27J4j20k14N70N1j63J16J21j74p8M33q4k88K81J94n78%J79j8l91K43K89
2104A56m19k59M75K01m68L02L99m86j85N74k8l29J93N23l13l75L03L3j011N08
$$ y = [191, 64, -91, 104, 132, -333, -165, -109, -296, -593, -194, -108, -218, -64, 11, 100, 150, 290, 193, 64, 258, 151, 112, 13, 105, 258, -166, 46, -100, -265, -402, -262, -231, -405, -80, 75, 73, 201, 132, -49, -11, 238, 216, 191, 193, 369, 267, -327, -79, -210, -137, -131, 41, -217, -212, -60, 82, -119, -22, 191, 145, 88, 262, 213, -176, 187, 334, 184, 68, 192, 44, -325, -381, 98, -117, -447, 75, 18, -412, -216, 184, -200, 44, 492, 533, 141, 62, 361, 65, -196, 227, 454, -61, 191, 32, -444, -349, -227, -265, -334, -123, 207, 120, -242, -20, 133, -49, 258, 544, 442, 183, 255, 287, -18, 78, 63, -185, -163, -113, -72, -418, -363, -5, -248, -279, -183, -58, 32, 346, 358, 338, 345, 247, 138, 57, 61, 52, -137, 200, 45, -415, -227, -213, -333, -547, 23, 74, -89, 27, 148, -26, -104, 329, 245, -43, 238, 432, -146, -146, 33, 15, -376, -133, 156, -263, -522, -47, 154, -314, -12, 387, -99, -284, 290, 262, -67, 126, 649, 336, -39, 264, 297, -714, -206]
2124b06L38l92j55O33j34n65jN38j35j44O12J50l96o3K49l56o2M54K39o76R3K40
2146B61m45m89N39J43m14K76K77k67l35M40J19j48N1M34J6m14J89p4N6j77J23
2167A61k20j21K25l37p4J55K68m05J34J95Nl71L11M17j57r4L01j12m09L03j33
2188D2j26J9K11k95j65L64p1k01j40M64k31R6K6J70l34L21J55K1l15K56J4m52
2210a71K70J07j64m09L06J09l59N9K62k06l0J73K06k17rL39j01k46J88K9J55k06
2232H5O8k89K5M6J14j77Q2k01K01j65o5K76L7L9KJ28j21J52Ok79J15J34j02q0
2256C1Q3k86o9Q2q3J29k40L35m0N2J22k26O7K86J9M3R0j89j90J03k4nm0j02n3
2281a05k50K22j0J44l89J91K44j66J06o6P1m0K79j09n4j4J69j08R3j95R5r4j25
$$ y = [-206, 132, -260, -415, 218, 84, -481, -482, 56, -79, -223, 389, 539, 143, 80, 329, -27, -89, 365, 604, -72, 21, 261, -184, -673, -134, 9, -405, -129, 148, -119, -454, -14, 105, -43, 8, 442, 458, 44, 233, 159, 215, 38, 161, -59, -180, 45, -292, -366, -211, 57, -348, -214, -19, -14, -385, -74, 343, 186, 92, 393, 281, -128, 175, 42, -84, -65, 146, -149, -314, 50, -21, -222, -362, 102, -129, -33, -7, 163, -171, 150, 305, 326, 11, 267, 281, -171, 99, 206, 42, -367, -61, 48, -311, -252, 10, -196, -226, -53, 153, -64, -73, 266, 165, -81, 107, 136, 291, 85, 153, -136, -111, -65, 49, -128, -46, -247, -46, -211, -276, 0, 37, 76, 78, 206, 85, 237, 243, -36, 79, 213, 111, 31, 114, -172, -241, -159, -242, -113, -353, -18, -58, -6, 116, -110, -43, 243, 262, 305, 395, 206, 16, 119, 95, 90, 50, -52, -105, -355, -133, -143, 1, -388, -197, 47, -119, -13, -79, -8, -48, 231, 122, 68, 54, 223, 115, 208, 13, 108, 14, -111]
2304a11N2L5k9m8l7L4P4n2L07k27J91k8J44kr1Rj99J05l6O4l24oJ16q8Jj53O3
2331b36J12Q5P1jj13J46J01J87k18K6j4j6K5k19j08Q9Q1p1k19L16j72r2J2K84
2355E6qj05J25l3L7J53L9j04L6j93J19on3j75j75J06R2j55M5j26J73J45l1l2Q2
2380A2K20p9j4j85L36r8j31j52J27qr7J29j98j50K29j88J50l1n5L15j54M2K1K1
2404F2p9J90J79k52k6m6Q4j30j33K02L8k83L7j2J6%J07J82j95R6j9K15j04n5J38
2429B12k87L29r7j02j08J08p1j19mJ79j75N8L6j07L9J16K24l46KJ73J8J10j27
2452F1L1r6k5J41o2on9N4j40n8J5R3j03J89k4K3j23p1J28j18L04L2j10K58k13
2477A21m1M3k9k10K6J31j29M9j98L04j12M3m5J51q0r1k9K33j68J83J01k52J16
$$ y = [-111, -59, -24, -53, -101, -138, -104, -30, -82, 225, -2, 189, 161, 305, 303, 212, 221, 22, 127, 91, 155, -169, -175, -59, -147, -146, -299, -236, -124, -39, 32, 31, -82, 64, 165, 352, 134, 160, 146, 130, 155, -64, -172, -83, -2, -73, -292, 24, -148, -240, -228, 56, 48, -57, 68, 35, 72, 225, 264, 160, 196, 3, 122, 116, 63, -112, -287, -181, -89, -244, -199, -325, -152, -7, -38, -70, 12, 232, 153, 139, -46, 290, 192, 61, -91, 36, 28, -69, 60, -138, -288, -59, -247, -97, -128, -183, 132, -22, 20, 41, 62, -17, 173, 352, 100, 74, 28, 112, -18, -151, 51, 89, -194, -157, -169, -153, -153, -46, 136, -59, 37, 18, 233, 129, 74, 212, -75, 254, 157, 55, -53, 55, -16, -135, -139, 40, -135, -77, -41, -148, -109, 7, 231, -115, -113, 60, 78, 188, 61, 92, -4, -29, 112, 50, 44, -15, 39, -101, -159, -144, -51, -154, 35, 11, 34, -89, -160, -32, -150, 154, 186, 76, 334, 121, 80, 123, 94, -116, -90, 41, -88, -39, -237, 67, -45, -2, -47, 104, 24, -67, -96, 137, -31, 152, 253, 1, 117]
2500A17J4k13lJ05j52Q0p1J42k15j20L76Rk91K10J60j67N3Q7J17j51J07J43m06
2523f9K13o3k5k90K6K16j52j31L81k43j64K38N3M0r9L58k28pl0K3J87l35K38p6
2547F1q1j10J64m3m3N1L4p4N2pJ4K3J21k8k83J34J90p8q9J02m2k01J31j7k32J39
2573a12J49j57j3K02k28J53j1N6k2m5J83j8j94J98J43k56j56K22o2J24j58J67
2595A65k94p6K66n7j07J0L17k14j38J92J43k33J0N9J45k51J3J19r7RK04j98j51
2618a64Q3J13o1QJ50j42L6m9J53j48n6J57j6J10j57K5k40K17j6l5K29j95j42r7
2642b37J35pR9j95L3K88j79O9MO4j31N4Q0j09K11k40J25j18j12l3M9J38J2L6j8
2667A8J10k14l5K1J49J41r3o6p6QL1p2M7K2J39k60OQ0p9O8J44k38L7J20K1p6k2
$$ y = [117, 131, -82, -85, 20, -132, -52, -123, 19, -196, -316, 60, 69, -222, -12, 148, -19, 34, 121, 238, 87, 194, 337, -69, 144, 81, 56, -234, -208, 8, -144, -275, 106, -137, -301, -63, -10, 30, -69, 289, 61, 54, 24, 47, 234, -101, 137, 61, -20, -130, 34, -9, -52, -1, 33, -41, 11, 4, 18, 41, 162, 134, -149, -15, 175, 97, 8, 110, 68, -133, -2, -19, -251, -112, 37, -120, -133, 69, -159, -6, -17, 39, 17, -28, 155, 137, -57, 141, 284, 28, -128, 94, 32, 156, -2, 165, -129, -205, 61, 4, -103, -93, 224, 10, -128, 64, 207, -26, -16, 43, 188, -63, -50, 69, -28, -19, 185, -13, -164, -81, 32, -29, -21, 129, -13, 23, -26, 127, -21, -77, 80, 64, 174, 17, 42, -198, 19, 3, -32, 197, 2, -140, -237, -102, -109, -10, -205, -172, 116, -63, 6, 10, 74, -57, -3, 77, -32, 179, -61, 64, -54, -166, -199, -150, -12, 0, 36, 18, 128, -86, -121, -100, 49, 190, 97, 31, -45, -37, -6, -78, -31, -9, 130, -130, -124, -44, -123, -55, 89, -149, -112, 8, 29, -47, -69]
2694f9J00J99r9q3n8lr3J09P7m1l1p6Jrm1L3k4RK51o8j30j23K44j1lqJ07j73P9
2723F6j28m4R1K62l07l5lJ76k15p2K82j29l0P5Q4r9M6K1p4k3O5L4j3KP7j85l5
2750a11P5k09L05j40R1j01o4K93j26o1O7J88j98P1j40K0J33n1l2l4J21j41l1l5
2774a10Q0J28nk07J77p8Q1J23j12L3j4p8J77j63J3J8r8q8R9J95l20K79l72K84
2798D2k74L19l4j43K0J27m2NJ21P5n8J01k17p4J42o1J3j57J31j81J44j4J21j39
2822c3J11q3k58L32j46P5k0j07J10J79j90J52q0m5r5j63J88K4j07K20j39M9n4
2845h0J42k20K36J30j88M6o9J08p6nj8r6K04j98J51j14Kl6J31j48J55R8k79K14
2869I0o8r9K2Q5J32j11j2k9r9M9J54j24J43j75j27J19J18j0q9N1j63P9Q0J2M5
$$ y = [-69, 31, 230, 131, 48, -10, -13, -106, 3, 80, 39, 8, -68, -67, -76, -117, -84, -108, -99, 152, 84, -46, -169, 75, 64, 61, 53, 160, -13, 66, -62, -106, -15, 247, -60, -95, -98, 78, -137, -209, 73, -56, -86, -11, 73, -26, 20, 41, -33, -56, 9, 43, 30, 32, 109, -76, -111, -36, -245, 60, -80, 11, -90, -154, 139, 13, -48, 19, 207, 9, 80, -60, -40, 93, 42, 10, -24, 97, -44, -75, -110, -30, 98, 93, -114, 63, -15, 66, 189, 77, 110, 96, 18, 195, 32, 45, 63, -35, -123, -24, 171, -149, 130, -242, 42, -232, 87, 53, -90, -70, 57, 15, 20, 141, 216, 158, 259, 42, -32, 110, 49, 62, -95, 36, -145, -1, -15, 106, -33, 78, -5, -263, 69, -77, -2, -22, -129, -19, 160, -30, 122, 42, -3, -98, -261, -73, -49, -156, 64, -75, -26, -80, 62, -158, 78, 208, 20, 66, -3, 105, 29, 24, 6, -90, 114, -84, 67, -47, -45, -81, 50, -98, 57, 155, -124, 90, 22, -77, -55, 30, 162, 51, 39, 10, -89, -40, 114, -10, 133, -42, -169, -50, 68, 58, -31, 20, -143, -64, 16, 28, 73]
2894G3j7n0j4J32p0j40J47P7J14k13j87K02n0Q7j69J30r9O4l8O0m2J30o3J4lj32
2920e7K22o8K8j18k47K93j41k9J6K09p3m9l2m8j7J43K6q5n0N6o7J86J23m4r6j9
2946F2Q%J9j08k2j03J8J83P2j58J06j25J73l3k37J53mK8o4j61K80j16O9j50J58
2971D8j00J18k14J56j34M4R5JJ58j82l3KR1J17j79j01J83j27k11L00k07K11O6
2994A02M4k29J56j75j0K09k68J19P9n6o0J72q1K04l21P6Pr0J58K8p9K5jp7P9J29
3020A40r7j13K2j2j15J11K2o3J21K28k81J72k21J07k00J74r9J25K0O7l34N7l9
3043b08J62M1p1J35M7pj58K53j37oj03J49q4J51j29J14k06l2J13L2J4j62j12J13
3067i1J31J1K6l35L29r7J04r9L5kl4K75r6j40q4p6J99k24K4J55j3J32M1j91m9
$$ y = [73, 56, 6, -8, 124, 54, -86, 61, 138, 252, 39, -148, 54, 4, 91, -78, 52, -47, 17, -21, 39, -3, 127, 64, 78, 75, -57, 165, 97, 125, 7, -240, 53, -88, -117, -101, 108, 35, -14, -46, -94, -111, 32, 58, -27, -77, -21, -88, 98, 221, 177, 81, 62, 70, 70, 89, -19, -41, -144, -126, 57, 129, -29, 77, -48, 125, 92, -145, 8, 4, 32, -32, -193, 87, -29, 40, -110, 48, -52, 66, -148, 8, -126, -82, 13, 14, 172, -10, -43, -41, 50, 167, -12, -113, 70, -57, -268, 32, -175, 36, 102, 146, -83, 73, -102, -112, 97, -171, -52, 27, -29, -89, 83, 2, 206, -115, -39, -32, -122, 36, 64, -15, 10, 9, -68, 11, 140, 43, -70, -48, -60, -175, -64, -42, -105, 16, 244, -37, 135, -86, 21, -179, -5, -104, 21, 41, 108, -226, -169, -208, -46, -5, -76, 59, 106, 99, -59, 194, 57, 51, -52, 97, 13, 164, 35, 149, -57, -89, 24, 56, 70, -92, -204, -91, 40, 51, 77, -258, 71, -26, 78, -21, 14, 12, -22, 253, 157, 17, -67, -143, 56, -168, -144, 11, -2, 130, 171, -20, -69]
3092f9J18O9j58K03O9j90J82m5k45N3Q5l7m6j55K30p0J15l33L2K09j50K74j90
3115d9J90k53J36r6J84j6j20K8Q2j18M0Nr6J40p4j9m9J6L9J80j83p8J30L0r3J29
3141H5p2n0J4K65l27R8J29o4j32M2J3j66K28p0kj20J86q4M4j17P6J58k01o0J77
3166E0n3J35j02M5j86J08J6K1j7M2o7rj5m7J83j55k9J51j99J05k0O5J13O3k37
3191c9Q5J60j79j60N1J27L8l19L25r0J1Ll7M8K44l63K11%k12J29J47j62j24P6
3215c0O1k26L6K58o3n6P3K9p1J10j42p9J12n9j2qJ43K6k57K06N6j33K39k67N2
3240bj3j0J06o0j16J79j62O4QL3Ll2L7lP4j39L7J72k51p9K99q3l6K5j23k2N7Q9
3268E2O2j35lk7NJ16N7j64M5l2q4k4K41rj42J32j82J59L0k92j78J88j2J63k7J90
$$ y = [-69, 49, 118, -40, 163, 232, 42, 224, 179, -66, -13, 72, 35, -11, -166, 64, -6, 109, -224, -192, 17, -133, 141, -49, 141, -112, 24, -72, 112, 96, -24, 4, 86, -32, 8, 13, -83, 57, -17, -36, -85, -69, -30, 150, -33, -111, 19, 49, -44, 85, 13, -37, -23, 242, -85, 13, 142, 78, -54, -12, 1, -165, 63, -7, -9, -129, 57, -27, 17, -100, -24, 134, -67, -127, 50, -3, 132, 30, 75, -111, -3, 13, 34, 17, 59, -8, -17, -32, -79, 104, -51, -80, 71, -128, -23, -43, 22, 135, 198, -39, 46, 206, 27, -133, -82, 45, 83, -236, 89, -1, 10, 13, -24, 24, 268, -95, 116, 116, -96, 33, 180, 18, -106, -30, 31, -195, -159, 99, 36, -20, 53, 82, 11, 121, -21, -100, 12, -47, -59, -67, 76, 102, -155, 51, 107, -26, 213, -54, -2, -15, -25, 81, 21, -95, 84, -78, -14, -6, 27, 30, -2, 35, 32, 106, -33, 4, 176, -75, -154, 145, 62, 26, 51, -72, -94, -37, 52, 114, -21, -24, -51, -46, 70, 127, -37, 8, -24, -108, -132, 109, 100, -42, 90, -92, 67, 97, -195, -373, -185, -197, -34, -61, 129]
3294A29p3j35J59k2n7QJ9J14j26m3J39r4r4N5j78K4J42O0j5p6J50k60L07k56L02
3319A79j4p2n5j45RK41j92j12O1j20K48M9j65N4Q5Ln6j79K33r3N1l6J70j05J23
3344A62j11r5P6P1r0Kj1Q9j08J27r5Pnj22mj9J39J72j29r6M9J93j43J23j0k30
3370e8J7qJ62l53K84j58J49l2n1o0P0kJ52K4j85O9l7Q1mQl9M7j76J21mN4j27P
3398d9O3q4J04n6M1N9o5L0l5m7K56j70o8j24J50j6l3L2n8J57j24p6K01k03L8q4
3424a61O9l2K6J31j01J18Q0j7J0p5l8P9j95j4J55j35n3K94k22N4M8j8l0P8m2K7
3450C6K8r9J59j45LL0P3j17J24l21J46M8N5MK6j35J53k7j71n8K77j53J02l2l0
3475b4Q6J5j14K7Q2j04kj8K59k90J65j39j52J14R5N8m8j34K42j69L2J33mj19P2
$$ y = [129, 56, -79, 80, 58, 1, 9, 28, 142, 16, -27, 112, 18, -76, -21, -199, -175, -33, 27, 12, -64, 86, -174, 133, -123, 179, 165, 93, 38, -107, -98, 143, -49, -161, -100, -220, 28, 77, -88, -34, 51, 54, -2, -181, 52, -41, 10, -26, 144, 39, 162, 51, -44, 32, 103, 13, 15, 4, 93, -15, 112, 17, 24, 19, -103, -107, -126, 13, 185, 56, -40, 9, 202, 59, 182, 172, -58, -41, -49, 113, -240, 44, -114, 35, 3, -48, -108, -38, -40, 112, 136, -49, 20, -17, 64, 60, 68, 29, 76, -100, 21, 17, 71, -56, -49, 14, -70, 34, -22, 19, 78, 13, 43, 8, -39, 217, 47, -21, -145, 5, -11, -44, -12, -70, 87, -37, -113, 88, -115, -77, -161, -92, -124, -98, 33, -68, 50, 130, 113, 123, 48, 10, 89, -106, -120, 35, -100, -153, 141, -81, -27, 21, 3, -27, 51, 9, 36, 64, -35, 124, -21, -18, 12, 85, -32, 92, -229, -83, -35, 20, 24, 50, -85, 68, 41, -130, -188, 89, -64, 38, 6, -24, 62, 77, -37, -10, 72, -32, -34, -52, 207, -83, 82, -57, -209, -95, 0, 58, 10, -124, 118, -51, -19, 114, 110, -9, 63]
3500F3J14j11j76K18k08Q9N5j56J18K01p3k36J38Nl6ko1J55N0l02L27j75Q5J0
3524I2j8j10m8L2Op0N3q7J18N2j27O5n9K20J4j71k3P9J19l22K59M0k18J77j68
3549i5m4O9K03j15K2O0%j96jJ31j16j14K46q0rK11j14m7J95j46K3k32J49J12J
3574A13k44N2j09J22r4J7Q6J73r7n7J9N4m7N1q7N0K23j73nj61K91k10J5k2O1m5
3600b4M2o8M7J3P1k7N5o4K31k49Rm6K3K7q3j58Q5J8N9O9o1J00PNj25M0m0K42q9
3629A09M5j54n8M9N3M4r9O8K4j63k0j70L01k7r3lN0p6j27L32j65qJ26R6k27K7
3655f6K87r2j44k5n6K50k92K71m7k95PK90K7p7P2k66J71J33j31k9L6Rj3m1m3j19
3681a83J84k4l3j1J6j7J5Q6j49j8J62L7j86R6K11j15j82jJ79Oj81J69J12k36Q3
$$ y = [63, 177, 66, -110, 108, -100, -11, 44, -112, 6, 207, 134, -102, 36, 41, 5, 3, -58, 97, 147, -155, 172, -3, 82, 92, 74, -36, -84, -52, -46, -116, -63, -150, -32, 20, -107, -42, -101, 119, 133, -38, -61, 18, 137, -185, 74, 114, -104, 73, -95, -139, -70, 133, 18, 40, 100, 100, -96, -97, 34, -82, -196, 50, -30, -39, 172, 58, 11, 206, 60, 83, -149, 0, 112, 113, -131, -79, -188, -66, -160, -143, -57, 116, 19, -38, -19, 35, -12, 39, -48, 2, 225, 52, 47, -114, 177, -33, -18, -40, 21, -24, 18, -50, -3, 10, 81, 54, 109, 45, 276, 27, 36, -10, 13, 40, -43, -201, -116, -98, -39, 30, -31, 69, 76, 81, -44, -4, -44, 198, 109, 154, 0, -58, -9, 44, 88, -11, 57, 81, -82, -102, -272, 29, 2, -91, -94, -44, -120, -247, 85, -80, -88, 38, 134, -93, -66, 221, 129, -15, -40, -96, 154, -138, 133, 86, -209, -202, 88, 115, 38, 110, -156, 15, 148, 17, -12, 24, 33, 20, -21, -64, -183, 1, -23, -56, -67, -51, -68, -53, 33, -116, -134, 28, 65, -121, -25, 186, 71, -111, -112, 67, 73, -108, 61, 173, -63, 20]
3706B0m1q8J31k02J32p1K32o2k17K07J2QL8k18J80p9J62l3q6Q4l5N6p1r2R8o5
3732@J07k01K44l72J79rN4j7NJ55J19k20j29J19N5j65J00R7q6n7P5n1n7P9j42
3757a18M5j31J21K57l02O5J38q9p1K1N9J01j53p6J20J0K1rn1j0j46J69N2j53L5
3782i5J11L6j5j49L18k34J17p4K20k32r6J01l0J78j39j11P2N1r5J8P8q6K5J10
3806G9j25Q3j15J08J5k76J82M8J81j6j44k0J1J55o1l9qN9j78J92j03k4O7O8j04
3831C5M5j8j29P3R6k31J80LJ3j53Q5O4J55j89o2r1J42k5Q0o3K16j75K1j3M5L5
3857A39j1j5nk02K7J25j30J81j47m9M8j89K67R7l76L10j14L1J46j17Q5J2J7j57
3881b7R9K15l33QR6j7l3j5m4J74j50j54O8J44oQ6m8k9M7j36O9l5R8o9j15m9J57
$$ y = [20, -21, -109, 22, -180, -48, -119, 113, 51, -166, 41, 53, 61, 99, -119, 61, -18, 144, 111, 25, 109, 74, 130, 59, -33, 65, 0, 107, -94, 150, -222, -43, -52, 2, -15, -10, 145, 264, 44, -85, 34, 89, -76, 24, 121, 35, -22, 53, 2, -55, 24, -118, -73, -204, -83, 174, -128, -63, 75, -14, -85, -64, -5, 96, -57, -133, -13, -3, 18, 9, -42, -52, -198, -29, 23, -130, -95, 16, 52, 37, -112, 206, -28, 89, 15, 235, 3, -93, 8, -22, 156, 17, -94, -22, 29, -66, -48, 30, -56, -31, 79, -46, 37, -78, 30, 45, -231, -49, -1, 180, 164, 20, 0, 11, 166, 105, 66, 58, 117, -61, 131, 28, 4, 71, 139, 35, 80, 62, -67, 6, 102, -129, 51, 54, 67, -86, -1, 63, 218, 29, -33, -124, 18, -7, 73, 10, 226, 51, 72, 59, 104, 139, 128, 113, 108, -94, -67, 58, -72, 109, -38, -87, -39, -228, 39, 136, -240, 70, -44, -13, 133, 16, 101, 113, 130, -27, 72, 287, -46, -38, 58, 41, 8, -7, -51, 123, -27, -181, -113, 31, 25, 111, 63, 34, 81, -55, 14, -21, 77, 8, -107, -156, 1]
3908AJ46j76krk11L47j54L8J05j55J79p5j22p9K85J07j55N2p4p1L9J27j92J05
3932E6n2J70j42q5k40L03J82k07P2J2L7k00R4J17o9n3q3pJ65JJ9j74Q3po2o2J7
3959a15M5J24o4l2MN2rJ21j32J95j71N3MJ60r0k20K4N0r0J47j66M2J46j95Q9Q4
3985E6M9j92K31n5j25M7J78j59j91R2L9m5J69j5j04j51J06K7J46k25Q9j20K79
4008A26K4k44l8K12J2j47J05j21J7R2P1n5j12K21j07o2LRj39Q7O6l2J0j26K18
4033I0J9k77K59m1R2j3k17j20r7K19l4K8L0M5l2m4J26n6K0n2N1J13L1J18k23k42
4059b07L09R3l8j23j20J67j4k3k3p5J12j82L35k86L5R2J48k35j00L14j21KP5j11
4083B4j8PJ63k59P7n1K9j03j28K79PJ08po5j29L9J00j19J97J0k02o5J64j8j19
$$ y = [1, 147, -29, -31, -40, -251, 96, -58, -20, 85, -70, 109, 34, -88, -167, 118, 225, 70, 122, 48, -23, 16, 143, -49, 56, 4, 174, 32, -53, -293, 10, 192, -15, 57, 69, 106, -94, 0, 117, 48, -5, -88, -95, 70, 71, 90, -84, -1, -8, -70, -132, -115, -70, 54, -10, -42, -38, 14, 5, 126, -6, 189, 18, 71, 75, 235, 145, -75, -51, -1, -91, 56, -110, -68, 78, -117, -28, 56, 105, -87, 144, 89, -36, 11, 189, 30, -161, -69, -30, -75, 94, 79, -25, -176, -70, -43, 103, -122, -33, -153, 126, 150, -94, -132, 80, 92, -55, 50, -71, -54, 38, 109, 54, -58, 163, 56, -6, -3, 6, -133, -46, 20, -12, -2, -128, 90, 109, -168, 91, 50, 142, 129, -88, -208, -305, -86, -120, -92, -62, -17, -49, -93, 33, -23, -3, -55, -4, 109, 140, 258, 35, -207, 102, 195, 157, 34, -86, 81, 67, 44, 21, -54, 58, -124, 211, -75, -40, 52, 200, -35, -135, 179, 58, 60, 135, 24, 6, 13, 176, -83, -6, -57, -28, -131, -259, 20, 27, 135, 128, 63, -66, -27, 73, -46, 151, 161, -41, -106, 58, 40, -79]
4108g9J31LM5Mj98J08L9r5O7l7o8J24j66P7J95q1pl1N1j55Q4L0j0R9n2j71o7j15
4136b75L53j63J17KQ0j61MK09L4j85K27k69R2j75K58j78R3j99J3J46l6o3J4J32
4160G0l5JO3Pk2J12j25m8J13q4p2N2K2n5k5P3P1j28j12L4m0J44K9l5K1k5k1J39
4188A24R7j39j61J29J07j25j68J15R0J5r0L2k89J66Q0n4P3N9R0j21j67qK39n4
4212D0q3J19j62P1m9J39MP1j08j62oM1j30J91n9K55r5k10J71j20m9J90m3N4N9
4237A29l4j94R1NO2j43J04j1j38R2m1O4j4j1j8J77P6k66M0j6J00K3j84K22p9r9
4263f3K2K6j58J66q7q1J33K9K00j86m3JRR6o0P0r5J51J20k66p2R9j46J33q2J8
4289f6R0R2k16k8K5l7K32q6O5p0j71K39l1Q1j18N8J11j88M3j10O7J7q7M3q1M6
$$ y = [-79, 52, 55, 100, 104, -94, 14, 53, -42, 25, -12, -80, 44, -122, -45, 150, 69, 62, 31, 82, -73, 11, 41, 31, 130, 78, -93, -160, -275, 78, -85, 32, 34, 114, -47, -43, 166, 200, 15, 242, -27, 65, -110, 148, -30, 63, -136, -123, 23, -13, -76, -62, 70, 35, 36, 99, 106, 84, 196, 71, 23, 136, 52, -20, 32, 54, -1, -26, 47, 118, -10, -122, -88, -128, 16, 45, 10, 31, 6, -15, 124, 221, 82, -79, 50, 157, 32, -136, -21, 69, 84, -6, 26, -263, -97, -17, -71, 2, 61, 151, 30, -137, -145, 94, 40, -43, 76, -86, -15, -64, 75, 79, 150, 42, -120, -126, -85, -215, -24, -83, 172, 77, -133, 38, -82, -131, 59, 16, 70, 129, 95, -99, -8, -3, 59, -84, 20, 9, -129, -37, -78, -14, -28, -39, -57, 120, 196, -70, -30, -46, 54, 77, -107, 115, 36, -63, -41, -15, -173, -7, -94, -175, -42, -13, 187, 1, -42, -41, -32, 64, 4, 74, -21, 130, 250, -16, -88, 11, -135, -2, -84, -66, 24, 116, -100, -128, -103, -140, 92, 6, 71, 1, -170, 69, 38, 119, 1, 59, 170, -18, 25, -85, -18, -1, -88, -45, -126, -80]
4315h0R8Q6p2n0n3M8J0qr9J33K23k59O8K6L8j00K0Jr1J84j23lj26J9R3M5k2O4
4343G0j34R8N1R6k15J80p7o5N5o7k4lJ34k48PLm3J00J80K0k96J50K6r7J41m8J1
$$ y = [-80, 18, 104, 32, -18, -71, -23, -13, -21, -120, 13, 236, -23, 45, 71, 109, 9, 29, 30, -61, 123, 0, -3, -129, -110, -17, 28, 6, 70, -64, 34, 85, 181, -34, 146, 69, 4, 59, -8, -32, -35, 99, -149, -142, -139, -182, -82, 98, 118, -178, -28, -2, -99, 42, -6, 5]
$$ [...]
8191a7
##END NTUPLES=NMR FID
##END=
