##TITLE=1H_Pr NCO-M
 200.13MHz, CDCl3,
 8 sc
 
 6.8.2025
##JCAMPDX= 6.0         $$ Bruker NMR JCAMP-DX V2.0
##DATA TYPE= NMR FID
##DATA CLASS= NTUPLES
##ORIGIN= UXNMR, Bruker Analytische Messtechnik GmbH
##OWNER= pz
$$ XWIN-NMR		Version 3.5
$$ Wed Aug  6 16:38:10 2025 Russian Standard Time (UT+4h)  she@DPX200
##.OBSERVE FREQUENCY= 200.1313
##.OBSERVE NUCLEUS= ^1H
##.DELAY= (6, 6)
##.ACQUISITION MODE= SIMULTANEOUS
##.ACQUISITION SCHEME= undefined
##.AVERAGES= 8
##.DIGITISER RES= 18
##SPECTROMETER/DATA SYSTEM= spect
##.PULSE SEQUENCE= zg30
##.SOLVENT NAME= CDCl3
##.SHIFT REFERENCE= (INTERNAL, CDCl3, 0, 14.3821)
##AUDIT TRAIL= $$ (NUMBER, WHEN, WHO, WHERE, WHAT)
$$ ##TITLE= Audit trail, XWIN-NMR		Version 3.5
$$ ##JCAMPDX= 5.01
$$ ##ORIGIN= Bruker BioSpin GmbH
$$ ##OWNER= she
$$ F:/spectra/data/she/nmr/H-C/1/audita.txt
$$ ##AUDIT TRAIL=  $$ (NUMBER, WHEN, WHO, WHERE, WHAT)
(   1,<2025-08-06 16:36:44.82 +0400>,<she>,<DPX200>,
      <created by zg, POWCHK disabled, PULCHK disabled
       configuration hash MD5:
       00 E9 B6 7A A2 85 ED C7 34 08 36 98 17 FE 4E 26
       data hash MD5: 16K
       C5 B6 9E B8 42 D8 9E 1C 8B BA 24 FB F6 59 99 D6>)
$$ ##END=
$$ 
$$ hash MD5
$$ 23 1A 27 E9 0F 4E 2A 12 25 26 08 B2 5F 03 25 AD
##$RELAX= 
##$RELAX= 
##$RELAX= 
##$RELAX= 
##$RELAX= 
##$RELAX= 
$$ Bruker specific parameters
$$ --------------------------
##$DU= <F:/spectra>
##$EXPNO= 1
##$NAME= <H-C>
##$PROCNO= 1
##$TYPE= <nmr>
##$USER= <she>
##$AMP= (0..31)
100 100 100 100 100 100 100 100 100 100 100 100 100 100 100 100 100 100 
100 100 100 100 100 100 100 100 100 100 100 100 100 100 
##$AQSEQ= 0
##$AQ_mod= 1
##$AUNM= <au_zg>
##$AUTOPOS= <>
##$BF1= 200.13
##$BF2= 200.13
##$BF3= 200.13
##$BF4= 200.13
##$BF5= 200.13
##$BF6= 200.13
##$BF7= 200.13
##$BF8= 200.13
##$BYTORDA= 1
##$CFDGTYP= 0
##$CFRGTYP= 5
##$CHEMSTR= <none>
##$CNST= (0..31)
1 1 145 1 1 1 1 1 1 1 1 1 1 1 1 1 1 1 1 1 1 1 1 1 1 1 1 1 1 1 1 1 
##$CPDPRG= <>
##$CPDPRG1= <>
##$CPDPRG2= <>
##$CPDPRG3= <>
##$CPDPRG4= <mlev>
##$CPDPRG5= <mlev>
##$CPDPRG6= <mlev>
##$CPDPRG7= <mlev>
##$CPDPRG8= <mlev>
##$CPDPRGB= <>
##$CPDPRGT= <>
##$D= (0..31)
0 0.7 0 0 0 0 0 0 0 0 0 0.03 0 0 0 0 0 0 0 0 0 0 0 0 0 0 0 0 0 0 0 0 
##$DATE= 1754483804
##$DBL= (0..7)
120 120 120 120 120 120 120 120 
##$DBP= (0..7)
150 150 150 150 150 150 150 150 
##$DBP07= 0
##$DBPNAM0= <>
##$DBPNAM1= <>
##$DBPNAM2= <>
##$DBPNAM3= <>
##$DBPNAM4= <>
##$DBPNAM5= <>
##$DBPNAM6= <>
##$DBPNAM7= <>
##$DBPOAL= (0..7)
0.5 0.5 0.5 0.5 0.5 0.5 0.5 0.5 
##$DBPOFFS= (0..7)
0 0 0 0 0 0 0 0 
##$DE= 6
##$DECBNUC= <off>
##$DECIM= 32
##$DECNUC= <off>
##$DECSTAT= 4
##$DIGMOD= 1
##$DIGTYP= 9
##$DL= (0..7)
0 120 120 120 120 120 120 120 
##$DP= (0..7)
150 150 150 150 150 150 150 150 
##$DP07= 0
##$DPNAME0= <>
##$DPNAME1= <>
##$DPNAME2= <>
##$DPNAME3= <>
##$DPNAME4= <>
##$DPNAME5= <>
##$DPNAME6= <>
##$DPNAME7= <>
##$DPOAL= (0..7)
0.5 0.5 0.5 0.5 0.5 0.5 0.5 0.5 
##$DPOFFS= (0..7)
0 0 0 0 0 0 0 0 
##$DQDMODE= 0
##$DR= 18
##$DS= 0
##$DSLIST= <SSSSSSSSSSSSSSS>
$$ [...]
##$SUBNAM0= <"">
##$SUBNAM1= <"">
##$SUBNAM2= <"">
##$SUBNAM3= <"">
##$SUBNAM4= <"">
##$SUBNAM5= <"">
##$SUBNAM6= <"">
##$SUBNAM7= <"">
##$SUBNAM8= <"">
##$SUBNAM9= <"">
##$SW= 18.0517328524113
##$SWIBOX= (0..15)
0 0 2 0 0 0 0 0 0 0 0 0 0 0 0 0 
##$SW_h= 3612.71676300578
##$TD= 16384
##$TD0= 1
##$TE= 0
##$TE2= 300
##$TE3= 300
##$TEG= 300
##$TL= (0..7)
0 120 120 120 120 120 120 120 
##$TP= (0..7)
150 150 150 150 150 150 150 150 
##$TP07= 0
##$TPNAME0= <>
##$TPNAME1= <>
##$TPNAME2= <>
##$TPNAME3= <>
##$TPNAME4= <>
##$TPNAME5= <>
##$TPNAME6= <>
##$TPNAME7= <>
##$TPOAL= (0..7)
0.5 0.5 0.5 0.5 0.5 0.5 0.5 0.5 
##$TPOFFS= (0..7)
0 0 0 0 0 0 0 0 
##$TUNHIN= 0
##$TUNHOUT= 0
##$TUNXOUT= 0
##$USERA1= <user>
##$USERA2= <user>
##$USERA3= <user>
##$USERA4= <user>
##$USERA5= <user>
##$V9= 5
##$VALIST= <valist>
##$VCLIST= <CCCCCCCCCCCCCCC>
##$VD= 0
##$VDLIST= <DDDDDDDDDDDDDDD>
##$VPLIST= <PPPPPPPPPPPPPPP>
##$VTLIST= <TTTTTTTTTTTTTTT>
##$WBST= 1024
##$WBSW= 4
##$XGAIN= (0..3)
0 0 0 0 
##$XL= 0
##$YL= 0
##$YMAX_a= 436597
##$YMIN_a= -477862
##$ZGOPTNS= <>
##$ZL1= 120
##$ZL2= 120
##$ZL3= 120
##$ZL4= 120
##$ABSF1= 10
##$ABSF2= 0
##$ABSG= 5
##$ABSL= 3
##$ALPHA= 0
##$AQORDER= 0
##$ASSFAC= 0
##$ASSFACI= 0
##$ASSFACX= 0
##$ASSWID= 0
##$AUNMP= <proc_1d>
##$AZFE= 0.1
##$AZFW= 0.1
##$BCFW= 1
##$BC_mod= 2
##$BYTORDP= 1
##$COROFFS= 0
##$CY= -3
##$DATMOD= 1
##$DC= 2
##$DFILT= <>
##$DTYPP= 0
##$F1P= 0
##$F2P= 0
##$FCOR= 0.5
##$FTSIZE= 0
##$FT_mod= 4
##$GAMMA= 1
##$GB= 0.15
##$INTBC= 1
##$INTSCL= 1
##$ISEN= 128
##$LB= 0.25
##$LEV0= 0
##$LPBIN= 0
##$MAXI= 10000
##$MC2= 0
##$MEAN= 0
##$ME_mod= 0
##$MI= 1.114404
##$NCOEF= 0
##$NC_proc= 0
##$NLEV= 6
##$NOISF1= 3.799351
##$NOISF2= 2.8
##$NSP= 1
##$NTH_PI= 0
##$NZP= 0
##$OFFSET= 14.38212
##$PC= 1
##$PHC0= -1197.329
##$PHC1= 8.3923
##$PH_mod= 1
##$PKNL= yes
##$PPARMOD= 0
##$PSCAL= 0
##$PSIGN= 0
##$REVERSE= no
##$SF= 200.129724274929
##$SI= 16384
##$SIGF1= 3
##$SIGF2= 2
##$SINO= 400
##$SIOLD= 16384
##$SREGLST= <1H.CDCl3>
##$SSB= 0
##$STSI= 0
##$STSR= 0
##$SW_p= 3205.1282051282
##$SYMM= 0
##$S_DEV= 0
##$TDeff= 0
##$TDoff= 0
##$TI= <>
##$TILT= no
##$TM1= 0
##$TM2= 0
##$TOPLEV= 0
##$USERP1= <user>
##$USERP2= <user>
##$USERP3= <user>
##$USERP4= <user>
##$USERP5= <user>
##$WDW= 1
##$XDIM= 8192
##$YMAX_p= 0
##$YMIN_p= 0
$$ End of Bruker specific parameters
$$ ---------------------------------
##NTUPLES= NMR FID
##VAR_NAME=  TIME,          FID/REAL,        FID/IMAG
##SYMBOL=    X,             R,               I
##VAR_TYPE=  INDEPENDENT,   DEPENDENT,       DEPENDENT
##VAR_FORM=  AFFN,          ASDF,            ASDF
##VAR_DIM=   8192,          8192,            8192
##UNITS=     SECONDS,       ARBITRARY UNITS, ARBITRARY UNITS
##FACTOR=    0.0002768,     1,               1
##FIRST=     0,             0,               0
##LAST=      2.2672688,     0,               0
##MIN=       0,             -477862,         0
##MAX=       2.2672688,     436597,          0
$$ Real data points
##PAGE= N=1
##DATA TABLE= (X++(R..R)), XYDATA
$$ [...]
1899d95k08L7M40l29J21P06k43O54J99m25P77n89m09K65o97p9M00n98lj11k71
$$ -495 -703 -666 -226 -555 -434 272 29 683 882 457 1234 645 236 501 -196 -275 125 -473 -476 -587 -858
1920h58PL73l46Q97n55M31O52n81N77L0j23L68j21m20K59o9l65J01p00K8J18r05
$$ -858 -851 -478 -824 73 -482 -51 601 20 597 627 504 872 751 331 590 521 156 257 -443 -415 -297 -1202
1942a202P54k40l20Q46m51J82O68q7L03L85l68M08P1o99N30k51p26M33n86l2K48
$$ -1202 -448 -688 -1008 -162 -613 -431 237 150 453 838 470 878 949 250 780 529 -197 236 -350 -382 -134
1963a34r50L23L57o16O68J89m98Q59R1j16N82m41L88L74n87M23k06o38k1j49k77
$$ -134 -1084 -761 -404 -1020 -352 -163 -661 198 289 173 755 314 702 1076 489 912 706 68 47 -102 -379
1984c79J20m26M4n0j28K10K43k21P41J57k71M79l41m9P07k98K58r3o02L33m02
$$ -379 -259 -685 -641 -691 -819 -609 -366 -587 154 311 40 519 178 129 836 538 796 703 101 434 32
2005C2m61q1j25M8J23n83L19N23l48N31lq6P74n1J03N4j82P8Pn36N7J94q58K05
$$ 32 -429 -510 -635 -587 -464 -1047 -728 -205 -553 -22 -25 -111 663 612 715 769 587 665 672 136 193 387 -471 -266
2029b66l47j27O83p97K29O4k7N32M35p43P92J39k23O28l77j44N37r48K47k90n71
$$ -266 -613 -740 -57 -854 -625 -561 -588 -56 379 -364 428 567 344 972 595 451 988 40 287 -3 -574
2050e74Q0J25m49N04l71J26L73n47N51L84n76N75J38j08Q80m36k19K81n14l36
$$ -574 -494 -369 -818 -314 -685 -559 -186 -733 -182 202 -374 201 339 231 1111 675 456 737 223 -113
2070a13L17p28L27p7n78M80k72r8O54k91k10J30M07K68L80m32M00j57R2K32k81
$$ -113 204 -524 -197 -274 -852 -372 -644 -742 -88 -379 -589 -459 -52 216 596 164 564 407 499 731 450
2091D50m50K57k78k12K74m41lq3k59M76n7j99M85j72L83L37l53L60J57l45M12
$$ 450 0 257 -21 -233 41 -400 -403 -486 -745 -269 -326 -525 -40 -212 171 508 155 515 672 327 739
2112G39n15l12O04m18l95M10o91K39K2m55M24J91o12Q04k18J77N55o19L71L69
$$ 739 224 -88 516 98 -297 113 -578 -339 -317 -772 -348 -157 -769 35 -183 -6 549 -70 301 670
2132F70m81K43L40q17L58l13k44M07m08j35K21l74J28p2j42O85j93r6O58p02N69
$$ 670 189 432 772 -45 313 0 -244 163 -245 -380 -159 -533 -405 -477 -619 66 -127 -223 435 -267 302
2153C02M46n65L31j4j92j06k32n9K28k76l39K83n60K63K32m04N23j13k18Q36j62
$$ 302 748 183 514 500 308 202 -30 -89 139 -137 -476 -193 -753 -490 -258 -662 -139 -252 -470 366 204
2174B04j75O87o56N10K8m46K91J00m53l5j78k62Q9l60l2M84k59L01J8j62L88K51
$$ 204 29 716 60 570 598 152 443 543 90 55 -123 -385 -296 -656 -688 -204 -463 -162 -144 -306 82 333
2196C33M4J57k68N7M47n29Nj45k04O0J40o25M49l89K9K73l06M9L65l49L64O8k02
$$ 333 377 534 266 323 770 241 246 101 -103 -43 97 -528 -79 -468 -439 -166 -472 -423 -58 -407 -43 25 -177
2219a77P17j85j01L62j68k01L38m45K70k18n24K85l50l64M35M1l21N10l44K14
$$ -177 540 355 254 616 448 247 585 140 410 192 -332 -47 -397 -761 -326 -285 -606 -96 -440 -226
2239b26N29l8L40j25l71M67j25p8J44n09r1P8k41J6J30m18L42n39j79Q69l00J95
$$ -226 303 265 605 480 109 576 451 373 517 8 -83 -5 -246 -230 -100 -518 -176 -715 -894 -25 -325 -130
2261a30J13l0K39K05m06N66lj89j0j18k67J88m14L19k94j02P5j28k95N18j43M4
$$ -130 -17 -47 192 397 -9 557 554 365 355 237 -30 158 -256 63 -231 -333 -258 -386 -681 -163 -306 -262
2283b62L14q8J57K87r9j3M29m81K26j42l52M23n57O0L9l15j6K73o24O90k83j52
$$ -262 52 -36 121 408 309 296 725 244 470 328 -24 399 -158 -98 -59 -374 -390 -117 -741 -51 -334 -486
2305d86O24l09L47k8J20k32M81k96L96J0o51K78o37M69l43l07L51l27O4nK40j72
$$ -486 138 -171 176 148 268 36 517 221 617 627 -24 254 -383 86 -257 -564 -213 -540 -476 -481 -241 -413
2327d13L60j79N1N95k21mN93n55Q6J16l77L26m38K21J05o85K55J45m36K07j03
$$ -413 -53 -232 -181 414 193 189 782 227 313 429 52 378 -60 161 266 -419 -164 -19 -455 -248 -351
2348c51j84N22j51J45L65j99P0L52l65J96N5j40Q9j35k62N2l52J28O8l84K09J11
$$ -351 -535 -13 -164 -19 346 147 217 569 204 400 455 315 404 269 7 59 -293 -165 -97 -481 -272 -161
2370a61n76M44L04k92K03J09J27K83l8j09J01k57J92j42l43P0K10p48J94M4M44
$$ -161 -737 -293 11 -281 -78 31 158 441 403 294 395 138 330 188 -155 -85 125 -623 -429 -385 59
2391E9j42j34r3J0l5N17q2m5M98m49R6P1j35K5J0m85J74K55n53J56J20r5J31k74
$$ 59 -83 -217 -310 -300 -335 182 100 55 553 104 200 271 136 161 171 -314 -140 115 -438 -282 -162 -257 -126 -400
2415d00J9M65k53K39J89n66O55k42q7J71oj70J18j14J08L9k99n4k2j44L67k80
$$ -400 -381 84 -169 70 259 -307 348 106 19 190 184 14 132 18 126 165 -134 -188 -210 -354 13 -267
2437b67j37M57j06j94O41k83K32j9l21L26j08j37K16k32Q9j88j44k3O9k14K41
$$ -267 -404 53 -53 -247 394 111 343 324 3 329 221 84 300 68 157 -31 -175 -198 -129 -343 -102
2458a02jk59M07k72J93J60l0n3L14j64l3k56L82R8k33J2R4o06Q9L43j92k20M5
$$ -102 -103 -362 45 -227 -34 126 96 43 357 193 160 -96 286 384 151 163 257 -349 -260 83 -109 -329 -284
2481b84p2n4L12M0J75l38J83L44j12K22P1k63j99q5J47j73r4M1j67j13J82R0k60
$$ -284 -356 -410 -98 -58 117 -221 -38 306 194 416 487 224 25 -60 87 -86 -180 -139 -306 -419 -237 -147 -407
2504d07K36L6n5R0J31N2J50j10p3L60j99J67j87p0j30m1q5L95n24k2K1l18O26
$$ -407 -171 -135 -190 -100 31 83 233 123 50 410 211 378 191 121 -9 -50 -135 260 -264 -286 -265 -583 43
2527D3pk37J6N3K49L71l18N1N0k1L21o3m73j36K86k12J66m18J45n3J93j77j7M9
$$ 43 36 -201 -185 -132 117 488 170 221 271 250 571 508 35 -101 185 -27 139 -279 -134 -187 6 -171 -188 -139
2551a39J19L7J8L39J2k65L46n90M71Q7o23M11pl18j38l49L69m9j96J68L09j70
$$ -139 -20 17 35 374 386 121 467 -123 348 435 -188 223 216 -102 -240 -589 -220 -269 -465 -297 12 -158
2573a58p9J39N0K17j46L45j38n8k3o5j49J89J67k62k22J79k52m3L31l88R4j76
$$ -158 -237 -98 -48 169 23 368 230 172 149 84 -65 124 291 29 -193 -14 -266 -309 22 -366 -272 -448
2595d48J42J73k3J72K4J23J56n5q2L59l90j46K01l23J44l49M8L0n6k81P01j64
$$ -448 -306 -133 -156 16 40 163 319 264 182 541 151 5 206 -117 27 -322 -274 -244 -300 -581 120 -44
2617d4N4j5j41K53j82K34K32l41Q1m1j9K05j49r0p4J89o47M46j00o3l6J40j73
$$ -44 10 -5 -146 107 -75 159 391 50 131 90 71 276 127 37 -37 152 -495 -49 -149 -212 -248 -108 -281
2640b81K65k36J87J42%J97k64K47n5j76L2L62m11j88K42j13J13j9k19j87K57L4
$$ -281 -16 -252 -65 77 77 274 10 257 202 26 58 420 9 -179 63 -50 63 44 -175 -362 -105 -71
2662g1j22M9Q8J53n2Q6K84k61k6J20k46R8o1J17j36j37j16L73m79N4J15j58L42
$$ -71 -193 -144 -56 97 45 131 415 154 128 248 2 100 39 156 20 -117 -233 140 -339 -285 -170 -328 14
2685A4k12o4K45M30l79L75o51M10j87j20L73k00j58L08k13P1k91j25k33O33j81
$$ 14 -198 -262 -17 413 34 409 -242 168 -19 -139 234 34 -124 184 -29 42 -249 -374 -607 26 -155
2706a55j06M11l36L95M5j31j44j53J46M69n50J80K4k02O6K93l65j27j3L14k21
$$ -155 -261 150 -186 209 254 123 -21 -174 -28 441 -109 71 95 -107 -41 252 -113 -240 -253 61 -160
2727a60l1k65K21J04J81J1j29M42k70k50L59n06N91o4J0j87k52r4K14n4K3K02
$$ -160 -191 -456 -235 -131 50 61 -68 374 104 -146 213 -293 298 234 244 57 -195 -289 -75 -129 -106 96
2749I6k12K03J26m73L50Nl07K38J30j62L61k34K76k79o4P0j07k08L57k25j21J30
$$ 96 -116 87 213 -260 90 95 -212 26 156 -6 355 121 397 118 54 124 17 -191 166 -59 -180 -50
2771e0o2k17N9k00K46J08j11N29j47j9j70J4M34k69q4p0j00N8ql6OJ5J27k59L55
$$ -50 -112 -329 -270 -470 -224 -116 -227 302 155 136 -34 -20 414 145 61 -9 -109 -51 -59 -95 -89 -74 53 -206 149
2796A49l39oK16j47K84q1j41P0K41J14r8r4K8m01k7M3J69n4O6j29K17r7j09j46
$$ 149 -190 -196 20 -127 157 76 -65 5 246 360 262 168 196 -205 -232 -189 -20 -74 -8 -137 80 -17 -126 -272
2820b72O06j82Q6r1j32J30r6q2L20j94j78K84j31l02J90m1oJ05k77K11j05l1k3
$$ -272 334 152 238 147 15 145 49 -33 287 93 -85 199 68 -234 -44 -85 -91 14 -263 -52 -157 -188 -211
2843b11r9N78l4l06K48p5O3m3J61l18L4K42j98n7j15K5K46k53r3P6j70M43K9n27
$$ -211 -310 268 234 -72 176 101 164 121 282 -36 -2 240 42 -15 -130 -105 141 -112 -205 -129 -299 144 173 -354
2867c54K74J89q5J07N3J9n3j14l32N14j25j5j85k35L36k08K13j59K96j89J00k1
$$ -354 -80 109 24 131 184 203 150 36 -296 218 93 78 -107 -342 -6 -214 -1 -160 136 -53 47 26
2889B6j04J20j01J46j28J96%j05L26j8o38M37j92lJ27p7k9k45J42j5k4J80q8P
$$ 26 -78 42 -59 87 -41 155 155 50 376 358 -280 157 -35 -38 89 12 -17 -262 -120 -135 -159 21 -67 -60
2913f0j15L61J07m72N36l27Q5P7j61m4j97J45J10Qrj84oJ3K3pr7M55j87j9J08
$$ -60 -175 186 293 -179 357 30 115 192 31 -13 -210 -65 45 53 44 -140 -146 -133 -110 -117 -214 241 54 35 143
2938A43j5J32l14K93j11p5m1p3Q3j39K7j70K81m11L06k59K23K53j47n1L16k09
$$ 143 128 260 -54 239 128 53 12 -61 22 -117 -90 -260 21 -390 -84 -343 -120 133 -14 -65 251 42
2960D2j29J19J55j06j6j94J54k05K54k0k13rrQ6J92k17J17N7k18K40O2j12j01
$$ 42 -87 32 187 81 65 -129 25 -180 74 54 -159 -168 -177 -91 101 -116 1 58 -160 80 142 30 -71
2983g1L52m86L12K1J3j85J08K01k24k67NM27j26l36L56K2j71J66j87K59K1l0k
$$ -71 281 -205 107 128 141 -44 64 265 41 -226 -221 206 80 -256 100 122 -49 117 -70 189 210 180 178
3006A78J60m21J86J17k10j1p4Q8m7r9J3k43L3K79J42k16J54K06j90K09n05M71
$$ 178 338 -83 103 220 10 -1 -75 13 -34 -133 -120 -363 -330 -51 91 -125 29 235 45 254 -251 220
3028B20k56N3K78m26j1J67J6l75L40J49k11K80l85L01k39K80k98Q2J6K28l90J92
$$ 220 -36 17 295 -131 -142 25 41 -334 6 155 -56 224 -161 140 -99 181 -117 -35 -19 209 -181 11
3050A1L9j82K09o2k47K90Q4m35L34k82K76R2l83K49O9l6L5O2j97K95j30J1k83
$$ 11 50 -132 77 15 -232 58 142 -293 41 -241 35 127 -256 -7 62 26 61 123 -74 221 91 102 -181
3073a81L63j57K3L0l33J78n3p1K91m34J72J65l51L99r5J41n1n6L31j69J6k24l1
$$ -181 182 25 48 78 -255 -77 -130 -201 90 -344 -172 -7 -358 41 -54 87 36 -20 311 142 158 -66 -97
3096i7K07j75J36J20j93J98j79O5J21o8k57L34o22K41K06K15k50K09j2M8j8j71
$$ -97 110 -65 71 191 -2 196 17 82 203 135 -122 212 -410 -169 37 252 2 211 199 247 229 58
3118E8M3k01k18L70l6j56j3J91o0r9M01k49k6Qk29J84M88n06J44j98j29K45l57
$$ 58 101 -100 -318 52 16 -140 -153 38 -22 -121 280 31 5 13 -216 -32 456 -50 94 -104 -233 12 -345
3141c45M84k63L49j70j36J23r1P7J15k24j9J9J33j57K5K39o8o9K47l24L55k30
$$ -345 139 -124 225 55 -81 42 -49 28 143 -81 -100 -81 52 -105 -80 159 91 22 269 -55 300 70
3163G0J96j88j26J00o4k19K63J7p9l6nj29R6j27L57j4j39L6L9k11Q0ML14l36M4
$$ 70 266 78 -48 52 -12 -231 32 49 -30 -66 -71 -200 -104 -231 126 112 -27 9 48 -163 -83 -79 235 -101 -57
3188e7l3l8J65J7k52L12k22K8rj20J47J91k28P9J10j68P6k4J22q9K03k17r7Q5
$$ -57 -90 -128 37 54 -198 114 -108 -80 -89 -209 -62 129 -99 -20 90 -78 -2 -26 96 7 210 -7 -104 -19
3212a9j10K61o2O4p7k19L0K45j30J48J1j94K10k47O7j55l5M32k46j30L86l00k4
$$ -19 -129 132 70 134 57 -162 -132 113 -17 131 142 -52 158 -89 -22 -177 -212 220 -26 -156 230 -70 -94
3235i4J16J07j41J43l45Q4K27l68M36k01L19k49J12J8r1k54k4L85p8l3j30J17
$$ -94 22 129 -12 131 -214 -130 97 -271 165 -36 283 34 146 164 73 -181 -205 180 102 69 -61 56
3257E6p8L3j68M9M0K4o1k78M80l9J82j21l89M24K73l87j87M15j53p1k69O6M8R2
$$ 56 -22 11 -157 -108 -68 -44 -105 -383 97 58 240 119 -270 154 427 40 -147 268 115 44 -225 -159 -111 -19
3281a9J52m3m14K20K67J0j71OJ04j78K39r7Q1J64m20M9P2n3p8P2J38k62j6J67
$$ -19 133 90 -324 -104 163 173 2 8 112 -66 173 76 157 321 -99 -50 22 -31 -109 -37 101 -161 -177 -10
3305a0l9O4%O0P7l05o8J66p5L38k38J80k22Q6O8l24J32K03o2n0k69J53K74l19
$$ -10 -49 15 15 75 152 -153 -221 -55 -130 208 -30 150 -72 14 82 -242 -110 93 31 -19 -288 -135 139 -180
3329a80O4J04K8K8M8Q8k54K41p0l7j02j28J17N8J71j54J69j30J20j42j43K4l9
$$ -180 -116 -12 16 44 92 180 -74 167 97 60 -42 -170 -53 5 176 22 191 61 181 39 -104 -80 -119
3352a19r4rJ33J05J60o7O8m8j22K10k75j44O4n6J37j36J51k18K54Qj87J59Q5m4
$$ -119 -213 -222 -89 16 176 109 177 129 7 217 -58 -202 -138 -194 -57 -193 -42 -260 -6 2 -185 -26 59 15
3376A5M4K87n89L19L5J4O4j29r9P1N3j62L8j44n6K96j54J43k53p2K26j44K53n8
$$ 15 59 346 -243 76 111 125 189 60 -39 32 85 -77 -39 -183 -239 57 -97 46 -207 -279 -53 -197 56 -2
3400bj2K62k45J08l0k4n9N5j35O5n7R3j1k50J29J17k1m3K9J37P7L2j02j02L8L17
$$ -2 -14 248 3 111 81 57 -2 53 -82 -17 -74 19 8 -242 -113 4 -17 -60 -31 106 183 215 113 11 49 366
3426C66j87j90J56o2R3m99M52om9k30J51mj86O2K29j53K6k25L35o6q4J07M2Q8
$$ 366 179 -11 145 83 176 -323 129 123 74 -156 -5 -9 -195 -133 96 -57 -31 -256 79 13 -71 36 78 166
3450A66m39L37l59O43k92j44L6R5Qk86J94Q4M0J0k21J96k6m7J15l1O0J11j0k55
$$ 166 -273 64 -295 348 56 -88 -52 43 51 -235 -41 43 83 93 -128 68 42 -5 110 79 139 250 240 -15
3474a5J08j79L26j69m6q8j26J42p8l3K9n0J31J48p7P3J3j4o8j5Q7J9k06L46l14
$$ -15 93 -86 240 71 25 -63 -189 -47 -125 -158 -129 -179 -48 100 23 96 109 95 27 12 99 118 -88 258 -56
3499e6j0j09M9Q7m1j05qK45J23j48N1j97K49K64m48J4L56k56k08J51J28j4j46
$$ -56 -66 -175 -126 -39 -80 -185 -193 52 175 27 78 -119 130 394 -54 -40 316 60 -148 3 131 117 -29
3522b9K13j73r6J97l04L29l60L26j96P3J81k61J70JJ36k30j08L62j16l72L14J71
$$ -29 184 11 -85 112 -192 137 -223 103 -93 -20 161 -100 70 71 207 -23 -131 231 115 -257 57 228
3544B28k61j07K07k59O3J58j10J70L3J53k37J43k63K95p1j60L20l71K1j73K81
$$ 228 -33 -140 67 -192 -129 29 -81 89 122 275 38 181 -82 213 142 -18 302 -69 -48 -221 60
3565F0N0m1j77J75Q5j15l37j38K06L57j75K55j43l7P7j23P8K58r1O6%l00l4L2
$$ 60 110 69 -108 67 152 37 -300 -438 -232 125 -50 205 62 25 102 -21 57 315 224 290 290 -10 -44 -12
3589a2n9j28p7L61q7Jj96O4J64J15j16rR2J41j44P9l11K07k31j26J59K08j07J17
$$ -12 -71 -199 -276 85 -2 -1 -197 -133 31 146 30 21 113 254 110 189 -122 85 -146 -272 -113 95 -12 105
3613A05j23j58P5P2k18M18k15j7o3J11K55k02r2o8J65j07J7k7L01j30k53k9J83
$$ 105 -18 -176 -101 -29 -247 171 -44 -61 -124 -13 242 40 -52 -120 45 -62 -45 -72 229 99 -154 -183 0
3636@Qlk0j21O3j15P3J00j7J66o9j42J70L2p9R7p7l1p0o3j6K92l15K86l8l59K80
$$ 0 8 5 -15 -136 -73 -188 -115 -15 -32 134 65 -77 93 125 46 143 66 35 -35 -98 -114 178 -137 149 111 -248 32
3663C2j39L6k34K57p2K69J41l44J44J17p2l5k5m73L38M4k76M08k03K01j31rJ5
$$ 32 -107 -71 -305 -48 -120 149 290 -54 90 207 135 100 75 -398 -60 -16 -292 116 -87 114 -17 -26 -11
3686a1l40N03j53Q6n0Q7J30j56J85l79J3J80j20L4n6O1r9R0m10K95L6R6j30K28
$$ -11 -351 152 -1 85 35 122 252 96 281 -98 -85 95 -25 9 -47 14 -85 5 -405 -110 -74 22 -108 120
3710A20K4N3k23K21j04p6Q8l39M21l71K01J84m18K30J4k45K55j64J65k2k08K49
$$ 120 144 197 -26 195 91 15 103 -236 185 -186 15 199 -219 11 25 -220 35 -129 36 14 -194 55
3732E5K13m37J65K37k33K80o1j86J5m3j02j0J83K6o5k24K7L4o0J98K40o36O58
$$ 55 268 -169 -4 233 0 280 219 33 48 5 -97 -107 76 102 37 -187 -160 -126 -186 12 252 -384 274
3755B74k24j68J29J24q4R1j28J60P9m08q1K80l9j64R3Kj66K29pnP3l2j17K58k28
$$ 274 50 -118 11 135 51 142 14 174 253 -155 -236 44 5 -159 -66 -64 -230 -1 -8 -13 60 28 -89 169 -59
3780e9m6L55p6q2J93l0n25M16m14L31k21L50p5l06k00O9M11k10J02M2j57M4Q5
$$ -59 -105 250 174 92 285 255 -270 146 -268 63 -158 192 117 -189 -389 -320 91 -119 -17 25 -132 -88 -3
3803cp6N3R8R0j92j49L54k41K0J38J2P5k61O7j7K44m88p5L86J16P2k88n1J27j1
$$ -3 -79 -26 72 162 -30 -179 175 -66 -46 92 104 179 -82 -15 -32 212 -276 -351 35 151 223 -65 -116 11 0
3828@o6K38k56L9o9J87j23j1p0K44n2j10J01l1m83K18M72m12Q2K28j70M7L3j28
$$ 0 -66 172 -84 -45 -114 73 -50 -61 -131 113 61 -49 52 21 -462 -244 228 -184 -102 126 -44 3 36 -92
3852i2n2M40m72K19p5k87L57j22j44j03K02J70j24j0O0j67L18k25K03j2J72K3
$$ -92 -144 296 -176 43 -32 -319 38 -84 -228 -331 -129 41 -83 -93 -33 -200 118 -107 96 84 256 279
3874B79l34M1K18j75J03J9j50J2j43n6J47l58L77m5L62j7l52Q3o2J10m7J02n5
$$ 279 -55 -14 204 29 132 151 1 13 -130 -186 -39 -397 -20 -65 297 280 -72 11 -51 59 12 114 59
3897E9r0J57l2l9o2l6L9p9j34J52m8L4P4j51J73K00j73J80j34Q1R8rj06k86J15
$$ 59 -31 126 94 55 -7 -43 -4 -83 -217 -65 -113 -79 -5 -156 17 217 44 224 90 171 269 260 154 -132 -17
3922a7k41M56o93L43l8P1l7j36L78j34k18K58j02L05N4Oj6r2j76O9l3O5K37r6
$$ -17 -258 198 -495 -152 -190 -119 -156 -292 86 -48 -266 -8 -110 195 249 255 239 147 -29 40 7 72 309 213
3946B13j39N4N6j04J71j03l55r5J96lj06J10P1J10q0P0k37K45j54L5j93K84j99
$$ 213 74 128 184 80 251 148 -207 -302 -106 -109 -215 -105 -34 76 -4 66 -171 74 -80 -45 -238 46 -153
3969a53J45j22j29K32J05p7L3r9j88M33k29K55p0p6k9p4J05J19Q0k16J16k6l5
$$ -153 -8 -130 -259 -27 78 1 34 -65 -253 180 -49 206 136 60 31 -43 62 181 261 45 161 135 100
3992A00k95O3L34l86J86Q7k3j09L73k56j67L15o1k76J87j08k5K35km98L09j12
$$ 100 -195 -132 202 -184 2 89 66 -43 330 74 -93 222 161 -115 72 -36 -61 174 172 -326 -17 -129
4014a29K56r7k12K60j65J37j90K02k13J99J3Oj11R0pk08K84J18n9j40N1Rj88P1
$$ -129 127 30 -182 78 -87 50 -140 62 -151 48 61 67 -44 46 39 -169 115 233 174 34 85 94 -94 -23
4038b3k21l1K33l27K83J1j79K41j9N9j87N68l17ko9J0L4J64m9k17j98K57j93P1
$$ -23 -244 -275 -42 -369 -86 -75 -254 -13 -32 27 -160 408 91 89 20 30 64 228 179 -38 -236 21 -172 -101
4062a01k0J39j41J3J56j49L0j42L59j46K92l48M36k58k90L65l11R0J47j16j20
$$ -101 -121 18 -123 -110 46 -103 -73 -215 144 -2 290 -58 378 120 -170 195 -116 -26 121 5 -115
4083a15J24m0p9J16K36k02P4R4k15K90l91J19jk18L02J72n69R3L01J18l27K54
$$ -115 9 -31 -110 6 242 40 114 208 -7 283 -108 11 10 -208 94 266 -303 -210 91 209 -118 136
4105A36j49j18R8j30P0K40j97q5J67m9n3k4K49j33l3k3L5m9n9k03K76J5k27J82
$$ 136 -13 -131 -33 -163 -93 147 -50 -135 32 -17 -70 -94 155 22 -11 -34 1 -48 -107 -310 -34 -19 -246 -64
4129f4l8k18L80Qr1n9R0o0L90m11R4J68J72j62q3L5r6k59J37R0j71P7M2L61l42
$$ -64 -102 -320 60 68 -23 -82 8 -52 338 -73 21 189 361 199 116 151 55 -204 -67 23 -148 -71 -29 332 -10
4154a0lj78K91j44N9L1o7M34n30J72j5k23K11l0j32q0K28n9P8k74L88Mj73l46
$$ -10 -13 -191 100 -44 15 46 -21 413 -117 55 40 -183 28 -2 -134 -214 14 -45 33 -241 147 151 -22 -368
4178c68L94K18l13K71j34K61j27l05K36j5j72J67l8p2j25n0J04J97j10m9J29j58
$$ -368 26 244 -69 202 68 329 202 -103 133 118 -54 113 75 3 -122 -172 -68 129 19 -30 99 -59
4200e9J9P2M6l1n2J99j10k32L44j29M8k00J28j28j44L80j99j97K9K50LrK13k32
$$ -59 -40 32 78 47 -5 194 84 -148 196 67 115 -85 43 -85 -229 151 -48 -245 -216 34 37 28 241 9
4224Ij58j05Q1K90r8k1J57l12Q2O7opN0k24O7J12J0p4%j85M30l4k12K83l05K59
$$ 9 -149 -254 -173 117 19 -2 155 -157 -75 -8 -14 -21 29 -195 -128 -16 -6 -80 -80 -265 165 131 -81 202 -103 156
4250A56r9k60N32r1j57l26N02q1k84K22k41K35o3j40L22k13KJ35j49Q1J75j97
$$ 156 57 -203 329 238 81 -245 257 176 -108 114 -127 108 45 -95 227 14 16 151 2 83 258 61
4272F1P9l0J87k38K52k20m90M65j10P3j21P7p2n1J9J0m5M14M4l29P2lj4j5l9J17
$$ 61 140 110 297 59 311 91 -399 66 -44 29 -92 -15 -87 -138 -119 -109 -154 260 304 -25 47 44 30 15 -24 93
4298I3k51K20j5k19l7J61k4j31J58J41k2j34K95j56k18J95K13m43L27j22K31K2
$$ 93 -158 62 47 -172 -209 -48 -72 -203 -45 96 74 -60 235 79 -139 56 269 -174 153 31 262 284
4320B84j84pj50Q4R8m6k06J01J0K9J77o5Q5k18Q0rK1O6M6O5k43J60j28p0j98L35
$$ 284 100 93 -57 27 125 79 -127 -26 -16 13 190 125 210 -8 72 63 84 150 196 261 18 178 50 -20 -218 117
4346A17M0m01J44J6j21J39R2L7k94K08j03O2K78k95J99k18l5n0L14R4j56j43K61
$$ 117 157 -244 -100 -84 -205 -66 26 63 -231 -23 -126 -64 214 -81 118 -100 -135 -185 129 223 67 -76 185
4369A85k23R6k76J35j46J52J35k00J43nL0j31qN0l3K43j60J79q8l6O7l9K50o13
$$ 185 -38 58 -218 -83 -229 -77 58 -142 1 -4 26 -105 -113 -63 -96 147 -13 166 78 42 109 70 320 -293
4393b93L96k38j15L6p9K85j15N0l1R5J85J55l95M31m08K57j38k11J28n3K98k98
$$ -293 103 -135 -250 -214 -293 -8 -123 -73 -104 -9 176 331 -64 367 -41 216 78 -133 -5 -58 240 -58
4415e8J04J9L6j06Pj6J28k52O1n0K8K32j89j68L13M2l08J96K4K6J1n6j88n4K13
$$ -58 46 65 101 -5 2 -14 114 -138 -77 -127 -99 133 -56 -224 89 131 -177 19 43 69 80 24 -164 -218 -5
4440eQ6n0k79J82OQ6j47r6K00J3P3J98m37L06O1k15M6j10Nj15Q5o6j11L91p3l05
$$ -5 81 31 -248 -66 -60 26 -121 -217 -17 -4 69 267 -170 136 197 -18 28 -82 -77 -192 -107 -173 -284 107 34 -271
4466b71J0J25l9K60l7k00K07l8k9K9m51N19j36J30k30K04j24J10L85m11k7m2k9
$$ -271 -261 -136 -175 85 48 -152 55 17 -12 17 -434 85 -51 79 -151 53 -71 39 424 13 -14 -56 -85
4489h5K5N5K61l26M3L98l82J93m17N48l61J65l37L06k0L6J1k96o4K94J89l51j2
$$ -85 -60 -5 256 -70 -27 371 -11 182 -235 313 -48 117 -220 86 66 102 113 -183 -247 47 236 -115 -127
4512a27K15L1k72L98k43J50j59j3Rj4Q8l11q0L10J01m9p9k29K00p2K09k44K07
$$ -127 88 119 -153 245 2 152 -7 -20 -11 -25 63 -248 -328 -18 83 34 -45 -274 -74 -146 63 -181 26
4535B6L7j47O3J21j68K9L8Jj14K86nq2r8k62M10j23j09mJ34j79K9K57j34k6k50
$$ 26 63 -84 -21 100 -68 -39 -1 0 -114 172 167 85 -13 -275 135 12 -97 -101 33 -146 -117 140 6 -20 -270
4560b70L13j66J87j1k60M96k04q7p7k7j5J38k84K63R6n8J2k11K40j64L1K4J76
$$ -270 43 -123 64 53 -207 289 85 -2 -79 -106 -121 17 -267 -4 92 34 46 -165 75 -89 -58 -34 142
4583A42j89k1J00L8o3L4j7j29Q6R7j43j37J29l5K38k68qm6J9K11k27J95Q7k93
$$ 142 -47 -68 32 70 7 41 24 -105 -19 78 -65 -202 -73 -108 130 -138 -146 -192 -173 38 -189 6 93 -200
4607b00L73j54N5r1o1K90k05J09Qj60J44k80Q3R7j29J53j09j15J95J7k89K14K66
$$ -200 173 19 74 -17 -78 212 7 116 124 -36 108 -172 -89 8 -121 32 -77 -192 3 20 -269 -55 211
4630B11k50j16K45r7j62J79o5Q3k11L24n85P62p9j27L4k76L63k12L00m00K64k38
$$ 211 -39 -155 90 -7 -169 10 -55 28 -183 141 -444 318 239 112 146 -130 233 21 321 -79 185 -53
4652e3J77j25L4Q7j82J75m7J61l00K82l76J7j3r7M11p8KoN1o3j77q9L13n6k33
$$ -53 124 -1 33 120 -62 113 66 227 -73 209 -167 -150 -163 -260 151 73 75 69 120 57 -120 -209 104 48 -185
4677a85J57l0J8j36j4R9j5L0o3N2L02l07%J34O6J79j76q9J04J08m67Q6J00J53
$$ -185 -28 -58 -40 -176 -190 -91 -106 -76 -139 -87 215 -92 -92 42 108 287 111 22 126 234 -233 -147 -47 106
4701A06P7p9m9j48J69pR1k40m6K7J47j77K10j5p1k5J30j82K09O7r2J1j4l0m2k74
$$ 106 183 104 55 -93 76 69 160 -80 -126 -99 48 -129 81 66 -5 -30 100 -82 127 194 102 113 99 69 27 -247
4727b47PK75K39m85K84k24K42j72L39m83L36Q8k03K41k26K11j50m3m3J46l43M58
$$ -247 -240 35 274 -211 73 -151 91 -81 258 -225 111 199 -4 237 11 222 72 29 -14 132 -211 247
4749B47k22j08j83K11K32l37K02j14J92l40M72o2j35J2l44K74mK09l49K67J92
$$ 247 25 -83 -266 -55 177 -160 42 -72 120 -220 252 190 55 67 -277 -3 -7 202 -147 120 312
4770C12n20K0L11P2j82j03K36q4L1J00k13J1M70m59k42N24m25Q2n8q5K28k20P7
$$ 312 -208 -188 123 195 13 -90 146 62 93 193 -20 -9 461 2 -240 284 -141 -59 -117 -202 26 -194 -117
4793a17n8J21M1j79K31L7r2k05K02j85K36q2M4J43j53L9j52J31j14L38M8J05k85
$$ -117 -175 -54 -13 -192 39 76 -16 -221 -19 -204 32 -50 -6 137 -16 23 -129 2 -112 226 274 379 94
4816I4l65M95k12pJ11j76J08j21l48M07Q0R9k21J9j16J71j57K99Qj63j45M1P9
$$ 94 -271 224 12 5 116 -60 48 -73 -421 -14 66 165 -56 -37 -153 18 -139 160 168 5 -140 -99 -20
4839b0o6j52K33J02l05m2K91j42l5J63M7k16j7j45N43l61L1L61m8j88J88l16J97
$$ -20 -86 -238 -5 97 -208 -250 41 -101 -136 27 74 -142 -159 -304 239 -122 -91 270 222 34 222 -94 103
4862A03R7p9j34j26J18K36j77K45k21l56K94k29P3L31R8k48kL62r3j75l8L0j98
$$ 103 200 121 -13 -139 -21 215 38 283 62 -294 0 -229 -156 175 273 25 23 385 292 117 79 109 -89
4885h9K1J54k88K56j08o6K8l1J96k40K68JK05k61j00R4r1j23J64J77j55K1P0k13
$$ -89 -68 86 -202 54 -54 -120 -92 -123 73 -167 101 102 307 46 -54 40 -51 -174 -10 167 12 33 103 -110
4909a10J4jK70J9J8j42k08L27k96k3o6M41j3j69o4K76j98r3J24j05K4k74L53Q2
$$ -110 -96 -97 173 192 210 68 -140 187 -109 -132 -198 243 230 61 -3 273 75 -18 106 1 25 -249 104 186
4933A86l6L9k57n5j2R8j3L7K51l10k0n3L46j10j3K9j59j02j33K39J19j86L5K24
$$ 186 150 189 -68 -123 -135 -37 -50 -13 238 -72 -92 -145 201 91 78 107 -52 -154 -287 -48 71 -115 -80 144
4957A44mj68L05l05q8N05j75l72N6K76j07o2K46k15q6J33j70R4Q0k57K31q8j99
$$ 144 140 -28 277 -28 -116 389 214 -158 -102 174 67 5 251 36 -50 83 -87 7 87 -170 61 -27 -226
4980b26l6P3K69j53M9j11K11k66K58m24L74j72J18j97L20j43j32M6P3l2J72j29
$$ -226 -262 -189 80 -73 -24 -135 76 -190 68 -356 18 -154 -36 -233 87 -56 -188 -142 -69 -101 71 -58
5002e8j99n3J60L34l24Q8P4j16J83j10L9j23L4n3j21K37J20j66J54k26m4J25j7
$$ -58 -257 -310 -150 184 -140 -52 22 -94 89 -21 18 -105 -71 -124 -245 -8 112 -54 100 -126 -170 -45 -62
5025f2M7P7M9R6k73J62o5PJ68j98k08K2K26J5n3k9K23k63N3J58k77J94j40J57
$$ -62 -15 62 111 207 -66 96 31 38 206 8 -200 -178 48 63 10 -19 204 -59 -6 152 -125 69 -71 86
5049H6k26K52Q4m5j45j90L62l3qo3J73m22L24m03K35J34j74j51L21k24K56m38
$$ 86 -140 112 196 151 6 -184 178 145 137 74 247 -175 149 -254 -19 115 -59 -210 111 -113 143 -295
5071b95L97k91M14j54P6j24n0M22l29j46K53j47j53J77j30J95r9l3J02l66L41
$$ -295 102 -189 225 71 147 23 -27 395 66 -80 173 26 -127 50 -80 115 16 -17 85 -281 60
5092F0l18L45l08J33J42j72J18j04L13j51k06N19l40K66l97R3K18l71J45K2K42
$$ 60 -258 87 -221 -88 54 -118 0 -104 209 58 -148 371 31 297 -100 -7 211 -160 -15 7 249
5113B49r0j71o7NJ3k1j3K59j99O5K40j84k2q4j76L24j09K3Nj53j04J95j03P0K85
$$ 249 159 -12 -79 -74 -61 -82 -95 164 -35 30 270 86 64 -20 -196 128 19 42 47 -106 -210 -15 -118 -48 237
5138B37j15K8p8k42K72j73j81K87l37K66R5J2Qj05p4j7k6J6J17r7j68K73j2m9
$$ 237 122 150 72 -170 102 -71 -252 35 -302 -36 59 71 79 -26 -100 -117 -143 -127 -10 -107 -275 -2 -14 -63
5162f3n3L97j43j29K10q9j80L5J2j1n3MJ54k55N6l3K40j23J40j68P6o4J75Q1O
$$ -63 -116 281 138 9 219 130 -50 -15 -3 -14 -67 -63 91 -164 -108 -141 99 -24 116 -52 24 -40 135 216 222
5187B22p1j6l7j8m0J9j54O6J22k40L02k58K60K05l06j24j8M6R0J27l22K44m96
$$ 222 151 135 98 80 40 59 -95 -29 93 -147 155 -103 157 362 56 -68 -86 -40 50 177 -145 99 -397
5210c97N80J97n49J56j34M89m83K69k24L2o6K08J42k23K50k65k16O9N4J27J6K22
$$ -397 183 380 -169 -13 -147 342 -141 128 -96 -64 -130 78 220 -3 247 -18 -234 -165 -111 16 32 254
5232B54m04J45m3J42l96J23J46k12M31N6j65k96K64l21L52J36k63j14L23p8M0
$$ 254 -150 -5 -48 94 -302 -179 -33 -245 186 242 77 -219 45 -276 76 212 -51 -165 158 80 120
5253A20J60m05J99j78J32J68k37J15J12j13Q2k87O4N0J99N1l41P7K08k74K2M7
$$ 120 280 -125 74 -104 28 196 -41 74 186 73 155 -132 -68 -18 181 232 -109 -32 176 -98 -76 -29
5275b9K05j84r9P7K7R6j51J63r3j62J61Rp4P4k41J49j04J9P6J12m6L34m29J68
$$ -29 176 -8 -107 -30 -3 93 -58 105 12 -150 11 20 -54 20 -221 -72 -176 -157 -81 31 -15 319 -110 58
5299E8r5K32k38r8L9L61j08l68J40j02l0K00k7J1J81l35J65rL01l33k1j05J64
$$ 58 -37 195 -43 -141 -102 259 151 -217 -77 -179 -209 -9 -36 -25 156 -179 -14 -23 278 -55 -76 -181 -17
5322a7O5L9P2j03j00kO6r0L9J57LJ20m54L77l07J12j28J24L22j23l47J37j13L00
$$ -17 48 87 159 56 -44 -46 20 -70 -31 126 129 249 -205 172 -135 -23 -151 -27 295 172 -175 -38 -151 149
5346A49j58k3j82J04K66j41j06J69j79K22qo8j34J15m6J88Pl43J99j05J5o9J2
$$ 149 -9 -32 -214 -110 156 15 -91 78 -101 121 113 45 -89 26 -20 168 175 -168 31 -74 -59 -128 -116
5369a16o8K08O2p9J52k8k55J26K8J98j99K28l46J7k5qK05j38k3j3M1N4K60j94
$$ -116 -184 24 86 7 159 131 -124 2 30 228 29 257 -89 -72 -97 -105 100 -38 -61 -74 -33 21 281 87
5393H7J44m65K11J36p5j34J31J22q3O7j34M0n3k40N09k53K1j32O6j8K01j56m8
$$ 87 231 -234 -23 113 38 -96 35 157 74 141 7 47 -6 -246 263 10 31 -101 -35 -53 148 -8 -56
5416e6J97P4K4j99j73J51K4K18j13m50L27n2k6Q2M8l05L03k23J39J11n9j89J25
$$ -56 141 215 239 40 -133 18 42 260 147 -303 24 -28 -54 28 76 -229 74 -149 -10 101 42 -147 -22
5439b2K72l50J09j62J00j37L73j93l0m8K44l64J65L1M9k3J8J33l2m2k78L37k25
$$ -22 250 -100 9 -153 -53 -190 183 -10 -40 -88 156 -208 -43 -12 37 14 32 165 133 91 -187 150 -75
5462g5J85k2j16q5k3J31J42j98M6K11k91k0L9K20j9Q4l94K86k39K05l2n0nj80
$$ -75 110 88 -28 -113 -136 -5 137 -61 -15 196 -95 -115 -76 144 125 209 -185 101 -138 67 35 -15 -20 -200
5486b00K15r4M5%K54k36J46j75J75k54J89j70M15j71k25R7j58L4J70N2Q0k59K01
$$ -200 15 -79 -34 -34 220 -16 130 -45 130 -124 65 -105 310 139 -86 11 -147 -113 57 109 189 -70 131
5509A31l24L53km16K82M9r4K40l78K57k15J88j94Q6j51J56J7j15L42n03M02q9
$$ 131 -193 160 158 -258 24 73 -21 219 -159 98 -117 71 -123 -37 -188 -32 -15 -130 212 -291 111 22
5531B2l9J1J00J4Qj74K36l75J25O6k1k40L63j2j67L74l36j77J12J03K38l39j30
$$ 22 -17 -6 94 108 116 -58 178 -197 -72 -6 -27 -267 96 84 -83 291 -45 -222 -110 -7 231 -108 -238
5554b38K23rj78K58K16k52m2M2k0o7q1j73L66j26J84k02K53o0J76m25L4J06J30
$$ -238 -15 -24 -202 56 272 20 -22 20 0 -67 -148 -321 45 -81 103 -99 154 94 270 -155 -121 -15 115
5577A15j85p2K16j51J44K01k39L4P5m52N62J14m52K54m88K54N3k21L68p6J91j31
$$ 115 -70 -142 74 -77 67 268 29 63 138 -314 248 362 -90 164 -324 -70 -17 -238 130 54 245 114
5599A14l5k2k37J04P1O0r7J07r0J43Q1M5j97j1j24K88j48o3l2n8k0J28p5J8j08
$$ 114 79 57 -180 -76 -5 55 -42 65 -25 118 199 244 47 36 -88 200 52 -11 -43 -101 -121 7 -68 -50 -158
5624a58Q5J29q0j32p8K01J02k9p8n9L34l72K82j85k15K63K1l9J59q1j60R6K55
$$ -158 -73 56 -24 -156 -234 -33 69 40 -38 -97 237 -135 147 -38 -253 10 31 -8 151 70 -90 6 261
5647B61k32J07j13k2j05J01K94m02m3K50j43MJ29j27J87o1k33L00J11m43K32k52
$$ 261 29 136 23 1 -104 -3 291 -111 -154 96 -47 -43 86 -41 146 85 -148 152 263 -180 52 -200
5669b00L78m0k41P5J90l9q9m0kj22J01J15j26n1j2j60L75r7lj6j14J3L47l12K36
$$ -200 178 138 -103 -28 162 123 34 -6 -8 -130 -29 86 -40 -91 -103 -263 112 15 12 -4 -118 -105 242 -70 166
5694A66k11L75j59j65k0k55M27j50J30l77K49J2l55K5L50j77j11K40n2k4Q1k77
$$ 166 -45 330 171 6 -14 -269 158 8 138 -239 10 22 -333 -308 42 -135 -246 -6 -58 -82 -1 -278
5716b78M54k13q3K69k5m21K15J06J8J06j04j57R6k13J75j51J63K1Pj87K96m64
$$ -278 176 -37 -120 149 124 -297 -82 24 42 148 44 -113 -17 -230 -55 -206 -43 -22 -15 -202 94 -370
5738c70J30K99j51K12mr9l19J5J44K38l14K83k37K27L00o88N65k17K9l02J97l0
$$ -370 -240 59 -92 120 116 17 -302 -287 -143 95 -219 64 -173 54 354 -334 231 14 43 -259 -62 -92
5760i2j00O6p6R2J88J61j72l81M54Q8j73k69R4J18N2J54l29%j53K10k50J16P5
$$ -92 -192 -126 -202 -110 78 239 67 -314 140 228 55 -214 -120 -2 50 204 -125 -125 -278 -68 -318 -202 -127
5783a27K90k40K63o0m60M71j07jj36J9P7O2k49M4M94m34R5Rj61K3J28J7q0N3j2
$$ -127 163 -77 186 126 -334 137 30 29 -107 -88 -11 51 -198 -154 340 -94 1 10 -151 -128 0 17 -63 -10 -22
5808b2j06J42R9k06J98m25K90Jj41M57j90M3r9l3j40N7J18K61j96q2l13M35k83
$$ -22 -128 14 113 -93 105 -320 -30 -29 -170 287 97 140 41 8 -132 -75 43 304 108 26 -287 148 -135
5831a35J91J63k67j68K83j60N0J7o4q5K33N1j2RJ1Nk56K76j41J20k92K03J40m08
$$ -135 56 219 -48 -216 67 -93 -43 -26 -90 -175 58 109 97 106 117 122 -134 142 1 121 -171 32 172 -236
5855b36j4N9J59J16j60J84O1j07L5j90J91k66K29l2r4K7L34l09m5O1k34L17j10
$$ -236 -250 -191 -32 84 -76 108 169 62 97 -93 98 -168 61 29 -65 -38 296 -13 -58 3 -231 86 -24
5878b4JJl3Q4k5k06k8J63N6k1Pr9J43m4J98j81J11l04L58j86m9J93j22j11M9K2
$$ -24 -23 -22 -55 29 4 -202 -230 -67 -11 -32 -25 -124 19 -25 173 -8 103 -201 157 -29 -78 115 -7 -118 -69 -47
5904d7J52P8j01k61J1K90o6m9p5j50K36p2J07J51k04k1j75J90j04K08N8J26Rm09
$$ -47 105 183 82 -179 -168 122 56 7 -68 -218 18 -54 53 204 0 -21 -196 -6 -110 98 156 282 291 -118
5928a18K37j37r4J49n7j62L21m44K10K3J60k37l3J18K71k56j89J09N4n7j17J14
$$ -118 119 -18 -112 37 -20 -182 139 -305 -95 -72 88 -149 -182 -64 207 -49 -238 -129 -75 -132 -249 -135
5950a35L16n8j17J26k49K43k5l6k7k0k53j52M74l00J97o1J68j4k40N16m99R5k52
$$ -135 181 123 6 132 -117 126 101 65 38 18 -235 -387 87 -213 -16 -77 91 77 -163 353 -146 -51 -303
5973c03P0N0M27p9j2j13K02r8K4o8l20R9j19J58J90k74P3J72k04K91j00n3r0J01
$$ -303 -233 -183 244 165 153 40 242 144 168 100 -220 -121 -240 -82 108 -166 -93 79 -125 166 66 13 -77 24
5997B4L9J27l72K34L03o35N12l52J58j01O8j23n7j68K97m4j87R5j39L30J99m47
$$ 24 63 190 -182 52 355 -280 232 -120 38 -63 5 -118 -175 -343 -46 -90 -277 -182 -321 9 208 -239
6019b39N46l71N5J79j33J0N2j01j42J20pL54l64M2k92K01J85k68J82J96k98K03
$$ -239 307 -64 -9 170 37 47 99 -2 -144 -24 -31 323 -41 1 -291 -90 95 -173 9 205 -93 110
6041A10k16J83J70m35M72l02j7l4KP7K13l21R5j40n3K40j46O9J20j92q8J33n0
$$ 110 -106 77 247 -188 284 -18 -35 -69 -67 10 223 -98 -3 -143 -196 44 -102 -33 87 -105 -193 -60 -110
6064a10K72q6J49k06l2J52n1j67lM06k63P3q0lM4l43P4J58J07R3j02j57jM0J80
$$ -110 162 76 225 19 -13 139 88 -79 -82 324 61 134 54 51 95 -248 -174 -16 91 184 82 -75 -76 -36 144
6089A44J95j26j35p1j15j95L85m29K56J5J04Q0l24L5M5L37KKl65K01j80K8K14
$$ 144 339 213 78 7 -108 -303 82 -347 -91 -76 28 108 -216 -181 -136 201 203 205 -160 41 -139 -111 103
6112A03j47J83j33j80N8L02J7q9j07R5M6o4j17M6j83R1J72k64J79O5j15J76j40
$$ 103 -44 139 6 -174 -116 186 203 114 7 102 148 84 -33 13 -170 -79 93 -171 8 73 -42 134 -6
6135fM42m95J91j77j23J59j4J30k54K30j29J4l5O3K0Q5k3L2K4k70j0J77R2o8k5
$$ -6 436 -59 132 -45 -168 -9 -23 107 -147 83 -46 -32 -67 -4 16 101 78 110 134 -136 -146 31 123 55 30
6160C0l7r0K29L4p7q5l8N2J39l57K32K1k38K63J05m53K02J3J61O4k50P9K06l6
$$ 30 -7 -97 132 166 89 4 -34 18 157 -200 32 53 -185 78 183 -270 -68 -55 106 170 -80 -1 205 169
6184A69j81q8J00p6J10o6o5N0J13k1Q5l39K90m9J9J00k1k42J91o4K0J1r6K17J87
$$ 169 -12 -100 0 -76 34 -32 -97 -47 66 45 130 -209 81 32 51 151 130 -112 79 15 35 46 -50 167 354
6209C54k65j20j58M07k08J02p5k92K10k07K99l1j54O1%L3j63J44J13R2N4m1j04
$$ 354 89 -31 -189 218 10 112 37 -255 -45 -252 47 16 -138 -77 -77 -44 -207 -63 50 142 196 155 51
6232E1l4j4j55K71j44q4R2J23J55m05J47J59n9j18K35j82J8JO4j23J4j56K20k2
$$ 51 17 3 -152 119 -25 -109 -17 106 261 -144 3 162 103 -15 220 38 56 57 121 -2 12 -144 76 54
6256E4o2j16K01k76qJ65j67P1K21J5l6J55l74J95r6L9J58j13P9j20K24k24P5m5
$$ 54 -8 -124 77 -199 -207 -42 -209 -138 83 98 62 217 -157 38 -58 -19 139 26 105 -15 209 -15 60 15
6280A5O7J52j63o7J4j40J1K69kj42J20O5k49k7K19k60J17O3m6j34n9j31Q4L43
$$ 15 82 234 71 4 18 -122 -111 158 156 14 134 199 -50 -77 142 -118 -1 62 16 -118 -177 -308 -224 119
6304A19l27J77j64K71j56lK37l89J93L8j28j63N72k09p8OJ43j56J47j30L5Jj98
$$ 119 -208 -31 -195 76 -80 -83 154 -235 -42 -4 -132 -295 277 68 -10 -4 139 -17 130 0 35 36 -162
6327a62Q6K1j15Q4l6J87j84J74j0j02r8J83Q8j22j26L0M32l63o9j91L02k30J06
$$ -162 -76 -55 -170 -86 -122 65 -119 55 45 -57 -155 28 116 -6 -132 -102 330 -33 -102 -293 9 -221 -115
6350a15mL11k40J18l6j42L67k41P6r2J56j34r8L77l12j16K95k76Q8q6J37L0o5
$$ -115 -119 192 -48 70 34 -108 259 18 94 2 158 24 -74 303 -9 -125 170 -106 -18 -104 33 63 -2
6373bk73M49n5o6Ok6k94M19K2k77K11K08k10l26K73n3J02RL43n96k45J43J16j94
$$ -2 -275 174 119 53 59 33 -261 158 180 -97 114 322 112 -214 59 6 108 117 460 -136 -381 -238 -122 -316
6397c16L04j4J51l03L2M11k12k2J09J68k10m36O8K73q5l03P75l77jk01J48J34
$$ -316 -12 -26 125 -178 -146 265 53 31 140 308 98 -338 -270 3 -82 -385 390 13 12 -189 -41 93
6419I3k66K89o0j46k0K16K15j25o2O7j90K90m86L36k2m16L68j94J61m0q1J36K2
$$ 93 -173 116 56 -90 -110 106 321 196 134 201 11 301 -185 151 129 -287 81 -113 48 8 -73 63 85
6442H5j49J42j48j2K22r4k0j24K96j31K1j27J48j50rJ17J85l16J44j72J90j42
$$ 85 -64 78 -70 -82 140 46 26 -98 198 67 88 -39 109 -41 -50 67 252 -64 80 -92 98 -44
6464d4j9K31k96J37j41mj29K86r3K20k09L54l31j1J86j30r9J27Rj11N8lJ56l72
$$ -44 -63 168 -128 9 -132 -136 -265 21 -72 148 -61 293 -38 -49 137 7 -92 35 44 -67 -9 -12 144 -228
6488b28L0K87J51k43J99k37Jo9JK87j21nppj18J06K6O4m54L43j28J49j2J44N7
$$ -228 -198 89 240 -3 196 -41 -40 -109 -108 179 58 53 46 39 -79 27 53 117 -337 6 -122 27 15 159 216
6513B16m29N39l61J76j99J78p8k22K85j30k42J92J9q3Pm0K25l27J99K9J55O6k67
$$ 216 -213 326 -35 141 -58 120 42 -180 105 -25 -267 -75 -56 -139 -132 -172 53 -274 -75 -46 109 175 -92
6536i2J00J13m8k27N2R1J8L3l12L05m7J16L7j53j07J25K1Kl14P1L91J53k95j37
$$ -92 8 121 73 -154 -102 -11 7 40 -272 33 -14 102 139 -14 -121 4 25 27 -287 -216 175 328 33 -104
6560a04K50N3j03r9j09L66l18j65M16l05L30n5j8j40Q3K8k10j55M00j25k50K24
$$ -104 146 199 96 -3 -112 254 -64 -229 187 -118 212 157 139 -1 82 110 -100 -255 145 20 -230 -6
6582fK1o6r1K36r3j97M66j94l13K69oj3ql05M01N6k62J83j60K05j05n0R8L8k80
$$ -6 15 -51 -142 94 1 -196 270 76 -237 32 26 13 5 -300 101 157 -105 78 -82 123 18 -32 66 104 -176
6607a76P8K31k98M61k77K56j60j73j55K32q3j67J84O7r2k0p7L13J3r1K44k24n0
$$ -176 -98 133 -165 296 19 275 115 -58 -213 19 -64 -231 -47 20 -72 -92 -169 144 157 66 310 86 36
6630C6M7j54K94j76N7Oj45pk47K49m9J29k44J41J53l78K04J07J2K5J95m01K29
$$ 36 83 -71 223 47 104 110 -35 -42 -289 -40 -89 40 -204 -63 90 -288 -84 23 35 60 255 -146 83
6653H3j29J15j9Qj2k30J5J58j80j34K14j29J59j13K07J77k95J17k21J28J11l20
$$ 83 -46 69 50 58 46 -184 -169 -11 -191 -325 -111 -240 -81 -194 13 190 -105 12 -209 -81 30 -290
6675b90L57p9M6k79L82j92J6l5L48m69M27k73o6l6J58K18n5O3l17j44K74L8j64
$$ -290 67 -12 34 -245 137 -55 -39 -74 274 -195 232 -41 -107 -143 15 233 178 241 -76 -220 54 92 -72
6698g2l7L85k28P5q8K18k79J05k12Q4k34L9K60k8l3J97l95L91l1j09K34k56J78
$$ -72 -109 276 48 123 35 253 -26 79 -133 -49 -283 -244 16 -12 -45 152 -243 148 117 8 242 -14 164
6721A64r4qq7J32k30J45p9j6K06j90M3J5l6k08L24J5j24J1K74j78j43O8Kj97K51
$$ 164 70 62 -25 107 -123 22 -57 -73 133 -57 -14 1 -35 -243 81 96 -28 -17 257 79 -64 4 6 -191 60
6746F0n3j92O8J03p9M9k27L26J08m80M61l39N14j06k23J72Ml44K12M0K16O2k85
$$ 60 7 -185 -117 -14 -93 -44 -271 55 163 -317 144 -195 319 213 -10 162 166 -178 34 74 290 352 67
6769F7k67R3k8o9P3K06q3p2j79J10l8J45j2J16q1j37L02m3j38q2K60j56j03K07
$$ 67 -200 -107 -135 -204 -131 75 -8 -80 -259 -149 -187 -42 -54 62 -19 -156 146 103 -35 -117 143 -13 -116 91
6793I1l0j27k15K57P4M4j85K5J74k0k15K26m98P68l69J14J20j60j0j75k2j56L22
$$ 91 61 -66 -281 -24 50 94 -91 -66 108 88 -127 99 -399 369 0 114 234 74 64 -111 -133 -289 33
6816C3k04L65k85K45k13R7p1m39M99J2O7K03q8j82l8K1j7K12k01J46M26n63J18
$$ 33 -171 194 -91 154 -59 38 -33 -472 27 39 106 309 221 39 1 22 5 217 16 162 588 25 143
6839A43l01K91q5r2j06J37P0k02K57o7l8J65K4q7L02l30o0q7J17j89K17r3P5J33
$$ 143 -158 133 48 -44 -150 -13 57 -145 112 45 7 172 196 109 411 81 21 -66 51 -138 79 -14 61 194
6863A94n92K28J37j74PK8R4L39p7j76m5k2j3K88k63L48l07j29J69j45p8P0r9M32
$$ 194 -398 -170 -33 -207 -200 -172 -78 261 184 8 -37 -59 -72 216 -47 301 -6 -135 34 -111 -189 -119 -218 214
6887B14k52K6j3k44K89k2j5N2k47M04p9L5k04N0P3Q0l28J88j0P3K96l84J0k03
$$ 214 -38 -12 -25 -269 20 -2 -17 35 -212 192 113 148 -56 -6 67 147 -181 7 -3 70 366 -18 -8 -211
6911b11M19j72l08K78P6j28K34L4m07K82r1r3L68k07l69L44p3P6J10m04L65l6
$$ -211 208 36 -272 6 82 -46 188 222 -185 97 6 -87 281 74 -295 49 -24 52 162 -242 123 87
6933H7j96m8K57o1R5j55k02N91j44l68K22j54P5L2j48J41k0P3j41J84q3j06J46
$$ 87 -109 -157 100 39 134 -21 -223 368 224 -144 78 -76 -1 31 -117 24 4 77 -64 120 37 -69 77
6956G7L2r9P7j39J38j70k9K08k51R8j44J92P3Lp1j94M17j43o4o6J36K23j67k51
$$ 77 109 10 87 -52 86 -84 -113 95 -156 -58 -202 -10 63 66 -5 -199 218 75 11 -55 81 304 137 -114
6980a14k2N3J61o0K16j01k16L77m45M85r4n21L27N6M2n2j66O1j17K88K0q5O6r8
$$ -114 -136 -83 78 18 234 133 -83 294 -151 334 240 -281 46 102 144 92 -74 -13 -130 158 178 93 159 61
7004F1O7j49J4K62l56L50j99J93k44k5N2k38J49O3k16J36l3J07R0k85r9k4K85
$$ 61 128 -21 -7 255 -101 249 50 243 -1 -26 26 -212 -63 0 -216 -80 -113 -6 84 -201 -300 -324 -39
7027c9q0Q4R6J30j31O8l0j58J36J54j73j46K14j84P0l09M56j90j83P9J12j4j80
$$ -39 -119 -35 61 191 60 128 98 -60 76 230 57 -89 125 -59 11 -298 158 -32 -215 -136 -24 -38 -218
7050b18L69j91R7J73j75q2J39k30L16j99P9L3k49J9J82j23k05J23J99j16JJ58
$$ -218 151 -40 57 230 55 -27 112 -118 198 -1 78 111 -138 -119 63 -60 -265 -142 57 -59 -58 100
7072A00j36J42k30J30L08j26j64Qj53L23k43Pr5k4L63j98J29P8l77J10O9O4l3
$$ 100 -36 106 -124 6 314 188 24 32 -121 202 -41 -34 -129 -153 210 12 141 219 -158 -48 21 85 52
7095E2P8N7l42J80j15J74J25l34K21j37K10j65l9J48k23J52r7L48k48j26k2P8
$$ 52 130 187 -155 25 -90 84 209 -125 96 -41 169 4 -35 113 -110 42 -55 293 45 -81 -103 -25
7117b5K40j50K30j39Oj02R9k23J37qk3j99K62l1k29O4Kk19J66l5J89j55NJ26j23
$$ -25 215 65 295 156 162 60 159 -64 73 65 42 -157 105 74 -155 -91 -89 -308 -142 -177 12 -143 -138 -12 -135
7142a35K66k34P8K09k29n4n2J06R0j23J09mj90K23L0j30o4m1J28j19J18J16j37
$$ -135 131 -103 -25 184 -45 -99 -151 -45 45 -78 31 27 -163 60 90 -40 -104 -145 -17 -136 -18 98 -39
7165c9J32j11QJ56L3j06k15Q1m2J80j12j54K52l6m6K3R3j37J81l94K60K9j85J28
$$ -39 93 -18 -10 146 179 73 -142 -61 -103 77 -35 -189 63 27 -19 4 97 -40 141 -253 7 36 -149 -21
7189b1K65k66j3rj07K82L6rJ39l98L25k24n5o0%K48J51l11J08j14L1R2%p1OJ76
$$ -21 244 -22 -35 -44 -151 131 167 158 297 -101 224 0 -55 -115 -115 133 284 -27 81 -33 -2 90 90 19 25 201
7215B01l22Q9NM1R1j2m53L04o3K69k46K50j29jk3J7j36O2L48m92lL29J7J5k56
$$ 201 -121 -32 -27 14 105 93 -360 -56 -119 150 -96 154 25 24 1 18 -118 -56 292 -200 -203 126 143 158 -98
7240i8j16J73k51K24M5j20K11j3L7m58M26J32j17O6m20M25j89L35j74k7J8j29
$$ -98 -214 -41 -292 -68 -23 -143 68 55 92 -366 60 192 75 141 -279 146 -43 292 118 91 109 -20
7262b0J41J3j98Q4j27p4J95Nn1lj77L01p3j36J74J96j63k15L98j32j37O3j31J89
$$ -20 121 134 -64 20 -107 -181 14 19 -32 -35 -212 89 16 -120 54 250 87 -128 270 138 1 64 -67 122
7286A22l38P1O9J32r4M6n6K88l18O2j34L08k56k6O1J04K84l22k0R8j52K61l33
$$ 122 -216 -145 -76 56 -38 8 -48 240 -78 -16 -150 158 -98 -124 -63 41 325 3 -17 81 -71 190 -143
7309a43Q9J0P7L6k9o1k27M74j08j03Q4k15l9K43p5J67j54j53JK41Lk88K87j94
$$ -143 -54 -44 33 69 40 -21 -248 226 118 15 99 -116 -155 88 13 180 26 -127 -126 115 118 -170 117 -77
7333g7j75L80k49P6K33j62Q7j19j55M03k49M6n9O5j67m3M04k3k14J2o2j13M6J1
$$ -77 -252 128 -121 -45 188 26 113 -6 -161 242 -7 39 -20 45 -122 -165 239 216 2 14 -48 -161 -115 -104
7357a04K28l12Q4r8K25%j16K07j67J40j96J01K64m06n4K02l1k13J86j7L6j7N9
$$ -104 124 -188 -104 -202 23 23 -93 114 -53 87 -109 -8 256 -150 -204 -2 -33 -246 -60 -77 -41 -58 1
7380Ak1j90J84O5j85k04M53R4lr1j92J65J50j49K3M3j51J40k73K02j95J55j15
$$ 1 -20 -210 -26 39 -146 -350 103 197 194 103 -89 76 226 77 100 143 -8 132 -141 61 -134 21 -94
7403i4R2j00J52J13q1Nj20Q7l00L84j00k7j01K75l71J08J33N4%j56k31L17k1O
$$ -94 -2 -102 50 163 82 87 -33 54 -246 138 38 11 -90 185 -186 -78 55 109 109 -47 -278 39 18 24
7427B4j44j10L58l53K34J87l15J67l3J15k57L34m10J35j38L54j09Nq1j16K32j49
$$ 24 -120 -230 128 -225 9 196 -119 48 15 130 -127 207 -203 -68 -206 148 39 44 -37 -153 79 -70
7449g0P3j25K98k01p8K1R2j67K01k40M19k10j21K23k37K2L7K17k85lJ15J85l1
$$ -70 3 -122 176 -25 -103 -82 10 -157 44 -196 223 13 -108 115 -122 -100 -63 154 -131 -134 -19 166 135
7472A35k87M12k70j47J04l19M22J75m16N8m8R8J25l10K16Q6K48J7j78k37K8J31
$$ 135 -152 260 -10 -157 -53 -372 50 225 -191 -133 -181 -83 42 -268 -52 34 282 299 121 -116 -88 43
7494D3m9L6m6j43L19k96j5K70j94N9R5n9k9j48j03K61J53k29j0R5L9o2k37QJ35
$$ 43 -6 30 -16 -159 160 -136 -151 119 -75 -16 79 20 -9 -157 -260 1 154 -75 -85 10 49 -13 -250 -242 -107
7519a07J85l72J86J96np6p1P6Q4l22K3K58k35Q6q7J54P0j49J02k17K57r6p0J44
$$ -107 78 -294 -108 88 83 7 -64 12 96 -226 -203 55 -180 -94 -181 -27 43 -106 -4 -221 36 -60 -130 14
7543A4k29K30j43J33K3J53k5j02j00P2q6K31l43O6J88J4j49J78k70L96l03J75
$$ 14 -215 15 -128 5 28 181 156 54 -46 26 -60 171 -172 -106 82 96 -53 125 -145 251 -52 123
7565A23R0p3j65k9J81l37M11j21m5j07J27k25Q9J53M6k17NJ82l56K34J01K52m20
$$ 123 213 140 -25 -54 127 -210 201 80 35 -72 55 -170 -81 72 118 -99 -94 88 -268 -34 67 319 -101
7588a01Q1M6P5m8j54N8J35K84k59j99L60m4k68j71K05j49J32k64L55K7o9j73P0
$$ -101 -20 26 101 53 -101 -43 92 376 117 -82 278 234 -34 -205 0 -149 -17 -281 74 101 32 -141 -71
7611g1J1P8L7R5Nk1j60K53o5r3k26P2J91j64J52j48j4L18r5k01p6j52L39j79M3
$$ -71 -60 18 55 150 155 134 -26 227 162 69 -157 -85 106 -58 94 -54 -68 250 155 -46 -122 -274 65 -114 -71
7636g1K30j84j23M14l22J2J60k53J90ok43J70n1K12m3l28N26k94mK23L5k85J28
$$ -71 159 -25 -148 266 -56 -44 116 -137 53 47 -196 -26 -77 135 92 -236 290 -4 -8 215 250 -35 93
7659I3N4j35K79m74M05j61M8Oj26mj64L06j36K3k85K95J08j37K88k39J49j01N8
$$ 93 147 12 291 -183 222 61 109 115 -11 -15 -179 127 -9 14 -271 24 132 -5 283 44 193 92 150
7682A50k80O9Qn7Q2N7J40m0K7k19R5R9k4n0p5J40k7J75m00K33j57L0k37K64K02
$$ 150 -130 -61 -53 -110 -28 29 169 129 156 -63 32 131 107 57 -18 122 95 270 -130 103 -54 -24 -261 3 205
7707B05l83K17n5O0J4K36l79L56l97p9Q2R7P7k3J39q8q2k28N12q7k9k44K23j25
$$ 205 -178 39 -16 44 58 294 -85 271 -126 -205 -123 -26 51 28 167 79 -3 -231 281 194 165 -79 144 19
7731A9m0q8J21J28n55M42j60J69j27K36k53j3L02m09J13K35j34q1J46L8j45o3
$$ 19 -21 -109 12 140 -415 27 -133 36 -91 145 -108 -121 181 -228 -115 120 -14 -95 51 89 -56 -119
7753a19J70j15q3J19K13k75Jk0J14O3j83K46j03j81L94j2l46K58Qj92k3nk00M38
$$ -119 51 -64 -147 -28 185 -90 -89 -109 5 68 -115 131 28 -153 241 229 -117 141 149 -43 -66 -71 -271 167
7777A67j57j16j26K75J65k46L3j2n5K93l99J78K9K34k85O9j85mJ38j97K92j68
$$ 167 10 -106 -232 43 208 -38 -5 -17 -72 221 -178 0 29 263 -22 47 -138 -142 -4 -201 91 -77
7799g7K68j77J4k96K19J70m82Q6K9M15k91J67l30K06J35o5K00J5m03K35j18k5
$$ -77 191 14 28 -268 -49 121 -361 -275 -246 169 -122 45 -285 -79 56 -9 191 206 -197 38 -80 -105
7821a05O7N8J03o6J05j6j37P5n5M0jK32j64j52m5J13L3k42J14J42q7k7j20J86
$$ -105 -38 20 123 57 162 146 9 84 29 69 68 300 136 -16 -61 52 85 -157 -43 99 12 -15 -135 51
7845E1M5n0j39N9j03J79j52J93j38k5J44n8K8MJ63q5k49J04J87j7j25N9K7j92
$$ 51 96 46 -93 -34 -137 42 -110 83 -55 -80 64 6 34 38 201 116 -133 -29 158 141 16 75 102 -90
7869i0J96j04j41pJ11rk20J6J87J19k03M08l86L01l9k68J97R5k91L34l4l10P2
$$ -90 106 2 -139 -146 -35 -44 -264 -248 -61 58 -145 263 -123 178 139 -129 68 163 -128 206 172 -138 -66
7892f6R2N6J26k0k58o5KO4J87r1k69K23j83J48K07N4p4k24J32J32l46L32k08j55
$$ -66 26 82 208 188 -70 -135 -133 -69 118 27 -242 -19 -202 -54 153 207 133 -91 41 173 -173 159 -49 -204
7916b04J06j78J86LK77n2j39P7j02L40k40p2j2Q5l97J74J77L37k46N0l47p8K47
$$ -204 -98 -276 -90 -87 190 138 -1 76 -26 314 74 2 -10 75 -322 -148 29 366 120 170 -177 -255 -8
7939hMJ01j83m9J60j84L00J7l0j48q1M24n15J47Q1O9k49J29l02J59Q6J27j53r9
$$ -8 -4 97 -86 -135 25 -159 141 158 128 -20 -101 323 -192 -45 36 105 -144 -15 -317 -158 -72 55 -98 -197
7963a97O3J38RK8J38j59L1p9L7M7J02J40l28J2M04l18l6J37l1j83n6j24K27Q8
$$ -197 -134 4 13 41 179 20 51 -28 9 56 158 298 -30 -18 386 68 32 169 138 -45 -101 -225 2 90
7987I0k66J72j31L0J95O3K52m45j43J79j01k09L03K18m06M56k32j9K1N6k90OL01
$$ 90 -176 -4 -135 -105 90 153 405 -40 -183 -4 -105 -314 -11 207 -199 257 25 6 27 83 -207 -201 100
8010A00k82L73mj16k0j33J69j32p9K85J65k61l2j0j27K62k26m5J82j5N1l5j85
$$ 100 -182 191 187 71 51 -82 87 -45 -124 161 326 65 33 23 -104 158 -68 -113 69 54 105 70 -115
8033a15L2j9K65r3J56j31J36j60J80k05k65L02j52o9P4j29J46l6J57r4N9l7o5
$$ -115 -83 -102 163 70 226 95 231 71 251 46 -219 83 -69 -138 -64 -193 -47 -83 74 -20 39 2 -63
8056f3j27N22l18k03L88j3j34j19K19k5j90k4M1L8P9j84Pl0J48m2j38R4k75N89
$$ -63 -190 332 14 -189 199 186 52 -67 152 127 -63 -87 -46 -8 71 -113 -106 -136 12 -30 -168 -74 -349 240
8080B40k97J6J87j59j37K66j98L00j87M1j21R0J11r2Jk24J86L9m6J32j77K49j40
$$ 240 -57 -41 146 -13 -150 116 -82 218 31 72 -49 41 152 60 61 -163 23 62 16 148 -29 220 80
8103H0J8J69l96P5K12J28l37N7n1k9J73m90L19r0m6L51l02R6J79j62K1J88q4j78
$$ 80 98 267 -129 -54 158 286 -51 6 -45 -74 99 -391 -72 -162 -208 143 -159 -63 116 -46 -25 163 79 -99
8127i9K31n7J10o3j14K04k62R6K03l16n0j03j7K00K9Q2p3J29k30l2J32Q7N0j14
$$ -99 132 75 185 122 8 212 -50 46 249 -67 -117 -220 -237 -37 -8 74 1 130 -100 -132 0 87 137 23
8151B3j08p9K42p1r3J38J46n19K23J19q5Q8j78N5L37k75j8L1l2J68K8j19j64J0
$$ 23 -85 -164 78 7 -86 52 198 -321 -98 21 -64 24 -154 -99 238 -37 -55 -24 -56 112 140 21 -143 -133
8175a33J9MJ97j17K28j88nr4J87l97M00k91L00k72r9K38
$$ -133 -114 -110 87 -30 198 10 5 -89 98 -299 101 -190 110 -162 -261 -23
8191b3
$$ Imaginary data points
##PAGE= N=2
##DATA TABLE= (X++(I..I)), XYDATA
0@%%%%%%%%%qJ6j6J6k4L2m0N6p2Q2r8J20j41J65j96K36k72L12l65M22m86N57o33
$$ 0 0 0 0 0 0 0 0 0 0 -8 8 -8 8 -16 16 -24 32 -40 42 -56 64 -77 88 -108 128 -144 168 -197 225 -261 296 -337
32c37P19q15R20j036J164j303J456j624J808k010K230k465K722l008L318l654
$$ -337 382 -433 487 -549 615 -688 768 -856 952 -1058 1172 -1293 1429 -1579 1739 -1915
48a915M022m427M873n362N904o508P182p940Q800r785J0927j2265J3862j5809
$$ -1915 2107 -2320 2553 -2809 3095 -3413 3769 -4171 4629 -5156 5771 -6494 7368 -8441
62h441J8238k1367K5566l1520M0655n6568R1990l13778J56890N22531l79207l39749
$$ -8441 9797 -11570 13996 -17524 23131 -33437 58553 -255225 -98335 424196 44989 -294760
74b94760P4082L58866j5289j08684J9723k4475n9153J19994J60608r0032k95575
$$ -294760 -220678 138188 122899 14215 33938 9463 -49690 70304 230912 140880 -154695
85a54695n75K18646R0146j84037j09463R0798J0210j5280M8052J0627m4046n0710
$$ -154695 -155270 63376 153522 -30515 -139978 -49180 -38970 -54250 -6198 4429 -39617 -90327
97i0327J44178P6615j47042l6270J21156M1723j22290l0640J38302k2579j55477
$$ -90327 53851 130466 -16576 -52846 68310 110033 -12257 -42897 95405 72826 -82651
108h2651p152J51489j0979j60333K8849J08767q362q1142J7745J19693p2490j02820
$$ -82651 -89803 61686 50707 -109626 -80777 27990 19628 -61514 -43769 75924 3434 -99386
120i9386J15626J18649p0213j61153N0335J67542n0915j43584J7422J14770k0814
$$ -99386 16240 134889 64676 -96477 -46142 121400 70485 -73099 -55677 59093 38279
131C8279q6445K0440L1023k3612l4173N9238N3801p9290k6557L9296J8981J0646
$$ 38279 -48166 -27726 3297 -20315 -54488 4750 58551 -20739 -47296 -8000 10981 21627
143B1627j0983J5369k7089l9625O0536N0270n0346q5410J8844J00793J9866q2532
$$ 21627 10644 26013 -1076 -40701 19835 70105 19759 -65651 -46807 53986 73852 -8680
155h680p0379M4327N7575N421l401n4485k8481L5759N4922K6157p8743m3731N8324
$$ -8680 -79059 -34732 22843 28264 24863 -29622 -58103 -22344 32578 58735 -20008 -63739 -5415
168e415M3363N315l2177k9215k304K0880L9592M138m9862n0196L5601O2621j3152
$$ -5415 37948 43263 11086 -18129 -20433 447 40039 44177 -5685 -55881 -20280 42341 29189
181B9189m9857m1359L5291N8315j9096k3260j3555N178L0015Q31M995k552j6660
$$ 29189 -20668 -62027 -26736 31579 12483 -10777 -24332 -19154 10861 11692 16687 14135 -2525
194b525R161J3468k627j2932o072k919P857N240j8322l539r996q69K3932m433
$$ -2525 6636 20104 17477 4545 -1527 -4446 3411 8651 -9671 -13210 -23206 -24075 -143 -4576
208d576L96m809q925K8327M015j2894L663Q878J4110j1413k1848O697J7306j0604
$$ -4576 -4180 -8989 -17914 10413 14428 1534 5197 14075 28185 16772 -5076 1621 18927 8323
222H323j9809J792K974M855j2002j2852J7295j798M412J1666j3807L864J0501
$$ 8323 -11486 -9694 -6720 -1865 -13867 -26719 -9424 -11222 -6810 4856 -8951 -5087 5414
235E414R942O905j9747j121K0223N4j4478q367j272K274K7j0493R90k344j1587
$$ 5414 15356 22261 2514 1393 21616 21670 7192 -1175 -2447 -173 -146 -10639 -9649 -11993 -23580
250b3580J6066O185q367l35k989K1641J1256j6036K489J148R18J1339k622j2034
$$ -23580 -7514 -1329 -9696 -10031 -13020 8621 19877 3841 6330 7478 8396 19735 17113 5079
264E079q905J877J0769l435k5684j106K0045k889o533n985L603J7090p840K37
$$ 5079 -3826 -1949 8820 5385 -20299 -21405 -1360 -4249 -10782 -16767 -13164 3926 -3914 -3677
278c677J4908n061L29K666K252N179j0867l702R786n373j2458J265p48j804L62
$$ -3677 11231 6170 6499 9165 11417 16596 5729 2027 11813 6440 -6018 -4753 -5501 -7305 -6943
293f943o868L995K561m463J1484j933m210J1985L89L851K88p464Q390L211o757
$$ -6943 -13811 -9816 -7255 -11718 -234 -2167 -6377 5608 5997 9848 10136 2672 11062 14273 7516
308G516j867m926k897L915l888m946j699o967P229Q576j2362J848Q088L019N682
$$ 7516 5649 723 -2174 1741 -2147 -7093 -8792 -15759 -8530 46 -12316 -10468 -2380 639 6321
323F321p500L319J0862n808J788K881o014P66k918m659L431l451p449K006k461
$$ 6321 -1179 2140 13002 7194 8982 11863 5849 6615 3697 -962 2469 -982 -8431 -6425 -8886
338h886J22K605p058O719O836n251O049N75R66Q063m584P46N159m701k58k391
$$ -8886 -8764 -6159 -13217 -6498 338 -4913 1136 1711 2677 10740 6156 6902 12061 7360 7102 4711
354D711m786L340m318o670M183k566n462M384j440J740L987l916P177K556k544
$$ 4711 -75 3265 -1053 -7723 -3540 -6106 -11568 -7184 -8624 -6884 -2897 -6813 364 2920 376
369C76Q017j628p91N631n099j26J319n669l30j799n284K260k364n173L486j217
$$ 376 8393 6765 5974 11605 6506 6380 7699 2030 1700 -99 -5383 -3123 -5487 -10660 -7174 -8391
385h391J272M156n817O714P491n569L729L273J110K379o287K050M596q241k157
$$ -8391 -7119 -2963 -8780 -2066 5425 -144 3585 6858 7968 10347 4060 6110 10706 2465 308
400C08J621n617r3j808l957M495k276l104N671j93K988L564l174O737K360l578
$$ 308 1929 -3688 -3781 -5589 -9546 -5051 -7327 -10431 -4760 -4953 -1965 1599 -1575 5162 7522 3944
416C944N995q79m335K600k536j695j274n481M78j131m550M498j715n707N818K386
$$ 3944 9939 9060 4725 7325 4789 3094 1820 -3661 -3183 -4314 -8864 -4366 -6081 -11788 -5970 -3584
432c584R30L586k782M817L665l026N488N8m336K508l203n12K052q974l334M011
$$ -3584 -2654 932 -1850 2967 6632 3606 9094 9152 4816 7324 4121 3609 5661 -3313 -6647 -2636
448b636j755j009k515k541N528r57P37P890l182p93O572j03L537o02m805L227
$$ -2636 -4391 -5400 -7915 -10456 -4928 -5885 -5148 2742 -440 -1233 5339 5236 8773 8171 3366 6593
464F593l36j444N17q245k556M547l401j279q61m172N130K844l302L819M34K394
$$ 6593 6257 4813 5330 -2915 -5471 -924 -4325 -5604 -6465 -10637 -5507 -2663 -5965 -2146 -1712 682
480F82N748l000K246K131m254M404J113p238l43q38m25L6p998p89L859j674J694
$$ 682 6430 3430 5676 7807 3553 7957 9070 1832 1489 651 226 262 -7736 -8525 -4666 -6340 -4646
497d646p05l405O547L098n39L951j948P17N798j710L66k232n294N050l34o288
$$ -4646 -5351 -8756 -2209 889 350 4301 2353 3070 8868 7158 7524 5292 -2 5048 4714 -1574
513a574J7l559j351L002l672J2K223j703M418J091k044P404M13k270M303n94O85
$$ -1574 -1557 -5116 -6467 -3465 -7137 -7125 -4902 -6605 -2187 -1096 -3140 4264 4677 2407 6710 6116 6801
530F801Q65n580R45j06l938J950l390m528J775j968O70M383m116k62N093J394
$$ 6801 7666 2086 3031 2925 -1013 937 -2453 -6981 -5206 -7174 -6504 -2121 -6237 -6499 -1406 -12
546a2M237k328j928O877L91j339K322m757j271J227l162J261l396m945L468j252
$$ -12 4225 1897 -31 6846 7237 5898 8220 3463 2192 3419 257 1518 -1878 -6823 -3355 -4607
562d607k289K401l069K499N682k241J897K495q29L859l81r82L916l699j560J893
$$ -4607 -6896 -4495 -7564 -5065 617 -1624 273 2768 1939 5798 5417 4435 8351 4652 3092 4985
578D985n329l46J33n206K187Q3k826O54j365K734M310l645J858N613j315K238
$$ 4985 -344 -690 -557 -5763 -3576 -3493 -6319 -5665 -7030 -4296 14 -3631 -1773 3840 2525 4763
594D763O28j903K894j642j128K732n108k724K64k391J815j718n464L979J457j463
$$ 4763 5391 3488 6382 4740 3612 6344 1236 -1488 -1224 -3615 -1800 -3518 -8982 -5003 -3546 -5009
610e009L285j443J77N109O37K897n85l923N025P25l173J063l467k429K610l341
$$ -5009 -1724 -3167 -2990 2119 2756 5653 5068 1145 6170 6895 3722 4785 1318 -1111 1499 -1842
626a842j589q08l189L415Q03k620L026l89R40M583j817J384M298j936O74M35j825
$$ -1842 -3431 -4239 -7428 -4013 -3210 -5830 -2804 -3193 -2253 2330 513 1897 6195 4259 4933 5368 3543
643C543J401l061j900K781m989k522L025k733j218J091q80L069j11j17L604j122
$$ 3543 4944 1883 -17 2764 -2225 -4747 -1722 -4455 -5673 -4582 -5462 -2393 -2504 -2621 983 -139
659a39J576M882k904j15K687j918M64j384l280J418j994j803O13l970R02K042
$$ -139 1437 6319 3415 3300 5987 4069 4533 3149 -131 1287 -707 -2510 -1897 -5867 -4965 -2923
675b923l390K936J764j962L306J665k9K281j334K544J566l683J183N92m211P49
$$ -2923 -6313 -3377 -1613 -3575 -269 1396 1367 3648 2314 4858 6424 2741 3924 4516 305 1054
691A054o73l335Q45j968o4J108k849J414K329j166L526N72j367L905K92m26K567
$$ 1054 381 -2954 -2109 -4077 -4141 -3033 -5882 -4468 -2139 -3305 221 793 -574 3331 3623 3197 5764
708E764k226j84J320k769k80j670k981K400k351k431K287j356l28J804j2K102
$$ 5764 3538 3354 4674 1905 1625 -45 -3026 -626 -2977 -5408 -3121 -4477 -4805 -3001 -3013 -911
724i11J151r70M011K15j129L066k027j64K128l800m51N57l305N93j548k083J763
$$ -911 240 -730 3281 3496 2367 5433 3406 3242 5370 1570 1119 1676 -1629 -1036 -2584 -4667 -2904
741b904j214k81K268j889J750L272j672K353J748j448K655n26p41J440k903k95
$$ -2904 -4118 -4399 -2131 -4020 -2270 1002 -670 1683 3431 1983 4638 4112 3371 4811 1908 1613
757A613J135m359k8M95k836Q35o04j243K665j158N95K871p24J979J838j634K972
$$ 1613 2748 -1611 -1639 -1144 -3980 -3145 -3749 -4992 -2327 -3485 -2890 -19 -743 1236 3074 1440 4412
774D412j08k163K364j195j755R10k965m54K89l512J187m26j691K844o94o63L272
$$ 4412 4304 2141 4505 3310 1555 2465 -500 -954 -665 -4177 -2990 -3416 -5107 -2263 -2957 -3620 -348
791c48k69J066K132j287K360O63j964J783o56k022J354k794r13O99l264n1J112
$$ -348 -617 449 2581 1294 3654 4317 2353 4136 3480 1458 2812 18 -895 -196 -3460 -3511 -2399
808b399k078J408K07o54K874l26K42L308j109J241J863k213J685k98k126Q77j130
$$ -2399 -4477 -3069 -2862 -3516 -642 -968 -726 2582 1473 2714 4577 2364 4049 3751 1625 2502 1372
825A372k305R77k607l79J043k857J383Q66j286K363N01l70L285o87M35K247j496
$$ 1372 -933 44 -2563 -2942 -1899 -4756 -3373 -2507 -3793 -1430 -929 -1299 1986 1299 1734 3981 2485
842B485J166N19l194J746r35k610R54j604j411J034k194O32J133j465J871P46
$$ 2485 3651 4170 976 2722 1787 -823 131 -1473 -2884 -1850 -4044 -3412 -2279 -3744 -1873 -1127
858a127l35K858j18K2K637j292K97J323k422J082m63l028J028j337j967J451k239
$$ -1127 -1462 1396 1278 1300 3937 2645 2942 4265 1843 2925 2462 -566 462 -875 -2842 -1391 -3630
875c630m10J744j710J954J122r17K314O92j62K511p09l53J765j988M15l9k770
$$ -3630 -4040 -2296 -4006 -2052 -930 -1847 467 1159 997 3508 2799 2446 4211 2223 2638 2599 -171
892a71M82o52k318J334j471j047J485j043O36J669j296K477J270p82K579m07p67
$$ -171 311 -341 -2659 -1325 -2796 -3843 -2358 -3401 -2765 -1096 -2392 85 1355 573 3152 2745 1978
909A978J948r59q26P15k695L22l30k665J119q46j800J878j074k41K320r07J213
$$ 1978 3926 2967 2141 2856 161 483 153 -2512 -1393 -2239 -4039 -2161 -3235 -3476 -1156 -2063 -850
926h50J840m76K026K13p55J813r79p67J314k512p04M90k548L63n50j768J879q89
$$ -850 990 514 2540 2753 1998 3811 2832 2065 3379 867 163 653 -1895 -1532 -2082 -3850 -1971 -2860
944b860m78K449j263J071K528j351J725J028j449K013qj643J386k041n76P88k734
$$ -2860 -3338 -889 -2152 -1081 1447 96 1821 2849 1400 3413 3405 1762 3148 1107 531 1319 -1415
961a415o6J27k362J355K86j721J883J94J70K171p52J675J206r93J626K33k382
$$ -1415 -1481 -1354 -3716 -2361 -2075 -3796 -1913 -1719 -1549 622 -130 1545 2751 1758 3384 3617 1235
978A235J638o85j811J079k166r32O05k199Q75P5j570K215L91q38K611n16J86K396
$$ 1235 2873 2188 377 1456 -710 -1642 -1037 -3236 -2361 -2286 -3856 -1641 -1250 -2088 523 7 193 2589
996B589m47N20O73j224Q94q41j921J443k072j903J636j714q41R87j492J638N78
$$ 2589 2142 2662 3335 2111 3005 2164 243 1686 -386 -2289 -653 -2367 -3208 -2221 -3713 -2075 -1497
1013a497m16K175k72j54K419p30M84J699j681M06M84j948K22j327j213Q80j847
$$ -1497 -1913 262 -10 -164 2255 1525 2009 3708 2027 2433 2917 969 1191 -136 -1349 -469 -2316
1030b316m41J244k377J420J412j313J213J570p13K181j21p1J584j345L83R43k574
$$ -2316 -2757 -1513 -3890 -2470 -1058 -2371 -1158 412 -301 1880 1759 1688 3272 1927 2310 3253 679
1047F79K86l6k407P54j234r26J064r76J51J183j369K009J139j278K573N25j058
$$ 679 965 929 -1478 -724 -1958 -2884 -1820 -2796 -2645 -1462 -2831 -822 317 -961 1612 2137 1079
1064A079J862l73o33R14j847L17p8k295O87q15j689J308j024n84J864p46O30J209
$$ 1079 2941 2568 1935 2849 1002 1319 1241 -1054 -367 -1182 -2871 -1563 -2587 -3171 -1307 -2053 -1423 -214
1082b14l57J937L64o77K176p72r55J542j621p75P51j970J20m47j875J162r04n25
$$ -214 -571 1366 1730 1053 3229 2457 1502 3044 1423 648 1399 -571 -451 -898 -2773 -1611 -2515 -3040
1100c040K074j030n67K579n96R41J290o59J615j26o92J345j698n17J087k307k88
$$ -3040 -966 -1996 -2563 16 -580 361 1651 992 2607 2481 1789 3134 1436 919 2006 -301 -589
1117e89M66k276L31K60j237J367k9n33J935p30R88J772j033J245Q62j006O89p83
$$ -589 -123 -2399 -2068 -1808 -3045 -1678 -1707 -2240 -305 -1035 -47 1725 692 1937 2799 1793 2482 1699
1135A699q03R47j760o44Q33k298M09L45j723R88L60o88J731p6K95J958r79R22
$$ 1699 896 1843 83 -561 272 -2026 -1617 -1272 -2995 -2007 -1647 -2335 -604 -680 -385 1573 594 1516
1153A516J340j406J094p9j710J070j129j115L98j289l28K48j199P98L50j015J805
$$ 1516 2856 1450 2544 2465 755 1825 696 -419 -21 -1310 -1638 -1390 -2589 -1791 -1441 -2456 -651
1170f51J29j84J752o02M92J793j339O67M22j460O41o80j678J035j423n85P25j129
$$ -651 -522 -706 1046 444 936 2729 1390 2057 2479 1019 1660 980 -698 337 -1086 -1671 -946 -2075
1188b075k9P91q45J092L91l97K063k96PJ495o81J35J251j900N93J8j733P23j175
$$ -2075 -2104 -1313 -2158 -1066 -675 -1072 991 695 702 2197 1516 1651 2902 1002 1595 1613 -120 603 -572
1207e72j073J114j366l91J127j195R86Q71p09J620K58o51J876k85m67J706j729
$$ -572 -1645 -531 -1897 -2288 -1161 -2356 -1370 -499 -1208 412 670 19 1895 1610 1143 2849 1120
1224A120K32O06k033N04l36j817J133j122n58J218j155Q49R27q86J272Q38p90
$$ 1120 1352 1958 -75 429 93 -1724 -591 -1713 -2271 -1053 -2208 -1359 -432 -1318 -46 792 2
1241BJ693Q6k21P50q06k45N10j459Ok36j348O31n38j118R04l48J49J109o82R01
$$ 2 1695 1781 1560 2310 1504 1259 1769 310 316 80 -1268 -637 -1175 -2293 -1389 -1737 -1588 -479 -1161 -260
1261b60R16r00J594O09j023J380l58o31M02j107l74K74j750N94m13j133R74m88
$$ -260 656 -244 1350 1959 936 2316 1958 1327 1729 622 248 522 -1228 -634 -1047 -2180 -1206 -1694
1279a694m91J872q31M57J207n21R39O94n22R05k79q43J239j291m53L35j310k82
$$ -1694 -2185 -313 -1144 -687 520 -1 938 1632 1110 2015 1736 893 2132 841 388 723 -587 -869
1297h69J22j270P82k61n38J389k78J74J336l98L37R99n35J031K32j013N33p09
$$ -869 -747 -2017 -1235 -1496 -2034 -645 -923 -749 587 189 526 1525 990 2021 2253 1240 1773 1064
1315A064o32M72j154p84N92j563M11K95p66J375m49j45J662j04J10J233o23P16
$$ 1064 432 904 -250 -1034 -442 -2005 -1594 -1299 -2065 -690 -1139 -1284 378 274 384 1617 994 1710
1333A710L90j270P72R7j438M38q68p68N12j034n5N66j098P68K97p67J528qJ63
$$ 1710 2100 830 1602 1699 261 699 -169 -937 -425 -1459 -1514 -948 -2046 -1278 -981 -1748 -220 -228 -65
1352f5J683o04K99O09p58M91j19j205N60o40j171O84j198k20O18o73K46N95m81
$$ -65 1618 1014 1313 1922 1164 1655 1536 331 891 251 -920 -236 -1434 -1654 -1036 -1709 -1463 -868 -1349
1371a349J055L29k68J281k87K18R98o83K16K14r73R9k24j134Ll32q07J203j333
$$ -1349 -294 35 -233 1048 761 979 1977 1294 1510 1724 751 850 626 -508 -505 -837 -1644 -441 -1774
1390a774Q8R26q35R83O72o09J231L69l92Q90k90P8N42j193J85l5j275M80n75j244
$$ -1774 -1686 -760 -1595 -612 60 -549 682 1051 659 1549 1259 1337 1879 686 871 836 -439 41 -534 -1778
1410a778Q35l77k18O02n40M90J071r56J315N20o97J565m46l32Q83j076m15N75
$$ -1778 -943 -1320 -1538 -936 -1476 -986 85 -871 444 964 267 1832 1386 1054 1937 861 446 1021
1428A021j202J44k94j180O42l89o23Q87k06kR67j79L87J009p01J209J42o68Q61
$$ 1021 -181 -37 -331 -1511 -869 -1258 -1881 -994 -1200 -1202 -235 -414 -27 982 281 1490 1632 964 1825
1447A825n53q80O02r17k34K9j443N54k0o72P91n89K02J224n32L63J175n82R29
$$ 1825 1272 392 994 77 -157 -128 -1571 -1017 -1037 -1709 -918 -1507 -1305 -81 -613 -250 925 343 1272
1466A272N02q41R40m00p22M26p77p58L32j053J92L2o97K79K55o42J480m29J78
$$ 1272 1774 933 1873 1473 751 1177 400 -358 -26 -1079 -887 -855 -1552 -1273 -1018 -1660 -180 -609 -431
1485d31J573q09L98R42o37M62q0o45L38o26n30M12j326k91O28j118L89K38l22
$$ -431 1142 333 731 1673 1036 1498 1418 773 1111 485 -45 367 -959 -1250 -622 -1740 -1351 -1113 -1435
1504a435R93J25k50J232l27L31J134p81L56N44j197J20J77j165N24r82m67M06
$$ -1435 -442 -317 -567 665 338 669 1803 1022 1378 1922 725 845 1022 -143 381 -601 -1068 -662
1522f62p64r2Q64p01N82N82m70J178Q7j21Q71m94J09M47n38J77l27r37M74n89
$$ -662 -1426 -1518 -654 -1355 -773 -191 -661 517 604 483 1354 860 969 1416 878 1055 728 -209 265 -324
1542c24o23M42q35j21Q73q29N24K37k47J084L21k87R73l15Q7O09o86K6l8q81j24
$$ -324 -947 -505 -1340 -1461 -588 -1417 -893 -656 -903 181 502 215 1188 873 960 1569 883 909 871 -10 -134
1563a34J64r08L00p08l27R40p26L25O83n86J286J54k89R96m9l57Q43n84k61L47
$$ -134 30 -878 -578 -1286 -1613 -673 -1399 -1074 -391 -977 309 463 174 1170 1121 764 1607 1023 762 1109
1583A109o87k76K77j317L41k70n36P85r39K56J002n87K49J154o09N93N88o93P74
$$ 1109 422 146 423 -894 -553 -823 -1359 -574 -1513 -1257 -255 -842 -593 561 -48 545 1133 440 1214
1602A214j69j05K45q38k17J69j158K29k1p35L49j50r9M58M52r0R38n07M24N46
$$ 1214 1045 940 1185 347 130 299 -859 -630 -651 -1386 -1037 -1187 -1286 -828 -376 -466 472 -35 389 935
1622I35m12P34Rp68Q66p64m69L04p28k90J5p26N68l22l33Q19j3j38R78m5j40R22
$$ 935 523 1257 1266 498 1364 600 131 435 -293 -583 -568 -1294 -726 -1048 -1381 -562 -575 -713 265 220 80 1002
1644A002l83L89mn11N42j64m62L49j038m37N63q78J99M0o93P17j03J4R85j88j11
$$ 1002 619 1008 1004 493 1035 871 409 758 -280 -717 -154 -1032 -833 -793 -1486 -769 -872 -858 127 -61 -172
1665a72J419q41L05P05q58M03k99m06K61o40l87L20n90j02J90p96N75N54o55R56
$$ -172 1247 406 711 1416 558 961 662 256 517 -123 -510 -190 -780 -882 -692 -1488 -913 -359 -1014 -58
1685e8j3q3Q28M1m7P37q94O03j76q14M14m22m78J14m20l28K86l66Q0N39l94O10
$$ -58 -71 -154 674 715 668 1405 511 1114 938 124 538 116 -362 -248 -668 -996 -710 -1076 -996 -457 -851 -241
1707b41K72l53Q54L52l32O35l19J06%p81K47N8p26J86l38p39N55m66M7L21k82
$$ -241 31 -322 532 884 552 1187 868 974 974 193 440 498 -228 -42 -380 -1119 -564 -1030 -983 -662 -944
1728i44O42L85l93P87j42N6P55j91k98O48q88P4l0p28rj82o81N71m48j55P14l44
$$ -944 -302 83 -310 477 335 391 1146 955 657 1305 417 491 461 -267 -276 -458 -1139 -568 -1016 -1171 -457 -801
1750h01M6O56l64P80L50k97N67n9j56L28p52L55L00j143Q5m6o42M22o13k74Q73
$$ -801 -755 -99 -463 317 667 370 937 878 722 1050 298 653 953 -190 -105 -151 -793 -371 -984 -1258 -385
1771c85n57K71O35k83M96N41n57O57K55p43P13o25o7L54n78k02J61j300P74j4
$$ -385 -942 -671 -36 -319 177 718 161 818 1073 330 1043 418 351 705 127 -75 86 -1214 -440 -454
1791d54n64J80K34m75Q33j78L69P30l73L56L67m19O63m30l96K68n49k53ln56J58
$$ -454 -1018 -838 -604 -1079 -246 -424 -55 675 302 658 1025 606 1269 839 443 711 162 -91 -94 -650 -492
1812d92J21q51N81l06j13O57O6o1O17J29J38M33l33L69l0o62N34l24n33L87m79
$$ -492 -371 -1222 -641 -947 -1060 -403 -337 -398 219 348 486 919 586 955 925 263 797 473 -60 327 -152
1833a52n39L91r17J70M40m11Q12k69q3R12l39L23M77j34R3L23p11L20j20n68K48
$$ -152 -691 -300 -1217 -1047 -607 -1018 -206 -475 -558 354 15 338 815 681 774 1097 386 706 586 18 266
1854B66p65l4L17p76K65R4k71M12R4p5P04j83K87N74l23KN47q55M02M7q68L02
$$ 266 -499 -533 -216 -992 -727 -633 -904 -492 -398 -473 231 48 335 909 586 588 1135 280 682 729 -139 163
1876A63k34o42O30p50k88O48o45M30L58m93N32N79j70R02k73k04P87q81L61M3
$$ 163 -71 -713 -83 -833 -1121 -473 -1118 -688 -330 -823 -291 288 118 1020 747 543 1330 449 810 853
1896H53r03K43o9o92L24n79q9M76n94L67L45l42O19L70k59O65j2m95Q42o21k6
$$ 853 -50 193 124 -568 -244 -823 -912 -436 -1030 -663 -318 -660 -41 329 70 735 723 228 1070 449 423
1917D23J65n75K88q8m29j23o2o52O34m35j42O10l41M25M00j92P82k71J93K23j8
$$ 423 588 13 301 213 -216 -339 -401 -1053 -419 -854 -996 -386 -727 -302 98 -94 688 417 610 833 815
1938H15k26J21m38P5M7r33K45q9l70J40j76k29L20O1L92N77n48O04L81l70K47
$$ 815 589 710 272 347 394 -539 -294 -383 -753 -613 -789 -1018 -698 -637 -245 332 -216 388 769 399 646
1959F46K00o09N24l43m59M52p77mL15j134N24O7n93R66l19K14J84J65J26N19l73
$$ 646 846 237 761 418 -41 411 -366 -370 -55 -1189 -665 -598 -1191 -225 -544 -330 -146 19 145 664 291
1980B91O71j35j93L41l00o57L97o32l81L40m46N5J31k05K97o1k20J010j60p6O18
$$ 291 962 827 634 975 675 18 415 -217 -598 -258 -704 -649 -518 -723 -426 -487 -707 303 143 67 685
2001F85n10L08N28o73K48P6l45k44J40n02J46m77l41M10m81M54J49m26P84m5j95
$$ 685 175 483 1011 338 586 662 317 73 213 -289 -143 -620 -961 -551 -1032 -578 -429 -855 -71 -116 -311
2022c11P00j72J72O23p08j29N03m04K7j73m80O35n92n31O66n07j06M48m71M85
$$ -311 389 217 389 1012 304 175 678 274 301 128 -352 283 -309 -840 -174 -681 -787 -339 -810 -325
2042c25L42k19L74m9R0P69m82j7M12q62L04M0p88L27l52J78j42l05P3q3L06K26
$$ -325 17 -202 172 123 213 982 500 483 895 33 337 377 -411 -84 -436 -258 -400 -705 -632 -715 -409 -183
2064a83R7k05M60l7J47K15J70p8J28m34j16M97r88L84k13o26O90l71j40L49m63
$$ -183 -86 -291 169 132 279 494 664 586 714 280 164 661 -327 57 -156 -782 -92 -463 -603 -254 -717
2085g17K98J73m1O18O0k84N92l0l71O30o35j8L46n06L2k71l41K92j39m13K58j55
$$ -717 -419 -246 -287 331 391 107 699 669 298 928 293 275 621 115 147 -124 -465 -173 -312 -725 -467 -622
2107f22j65N21OJ27L95j44N76m8m45P38n19j01K07n74Q3L5m51J89P9j59r7j24
$$ -622 -787 -266 -260 -133 262 118 694 646 201 939 420 319 526 -48 35 70 -381 -192 -113 -272 -369 -493
2129d93L34L60l44KN52n44O17q3P9L5j87k57M17m46j52L97o28j07J05n46N41k6
$$ -493 -159 201 -143 -141 411 -133 484 401 480 515 328 71 488 42 -110 287 -341 -448 -343 -889 -348 -374
2151c74m43M20J68K29L11j21rJ92M6J99j70m68P04n99J31J69o10M7J89l50m3j85
$$ -374 -817 -397 -229 0 311 190 181 373 419 618 448 -20 684 85 216 385 -225 -178 11 -339 -382 -567
2173e67j17N47j27O5J87J87Q5K27l42M09P9o27L18N5l64M28o10n3J72n36J55J95
$$ -567 -684 -137 -264 -199 -12 175 260 487 145 554 633 6 324 379 15 443 -167 -220 -48 -584 -429 -234
2195b34n09M15K36n56J128m51L65Rj87J06L76j00j0j32k34K84n31m34L23m54m9
$$ -234 -743 -328 -92 -648 480 29 394 403 216 322 698 598 588 456 222 506 -25 -459 -136 -590 -639
2216f39M69o22M92M16m56L98k7Q5L59l88N10N12j182K91J93m45K88l06l51K84
$$ -639 -170 -792 -300 116 -340 58 31 116 475 87 597 1109 -73 218 411 -34 254 -52 -403 -119
2236a19k29j85M53m85n3M75k97L91M1k37M13j6m1M35m3k18K82n48J22J19m95J77
$$ -119 -348 -533 -80 -565 -618 -143 -440 -49 -8 -245 168 152 111 546 503 285 567 19 141 260 -235 -58
2258e8k66k61M64J9k44J29l25J85J29J96K06k61L06M59k43j42K77m32K21j98l92
$$ -58 -324 -585 -121 -102 -346 -217 -542 -357 -228 -32 174 -87 219 678 435 293 570 138 359 161 -231
2279b31l0K84l96K77j82k11L60k26J44J54j68K04N37n78N91PJK15n46J9J02l38
$$ -231 -261 23 -373 -96 -278 -489 -129 -355 -211 -57 -225 -21 516 -62 529 536 537 752 206 225 327 -11
2301a1j64N5m17L48j70j32M4O9J03J63nJ72J15J51nK34k41M04k37l47K07l20J46
$$ -11 -175 -120 -537 -189 -359 -491 -447 -378 -275 -112 -117 55 170 321 316 550 309 713 476 129 336 16 162
2324A62l7k94J21j28k71M7J05J21O4j98K21L56k3j66M90o39N28j35l29K54k70
$$ 162 125 -169 -48 -176 -447 -400 -295 -174 -110 -308 -87 269 246 80 570 -69 459 324 -5 249 -21
2345b1j46J90m13L19m3n20J76P0j50K96Q9o6L33m2K34K24m04K30N0j03m1oj23
$$ -21 -167 23 -390 -71 -114 -634 -458 -388 -538 -242 -153 -219 114 72 306 530 126 356 406 303 262 256 133
2368A33K50m30p0j14l82K62R6m27O78r0%L19J07m74K52o1M49k6l35k5K14k77r6
$$ 133 383 -47 -117 -231 -613 -351 -255 -682 -4 -94 -94 225 332 -142 110 49 498 472 137 112 326 49 -47
2391d7j54l78O83n12oJ95m13P50k46j86N75j80J07N01m97J30Q9j74m39M97oR5
$$ -47 -201 -579 104 -408 -414 -219 -632 118 -128 -314 261 81 188 689 192 322 411 237 -202 295 289 384
2413C84l08m11P7j91K18J92n17K17L54l71J38L28k40M84k11J16K42l73J99j62
$$ 384 76 -335 -258 -449 -231 -39 -556 -339 15 -356 -218 110 -130 354 143 259 501 128 327 165
2433A65l93K75K19o68K78j54j05K69L9m31L59j53P0O34j68L5Rj15K75k8m17L99
$$ 165 -228 47 266 -402 -124 -278 -383 -114 -75 -506 -147 -300 -230 404 236 271 280 165 440 412 -5 394
2455C94k32o7o8j15k93K19j10nJ19j73M08j57n7K03r5M3M1j0M62k45J42j41l76
$$ 394 162 95 27 -88 -381 -162 -272 -277 -158 -331 77 -80 -137 66 -29 14 55 45 507 262 404 263 -113
2478a13J84L3j26k91M38p40M07j12k63L73p7q6N06l37J73L94k59K48l11J93q8
$$ -113 71 104 -22 -313 125 -615 -208 -320 -583 -210 -287 -373 133 -204 -31 363 104 352 41 234 146
2499A46r4k9J97m94L55n5k10o4J70k48M35k20k40L22k8J15J95m7L5J30k57L77
$$ 146 52 23 220 -274 81 26 -184 -248 -78 -326 109 -111 -351 -29 -57 58 253 206 241 371 114 491
2521D91m60J58n3kk38P9k72N6j01R3K16J00m00J32kJ33M11k45K61j09j5J52J30
$$ 491 31 189 136 134 -104 -25 -297 -241 -342 -249 -33 67 -333 -201 -203 -70 341 96 357 248 233 385 515
2544E15o34K49j10j59K61l90J46J80l15k11J81k9J72J8j11M15j46j82M13N7n40
$$ 515 -119 130 20 -139 122 -268 -122 58 -257 -468 -287 -316 -144 -126 -237 178 32 -150 263 320 -220
2565b20M47j55J17Kk07J66j82j98r5lJ21J41L3L9N9j74J31J54m86N69l42L08R8
$$ -220 227 72 189 191 -16 150 -32 -230 -325 -328 -207 -66 -33 6 65 -109 22 176 -310 259 -83 225 323
2588C23kj28k14J33J49m59j54L72m16J74J31l51L10j08r9K88L63J0J55l81J86
$$ 323 321 193 -21 112 261 -198 -352 20 -396 -222 -91 -442 -132 -240 -339 -51 312 322 477 96 282
2609B82L46l30k04M7j37o3M0k38K63j78j43K11j02J88j65P0K02k29J64J28J57
$$ 282 628 298 94 141 4 -59 -19 -257 6 -172 -315 -104 -206 -18 -183 -113 89 -140 24 152 309
2630C09q2J79r2k67L56m94J14M0o73M86n2j35r9K90k2l4j94M56j03k96L91J17
$$ 309 227 406 314 47 403 -91 23 63 -610 -124 -176 -311 -410 -120 -142 -176 -370 86 -17 -313 78 195
2652A95j06J56p6J47o0k60m4j12L8q7J0J12M7k75j16M96n0j26kj0L02n7K39k17
$$ 195 89 245 169 316 256 -4 -48 -160 -122 -209 -199 -87 -40 -315 -431 65 15 -111 -113 -123 179 122 361 144
2676A44R0m49O42l16j68Kk74M3K99m26K15l6p1O7OJ29K01j17J30K44k14M4k15
$$ 144 234 -215 427 111 -57 -55 -329 -286 13 -413 -198 -234 -305 -238 -232 -103 98 -19 111 355 141 185 -30
2699c0K35P2l08%J70O7m12O8k94L59k83m8M03J19j16J23k98J21L5OJ25r1k6P3
$$ -30 205 277 -31 -31 139 206 -206 -138 -432 -73 -356 -404 -1 118 2 125 -173 -52 -17 -11 114 23 -3 70
2723G0P0l81M41l69K97l13j71J18K13L2k29J12kJ47J02j59J57j46o9K37o0n1Q7
$$ 70 140 -241 200 -169 128 -185 -356 -238 -25 7 -222 -110 -112 35 137 -22 135 -11 -80 157 97 46 133
2746A33k6k0j20R2k01j97L85j84r7J79M5k37K81n5l81O05p4l40M70k12O2J13k95
$$ 133 107 87 -33 59 -142 -339 46 -138 -235 -56 -11 -248 33 -22 -403 202 128 -212 258 46 108 221 -74
2769g4R1J44k04j12Kop2o3J02l17K21K80K42m40K90l0pK97m13J65K1J51l16J01
$$ -74 17 161 -43 -155 -153 -159 -231 -294 -192 -509 -288 -8 234 -206 84 54 47 344 -69 96 117 268 -48 53
2793E3l84N68k32k12J79j89K3O1J33k26K83o3n7L01m9P2j29k87Q6J71J40L7j31
$$ 53 -331 237 5 -207 -28 -217 -194 -133 0 -226 57 -6 -63 238 189 261 132 -155 -69 102 242 279 148
2816A48l82J81q0k67K42NR0J5p0K45k16J82J26l30L00k12L92k14k2J1J52j63O
$$ 148 -234 -53 -133 -400 -158 -153 -63 -48 -118 127 -89 93 219 -111 189 -23 369 155 133 144 296 133 139
2839A39j19r1L81m65J48K7l8Qk14K63n0K58k41J82n1k08M43l25P5k39Q7O2L2j46
$$ 139 20 -71 310 -155 -7 20 -18 -10 -224 39 -11 247 6 188 137 -71 372 47 122 -117 -30 32 64 -82
2863h2Q0k40L1k5J71l1J2k70K89K12j45j66K68J55j16j44j4J07n0Q4l6Jk27K35
$$ -82 -2 -242 -211 -236 -65 -96 -84 -354 -65 147 2 -164 104 259 143 -1 -15 92 42 126 90 91 -136 99
2887I9j48n1o5K52j81o3M63j39j72J33j15k9J24j29J99J49l23r2K74l13L3m7J1
$$ 99 -49 -100 -165 87 -94 -157 306 167 -5 128 13 -16 108 -21 178 327 4 -88 186 -127 -94 -141 -130
2910a30j3J95k27M0J56k01K24K0k08K51j50J39p1K3L19k26k51L97j48l47J73j45
$$ -130 -143 52 -175 -135 21 -180 44 64 -144 107 -43 96 25 48 367 141 -110 287 139 -208 -35 -180
2932a80J20J9m17L26P2K02j35j44k3K17J16m6K23m59K55l20J69p9J04N3l35M54
$$ -180 -60 -41 -458 -132 -60 142 7 -137 -160 57 173 127 350 -109 146 -174 -5 -84 20 73 -262 192
2954A92m4j09j49mJ55j39J19j63L66j05P2j85J41l46J70K07k51J88j97N5k81M1
$$ 192 148 39 -110 -114 41 -98 21 -142 224 119 191 6 147 -199 -29 178 -73 115 -82 -27 -308 -267
2976b67P3K18j65P9R1l58K27K39k13K12l6j26M20k65j05MK0M8K56l78l84N26l06
$$ -267 -194 24 -141 -62 29 -329 -102 137 -76 136 100 -26 394 129 24 28 48 96 352 -26 -410 116 -190
2999a90L71j45j82K53l08Q5N9K96j61K20j14k03K26k61O7N3j64J03j96J5kJ62
$$ -190 181 36 -146 107 -201 -116 -57 239 78 298 184 -19 207 -54 13 66 -98 5 -191 -176 -178 -16
3021a6k05l8J29j5J79J44l14L41m20K51P2J10n2j82P8K5K0r7k97M99k36j93K79
$$ -16 -221 -259 -130 -145 34 178 -136 205 -215 36 108 218 166 -16 62 87 107 10 -287 212 -24 -217 62
3044F2k63p8O17k41j95J30k68L76l43L9J35J77k31J56Q6j09p2J07J20l27j03J48
$$ 62 -201 -279 338 97 -98 32 -236 140 -203 -164 -29 148 -83 73 159 50 -22 85 205 -122 -225 -77
3066g7J02j3j49J1k7L12k61oO5L31j66j87L51k61J0l14K53P8j44p7L41m24K82
$$ -77 25 12 -137 -126 -153 159 -102 -108 -43 288 122 -65 286 25 35 -279 -26 52 -92 -169 172 -252 30
3089C0L8j28K90n33M70k70r7K70J24k40J61j70J22l2m7J21j99M9j92L83k13o7
$$ 30 68 -60 230 -303 167 -103 -200 70 194 -46 115 -55 67 35 -12 109 -90 -41 -233 150 -63 -130
3111a30j58K27m2O1J2k4k02K87o0p5N63l36l58N30j45J53l9j72l21J02j52K74
$$ -130 -288 -61 -103 -42 -30 -54 -256 31 -29 -104 459 123 -235 295 150 303 264 92 -229 -127 -279 -5
3133ej96K25j36k81M64O5o2J4n9n0K09r0j94K99k50o7R4L9K08j01l20J05p7K90
$$ -5 -201 24 -112 -393 71 136 74 88 29 -21 188 98 -96 203 -47 -114 -20 19 227 126 -194 -89 -166 124
3157A24k55j03L98J4j93J6J3k9K19k49K59j67k15K35n0j98N61o65J0J38j78K92
$$ 124 -131 -234 164 178 -15 1 14 -15 204 -45 214 47 -168 67 17 -181 380 -285 -275 -137 -315 -23
3179b3K02j13k72L66j72O9r2J57J66k53Q8k02K9L14l61J80l21J19J18o9n4Q5R3
$$ -23 179 66 -206 160 -12 57 -35 122 288 35 123 -79 -50 264 -97 83 -238 -119 -1 -70 -124 -39 54
3202E4k63J78J95n8R8M1j83J1K6O0l94J46r4L74m38J09J21k87M8K74j25L1OM6
$$ 54 -209 -31 164 106 204 245 62 73 99 159 -235 -89 -183 191 -247 -138 -17 -304 -256 18 -107 -76 -70 -24
3226b4J3K24k27j33K03n8M2Q0n9J22l42R0J03k79K63J7R1j28j97K33n2n4K5m3
$$ -24 -11 213 -14 -147 56 -2 40 120 61 183 -159 -69 34 -245 18 35 126 -2 -199 34 -18 -72 -47 -90
3250i0J56P3j7p0o8k4J41J66p11L44K23J8k39K74j78q0l5r1K48P5k49L26j86j9
$$ -90 66 139 122 52 -16 -40 101 267 -444 -100 123 141 -98 176 -2 -82 -117 -208 40 115 -134 192 6 -13
3274a3L1j49K92j89R5m4j7ONj89J94k0o1p6p4P1L82l75j36J84J06j2J2K1j11P6
$$ -13 18 -131 161 -28 67 23 6 12 17 -172 22 2 -59 -135 -209 -138 244 -131 -267 -83 23 11 23 44 -67 9
3300Ik64J57J27J19J65m63l3j67M25n4j64L88m13K7j9L72r3j79K56j57j4m0K86
$$ 9 -255 -98 29 148 313 -150 -183 -350 75 21 -143 245 -168 -141 -160 212 119 -60 196 39 25 -15 271
3323B71j46j60J8K33j38l16J98k51K53k14J79J57l55K17K51k55P7p0j30O7J06
$$ 271 125 -35 -17 216 78 -238 -40 -291 -38 -252 -73 84 -271 -54 197 -58 19 -51 -181 -114 -8
3344hN2J46n3L4j74j9O1j06K66l39J76l1K10l08Q3o4J51j90J52o5R0L4M5l04P7
$$ -8 44 190 137 171 -3 -22 39 -67 199 -140 36 5 215 -93 -10 -74 77 -113 39 -26 64 98 143 -161 -84
3369h4O7p9K12k92Q4J30J74l83J1N4Mk2JJ07q7L36j27R5j81j2N1Q5n5r4k0j9O5
$$ -84 -17 -96 116 -176 -92 38 212 -171 -160 -106 -102 -124 -123 -16 -103 233 106 201 20 8 59 144 89 -5 -25 -44 21
3396B1l0k12K96k43j90L03J40p1j25K47j97L13q8N5l28j11L98l19P2M3n8J35m2
$$ 21 -9 -221 75 -168 -358 -55 85 14 -111 136 -61 252 164 219 -109 -220 178 -141 -69 -26 -84 51 9
3419IN9K77m35l16O75l14j18L80j01q5J60J78k90n1p9Q5n1P4m0k12R1L65m18J69
$$ 9 68 345 -90 -406 269 -45 -163 217 116 31 191 369 79 28 -51 34 -17 57 17 -195 -104 261 -157 12
3443A2k35N0R6O9k97J57O4J24O2kK48j49N2k61L4J05q1k68K48mJ35k3p3k03K20
$$ 12 -223 -173 -77 -8 -305 -148 -84 40 102 100 348 199 251 -10 24 129 48 -220 28 24 159 136 63 -140 80
3468H0L5l38L42J31j59O0j86K98l46M1K09k06J15j78L09k32J55j04L2j72m9J81
$$ 80 115 -223 119 250 91 151 -35 263 -83 -42 167 -39 76 -102 207 -25 130 26 58 -114 -163 18
3490A8J12l57L23j55k05M41q2J19k13O9j5J05k96J49R1k10J69m5l5K5P8j22J27
$$ 18 130 -227 96 -59 -264 177 95 214 1 70 55 160 -136 13 104 -106 63 18 -17 8 86 -36 91
3513I1k07J45J56l00J91j46J33Pk57L33j61j05K81m04J1J22m5j06J69Q7j5K69
$$ 91 -116 29 185 -115 76 -70 63 70 -187 146 -15 -120 161 -243 -232 -110 -155 -261 -92 -5 -20 249
3535B49l35J61K2J62k92R6n1o4L52m42K52j65J52p5l38k08Q06j18m19J62l52N46
$$ 249 -86 75 97 259 -33 63 12 -52 300 -142 110 -55 97 22 -316 -524 282 164 -255 -93 -445 101
3557A01p54Q43K6k97k02L63j30K38o1j83J65N9lO5l83O8r0n6K05j74R0J40p3j
$$ 101 -653 190 216 -81 -283 80 -50 188 127 -56 109 168 165 230 -153 -85 -175 -231 -26 -200 -110 30 -43 -44
3581d4J5K78m87L39N0O6N0mk90J53k95J39M9R7p7m9J04pj60m9K90j77J57j26p4
$$ -44 -29 249 -238 101 151 217 267 263 -27 126 -169 -30 19 116 39 -10 94 87 -73 -122 168 -9 148 22 -52
3606e2K1M29j57j35k65M28k28j22o4P0K6L6N0n4J4q3Q2n4J3L29j85j67r5L39J2
$$ -52 -31 398 241 106 -159 269 41 -81 -145 -75 -49 -13 37 -17 -3 -86 -4 -58 -45 284 99 -68 -163 176 188
3631A88qJ7k63K80%j76j04J18L3k72j27L55j25Q8J2j10K66l37K23J90j53k12K05
$$ 188 180 197 -66 214 214 38 -66 52 85 -187 -314 41 -84 4 16 -94 172 -165 58 248 95 -117 88
3654H8J87k24L3l01K02P3k36j32L50l66K53j83J02M4KK28k10o5K08o3%J06k02
$$ 88 275 51 84 -217 -15 58 -178 -310 40 -326 -73 -256 -154 -110 -108 120 -90 -155 53 -10 -10 96 -106
3677a06L20o5K8N1m49%L1M05m17Q3J65k49L95l57M1n2J41l1J84j58L26l19j80
$$ -106 214 149 177 228 -221 -221 -190 215 -202 -119 46 -203 192 -165 -124 -176 -35 -66 118 -40 286 -33 -213
3700b13M25j40j60J50j28l7J92k5j12J72k05j6P2j35K80k79J89O3N9OJ29j71n64
$$ -213 212 72 -88 62 -66 -103 89 64 -48 124 -81 -97 -25 -160 120 -159 30 93 152 158 287 116 -448
3723d48O68p1J16k90j79K6K25k55J3L18j77J4K0N8J04k21K44j8j56R0R7n3k95
$$ -448 220 149 265 -25 -204 -178 47 -208 -195 123 -54 -40 -20 38 142 -79 165 147 -9 81 178 125 -170
3746a70L87k71k56N06k96M0k26L67r0J37j85k5lK42K87k90K7j33O5o5k0J82k72
$$ -170 217 -54 -310 196 -100 -60 -286 81 -9 128 -57 -82 -85 157 444 154 181 48 113 48 28 210 -62
3769f2J36q7K24l61jl1K29q9j90K50j24J98m5j3q6j22J93K25l59m5J34K5L7n3
$$ -62 74 -13 211 -150 -151 -182 47 -42 -232 18 -106 92 47 34 -52 -174 19 244 -115 -160 -26 -1 36 -17
3793a7k2J9j48J01J36k68J76N6l18K18K00R6j62k74L17j9r2L32j79j36j45J54
$$ -17 -39 -20 -168 -67 69 -199 -23 33 -285 -67 133 229 67 -207 110 91 -1 331 152 16 -129 25
3815B5pr3K0J09r7k24JL73J2l27L81k87R1J37m0l22M14n0R6j79k3R1m16J01j01
$$ 25 18 -75 -55 54 -43 -267 -266 107 119 -208 173 -114 -23 114 74 -248 166 116 212 33 10 101 -315 -214 -315
3840c15P2J18K0k53L62m2k48J94j15j46L61j09k6K37k17Q8J2O4L09l44k50K97
$$ -315 -243 -125 -105 -358 4 -38 -286 -92 -207 -353 8 -101 -127 110 -107 -19 -7 57 366 22 -228 69
3862F9j55Q3L5o8o0n0L46l59R1J42L0m3K43k14p8M1j64o4K35J63j47M0j53l3j6
$$ 69 -86 -3 32 -36 -96 -146 200 -159 -68 74 104 61 304 90 12 53 -111 -175 60 223 76 116 -37 -70 -86
3887h6o4PoP0P6J13j02KK56N6k56J50j83Q1k40N3q4J30n3oj10R0JJ5l6J36j54
$$ -86 -150 -143 -149 -79 -3 110 8 10 266 322 66 216 33 114 -126 -73 -157 -27 -80 -86 -196 -106 -105 -90 -126 10 -144
3914a44K79M0m4p8k71K52J17J32l62Q5J15l16L51l65K97K4O5o2j61J11Pj93J25
$$ -144 135 175 131 53 -218 34 151 283 -79 6 121 -195 156 -209 88 112 177 115 -46 65 72 -121 4
3937DK5n8q4K45Mm07K26q3K24J3L1m65K93k7J35l61K48pk4J08j12N2M8M4O2k97
$$ 4 29 -29 -113 132 136 -271 -45 -128 96 109 140 -325 -32 -59 76 -285 -37 -44 -68 40 -72 -20 28 72 134 -163
3963a63P6J73P6qr8P4k09J37j97p5J10J17r0m2J03q1P3P3l65J51J95l76M78l89
$$ -163 -87 86 162 154 56 130 -79 58 -139 -214 -104 13 -77 -119 -16 -97 -24 49 -316 -165 30 -346 132 -257
3987b57N3M95l05o4K34j00j16N8J81l07P4l23J7L01N4j10m9J76M9j88k62O80k62
$$ -257 -204 291 -14 -78 156 56 -60 -2 179 -128 -54 -377 -360 -59 -5 -115 -164 12 61 -127 -389 291 29
4010B9n4Q2k2J77l37q6L70l69K86Nk01R3J66k40M5J52k09J45L4l0k35K39k2j69
$$ 29 -25 57 35 212 -125 -211 159 -210 76 81 -120 -27 139 -101 -56 96 -113 32 66 36 -199 40 18 -151
4034a51K21o2k6K1K3J91J37m44J24J15r7k07Q4j75j39M71j59O6j7j81K64K20p7
$$ -151 70 8 -18 3 26 217 354 -90 34 149 52 -155 -71 -246 -385 86 -73 -7 -24 -205 59 279 202
4057B02q5l67K94M5o9P2k43j75R8M23l79L17j12j89J99J31j86J54l3L8l52L71
$$ 202 117 -250 44 89 20 92 -151 -326 -228 195 -184 133 21 -168 31 162 -24 130 97 135 -217 154
4079A54k79K65N6k61J1R5M7Q7k85J93j39K83l16OR1j11k7J26j33m4L27j12L01
$$ 154 -125 140 196 -65 -54 41 88 175 -110 83 -56 227 -89 -83 8 -103 -130 -4 -137 -181 146 34 335
4102C35k17Jj54L24l22P0p1J02j72j41K13k0K08q2k54K3J04J32oO3j22Q9O6k55
$$ 335 118 119 -35 289 -33 37 -34 68 -104 -245 -32 -52 156 74 -180 -157 -53 79 73 136 14 103 169 -86
4126h6J76j5J52m45K99N2l09M6J38l9k0J96n2m7J52l9j46R0j88m9J16L5J18l23
$$ -86 90 75 227 -218 81 133 -176 -130 8 -31 -51 145 93 46 198 159 13 103 -85 -134 -18 17 135 -188
4150a88Q2R5k29J15mj04J33j10J62l9j37K64j85k1L85m17M59l29n5M9Q7K65k05
$$ -188 -106 -11 -240 -125 -129 -233 -100 -210 -48 -87 -224 40 -145 -166 219 -198 261 -68 -123 -74 13 278 73
4173G3k86L69j88P8r1K05l61J38m7J42j4j24J28k42K27k47J66P5P1K88m67J72
$$ 73 -213 156 -32 46 -45 160 -201 -63 -110 32 18 -106 22 -220 7 -240 -74 1 72 360 -107 65
4195F5j87J44N3j02k2l10L23q0n1L5J23J04J86m4r8k86P3Q7J36m8N6L2m41K48
$$ 65 -122 22 75 -27 -49 -359 -36 -116 -167 -132 -9 95 281 237 139 -147 -74 13 149 101 157 189 -252 -4
4219dk5J84q8k58M53m48J9L74j38j53kj39K7K97M3m2l59J53K60k73K13k51J28
$$ -4 -29 155 67 -191 262 -186 -167 207 69 -84 -86 -225 -198 99 142 100 -259 -106 154 -119 94 -157 -29
4242b9J05Nj93pk47L79L0j73K13j1j61J19L47j56R2o7m84K93k9O4l59K44P1j90
$$ -29 76 81 -112 -119 -366 13 43 -130 83 72 -89 30 377 221 313 246 -238 55 26 90 -269 -25 46 -144
4266a44ll8J15j48M7J42j6o7J55p2j4K14q9K8j24j15L12j52j34N3J04P3LP8j61
$$ -144 -147 -185 -70 -218 -171 -29 -45 -112 43 -29 -43 171 82 110 -14 -129 183 31 -103 -50 54 127 130 208 47
4291D7n32J95J27N1k8MK74m48L13J12k27p2L41j09j29m7L54j60k42o9K70l16K46
$$ 47 -485 -290 -163 -112 -140 -136 138 -310 3 115 -112 -184 157 48 -81 -128 226 66 -176 -245 25 -291 -45
4314d5J10L1k8O2Qm6j50L7K12k08J36O0m6j43L04l02j73O5O4R1l29L53m3j32L2
$$ -45 65 96 68 130 138 92 -58 -21 191 -17 119 179 133 -10 294 -8 -181 -116 -52 39 -290 63 20 -112 -80
4339h0K0N3q6M1R0qko9J00k03N9L46j87j16J40m04OJ08K07n5j37K52j80J45J78
$$ -80 -60 -7 -93 -52 38 30 28 -41 59 -144 -85 261 74 -42 98 -306 -300 -192 15 -40 -177 75 -105 40 218
4364B18l88J25j91N94l26J82j69m4J25pJ5j34J90j37N8k99P0K5o8J44j73J28Q3
$$ 218 -170 -45 -236 358 32 214 45 1 126 119 134 0 190 53 111 -188 -118 -93 -161 -17 -190 -62 21
4387B1n1J61k12K40j60J96l44K63m9J84n9k03O2j31K14k25J41k08M0N0O9j41O5
$$ 21 -30 131 -81 159 -1 195 -149 114 65 249 190 -13 49 -82 132 -93 48 -160 -120 -70 -1 -142 -77
4410g7k2J93j00J42N8k47L23m53J25k2M6K55j55j89o0R5J09n0K08l3k66K71q5
$$ -77 -99 94 -6 136 194 -53 270 -183 -58 -80 -34 221 66 -123 -183 -88 21 -29 179 146 -120 151 66
4433F6j20n9M40j66j70P3o7j65K63l09J40J98j54oj63K62j97J24l4N3l3j85K44
$$ 66 -54 -113 327 161 -9 64 -3 -168 95 -214 -74 124 -30 -36 -199 63 -134 -10 -44 9 -24 -209 35
4456C5k4j31K82l66L31j48j15J87l36O33n31j21K25k7j19J01K90k02M9j9j5J21
$$ 35 11 -120 162 -204 127 -21 -136 51 -285 348 -183 -304 -79 -106 -225 -124 166 -36 13 -6 -21 100
4478A00q6o0J70j8N0J86p8m66j2M96k05Jk54M62k58l2J86j18l5j09r1K33k25Q8
$$ 100 14 -46 124 106 156 342 264 -202 -214 282 77 78 -176 286 28 -4 182 64 29 -80 -171 62 -163 -75
4502g5L76j01k45k77J25L44k12J46l1o0P0k52K59k29O3J5j04J08K30J25l11p6
$$ -75 301 200 -45 -322 -197 147 -65 81 50 -10 60 -192 67 -162 -99 -84 -188 -80 150 275 -36 -112
4524a12J74J09j17j90j00K5L15K50k69J7k32P7pK2L8k80L62k94K16j65o9L43j97
$$ -112 62 171 54 -136 -236 -211 104 354 85 102 -130 -53 -60 -38 0 -280 82 -212 4 -161 -230 113 -84
4547h4K06pj81J54j05K37l5J29m29K9J66Q2k28j17L31j35k4r8O1J69j41K65k41
$$ -84 122 115 -66 88 -17 220 185 314 -115 -86 80 162 -66 -183 148 13 -11 -109 -48 121 -20 245 4
4570DJ92P0r6l04N8J04j18k01K55nl2R7J2N8j47J12l20M35n8j62pO7J43j38k02
$$ 4 196 266 170 -134 -76 28 -90 -291 -36 -41 -73 24 36 94 -53 59 -261 174 116 -46 -53 14 157 19 -183
4595a83L75j27m4k04k9M16k45K1Lk00L0K74l50J98J11r6N9J39k17K23O3l12j44
$$ -183 192 65 21 -183 -212 204 -41 -20 -17 -217 -187 87 -263 -65 46 -50 9 148 -69 154 217 -95 -239
4618b39R0J70P4k60J76J70l73J8O0j42N8o6L94J12j30j39K17l25O9J27r4K42n6
$$ -239 -149 21 95 -165 11 181 -192 -174 -114 -256 -198 -264 130 242 112 -27 190 -135 -66 61 -33 209 153
4641A53q8j49j97J40K45k03O2J10j20j47J56k14K79j31J37J87j17l1k09J22Q1
$$ 153 65 -84 -281 -141 104 -99 -37 73 -47 -194 -38 -252 27 -104 33 220 103 72 -137 -15 66
4662F6k29k0j64M90k71K04l40K36M6K2j35R9J19L8k55K61N1j42Pj31K53j70J02
$$ 66 -163 -183 -347 143 -128 76 -264 -28 18 40 -95 4 123 161 -94 167 218 76 83 -48 205 35 137
4685A37n7j46j05Q9K66k25Q3K9q0Q0m2o2j66L95l77N4J07J45k2o8j66j06L11l31
$$ 137 80 -66 -171 -82 184 -41 42 71 -9 71 29 -33 -199 196 -181 -127 -20 125 103 35 -131 -237 74 -257
4709b57J42M0J09Q9K28m54N0N3l83M00K43k57R9K06l99R6R9J14k95N1J35k57O
$$ -257 -115 -75 34 123 351 -103 -53 0 -383 17 260 3 102 308 -91 5 104 218 -77 -26 109 -148 -142
4732a42K00m7J1j6K6Pj83J25p6J41L32l31J20m80M51k36L84k79j16L53L6j49j91
$$ -142 58 11 22 6 32 39 -144 -19 -95 46 378 47 167 -313 138 -98 286 7 -109 244 280 131 -60
4755f0p2L56m07L8R7J32k30J60r2J62j47R0m7L7j0k0K7j85L20p6K26l49m6K81
$$ -60 -132 224 -183 -145 -48 84 -146 14 -78 84 -63 27 -20 17 7 -13 14 -171 149 73 299 -50 -96 185
4779A85k56R1O3K9j67Q2m46K25L73n9j4k05J19P1J62J0Rl13K26p7Q5o6l2r8m0
$$ 185 -71 20 83 112 -55 27 -419 -194 179 120 106 -99 20 91 253 263 272 -41 185 108 193 127 95 -3 -43
4804d3K82k96r8K20j90K24j36q1L8j3n7oJ23j2N6K06k87j2L9Lk1J33j30mJ01j5
$$ -43 239 -57 -155 65 -125 99 -37 -118 -80 -93 -150 -156 -33 -45 11 217 -70 -82 -43 -40 -61 72 -58 -62 39 24
4830B4n9K08m63K91N9J5K9J44l8l90J09J23jq5L1O6r4L29l92K37j38K07l7j4j42
$$ 24 -35 173 -290 1 60 75 104 248 210 -180 -71 52 51 -34 -3 63 -31 298 -94 143 5 212 175 161 19
4855A9Q4j77K14j39q8j85K84j0K7J06l14N4J67Q7j27K0j65j8L58l19n6M45j50
$$ 19 103 -74 140 1 -87 -272 12 2 29 135 -179 -125 42 129 2 22 -143 -161 197 -122 -178 267 117
4878A17k11J43JJ95o6m4r2j2K03j56j5k36K70k32J28J18oK1o5J11j01k40J60J1
$$ 117 -94 49 50 245 179 135 43 31 234 78 63 -173 97 -135 -7 111 105 126 61 172 71 -169 -9 2
4902BJ18p1q8K34k79q1L40k78k0m5P1J5k5J86Mp6Q4k9j33mL94j66k42K00l39L22
$$ 2 120 49 -39 195 -84 -165 175 -103 -123 -168 -97 -82 -107 79 83 7 91 62 -71 -75 319 153 -89 111 -228 94
4928I4J11N3n5j81nq7N5K43L2k34l6O5K70Kn06K06K52m14J29L4p2K08j42k10J54
$$ 94 205 258 203 22 17 -70 -15 228 260 26 -10 55 325 327 -179 27 279 -135 -6 28 -44 164 22 -188 -34
4953c4K10l39M9m0J04j4j64L58l28J31j03J09L92k86%l15M28l07O7J83Q8K9k35
$$ -34 176 -163 -114 -154 -50 -64 -228 130 -198 -67 -170 -61 331 45 45 -270 158 -149 -82 101 189 218 -17
4976a7O4j02J36M2J9k53J60q4n05N72j84Q2K26j47J18k61J81k11Q8q1O0J20j81
$$ -17 47 -55 81 123 142 -111 49 -35 -540 32 -152 -70 156 9 127 -134 47 -164 -76 -157 -97 23 -158
4999a58L36j75j95M96l29J7J34r0q5n6J82k29N25k83J59k80K57k18M8k26L05j18
$$ -158 178 3 -192 304 -25 -8 126 36 -49 -105 77 -152 373 90 249 -31 226 8 56 -170 135 17
5021A7j72L41j40J19k67K52l68R6n5L77pl98mQ2J74K88l68o4p2j97L12rN0P4n1
$$ 17 -155 186 46 165 -102 150 -218 -122 -177 200 193 -205 -209 -127 47 335 -33 -97 -169 -366 -54 -63 -13 61 10
5046A0J6R8o3k70j79k2P15p5m7R2m51J57J45J40j28k95K14j32J11k01K19j57l8
$$ 10 26 124 61 -209 -388 -410 305 230 183 275 -176 -19 126 266 138 -157 57 -75 36 -165 54 -103 -141
5069a41L3k21L11r8K44j83j9j2O7P0k85M8J99k08J57L3p5K48j53K6Q2j34r9J25
$$ -141 -108 -329 -18 -116 128 -55 -74 -86 -19 51 -234 -186 13 -195 -38 -5 -80 168 15 41 123 -11 -110 15
5093A5m2k15M53j8k7j95J45J05j96o5J89k54J09K17k70J69m7J6l55K23R4j11K8
$$ 15 -27 -242 211 193 166 -29 116 221 25 -40 149 -105 4 221 -49 120 73 89 -266 -43 51 -60 -32
5116c2k5J16m2Ol3K13k46j94K56L9P7k61K79k40K01j58R1k29J64K52l80j29K70
$$ -32 -57 59 17 23 -10 203 -43 -237 19 58 135 -126 153 -87 114 -44 47 -182 -18 234 -146 -275 -5
5139eL6k60K01j59J69M0j51J93o8P5p4J15k26K62l00J2K30Q0j36j76K38p6l75
$$ -5 31 -229 -28 -187 -18 22 -129 64 -4 71 -3 112 -114 148 -152 -140 90 170 34 -142 96 20 -355
5162c55M32k0k1l7J39j41l2j20j30L97k98L44j26k4j18OJ99k85K42o2j23M7J26
$$ -355 77 57 36 -1 138 -3 -35 -155 -285 112 -186 158 32 8 -110 -104 95 -190 52 -10 -133 -86 40
5185D0q3J64RN7k63K5L14l10K17q9j41j7Q4l0K54k08k4O0n1K4n2Q6j41O8O3k42
$$ 40 -43 121 130 187 -76 -51 263 -47 170 81 -60 -77 7 -23 231 23 -1 59 8 32 -20 66 -75 -7 56 -186
5211a86J31o0p0J20J75p1L3m6k66N42k44K5N5j04j38O2k75J24K27j18O6R0Q3l20
$$ -186 -55 -115 -185 -65 110 39 72 26 -240 302 58 83 138 34 -104 -42 -317 -193 34 -84 -18 72 155 -165
5235a65j7K42q8J15p1M3M8q2J16j88k62J68J38R6P0m06k9J88O3q4j7L98j21k46
$$ -165 -182 60 -28 87 16 59 107 25 141 -47 -309 -141 -3 93 163 -243 -272 -84 -21 -105 -122 276 155 -91
5259i1L66k07k85M47m82J52RJ93j86R0R4O1p9l8J1K27n11O4M48m81N5J87j81n3
$$ -91 275 68 -217 230 -252 -100 -91 102 -84 6 100 161 82 44 55 282 -229 -165 283 -198 -143 44 -137 -190
5283a90K34Pp4O1k37n5K38M1P1o3jJ38J18l34P2j34J17N5qJ56j15n9m4jK04j57
$$ -190 44 51 -23 38 -199 -254 -16 25 96 33 32 170 288 -46 26 -108 9 64 56 212 97 38 -6 -7 197 40
5309D0j36K25r7l15M16j48m8k12M00qn66M19J06l46n2K48p6K10j08J58j91J44
$$ 40 -96 129 32 -283 133 -15 -63 -275 125 117 -449 -30 76 -270 -322 -74 -150 60 -48 110 -81 63
5331F3r9O1J30k49JL2J84m6J0pk97K44J79k23n9O6n2L6R6m7Q2kp4q8j03J35J48
$$ 63 -36 25 155 -94 -93 -61 123 77 87 80 -217 27 206 -17 -76 -10 -62 -26 70 23 105 103 29 -59 -162 -27 121
5358A21l11L95k69n4j44J44n5m2K26K20j56j90J3q8K67j05J53k49K24k15M1M7
$$ 121 -190 205 -64 -118 -262 -118 -173 -215 11 231 75 -115 -102 -190 77 -28 125 -124 100 -115 -74 -27
5380b7J8J23q0J00k37J01J97L8k18j83j4M07l79L67k94q7J82k4Q0K47k02k97L43
$$ -27 -9 114 34 134 -103 -2 195 233 15 -168 -182 225 -154 213 -81 -168 14 -10 70 317 115 -182 161
5403A61j91J7J58l23L71M3k35j01O7J33j86K99j3k29K67j19l54K09n2K65k37K12
$$ 161 -30 -13 145 -178 193 236 1 -100 -33 100 -86 213 200 -29 238 119 -235 -26 -78 187 -50 162
5425A62l70K94k67K15q7n3K24l35L43k02k51M42J15k30K8Q4k22j09J5J98L9J4
$$ 162 -208 86 -181 34 -53 -106 118 -217 126 -76 -327 115 230 0 28 112 -110 -219 -204 -6 33 47
5447D7j82J18N3j75JJ95l33N29o7k73J97l79M03k76J72j53n0L8J42k1L9Q2j60
$$ 47 -135 -17 36 -139 -138 57 -276 253 186 -87 110 -269 134 -142 30 -123 -173 -135 7 -14 25 107 -53
5470e3J22k9J85j74j92J69m09O32k01M1k71K47J62k51J00j84k08J79J89J31l47
$$ -53 69 40 225 51 -141 28 -381 251 50 91 -180 67 229 -22 78 -106 -314 -135 54 185 -162
5491a62K28k25K94j56J21l34Q6K27o4j98K70k4q7J94j87O2p1q9K38k29K6Q1L6
$$ -162 66 -159 135 -21 100 -234 -148 79 15 -183 87 63 -24 170 -17 45 -26 -115 123 -106 -80 1 37
5514C7K43m24J55K77j1k47j71J99J5R5j70j27J83k08N2J26q9l9Ql9P7K54p9q6
$$ 37 280 -144 11 288 277 30 -141 58 73 168 -2 -129 54 -154 -102 24 -65 -104 -96 -135 -58 196 117 31
5538C1j18K01l5k7M2l45K52L7m43K76O0q0M9J09J25j92J47r6k3J47m5j51J13K
$$ 31 -87 114 79 52 94 -251 1 38 -405 -129 -69 -149 -100 9 134 -58 89 -7 -30 117 72 -79 34 36
5562C6j94P1K98j67j90J78j70J10l0J11kJ29J49k27j73J00Qj33K06M6r5n1J43
$$ 36 -158 -87 211 44 -146 32 -138 -28 -58 53 51 180 329 102 -71 29 37 -96 110 156 61 10 153
5585A53o3R5l82R6K0K3O8J81Q5k68j26K91k42K21j30k2O6J55n14M37m5j29J61
$$ 153 90 185 -197 -101 -81 -58 10 191 276 8 -118 173 -69 152 22 0 66 221 -293 144 99 -30 131
5608A31P3k14J05J74j37l34j5M5O1k1j28J89J52J73J1J22l01J14q4Q0Rk0j81j13
$$ 131 204 -10 95 269 132 -202 -217 -172 -111 -132 -260 -71 81 254 265 387 86 200 116 196 205 185 4 -109
5632a09J28N0K29m72M20k93o6L03j50j03Q0l37L98J34k38m5lL04k48k28J2J94
$$ -109 19 69 298 -174 246 -47 -113 190 40 -63 17 -320 78 212 -26 -71 -74 230 -18 -246 -234 -40
5654d0K01k05j30M32l45K08k06j2J10j56N2m2P6n5J65kk0Jl32K55j73J76Q4j79
$$ -40 161 -44 -174 258 -87 121 -85 -97 13 -143 -91 -133 -57 -112 53 51 31 32 -300 -45 -218 -42 42 -137
5678a37L17k39M37n13K58j82p3R6L1J54N0m23k5M89j31o9j90M0J76j01R7k36N8
$$ -137 180 -59 378 -135 123 -59 -132 -36 -5 149 199 -224 -249 240 109 40 -150 -110 66 -35 62 -174 -116
5701a16K32K4j61l16K07J9J9n4J91j47p9L07k57J55k98K81M1l45M42l71L19J27
$$ -116 116 140 -21 -337 -130 -111 -92 -146 45 -102 -181 126 -131 24 -274 7 48 -297 145 -226 93 220
5723B20k67j04J43p6QK22O2m81q8L45l88N24k12k39J73M8L44m1o1q0j48P3L8O9
$$ 220 -47 -151 -8 -84 -76 146 208 -273 -361 -16 -404 120 -92 -331 -158 -110 234 193 132 52 -96 -23 15 84
5747H4k36J12j4L05n6M1k11o8J79oj72L21m46J68k4j26J73l35N63k29l0R0k60
$$ 84 -152 -40 -54 251 195 236 25 -43 136 130 -42 279 -167 1 -23 -149 24 -311 252 23 -7 83 -177
5770a77L25o3qL6k26J72j31j94M75N0j8r7j67J62k55jq4J28j4J51j01J37k57K77
$$ -177 148 85 77 113 -113 59 -72 -266 209 259 241 144 -23 139 -116 -117 -201 -73 -87 64 -37 100 -157 120
5794A20O1m57N5J03J43n1K21l09L61k74J65k88J73K26l56J06M3K41j01k48J96
$$ 120 181 -276 -221 -118 25 -26 195 -114 247 -27 138 -150 23 249 -107 -1 42 283 182 -66 130
5815A30j38Qk2j5Q5j95L27r5k71J23j01P1K39r0l5K20j3l47J1L68k03l52J43M74
$$ 130 -8 0 -22 -37 48 -147 180 85 -186 -63 -164 -93 146 56 21 241 228 -119 -108 260 57 -295 -152 322
5839C22l96j87K54k46L66Nl18K08M0p7J99k68o1j6K34j96L31j80j41K83L17n74
$$ 322 -74 -261 -7 -253 113 118 -200 8 48 -29 170 -98 -159 -175 59 -137 194 14 -127 156 473 -101
5861a01p8L00m15K30j58J69j5j1r6k6L22o5K9j61R9q3q0N11m26P0m4J55j28M1
$$ -101 -179 121 -294 -64 -222 -53 -68 -79 -175 -201 121 56 85 -76 23 -60 -140 371 -55 15 -29 126 -2 39
5885C9j12K90j01m70K29j22M25j07l43K12J65j0K08j69k27K03l3P6J37l33K17
$$ 39 -73 217 116 -354 -125 -247 178 71 -272 -60 105 95 303 134 -93 110 77 153 290 -43 174
$$ [...]
8191A52
##END NTUPLES=NMR FID
##END=
