##TITLE=1H_Pr NCO-EA
 200.13MHz, CDCl3,
 8 sc
 
 20.10.2025
##JCAMPDX= 6.0         $$ Bruker NMR JCAMP-DX V2.0
##DATA TYPE= NMR FID
##DATA CLASS= NTUPLES
##ORIGIN= UXNMR, Bruker Analytische Messtechnik GmbH
##OWNER= pz
$$ XWIN-NMR		Version 3.5
$$ Mon Oct 20 16:25:33 2025 Russian Standard Time (UT+4h)  she@DPX200
##.OBSERVE FREQUENCY= 200.1313
##.OBSERVE NUCLEUS= ^1H
##.DELAY= (6, 6)
##.ACQUISITION MODE= SIMULTANEOUS
##.ACQUISITION SCHEME= undefined
##.AVERAGES= 8
##.DIGITISER RES= 18
##SPECTROMETER/DATA SYSTEM= spect
##.PULSE SEQUENCE= zg30
##.SOLVENT NAME= CDCl3
##.SHIFT REFERENCE= (INTERNAL, CDCl3, 0, 14.3821)
##AUDIT TRAIL= $$ (NUMBER, WHEN, WHO, WHERE, WHAT)
$$ ##TITLE= Audit trail, XWIN-NMR		Version 3.5
$$ ##JCAMPDX= 5.01
$$ ##ORIGIN= Bruker BioSpin GmbH
$$ ##OWNER= she
$$ F:/spectra/data/she/nmr/H-C/1/audita.txt
$$ ##AUDIT TRAIL=  $$ (NUMBER, WHEN, WHO, WHERE, WHAT)
(   1,<2025-10-20 16:24:27.20 +0400>,<she>,<DPX200>,
      <created by zg, POWCHK disabled, PULCHK disabled
       configuration hash MD5:
       00 E9 B6 7A A2 85 ED C7 34 08 36 98 17 FE 4E 26
       data hash MD5: 16K
       DA 5C A5 5A E2 36 99 34 3C C7 9C B3 B2 B3 F9 C1>)
$$ ##END=
$$ 
$$ hash MD5
$$ F9 6C C0 17 6F 72 95 02 76 CB 40 59 1F 11 7C 98
##$RELAX= 
##$RELAX= 
##$RELAX= 
##$RELAX= 
##$RELAX= 
##$RELAX= 
$$ Bruker specific parameters
$$ --------------------------
##$DU= <F:/spectra>
##$EXPNO= 1
##$NAME= <H-C>
##$PROCNO= 1
##$TYPE= <nmr>
##$USER= <she>
##$AMP= (0..31)
100 100 100 100 100 100 100 100 100 100 100 100 100 100 100 100 100 100 
100 100 100 100 100 100 100 100 100 100 100 100 100 100 
##$AQSEQ= 0
##$AQ_mod= 1
##$AUNM= <au_zg>
##$AUTOPOS= <>
##$BF1= 200.13
##$BF2= 200.13
##$BF3= 200.13
##$BF4= 200.13
##$BF5= 200.13
##$BF6= 200.13
##$BF7= 200.13
##$BF8= 200.13
##$BYTORDA= 1
##$CFDGTYP= 0
##$CFRGTYP= 5
##$CHEMSTR= <none>
##$CNST= (0..31)
1 1 145 1 1 1 1 1 1 1 1 1 1 1 1 1 1 1 1 1 1 1 1 1 1 1 1 1 1 1 1 1 
##$CPDPRG= <>
##$CPDPRG1= <>
##$CPDPRG2= <>
##$CPDPRG3= <>
##$CPDPRG4= <mlev>
##$CPDPRG5= <mlev>
##$CPDPRG6= <mlev>
##$CPDPRG7= <mlev>
##$CPDPRG8= <mlev>
##$CPDPRGB= <>
##$CPDPRGT= <>
##$D= (0..31)
0 0.7 0 0 0 0 0 0 0 0 0 0.03 0 0 0 0 0 0 0 0 0 0 0 0 0 0 0 0 0 0 0 0 
##$DATE= 1760963066
##$DBL= (0..7)
120 120 120 120 120 120 120 120 
##$DBP= (0..7)
150 150 150 150 150 150 150 150 
##$DBP07= 0
##$DBPNAM0= <>
##$DBPNAM1= <>
##$DBPNAM2= <>
##$DBPNAM3= <>
##$DBPNAM4= <>
##$DBPNAM5= <>
##$DBPNAM6= <>
##$DBPNAM7= <>
##$DBPOAL= (0..7)
0.5 0.5 0.5 0.5 0.5 0.5 0.5 0.5 
##$DBPOFFS= (0..7)
0 0 0 0 0 0 0 0 
##$DE= 6
##$DECBNUC= <off>
##$DECIM= 32
##$DECNUC= <off>
##$DECSTAT= 4
##$DIGMOD= 1
##$DIGTYP= 9
##$DL= (0..7)
0 120 120 120 120 120 120 120 
##$DP= (0..7)
150 150 150 150 150 150 150 150 
##$DP07= 0
##$DPNAME0= <>
##$DPNAME1= <>
##$DPNAME2= <>
##$DPNAME3= <>
##$DPNAME4= <>
##$DPNAME5= <>
##$DPNAME6= <>
##$DPNAME7= <>
##$DPOAL= (0..7)
0.5 0.5 0.5 0.5 0.5 0.5 0.5 0.5 
##$DPOFFS= (0..7)
0 0 0 0 0 0 0 0 
##$DQDMODE= 0
##$DR= 18
##$DS= 0
##$DSLIST= <SSSSSSSSSSSSSSS>
$$ [...]
##$SUBNAM0= <"">
##$SUBNAM1= <"">
##$SUBNAM2= <"">
##$SUBNAM3= <"">
##$SUBNAM4= <"">
##$SUBNAM5= <"">
##$SUBNAM6= <"">
##$SUBNAM7= <"">
##$SUBNAM8= <"">
##$SUBNAM9= <"">
##$SW= 18.0517328524113
##$SWIBOX= (0..15)
0 0 2 0 0 0 0 0 0 0 0 0 0 0 0 0 
##$SW_h= 3612.71676300578
##$TD= 16384
##$TD0= 1
##$TE= 0
##$TE2= 300
##$TE3= 300
##$TEG= 300
##$TL= (0..7)
0 120 120 120 120 120 120 120 
##$TP= (0..7)
150 150 150 150 150 150 150 150 
##$TP07= 0
##$TPNAME0= <>
##$TPNAME1= <>
##$TPNAME2= <>
##$TPNAME3= <>
##$TPNAME4= <>
##$TPNAME5= <>
##$TPNAME6= <>
##$TPNAME7= <>
##$TPOAL= (0..7)
0.5 0.5 0.5 0.5 0.5 0.5 0.5 0.5 
##$TPOFFS= (0..7)
0 0 0 0 0 0 0 0 
##$TUNHIN= 0
##$TUNHOUT= 0
##$TUNXOUT= 0
##$USERA1= <user>
##$USERA2= <user>
##$USERA3= <user>
##$USERA4= <user>
##$USERA5= <user>
##$V9= 5
##$VALIST= <valist>
##$VCLIST= <CCCCCCCCCCCCCCC>
##$VD= 0
##$VDLIST= <DDDDDDDDDDDDDDD>
##$VPLIST= <PPPPPPPPPPPPPPP>
##$VTLIST= <TTTTTTTTTTTTTTT>
##$WBST= 1024
##$WBSW= 4
##$XGAIN= (0..3)
0 0 0 0 
##$XL= 0
##$YL= 0
##$YMAX_a= 232613
##$YMIN_a= -285317
##$ZGOPTNS= <>
##$ZL1= 120
##$ZL2= 120
##$ZL3= 120
##$ZL4= 120
##$ABSF1= 10
##$ABSF2= 0
##$ABSG= 5
##$ABSL= 3
##$ALPHA= 0
##$AQORDER= 0
##$ASSFAC= 0
##$ASSFACI= 0
##$ASSFACX= 0
##$ASSWID= 0
##$AUNMP= <proc_1d>
##$AZFE= 0.1
##$AZFW= 0.1
##$BCFW= 1
##$BC_mod= 2
##$BYTORDP= 1
##$COROFFS= 0
##$CY= -3
##$DATMOD= 1
##$DC= 2
##$DFILT= <>
##$DTYPP= 0
##$F1P= 0
##$F2P= 0
##$FCOR= 0.5
##$FTSIZE= 0
##$FT_mod= 4
##$GAMMA= 1
##$GB= 0.15
##$INTBC= 1
##$INTSCL= 1
##$ISEN= 128
##$LB= 0.25
##$LEV0= 0
##$LPBIN= 0
##$MAXI= 10000
##$MC2= 0
##$MEAN= 0
##$ME_mod= 0
##$MI= 1.114404
##$NCOEF= 0
##$NC_proc= 0
##$NLEV= 6
##$NOISF1= 3.799351
##$NOISF2= 2.8
##$NSP= 1
##$NTH_PI= 0
##$NZP= 0
##$OFFSET= 14.38212
##$PC= 1
##$PHC0= -2284.534
##$PHC1= 23.19225
##$PH_mod= 1
##$PKNL= yes
##$PPARMOD= 0
##$PSCAL= 0
##$PSIGN= 0
##$REVERSE= no
##$SF= 200.129724274929
##$SI= 16384
##$SIGF1= 3
##$SIGF2= 2
##$SINO= 400
##$SIOLD= 16384
##$SREGLST= <1H.CDCl3>
##$SSB= 0
##$STSI= 0
##$STSR= 0
##$SW_p= 3205.1282051282
##$SYMM= 0
##$S_DEV= 0
##$TDeff= 0
##$TDoff= 0
##$TI= <>
##$TILT= no
##$TM1= 0
##$TM2= 0
##$TOPLEV= 0
##$USERP1= <user>
##$USERP2= <user>
##$USERP3= <user>
##$USERP4= <user>
##$USERP5= <user>
##$WDW= 1
##$XDIM= 8192
##$YMAX_p= 0
##$YMIN_p= 0
$$ End of Bruker specific parameters
$$ ---------------------------------
##NTUPLES= NMR FID
##VAR_NAME=  TIME,          FID/REAL,        FID/IMAG
##SYMBOL=    X,             R,               I
##VAR_TYPE=  INDEPENDENT,   DEPENDENT,       DEPENDENT
##VAR_FORM=  AFFN,          ASDF,            ASDF
##VAR_DIM=   8192,          8192,            8192
##UNITS=     SECONDS,       ARBITRARY UNITS, ARBITRARY UNITS
##FACTOR=    0.0002768,     1,               1
##FIRST=     0,             0,               0
##LAST=      2.2672688,     0,               0
##MIN=       0,             -285317,         0
##MAX=       2.2672688,     232613,          0
$$ Real data points
##PAGE= N=1
##DATA TABLE= (X++(R..R)), XYDATA
0@%%%%%%%%%%%%%%Mj1J5j6J6j6K3l1L2l9M7n5O3p1Q3r5J08j23J41j58J76k00K25
$$ 0 0 0 0 0 0 0 0 0 0 0 0 0 0 0 4 -7 8 -8 8 -8 15 -16 16 -23 24 -31 32 -39 44 -51 57 -66 75 -83 93 -107 118
37A18k50K79l11L46l84M26m72N22n78O38p03P74q51R38j036J141j257J392j543
$$ 118 -132 147 -164 182 -202 224 -248 274 -304 334 -369 405 -446 492 -544 597 -660 732 -811
56h11J715j915K148k422K755l169L695m390N355o788R127j3577K4882j06648j95274
$$ -811 904 -1011 1137 -1285 1470 -1699 1996 -2394 2961 -3827 5300 -8277 16605 -90043 -285317
71b85317K86614J69339j92233j27474J20887O5130l4167O432O390o6105n485Q3222
$$ -285317 1297 170636 -21597 -149071 -28184 36946 2779 9211 15601 -50504 -55989 27233
83B7233L9783m8683n1376l041N4251M5974l6043o5480J6873N7185m570m1272N023
$$ 27233 67016 18333 -33043 -36084 18167 64141 28098 -37382 -20509 36676 32106 -9166 -4143
96d143J6602j1409R446J9754m3605l5845N6368M8368n6803n3296L8969L3341l8682
$$ -4143 12459 1050 10496 30250 -13355 -49200 7168 55536 -1267 -54563 -15594 17747 -20935
109b0935j3635L6040p660k6975L3223K5230m2771k0318N3147K9461m9226k5465
$$ -20935 -34570 1470 -6190 -33165 58 25288 -17483 -37801 15346 44807 -4419 -29884
121b9884O3486L3922p0397m2643N8909L4937n2013k2173M6946O977m2880N321
$$ -29884 33602 67524 -2873 -45516 13393 48330 -3683 -25856 21090 28067 -14813 -9492
133i492K5777k5886k0657L0114J2791k4277m652J6119l714j2444J0799J1390r547
$$ -9492 16285 -9601 -30258 -144 12647 -11630 -16282 -163 -3877 -16321 -5522 5868 -3679
146c679p838M700J0918J4910j0852l5821J1274M8523j2920n2313K0604O1392k0644
$$ -3679 -11517 -6817 4101 19011 8159 -27662 -16388 32135 19215 -33098 -12494 48898 28254
159B8254n4997K9906M0716n2827l3542O5781K7534o4177j8534N1301J687m2723
$$ 28254 -26743 3163 43879 -8948 -42490 23291 50825 -13352 -31886 19415 21102 -21621
171b1621N708K0019k2713O03L9417j5390n3635J1110N0712L171k8369q397J0643
$$ -21621 -15913 4106 -18607 -18004 21413 6023 -47612 -36502 14210 17381 -10988 -19385 -8742
184h742J7658J9059j2313l1145J1559M0644j0373l9946O678K2787j2093q796J8234
$$ -8742 8916 27975 15662 -15483 -3924 36720 26347 -13599 -6921 15866 3773 -5023 13211
197A3211k492k7329M151K4546r327k2026R902J1448p988L073N504j4349m771K5234
$$ 13211 10719 -16610 -12459 12087 2760 -19266 -9364 2084 -5904 -2831 2673 -11676 -16447 8787
211H787R394k8124j1184K7978P217k5905j579K3119p65j5516Q065J1770j3665
$$ 8787 18181 -9943 -21127 6851 14068 -11837 -13416 9703 8938 -6578 1487 13257 -408
224d08r379J9120Q246j9740l102J9169j609j7022Q24Q754j975n125L14l250k082
$$ -408 -9787 9333 17579 -2161 -5263 13906 12297 -4725 -3901 4853 2878 -2247 -1933 -5183 -7265
239g265P531m49j1894O212J3004j5035j3229J9414J1935j8997l236K6070J247
$$ -7265 266 -183 -12077 -5865 7139 -7896 -21125 -1711 10224 -8773 -12009 14061 15308
252A5308k5683M313K2133j1999j2357K1479O953k5060k250K1795p614k2334J2545
$$ 15308 -10375 -6062 16071 4072 -8285 13194 20147 -4913 -7163 14632 7018 -15316 -2771
265b771J9482j4590j3280J2089J384j2332N717Q640r631j925J0921m495j1892
$$ -2771 16711 2121 -11159 930 2314 -10018 -4301 4339 -5292 -7217 3704 -791 -12683
278a2683J1623J2757j6679p238K1245J228k5032K921K3433l357j5881P102J1140
$$ -12683 -1060 11697 -4982 -12220 9025 10253 -14779 -11858 11575 8218 -7663 -561 10579
291A0579q664m723R888k811p255R583L830j5520q31J5223m003j3233Q099J0223
$$ 10579 1915 -2808 7080 4269 -2986 6597 10427 -5093 -5924 9299 5296 -7937 162 10385
305A0385j5467j0869J6502N589j8155J612J7945m554j6341O936J2605p400p838
$$ 10385 -5082 -15951 551 6140 -12015 -10403 7542 2988 -13353 -6417 6188 -1212 -9050
318i050J2299O902j1308j384R816k602o488N098L642n014j445L375l915l594P079
$$ -9050 3249 10151 -1157 -2541 7275 4673 -1815 3283 6925 1911 466 3841 -74 -3668 3411
333C411K056j0672R20J0135p503j0431J1680Q882j2230m682J4695J51j9177K805
$$ 3411 5467 -5205 -4285 5850 -1653 -12084 -404 8478 -3752 -8434 6261 6412 -12765 -9960
347i960J9993n881j4846J1000J1196j3496q788J1703M642r192K216P692n931l366
$$ -9960 10033 4152 -10694 306 11502 -1994 -10782 921 5563 -3629 -1413 6279 348 -3018
361c018R046k163q330R084O010j3411l956J4089p94j6432N350J7971r699j7820
$$ -3018 6028 3865 -4465 4619 10629 -2782 -6738 7351 6557 -9875 -4525 13446 3747 -14073
375a4073J0177J0494j2103m173J2051j00r483M651P201p186l902J0409J643q213
$$ -14073 -3896 6598 -5505 -9678 2373 2273 -7210 -2559 4642 -2544 -6446 3963 5606 -2607
389b607L785M793q467j80J1571j892j1807L654R302r145q543J2639N268j3950
$$ -2607 1178 5971 -2496 -2676 8895 7003 -4804 -1150 8152 -993 -9536 3103 8371 -5579
403e579J81J3721n090j3926N820J1863o047o862Q827L304j1086j421R479o05o859
$$ -5579 -5398 8323 3233 -10693 -4873 6990 943 -5919 2908 6212 -4874 -6295 3184 2579 -4280
418d280K197L862j687r10J530l221n47P953J766j1261j019J1841k295r110O480
$$ -4280 -2083 1779 92 -818 712 -2509 -3056 4897 6663 -4598 -5617 6224 3929 -5181 1299
433A299Q652r798p333J1722L783j6631j500J7488N73j4291Q46Q263l840m002M890
$$ 1299 9951 153 -7180 4542 8325 -8306 -9806 7682 8255 -6036 -5190 3073 -767 -4769 121
448A21O16n063L169M906n635j935Q534j601p538N788O750j0218o144J1600M552
$$ 121 737 -4326 -1157 3749 -1886 -3821 4713 3112 -4426 1362 8112 -2106 -8250 3350 7902
463G902j1715M3J1651o488j2681R505J1090j0572o805J1145M392r592j010O385
$$ 7902 -3813 -3770 7881 1393 -11288 -1783 9307 -1265 -8070 3075 7467 -2125 -3135 3250
477C250l635k772Q531Pj0118L86P088k904j360M956m873p911P623R982j0982r950
$$ 3250 -385 -3157 5374 5381 -4737 -4351 2737 -167 -1527 3429 -1444 -9355 -1732 8250 -2732 -12682
493a2682J4528J0873j2562p027R562J386p928L002P907m458o789N085L781n682
$$ -12682 1846 12719 157 -6870 2692 4078 -3850 -848 7059 2601 -4188 897 4678 -1004
507a004j316K976k298k49M820k915o430L468O894l039m878M957L293p568j002
$$ -1004 -2320 656 -1642 -1891 2929 14 -6416 -2948 3946 907 -3971 986 4279 -3289 -4291
522d291Q619j27p050J099O070j874m830K490J366m413J096P335l279r594L103
$$ -4291 4328 4201 -2849 -1750 4320 2446 -2384 106 1472 -2941 -1845 5490 2211 -7383 -4280
537d280Q656k316o628K802M309k249m06M245m445m572P770M578p336l748M167
$$ -4280 4376 2060 -4568 -1766 2543 294 -112 4133 -312 -4884 2886 7464 128 -3620 547
552E47n69j707N683r39j0534K069J2637n131j3925Q028J3573p828p974Q928K707
$$ 547 -22 -1729 3954 3015 -7519 -5450 7187 2056 -11869 -3841 9732 1904 -6070 2858 5565
567E565j0965J61J1087j208p803K781L297m682J246L479m334j791O101j194p840
$$ 5565 -5400 -5239 5848 4640 -3163 -382 2915 -1767 -521 2958 -1376 -3167 2934 1740 -6100
582f100L893Q850o206p667J0398P738j2671p596J0024N259o845j694L845j628
$$ -6100 -2207 6643 437 -7230 3168 10906 -1765 -9361 663 5922 -923 -2617 1228 -400
596d00j630L857k9o651J959O684k079m437J968J003k161K841M056m661n412N852
$$ -400 -2030 1827 1798 -4853 -2894 3790 1711 -2726 -758 245 -1916 925 4981 320 -5092 760
612G60N256o939l726P371J583n721M75M442m156n256O066O190o834n009O171K947
$$ 760 6016 -923 -4649 2722 4305 -1416 -941 3501 -655 -5911 155 6345 -489 -5498 673 3620
628C620m843q55K829q18m17K115r30k756J505L223l161j205M621j448n992K021
$$ 3620 -1223 -2078 751 -67 -484 1631 701 -2055 -550 2673 -488 -1693 2928 1480 -4512 -2491
644b491O234k856n428M920M424o277k928O510R81o999L153P425m589o091L964
$$ -2491 3743 887 -4541 379 4803 -1474 -4402 2108 3089 -3910 -757 6668 2079 -4012 -48
659d8L304l947j329M087j442l824L356J708n506K86O637k075m955K833L875n223
$$ -48 3256 -691 -2020 2067 625 -3199 157 1865 -3641 -3355 3282 1207 -3748 -915 2960 -2263
675b263j600P189J454p454J435N821l881m600N444K193m877m34M633k819m806
$$ -2263 -3863 3326 4780 -2674 -1239 4582 701 -3899 1545 3738 -1139 -1573 3060 241 -4565
690d565M914L156n344o60N378k179m220L159K631l390M66L925l187n025M988M861
$$ -4565 349 3505 -1839 -2499 2879 700 -3520 -361 2270 -1120 -654 3271 84 -4941 47 4908
706D908o437l365Q261J816q654j033O631o99n268K675N506l146l838L079J530
$$ 4908 -1529 -4894 3367 5183 -3471 -4504 2127 1428 -3840 -1165 4341 1195 -2643 436 1966
721A966k426L61J577j387O8J752j451k499K682L237m696k745M579M83n079O41
$$ 1966 -460 -99 1478 91 159 1911 460 -2039 643 3880 -816 -3561 1018 1501 -3578 -2937
737b937N542j729m284K939L676m404l035N340K586m756j04M260k398k708K648
$$ -2937 2605 876 -3408 -469 3207 -1197 -4232 1108 3694 -1062 -1166 3094 696 -2012 636
752F36J527l208j5L349j784l224K638K015l689K99M478k295m279L110L796m031
$$ 636 2163 -1045 -1060 2289 505 -2719 -81 1934 -1755 -1456 3022 727 -3552 -442 3354 -677
768f77k005N137J044n885k30N355k512l934M010K986m612j608L988L33l738J027
$$ -677 -2682 2455 3499 -2386 -2616 2739 227 -3707 303 3289 -1323 -2931 1057 1390 -2348 -1321
784a321L244k057n07K422j845j758L855J955m854r03M874j115n710K041O539m022
$$ -1321 1923 -134 -641 1781 -64 -1822 2033 3988 -866 -1769 3105 1990 -3720 -1679 4860 838
800H38n235M915K698n659k304N687J363m289N89L257j568k126K613M27k229J686
$$ 838 -4397 518 3216 -2443 -4747 940 2303 -1986 -1397 1860 292 -1834 779 1206 -1023 663
816F63J529k594j220K980j41l092J571L287l031l109L618J713m329M46M748q08
$$ 663 2192 -402 -1622 1358 1217 -1875 -304 2983 -48 -3157 461 2174 -2155 -1709 3039 2231
832B231n010K160L200k853k539M398J887m463j244L432k68l374J255J876j396
$$ 2231 -2779 -619 2581 -272 -2811 1587 3474 -989 -2233 1199 931 -2443 -1188 688 -708
847g08p62J945o38j818K414J316k740K87L086j749l544L469L725m187k753M605
$$ -708 -1470 475 -163 -1981 433 1749 -991 -704 2382 633 -2911 558 4283 96 -2657 1948
863A948J750n951j121N230k26m353K027K955k673k253K623J127k244J094J342
$$ 1948 3698 -2253 -3374 1856 1630 -2723 -696 2259 -414 -2667 -44 1083 -1161 -67 1275
878A275k074l65L094j180k723K875K326l975j992L564J009m452J056N111k395
$$ 1275 -799 -1164 1930 750 -1973 902 3228 -747 -2739 825 1834 -2618 -1562 3549 1154
893A154m397K730K872l428j014L763M30l331O49K670k273j778K798Q69k059l09
$$ 1154 -3243 -513 2359 -1069 -2083 1680 2110 -1221 -572 2098 -175 -1953 845 1714 -345 -654
909f54J101r11q44K011j83k524J206K518k462k519L715K177l961l13M328q52m667
$$ -654 447 -464 -1308 703 520 -2004 -798 1720 -742 -3261 454 2631 -1330 -1643 2685 1833 -2834
926b834J320M981k001l573K633K387l212j430K347l01j634J090R12j244l11J571
$$ -2834 -1514 3467 1466 -2107 526 2913 -299 -1729 618 317 -1317 -227 685 -559 -870 701
942G01r02j274K711J152l853o25M032o80l765J892L518k507l145K883J939m375
$$ 701 -201 -1475 1236 2388 -1465 -2090 1942 1262 -2503 -611 2907 400 -2745 138 2077 -2298
958b298m71M795p3l909J029K501j644j286K480L8k091R12K216k185j287K513J20
$$ -2298 -2769 2026 1953 -1956 -927 1574 -70 -1356 1124 1162 -929 -17 2199 14 -1273 1240 1360
975A360k368J094J225k618j743L823J078l638N2L936j592l862K428L297k869j494
$$ 1360 -1008 86 1311 -1307 -3050 773 1851 -1787 -1735 2201 609 -3253 -825 2472 -397 -1891
991a891L558P00l340l91K498n82j658J664K44j926J228P90j747k23K579n57l038
$$ -1891 1667 2367 -973 -1364 1134 552 -1106 558 802 -1124 104 894 -853 -1076 1503 946 -2092
1008b092R98L121j707l253K650L745k606k810K467J135k694m60K687l39j981O50
$$ -2092 -1094 2027 320 -2933 -283 3462 856 -1954 513 1648 -1046 -1506 1181 842 -1139 -489
1024d89J329j516q89J528L29r81P80O71j621j63K520L42l128J226K464k043j906
$$ -489 840 -676 -1565 -37 292 -689 91 762 -859 -1022 1498 1840 -1288 -62 2402 359 -1547
1041a547K537Q56k822N7K804j405l395K327K508l018q94L726m29l787J636K546
$$ -1547 990 1846 -976 -919 1885 480 -2915 -588 1920 -1098 -1992 1734 1305 -2482 -846 1700
1057A700j951j372K721M94k364O57J669j996r09K662J83l072Q57K015k012j221
$$ 1700 -251 -1623 1098 1592 -772 -115 1554 -442 -1351 1311 1494 -1578 -721 1294 -718 -1939
1073a939K801J439l528n59L745n18l913J645K717j015j623J483N75k016j62K066
$$ -1939 862 2301 -1227 -1786 1959 1441 -2472 -827 1890 875 -748 735 1310 -706 -868 1198
1089A198j254j011J362J0j799J024J560j320j081K024J083l399J38L640l39l194
$$ 1198 -56 -1067 295 305 -1494 -470 1090 -230 -1311 713 1796 -1603 -1465 2175 1836 -1358
1105a358J415K745k519j884K301O13k095j96K454p83k176J016J358j513k31K085
$$ -1358 57 2802 283 -1601 700 1313 -782 -978 1476 693 -1483 -467 891 -622 -853 1232
1121A232q16j276R94O07j152J86J437n70j842J326J338k131j165K746Q48k884
$$ 1232 416 -860 134 741 -411 -225 1212 642 -1200 126 1464 -667 -1832 914 1762 -1122
1137a122j52K554j011k395J487K502j572j370J804P86j874q0J384p82l69Q27k40
$$ -1122 -1274 1280 269 -2126 -639 1863 291 -1079 725 1511 -363 -443 941 159 -210 617 377
1154C77j090N61R18q02j531K307L07k881R2K899l45k685J776K567k424k189K688
$$ 377 -713 -152 766 -36 -1567 740 1047 -1834 -1742 1157 812 -1873 -97 2470 46 -2143 545
1171E45R72k319K31K151q63j751J264Q71j578l38J681p00j640K025J96j731J79
$$ 545 1517 -802 -571 1580 717 -1034 230 1101 -477 -815 866 166 -1474 551 747 -984 -805
1188h05K126r86j679J910J122k558l84K843K2k792O20K211j955j573J513J837
$$ -805 1321 335 -1344 566 1688 -870 -1254 1589 1611 -1181 -561 1650 -305 -1878 -365 1472
1204A472j882n64J612J43j964M41J581p50l38J160m09j038J045N70j592J33J835
$$ 1472 -410 -974 638 781 -1183 -742 839 89 -249 911 502 -536 509 1079 -513 -380 1455
1221A455p09k526R88K584k132j283K232Q44k319j000K624J19k284Q17K081r62
$$ 1455 746 -1780 -792 1792 -340 -1623 609 1453 -866 -1866 758 877 -1407 -590 1491 529
1237E29j173J055L49j208L35J061j112n30J341k16j377N66J610j189j497J671
$$ 529 -644 411 760 -448 -113 948 -164 -694 647 431 -946 -380 1230 41 -1456 215
1253B15Q93k314Q4K448k97k159Q80J919j710j644J967J097j827m49J834m79j674
$$ 215 1108 -1206 -1122 1326 1029 -1130 -250 1669 -41 -1685 282 1379 -448 -897 937 458 -1216
1270a216O31R81q13l32R06l08o61J055K43j160L83J668p75j885J612J107k031
$$ -1216 -585 396 -417 -749 157 -151 -812 243 486 -674 -291 1377 602 -1283 329 1436 -595
1287e95p42L074Q7k962l01K557p03k318J512J701j200j051J032K70j080J43J223
$$ -595 -1337 1737 1824 -1138 -1439 1118 415 -1903 -391 1310 110 -941 91 361 -719 -576 647
1304F47o05n37J254p60j057J419Q78j664o66K101l17k040K31K237p31j325R38
$$ 647 42 -495 759 -1 -1058 361 1239 -425 -1091 1010 693 -1347 -1116 1121 390 -935 3
1321CJ418j767q07J947J22j474M36J605j323n74P07K37r44K20P37q30p53R52N28
$$ 3 1421 -346 -1153 794 916 -558 -122 1483 160 -414 293 530 -414 -194 543 -287 -1040 -88 440
1340D40j354M22J642j145j458J677J117j917j36J977J54k435L93K046j187j341
$$ 440 -914 -492 1150 5 -1453 224 1341 -576 -712 1265 1419 -1016 -623 1423 236 -1105
1356a105J316J167j605m31Q83K23j435O31P03o98j13Q74o45n63J084O55j203l73
$$ -1105 211 1378 -227 -658 225 448 -987 -356 347 -351 -464 410 -235 -798 286 941 -262 -635
1374f35J754n45j881J098J478r22j586J537M56j588l78J669mj404Q17J092j230
$$ -635 1119 574 -1307 -209 1269 347 -1239 298 754 -834 -1212 457 453 -951 -134 958 -272
1391b72l60J237%r69M57Q73r08q13J172k83q06M85J146j050j100R92R07j507O2
$$ -272 -632 605 605 -364 93 966 58 -755 417 134 -672 -187 959 -91 -1191 -199 708 -799 -737
1410g37J671k16j924J129J103j169p96J541O84j713R6R83j69j601J493J05p27
$$ -737 934 718 -1206 -77 1026 -143 -939 602 1286 -427 -331 652 483 -1118 375 480 -247
1427b47k52O91j63p64Q34K88j300O83J334n21j813J174J337j507n04J563P2j846
$$ -247 -499 192 29 -735 99 387 -913 -230 1104 583 -1230 -56 1281 -226 -730 833 905 -941
1445i41l33K044m40j273Q54P17q79m35J056k87p15J048K82r99m17J486n48j058
$$ -941 -1274 770 330 -943 -89 628 -251 -686 370 83 -632 416 698 -301 -718 768 220 -838
1463h38J112Q18j050o52R51K71j490L88J685j145j049Q30Q10j520J02J597k83
$$ -838 274 1092 42 -610 341 612 -878 -490 1195 50 -999 -169 641 -879 -777 820 537
1480E37j210O60J194j412m53J216j7q27L71L73r03k92J402Q3j468N38J222j223
$$ 537 -673 -13 1181 -231 -684 532 515 -312 59 432 -471 -763 639 722 -746 -208 1014 -209
1498b09q95J342N16j151m7J699m44j670O37J121q16o37R28M86q98n45P38k73k45
$$ -209 -1104 238 754 -397 -444 1255 811 -859 -222 899 83 -554 374 860 -38 -583 155 -118 -363
1517c63M16L8o05L19N60n10k59R69J76j044k25J075P4j450P29J447o74j594J067
$$ -363 53 91 -514 -195 365 -145 -404 565 741 -303 -528 547 621 -829 -100 1347 673 -921 146
1536A46N23j471j09J568l17q43K27O60p71k26R77j43l55M04M41j036k50J186j
$$ 146 669 -802 -911 657 340 -503 -276 384 -387 -613 364 221 -134 270 711 -325 -575 611 610
1555F10j086M60J020j473m16J413J31j258J92J244p79r68O74J075j025l30J003
$$ 610 -476 -16 1004 -469 -885 528 659 -599 -407 837 58 -910 -236 839 -186 -516 487
1572D87K4p37L01M06l65m93O17J14o74J72N39q13j32J213k53j116L88R94k97j353
$$ 487 511 -226 75 481 116 -377 240 354 -320 -148 391 -422 -554 659 406 -710 -322 672 375 -978
1592i78J114J070j101r15J203L42j307K87J232o01q32O41K42r17L16L86j89l45
$$ -978 136 1206 105 -810 393 735 -572 -285 947 346 -486 155 397 -520 -204 182 -7 -352
1610c52N97M3q93K61J093l17j114J240M98j324n82J337q3r81M56Q99r04o88Q15
$$ -352 245 288 -605 -344 749 432 -682 558 1056 -268 -850 487 404 -577 -121 778 -126 -814 1
1629AM37j087J18J292k94p94K77L24o54K12O37K0o07J91K29l85j13P61j83j357
$$ 1 438 -649 -531 761 467 -327 -50 274 -380 -168 469 489 -118 73 302 -83 -196 565 382 -975
1649i75P60N29n01p52J317K61j198j68J095j70j044N60J081n49p85Q56o3m93K47
$$ -975 -215 314 -187 -939 378 639 -559 -727 368 198 -846 -286 795 246 -539 317 254 -239 8
1668HN75p09Q2K14r5r32P91J19j18p79J003O06j208j31J100k4j203J196M22j046
$$ 8 583 -126 -44 170 75 -857 -66 53 -65 -844 159 765 -443 -574 526 502 -701 495 917 -129
1688a29k33O27J18q35l0J168n58p03N72M84o96L2M17q5l65J11J29l20J89R55n54
$$ -129 -362 265 383 -452 -482 686 128 -575 -3 481 -215 -183 234 149 -216 -105 24 -296 -107 848 294
1709B94n47L00O11j149J49R52j17j038K14P94o37o77O55J036q13n18R38k01n50
$$ 294 -253 47 658 -491 -342 610 493 -545 -331 463 -174 -851 -196 840 27 -491 447 246 -304
1728c04J34O58j49k97M13k79n69M68K89n95K25L19J25j404P33O81p62k66R82L06
$$ -304 -170 488 339 42 455 176 -393 75 364 -231 -6 313 438 -966 -233 448 -314 -580 402 708
1748G08j046k21P50l2o36N36O03o42n88P86K88q74M03J49l79j57L63J32p67M04
$$ 708 -338 -559 191 159 -477 59 662 20 -568 218 506 -368 35 184 -195 -352 11 143 -624 -220
1768b20Q10o03p22J154j25m51o4R84k16j023O08P80j161k67N70M42p58M2M61j32
$$ -220 590 -13 -735 419 294 -157 -221 763 547 -476 132 912 -249 -516 54 496 -262 -220 241 109
1788A09o69L57M63k97j62N16j48n51O50p5k98l16J132n70p74Q03K12n92n63R41
$$ 109 -560 -203 260 -37 -199 317 169 -382 268 193 -105 -421 711 141 -633 170 382 -210 -773 168
1808A68J71o38j88O86J6q37P25M07o03l06O46K13q50N03J55m62J51M52j54o76
$$ 168 339 -299 -487 199 215 -622 103 510 -93 -399 247 460 -390 113 268 -194 -43 409 255 -421
1828d21R9P73m10m60P64j24q13K46Q75l49o13P41L32j062J61M45J2m67M35L67
$$ -421 -322 451 41 -419 345 221 -592 -346 529 180 -433 308 640 -422 -261 184 196 -271 164 531
1848E31p76j88K92J01j69j2L13l51R0J13L35o54J19O31j51q11Q90J0q00M8R09
$$ 531 -245 -433 -141 -40 -209 -221 92 -259 -169 -56 279 -375 -256 375 224 -587 303 313 -487 -439 470
1869D70j39p27K20N26o43j11K78L38o01N2K75j39j25M13K89m98l48Q80k21o78
$$ 470 331 -396 -176 350 -293 -404 -126 212 -389 -337 -62 -201 -326 87 376 -122 -470 410 189 -489
1889d89N64K47m96n2O73k47j009O40K36k09j41O75n6r05L78M07O8n74K48K88l00
$$ -489 75 322 -174 -226 447 200 -809 -169 67 -142 -283 392 336 -569 -191 216 284 -290 -42 246 -54
1910e4q6N81k20n09L99K14n32j09Q59l76k81j19N99l37n32M30L60p18L11O00k71
$$ -54 -140 441 221 -288 111 325 -207 -316 543 167 -114 -233 366 29 -503 -73 287 -431 -120 480 209
1931B09m62M97M25p14j07J83N74o94lN12q53K46OK34l40K60J90m74M0M47L0l50
$$ 209 -253 244 669 -45 -152 31 605 -89 -92 420 -433 -187 -181 53 -287 -27 163 -311 -271 176 206 -144
1953a44k7O15m50o77Q70J87n02j10N08K15j170M02M47J00m73L19N9o58K57N56
$$ -144 -171 444 -6 -683 187 374 -128 -238 270 485 -685 -283 164 264 -209 110 169 -489 -232 324
1973C24l37j50M23N1o88J91N59m86PJ54q3l7j40M23J86q62N45J84j86l18K47J85
$$ 324 -13 -163 260 311 -377 -186 373 -113 -106 48 -35 -72 -212 211 397 -465 80 264 78 -240 7 192
1995A92k08l96P46n16J22Q3L92l69k35M22j89j37M8Q0k91j9L43J40p85L34N47
$$ 192 -16 -412 334 -182 -60 23 415 46 -189 233 44 -93 -45 35 -256 -275 68 208 -577 -243 304
2016C04l57l47L89L34l47l2K22J16l75o1J81j3l93M57K40k67k82L74k62k9L49
$$ 304 -53 -400 -11 323 -24 -56 166 282 -93 -154 27 14 -379 78 318 51 -231 143 -119 -148 201
2037B01j11j70p9M02o16K07L55Rj93k05N15k49n22K66N19j48l69K75J29n41J5
$$ 201 90 -80 -159 243 -373 -166 189 198 5 -200 315 66 -456 -190 329 181 -188 87 216 -325 -310
2058c10M37l7r2J54j64j83k06N54o8k96K86o6l22N2L42j13j50L90Q7n47K96j04
$$ -310 127 90 -2 152 -12 -195 -401 153 85 -211 75 9 -313 -261 81 -32 -182 208 295 -252 44 -60
2080f0J59m40J06P22k59o91M44L96o73J42L38j18M7j57L58l06j36M55k72m54N77
$$ -60 99 -341 -235 487 228 -463 -19 377 -296 -154 184 66 113 -44 314 8 -128 327 55 -399 178
2101A78l0l24J04K07R5p24L43M53k42n46N85Ok24j08N33l31j48M5L18k57k31L00
$$ 178 148 -176 -72 135 230 -494 -151 302 60 -486 99 105 -119 -227 306 -25 -173 -128 190 -67 -298 2
2123BN9n39L05K89n3r9K71j6m40R0O7L21n92M68j08k92J17L86j45m98N25K24n49
$$ 2 61 -478 -173 116 63 -36 235 219 -221 -131 -64 257 -335 133 25 -267 -150 236 91 -407 118 342 -207
2146b07n4M16P8m79J06M16n3m51K97Ql06J20M6L07l71R7M6j74j11L89q0j66n8
$$ -207 -261 155 233 -246 -140 276 223 -228 69 77 -229 -109 -63 244 -127 -30 16 -158 -269 120 40 -126 -184
2169a84L70l90k70O60l29j92L13K60j62l68L15M34n50l2M10k37n3OK80l87n6J57
$$ -184 186 -204 -474 186 -143 -335 -22 238 76 -292 23 457 -93 -125 285 48 -5 1 281 -106 -162 -5
2191ej60l6M71l5lm92M46l34MK54mK1k1Q4J70k86j88J54j95O8K19k4k41r8J31
$$ -5 -165 -201 270 235 232 -260 186 -148 -144 110 106 127 106 190 360 74 -114 40 -155 -87 132 108 -133 -231 -100
2216a00K65l32M20L5j97j03J57j22n07M58O2j4k77K53K50o30K72K05J47l92N3
$$ -100 165 -167 253 288 91 -12 145 23 -484 -26 36 22 -255 -2 248 -382 -110 95 242 -150 -97
2237i7M76m03l29M75k05N2j22M23j26k65L31J23n56K04J96l97j01M51J6j77N2
$$ -97 379 -24 -353 122 -83 -31 -153 270 144 -121 210 333 -223 -19 177 -220 -321 130 146 -31 21
2258B1J63qn27L57J05k32k88O24o3k19j76M37r3j29J45k4l86J03J23J12l66K93
$$ 21 184 176 -351 6 111 -121 -409 215 152 -67 -243 194 101 -28 117 93 -293 -190 -67 45 -321 -28
2280b8qP9k25L68m1k86K17j39P3j44L67k66p7K2M18j73l26q6N33m06o9J42K75
$$ -28 -36 43 -182 186 145 -141 76 -63 10 -134 233 -33 -110 -88 330 157 -169 -255 278 -128 -197 -55 220
2303B20m50J15L23m89N1L03J61l18K38o0l31K68K1q2l4p8M97m90r9M00Q2k23K5
$$ 220 -230 -115 208 -281 -230 73 234 -84 154 94 -237 31 52 -30 -64 -142 355 -135 -234 166 248 25 50
2326E0K11k64j78p1J49L3lJ25n5M9O7Rk31Q8L00l05j10J02K34l8n91M84j03O6
$$ 50 261 -3 -181 -252 -103 -70 -73 52 -3 46 113 122 -109 -21 279 -26 -136 -34 200 162 -429 55 -48 18
2350A8k94M73k64j36K06L22k30j22J16O2l53J50J78k53j8Q8M68o95N7J25J10j05
$$ 18 -276 197 -67 -203 3 325 95 -27 89 151 -202 -52 126 -127 -145 -57 411 -284 -227 -102 8 -97
2372i7K05J81o30M69j11l4k09K64j30M5j08L67j19l61J77J99j65j06J33r4L5r7
$$ -97 108 289 -341 128 17 -17 -226 38 -92 -47 -155 212 93 -268 -91 108 -57 -163 -30 -124 -89 -186
2394a86K92j75j56L94K13l55J3R1J9j94k59M13l2q6N93m22k82N6K30k97j84L58
$$ -186 106 -69 -225 169 382 27 40 131 150 -44 -303 110 78 -8 585 163 -119 -63 167 -130 -314 44
2416D4q5K41r8p2L3k94p1M32l20J53j89L20k42J50p0o8K7J65j85L66l33j11J67
$$ 44 -41 200 102 30 63 -231 -302 130 -190 -37 -226 94 -148 2 -68 -136 -109 56 -129 237 -96 -207 -40
2439d0J74m2j60q5k6J31K55k78N3L72m42j0R7Mk77J79K44n66L24r2j14N9L66R7
$$ -40 134 92 -68 -153 -179 -48 207 -71 -18 354 -88 -98 -1 3 -274 -95 149 -417 -93 -185 -299 -240 126 223
2463B23j84q1k62L78l44K24K11k19O2k5M27m86K8K83K1l14o2L47j16k41K36K9
$$ 223 39 -42 -304 74 -270 -46 165 -54 8 -17 410 -76 -48 235 256 -58 -120 227 111 -130 106 135
2485A35Ol79M91k91j4N0L87n4j63n5j99O1R3R3m89K88L82j37k75J97Rj21k5j54
$$ 135 141 -238 253 -38 -52 -2 385 331 168 113 -86 -25 68 161 -328 -40 342 205 -70 127 136 15 -10 -164
2509a64M68l38j07L45k25l30N69k5j09j22K90k76J10r2Mk5qj42L7j88J67r7L63
$$ -164 304 -34 -141 204 -21 -351 218 193 84 -38 252 -24 86 -6 -2 -27 -35 -177 -140 -328 -161 -258 105
2532A05j24L02l74j32K99O9j8l22j26M04q4r6J56K5l26K04l4m4J65p7K82j87m3
$$ 105 -19 283 -91 -223 76 145 127 -195 -321 83 -1 -97 59 84 -242 -38 -72 -116 49 -28 254 67 24
2555B4j13pM8k11L3J63m9K46j69j75M30j82j8LO0K37k33k21J73l6L4l6lK04l17
$$ 24 -89 -96 -48 -259 -226 -63 -112 134 -35 -210 220 38 20 23 83 320 87 -134 39 3 37 1 -2 202 -115
2580a15L11l2l52L28m8j84L1J22J12o0J95l17o3k8J55J47n38J53N42l08Q1j08
$$ -115 196 164 -188 140 92 -92 -61 61 173 113 308 -9 -72 -100 55 202 -336 -183 359 51 132 24
2602B4q5N6j26J40K29l87P5Jp0P0K48j52M4J61j36n9q0m3p0J05L2J62Lk57R8L15
$$ 24 -61 -5 -131 9 238 -149 -74 -73 -143 -73 175 23 67 228 92 33 -47 -90 -160 -55 -23 139 142 -115 -17 298
2628B98m04L0R4K14l82J91M0l08J17J38J28p9j15J44k37J36J59k33K2P1P5j7k96
$$ 298 -106 -76 18 232 -150 41 81 -227 -110 28 156 77 -38 106 -131 5 164 -69 -47 24 99 82 -214
2651b14J24K42l11N07k59J31l74J05O0m8J9K69k63p4r3L01k40K88k37L63l02P0
$$ -214 -90 152 -159 348 89 220 -154 -49 11 -37 -18 251 -12 -86 -179 122 -118 170 -67 296 -6 64
2673F4K57j59k16Q9oj39J27j00qo2K07%k0j36j15L52m51j24L79K01q9p7J42j70
$$ 64 321 162 -54 35 29 -110 17 -83 -91 -153 54 54 34 -102 -217 135 -316 -440 -61 140 51 -26 116 -54
2697e4J87J5k37K2J15M3j69M3o0L36l51Q3J48p0o2j32K46k20J7J38P2p1k9q0N1
$$ -54 133 148 -89 -67 48 91 -78 -35 -95 241 -110 -27 121 51 -11 -143 103 -117 -100 38 110 39 10 -70 -19
2722a9PK98q6k21J29o9k08R3r6J87k19M24l25n0qL44j81J01l11N27l81R0K6J31
$$ -19 -12 286 200 -21 108 39 -169 -76 -172 15 -204 220 -105 -155 -163 181 0 101 -210 317 -64 26 52 183
2746A83J93k22r5j27j29J19K03l7Qm67L49J54l81K93j7j21K05Ok3k82K69O4m12
$$ 183 376 154 59 -68 -197 -78 125 88 96 -371 -22 132 -249 44 27 -94 111 117 94 -188 81 145 -267
2769b67K56J2j52o0K65k2j05K47J76m95j8K33M3j68m6J57k15j20K53J80l28L10
$$ -267 -11 1 -151 -211 54 32 -73 174 350 -145 -163 70 113 -55 -101 56 -159 -279 -26 154 -174 136
2791A36k73K33k44K08k13M05n9k34k7J42j94j64M78k70j3N2l2M2N3R5j30P7J22
$$ 136 -137 96 -148 60 -153 252 193 -41 -68 74 -120 -284 194 -76 -89 -37 -69 -27 26 121 -9 68 190
2814A90l54J85J37m9l71K37J56O9k17M6K8j46K51n0m20J67J88j46J34k9M08k78
$$ 190 -164 21 158 109 -262 -25 131 200 -17 29 57 -89 162 112 -308 -141 47 -99 35 6 414 136
2836A36k32J24m4Q6k09J35k5m2K86kj95j37L07k56M7k04L90k02o4J48j13J10n0
$$ 136 -96 28 -16 70 -139 -4 -29 -71 215 213 18 -119 188 -68 -21 -225 165 -37 -101 47 -66 44 -6
2859fk53JM11j55j06K13r4jj45J59j24J35K33l56L4J03k30K10J46k25P8J1K3L0
$$ -6 -259 -258 153 -2 -108 105 11 10 -135 24 -100 35 268 -88 -54 49 -181 29 175 -50 28 39 62 92
2883I2l91K80P1K11m91K43p3O4O5j54j11K03L44l35o9K69o1p9r3m4R2J85l11M3
$$ 92 -299 -19 52 263 -228 15 -58 6 71 -83 -194 9 353 18 -51 218 157 78 -15 -59 33 218 -93 -50
2907e0j28J9R4j42R2lJ43J88q7J31k20j51P8l6P0n7J96J46k04j74J86j10J57l83
$$ -50 -178 -159 -65 -207 -115 -118 25 213 126 257 37 -114 -36 -72 -2 -59 137 283 79 -95 91 -19 138 -245
2931b45L97n28J35L47KR1l44L06k17l4J64L2l03K5M80k12p5l1O7j50j14K32m3
$$ -245 152 -376 -241 106 108 199 -145 161 -56 -90 74 106 -197 -172 308 96 21 -10 57 -93 -207 25 -18
2954a8j11J65J9J59p1n1k87J41j73o5K21q5J58J51j56j35R8k3j42J80mn8J03j91
$$ -18 -129 36 55 214 143 92 -195 -54 -227 -292 -71 -156 2 153 -3 -138 -40 -63 -205 -25 -29 -87 16 -175
2978a75J64j47L64l41K59k11K03K9j96j20K90j70JM07m11k15J10K09j62L06r6
$$ -175 -11 -158 206 -135 124 -87 116 145 -51 -171 119 -51 -50 357 -54 -269 -159 50 -112 194 98
2999I8o9J19m28K35J19K60l10J53n8q1r7O3q1r2J8J24J86q5O7k21Kq0M4p5J71
$$ 98 29 148 -280 -45 74 334 24 177 119 38 -59 4 -77 -169 -151 -27 159 74 141 -80 -78 -158 -114 -189 -18
3024a8J72r9j63K0m6K20k8L4q3j11M03k50p0K16k55j1J04M3j28p1L9K12j16j49
$$ -18 154 55 -108 -88 -134 86 58 92 9 -102 301 51 -19 197 -58 -69 35 78 -50 -121 -82 130 14 -135
3048a35M53o28P04k86L2j74K3N9q1o6J64k34M61k00j13K35j22k41O4L0l51M17
$$ -135 318 -310 394 108 140 -34 -11 48 -33 -99 65 -169 292 92 -21 214 92 -149 -85 -55 -406 11
3070A1q0mj13N7r9L7r4K76J00K14l81j09K77j84K39j73N9l48J83K06k18L90m24
$$ 11 -69 -73 -186 -129 -228 -191 -285 -9 91 305 -76 -185 92 -92 147 -26 33 -315 -132 74 -144 246 -178
3093a78K23Q9j27L7j29J93K61n47K44j94R6o2K25K02k84j64K37m2J04n00L48J35
$$ -178 45 134 7 44 -85 108 369 -178 66 -128 -32 -94 131 333 49 -115 122 80 184 -316 32 167
3115A67l51l7K14L0P6K1J60k66J98j02j20j3J49k59P6K18k03rJ68M6n0Pq2l3N2
$$ 167 -184 -221 -7 23 99 120 280 14 212 110 -10 -23 126 -133 -57 161 -42 -51 117 163 113 120 38 5 57
3140E7k47K47Q6j29j57Qj54K28J70l6k62J60Q9q4P7J54j22l7K31l16lK77l15J21
$$ 57 -190 57 143 14 -143 -135 -289 -61 109 73 -189 -29 60 -24 53 207 85 48 279 -37 -40 237 -78 43
3164D3O7m89L24r1J54k27K65R6j27r0J11J6n8r2J52J04k67j0K10j89J35N1k85
$$ 43 110 -379 -55 -146 8 -219 46 142 15 -75 36 52 -6 -98 54 158 -109 -119 91 -98 37 88 -197
3187a97k00O91l08k40K85j7N3j13j7J3Pj04K51k96K20N8q3J32n0q3J82k96J40
$$ -197 -397 294 -14 -254 31 14 67 -46 -63 -50 -43 -147 104 -192 28 86 3 135 85 2 184 -112 28
3210B8j71L27l4jj15k07L58n04L82j79K54k9M2L7j00m2K3M5l79M54j62K6j04l0
$$ 28 -143 184 150 149 34 -173 185 -319 63 -116 138 109 151 188 88 46 69 114 -265 189 27 53 -51 -81
3234h1R5K77k96m0JJ13j23K34r1m47L70L5o0O1k7O6J03m47M17k10N0K56j52j66
$$ -81 14 291 -5 -45 -44 69 -54 180 89 -358 12 47 -13 48 21 87 190 -257 160 -50 0 256 104 -62
3258f2j92M48k17j14Q8Q5P8J74k67j10J28J17m02K92k26L37j91n4L09j50n4Q3
$$ -62 -254 194 -23 -137 -49 36 114 288 21 -89 39 156 -246 46 -180 157 -34 -88 221 71 17 100
3280A00K3q7OL2j13j97K22o7K16j67%J63j22M1NL05k27N4k15M9J32l2J38n4j71
$$ 100 123 36 42 74 -39 -236 -14 -81 135 -32 -32 131 9 50 55 360 133 187 -28 21 153 121 259 205 34
3305C4j29L0K10k3k18K25l03L55O9j97J2p4J41j68l21N02j43K85k59k3J11j46
$$ 34 -95 -65 145 122 -96 129 -174 181 250 53 65 -9 132 -36 -357 145 2 287 28 5 116 -30
3327c0K57m36L21k63k32M27j08K24k89J78k98j20O74l36K38j23o7q0L20k71L8
$$ -30 227 -209 112 -151 -383 44 -64 160 -129 49 -249 -369 305 -31 207 84 17 -63 257 -14 24
3348B4r6j32O8K54k66L55j00k51J19k39J15N4q5J53K6r5o5K02n4j69P8j37K78
$$ 24 -72 -204 -136 118 -148 207 107 -144 -25 -264 -149 -95 -180 -27 -1 -96 -161 41 -13 -182 -104 -241 37
3371C7j39K4M7P8k01J19Np8L46k82j50K54J05Nj64n3J41j63J16K01j35l3J50k06
$$ 37 -102 -78 -31 47 -154 -35 -30 -108 238 -44 -194 60 165 170 6 -47 94 -69 47 248 113 80 230 24
3395B4j59L72k0j53J58k28p0J62n6J69m7M9Lj56N9n3J56m72N08j90n8rJ40o7k71
$$ 24 -135 237 217 64 222 -6 -76 86 30 199 152 201 204 48 107 54 210 -262 246 56 -2 -11 129 62 -209
3420b09K20J55k89J34k1L32l73J41P6j57k15L59j94Q9L4j02r5j0K10J18k19r6
$$ -209 11 166 -123 11 -10 322 -51 90 166 9 -206 153 -41 48 82 -20 -115 -125 85 203 -16 -112
3442a12oJ40k02J89J57k88L75j24J8n5n7J82j6j65K09k96K68m75K86L36n35K54
$$ -112 -118 22 -180 9 166 -122 253 129 147 92 35 217 201 36 245 -51 217 -258 28 364 -171 83
3464H3pL2k97J10K29j27J31j12K09l37K02K5k58K58j83K02O8l58K50p4r5P8J54
$$ 83 76 108 -189 -79 150 23 154 42 251 -86 116 141 -117 141 -42 160 228 -130 120 46 -49 29 183
3487A83l66J99J41j58k22L02J51J04m18Q5j17L30kl34J60j60k2J46R2q8J25k31
$$ 183 -183 16 157 -1 -223 79 230 334 -84 1 -116 214 212 -122 38 -122 -144 2 94 6 131 -100
3509a00j24M65k74j17K57k80K00R7j96j2M3N0R0m33O20k82J12j84M3L7O5J12j00
$$ -100 -224 241 -33 -150 107 -173 27 124 -72 -84 -41 9 99 -334 286 4 116 -68 -25 12 77 189 89
3532H9P1p0pk16J45J42j17k82L12j09m5J89r2k9k69K24NK72j82k40J5K08K82k40
$$ 89 160 90 83 -133 12 154 37 -245 67 -42 -87 102 10 -19 -288 -64 -59 213 31 -209 -194 14 296 56
3556E6k42O3oL04k23j10j2lL40K4n35P35n00K41j54lO6O7l10L18j3k33N5J3R2
$$ 56 -186 -123 -129 175 -48 -158 -170 -173 167 191 -344 391 -109 132 -22 -25 41 108 -202 116 103 -130 -75 -62 30
3581C0O3j85J30j50j05J43MJ36j41Q2j94J0NL17O0j91k30M55l15K43J54n49L23
$$ 30 93 -92 38 -112 -217 -74 -70 66 -75 7 -187 -177 -172 145 205 14 -216 239 -76 167 321 -228 95
3604I5j81j51K83M7P4k33P4P0O6O0k75O4lj16L58j61r8j43O8L75j91J7j12l1K0
$$ 95 -86 -237 46 93 167 -66 8 78 144 204 -71 -7 -10 -126 232 71 -27 -170 -102 273 82 99 -13 -44 -24
3629b4k8L85l52J20k74L15lk11K45j59k1k7K0K01j25nj78L9J40k90J06J35k16
$$ -24 -52 333 -19 101 -173 142 139 -72 173 14 -7 -34 -14 187 62 57 -121 -82 58 -232 -126 9 -207
3652b07Q9J15n1j04M24l62P5N6Rk09l6L03k73J68j12K84j54J46j47p4j60L28r0
$$ -207 -118 -3 -54 -158 266 -96 -21 35 44 -165 -201 102 -171 -3 -115 169 15 161 14 -60 -220 108 18
3675A8L60n35K90j02j49K07r7n5R7L2j40Pj02J43q2L21j08j70j05L8J53o0k30
$$ 18 378 -157 133 31 -118 89 -8 -63 34 66 -74 -67 -169 -26 -108 213 105 -65 -170 -132 21 -39 -269
3698b69qN0J30l7M02j88j77o7J24N9o5K9m5J72RL1j41j59J84JJ97j71L5m2p1r8
$$ -269 -277 -227 -97 -134 268 80 -97 -164 -40 19 -46 -17 -62 110 119 150 9 -150 34 35 232 61 96 54 -17 -115
3724a15q6q3K08KK25l43K26o3j97L87pj13j5ML0r3J27N2K30k48k01l2O3N6L1n2
$$ -115 -201 -284 -76 -74 151 -192 34 -29 -226 161 154 41 26 30 60 -33 94 146 376 128 -73 -105 -42 14 45 -7
3750gk32K51j23J77j04n7J10j15L4J36j41K79M5l74R3Q9n7k28K57j96R1K2L63
$$ -7 -239 12 -111 66 -38 -95 15 -100 -66 70 -71 208 253 -121 -28 61 4 -224 33 -163 -72 -50 313
3773C13l42o5K18l54K25P3k59K71N5N8J00n53O0N17l9m72J40q1J61j92J01J11
$$ 313 -29 -94 124 -230 -5 68 -191 80 135 193 293 -260 -200 317 278 -194 -54 -135 26 -166 -65 46
3795D6pk17L78M8k41o0J74k61K01j61ok9J67K1j17M8P4M8M9J10m43L15p5k57J84
$$ 46 39 -178 200 248 7 -53 121 -140 61 -100 -106 -135 32 53 -64 -16 58 106 155 265 -178 137 62 -195 -11
3820a1j08J41j02K27l69J01M2r0Q1J46J9k27O1O2L1k28K62%j31J43m0k62J30K31
$$ -11 -119 22 -80 147 -222 -121 -79 -169 -88 58 77 -150 -89 -27 4 -224 38 38 -93 50 10 -252 -122 109
3844A09l12K14K84l17l46M27J75n02M65n28M17r8L0n3O6O6r9K8j93R0k4J36j35
$$ 109 -203 11 295 -22 -368 59 234 -268 197 -331 86 -12 18 -35 31 97 -2 26 -167 -77 -101 35 -100
3867a00K37j01J06o0l27K1J71Q9j68J00j15K80j01J56j41J04k37J55qQ0k2o7n0
$$ -100 137 36 142 82 -245 -224 -53 36 -132 -32 -147 133 32 188 47 151 -86 69 61 141 119 52 2
3890BJ01k11j5L43l07R3k84J54j6J80j86MJ72k4M1l63K56J50J70n03K01m3R6l75
$$ 2 103 -108 -123 220 -87 6 -278 -124 -140 40 -146 -142 30 6 47 -316 -60 90 260 -243 -42 -85 11 -364
3914c64L83j24K2J89k30J53r0j56m2M24l74K80o3k13K40q2O7Lk97M28k47L53j70
$$ -364 19 -105 -83 106 -124 29 -61 -217 -259 165 -209 71 8 -205 35 -47 20 23 -274 154 -93 260 90
3937I0M4j42J26J85q7n2k55l4J33oO9m6K70m58L4J14l21N29l41M7R9o8j30J22
$$ 90 134 -8 118 303 216 164 -91 -125 8 2 71 25 295 -163 -129 -15 -336 193 -148 -101 -2 -70 -200 -78
3961g8O7j55L33j17k45o6L96R6j64J2K33l60j76M08J00l41P4J25o3j56R8j71l1
$$ -78 -11 -166 167 50 -195 -261 135 231 67 79 312 -48 -224 184 284 -57 17 142 79 -77 21 -150 -181
3984a81L3L22j65j07m9m4K92l68Q3N1K51r9q3J5L18l04j18J89j80K14j39M1J81
$$ -181 -148 174 9 -98 -147 -191 101 -267 -184 -133 118 19 -64 -49 269 -35 -153 36 -144 70 -69 -28 153
4007A53N3Pk91J05M03n10m5K35J00j34Q1J63k35J0L5O2k27P5K0j07J16J57m5k54
$$ 153 206 213 -78 27 430 -80 -125 110 210 76 157 320 85 95 130 192 -35 40 60 -47 69 226 181 -73
4031g3o9J7J54k27K41K07m45K28j0k3k10L01J5k2l02NK50j17N4j61j06K12L8K89
$$ -73 -142 -125 29 -198 43 250 -195 33 23 0 -210 91 106 84 -218 -213 37 -80 -26 -187 -293 -81 -43 246
4055B46k84O8o2J18k04J06jj4J48k44L05k60KJ50k42J98p8J42J66k09k83K36J07
$$ 246 -38 30 -32 86 -118 -12 -13 -27 121 -123 182 -78 -76 74 -168 30 -48 94 260 51 -232 4 111
4078A11k15J19L7p8K81k50l6K8k0k3L41j84k17J18L4P7n1k00m8M68k35j39J98
$$ 111 -104 15 52 -26 255 5 -31 -3 -23 -46 295 111 -106 12 46 123 72 -128 -176 292 57 -82 116
4101A16o1P6j51q1K43j19m6K31l38J28J1K00k4o5r4J18m0LQ2k11oO2%L3j39J5
$$ 116 55 131 -20 -101 142 23 -23 208 -130 -2 9 209 185 120 26 144 104 107 189 -22 -28 34 34 67 -72 -57
4127e7j9j18K33o3j24K66mj30j96L79k07j16K46j21j25K58p2j63K47N1l1k36O3
$$ -57 -76 -194 39 -24 -148 118 114 -16 -212 167 -40 -156 90 -31 -156 102 30 -133 114 165 134 -102 -39
4150c9J46Q8l15n3N30k42p6k51M04j97K06k5l2k1M1j00jP9m7pr8J4j26OK1N7P0
$$ -39 107 195 -120 -173 357 115 39 -212 192 -5 201 176 144 123 164 64 63 142 95 88 -10 4 -122 -116 -95 -38 32
4177C2J60l23M5l8J78q5J13l98K33M36k20l17J33l5Q4j35J57j85J44K9J23k01
$$ 32 192 -131 -86 -124 54 -31 82 -316 -83 353 133 -184 -51 -86 -2 -137 20 -165 -21 8 131 -70
4199g0jN9R5j43J6L26k94Q0J29j21p1l9o2K6j5L20j27r4K6J26j3l88J07N26l05
$$ -70 -71 -12 83 -60 -44 282 -12 68 197 76 5 -34 -96 -70 -85 235 108 14 40 166 153 -235 -128 398 93
4224I3j23L23k42k60K82n3P5K15k36j86J8J61NJ75l66L03r8l17J11L69r1k87J29
$$ 93 -30 293 51 -209 73 20 95 310 74 -112 -94 67 72 247 -119 184 86 -231 -120 249 158 -129 0
4247@l6k1J41j25o0J78j93n9J75M6K28p4j03k01M34n14K40p7p2R4J1Q6Pj57K6
$$ 0 -36 -57 84 -41 -101 77 -116 -175 0 46 274 200 97 -104 330 -184 56 -21 -93 1 12 98 105 -52 -26
4272b6N9J09j4Q4m83J08l6L81k01k45K99L26l69q5k6K2K20o4o7K76l23O8k34K03
$$ -26 33 142 128 212 -271 -163 -199 182 -19 -264 35 361 -8 -93 -119 -97 123 59 -8 268 -55 13 -221 -18
4296a8k77J41J13J27J57l63j4RoQ5K34j7k11K08k93J59k24L12o7n6J20j44J78
$$ -18 -295 -154 -41 86 243 -120 -134 -125 -131 -46 188 171 -40 168 -125 34 -190 122 55 -1 119 -25 153
4319A53p8j4N9k60j25K94J41j16k23K60K7j9j60N2o4l26N23K4K42m22L73l43J09
$$ 153 75 61 120 -140 -265 29 170 54 -169 91 118 99 -61 -9 -73 -399 124 148 390 -32 341 -2 107
4342A07r2j2J78k11J87j22K4k37J07K6J2K66k27J83k45J60k15J80O3j7l27J77
$$ 107 15 3 181 -30 157 35 59 -178 -71 -45 -33 233 6 189 -56 104 -111 69 132 115 -212 -35
4364c5J75j34l16J53L33m02J92j36J25L4P1K0j85K35l05M46k16k09j5K46j99K05
$$ -35 140 6 -310 -157 176 -226 -34 -170 -45 -11 60 80 -105 130 -175 271 55 -154 -169 77 -122 83
4386H3J2N2J15l64L3K50j3l09J52k09J76K3j44K55l08J79K80j28k78j07J62K13
$$ 83 95 147 262 -102 -69 181 168 -141 11 -198 -22 1 -143 112 -196 -17 263 135 -143 -250 -88 125
4408A25j22J00j66L59n33J96J75j08nk36L06J21r0j00m7Q9O2m35L24J97j20J6
$$ 125 3 103 -63 296 -237 -41 134 26 21 -215 91 212 122 22 -25 64 126 -309 15 212 92 108
4430A08o2n7J71j52j8m4K63l75j6L38k24J58k83Q6l3q5l0J14L1K41j32p5K78j76
$$ 108 46 -11 160 8 -10 -54 209 -166 -182 156 -68 90 -193 -107 -140 -225 -255 -141 -110 131 -1 -76 202 26
4454B6P3j97k18J40J76N5M4m5R8k22Oj66L24j12n15L94M4j09K48l32L56j76o1
$$ 26 99 -98 -316 -176 0 55 99 54 152 -70 -64 -230 94 -18 -533 -139 -95 -204 44 -288 68 -108 -169
4477a69n2M08j92J65k6J21k80Rj13N0N1j12O%l0j6K52j79J41j21K96k38j2P9K52
$$ -169 -221 187 -5 160 134 255 -25 -16 -129 -79 -28 -140 -134 -134 -164 -180 72 -107 34 -87 209 -29 -41 38 290
4502B90j10l40lK83j71L40o6q3k52R3j16M5J60j05J81l21J81N6k65kJ92r7p1N5
$$ 290 180 -160 -163 120 -51 289 223 140 -112 -19 -135 -90 70 -35 146 -175 6 62 -203 -205 -13 -110 -181 -126
4526a26R3j72p1K83K90m6m45M4J23L6r0J30k29O9O2L06k73M7j05J79l84L01j84
$$ -126 -33 -205 -276 7 297 251 -194 -150 -27 9 -81 49 -180 -111 -49 257 -16 31 -74 105 -279 22 -162
4549a62J41j11K65j25J25K26m65J13j01K45k8J6KN6k71K31J5k14m00P34l31k35
$$ -162 -21 -132 133 8 133 359 -106 7 -94 151 123 139 141 197 -74 157 172 -42 -442 292 -39 -274
4571b74M0N5K48L8l5j03J56j66m7R1n5P6J08j75j11J00k5J45qL8J33j05k43O9
$$ -274 -234 -179 69 107 72 -31 125 -41 -88 3 -52 24 132 -43 -154 -54 -79 66 58 96 229 124 -119 -50
4595e0J00P2J03k90J6K19k5q4k3j10J34j19j97R3K27j74J3J16r3L17j09L5m75
$$ -50 50 122 225 -65 -49 170 145 61 38 -72 62 -57 -254 -161 66 -108 -95 21 -72 245 136 171 -304
4618c04K59J25j21R8k28L39J9k60p6L31j49r6j44N7J21l7J13k53L83j39l2O5j25
$$ -304 -45 80 -41 57 -171 168 187 -73 -149 182 33 -63 -207 -150 -29 -66 47 -206 177 38 6 71 -54
4641e4O6n4R6nk19Q8K69l60J54j88o8J66J26L9n6J24j70k51J44j12L48q8k09J79
$$ -54 12 -42 54 49 -170 -82 187 -173 -19 -207 -275 -109 17 56 0 124 -46 -297 -153 -265 83 -5 -214 -35
4665c5J68k54M33l84K24j96l7j05K25k06K9J49J04j27K39l53p4L69r0N3o4RO6
$$ -35 133 -121 312 -72 152 -44 -81 -186 39 -167 -138 11 115 -12 227 -126 -200 169 79 132 68 77 143
4688A43n9k7l48K11R0Q0q5j65K81o8J85m94K84j0K62k71r7K22j34Qj16K52q0k82
$$ 143 84 57 -291 -80 10 90 5 -160 121 53 238 -256 28 18 280 9 -88 134 0 8 -108 144 64 -218
4712b18L2J75j48J5M8kN9J29j99J82k04M1r5K08k0O3Q5j62j01j2Q0K09o0j31m4
$$ -218 -186 -11 -159 -144 -96 -98 -39 90 -109 73 -131 -90 -185 23 3 66 151 -11 -112 -124 -44 165 105 -26 -70
4737g0J42k54K48K43r2j55j25j15N7PjQ9J39k17J4M30o25M69j59q5J40J62k37
$$ -70 72 -182 66 309 217 62 -63 -178 -121 -114 -115 -26 113 -104 -90 340 -285 184 25 -60 80 242 5
4760EQ1P4l2k57J0k1J19k1j08J43J70j01L8J7j5o1j33P0R4P5j95L58o18K75Lk5
$$ 5 86 160 128 -129 -119 -140 -21 -42 -150 -7 163 62 100 117 102 41 -92 -22 72 147 -48 310 -308 -33 -30 -55
4786e5M6R3k8lm57N81j68J19p6J03j94r2j12K40P8j95N0J49p4j2J8K5j67J10Q5
$$ -55 -9 84 56 53 -404 177 9 128 52 155 -39 -131 -243 -3 75 -120 -70 79 5 -7 11 36 -131 -21 64
4811F4J45k02K53j57j61rN7j3j59L44j14r9J78l49J29L20l48K72l43J45O3j67
$$ 64 209 7 260 103 -58 -67 -10 -23 -182 162 48 -51 127 -222 -93 227 -121 151 -192 -47 16 -151
4833a51K1M9K18j89M8K16k37L6K07k33oJ50l21R4M39l91P8R1k67K1m7J81K8j6
$$ -151 -130 -81 137 -52 -4 212 -25 11 218 -15 -21 129 -192 -98 341 -50 28 119 -148 -127 -174 7 35 19
4857A9j87N3J77qm4J33o9Nk00L38k84K48j38Q0m2O1j79K1Q0L8j33J63j30j97L99
$$ 19 -168 -115 62 54 10 143 74 79 -121 217 -67 181 43 123 81 142 -37 -16 64 102 -31 132 2 -195 204
4882B04l87M74q6l22J0L0q7M37j88j53L3j54K13R0J5j77j38L05k10L98j05j57
$$ 204 -183 291 205 -117 -107 -77 -164 273 85 -68 -35 -189 24 114 129 -48 -186 119 -91 307 202 45
4904D5j70n4K72L7k56J67j46p6M59l67J99j11K71k24k6R1M3q4j22L18j28k24k11
$$ 45 -125 -179 93 130 -126 41 -105 -181 278 -89 110 -1 270 46 20 111 154 70 -52 266 138 -86 -297
4927b97L76O9m38M20k77L52n4K40l68PK5M9l25K11Q0Lq0J75Q1m14J56k9J45l6
$$ -297 79 148 -290 130 -147 205 151 391 23 30 55 104 -221 -10 70 73 -7 168 249 -165 -9 -38 107 71
4951G1J02k43K86l53N7N7o9j24K6L85j87L9J55j8j41J10l93J99Q8l9r7J10nj02
$$ 71 173 -70 216 -137 -80 -23 -92 -216 -190 195 8 47 202 184 43 153 -240 -41 47 8 -89 21 16 -86
4975h6j90M16j14J61l08R7JJ21j02j94J29qK91J0m04P7J81R1l29J97k94J01l8
$$ -86 -276 140 26 187 -121 -24 -23 98 -4 -198 -69 -77 214 224 -180 -103 78 169 -160 37 -257 -156 -194
4998a94J09N40n36K38j20Q2Mj45N01o73J80p5J79j16J54l04N2N4j44M24j94Q1
$$ -194 -85 455 -81 157 37 119 123 -22 479 -194 -14 -89 90 -26 128 -176 -124 -70 -214 210 16 97
5020I7j77k76K61O1k2kJ84J9J61l72J94k67Q1N3J04l22K19M7Q1J36m59J79j29
$$ 97 -80 -356 -95 -34 -56 -58 126 145 306 -66 128 -139 -58 -5 99 -223 -4 43 124 260 -199 -20 -149
5043a49J76m2k0q3n8M19k41k01K38q6J3L2J98n39K57j81K24N6pl62N12k01J89
$$ -149 27 -15 -35 -118 -176 243 2 -199 39 -47 -34 -2 196 -343 -86 -267 -43 13 6 -356 156 -45 144
5066A44k9k0j09r2J45L1M3j17M3Q2M0o8j29J55j48Q7o4L1K02j83q7J51m54K48
$$ 144 115 95 -14 -106 39 70 113 -4 39 121 161 93 -36 119 -29 58 -6 25 227 44 -43 108 -346 -98
5090i8L1p1K04k51L36j23n1J33j37%j46nK43k84P3n7K33q7J23p9R3k94K05P4J42
$$ -98 -67 -138 66 -185 151 28 -23 110 -27 -27 -173 -178 65 -219 -146 -203 30 -57 66 -13 80 -214 -9 65 207
5115B07k93J00j47n8P5J48J49l88L98k51oK76j53o7J40o8m6k45J36n7J76m8J24
$$ 207 -86 14 -133 -191 -116 32 181 -207 191 -60 -66 210 57 -10 130 62 16 -229 -93 -150 26 -22 102
5138A02j36L1k67L43Ro4J2p4J22L7k62K18q4L34n66M05N6j63J61j85l08L63m1
$$ 102 -34 -3 -270 73 82 18 30 -44 78 115 -147 71 -13 321 -245 160 216 53 214 29 -279 84 43
5161D3k52J01L15k44K42k79MJ63R0j34J79m7l16K50k36L32j12Q6k22k28J74k6
$$ 43 -209 -108 207 -37 205 -74 -70 93 183 49 228 181 -135 115 -121 211 99 185 -37 -265 -91 -117
5183a17J63j41J96k16l7K67j30L2J25n0j70l85O48j20M6j23j84R8n5K59m4J3p8
$$ -117 46 -95 101 -115 -152 115 -15 17 142 92 -78 -463 185 65 111 -12 -196 -98 -153 106 62 75 -3
5206cPk29n4K25L06l00N1J16l3k74J97j13K08m57K95o2N1J5k02K21KL53j7l73
$$ -3 4 -225 -279 -54 252 -48 3 119 86 -188 9 -104 104 -353 -58 -120 -69 -54 -256 -35 -33 320 303 -70
5230g0n6k04N29k18j36L92k94J55k12J10M7p0k9k0J10P0k61J54K19j55k62J78
$$ -70 -126 -330 199 -19 -155 237 -57 98 -114 -4 43 -27 -56 -76 34 104 -157 -3 216 61 -201 -23
5252b3k87M52k17O16j94j67r1l44L33j66o4J99n2P3k29L34k68J3J8k17j38K61
$$ -23 -310 142 -75 541 347 180 89 -255 78 -88 -152 47 -5 68 -161 173 -95 -82 -64 -281 -419 -158
5274a58J01J92k79j78L76r7LJ58J4M4l69K51p3Q6k09J89j87K60k76m2K08j41J00
$$ -158 -57 135 -144 -322 54 -43 -40 118 132 176 -193 58 -15 71 -138 51 -136 124 -152 -194 14 -127 -27
5297b7k2O6Q3P4j85p7J1O1M0o2OJ6j11J26l8l50N49j36Q1l39M04m35L4L27r8K62
$$ -27 -49 17 100 174 -11 -88 -77 -16 24 -38 -32 -16 -127 -1 -39 -389 160 24 105 -234 170 -265 -231 96 -2 260
5323B60m29K48j18m1J3O4j00J20P7m4j8n4j44J3O6M0j20R4J6J99k02j09N02l55
$$ 260 -169 79 -39 -80 -67 -3 -103 17 94 50 32 -22 -166 -153 -87 -47 -167 -73 -57 142 -60 -169 333 -22
5347b2l9k54j00N98k88P3O1O1j47l5lp0J73J79m65J6K55P1j87L86j23j48P2J19
$$ -22 -61 -315 -415 183 -105 -32 29 90 -57 -92 -95 -165 8 187 -278 -262 -7 64 -123 263 140 -8 64 183
5371A83o0l23J87q2P5n5K27j20JL1J6Kl8k5L53n74K09J07J2j62K26k26q1R7K69
$$ 183 123 -200 -13 -95 -20 -75 152 32 33 64 80 82 44 19 372 -202 7 114 126 -36 190 -36 -117 -20 249
5396B49l9lj26K7Nj65l41L85q2j08J61j30q5L91k67N5K33j34Kk20J55n2K55m8
$$ 249 210 207 81 108 113 -52 -393 -8 -90 -198 -37 -167 -252 139 -128 -73 160 26 28 -192 -37 -89 166 118
5420A18J2j86p3K04L2j52j12j45N57m23Q8L65n59K76j03K17q9J02j17PJ6J6j73
$$ 118 130 -56 -129 75 107 -45 -157 -302 255 -168 -80 285 -274 2 -101 116 27 129 12 19 35 51 -122
5443a22J87j8N2k19j60L82j75j71Q6R9k9r8K18P1k57L35l15K23r3M4l02O54m44
$$ -122 65 47 99 -120 -280 102 -73 -244 -158 -59 -88 -186 32 103 -154 181 -134 89 -4 40 -262 392 -52
5466e2K16l5m0k15j97J33P8k65M01p0j26K67k15J33P2K64k94j45J85jj81J52q
$$ -52 164 129 89 -126 -323 -190 -112 -377 24 -46 -172 95 -120 13 85 349 55 -90 95 94 -87 65 57
5489E7k14J55j73L90k44J01p0pJ25l09J81j34K62j54r0N9J43k09K17k85K83J1
$$ 57 -157 -2 -175 215 -29 72 2 -5 120 -189 -8 -142 120 -34 -124 -65 78 -131 86 -199 84 95
5511I5k8k19oK19m58N22r7K64k81k97L90P9j04j48N0J09J32N5l92R7j03l2K15
$$ 95 67 -152 -158 61 -397 125 28 292 11 -286 104 183 79 -69 -19 90 222 277 -115 -18 -121 -153 62
5534F2J43l78J20r5O8J02p6K7m6J47k66J76O9l2k84j36M71m8l36L46m7k03N73
$$ 62 205 -173 -53 -148 -80 22 -54 -27 -73 74 -192 -16 53 21 -263 -399 72 24 -312 34 -13 -216 357
5557C57k68o8J21k89R1n0%K73l60L32j47l62M09l40J97J48k7k6Rn2R7J66k68q2
$$ 357 89 21 142 -147 -56 -106 -106 167 -193 139 -8 -370 39 -301 -104 44 17 -9 0 -52 45 211 -57 -139
5581a39l6J36K75n9j42k76J41J46k15K98j43J41k55p3L11k6j76Rj6K35J1l14J97
$$ -139 -175 -39 236 177 35 -241 -100 46 -169 129 -14 127 -128 -201 110 84 -92 -83 -99 136 147 -167 30
5604C0q1J61k32L08k67J82j51k07J26M4K95j56J8k63M79l40L15k85Qr8K08j11
$$ 30 -51 110 -122 186 -81 101 -50 -257 -131 -87 208 52 70 -193 286 -54 261 -24 -16 -114 94 -17
5626a7J55K8J21k08k24O8L0Q6j00q7J74j47Q2l4L8K59l92K20k43L25j5j84P2k12
$$ -17 138 166 287 79 -145 -77 -47 39 -61 -148 26 -121 -39 -73 -35 224 -168 52 -191 134 119 -65 7 -205
5650b05K21j1L0J00j69M4R3Q5k41O7R2o6lq2O3Q0P0J52k68J41j23R5j72j96J94
$$ -205 16 5 35 135 -34 10 103 188 -53 14 106 40 37 -45 18 98 168 320 52 193 70 165 -7 -203 -9
5675iQ3l28J08K96m93J52J46l6k2J07J91J40m89Q6J59K30j56l37N0QJ25L4J41
$$ -9 74 -254 -146 150 -343 -191 -45 -81 -103 4 195 335 -154 -68 91 321 165 -172 -122 -114 11 45 186
5698A86r4j94j69K11oJ53O3m9k50J48K47p9J16j33l08L34N2k66J12m9Qj46J70
$$ 186 92 -102 -271 -60 -66 87 150 101 -149 -1 246 167 283 150 -158 176 228 -38 74 25 33 -113 57
5721E7K74o52L76j6m0P6o2j25J31j55R9Q6lp4O4k14M1J73O2P1j95K48q9m1qj28
$$ 57 331 -321 55 39 -1 75 13 -112 19 -136 -37 49 46 -28 36 -178 -137 36 98 169 -26 222 133 92 84 -44
5747d4J14m18L19r7K08M9N4j24J18j2k04N4j42J38j87J81q9rJ10K12k94J49j29
$$ -44 70 -348 -29 -126 82 131 185 61 179 167 -37 17 -125 13 -174 7 -82 -91 19 231 -63 86 -43
5770d3l40M63j09j92K53j53M9Mk3L4O9l1q9R4j20J39K82q6j67p4j87L58j97K9
$$ -43 -383 80 -29 -221 32 -121 -72 -68 -91 -57 12 -19 -108 -14 -134 5 287 201 34 -40 -227 131 -66 -37
5794c7K0j29K26p5J84l74J93p6R3j3J59k63P2J90m4j57N1O3O1j92K23J9k10M3
$$ -37 -17 -146 80 5 189 -185 8 -68 25 12 171 -92 -20 170 126 -31 20 83 144 -48 175 194 -16 27
5818B7J12O9k76J26%n7Q2j90j27J83l12K11M2J35j95J62j16K96r7q5o3k4J73j8
$$ 27 139 208 -68 58 58 1 83 -107 -234 -51 -363 -152 -110 25 -170 -8 -124 172 75 -10 -73 -97 76 58
5842E8j3Jj4ol5J87j37K37j25pp4K35k49k29L49j40R1j90J45N9l28J96O1R0j16
$$ 58 45 46 32 26 -9 178 41 278 153 146 72 307 58 -171 178 38 129 -61 84 143 -185 11 72 162 46
5867D6k10J07L69l25J61j81J50l02K37o2k44K93k37K8K68j77j28J63J80l29M56
$$ 46 -164 -57 312 -13 148 -33 117 -185 52 -10 -254 39 -198 -170 98 -79 -207 -44 136 -193 263
5888B63n4n7p6j11r6L35m19L39k26j9J12oJ71k15l00K74J16k5L0l6k3R4k73J61
$$ 263 209 152 76 -35 -131 204 -215 124 -102 -121 -9 -15 156 -59 -359 -85 31 6 36 0 -23 71 -202 -41
5912d1l36M97n2j61K28j58J89j02j34q2J63K7J20n7J3L0j17J49l55L7j12L93j90
$$ -41 -377 120 68 -93 135 -23 166 64 -70 -152 11 38 158 101 114 144 27 176 -179 -142 -254 139 -51
5935e1J83j07q3N1Q5j45J49J25j48J17l97L97j46j76J94r2j51Q7K38m91K60J05
$$ -51 132 25 -58 -7 78 -67 82 207 59 176 -221 176 30 -146 48 -44 -195 -108 130 -361 -101 4
5957Dk9K1q2J48j14O4N7J04k60M2K04j12nk1J37q3j36N4K15m67k3J63J67m0j44
$$ 4 -25 -4 -86 62 -52 12 69 173 -87 -45 159 47 42 21 158 75 -61 -7 208 -259 -282 -119 48 8 -136
5982a36J66N8pj56j42L51k17J99K3k20L1k49J37L50n3l52K53p6n9N7j1L8p2L81
$$ -136 30 88 81 -75 -217 134 -83 116 139 -81 -50 -299 -162 188 135 -217 36 -40 -99 -42 -53 -15 -87 294
6006B94p01M18l51J12J47J10M5J30j55k1lk31K76j7p2k7j73L9M08j49LJ25n1j63
$$ 294 -407 11 -340 -228 -81 29 74 204 49 28 25 -206 70 53 -19 -46 -219 -180 228 79 82 207 156 -7
6030gK16l90K93k93L20j83j32J34%J0J56q6k8O0q9K11l05J35J64q3o0n5Q7k70
$$ -7 209 -181 112 -181 139 -44 -176 -42 -42 -32 124 38 10 70 -19 192 -113 22 186 103 43 -12 75 -195
6054a95L48k83J9J09l52K63Q9k73J84r0L01o7L3l9n0k83M56j81M7P0L6l0k29J47
$$ -195 153 -130 -111 -2 -354 -91 -2 -275 -91 -181 120 53 86 47 -3 -286 170 -11 36 106 142 112 -117 30
6078C0k5oj28J10J73j09p5K9P6j60n5j7K14p5R5k41J3J3K40m3J33l20J83k3M8
$$ 30 5 -1 -129 -19 154 45 -30 -1 75 -85 -140 -157 57 -18 77 -164 -151 -138 102 59 192 -128 55 32 80
6103H0N4P8j30k89J56J68j38M6R0k37K11j82Q6j3j18J97J58k82L49j22Q1l59o1
$$ 80 134 212 82 -207 -51 117 -21 25 115 -122 89 -93 -7 -20 -138 59 217 -65 284 162 243 -116 -177
6126a77L76m17K01M44o02O8K24j69k7J22j08l34K19J56k57K15J58j63J14k16J56
$$ -177 199 -218 -17 427 -175 -107 117 -52 -79 43 -65 -399 -180 -24 -281 -66 92 -71 43 -173 -17
6147a7j25J48N3L5j17P7j76N6J64k99K25j62J63q9L0K94k44N8j65J41K09k47q2
$$ -17 -142 6 59 94 -23 54 -122 -66 98 -201 24 -138 25 -64 -34 260 16 74 -91 50 259 12 -70
6170g0J38L07n27J7P0OM8k75L29j45J27n6J16j40P7L26l08m4l4o0j18jQJ00q0
$$ -70 68 375 -152 -135 -65 -59 -11 -286 43 -102 25 -31 85 -55 22 348 40 -4 -38 -98 -216 -217 -209 -109 -189
6195a89K09K5m0j04P1j15J40O9P2k23J64j17J0K8l3p3J26R2J26k84J67k66J74
$$ -189 20 45 5 -99 -28 -143 -3 66 138 -85 79 -38 -28 0 -33 -106 20 112 238 -46 121 -145 29
6218B9j32N9k4K39N4j03j77Q1j00Q0j22j7J48m5j2p7J27k47L37J10j90J15j73
$$ 29 -103 -44 -68 171 225 122 -55 26 -74 6 -116 -133 15 -30 -42 -119 8 -239 98 208 18 133 -40
6241d0P6j7j31k2J57j06p5J22k56K82j41q8K47n4K37j30j16N0J05J50k60K4k69
$$ -40 36 19 -112 -134 23 -83 -158 -36 -292 -10 -151 -239 8 -46 191 61 -55 -5 100 250 -10 14 -255
6264b55K27r5n6K48n4Nr5J93k50O4n1n5L78k28J11j65j27m8J68L02k21k07K45
$$ -255 -28 -123 -179 69 15 20 -75 118 -132 -68 -119 -174 204 -24 87 -78 -205 -253 -85 217 -4 -211 34
6287C4K27m54J41L10l52pK63j5j51n4q0L86l4k79pP7j20oJ52k89J99l3j20K42
$$ 34 261 -193 -52 258 -94 -101 162 147 -4 -58 -138 248 214 -65 -72 5 -115 -121 31 -258 -59 -92 -212 30
6311C0J8m3k7M1l9J27j50J44j49j22J54LJ61j47m2R8j46J42r9j21K50R1l53R8
$$ 30 48 5 -22 19 -20 107 -43 101 -48 -170 -16 -13 148 1 -41 57 -89 53 -46 -167 83 174 -179 -81
6335h1j92K38k36K70J11LJ08k11k75M0K54J21l78K04NJ5J22p5P7j51n1J28pq3
$$ -81 -273 -35 -271 -1 110 113 221 10 -265 -225 29 150 -228 -24 -19 -4 118 43 120 -31 -82 46 39 -44
6359d4N3r1J13mk1M4q3K55N5k33j41OK9K97m09JoL28j99J02m5j12J95m1Np1K76
$$ -44 9 -82 31 27 6 50 -33 222 277 44 -97 -91 -62 235 -174 -173 -179 149 -50 52 7 -105 90 49 54 -17 259
6386B59l49J8M73m50m3O0l9K45p8j93j99K11K27k81L86l37J40j63K50l12L00q7
$$ 259 -90 -72 401 -49 -92 -32 -71 174 96 -97 -296 -85 142 -139 247 -90 50 -113 137 -175 125 38
6408C8k36N9J40k0PN8p3J9K07j94J52j85m2Q8j28K44k77K98j46j63K60j21j92
$$ 38 -198 -139 1 -19 -12 46 -27 -8 199 5 157 -28 -70 18 -110 134 -143 155 9 -154 106 -15 -207
6431b07K78K02j79j88M32k17R2j42P7r3l21L19N9l5J33j97J37K1j16j25KL72k81
$$ -207 71 273 94 -94 338 121 213 71 148 55 -266 53 112 77 210 13 150 171 55 -70 -68 304 23
6454B3l0n5P0J15m05K46K33l85L37Q5l16n6K43l15K79j2m7j01O1M1J69q1J23j64
$$ 23 -7 -62 8 123 -282 -36 197 -188 149 234 -82 -138 105 -210 69 57 10 -91 -30 11 180 99 222 58
6478E8j25j41J65M09l38j57J44k3L4Q6mnr6N1Pj73K1J11j40J09J75q2k14J55j6
$$ 58 -67 -208 -43 366 28 -129 15 -8 26 112 108 103 7 58 65 -108 -87 24 -116 -7 168 86 -128 27 11
6503A1O7J39j61j71L57k14J31m8k5l7J31j7j72O1l00M05k54q7J43L61m02J68L2
$$ 11 78 217 56 -115 242 28 159 111 86 49 180 163 -9 52 -248 157 -97 -184 -41 320 -82 86 118
6526A18l01j47K85L40l15K23r4j01M5j12Q1l2O0r5J52O4k29O2J0qO1j36K63j95
$$ 118 -183 -330 -45 295 -20 203 109 8 53 -59 22 -10 50 -45 107 171 -58 4 14 6 67 -69 194 -1
6550aj17J5M9JJ3O6nj5n1j43J59L7J33k70j20J93Q9j22M1j42L31o7j96P1Q1k5
$$ -1 -118 -103 -54 -53 -40 26 21 6 -45 -188 -29 8 141 -129 -249 -56 33 -89 -48 -190 141 74 -122 -51 30 5
6576EK64l29J59j42o3J4J3K63l16J27j39L00k94J04q3K32k71R5K88j52j81Rj78
$$ 5 269 -60 99 -43 -106 -92 -79 184 -132 -5 -144 156 -138 -34 -117 115 -156 -61 227 75 -106 -97 -275
6599b75K97j74RP7P1Mk3m0M8jj51j72K64R2j96K50M9K72l12j73r9J54J30O4k22
$$ -275 22 -152 -143 -66 5 9 -14 -54 -6 -7 -158 -330 -66 26 -170 80 129 401 89 -84 -183 -29 101 165 -57
6624e7J36rMj70J8N0j15L04q0r7l9L0k7J20k27l71M68N0L04l03k30M27r1J39j84
$$ -57 79 70 74 -96 -78 -28 -143 161 81 -16 -55 -25 -52 68 -159 -530 -62 -12 292 -11 -241 186 95 234 50
6649E0m5R4K8k53o2L23m4l42NL74k24L6o5L27q1j97J73k03j72N45k86JK29k9j2
$$ 50 5 99 127 -126 -188 135 91 -251 -246 128 -96 -60 -125 202 121 -76 97 -106 -278 267 -19 -18 211 182 170
6674A70j97J22L1j29j36K08n5L0p0P2J16j35J04J00l97J88k48L70Lk50L36j80
$$ 170 -27 95 126 -3 -139 69 14 44 -26 46 162 27 131 231 -166 22 -226 144 147 -103 233 53
6696E3l9J86m0J8n7k04J33j66rl9K92k23K7l4L43l43L38r5q2j85J16J64j24J2
$$ 53 14 200 160 178 121 -83 50 -116 -125 -164 128 -95 -68 -102 241 -102 236 141 59 -126 -10 154 30 42
6720D2J4k18K26p3J17Q2p0k48k0J41L5n1k16M28L7J02l53k3J42qM4o0Q6o5k17
$$ 42 56 -162 64 -9 108 190 120 -128 -148 -7 28 -23 -239 189 226 328 -25 -48 94 86 130 70 156 91 -126
6745a26K78l40Q9L5N18l23k20J99l53L53k2r8L6N3l7lp6K69l08J34M8m4j03pK08
$$ -126 152 -188 -99 -64 454 131 -89 110 -243 110 88 -10 26 79 42 39 -37 232 -76 58 106 62 -41 -48 160
6770A60j48Q7j52J56J4J3j66k5j3R6l8J11Kr8o4Q4M8j46K4K49m28J27J5L41k73
$$ 160 12 99 -53 103 117 130 -36 -61 -74 22 -16 95 97 -1 -65 19 67 -79 -55 194 -234 -107 -92 249 -24
6795b4j75J96J77Ok97J01P5j81j5K3L5L02Lj84j50J79p9K4J45m86L47k50L83l04
$$ -24 -199 -3 174 180 -117 -16 59 -122 -137 -114 -79 223 226 42 -108 71 -8 16 161 -325 22 -228 155 -149
6819a49K52j14j28K3K60j24O1q3n9O1K58j23m1j00J71J3k24J48j32K25l91M22
$$ -149 103 -11 -139 -116 144 20 81 -2 -61 0 258 135 94 -6 165 178 -46 102 -30 195 -196 226
6841B26j14k67j1N25n03L00m11J98J08n4p7K18J59k48J39j89k08K49pkJ97p0k42
$$ 226 112 -155 -166 359 -144 156 -255 -57 51 -3 -80 138 297 49 188 -1 -209 40 33 31 228 158 -84
6864h4J43J0j17L37k35L15m63k0k9K42J37m34L04r6L50m30K35j86j16J71j50J49
$$ -84 59 69 -48 289 54 369 -94 -114 -143 99 236 -198 106 10 360 -70 165 -21 -137 34 -116 33
6886C3j07L1K33j71q8L94k23k2q9k7J12k44L50l16J75K03k94r3L37l63K92k56
$$ 33 -74 -43 190 19 -69 325 102 80 -9 -36 76 -168 182 -134 41 244 -50 -143 194 -169 123 -133
6908a33l5L23N7m29M01Mk48J87j5m8P9k73K32Q2k6k62K7j14K13J17j87J18K04
$$ -133 -168 155 212 -217 184 188 -60 127 112 64 143 -130 102 184 158 -104 -77 -191 22 139 -48 70 274
6931B74l77J45o1J99qj64o4J80k34p2K28Q0j17J50q0j42m6O3j83L0L39j12L8j30
$$ 274 -103 42 -19 180 172 8 -56 124 -110 -182 46 126 9 159 79 -63 -109 -46 -229 -199 140 28 66 -64
6955f4L43n58N6R2J88j58m1j75J00L65K23j93j32o9K9j01J14l1j39L76j61L33
$$ -64 279 -279 -223 -131 57 -101 -142 -317 -217 148 371 178 46 -23 6 -95 19 -12 -151 225 64 397
6977C97m94J70j34J23Q6r3m2r5J54n9k59M58k00j08J58j35J30J6N5J2j86L03j46
$$ 397 -97 73 -61 62 148 55 13 -82 72 13 -246 212 12 -96 62 -73 57 73 128 140 -46 257 111
7000A11k33J83J08j41j12J99n9j41J65q9k5R3j35J88l17Q0J14l6M0J22j68j90
$$ 111 -122 61 169 28 -84 115 56 -85 80 -9 -34 59 -76 112 -205 -125 -11 -47 -7 115 -53 -243
7022b43K61Nj43m2L0J78O4p8o3J1j49P6K19k06j83j04K18j14L70J08N1j51l37
$$ -243 18 23 -120 -162 -132 46 110 32 -31 -20 -169 -93 126 -80 -263 -367 -149 -263 107 215 266 115 -222
7045b22K29J00k16N1Q4k07L54l77L18L7r9j0K9M8l33K95j86m9M4J7p0j83L20M
$$ -222 7 107 -109 -58 26 -181 173 -204 114 151 52 42 71 119 -214 81 -105 -154 -110 -93 -163 -346 -26 -22
7069b2j39K20r8M1k17J15Q6k90J41j04L5L12j28L53j99j62N8K3j11P3j90O0L53
$$ -22 -161 59 -39 2 -215 -100 -14 -304 -163 -267 -232 80 -48 305 106 -56 2 25 -86 -13 -203 -143 210
7092B10k19rj7n0J13L08k55R7k89K98k22k2k20L38N4l66K34k5j33J65J81l13M1
$$ 210 -9 -18 -35 -85 28 336 81 178 -111 187 -35 -57 -277 61 115 -251 -17 -42 -175 -10 171 -142 -101
7115a01K57q1k98J21J59j14OJ1N5j57Q3N9k11L24J44j61k03K09l3J97m58P0L85
$$ -101 156 75 -223 -102 57 -57 -51 -40 15 -142 -59 0 -211 113 257 96 -107 102 69 266 -192 -122 263
7138B63k99K15j8k61J39Kj17J19k54P5r6J21K11j09J55j99J22q9q6J42Oj89O5
$$ 263 -36 179 161 -100 39 41 -76 43 -211 -136 -232 -111 100 -9 146 -53 69 -20 -106 36 42 -147 -82
7161h2J09J19Q1j2j44j86J67J46j48l4l3P9J3j57M0j49K38J25l5M1k07M4R9r9
$$ -82 27 146 227 215 71 -115 52 198 50 16 -17 62 75 -82 -42 -191 47 172 137 178 -29 15 114 15
7185A5N7k45J59p2q3J27O9j89J17J4j06O5K0m2O7K35n61M01j44r3j04J71L35k96
$$ 15 72 -173 -14 -86 -169 -42 27 -162 -45 -31 -137 -72 -52 -94 -27 208 -353 48 -96 -189 -293 -122 213 -83
7209h3J57j50Q7J34l8k45Q6N5K15k88M7P5O1j18l1R2q0J38j36MR9j91mR0L74l57
$$ -83 74 -76 11 145 107 -138 -52 3 218 -70 -23 52 113 -5 -36 56 -24 114 -22 -18 81 -110 -114 -24 350 -7
7235gj9P7j18J28k08M15l59J88P0j78N5m5O0l8J36j26L18m79K52n9j81K2P9l7
$$ -7 -26 51 -67 61 -147 268 -91 97 167 -11 44 -1 59 21 157 31 349 -130 122 63 -118 -96 -17 -54
7259e4K9N0j15L16k83J42r7j82K05j00L50k80K12m42j4K13M4L2R5j3j99J97j27
$$ -54 -25 25 -90 226 -57 85 -12 -194 11 -89 261 -19 193 -249 -263 -50 -6 26 121 108 -91 106 -21
7282b1j14N11l19q1j33j9K12k5p3M1J27m1j50J33O0j03L3NJ73j18k7J13m67N51
$$ -21 -135 376 57 -24 -157 -176 36 11 -62 -21 106 65 -85 48 108 5 38 43 216 98 71 184 -283 268
7306B68k27j50J09L3J3j35J81O1n10J34L01k16N6n4L8K6J53J3j45M1K9l0J07j00
$$ 268 41 -109 0 33 46 -89 92 153 -357 -223 78 -138 -82 -136 -98 -72 81 94 -51 -10 19 -11 96 -4
7330dj18J61j24O1J28j24P1q1M6J57k84L69l60j17M32m23K81l66K29K65k59K21
$$ -4 -122 39 -85 -24 104 -20 51 -30 16 173 -111 258 -102 -219 213 -210 71 -295 -66 199 -60 161
7352A61n8r1j61R3P9l5J02k8j43J69j95K78j40L00m50M7K71n03J78j0K61k01L48
$$ 161 103 12 -149 -56 23 -12 90 62 -81 88 -107 171 31 331 -119 -72 199 -304 -126 -136 125 -76 272
7375B72l95Q7J55l90J22N7j17M50j26j41N6Jq2J71j71j28K64l33K10L09m57K82
$$ 272 -123 -36 119 -271 -149 -92 -209 241 115 -26 30 31 -51 120 -51 -179 85 -248 -38 271 -186 96
7397I6k46J97j45P5k19K76j33m3J5r4J55J69R7k90P5J49L0l2j41j36n8L03l56
$$ 96 -150 47 -98 -23 -242 34 -99 -142 -127 -221 -66 103 200 -90 -15 134 164 132 -9 -145 -203 100 -256
7420b56K73j67J20nLOK11o0l45Q2K74k72j17Q1L5P0K45k62N1J50j57K47l67K67
$$ -256 17 -150 -30 -35 -32 -26 185 125 -220 -138 136 -136 -253 -172 -137 -67 178 -84 -33 117 -40 207 -160 107
7444A07l24J73Jk82M05p6k1K6oK9p2J74l04J30k05M36l57J75J07j22J06k54j67
$$ 107 -217 -44 -43 -325 80 4 -17 9 3 32 -40 134 -170 -40 -245 191 -166 9 116 -6 100 -154 -321
7467c21J64K18j06K96m22K50k09n5L08k13k7J67r6R1L5J29j41l5r3P9k42K22k64
$$ -321 -157 61 -45 251 -171 79 -130 -185 123 -90 -117 50 -46 45 80 209 68 33 -60 19 -223 -1 -265
7490b65M10k48J63O9n4J64m00p7M41m4k99J67M6j42J3j75M68k48q5J46J07j96
$$ -265 145 -103 60 129 75 239 -161 -238 203 159 -140 27 73 -69 -56 -231 237 -11 -96 50 157 -39
7512c9j29J36K11j04k6P6j46p6J55R8J85m17PL4k2JJ44l06J76P7p2l2J07K18j35
$$ -39 -168 -32 179 75 49 125 -21 -97 58 156 341 -76 -69 -35 -57 -56 88 -218 -42 35 -37 -69 38 256 121
7537A21j15j78J70L3k20L05j42l9n5L06k59J17j6j0J49l02K11j21J92l1k87j66
$$ 121 6 -172 -2 31 -189 116 -26 -65 -120 186 -73 44 28 18 167 -135 76 -45 147 116 -171 -337
7559c37J50R1rR8J83k83R0j04J62j84J88p7k3%J28j87L65n38K82L8k40M09l53
$$ -337 -187 -96 -105 -7 176 -107 -17 -121 41 -143 45 -32 -55 -55 73 -114 251 -287 -5 33 -207 202 -151
7582a51K36j82R0j09J44n3m5J65J11k67L44n08K96n9k39K02j05Q3J1R6J09k1j36
$$ -151 85 -97 -7 -116 28 -25 -70 95 206 -61 283 -225 71 12 -227 -25 -130 -47 -36 60 169 148 12
7605A2J88j71j95L06k2m2R6j71n9j6l28L42K22j33k43K22J0k15L67k07N5q3Mq8
$$ 12 200 29 -166 140 118 76 172 1 -58 -74 -402 -60 162 29 -214 8 18 -197 170 -37 18 -65 -61 -149
7629a49L67l03j10L85k64L95j73l32M24l50J54J89n7Q3m15J58k2J31q5j84L62
$$ -149 218 -85 -195 190 -74 321 148 -184 240 -110 44 233 176 259 -156 2 -20 111 26 -158 204
7650B04k06K58n3l05J97n5j22J84M8j66r2L93M8j74j76L90j55j08ok90J47J26
$$ 204 -2 256 203 -102 95 40 -82 102 150 -16 -108 285 333 159 -17 373 218 110 104 -186 -39 87
7672H7k5n3j58Q1j46J5K00J04J05j58N3r4l43N47k23J22j59%P6j93K89l72K92
$$ 87 62 9 -149 -68 -214 -199 1 105 210 52 105 11 -332 215 -8 114 -45 -45 31 -162 127 -245 47
7695D7m9P2j5k83n4L73k03K2J14L2N7j13j98M38k36R8j18r8Q9J28l0j76j88M73
$$ 47 -2 70 55 -228 -282 91 -112 -90 24 56 113 0 -198 240 4 102 -16 -114 -25 103 73 -103 -291 182
7719A82p3j57L16l21J87l1j98L7j86J57N7N5J09k7j70P6J86k84J49l09J03J19
$$ 182 109 -48 268 -53 134 103 -95 -58 -244 -87 -30 25 134 107 -63 13 199 -85 64 -245 -142 -23
7741b3J84k40K24k05J78l04J40P6pj4K41k98k00L78k09K11k02K27k19K16r5N6
$$ -23 161 -79 145 -60 118 -186 -46 30 23 9 250 -48 -248 130 -79 132 -70 157 -62 154 59 115
7763A15Ql75K0J68J55j83K06r2L0j91J45J71k06p4J32K02l43R5J1j13J1m4L75
$$ 115 123 -252 -232 -64 91 -92 114 22 52 -139 6 177 -29 -103 29 231 -112 -17 -6 -119 -108 -152 223
7786B23j32k69L28J03k24k65J47J7P6K91m14J6J88j61Pk20K99j3k08M00m02J93
$$ 223 91 -178 150 253 29 -236 -89 -72 4 295 -119 -103 85 -76 -69 -289 10 -3 -211 189 -213 -20
7808b0P3n8J10r7J31l06K29L40n98K7M10k08J3j71K32j14J3j23K64k60O6j02J89
$$ -20 53 -5 105 8 139 -167 62 402 -196 -169 241 33 46 -125 107 -7 6 -117 147 -113 -47 -149 40
7831D0P2j04M7K62k39j93K13j30MJ53r9j74J58O1m7k48K92m3r4l6J38o6j14J16
$$ 40 112 8 55 317 78 -115 98 -32 -28 125 26 -148 10 71 24 -224 68 25 -69 -105 33 -33 -147 -31
7855c1o9l3K70K1k07q5J14k5jJ85q0j17J77k60J29M8PK5o0n6L44m86J57l3R6L3
$$ -31 -100 -133 137 158 -49 -134 -20 -45 -46 139 59 -58 119 -141 -12 36 43 68 8 -48 296 -190 -33 -66 30 63
7881F3K36k55P4j46L30m56J09J4j4J25QRn3j57J30O4L9j93J56j16K42l06K21j76
$$ 63 299 44 118 -28 302 -154 -45 -31 -45 80 88 97 44 -113 17 81 120 -73 83 -33 209 -97 124 -52
7905e2N9o1m5J83q8K00k16n3p6K47j98K22l80L71j84K98l37J62q0j15L46l37K
$$ -52 7 -54 -99 84 -4 196 -20 -73 -149 98 -100 122 -258 113 -71 227 -110 52 -28 -143 203 -134 -132
7928a32M3O3J47j90M5Q7K0M4m9j4q8K19l33J04J75l13P8l8P5j9r7J90q3L57l23
$$ -132 -89 -26 121 -69 -24 63 83 127 78 64 -24 195 -138 -34 141 -172 -94 -132 -57 -76 -173 17 -66 291 -32
7953c2m0L17l94P5k07J78M2O6LL7m0j57J08J60K7j3o8j11k5q5O4J09j54L2N4k3
$$ -32 -72 245 -149 -74 -281 -103 -61 5 8 45 5 -152 -44 116 143 130 62 -49 -74 -159 -95 14 -140 -108 -54 -77
7979g7M29k85N8k17M9M0K4J80m0J39l57r6K74j49o7J07J41J82j88n4k15J82j12
$$ -77 352 67 125 -92 -43 -3 21 201 161 300 -57 -153 121 -28 -95 12 153 335 147 93 -122 60 -52
8002e2r0L18k51J27k15O7J40j71J20j08J82j43j56K03K01m7mj57K39P6k52k31
$$ -52 -142 176 -75 52 -163 -96 44 -127 -7 -115 67 -76 -232 -29 172 125 121 -36 203 279 27 -204
8024b04N8R3M7j5J42j69M0k0Q2j28L56k7l70L3K62k29o1L47l15j74MN3L44l25
$$ -204 -146 -53 -6 -21 121 -48 -8 -28 54 -74 282 255 -115 -82 180 -49 -110 237 -78 -252 -248 -195 149 -176
8048a76J8J37J33p1l2Qj10k23L33R8n2O9r6L65m99J7j45K04K53l38M59l13j42
$$ -176 -158 -21 112 41 9 17 -93 -316 17 115 63 132 36 401 -98 -81 -226 -22 231 -107 352 39 -103
8071a03K76j9m6j67J27o8L3q4n9Q2P0K88m65K12j10K02k86Mj66K38K69p9k06j76
$$ -103 173 154 108 -59 68 0 33 -51 -110 -28 42 330 -135 77 -33 169 -117 -113 -279 -41 228 149 -57 -233
8095b33J36K90j92m7K3m20N09n8r5Q8o1j66J93q2Q4J45k00K83l40O2j72L75o9
$$ -233 -97 193 1 -46 -23 -443 66 8 -87 1 -60 -226 -33 -115 -31 114 -86 197 -143 -81 -253 122 53
8118E3j93J25R6j76k3J94k05Q8l2R8L3N7L5K1R8J51m15rJ63l22J26P2J04k83L11
$$ 53 -140 -15 81 -95 -118 76 -129 -41 -73 25 58 115 150 171 269 420 5 -4 159 -163 -37 35 139 -144 167
8143A67j86O8m0J18k36j35K19Mk14M8J49K99k49o5m1K77l92K46r9j7o7J61q4n7
$$ 167 -19 49 9 127 -109 -244 -25 -21 -235 -187 -38 261 12 -53 -94 183 -209 37 -62 -79 -146 15 -69 -126
8167a26J30K64m79J51j12j16K24L71k81N9J01k19M7j25K87j43j80M24j02k71j
$$ -126 4 268 -211 -60 -172 -288 -64 307 26 85 186 -33 14 -111 176 33 -147 277 175 -96 -97
8188i7K38J14m22
$$ -97 141 255 -167
8191a67
$$ Imaginary data points
##PAGE= N=2
##DATA TABLE= (X++(I..I)), XYDATA
0@%%%%%%%%%%Pj5J6j6J6k3L1l9M7n5P0q6J02j18J34j57J88k19K50k86L27l72M24
$$ 0 0 0 0 0 0 0 0 0 0 0 7 -8 8 -8 8 -15 16 -23 24 -31 39 -47 55 -63 71 -86 102 -117 133 -153 174 -198 226
33B26m83N46o16O94p78Q70r70J082j204J336j482J638j811K000k204K430k679
$$ 226 -257 289 -327 367 -411 459 -511 571 -633 703 -779 859 -952 1048 -1156 1274 -1405
50a405K952l251L584l954M366m828N351n951O643p452Q414r581J1033j2895J5381
$$ -1405 1547 -1704 1880 -2074 2292 -2536 2815 -3136 3507 -3945 4469 -5112 5921 -6974 8407
65H407j8889K4253l3567N4263j85129Q9749K93526k45076j18696J25531Q7767
$$ 8407 -10482 13771 -19796 34467 -150662 -60913 232613 -12463 -131159 -5628 82139
76H2139r1340O723K5961k7631j3587P4237P849n3331l7436K6306M0270J7522o2142
$$ 82139 -9201 -2478 23483 -4148 -17735 56502 64351 11020 -26416 -110 40160 57682 -4460
89d460n3914L7519P3031j7627n9508r638K7474n76P010J5096l0472l4671M8936
$$ -4460 -58374 -20855 52176 34549 -24959 -34597 -7123 -7699 -689 14407 -16065 -50736 -1800
102a800M4225n1488n1719M5771M3379l6791k1548M2088L858l3548J8711K7112
$$ -1800 42425 -9063 -60782 -15011 28368 -8423 -29971 12117 15975 -17573 1138 28250
114B8250l6387j6413N3504K5489n4183l1622N3477L0020o4533l5728O5697L7146
$$ 28250 -8137 -24550 28954 54443 260 -31362 22115 52135 -12398 -48126 17571 54717
126E4717n8610l0747M8259J2880m8155l695L4327j5334k3102K7805J2455l0665
$$ 54717 -3893 -34640 13619 26499 -21656 -25351 8976 -6358 -29460 -1655 10800 -19865
138a9865p835K4303L892j1620R241J2811r581q099R304J0292O206r054k4661J1163
$$ -19865 -27700 -3397 495 -11125 -1884 10927 1346 -6753 2551 12843 19049 9995 -14666 -3503
152c503M1352j4053n1597J6862N7618k1003o1003K1699M5025m3139l6810O1936
$$ -3503 37849 23796 -27801 -10939 46679 25676 -35327 -13628 31397 -11742 -48552 13384
164A3384L1760o6068k3235N7202J0153m7673O74L1400j3680p900L3827q328m8503
$$ 13384 45144 -20924 -44159 13043 23196 -24477 -23803 7597 -6083 -13983 19844 11516 -36987
177c6987J3114N3165l408l8223m107K1181J4574M460j4448k8895J1463L6361j1406
$$ -36987 -23873 29292 25884 -12339 -16446 4735 19309 23769 9321 -19574 -8111 28250 16844
190A6844m0704R581L2989r759j7127J3298J081k4047K996K6564n996k3673R487
$$ 16844 -23860 -14279 18710 8951 -8176 5122 6203 -17844 -14848 11716 5720 -17953 -8466
203h466J4908j0335m215Q491p346l098K0721P071k6926j0472K8545J0155k6203
$$ -8466 6442 -3893 -8108 383 -6963 -10061 10660 17731 -9195 -19667 8878 19033 -7170
216g170k848K6606N25k0633K382J1813j1834j0163J7070R282k0395p039J7679
$$ -7170 -10018 16588 17113 -3520 -1138 10675 -1159 -11322 5748 15030 -5365 -12404 5275
229E275l56j8339K481J3920o34o499J772J590j180M590Q17j0113M412J3777j1096
$$ 5275 4919 -13420 -10939 2981 2347 -4152 -2380 -790 -1970 2620 3437 -6676 -2264 11513 417
244D17j4742J5815J2948j8240o595K2278J742k7190J874K6089q233j8021J6894
$$ 417 -14325 1490 14438 -3802 -10397 11881 13623 -13567 -11693 14396 6163 -11858 5036
257E036R923k2517l565K3047l655k2516J0169K1019j4091j7867J3126P567j3209
$$ 5036 14959 -7558 -11123 11924 8269 -14247 -4078 16941 2850 -15017 -1891 5676 -7533
270g533K415R700q340m959J1274l41j0304Q960J2855j3888j1023J9011M474k2917
$$ -7533 -5118 4582 -3758 -8717 2557 2216 -8088 872 13727 -161 -11184 7827 12301 -10616
284a0616K363K5055l761k1166M277J2396q668q300R527J360q953N660N181j3122
$$ -10616 -8253 16802 13041 -8125 -3848 8548 -120 -8420 1107 2467 -6486 -826 4355 -8767
298h767j566J6728p48j3711O389J2048j1603j0991J5744Q302j6632j241J9097
$$ -8767 -10333 6395 5647 -8064 -1675 10373 -1230 -12221 3523 11825 -4807 -6048 13049
311A3049m748j9252M520J4394o174r510R287P072j1677l761J0909q26q805M472
$$ 13049 8301 -10951 -6431 7963 1789 -7721 1566 8638 -3039 -6800 4109 3283 -5522 -1050
325a050O155m326k708L582j281l985N126K933r590p79J0384m177j0028R267R940
$$ -1050 5105 779 -1929 1653 372 -3613 1513 4446 -5144 -5923 4461 284 -9744 -477 9463
340I463j2070o888J3818L212j6589K108K0799m515j7644Q316J3043j2842j0177
$$ 9463 -2607 -9495 4323 7535 -9054 -6946 13853 9338 -8306 10 13053 211 -9966
353i966J2139O392j1021j515P708m898o083P858J569q654M661O833j0986m418
$$ -9966 2173 8565 -2456 -3971 3737 -1161 -7244 614 2183 -6471 -1810 5023 -5963 -10381
367a0381J5152K602j4906L275J8219p525j9141R428J4159j0578o402J2034Q01
$$ -10381 4771 7373 -7533 -4258 13961 6436 -12705 -3277 10882 304 -6098 5936 6737
380F737j1487J731Q515o093n850R423K633r450J240O730o291l044J0973n1j1890
$$ 6737 -4750 -3019 5496 -597 -6447 2976 5609 -3841 -2601 4129 -2162 -5206 5767 5716 -6174
395f174K337J0119o586r106J0761P193j3762l045J4478l244j4026N774J3529n067
$$ -6174 -3837 6282 -304 -9410 1351 8544 -5218 -8263 6215 2971 -11055 -5281 8248 3181
409C181r203P091N691r056k212J0644J16q511J952N768k062l373N32j777j456
$$ 3181 -6022 1069 6760 -2296 -4508 6136 6252 -2259 -307 5461 3399 26 558 -1219 -2675
424b675N651P52j1560j862J2644M98j0766M135Q914p993o856J1538N438j3623
$$ -2675 2976 3728 -7832 -9694 2950 3448 -7318 -3183 5731 -2262 -9118 2420 7858 -5765
438e765k157J8318J397j6904m81J1059k206n857M009J738n430P65N247m549l421
$$ -5765 -7922 10396 11793 -5111 -5592 5467 3261 -2596 1413 3151 -2279 -1514 3733 -816 -4237
453d237O859P42q208L979O814q380o104J1371O065j1740k681J0822l557j2646
$$ -4237 2622 3364 -4844 -865 5949 -2431 -8535 2836 8901 -2839 -5520 5302 1745 -10901
467a0901Q211J2405j0374q392J0958M752j0399k429Q280r10l784O048K099r211
$$ -10901 -2690 9715 -659 -9051 1907 6659 -3740 -6169 2111 1201 -2583 3465 5564 -3647
481c647N07Q595k214m322M453j593p024N253Q907r186j0226J2732R530j4499r617
$$ -3647 -3140 5455 3241 -1081 3372 1779 -5245 8 8915 -271 -10497 2235 11765 -2734 -12351
496a2351J1747M137q807J697P926l580o830N252N318n170j885M436o21j913L548
$$ -12351 -604 3533 -5274 -3577 4349 769 -6061 -809 4509 -661 -2546 1890 1269 -644 2904
511B904j316n312L238O575l463o429L699M001o345k000Q518J181q425N59O570
$$ 2904 1588 -3724 -486 6089 2626 -3803 -104 3897 -2448 -4448 4070 5251 -3174 -2615 3955
526C955j676n295J898K710k781m51N839k917r651L205R807k538p426K138N553
$$ 3955 2279 -3016 -1118 1592 -1189 -1640 4199 1282 -8369 -5164 4643 2105 -5321 -3183 2370
541B370k150j905L548j796m267P069N126p476m436N425J566k659L398pr105K36
$$ 2370 220 -1685 1863 67 -4200 2869 7995 519 -3917 1508 3074 415 3813 3806 -5299 -5063
557e063J1804l268j3508O344J3793q299j0688Q461M653r860j113J1790p2r062
$$ -5063 6741 3473 -10035 -3691 10102 1803 -8885 -424 4229 -5631 -6744 5046 4974 -4088
571d088J943N602m018o66M596l159l141N602J41p168K433R007n498q710Q633P393
$$ -4088 -2145 3457 -561 -1227 3369 210 -2931 2671 2812 -4356 -1923 7084 1586 -7124 1509 8902
587H902j2221p563J2158O753q675k825N279Q0k721K982K59n536J225O549k822
$$ 8902 -3319 -10882 1276 8029 -646 -3471 1808 1888 -833 2149 2408 -3128 -1903 4646 1824
602A824o273J968K804j945R03K909m255m685N904N933n987m655P775M085p071
$$ 1824 -4449 -2481 323 -1622 -719 2190 -2065 -6750 -846 5087 -900 -5555 2220 6305 -766
617g66n57M668k299m129N463N303p055o144O002L935o052k083L522J11j417J610
$$ -766 -1323 3345 1046 -3083 2380 7683 628 -5516 486 4421 -1631 -3714 -192 -81 -1498 112
633A12o7k830J302L430j621k533L640R4n180K093O621k947o020L861M633n777
$$ 112 45 -2785 -1483 1947 326 -2207 1433 1527 -3653 -1560 5061 2114 -3906 -45 4588 -1189
649a189l862O440K228o703J418O947l636o772M096N150m032k231M249L85m375
$$ -1189 -5051 1389 3617 -3086 -1668 5279 1643 -5129 -1033 4117 85 -2146 2103 2488 -1887
664a887K324K198m573j35N480j598o257K257M811m080k826N930J735p062M04O689
$$ -1887 437 2635 -1938 -2073 3407 1809 -4448 -2191 2620 -1460 -4286 1644 3379 -3683 -3279 3410
680C410k663n197N357L849n017j683N002j765m127L689L848n525k198N503r47
$$ 3410 747 -4450 907 4756 -261 -1944 3058 1293 -2834 855 4703 -822 -3020 2483 1536
695A536n415K660L894l395j004L578k047l917M230N254n480m363P402J908q093
$$ 1536 -3879 -1219 2675 -720 -1724 1854 -193 -4110 120 5374 -106 -4469 2933 4841 -3252
710c252j623P131M55n918J707N338l312m854L336K956k933l26J894o74l43J772
$$ -3252 -4875 2256 2711 -3207 -1500 3838 526 -4328 -992 1964 -969 -1295 599 -75 -418 1354
726A354p50k215K389L302l812l539M435J750m768k47N114j475n156K146M097l927
$$ 1354 604 -1611 778 4080 268 -3271 1164 2914 -1854 -2101 3013 1538 -3618 -1472 2625 -1302
742a302l345N075K713m627j196M611j041l491K839K707l070j206L222n94l489
$$ -1302 -4647 428 3141 -1486 -2682 1929 888 -2603 236 2943 -127 -1333 1889 1295 -2194
757b194J911K871l188j121M161j910m549K865M542l336l381M901K056o079n03
$$ -2194 -283 2588 -600 -1721 2440 530 -4019 -1154 3388 52 -3329 1572 3628 -2451 -2954
772b954N956j446m313L755K845m700k657M311J066m100N03L127j749j852K639
$$ -2954 3002 1556 -2757 998 3843 -857 -3514 797 1863 -2237 -1734 1393 -356 -2208 431
787D31l80k678L333K166m240j365M684K06n361K450O612l461o438M487L571n352
$$ 431 51 -2627 706 2872 -1368 -2733 1951 2157 -3204 -754 5858 2397 -4041 446 4017 -1335
803a335l087N890J739m927j64L426j177k762K059J685k678J025J867j997j261
$$ -1335 -4422 1468 3207 -1720 -1884 1542 365 -2397 -338 1347 -1331 -306 1561 -436 -1697
818a697K973M25l013P44K869k301k895L300K317m036o75M439j123m825J629M445
$$ -1697 1276 1701 -1312 -568 2301 0 -2895 405 2722 -1314 -1989 2450 1327 -3498 -1869 2576
834B576k201l132L758K758m261j621L824J04l250Q45K728j563j924J697k05j772
$$ 2576 375 -2757 1001 3759 -502 -2123 1701 1805 -1445 -600 2128 565 -1359 338 133 -1639
850a639J374J493k740o05L144p78l607K866M192l412l613M065K681n224j600O115
$$ -1639 -265 1228 -1512 -2117 1027 249 -3358 -492 3700 288 -3325 740 3421 -1803 -3403 2712
866B712N95n176R98L567k635k484K065J898k521J4J890j546r47K574j09k910K186
$$ 2712 3307 -1869 -871 2696 61 -2423 -358 1540 -981 -967 923 -623 -1570 1004 895 -2015 171
883A71K537l303k384M268J525m315M0M818j948n465L019L653l271k188L861O81
$$ 171 2708 -595 -2979 1289 2814 -1501 -1461 3357 1409 -4056 -1037 2616 -655 -2843 1018 1699
899A699l532M79K917j257k168K379K104k633o01J878l81j224J988k15k690N70
$$ 1699 -1833 -1354 1563 306 -1862 517 2621 -12 -613 1265 884 -340 1648 1433 -1257 -687
915f87K293j402l513L191K505l750j201L918k75m689J650M966j215m195K126L318
$$ -687 1606 204 -3309 -118 2387 -1363 -2564 1354 1079 -3610 -1960 3006 1791 -2404 -278 3040
931C040k996j773K780N37k142N55J209j126j121J397J32j498J631R79l349p01
$$ 3040 44 -1729 1051 1588 -554 1 1210 84 -1037 360 492 -1006 625 1604 -1745 -2446
947b446M092M0l873J342L893k105l477K606K213l312j190M404k5m365L19L014
$$ -2446 1646 1686 -2187 -845 3048 943 -2534 72 2285 -1027 -2217 2187 2162 -2203 -1884 1130
963A130j220j927K066Q94k085K11K290j310j818K666J003k723P08J863j959j444
$$ 1130 -90 -2017 49 943 -1142 -931 1359 49 -1769 897 1900 -823 -115 1748 -211 -1655
979a655L460Q83m023n41M113j175m900K808L455k462j972K916Q33l345j26K836
$$ -1655 1805 2688 -1335 -1876 2237 1062 -3838 -1030 2425 -37 -2009 907 1740 -1605 -1731 1105
995A105j37j889J004R67j852P68J304j409r47K389k06l043O65K960r27l377K709
$$ 1105 968 -921 83 1050 -802 -34 1270 -139 -1086 1303 1097 -1946 -1281 1679 752 -2625 84
1012H4L330l244k552K370J724k307n15K746l31k249O78J724j160j661J591L25
$$ 84 3414 170 -2382 -12 1712 -595 -1110 1636 1305 -944 -266 1458 298 -1363 228 553
1028E53j549R75L64j429o34K180R49k935M51K619j463k022K541J836k992l91K400
$$ 553 -996 -21 343 -1086 -1720 460 1409 -1526 -1075 1544 81 -1941 600 2436 -556 -947 1453
1045A453l39k964J541K636k409j395L042l66l606Q54L434j659k193K428R28k580
$$ 1453 1114 -1850 -309 2327 -82 -1477 1565 1199 -2407 -1553 1881 222 -1971 457 1385 -1195
1061a195j75K799j161j597K579N39l003qK526j019j737K271R69l257q92L532K14
$$ -1195 -1370 1429 268 -1329 1250 1789 -1214 -1222 1304 285 -1452 819 1788 -1469 -2361 1171 1385
1078A385l739R60L461r21k275J157R54j368j0J575n62j689J381O08j768J03J915
$$ 1385 -2354 -1394 2067 1146 -1129 28 982 -386 -396 1179 617 -1072 309 917 -851 -748 1167
1095A167j208j505J679Q71k427r50L480K81l176J148K517j922j987K438J595k413
$$ 1167 -41 -1546 133 1004 -1423 -2373 1107 1388 -1788 -640 1877 -45 -2032 406 2001 -412
1111d12m83K491o40k087N81J693j369o56J423n6j762O39J307j063j68J770m30
$$ -412 -895 1596 956 -1131 -550 1143 -226 -882 541 485 -1277 -638 669 -394 -562 1208 778
1128G78k150J003J806j651j163K693P13k959n45K478k41k394J136K080j147k217
$$ 778 -1372 -369 1437 -214 -1377 1316 2029 -930 -1475 1003 762 -1632 -496 1584 437 -1780
1144a780J754J142k075l75J630K60q54O05L65j107M74J405r23j628K080O11k886
$$ -1780 -26 1116 -959 -1334 296 556 -298 307 672 -435 39 1444 521 -1107 973 1584 -1302
1161a302r9K571l22k592J377K109j993k365K377J741k125l28K166m22j787R70
$$ -1302 -1401 1170 848 -1744 -367 1742 -251 -2616 -239 1502 -623 -951 1215 793 -994 -24
1177b4J094j375j80J652q13j317J057R41j862J55J939p94k054R27J876j887o41
$$ -24 1070 -305 -485 1167 354 -963 94 1035 -827 -672 1267 473 -1581 -654 1222 -665 -1306
1194a306K541N57k939J72K381r71k082J645K172k002j715K118L84k011J0J637
$$ -1306 1235 1792 -1147 -975 1406 435 -1647 -2 2170 168 -1547 571 955 -1056 -1046 591
1210E91n40p76R59j09j336J039J022r86j04J163l10k122J009K681j565k127K117
$$ 591 51 -725 234 125 -1211 -172 850 -136 -240 923 613 -1509 -500 2181 616 -1511 606
1227F06J204k524j195K511K46k269M78K152o59j881J163O79p26j12J163p43n65
$$ 606 1810 -714 -1909 602 848 -1421 -943 1209 550 -1331 -168 511 -215 -327 836 93 -472
1244d72Q74O27j725L58J589r45j598J197J251k006k79J907L41k440Q58J827j315
$$ -472 402 1029 -696 -338 1251 306 -1292 -95 1156 -850 -1129 778 1119 -1321 -463 1364 49
1261D9j740J829J550j696p03J697j73j540N90J046o69p21Q43O3j424P48Q68j302
$$ 49 -1691 138 1688 -8 -711 986 813 -727 -137 909 240 -481 362 425 -999 -251 617 -685
1279f85K8J491j029j434J250J808j569j018K358O17k745o29K971m39k293J132
$$ -685 -657 834 -195 -1629 -379 1429 -140 -1158 1200 1817 -928 -1557 1414 975 -1318 -186
1295a86J715j506j668J292J057j066k62J061m40m64Q34j4j164Q71J333j732p97
$$ -186 1529 23 -1645 -353 704 -362 -624 437 -3 -467 367 353 -811 60 1393 -339 -1136
1312a136J611L72j642J58K027o91k046J102R88j378p77J780O00j723J12J612p91
$$ -1136 475 847 -795 -637 1390 699 -1347 -245 743 -635 -1412 368 968 -755 -643 969 178
1329A78j367J512N97j093k35J262o21p54P67L51j176r7J601j122j044J269J012
$$ 178 -1189 323 920 -173 -408 854 233 -521 246 597 -579 -676 925 -197 -1241 28 1040
1346A040j661l56J796l2j924K74J841o26j610J307J402j431q55J281K88j411K68
$$ 1040 -621 -977 819 787 -1137 -863 978 352 -1258 49 1451 20 -835 446 734 -677 -409
1363d09J111r55l82Q74l64o15O39J045j480l18J500k20j345O60J540m62j720J317
$$ -409 702 -253 -635 239 -125 -740 -101 944 -536 -854 646 426 -919 -259 1281 819 -901 416
1381D16J039k064n05J880P9j562K00J148j046p63J319M39q79l74J316n03o71J147
$$ 416 1455 -609 -1114 766 845 -717 -517 631 -415 -1178 141 580 -299 -673 643 140 -531 616
1399F16R0j117N49J020j149r40J096N83j043n57J801n28j856Q40J580j286j023
$$ 616 706 -411 138 1158 9 -931 165 748 -295 -852 949 421 -1435 -595 985 -301 -1324
1416a324J693N32j469l46J583l56j010Q84Q76j223m09Q47j28o27O67L61j241m0
$$ -1324 369 901 -568 -914 669 313 -697 187 1063 -160 -569 278 150 -477 190 551 -690 -730
1434g30J355o09j429J385J510j130j181J417J71j421l78K190k76j600L26J104
$$ -730 625 16 -1413 -28 1482 352 -829 588 759 -662 -1040 1150 874 -726 -400 704
1450G04q75n43Q03O3o39L23Q44j544n6J472j09j254P52J050j015j148J752K24
$$ 704 -171 -714 89 152 -487 -164 680 -864 -920 552 443 -811 -59 991 -24 -1172 580 804
1468H04j597P23J246o77j367O07J183j449o17J721K4j488L50J146r92l80R57O24
$$ 804 -793 -70 1176 499 -868 -261 922 -527 -1144 577 601 -887 -537 609 -383 -763 194 818
1486H18r77j54P21n79m21R42L84r48j69J284j126o49J188Q26j638k68J566m44
$$ 818 -159 -313 408 -171 -592 350 734 -214 -383 901 -225 -874 314 1140 -498 -766 800 356
1504C56j520N69J364o34p24P15Q72j058m49J091l12m05M35J04k81m13O44m8r14
$$ 356 -1164 -595 769 135 -589 126 998 -60 -509 582 270 -135 300 404 123 -290 354 306 -608
1523f08O05O86j176m13J195K12j257L78J719r72q08L19N87o57n55J598l24j007
$$ -608 -3 683 -493 -906 289 501 -756 -378 1341 369 -439 -120 467 -190 -745 853 529 -478
1541d78L65P74q77m75R36J41p62N5P75j024k76J238M24j255K84R06r10r76J699
$$ -478 -113 661 -216 -691 245 386 -376 -321 454 -570 -846 392 816 -439 -155 751 -159 -1135 564
1560E64K33j224m2J280p21j208N72J487r59o49Q34L87j283O06Q29k93m56M39q9
$$ 564 797 -427 -469 811 90 -1118 -546 941 -18 -667 167 554 -729 -123 706 413 -43 396 307
1579C07m21K14O48p17l36Q63R3j403K08R20j38j087O07R26r88p54J124N90j363
$$ 307 -114 100 748 31 -305 558 651 -752 -544 376 238 -849 -242 684 -304 -1058 66 656 -707
1598g07L91J115p4j027N60J09n21p5Q78k31q16L14N53q98L1J083n34r74P20Q30
$$ -707 -316 799 725 -302 258 367 -154 -229 649 418 -398 -84 469 -429 -398 685 151 -823 -103 727
1618G27j085m87J423R3j284N65R79r06q27P01Q37r89j19P58j5j234M63P17m58
$$ 727 -358 -845 578 671 -613 -48 931 25 -802 -101 736 -253 -372 386 371 -863 -400 317 -141
1637a41k12L93K49o21pM68j03l58R09k59r15N03O28o33n06R95M06j134l78P53
$$ -141 -353 40 289 -332 -339 129 26 -332 577 318 -597 -94 534 -99 -605 390 796 -338 -716 37
1657C7M28j123K02J299p20n78J99M14n60J52Q97n35l60P37k76o26K17Q41m51o21
$$ 37 465 -658 -456 843 123 -455 -256 158 -402 -250 647 112 -248 489 213 -413 -196 645 194 -427
1677d27Q30j72j281N36R45M3j008L12Q70n67p63R19M12j044p2R33j42r08J80Q43
$$ -427 403 231 -1050 -514 431 474 -534 -222 648 81 -682 237 649 -395 -467 466 324 -584 -404 439
1697D39k42p42P45N1o51J76O45o92k3Q06l07r17O37N99p20o8R19K4j209K31Q02
$$ 439 197 -545 200 251 -400 -224 421 -271 -294 512 205 -712 -75 524 -196 -264 655 679 -530 -299 503
1718E03n77p21O32P33o36p30R13K52j046L34Q30m39l01L50J18n07L79M14l78l31
$$ 503 -74 -795 -163 570 -66 -796 117 369 -677 -343 487 48 -253 97 215 -292 87 501 123 -208
1738b08P96j75r54R1J085o96l14M00M40q85k87P86N73r03j01R98o98l93M54K89
$$ -208 588 413 -541 -450 635 -61 -375 25 465 -420 -707 79 652 -251 -352 646 -52 -445 9 298
1758B98m47L17L97m48l02K23k2l22j78P80m72k30M70K72p83J65P84k39n30K64
$$ 298 -149 168 565 117 -185 38 16 -306 -484 296 -176 -406 64 336 -447 -282 502 263 -267 -3
1778cN40p23m87R51K62p29J7K86Nm62K61M1j30j16N23o7n99M54K59k03m17J140
$$ -3 537 -186 -673 278 540 -189 -172 114 119 -343 -82 -41 -171 -287 236 169 -430 24 283 80 -337 803
1800H03o81o66M38P52n25n05P37J33r56n1O27J50n85K36O62q41k06O50N3n67N97
$$ 803 122 -544 -106 646 121 -384 353 486 -470 -521 106 256 -329 -93 569 -272 -478 172 225 -342 255
1821B55K41m01m23O35J8m98K94O66o21n09L78L00r45L17J022o94o40N80J28k92
$$ 255 496 95 -328 307 325 -173 121 787 166 -343 35 335 -610 -293 729 35 -605 -25 103 -189
1841a89m95Q85J30o44K8N70j63n90O95J56n05j0M80j54l32K75R6n60P4M09l05
$$ -189 -684 201 331 -313 -285 285 122 -468 227 383 -122 -132 348 194 -138 137 233 -327 -253 156 -149
1862a49p29M87O95m01j43N51K74j084K78P21j51j019P18L28l75q0j91K57o7j68
$$ -149 -878 -391 304 -97 -240 311 585 -499 -221 500 349 -670 48 376 1 -79 -270 -13 -80 -248
1882b48M56k40j68K91j47r9J09N74p60n2O30J40p35J26O56j38p36N30M0o75j14
$$ -248 208 -32 -200 91 -56 -155 -46 528 -232 -284 346 486 -249 -123 533 395 -341 189 229 -446 -560
1903e60Q78o8n55L56J41k24m92M84K41k96j40M09j51j85K52K0j24J13m6j93n9
$$ -560 318 250 -305 51 192 -32 -524 -40 201 -95 -235 174 23 -162 90 110 -14 99 53 -140 -199
1924a99K94Kn78L92K75k87m72M31O07m93m69O85K68m13N3K64k15m08L06L28m13
$$ -199 95 97 -481 -89 186 -101 -573 -142 465 -28 -497 188 456 43 96 360 145 -263 43 371 -42
1945d2j98L88n03j9L47K57o17jN66j29p81Q33O08p86k50M42M45p88O3M00K7p03
$$ -42 -240 148 -355 -374 -27 230 -387 -388 178 49 -732 101 709 -77 -327 115 560 -228 -165 235 262 -441
1967d41N58N8k62L6K4Mm89M89K37n45k8P41j06l89L15L79n16m32N57nk20k01N89
$$ -441 117 175 -87 -51 -27 -23 -512 -23 214 -331 -359 382 276 -113 202 581 65 -367 190 185 -35 -236 353
1990C53n36k01M08J42l81J01L85o3p60N49J36j16j50K49M2k74J29R0q1M3J52l10
$$ 353 -183 -384 24 166 -215 -114 271 208 -552 -3 133 17 -133 116 158 -116 13 103 22 65 217 -93
2012i3l74K58L63n70L16p9N17n01pL47Q3m03p0N91l45j59M24j03j85l07O69k63
$$ -93 -467 -209 154 -416 -100 -179 338 -163 -170 177 260 -143 -213 378 33 -126 298 195 10 -297 372 109
2034A09m64N37j43k57J6M59k66k10K22M69r08O2O04j36o65O86N41r30j23O03P2
$$ 109 -355 182 39 -218 -202 257 -9 -219 3 472 -436 -374 230 94 -571 115 656 -274 -397 206 278
2055B78m27j78P17m87l10K42L02m91K55J64k1l35K83K42k43q6N23j02m53K3M34
$$ 278 -149 -327 390 -97 -407 -165 137 -354 -99 65 44 -291 -8 234 -9 -95 428 326 -127 -104 330
2076C30m56j87N45P2n24Q0N61m31k81k7O38m53m8J93K52m19j62N24j10n9J75l3
$$ 330 -126 -313 232 304 -220 -140 421 -10 -291 -318 320 -133 -181 12 264 -155 -317 207 97 38 213 180
2098A80l25L53K30m36j21K88j28l46P7L13j70k23P49k77m97K45J46k51J2K91K69
$$ 180 -145 208 438 2 -119 169 41 -305 -228 85 -85 -308 441 164 -333 -88 58 -193 -181 110 379
2119C79k08l96K64J48m64kJ33K71j93j19J48p6R7R4j83k54M00K03k65j17O41Q2
$$ 379 171 -225 39 187 -277 -279 -146 125 -68 -187 -39 -115 -18 76 -107 -361 39 242 -23 -140 501 583
2141E83n79N2J22j08k81n9O37m55N0J05O7n59L67L27l27Q8O0O5k47K03J08k35
$$ 583 4 56 178 70 -211 -270 367 -88 -38 67 134 -425 -58 269 -58 30 90 155 -92 111 219 -16
2163a6KM86k65n01K66j21n5j5M68j30m42Q3K49Q8l42K43L35k65n01L42J51k72
$$ -16 -14 472 207 -294 -28 -149 -204 -219 249 119 -323 -240 9 97 -245 -2 333 68 -433 -91 60 -212
2185b12l9N93m72j47J50P2j07K09j01J87k75K22O5j65n3N08l60k07K40K00k46
$$ -212 -251 342 -130 -277 -127 -55 -162 47 -54 133 -142 80 145 -20 -73 435 75 -132 108 308 62
2206F2P4L7L08o50L01J93j22l40K51j1JJ5K0j18l85L41K15l44J22M06l94m95M03
$$ 62 136 173 481 -169 132 325 203 -137 114 103 104 119 139 21 -364 -23 192 -152 -30 376 -18 -513 -110
2229a10M15k31k11L52J05n08K01J54k30j57L98j2p0l99L43N5j44NL58m54J3K13
$$ -110 305 74 -137 215 320 -188 13 167 -63 -220 178 166 96 -303 40 95 -49 -44 314 -140 -127 86
2251H6j86mJ80K48k64k84L98Qn32K2K72Q1k10K58L19n69RL24j72j07K06J0k24
$$ 86 -100 -104 76 324 60 -224 174 182 -350 -328 -56 25 -185 73 392 -177 -168 156 -16 -123 83 93 -131
2274a31J09j81L27k05k7K39K20n37J28k18J49j42N88l37k51L63j23k08J38J76
$$ -131 -22 -203 124 -81 -108 131 351 -186 -58 -276 -127 -269 319 -18 -269 94 -29 -237 -99 77
2294G7l5r6K83j3n88J52N41k03j28j12O3K31m79L81P5l21J3K81N6k04J03P2k34
$$ 77 42 -54 229 216 -372 -220 321 118 -10 -122 -59 172 -307 74 149 -172 -159 122 178 -26 77 149 -85
2317h5j20L77j39j99l6L06k53m3L81k95k82K44J32J5M4j24K82k40ON2Rq3J61k61
$$ -85 -205 172 33 -166 -202 104 -149 -192 189 -106 -388 -144 -12 3 47 -77 205 -35 -29 23 32 -51 110 -151
2341a51j0r7M53j35p1J80k73r6j16N60k06l70M31N6l55K5J52m6k3j19L97Lj39
$$ -151 -161 -258 195 60 -11 169 -104 -200 -316 244 38 -332 99 155 -200 -175 -23 -69 -92 -211 186 189 50
2364E0l98O88m45N6J17P7k23J70J09k60J17k3J63m11N0L06j47l94N38mj06j17
$$ 50 -348 340 -105 -49 68 145 -78 92 201 -59 58 35 198 -213 -163 143 -4 -398 140 136 30 -87
2386h7M70m9l83k93N76k12j01L08K29n57RR8l2N2pj9j89L09O1r7j58K75j05j41
$$ -87 383 334 -49 -342 234 22 -79 229 458 -99 -90 8 -24 28 21 2 -187 122 183 86 -72 203 98 -43
2410d3p7J51k60MJ5M87l72j89O12R8p16K96J97k58o8J24L8j45l2K19j18P3j67
$$ -43 -120 31 -229 -225 -210 277 -95 -284 328 426 -290 6 203 -55 -123 1 39 -106 -138 81 -37 36 -131
2433a31M80k83j41J32o2L4Pp8k78K68J66K19m52J39%jk55P4K50Q0j62P2q5J18
$$ -131 349 66 -75 57 -5 29 36 -42 -320 -52 114 333 -119 20 20 19 -236 -162 88 168 6 78 -7 111
2457A11p8R0m4k38M25l17J6J58p7k74J00L97j26k74O6J31J46m79N9L1L35l11R9
$$ 111 33 123 79 -159 266 -51 -35 123 46 -228 -128 269 143 -131 -65 66 212 -267 -208 -177 158 -153 -54
2480e4P2r5J23K11k29k52J06J35K8r5j56K66j51R1J02k23J39K33l40K90j57J20
$$ -54 18 -77 46 257 28 -224 -118 17 45 -50 -206 60 -91 0 102 -121 18 251 -89 201 44 164
2502A64j85J5J34j55N9n3roJ1q6O5k15J80K50j22o7r7J71j51j7J08m6L26k36R9
$$ 164 -21 -6 128 -27 32 -21 -30 -36 -25 -111 -46 -261 -81 169 47 -20 -117 54 -97 -114 -6 -52 274 38 137
2527A37l87K49J98J44p04M66J24j40m14N07n2j66P8J6J67k58J16J91l42J37j9
$$ 137 -250 -1 197 341 -363 103 227 87 -327 180 128 -38 40 56 223 -35 81 272 -70 67 48
2548D8j41q1O0K91k75k67L14L26l62l0J42M3k27J74K35l25n7K66k61q9J42Q4n3
$$ 48 -93 -174 -114 177 -98 -365 -51 275 -87 -117 25 68 -159 15 250 -75 -132 134 -127 -216 -74 10 -43
2571d3j30K46P7k53L3K09k36j04K49j03j9j12M59m1j20k98K51k7J4L31n18R2J09
$$ -43 -173 73 150 -103 -70 139 -97 -201 48 -55 -74 -186 273 232 112 -186 65 38 52 383 -135 -43 66
2594F6Q3j92j61L34J9k56J10lj97J75J17j84N1K86k64n3l3L0L63m11J17P8q0k61
$$ 66 149 -43 -204 130 149 -107 3 0 -197 -22 95 -89 -38 248 -16 -69 -102 -72 291 -120 -3 75 -5 -266
2618b66R5L19j55l2J31R8j45j46K1J98m1r9K33k16r6M42n44j01L23J95j63k5J9
$$ -266 -171 148 -7 -39 92 190 45 -101 -80 118 77 -22 211 -5 -101 341 -203 -304 19 214 51 26 45
2641D5j28r7L2L21j42j55L64K7l80L9J67j1N4j12K2l16J71J29n9j88P7L42j63
$$ 45 -83 -180 -148 173 31 -124 240 267 -113 -74 93 82 136 24 46 -270 -99 30 -29 -217 -140 202 39
2664C9p9nOJ22M3J13o80K74J57m7j04L3K39P8r8qp1j64Q4J59j85j23L55k45J44
$$ 39 -40 -45 -39 83 126 239 -441 -167 -10 -57 -161 -128 111 189 91 83 12 -152 -68 91 -94 -217 138 -107 37
2689C7l53N40k72n8NK63J2k84O9L07l44J5j2r4l6J51J43J3j87M3k99J19J6L57
$$ 37 -316 224 -48 -106 -101 162 174 -110 -41 266 -78 -63 -75 -169 -205 -54 89 102 -85 -42 -341 -222 -206 151
2713A51j39l28J38K90m67M09J2k06Q3O7R0m09J3N18n6k10j30K20J1j06J72k99
$$ 151 12 -316 -178 112 -355 54 66 -140 -57 10 100 -309 -296 222 166 -44 -174 46 57 -49 123 -176
2735a76J05p3L15J14l22K56k70r2K39k45M02l81M2J18L0j83M07k38j47J81k09
$$ -176 -71 -144 171 285 -37 219 -51 -143 96 -149 253 -128 -86 32 62 -121 286 48 -99 82 -127
2756a27K2j56K90J08j8l60J92r8J38j27L6N6L04l91K71j85j06J23L4j06N7J6k53
$$ -127 -105 -261 29 137 119 -241 -49 -147 -9 -136 -100 -44 260 -131 140 -45 -151 -28 6 -100 -43 -27 -280
2779b80N45j12r3O1q0kj89J2P3J5M36l67l47J06O6K17J50k79K47j96L5k62K62
$$ -280 265 153 60 121 41 39 -150 -138 -65 -50 386 19 -328 -222 -156 61 211 -68 179 -17 18 -244 18
2802A8p4k23K20J02j02J0J29n15N49J4j57r9M5K43l45K24k08K70n9k05K94o4j18
$$ 18 -56 -279 -59 43 -59 -49 80 -435 114 128 -29 -128 -83 160 -185 39 -169 101 42 -163 131 67 -51
2825e1j00MJ02K50l23Q6J23J82k60J22j88n0J06q1N5l47N66o0k54K81j45j99J62
$$ -51 -151 -147 -45 205 -118 -32 91 273 13 135 -53 -103 3 -78 -23 -370 196 136 -118 163 18 -181 -19
2848a9J66j81M6L5J19k07n9K75j07M4L5j90K0J11j39J93j81J59j61j93K28J09
$$ -19 147 -34 12 47 166 -41 -100 175 68 112 147 -43 -23 88 -51 142 -39 120 -41 -234 -6 103
2870A03l9j12O7J44l62n7K91K17m45p2L51n6l4K2j96K70r3M9j94K90k86L18k88
$$ 103 64 -48 19 163 -199 -256 35 252 -193 -265 86 30 -4 18 -178 92 -1 48 -146 144 -142 176 -112
2893a12J0P8K34q7j29J23qPk00N7j56K80k0k08j38K94R9j02j8n9oM6k21K58k1
$$ -112 -102 -24 210 123 -6 117 109 116 -84 -27 -183 97 77 -131 -269 25 124 22 4 -55 -61 -15 -236 22 1
2918Ak37K40K34k42O0q9J10j11p7J56j10Q9k8K70n25N88j96l11Q6J59k5j89N5
$$ 1 -236 4 238 -4 56 -33 77 -34 -111 45 -65 24 -4 266 -259 329 133 -178 -92 67 42 -147 -92
2941i2M7J64j87K50p8l74L41J10k08j70J7M07m54L20k65M1O7j44K12k2K36q2k1
$$ -92 -45 119 -68 182 104 -270 71 181 -27 -197 -180 227 -227 93 -172 -131 -64 -208 4 -18 218 136 115
2964A15l03J69r7N0J82r7O6k09K05o5L5j71K63k2l99L07L16l29j21J52j0N7k04
$$ 115 -188 -19 -116 -66 116 19 85 -124 81 16 51 -120 143 121 -278 29 345 16 -105 47 37 94 -110
2987a10J98j1k1K0J4l69K81j6k83K97k33L23k28n7L4K01P5o7N4p2r0j07K04M0
$$ -110 88 77 56 76 90 -279 2 -14 -297 0 -233 90 -138 -195 -161 40 115 48 102 30 -60 -167 37 77
3011G7j74K01k80K32j0j17L9J39j57J34j44O4r8K21j63j5K99j26j67J03L1j17
$$ 77 -97 104 -176 56 46 -71 -32 107 -50 84 -60 4 -94 127 -36 -51 248 122 -45 58 89 -28
3033b8j63J27J9k63K91o5j43M01k49J94R7l86N3K30m2L2m2k9j9J10k41j6J03J49
$$ -28 -191 -64 -45 -308 -17 -82 -225 176 -73 121 218 -168 -115 115 73 105 63 34 15 125 -116 -132 -29 120
3057A20k58J81Q2j70j85L94J42l21J56m5k68P0J1K25j13j51L7L64j30j86j2M6
$$ 120 -138 43 125 -45 -230 164 306 -15 141 96 -172 -102 -91 134 21 -130 -93 271 141 -45 -57 -11
3079a1k26K58n0K83k66j89L58q2j12J78j85r2J10M1k75K35K4J51k04k06M94l81
$$ -11 -237 21 -29 254 -12 -201 157 75 -37 141 -44 -136 -26 15 -260 -25 -1 150 -54 -260 234 -147
3101a47R8K93j59j52J25j32J6p8M6M6J45o0p8J66j43n5q0j04K09l3j04J60J0J04
$$ -147 -49 244 85 -67 58 -74 -58 -136 -90 -44 101 41 -37 129 -14 -69 -149 -253 -44 -77 -181 -21 -11 93
3125I3j12l37L96n7j37q6J77Q8j02K46l09L65k43j47j53K08j0O8J1l5r9L24j03
$$ 93 -19 -356 40 -17 -154 -240 -63 25 -77 169 -140 225 -18 -165 -318 -110 -120 -52 -41 -76 -175 149 46
3148D6j80K10l14J54Q4j04K3J04K20K4l50M8m7n2L39m38L23k91J17J23k24L51
$$ 46 -134 76 -238 -84 0 -104 -81 23 243 267 -83 -35 -82 -134 205 -233 90 -201 -84 39 -185 166
3170A66k50J76l3L2J73l53l7J59j5j93J95k80J0K41o5K65k17p6k09J33P9R2K27
$$ 166 -84 92 59 91 264 -89 -126 33 18 -175 20 -260 -250 -9 -74 191 -26 -102 -311 -178 -99 -7 220
3193B20m53L13K5k52K7J77j71R1R8k05M86k67J83k32k21N6K71k72O5K3K1j4J76
$$ 220 -233 80 105 -147 -120 57 -114 -23 75 -130 356 89 272 40 -181 -125 146 -126 -61 -38 -17 -31 145
3216A45l8L9j05L1j1j64J39j60R6NK22k11O2n2J96m21L81k9r8R9q5M4L9k87L06
$$ 145 107 146 41 72 61 -103 36 -124 -28 -23 199 -12 50 -2 194 -227 154 125 27 126 41 85 124 -163 143
3241A43J40k60J40j36k50J99J22k12K10p3j74L82l10k5j42K81J36l27J45L63l58
$$ 143 283 23 163 27 -223 -24 98 -114 96 23 -151 231 -79 -104 -246 35 171 -156 -11 352 -6
3262fq7K55k60J98j88j22J64j18K35P4l27L17Qj64k45L30J13j30m9J06j5j92J58
$$ -6 -93 162 -98 100 -88 -210 -46 -164 71 145 -182 135 143 -21 -266 64 177 47 -2 104 89 -103 55
3285E5k25K94j89n6K76j81p3p3M44l70J20k43J66J58j22K31o30O59k37qm7J05
$$ 55 -170 124 -65 -121 155 -26 -99 -172 272 -98 22 -221 -55 103 -19 212 -418 241 4 -4 -51 54
3307E4j20n0J97k67L7R6L3j00J54N1q8R5J0m4p1j40K69l8j05j56K51l65K00J19
$$ 54 -66 -116 81 -186 -149 -53 -20 -120 34 85 -3 92 102 58 -13 -153 116 78 -27 -183 68 -297 -97 22
3331B2k2o2R3J98m04J7K0M2N0m8P7L8m4N3l40K35m7L60l47J2j3K15M1k21L3R6
$$ 22 0 -62 31 229 -175 -158 -138 -96 -46 -94 -17 21 -23 30 -310 -75 -122 238 -109 -97 -110 105 146 -75 -42 54
3357E4J44m11K25J49j45k01K83j09k0J40o0k30O7K06k79M51k49j89j17K90P7K23
$$ 54 198 -213 12 161 16 -185 98 -11 -31 109 49 -181 -114 92 -187 264 15 -174 -291 -1 76 299
3379B99m70Q4o8l9M15k2j25k69J60J0m1J88j37k96L33j9pR9j3k67L16j22K9j20
$$ 299 -171 -87 -155 -194 221 199 74 -195 -35 -25 -66 122 -15 -311 22 3 -4 95 82 -185 131 9 38 -82
3403h2K01L3j62K08j82J04q3l9m1K7j78J53L3J14j83j46K85O0O3k77J81l3k09
$$ -82 119 152 -10 198 16 120 37 -2 -43 -16 -194 -41 -8 106 -77 -223 62 122 185 -92 89 56 -153
$$ [...]
8191B8
##END NTUPLES=NMR FID
##END=
