##TITLE=1H_Pr NCO-Dep
 200.13MHz, DMSO-d6,
 8 sc
 
 20.10.2025
##JCAMPDX= 6.0         $$ Bruker NMR JCAMP-DX V2.0
##DATA TYPE= NMR FID
##DATA CLASS= NTUPLES
##ORIGIN= UXNMR, Bruker Analytische Messtechnik GmbH
##OWNER= pz
$$ XWIN-NMR		Version 3.5
$$ Tue Oct 21 14:44:21 2025 Russian Standard Time (UT+4h)  she@DPX200
##.OBSERVE FREQUENCY= 200.1313
##.OBSERVE NUCLEUS= ^1H
##.DELAY= (6, 6)
##.ACQUISITION MODE= SIMULTANEOUS
##.ACQUISITION SCHEME= undefined
##.AVERAGES= 8
##.DIGITISER RES= 18
##SPECTROMETER/DATA SYSTEM= spect
##.PULSE SEQUENCE= zg30
##.SOLVENT NAME= DMSO
##.SHIFT REFERENCE= (INTERNAL, DMSO, 0, 14.3821)
##AUDIT TRAIL= $$ (NUMBER, WHEN, WHO, WHERE, WHAT)
$$ ##TITLE= Audit trail, XWIN-NMR		Version 3.5
$$ ##JCAMPDX= 5.01
$$ ##ORIGIN= Bruker BioSpin GmbH
$$ ##OWNER= she
$$ F:/spectra/data/she/nmr/H-C/1/audita.txt
$$ ##AUDIT TRAIL=  $$ (NUMBER, WHEN, WHO, WHERE, WHAT)
(   1,<2025-10-21 14:42:32.68 +0400>,<she>,<DPX200>,
      <created by zg, POWCHK disabled, PULCHK disabled
       configuration hash MD5:
       00 E9 B6 7A A2 85 ED C7 34 08 36 98 17 FE 4E 26
       data hash MD5: 16K
       FE 5F 76 4D 5B 18 54 11 6F 1B F0 22 5D 5B 2D DF>)
$$ ##END=
$$ 
$$ hash MD5
$$ 2B 1B B4 CD 1C 7C 52 E1 62 24 44 CA 12 BF 4C 50
##$RELAX= 
##$RELAX= 
##$RELAX= 
##$RELAX= 
##$RELAX= 
##$RELAX= 
$$ Bruker specific parameters
$$ --------------------------
##$DU= <F:/spectra>
##$EXPNO= 1
##$NAME= <H-C>
##$PROCNO= 1
##$TYPE= <nmr>
##$USER= <she>
##$AMP= (0..31)
100 100 100 100 100 100 100 100 100 100 100 100 100 100 100 100 100 100 
100 100 100 100 100 100 100 100 100 100 100 100 100 100 
##$AQSEQ= 0
##$AQ_mod= 1
##$AUNM= <au_zg>
##$AUTOPOS= <>
##$BF1= 200.13
##$BF2= 200.13
##$BF3= 200.13
##$BF4= 200.13
##$BF5= 200.13
##$BF6= 200.13
##$BF7= 200.13
##$BF8= 200.13
##$BYTORDA= 1
##$CFDGTYP= 0
##$CFRGTYP= 5
##$CHEMSTR= <none>
##$CNST= (0..31)
1 1 145 1 1 1 1 1 1 1 1 1 1 1 1 1 1 1 1 1 1 1 1 1 1 1 1 1 1 1 1 1 
##$CPDPRG= <>
##$CPDPRG1= <>
##$CPDPRG2= <>
##$CPDPRG3= <>
##$CPDPRG4= <mlev>
##$CPDPRG5= <mlev>
##$CPDPRG6= <mlev>
##$CPDPRG7= <mlev>
##$CPDPRG8= <mlev>
##$CPDPRGB= <>
##$CPDPRGT= <>
##$D= (0..31)
0 0.7 0 0 0 0 0 0 0 0 0 0.03 0 0 0 0 0 0 0 0 0 0 0 0 0 0 0 0 0 0 0 0 
##$DATE= 1761043352
##$DBL= (0..7)
120 120 120 120 120 120 120 120 
##$DBP= (0..7)
150 150 150 150 150 150 150 150 
##$DBP07= 0
##$DBPNAM0= <>
##$DBPNAM1= <>
##$DBPNAM2= <>
##$DBPNAM3= <>
##$DBPNAM4= <>
##$DBPNAM5= <>
##$DBPNAM6= <>
##$DBPNAM7= <>
##$DBPOAL= (0..7)
0.5 0.5 0.5 0.5 0.5 0.5 0.5 0.5 
##$DBPOFFS= (0..7)
0 0 0 0 0 0 0 0 
##$DE= 6
##$DECBNUC= <off>
##$DECIM= 32
##$DECNUC= <off>
##$DECSTAT= 4
##$DIGMOD= 1
##$DIGTYP= 9
##$DL= (0..7)
0 120 120 120 120 120 120 120 
##$DP= (0..7)
150 150 150 150 150 150 150 150 
##$DP07= 0
##$DPNAME0= <>
##$DPNAME1= <>
##$DPNAME2= <>
##$DPNAME3= <>
##$DPNAME4= <>
##$DPNAME5= <>
##$DPNAME6= <>
##$DPNAME7= <>
##$DPOAL= (0..7)
0.5 0.5 0.5 0.5 0.5 0.5 0.5 0.5 
##$DPOFFS= (0..7)
0 0 0 0 0 0 0 0 
##$DQDMODE= 0
##$DR= 18
##$DS= 0
##$DSLIST= <SSSSSSSSSSSSSSS>
$$ [...]
##$SUBNAM0= <"">
##$SUBNAM1= <"">
##$SUBNAM2= <"">
##$SUBNAM3= <"">
##$SUBNAM4= <"">
##$SUBNAM5= <"">
##$SUBNAM6= <"">
##$SUBNAM7= <"">
##$SUBNAM8= <"">
##$SUBNAM9= <"">
##$SW= 18.0517328524113
##$SWIBOX= (0..15)
0 0 2 0 0 0 0 0 0 0 0 0 0 0 0 0 
##$SW_h= 3612.71676300578
##$TD= 16384
##$TD0= 1
##$TE= 0
##$TE2= 300
##$TE3= 300
##$TEG= 300
##$TL= (0..7)
0 120 120 120 120 120 120 120 
##$TP= (0..7)
150 150 150 150 150 150 150 150 
##$TP07= 0
##$TPNAME0= <>
##$TPNAME1= <>
##$TPNAME2= <>
##$TPNAME3= <>
##$TPNAME4= <>
##$TPNAME5= <>
##$TPNAME6= <>
##$TPNAME7= <>
##$TPOAL= (0..7)
0.5 0.5 0.5 0.5 0.5 0.5 0.5 0.5 
##$TPOFFS= (0..7)
0 0 0 0 0 0 0 0 
##$TUNHIN= 0
##$TUNHOUT= 0
##$TUNXOUT= 0
##$USERA1= <user>
##$USERA2= <user>
##$USERA3= <user>
##$USERA4= <user>
##$USERA5= <user>
##$V9= 5
##$VALIST= <valist>
##$VCLIST= <CCCCCCCCCCCCCCC>
##$VD= 0
##$VDLIST= <DDDDDDDDDDDDDDD>
##$VPLIST= <PPPPPPPPPPPPPPP>
##$VTLIST= <TTTTTTTTTTTTTTT>
##$WBST= 1024
##$WBSW= 4
##$XGAIN= (0..3)
0 0 0 0 
##$XL= 0
##$YL= 0
##$YMAX_a= 187311
##$YMIN_a= -466057
##$ZGOPTNS= <>
##$ZL1= 120
##$ZL2= 120
##$ZL3= 120
##$ZL4= 120
##$ABSF1= 10
##$ABSF2= 0
##$ABSG= 5
##$ABSL= 3
##$ALPHA= 0
##$AQORDER= 0
##$ASSFAC= 0
##$ASSFACI= 0
##$ASSFACX= 0
##$ASSWID= 0
##$AUNMP= <proc_1d>
##$AZFE= 0.1
##$AZFW= 0.1
##$BCFW= 1
##$BC_mod= 2
##$BYTORDP= 1
##$COROFFS= 0
##$CY= -3
##$DATMOD= 1
##$DC= 2
##$DFILT= <>
##$DTYPP= 0
##$F1P= 0
##$F2P= 0
##$FCOR= 0.5
##$FTSIZE= 0
##$FT_mod= 4
##$GAMMA= 1
##$GB= 0.15
##$INTBC= 1
##$INTSCL= 1
##$ISEN= 128
##$LB= 0.25
##$LEV0= 0
##$LPBIN= 0
##$MAXI= 10000
##$MC2= 0
##$MEAN= 0
##$ME_mod= 0
##$MI= 1.114404
##$NCOEF= 0
##$NC_proc= 0
##$NLEV= 6
##$NOISF1= 3.799351
##$NOISF2= 2.8
##$NSP= 1
##$NTH_PI= 0
##$NZP= 0
##$OFFSET= 14.38212
##$PC= 1
##$PHC0= -2284.024
##$PHC1= 18.39226
##$PH_mod= 1
##$PKNL= yes
##$PPARMOD= 0
##$PSCAL= 0
##$PSIGN= 0
##$REVERSE= no
##$SF= 200.129724274929
##$SI= 16384
##$SIGF1= 3
##$SIGF2= 2
##$SINO= 400
##$SIOLD= 16384
##$SREGLST= <1H.CDCl3>
##$SSB= 0
##$STSI= 0
##$STSR= 0
##$SW_p= 3205.1282051282
##$SYMM= 0
##$S_DEV= 0
##$TDeff= 0
##$TDoff= 0
##$TI= <>
##$TILT= no
##$TM1= 0
##$TM2= 0
##$TOPLEV= 0
##$USERP1= <user>
##$USERP2= <user>
##$USERP3= <user>
##$USERP4= <user>
##$USERP5= <user>
##$WDW= 1
##$XDIM= 8192
##$YMAX_p= 0
##$YMIN_p= 0
$$ End of Bruker specific parameters
$$ ---------------------------------
##NTUPLES= NMR FID
##VAR_NAME=  TIME,          FID/REAL,        FID/IMAG
##SYMBOL=    X,             R,               I
##VAR_TYPE=  INDEPENDENT,   DEPENDENT,       DEPENDENT
##VAR_FORM=  AFFN,          ASDF,            ASDF
##VAR_DIM=   8192,          8192,            8192
##UNITS=     SECONDS,       ARBITRARY UNITS, ARBITRARY UNITS
##FACTOR=    0.0002768,     1,               1
##FIRST=     0,             0,               0
##LAST=      2.2672688,     0,               0
##MIN=       0,             -466057,         0
##MAX=       2.2672688,     187311,          0
$$ Real data points
##PAGE= N=1
##DATA TABLE= (X++(R..R)), XYDATA
$$ [...]
1896f3m04j22Q05l34J33M53n13j97K27j8j78k3R56o03m32L25K2l02O30M24o15
1917A71m63K02nj46L51K03m08m50N90n30l12Q89J01J29l83l4m53K52J162o6r94
1938a94K79K21p42K9Q00L55q76L50K21r60n5R64k51o7K19n93r25N13Q65p8j75
1959a00M55p15n66J070L61n15M92R19q47j201K49N25k57M77M58r85j096J120o7
1978b23j63Q08K6o40n20N82m82j09J009M10k60m11j2r03N57J849k14j384j02O62
1998D80o82K58N60k67n36O35k99j605M44J298n3k12O78r12j004O95J138k84k08
2017A24L39m57j046J126M67o48N84J285j033j219K83J66j29J067q5j515q00J423
2035f8O3p26R78L67j339J57N26n42N7J240L41j157j66J46o22N71J561r0j785M71
$$ y = [-63, -467, -589, 216, -118, 15, 468, -45, -242, -15, -33, -211, -234, 722, 119, -313, 12, 34, -268, 362, 786, 171, -292, -90, -95, -241, 110, 313, -95, -545, 45, -485, -797, 92, 193, 322, -61, -95, -548, -296, 866, 800, -194, 85, 306, -436, -407, 393, 748, -128, 222, 443, -517, -572, 392, 141, 74, 293, -300, -1225, -712, 153, 75, -100, 355, -360, -926, 144, 505, -10, 482, 1401, 554, -647, -398, 127, -130, 347, 805, -180, -1276, -156, -223, -386, 422, 448, -192, -712, -130, -612, -721, 288, 698, 438, 27, 15, -888, -331, 1518, 1304, -80, -182, 480, -202, 56, 616, 349, -187, 448, 149, -1456, -1012, 286, 233, 21, 699, -213, -1217, -522, 616, 332, 124, 463, 6, -1040, 86, 553, -95, 489, 1774, 741, -478, -195, -29, -158, 909, 824, -691, -1491, -68, -5, -731, 247, 614, -725, -568, -42, -584, -527, 713, 1054, -103, -269, -123, -745, -174, 1387, 1297, -488, -17]
2055a7K36p40K00R83n82q34J058k60j465M66J112J73k96q3l98q83J134J295p61
2074C38l24O83l19p94O47J06l76M26L84n61j188N57M86o9K72M27j754m14J331
2093a42Qj74L10M61q83K10M77p17k57J904l3j159k25L02j1j5J020o24r08O9M59
2114G2l63k59O35M07q00K26j79o22L51J094l32l33J85o59k0M29J350o80o84Q62
2134F80l22n29r7P18m60K03K20m50r17N46N37o4K21J75r35l49P23K23k98M04J76
2155D05o90j88O02j99k68R23o4m31n02L17L2L35M92m32o82NL15l16o9M99N2k34
2177i8J12P3j84l5M78Q2n44Q0R8o39N48L73j98l08K14l2k51N30j90j89L12K64
2199D96o57p53Q33M52l17J33j22j09l97O15J86m15J67J09m82J43kL74l18O0J05
$$ y = [-17, 219, -521, -321, 662, 80, -754, 304, 44, -1421, -955, 157, 330, 34, -49, -447, -1330, -196, 1099, 338, 14, 697, 378, -416, 231, 337, -39, 387, 771, 210, -978, -421, 65, -4, 268, 695, -1059, -1473, -142, -134, -308, 2, 463, -420, -210, 267, -450, -707, 1197, 1164, 5, -220, 82, 71, 56, 1076, 452, -456, -387, 72, -291, -550, 85, 492, -308, -82, -261, -883, -532, 562, 230, -103, 82, -577, -597, -168, 1182, 502, -182, 680, 358, -171, -268, 450, -10, 193, 413, -37, -954, -408, 129, 65, 286, 461, -474, -823, -100, 123, -175, 229, 405, -285, -473, 129, -70, -338, 585, 521, 90, -412, -95, -63, 272, 764, 332, -350, -345, -30, -346, -415, 84, 136, -98, 14, 87, -97, -132, 346, 428, -116, -36, 62, -577, -29, 344, 146, -162, 52, 20, -231, 299, 109, -80, 232, 496, -161, -914, -81, 371, 54, 187, 65, -44, -441, 174, 360, -55, 112, 221, -261, -118, -120, 254, -64, -4, 101]
2220A01r4n2J31L4J1J42j19l77M3M8o9J1L28j13j43j39N17l69Q3L24k20q1l9R6
2244E4k14P4J15j47J11J15q4j73O4J97J48k42L58j22k26j04o4L43l27p5L43l66
2266b22J76R9r0L41J66l88j00j62P3P8n0J46j07Lm1J52J18k00K01k11l8J49L0
2289A23J5m4N3l04N0j21L73j87J19K71n9k07K33l66L26k33o3j63M9R8j40M82r8
2312B07k02K57k31o3J42l64K02n3J26m1Nl82M23J01j19j33K06j02P8J62j20o6
2334C3j07J36j77R9K25k46Q7J89k19j2K19j49k9K16ko05J60K17mJ10k51K26l50
2357b34L10n8j61jK03J69k73MR6m01K67Q4K36k03j61K62k59K3J07M18l86q0J68
2380A30k79k74J53M77l99K04k1j30O1K00Pr9L55j76m77j82N64K2q2j02N7l86J99
$$ y = [101, 7, -45, 86, 120, 131, 273, 154, -223, -180, -132, -201, -190, 138, 25, -118, -257, 260, -109, -26, 298, 78, -3, -42, 54, -160, -86, 29, -118, -7, 108, 24, -149, -85, 112, 260, 18, 376, 254, 28, -76, -140, 203, -124, -199, 144, -222, -46, 53, -37, 304, 470, 82, -18, -180, -107, -29, -79, 67, -40, -37, -78, 74, 192, -8, 193, -18, -56, 93, 123, 138, 94, 147, -157, -107, -228, 145, -42, 77, 348, 289, 82, 315, -51, 275, 42, -21, -184, -135, -37, -177, 305, 207, 5, 262, 31, -32, 110, -254, -52, -105, 21, -20, -15, -397, 26, 127, 8, -125, 81, -21, 57, 219, 99, 33, -74, 62, -115, -16, 209, -37, 50, 239, 20, 8, 227, 78, 49, 265, 263, -342, -182, 35, 31, 141, -110, 116, -234, 76, 18, -143, -144, 59, 228, -45, -41, 55, -346, -79, 5, 241, 38, -123, 139, -120, -97, 10, 428, 42, -38, 130, -149, -423, -270, 207, -192, 12, -9, -139, -78, 122, 129, 30, 385, 209, -268, -450, 114, 136, 54, -48, 9, -377, -178]
2403a78K33l2j85O13k87p63L38L38k01K07J31j85j05N0R1m18M33Q07n21o63R9
2424a98K00j10M59Q2m41l04K29p1m02P99J07m69K7J61k24l16N40L42n08n0J35
2445a2m84L20P12j66l45K37J04n02j45N73k05j47L40J70j195J85N60J89j19J38
2465B08j07p66L94M97m31P7L71j06m95K9M80j46K26L60m8r63L88L0j25L76L66
2486F15j054k23O46r2m69P54L06p36K88J32o33n27J209M53n62j29n8k97J38P59
2506E20J86j122P78L8p13M5N42j11q7J92m81l76k61J029O0l94L19l94p67Q16O17
2527D36k35j45N08m87m48L46R6L2J62R95r94o18J84J04k35N02M77r98k79L14J00
2548a83o37O76N21n28k9L99l61l09P83N83o69k30o6j57K12P46r5j052L07K01m98
$$ y = [-178, 55, 23, -162, 451, 164, -599, -261, 77, -124, 83, 214, 29, -76, -26, 65, -353, 80, 887, 366, -297, -198, 2, -108, 351, 433, -8, -312, -83, -154, -556, 243, 350, -119, -92, 69, -155, -471, 69, 411, -97, -147, -12, -496, -176, 536, 370, 25, 262, 366, -136, -281, 292, 87, -60, 280, 450, -745, -560, 0, 189, 70, 208, 101, -665, -271, 226, -205, -128, 243, 137, -358, -329, 151, 5, 231, 591, 543, -420, -32, -2, -127, 249, 615, -439, -662, -16, -108, -577, 177, 483, -253, 35, 167, -466, -993, 216, 669, 107, -22, -80, -377, -239, 520, 706, -416, 362, 400, -313, -268, 274, 163, 76, 268, -213, -589, -850, 179, 239, -155, 164, -230, -997, -181, 436, 201, 56, 564, 77, -371, -25, 71, 103, 265, 1260, 266, -352, -168, -64, -299, 203, 680, -318, -597, -283, -183, -820, -144, 377, -151, -180, 219, -142, -451, 332, 915, 246, 16, -50, -207, 5, 751, 656, -396, -89, 112, -386]
2569c86j56O08j88j26K89k24p93L25P65K77l20l9L8o24N80M05l97j62Q77l29m95
2590g5J04J77m05M58O17q04r36N72N70l73J72K39q47J32K97o0l00L07P82n83l99
2611c55L30j43r9P75K74q87k94L28Lj16M88K40p46L20J71n69m0M05q0j86N96k52
2633A63m79j63P83M1n15M89m19j70M2O50k05l74M17M3n71J88PM25KK41q89N3K11
2656c0K03Pj12L41n59j98N02J22l47J64L45j72n15m5K21l15P12L68p62j16J41
2677d5L36k76J60jk28q2O0j27j53K50N9L24k51k63J03j33N78j14j23L1M9l83L11
2700H2j1K1KO7K3l94P6J49R7j4K4l82j82M07J51j82J82n9l00J86m4L74m96L87
2724A64P7l17r0L44q1k25J11j0pR5L2j9q7R5j14j75J79M6M1l22L06L19m43J33
$$ y = [-386, -542, 66, -122, -248, 41, -183, -976, -651, 114, 391, 71, 32, 70, -554, 26, 431, 34, -128, 749, 420, -75, 29, 206, -199, 259, 876, 72, -864, -292, 278, -95, 77, 316, -531, -399, -102, -162, -462, -155, 627, 44, -355, -25, -168, -267, 508, 782, -105, -399, -71, -68, -184, 304, 544, -202, 118, 289, -280, -320, 85, 5, -181, 415, 163, -316, -479, 304, 345, -170, 319, -100, -270, -228, 422, 217, -157, 260, 303, -268, -80, -73, 352, 354, 595, -294, -241, -30, 173, 180, 68, 409, -150, -348, 154, 276, -71, 93, 438, 266, -249, -294, -73, -388, 324, 692, -70, -186, -45, 291, 15, 175, 174, -54, -136, -76, -203, -356, -106, -47, 277, 26, -237, -134, -267, 311, 197, 74, 105, 154, -229, 82, 71, 92, 94, 161, 184, -210, -134, 15, 112, 98, 122, -260, -442, -35, 116, -66, 116, 57, -243, -57, -101, 273, -223, 164, 241, -76, -166, 178, 97, -128, -17, -27, -34, 61, 93, 74, -13, 82, -32, -207, -28, 18, 59, -263, 43, 362, -81, 52]
2748E2Q2K10k25J50p9l24M1J96j36r9L96j85O4k01N4l4p8q6J12j56N84n71J07
2771a26Q6O0p2J67j25L09l03j01j3n5K61j03K3j30PK06j82m5L79l41J96q7j15
2794a04K19l8L14k19o1l40P6J83r2r4L88m95L30k64J88R7j14P4m7j61J54j51K31
2817G4P0l33J77k56L31q4J89l21K53J10k24n2R1J25j05k25O09o14O6J35J63j48
2839C1K8K05k09N0l38L39P1j48Kj63j0L49M3m54K23L49j20m80K33j25p0J47K31
2862A84l62J12J58r6P7j97L66m62j01J12J24K84j60K07k76j42L05k36K36K63j32
2883B64l56K09n5l16K54j4Q2N4J48k84k61J7K38p2J22J01l09r0L65j26L2K08K11
2906D22m19p5Q1k6j47O31j90m67O5K69m31r1N30R3m21J75k4j21k15L64J88m8N2
$$ y = [52, 134, 344, 119, 269, 190, -134, -93, 103, -33, -132, 264, 79, 143, -58, -4, -38, -116, -202, -90, -246, 338, -233, -126, -40, 20, -52, 115, -10, 299, -4, -105, -118, -173, 88, -15, 8, -122, -115, 91, -91, -136, 243, -98, 98, 11, -104, 115, 77, 391, 172, 111, -229, -153, 30, -62, -156, 232, -263, 67, -197, -9, 88, -26, 48, 1, -160, -6, -157, 74, 144, -189, -12, -268, 63, -21, 168, -153, 100, 210, -14, -66, 25, 150, 45, -180, 429, -185, -119, 16, 179, 31, 59, 264, 55, 105, -233, 106, 177, 29, 31, -132, -142, 207, 250, -204, 19, 368, 248, -232, 1, -124, -194, -47, 184, -178, -66, 92, -4, 73, -124, 242, -220, -321, -209, -85, 199, 39, 246, -30, -172, 133, -103, 133, 396, 264, -92, 117, 62, -254, 0, -14, 68, 122, 270, -14, -275, -258, -20, -92, 30, 131, -178, -268, 97, -29, 3, 211, 422, 3, -72, 9, -17, -164, 467, 277, -190, -125, 144, -287, -378, 152, 245, -176, -1, -25, -146, -361, 3, 191, 143, 195]
2929A95r1k67J33L01j81n4j82L6j16J48J47j87J38K3k84J17j25L77k81l22M84
2950IJ12n09N10L39l88q7L89j27m75N34J68p47M85N1k57k47K06K14j42K44j63
2971A19m44k10M06r3J62J9P8l82J83L17k59j94M67Jk36R8q0k31J40M39j04k02
2993fk14J90j95J21M27l79o2J0K49m73J60L89j32k21J63m99J15L24N91n90L46
3014C14m76J45k88L70K15m72K19M12m09k21O8J12k73L92J3p18o0Q55j24k37L3
3035a30J31j10j04K83j51O4M90k41l24J06j50J20K16J46m3p86O05j32j64K50J26
3056B02j20k75K09p8l42K98L22o7k0j74l01q0M92M61k46o13O39m05k73M49o4j42
3078a28M1J29k16k38M05Jj5j01L98n14k23N63%l28k6M14n05J70M90l06j90O75
$$ y = [195, 104, -163, -30, 271, 90, 36, -146, -110, -226, -78, 69, -118, 20, 43, -241, -124, -249, 128, -153, -475, 9, 121, -388, 122, 461, 73, -14, 375, 248, -227, 307, 475, -272, 213, 264, 7, -240, -34, 180, 38, 282, 119, -325, -535, -129, -222, -60, -41, 37, -345, -162, 155, -104, -298, 169, 170, -66, 32, -48, -279, -139, 300, 196, -6, -220, -30, -225, -104, 323, -56, -118, -108, 141, -332, -172, 217, 85, -136, 27, -472, -357, -33, 558, -32, 314, -162, -17, -305, 65, 280, -192, 27, 439, 30, -191, -123, -11, -284, 108, 121, -597, -657, 198, 74, -163, -130, 1, -109, -213, 70, -81, -17, 473, 232, -92, 14, -136, -16, 200, 346, 303, -483, 122, -10, -174, 76, 202, 82, -193, 16, -62, -404, -106, 216, 149, 129, -45, -346, -426, 66, 527, 281, -332, 307, -98, -371, 78, 14, -128, -87, 42, -174, -412, -7, -6, -21, -122, 276, -238, -461, 102, 102, -226, -252, 162, -343, -173, 317, 11, -179, 496]
3100D96m93L0j73J87J47j0J79j82m94K45P3j52J10P3o76N15N8k04q4N17K03l30
3122C5j36K76J29p27L84L96l87j10R7K24l20P7K19L5k76o2R1oQ9K1j28K19k0l01
3146a81j24R5L15j72j48J52k07J81j82J61K86k60K24l17P3M8K88l62K00j21k23
3167b74J88k5J12O7J22k27j62K79k1m10N96L4l2k00k19J65O1k57L81j57j41J88
3189F8J9k14k27N15m67K92P6m4j28J22J68k28J68r3l66l5N40k21P2j98K68O3o8
3212H2KLk96L64k23Q2k99J82J17J8r8o5k2J2L67j33J8M3j17p8P7o9q1L20j99J08
3238A15n8p0k57K07N9l6pQ5l97L00J83Q4l76P5J79o4m9l45M61k96J96J26p8J35
3262A72k42L70j18R3m17J48k22L38o4j4j66L07j56j21O7k32Q8J29J38k41r7Q9
$$ y = [496, 3, 33, -140, 47, 194, 184, 363, 181, -313, -68, 5, -147, -37, 36, -640, -125, -67, -271, -355, 162, 365, 35, -101, 175, 304, -423, -39, 357, -30, -140, -43, 181, -139, -62, 157, 192, -84, -146, -55, -61, 28, 49, -79, 140, 120, -181, -305, -210, 105, -67, -215, -63, -270, -89, -271, -110, 176, -84, 140, -177, -104, -56, 232, -130, 70, -51, -274, -86, -111, 1, 68, 190, -37, -199, 80, 59, -351, 245, 279, 247, 47, -172, -7, 54, -203, 178, 21, -120, 68, 87, -127, -354, 161, -306, -14, 62, 18, -110, 12, 180, -48, 120, 27, -339, -374, 166, -55, 17, -181, 87, 150, 82, 84, 87, -209, 155, -68, 14, -285, -103, 14, 32, -66, -131, -153, -141, 226, 93, 111, 154, 37, -41, 36, -33, -114, 206, 7, 115, 57, -13, -270, -63, -4, -40, -47, 38, -359, -59, 124, 208, -168, -93, 86, 22, -27, -372, 89, -207, -11, 115, 37, 172, -70, 300, 182, 275, -142, 6, -216, 122, 58, 44, -122, 185, 29, -92, -25, -257, -169, -40, 98, -143, -240, -151]
3284a51K98j35J38p9N1l9k95M27j71JP6r4P3l51K64Mq1J25O5J00Mk04j5j66q3
3309b38O4K42k2J50pk38L75l67L4K5n3j95L80o7k40o4L42M2j93J94l24M43j44
3332A39J22l80J49R5n9j3P3J41m72J09RL1K32R1j30l69J60J60j24O4J16l39nk6
3356b26L11N6o4n6L05l08p9Q9m9K03k41M3Qj58J34J31k96L52m15K49j18nk1Q1
3380g4K03J52j82m6k00P1j45K52n1k93K03n6J90P8J53m68K15L9k22O7J98K4k25
3403a17J81j40q5r0K63J58j80j59j4L03j26m63Q77n58j40L38QQ3J3m20L43J43
3425B18m7j02K3m09L65K9O9k79J91j8l04K21J24o7Q0j70J54k62K13J83k96K80
3447A96k25K17k10k75O26k89LK1k17m4J4J36O9J01l21J2J4rJ97L8k83K05J35n9
$$ y = [-151, 147, 12, 150, 71, 122, 83, -212, 215, 44, 45, 121, 27, 100, -251, 13, 17, -64, 61, 126, 226, 230, 26, 11, -155, -238, -174, 68, 46, 196, 189, -49, 326, -41, -7, 18, -35, -230, 150, 83, -157, -221, 121, 163, -30, 164, -160, 283, 139, 261, -119, 30, 125, 66, 53, 126, 267, -205, -96, -87, -56, 176, 267, 137, -232, -72, 88, -36, 28, 144, -195, -200, -226, 85, 141, 77, 21, 326, 18, -61, 28, -21, 182, -59, -16, -8, -166, -32, 99, -197, 155, -260, -11, -129, -134, -155, -74, 129, 281, 99, 53, -147, -76, -221, 31, -20, -313, -110, -166, 24, 102, 255, -213, 2, 41, -181, -114, 84, 108, -117, 64, -76, -161, -251, 12, 170, -10, -169, -183, 120, -6, -469, 408, -150, -290, 48, 56, 139, 152, -268, 75, 218, 171, 69, 92, -317, 48, 77, 146, -133, 58, 40, -264, -43, 81, 14, 94, -76, 78, -184, 29, 212, -84, 196, -29, 188, -22, -297, 329, 40, 43, 64, -153, -197, -183, -47, 22, 123, -198, -186, -172, -181, 16, 54, -229, -24, 111, 52]
3471E2P4l7j12N8L15k92k83J21P4q7Q0K82m49k79M65n1K87l30J29l03J67K45l58
3494b32J24N20r3k39j24j72L85n6L57j68j33j88K03n20M11M7m6m7r0m3K3j25M68
3517B62k04Q5j89j50L4J8K76k44K31k5J76m52Q6q1K01r2J96p4k06K14J01k9j5
3540A19p9j72n2M5K10l17M14J4R3l69NP7L3P8J14r9j57p0L7K60N8kk81j52K51
3565E8Q7m68P7L04j63j27K85j49j0L90l38MrJ76l41N7L00j9J0N9m28J03J75K92
3589C25k36k88K94K3j63l4M91o96J83K90j40j68K66j7o8j2m0M7r9m6K07j02M5
3612F2J34o5n4j57k52K95L12k11j89K22k47J30K1K81k98r2J88l11K9K74N7j50
3634b1Q0k50L92k00QK74j61j00r3J3k9K01Q0j91P7J96j70J1k45J54K1J68j37l34
$$ y = [52, 126, 89, -23, 35, 350, 58, -225, -104, -30, -117, -37, 245, -204, -483, -18, -69, 218, -112, 17, -286, -119, 126, -232, -108, 412, 319, 80, -44, -216, 169, 113, 470, 302, 169, -19, 184, -336, 75, 122, 76, 29, -61, -104, -81, -206, 262, 58, 143, -46, -196, -162, -144, 132, -112, 119, 94, 270, -182, -96, -177, 24, -68, 128, 54, -152, 62, 163, 134, 119, 40, -132, -184, -139, 71, -246, 168, 182, 275, -94, -89, -12, 21, 99, 213, 114, -43, -113, -76, 184, 242, 240, -41, -193, 58, 145, -323, -246, 58, -105, -232, 53, -96, -106, 284, -54, -50, -59, 117, -224, -167, 133, 114, 124, 183, -245, -142, 33, 325, 89, -199, 95, 118, -45, -79, 412, -284, -101, 189, 49, -119, 147, 130, 62, 50, 10, 57, -42, -88, 119, 17, 62, 196, 131, 77, -80, -332, -37, 275, 64, -125, 97, -150, -20, 1, 282, -16, -108, 80, -231, -202, 72, 129, -21, 59, -191, 201, 1, 9, 283, 122, 22, -71, -58, -87, 114, 194, 3, 80, 276, 106, 117, -128, 26, 47, 215, 78, -256]
3658b56J34k53M57k72K83k17J71N1P5k98J68J02j82p1J89j10L28k98o5J59j06
3679a1J46q1m2kN0p0P2R8j65L0m6j81L67l76J4K09K8Qj08R0k88J53K23r9m8J78
3705A49o6o7R1m5k7k31K20j95M03m96J13O3J88R2j44NK04K8m77N57k72K0k00j16
3729b03J77n2K40J37l69L43n52J16K41L2j38l4J21k01o9L39k10J9J03J39K90l76
3751I3P1k60j7k6J66J50j07j42K92k60J18J4k19L03j59j73J39K07k66M5J81k26
3773g6K14n2j3nm5m8p0nK3p2J4K24j05o7K52k07J55j99l01K45J96K08O8m18L74
3798B90k64j17K38r8k12M63j55J96l28k5j9K21l1J8l58QO11j51m56K17N8k5Mj97
3822a12K77j43p9K57j81j31j36K22J8l6m8J82q6R5r6p7J78j42J89m4k21J06n5
$$ y = [-256, -122, -375, 82, -190, 93, -124, 47, 98, 173, -125, 43, 145, -37, -108, 81, -29, 299, 1, -64, 95, -11, 135, 54, 12, 10, 60, -10, 62, 160, -5, 25, -21, -202, 165, -211, -197, 12, 40, 48, -60, 30, -258, -105, 118, 19, -29, 149, 83, 16, 107, 62, 35, -196, 24, -171, 232, -264, -151, -88, 100, 192, 48, 53, 257, 285, -192, 365, 93, 113, -87, -203, -26, -78, 162, 299, -70, 273, -279, -163, 78, 110, -28, -62, 59, -142, -211, 128, -82, -63, 40, 179, 469, 93, 164, -96, -113, -139, 27, 177, 70, -72, 220, -40, 78, 92, -127, 176, 17, -156, -17, 190, -76, -31, 150, -76, 138, 86, 73, 68, 23, -25, -95, -100, -77, -149, -135, 89, -16, -83, 169, -38, 117, -82, -383, -138, 58, 266, 334, -84, 290, 26, -91, 147, 49, -163, 300, 145, 341, 13, -12, -31, 190, 159, 177, -181, -173, 438, 287, -169, 48, 106, 81, 85, -112, 165, 22, -57, 200, 19, -112, -248, -26, -8, -44, -92, 90, 4, 99, 3, -74, 104, -38, 151, 107, -114, -8, -63]
3845f3l27M38J9k9rK0L8k09K75j87M8N6j28J19k2P2k73o9J23J0M6q5J44k3j24
3870a40K91l39K87k98J52l0Q1L07j73l70JK13j1r7m5P4L32n42L17j09K8P7P4j76
3894i6K12j74j01K71N9m81J50L16j77n1j20L26l2k42k40O64n04K59m3j36K34k7
3916F7j0j13J15j58J94j84K49q1r5j12oJ30J47R1m10j26K61j21Q9J99k92M2K01
3939G7l7r2J74l0J05n0k06J41q6j06K23k97J71J40j99Q1p0O2j18J72kk39L05n9
3963F0J16j47J9m7J02p6k12K59j62j51J48k55J08K20J08j64rKN6K7J04l04J07
3986i1M52k52J52l14J30m0k34N02k72mk00K26j5k68J48K99j24j41P7N9J61o1k86
4009i6P8n4K42J62k19Mj76K95j81j43j41L17q1J07Ok5j05J74j16J70l63K91%j39
$$ y = [-63, -390, 48, 67, 38, 29, 49, 87, -122, 153, -34, 14, 70, -58, 61, 39, 111, -162, -231, -108, -98, -52, -137, 7, -16, -140, 151, -188, 99, -199, -47, -77, 4, 311, 138, -232, -231, -18, -29, -126, -171, -97, 235, -307, 10, -99, -71, 6, 80, -96, 116, -58, -159, 112, 171, -310, -160, 156, -21, -72, -192, 134, 102, -140, -380, 284, -220, 39, -4, -140, 94, 67, 57, -56, 59, -99, 95, -89, 160, 79, -16, -128, -134, -4, 143, 234, -176, -302, -41, -162, -73, 126, -166, -124, 77, 40, -52, 122, 92, 197, 147, -59, 82, -4, -110, 113, -184, -13, 127, -72, 9, -61, 1, -117, 55, 53, -186, 119, 60, 176, 29, 48, 1, 103, 27, -185, 74, -88, -239, -91, -346, -238, -18, 90, -74, -83, -81, -25, 2, 106, -198, -91, 361, 109, 261, -53, 77, 37, -197, 305, 33, 29, -171, 55, 40, -228, -80, 219, 95, -46, 31, 90, 251, 190, -96, -18, -72, 170, 332, 113, 117, -59, 236, 55, -88, -229, 88, 7, 114, 120, 95, -10, 164, 48, 218, -145, 146, 146, 7]
4033Gk7j97J22j8J89M0k96m7L28J12k46J31m7j59K52j77o9J25j68J71J37j84K8
4056GP0j76L51j75j36J73J02K9k94L4j37p3J24K44j88J22J58k84j34J94K5Ooj8
4080A8r6kJ24p1J11L6o6K27q8l20J91o7l6q6K58l91J40N3Q3K63m01R3J87k09L6
4105a3J07J60q6r8j3J21j64j55Q2J96j70k2J74p3P2o2K6lj08p5M5j6j99K88O4
4130G8n09K32M98n71L68l8K27k55J64m3j3k79L39P3m15J03j92K46Kk47J87j07
4152a52L19kl60r1K96K18L9k95J76k21M2M3KK28l00K00m7j32k61P8J36J72j54
4175f6K1K4L6l5R2k6J16j70n2q7J97j6k3J15r3J07j42q6Q9K30k73J13m5k5j59
4200a58j55Q6J10J28OJ02p7o2n9J81l13N1l2j57K07J02L80l92K88k9l95L53P7
$$ y = [7, -20, -217, -95, -113, 76, 116, -180, -227, 101, 213, -33, 98, 51, -108, 144, -33, -102, 23, -145, 26, 163, -21, 7, 77, -99, 252, 77, -59, 114, 216, 245, -49, -15, -152, -225, -101, 143, -45, 77, 235, -49, -183, 11, 36, 42, 36, 18, -78, -80, 44, -27, 84, 120, 54, 281, 193, -127, 64, -3, -39, -125, 133, -258, -118, -65, 18, 281, -120, -27, 160, -49, -13, 94, 254, 168, 70, 57, 178, 14, -141, -59, 137, -33, -55, 119, 46, 118, 56, 82, 79, -29, -104, -59, -75, -274, 14, 78, -431, -199, 299, -272, 96, 58, 285, 30, 194, 151, 138, -141, 198, 271, -144, -41, -233, 13, 15, -232, -45, -152, 167, 165, -195, -286, 10, 228, 267, -28, 148, -73, -31, 12, 14, 242, -58, 142, 95, -37, -298, -220, -84, 88, -66, -45, -21, 15, -20, 72, 46, 162, -8, -60, -147, 50, 34, 11, 126, 33, 140, -2, -88, 1, 231, -42, 71, 26, 1, -158, -313, -227, -117, 11, 17, 119, 42, -20, -79, 102, -211, -160, -192, -349, -142, -40, 340, -52, 236, 207, -188, 165, 242]
4223B42p0m72M24J08k10k64M50j00m4j9j62j27k0L30J60P8l27r9J60q3L45j43
4245A57m02L96j80j3L3R3j13K00%j52J22k99K18R3q9N0j29K53m28L55k58J00q9
4268h2R3l38K67K31l35L19J07j98l44N29m78P1O6K48j04l8R1k67K53n8m9q7k13
4291c16M08j56L6j48L77k26L30m34n4K16J50j22p6J1O2j30K1J69k00K47l17L41
4313A89L3j20J04k71J36q8o8P0J49kl67J16R9L5K93o07L19Q2Q2j52l3oj59j68
4337c34K21K24k51K45j77n6N1M1p9J98k04K50p5m05M12k05L3J86j65J04K8L5k04
4360a27M0J73j67j19K22R5Po1l9p3K00l3j59K18l29J47k94R0L05k29L16j26J75
4383B32k31mj15J02j06L93j60j68L2J31k10J94p3N0Q7k60L16m22K76j16J33j84
$$ y = [242, 172, -300, 124, 232, 22, -242, 208, 108, 64, 45, -117, -244, -264, 66, 226, 304, -23, -122, 38, -45, 300, 157, -245, 151, -29, -42, -9, 84, -29, 171, 171, 19, 141, -158, 60, 153, 64, 114, -15, 238, -190, 165, -93, 7, -82, 11, -327, -60, 171, -164, 155, 262, 64, -280, 249, -229, -158, -92, 156, 52, 14, 105, -162, 91, 33, -16, -103, -316, 92, -64, -28, -176, 201, -25, 305, -129, -183, 33, 183, 61, -15, -4, 58, -72, -51, 118, -82, 165, -152, 189, 222, 102, 206, -65, 71, -17, -85, -15, 134, 132, -235, -119, -20, 15, 308, -299, 20, 102, 184, 32, -1, -7, -166, -334, -113, 111, -140, 105, -72, -128, -77, -36, -115, 83, -121, 129, 54, -351, 61, -144, -111, 75, -90, 14, 42, 77, -127, -87, 86, -81, -200, 22, 117, 124, 63, 24, -49, 151, 118, -41, 177, -152, -5, -299, -209, 96, -133, 183, 57, 232, 1, -3, -118, -16, -122, 271, 111, -57, -25, 106, -104, 90, 17, 67, 154, -106, 210, -212, 64, -52, 81, -103]
4405a03k16M72k97K35Rl25M56qj74q5M6J88j90j94L27l79K06m6P2Q7j67J59L6
4428A09j55l0N7K2l3K23k06J67j83J83N4k92Q1j43K23k6J10j56j7m7K53l13Q7
4451c2p8o2j3J87O7j4jk23N3K79P2r0R8o7l39J00K24kj61k53K79k04J07J06K0
4476E3r9k65M68l95Q3L20J0l8P6m3m91M43j66n0O1k2K29k90k39J9L05qj81K60
4500D0l20K53n5J61J20l64L22j29k56J68j2K18r0j18J33j23l7j80J67J10l87J86
4522a93O8J97k44J75J14K6m40J81j01l3K45J13l77J58J03m9J5N24m55m0k57L35
4544F5kM6Mk6j19R9q7Q1k7j32J34M1K7k96n7J99J51m2k9J6l8RJ8J30k4l26J01
4571h4J29J33j59J20j95L52n92M59j87L5K3o3k44K52O9k9J86m88M48j08J96J6
$$ y = [-103, -319, 153, -144, 91, 100, -225, 231, 223, 49, -36, 10, 198, 8, -186, 141, -238, -32, -78, -6, 81, -86, 73, 109, -46, -76, -19, 3, -30, 193, -13, 154, -29, 154, 208, -84, -3, -146, 77, 51, 161, 5, -12, -59, 194, -119, -32, -110, -172, -185, 2, 69, 55, 54, -169, -116, 163, 235, 145, 243, 176, -163, -63, 161, 159, -2, -255, 24, -180, -73, 33, 53, -46, -311, 157, -238, -155, 165, 175, 137, 213, 170, -321, 122, -44, -94, -33, -55, 174, -116, -355, -336, -31, -39, -220, 40, -280, -27, -82, 79, 199, -165, 157, 28, -228, -60, -72, 146, 56, -62, 71, -52, -89, -269, -102, 8, -379, -193, -125, 72, -172, 3, 117, 143, -297, -116, -217, -250, -5, 108, -269, -111, -8, -57, -42, 482, 27, -13, -270, 65, 63, 109, 113, 87, -32, 67, -20, 61, 34, -98, 36, 77, 104, -192, -249, -50, 101, 59, 30, 46, 8, 17, 35, 165, 141, -185, -84, 45, 178, 19, 139, -56, 296, -296, 163, -24, 11, 34, -29, -273, -21, 48, 19, 205, -283, 165, 57, 253, 269]
4593B69l85K91j08m38N15J3k43O3j55Q3J4K76m08O48o62J64R1j21J35j35M9J54
4615A10o9k96J25K8N8LO6j89r0M93j41j47j48qJ01J12n14P63k45N5k25K36r2k07
4639b21M56k14J18kJ53l83L39k54R8k53J48Q4p0j62K19k0L3j99J76J72K1m21K22
4662D0K59l5j57j46K13m61K11J50K09j61l15J94k59L14L2rJ40n10M06m67M70l44
4684b26K54j23L95k46O2J6mp4j3j28j21L93N1k41mj0P8J45j90J55k03n7j28J17
4708a02K79j77o4j6M9J27j12L74m99J54L9P0j68O2J83j26q1l57K27j04q7N4L59
4731H4j27M4k63K74k04L5J59k4l14L17k51L48j49Q2J05p6k05J77L2J44j48n8P2
4754E4q7L09l79M91k90k15J36M6j43J56r5J92l61K12N6j31j0M1K20k09J95k87
$$ y = [269, -116, 175, 67, -371, 144, 157, -86, -23, -178, -95, -81, 195, -213, 435, -227, -63, 28, -93, 42, -93, -44, 110, 41, -255, -130, -102, -44, -41, 25, -164, -254, 239, 98, -49, -197, -205, -104, 8, -506, 257, 12, 67, -158, 78, -14, -221, 235, 21, 139, 137, 290, -93, 246, -8, 90, -163, -15, 69, -1, -163, 56, 36, 69, -130, 46, 218, 239, -182, 40, 299, 264, 107, -39, 174, -287, -76, 74, 283, 122, -193, 1, -258, 56, 88, 79, 219, -291, 115, -352, 118, -226, 28, -95, 300, 54, 116, 132, 128, 54, 41, -87, -208, 185, 236, -5, -9, -19, 59, 204, 14, 169, -34, -91, -219, -102, 177, 0, -64, -80, -31, 96, -16, 358, -141, 13, 52, 122, -46, 16, 199, 73, -8, -365, -138, -242, -329, -275, 84, -43, 1, -262, 12, -192, -157, 2, -22, -336, -19, -270, 78, -71, 11, 116, 40, -165, 12, 44, 188, 40, -18, 54, -33, 276, -103, 388, 98, -117, 19, 65, -78, 78, -17, 175, -186, 26, 82, -49, -59, -18, 202, -7, 188, -99]
4776i9k8q4J81k43J80r6M72j58j67R1k32K05j78l2R7K02j83L11r1j32J79k1k14
4799d0Lq4L46k09J01j59Qp5oK3K08j0j69J54M7l53O1K07p8J28j29R4k84J05N4
4824e7j15J1K08R1k12R7r6K46Mj86K90m02j07K19p2j39J81J02n8k01J97K4K13
4847B38k26J72k63K1K11l69K21j2j25k9m3R9J4K6k07L40l79J96J28R4k54K39m3
4870D9k47K74rk68O7R3L43l96j25K43J24k53L9K39O6l54J72o8K08m4O3k09K65
4893B72j47j17l3k42K88k62K34j85L66l97J16R1k28M53j94k90M69j94J82n9j60
4914c7j5J73nk28J16J27j11J29k12j3J60J32O2k95o0J95k28K70j05j08L23j54
4936A16K79o34J76k22J94K22k16J38K09l01l7K48l14J66L3J35j82j70Q6p8J52
$$ y = [-99, -127, -211, -30, -273, -93, -189, 283, 125, -42, 49, -183, 22, -156, -188, -91, 111, -72, 239, 148, 16, 195, 174, -40, -37, -121, 225, 16, 117, -42, -34, -109, -115, -92, 116, 106, -63, 91, 138, -215, -154, 53, -25, 103, -26, 68, -216, -111, -57, -172, -161, 47, 138, -74, 23, -73, 173, 177, -9, 281, -121, -228, -9, -81, -220, -39, 63, 5, -196, 1, 25, 238, 12, 184, -79, -58, 153, -216, 5, -7, -132, -161, -204, -105, -91, -65, -272, 68, -311, -115, 13, 107, -147, 92, 49, -198, 76, 67, -201, -134, -41, 302, -94, -219, 24, 148, -105, -66, 173, 239, -115, 57, -11, 197, 153, 216, 7, 272, 125, 8, -25, -267, 21, -241, -7, -192, 174, -223, -107, -16, -244, 209, 15, -275, 194, 0, 182, 123, -37, -52, 121, 116, -112, 4, 131, 20, 149, -63, -76, 84, 216, 278, -17, -77, 118, -110, 160, 55, -53, 270, 116, 395, -239, -63, -285, -91, 131, -85, 53, 262, -39, -76, 172, -142, 24, 57, 192, 10, -160, -74, -152, 0]
4957@k3J88l80M04l92L22M1k87J1L56k16N8m9k28J17j32M02k32m7J53J52j06j1
4980A01l22J65J40r9j44j00L16Q2o7j36Q5J10n62K81J66J25J05N0O2l60O6j21
5002e7j26L34k37p5N2J81j78P0k35K35J68j02P4o8j83K02n1j15L7K96j96O0j02
5025a6J96o9m4k53K52n3J62q4k08p9L49j32k12M84j39J25j16k36L8K9j16P4QJ84
5049A44J71l01j28M01p6n01L85r9j7K75k41k1p1K68r4j35M5j2Q5k5N2q2K56j55
5073A24r6J21r1O4K74l67k98K74j50K11l6o5m8R7Pk4j52N3L02k44nj40J1L78l07
5098a07Q8oJ47p6J21l0q1n8O1p2L85m10J51k23j0K9K65k63p9J20N3K43m7K0l07
5123h6Q1N6o7J29m69L90R2k25J54RJ41k47L25j95k20L32j57J35k53j33J9L09m39
$$ y = [0, -23, 165, -215, 189, -203, 119, 160, -127, -116, 240, 24, 82, 33, -195, -78, -210, 192, -40, -87, 66, 218, 112, 101, -221, -56, 84, -15, -159, -259, 57, 139, 72, -64, 21, 131, -431, -150, 16, 141, 246, 296, 358, -2, 64, -57, -183, 151, -86, -161, -109, 72, -106, -36, -271, -36, 132, 30, 104, 36, -147, 55, 4, -111, -74, 222, 26, 86, -16, 180, 111, 67, -186, 66, 13, 175, 91, -117, -196, 153, 21, -191, 293, 154, 279, 163, -73, -35, -6, -122, -48, -40, 144, 315, 14, -114, 287, 211, -290, 95, -4, -21, 254, 13, -8, -79, 189, 95, -40, 5, -7, 78, 53, 105, 23, 279, 124, 28, 149, 58, 122, 396, 29, -269, 5, -145, 66, 30, -35, -83, 14, 21, -3, -155, -102, 200, -44, -49, -189, -178, 200, -107, -19, -25, 122, 46, 167, 137, 56, -2, 59, -13, 372, -38, 113, -110, -120, -91, 174, -89, -168, -48, 5, 248, 201, 221, -86, -5, 51, -16, 113, -356, 34, 126, -99, 55, 64, 205, -42, 283, 88, -132, 200, 43, 178, -75, -208, -189, 120, -319]
5146c19K17J20kP9k10J53r7J86l31J23j26L85p3M0l00L70j13n3m34L24R1j63M19
5169B86l28J03%K27l46J82k69L94J85m01j62M57j55N8m13K23k94K61J60k15K07
5190A60N8k45J43k31J08L09k22j05l7J98n29N01k94K23j38j9K01j4k20J50r8N60
5212D59p47L10j27J57j62J44l4L01j88l91K07k45N46k92M2K08j59L1p6l15L34
5233Cj32m9L49l63J78n6J25M5m08M45j15j26K46k1l96M33l88L21p4J48m33N55
5255B87n02J61j06K82k69J35P9j63j11R8o8P2m5M0J14j4J43M0q1k31J28J52m6
5278I5j17k66M70j27P6K8j43Mk16nm6L25p9J97j82L8rk74RM16q4j79n3J21j53
5303a54JK89j74K20l89l5K24J1J72l23%Pk00M67L7L4l52j73L09J14j22O1L29n83
$$ y = [-319, -102, 18, 16, 95, -115, 38, -59, 127, -204, -81, -207, 178, 105, 145, -155, 215, 102, 49, -385, -61, 30, -133, 286, -42, 61, 61, 288, -58, 124, -145, 249, 434, 33, -129, 328, 173, 231, -182, 41, -253, 8, 168, -47, 160, 218, -27, 116, -115, -7, 302, 80, -25, -62, 136, -393, 108, -186, 37, -101, -120, 81, 67, -153, -3, -101, 459, -288, 22, -105, 52, -110, 34, 0, 301, 113, -278, -71, -316, 230, -62, -20, 188, 29, 60, -16, -331, 3, -129, -178, 171, -192, -14, -70, 55, 100, -308, 137, 22, -104, 142, 121, -275, 158, -230, 91, 17, 165, -268, 287, -215, -54, -160, 122, -147, -12, 67, -96, -207, -109, -177, -105, -150, -110, 4, -10, 133, 173, 92, -139, -11, 141, 95, -22, -288, 182, 55, 131, 159, 16, 20, -196, -201, -247, 78, -1, 196, 14, 52, 43, -231, -222, 194, 110, -69, -122, -1, -154, -153, 136, -38, 182, -207, -242, -18, -7, 165, -158, -158, -151, -351, 116, 153, 187, -165, -338, -29, 85, -37, 24, 353, -230]
5327b30K5J70J55l27J58L3N0j16L2m2P8J87K0m88Q5K84j80J38j95K28K59k33K22
5350C13k00J29j05j09N2RL8j27j1On3P2n4K3NOk45r7M23k15L00j17kM6J4j00j53
5377a52L22j09o7J10K15m73R0q2L44j38O7k24J64l5j21L29P3l85J97l6j9k9J11
5400A52j43J94r4k98J44q3K55k4j03L3M2%n3j13j4j26L32j2kk90J69J75J67j53
5424A55k93J16J21k38K81k55L2J17j20M57m51j48J90pq1O9K0N2J46j12L2J01k81
5447i7R9p9J58k85J16J01j33P4l31P8K53K12o7J00o1J22m35K21L4J6k6k10K82
5470A42k34qJ00q9L9K06M1k87J21j64K9J31m30O26k49LJ05K8q8j47L97l41n9P3
5494e5j22L49j26j90J03j00J97j16K33j66k9J53p5Jj9J09j93JJ93k7r4J59J41
$$ y = [-230, -205, -35, 120, -207, -49, -16, 34, -82, -50, -92, -14, 173, 193, -295, -210, 74, -106, 32, -163, 65, 324, 91, 313, 113, 242, 137, 28, 80, 89, 127, 0, -11, -5, -58, 14, -40, -17, -12, -6, -251, -348, 75, -140, 160, 43, 41, 87, 101, 1, -152, 170, 61, -6, 104, 319, -154, -64, -146, 198, 60, 127, -97, 67, 32, -89, 240, 313, -72, 125, 89, 70, 41, 152, 9, 203, 109, -189, -45, -128, 127, 103, 0, 33, 75, 75, 22, -91, -105, -231, 101, 89, 87, -203, -34, 141, 308, 155, -138, -22, 99, -139, 142, -113, -81, 36, -84, 373, -78, -226, -36, -43, -124, -55, -35, 17, 163, 51, 83, 184, -97, 2, -77, 81, -204, -88, 13, -120, -46, -377, -299, -46, 166, 99, 199, 138, 260, -175, 46, 80, 96, 70, -140, 142, -92, -100, 0, -89, -50, 156, 197, -90, 31, -133, -104, 27, -403, 223, -26, -23, 82, 110, 22, -125, 272, -69, -128, -55, -177, 172, 46, -144, -41, -141, 56, -60, 173, 7, -22, 131, 56, 57, 38, 147, -46, -45, 148, 121, 27, 186, 327]
5517C27j58k01r3K38l49L34j49j03M04m33J83J7R2J94j00j61N8j95K71q0j58j48
5539b10L07l6r3N6K13j43J4L5k36J33J71j49M6j03j4KN9q4Pk2KL5R6j64l7M58
5565C43m35J63J08j00k24M0m8L53J39n60J9K63j54m2K38m27M47j56K48j37j12
5586c4p1J13j30O5R0m5J01j27M4j50K20O7q0J13k72J05j9P5o5n1o7J15j51K45
5610I1l83N04k57n3J6O1R1j8m30K90j0J93j9l42L99j20J66o4l01K9J67K49j34
5633A25j66J54j10o1oJ9L40k44o8j19J53K7k50K64n1O6n9L68n92L25j14O0j5j72
5657a26P8j78R8L20k22L09l26L0j39L93k84k96K72Kj60Q2Q9p1j83L11M0q2M02
5680C59l21J27l99K07k04J76Q1k88L68l44Q5K91l68K35L9m3KJ21m20L7N07q4j88
$$ y = [327, 169, -32, -125, 113, -236, 98, -51, -154, 250, -183, 0, 17, 109, 303, 203, 42, 100, -95, 176, 96, -62, -210, 97, 61, -32, 24, 237, 94, 108, 143, -93, 40, 211, 62, 108, 5, -9, -7, 52, -32, -25, -47, -45, -10, 86, -78, -115, 343, -92, 71, 179, 79, -145, -105, -153, 200, 339, -221, -202, 61, -93, -135, 103, -324, 123, -33, 215, 78, -34, -105, 8, -122, -57, 33, -12, 89, -38, 6, -144, 76, 143, 63, 176, -96, 9, -10, 65, 0, -51, -118, -3, -154, 91, -292, 212, -45, -98, -82, -21, 70, 52, -378, -88, -98, 95, 76, -266, 133, 13, 179, 115, -186, -157, 10, 259, 125, -41, 113, 3, -58, -64, -45, 295, 51, -17, -136, 17, 44, -206, 58, 7, 73, 14, 382, -210, 115, 1, 61, 46, -126, -48, -226, -128, 192, -30, 279, -47, -17, -156, 237, -47, -343, -71, -69, -229, -147, -58, -129, -312, -1, 39, -43, 359, 38, 165, -234, -27, -231, -55, 26, -262, 106, -238, -153, 138, -230, 5, 44, 1, 3, 124, -296, -259, 248, 164, -24]
5703b4K31j30k25L03l15K75l4j99j5K44l69M3J90Q1o6J33l60L74k43j52jL09L1
5726H1l9k41K82%J83k99m3J19k10J93J83m23J84j46K48k52R7k25O04m72J42l4
5748f8R1j59J35K36l74K9M6M26m39j5L13k11m8Jp9K15j46l0N21l60m9j13P1K87
5772B80l04j41J54J55p8j50K65l3p0R1R1j11q3k04L21k26K17k70M1J54J35j30
5794A04k50J34r1J50%J39k81ML65k71K2r3q6K36J75K5j52k18n8J99l5j70J89l9
5818bk7j24J3k45M70n2R7k46J17l4K2j0p3P2J82K50o28L43l26K41j43k1K21r9
5842bJ39m4M7r6O3o7M8j4j52p8J43K15n4k66K51J5j65K82k22J71k52j7M9n0l3
5867h9N26m34k46N16l05q5LJ37o6N1j21J9J32rk24L39j48k73L86Q2j53q8L2n4
$$ y = [-24, 207, 77, -148, 155, -160, 115, 81, -118, -133, 111, -258, -215, -25, 56, -10, 123, -237, 137, -106, -258, -259, 50, 81, 42, -199, 83, 83, 266, -33, -76, 43, -167, 26, 209, -214, -30, -176, 72, -180, -83, -308, 296, -176, -34, -68, 23, -136, -1, 235, -139, -110, -64, 362, -77, -92, 221, 10, -38, -37, -116, 99, -47, -77, 444, 84, 35, -78, -7, 280, -24, -165, -11, 144, 66, -84, 181, 148, 78, 169, 260, 149, 66, -138, 183, -43, 174, -96, -55, 99, 234, 104, -146, -12, -103, 47, 47, 186, -95, -91, 274, 3, 25, -68, -154, 82, 257, 282, 130, -88, -146, 53, 18, -152, 37, -2, -29, -153, -140, -385, 85, 33, 130, -116, 1, -33, -11, -21, -94, -22, 160, 410, -218, 125, -201, 40, -103, -124, 97, -2, 137, 93, 140, 44, 107, 40, 88, 74, -78, -156, -13, 202, 148, -118, 133, 148, -17, 265, 43, 214, -38, -55, -6, -56, -89, 437, 3, -243, 273, -32, -117, -114, 23, -43, 8, -113, -94, 38, 29, -195, 144, -4, -277, 109, 191, 38, -50, -18, -72]
5891g2j32K46k14L55l77N77m53K77p7j96K8J94p2k64Q7K11j70K4L7k24J58k11
5913b68Q7O7J92r0M1j09L16k01m5K0k24M85j57j58K68k28q1K20m27M15K0Q7r8
5936A32n1j18q1J0J83l5M1k18r9Q0n9J34l8K01o8K78m6l79K45K11l71j33N74l05
5960H8m3j0J56j5j00l4r3M00j17k14l1K3p9O0J16j55K8N2j86K62J2l01J24R5Q
5985D6L3k01N5O5J43l29L08l17J30r2K08J87j93k26M00m56K11j34M5K7J03O0l77
6008c04J58J95j46K1J68j38K0m3J56J0J34l19N1N6j5P0j12J32k78K26J7n0P7k87
6032b01J58L9j4P3j20J28l50M99j83qj45J26J80k07J9L1p0N7K96m75K74k46L44
6055B05o42L36J82j63J78k4l90J29L33k98j0K40j46L6L6N8j33r1L5K94j17j49
$$ y = [-72, -204, 42, -172, 183, -194, 383, -70, 207, 130, -66, -38, 156, 84, -180, -93, 118, -52, -28, 9, -215, -57, -268, -181, -114, 78, -12, 29, -80, 236, 35, -10, 10, -214, 271, 114, -44, 224, -4, -85, 135, -292, 123, 143, 230, 132, 81, -37, -118, -108, 75, 40, 81, -137, -236, -156, -215, -81, -119, 82, 14, 292, 246, -133, 112, 323, -48, -181, 393, 88, 45, 35, 191, 176, 76, 42, -51, 349, 232, 18, -13, 10, -69, -9, 107, -48, -20, 32, -154, 108, 120, -181, -57, 38, 46, 79, -122, -67, -2, 141, -188, 120, -197, -67, -159, 49, 236, 43, -183, 217, -239, -28, -162, -117, -90, 13, 73, -304, -146, 49, -97, -76, 92, -46, -26, -69, 87, 97, 231, -88, -37, 19, 4, 74, -38, 94, -184, 42, 59, 9, 86, -201, -43, -4, -18, 55, -65, 63, -287, 212, 29, 21, -124, 2, 182, -25, -6, 25, -45, 12, 308, -167, 107, -139, 205, -437, -101, 81, -82, 96, 72, -318, -189, 144, -154, -164, 76, -70, -34, 2, 60, -73, -164, -129, 165, 48, -101]
6077a01R8K79j80j62k64J58Pl4j3o2K84R2j49k69K77K25j26j54J20K91l79R3j13
6100h2K68l44L60j88J66k0l57M0J44M1k91P7K95j9ml64L93r2j46j12L26k41J25
6123b5r7J34l7m2J17j77P2J63R0k65n1Q2j40k1L34l12J59j59J67Q4n0R5M2J57
6147C20l06J34l13N10l28k06Q0N0%K5J96r5M0n8o1mO1l33K18N4J2q8K24k90n6
6172b14O9R7j30k7K87Q6o4k38L79o3j38R7L9j55m4k1N1r2k8J35j77k38J20q2M29
6197G8m19N17k45m6l2L68q8j37j14r8K2K27J97l31j74L05L5r1L10m29R8j09n5
6220b11K43j35q9K20Op7j09P3j85L92k35p2M03j36p8nj08J38J2R9l84O6K1L52
6244B01k47Q6L21m41K25N6k04J57k48L0J25K4o5k5kk1J79l97J69J21r7J14l98
$$ y = [-101, -3, 276, 96, -66, -330, -172, -165, -199, -212, -274, 10, 102, -47, -316, -39, 186, 60, -94, 26, 317, -62, 31, -82, 186, -158, 202, 14, 180, 160, -197, -157, -13, 28, -263, -186, 109, 90, 86, -278, 115, 23, -123, -235, 91, -150, -25, -122, 12, -25, -67, 50, -127, -55, 108, 198, -67, -118, -36, -176, -197, 137, -175, -16, -175, -8, 76, 26, 121, 163, 320, 14, 148, -165, 345, 17, -189, -109, -59, -59, -34, 162, 67, 107, 49, -12, -16, 45, -288, -70, -16, -4, -92, 132, -158, -214, -145, -48, -178, -205, 82, 168, 104, -134, 245, 182, 44, 141, 180, 25, -19, -40, 11, -81, -109, 26, -151, -389, -269, -351, 78, -341, 176, -69, -115, -147, 221, 133, -4, -118, -216, -194, 33, 230, -101, -275, 30, 65, -26, 284, -145, -47, -156, -211, 32, -103, -192, 28, 34, -43, -152, -79, -264, 128, -107, -179, 224, 88, 10, 5, -103, 35, 47, 146, -238, -172, -151, 201, -46, 40, 361, -80, 145, 201, -3, 154, -94, -64, 61, 85, 20, -5, -7, -28, 151, -246, -77, 44, -53, 61, -337]
6267c37L11M6j26M19m57jL5R4J35j19J79q1r5J33r3r8M1J73l39J94p6J19j59J8
6291h4P7mj88M4p7K34rl7J47lp3K67m90L00J5o2Q2j27K08m70L67J6k74K01j0k29
6317a79K06L7q6J51l30L09l85J11L85k32j39Q1J93J9k94J64L42k11n2p1J37n0
6339A06j20K7l2J48p8L9j54Rj6J00L26l93L20n22K91p9k74M62r5r7K0N1l45J97
6363a09K64l6M8r9l43J36J83j58j36L02m2l8J47k80R6j10J56j84L55r4j50J97
6385A05j95K35m0k1O2k83J42n1P1J48k65J51J6l31K86L23m62L14j95k05M91n18
6407b22J60P0k2J25r0M6J09j71k94N36n78K43Q9l02K52k52M86k60j30J05K22q3
6429C9J74j63J27l69J57J45J03N7m75n1M05j80K51j72l4J03j28K64j48j60n0l6
$$ y = [-337, -26, 20, -106, 313, -144, -145, -110, -16, 119, 0, 179, 98, 3, 136, 43, -55, -14, 159, -180, 14, -62, 57, -102, -84, -7, -11, -199, -155, -232, 2, -7, -44, 103, 100, 27, 294, -196, 104, 119, 57, 139, 12, 220, -250, 117, 133, -141, 60, 50, -179, 27, 64, -22, 129, -201, 108, -277, -166, 219, -13, -152, -71, 122, 141, -153, 11, 353, 142, 90, 19, 156, 106, -14, 13, -19, 129, 51, 90, -64, -55, -71, 29, 355, -38, 282, -240, 51, -28, -302, 160, 65, -32, -12, 39, -306, -109, 155, 119, 167, 68, -275, -139, 44, -114, -250, 52, 10, -28, 119, -161, -65, -175, -19, -203, 152, 58, -92, 105, -90, 145, 105, 84, 146, -137, 5, -46, 25, 173, -92, 59, 75, -256, 30, 353, -109, 205, 10, -195, 296, -222, -62, 8, -14, 111, 21, 67, 176, 5, -289, 247, -331, -88, 1, -301, -49, -301, 185, -75, -205, -100, 122, 39, 213, 50, 177, -192, -35, 110, 213, 270, -205, -256, 149, -31, 220, 48, 14, 117, -11, 253, 105, -55, -105, -141]
6451a41J84J46n5R4k52n0l5J29J96k14k63M76l57J60J90l12J87n3K0MM9k51J23
6474b5l26K56l44M17J49l5m76M13K54j51j58k07L04r1K88l87j39K17r3m1L05J58
6496B88j59j50k7j29K43j80j9N6rK96k15J54k46J66j45m0N5K61k05j69J82J35
6518A43k8l82K06J0K31k39J54j98K32l74J05N1J99q0m1O8j58k1OK01NP6j95J08
6542G9k90J22K44k8k10L79m02L94l14j24M9q5R0K58j96K15l49K69Lp0q1J0J40
6565A03q6L26n11L72j31j56O2J57m1j78p2J51R2j46oj78o9K77j15J86K03k99j34
6588a93M01k79j30J47Q5j50J59m6L42k29l7J1k72J07K61k41J67o0k24N30l15L36
6610C70l54K92m90kK87n5L58m49Jk6K65j73J30q6k21M96j73k05q9p1L43q2J2K43
$$ y = [-141, 43, 189, 134, 228, -24, -74, -109, 20, 216, 2, -261, 215, -142, 18, 208, -104, 83, 30, 50, 54, 103, -148, -25, -351, -95, -439, -22, 127, 92, -384, 29, 283, 132, -26, -233, 71, -20, 268, -119, -258, -41, -134, -175, 130, 288, 129, -21, -48, -177, 66, -114, -133, -77, -86, 210, -5, 149, -97, 69, -76, -116, -61, 200, -5, -174, 8, 143, 115, -267, -61, -51, 180, -59, 95, -103, 129, -245, -140, -89, 110, 30, -11, 57, -101, -122, -116, 85, 90, 166, -29, 79, -211, -89, 155, 127, -83, 296, -106, 288, -26, -150, -101, -186, -96, 162, -34, 181, -168, 101, 104, 34, -47, -37, 103, 17, 343, -168, 204, 73, -83, -21, 136, 95, -83, -155, -4, 88, -58, -64, -242, -311, -34, -149, 37, 240, -59, -193, 208, -71, -201, -54, 31, -119, 40, -6, 336, 107, 70, 81, -191, -84, 177, -64, 103, 43, -181, 349, 34, 370, 16, 308, -182, -184, 103, 48, 406, -43, -42, -68, 197, 24, 154, 68, -153, 343, 170, -35, -124, -195, 148, 66, 78, 321]
6634C21k95o7K13J34l24k71L50k3l3j42J27O0J82j95P8m42J56K33j32J32J84k25
6656B1j2j05o2K28j3o0j72K01k7l3J72L6j25R0J69k51%j99K35N4l23m2J28PM24
6681C41k57J1Q3O7r9k91K17n2R1P2p2j26M1o4m1R0j60J96o2J56M2p2k32N6K38
6706A73j75K55q8k96R5K86j82lk33J64k0N4j35J13Q5l7P9n7j38N7J46l00L26j19
6730E0q5J36j1j78R6j59R5M7j6J36j51K68j45j58K23k90J8j69Q9P4N7k7N0J97
6754A47L6j73k09R3k05K55n8J74K98k26j18K12m40K58k15K29j69M01j23l8j81
6775e2M3J51J59k98l31J75J02k73K41N1R6j57K14k01J38j11P6j04J82m7j2M03
6797D45n92J91J49j33M0j24L4j24j55K64j30L48j61l2m4L40m50k4J45r5k1J18
$$ y = [321, 26, -41, 172, 306, -18, -289, 61, 38, 5, -137, -10, 50, 232, 37, 115, -327, -171, 62, -70, 62, 246, 21, 9, -96, -158, 70, 57, -3, -175, 26, -1, -34, 138, 174, 49, 139, 308, 57, 57, -142, 93, 147, -176, -218, -90, -83, 341, 84, 95, 178, 245, 146, -145, 72, 20, 111, 183, 111, -15, 26, -38, -79, 11, -149, 47, -15, 141, 183, 111, -121, -65, 173, -2, 253, 165, -131, -36, 250, 68, 65, -168, -4, -24, 30, -105, 8, 93, 56, 135, 78, -60, -3, 143, -157, 169, 50, -35, 101, 90, -88, 8, -151, -56, -9, -25, 111, -40, 228, 83, -75, 148, -142, -124, -293, -204, -130, -73, -100, -50, 147, 183, 10, -199, -106, -311, -56, -114, 60, 358, 132, 14, 226, -214, 44, -171, 58, -111, 290, 167, 129, -52, -9, 142, 301, 3, -328, -153, -51, -324, -83, -32, 64, -93, 121, -80, 58, -53, 23, -81, 101, 54, 42, 445, -147, 44, 193, 60, 100, -24, 10, -114, -269, -5, -135, 213, 52, 20, -24, 316, -134, -158, -13, -108, -129, -11]
6819a1J5J62l5k07K34n1l37K78p5l1j13jL84j47j45n0K48r0QQ0l3O6j01j53K59
6844A54k5l75K05L63m90R9O2J38j07J91k64j93J27J34l39J93L6j07k0L90j50L86
6866D08n25J9L73m36R8j31J74p6L74l18J62k25J8j09J54L23m22J45J48k29j07
6887a82M29k65K2J88k37O9o2r3J74J36k7M5p3j25K45l58J91n8R8j74K73j5r5k76
6911a70J79j04J05k02L59o5k62J55p%R7j52q7R6Q8k1j47M8P3J52l4k2j43j19J96
6936A3M2n6R1j16L3N6j19j04J93k0L6J31q1k50L13l25J33L5rM7k39K73r7o9L64
6961B75k21k7j23K03j88J31k28K14mJ2L3k07J31o6J56k72M66m19N2J15OJ03k88
6984a46J49j58J53J2N0O6J34l17R6n6k06J42J34k86L74j95n4L85l33J42K3j94
$$ y = [-11, 4, 166, 131, -76, 158, 107, -230, 48, -27, -58, -171, -172, 212, 65, -80, -130, 118, 28, 36, 116, 83, 149, 48, -105, 154, 129, -246, -41, 322, -168, -69, -7, 131, 24, 215, -49, -242, -115, 19, -320, -127, -91, -198, -218, 172, 22, 408, -117, -98, 275, -161, -63, -194, -20, -96, 278, -40, 122, -103, -85, -194, -40, 283, -139, 6, 154, -75, -182, 247, -18, 4, 192, -45, 24, -38, -131, 43, 179, 152, 197, 124, -1, 244, -114, 77, 19, 117, -57, 216, 201, 106, -170, 9, -95, 10, -192, 167, 102, -160, -5, -12, -12, 85, -67, -154, -58, 30, 9, -138, -90, -17, 135, 101, 79, -64, -183, 13, 55, -1, 90, -26, 7, 63, -56, -160, 33, 13, 49, 180, 99, -151, 162, -163, -30, 5, -4, 43, -196, 77, -20, -89, 275, 54, 27, -96, 107, -81, 50, -178, 36, 32, 44, 77, -130, 1, -65, 91, -181, 285, -134, -82, 33, 39, 142, -146, 3, -155, -2, 10, 60, 126, 260, -57, 39, -17, -223, -81, 53, -233, 141, -54, -108, 277, -56, 86, 109, -85]
7006h5K31j57o4O7j05L4R3N4p8K06k19J57J11M5j87j30M7q5M1O3O6j90K39k70
7030a16J05K92k95K26k11JL43j58k28r4Q3J80k00J80j15N6L4l9j72K54l49L37
7052A14K16l09j91K36J36m03K28J4n3J05R0J6l76J2j7K06j17J54J39l3j85J45
7074A27l07j35O27o87Q5K42R0j13q7M30l45n9J11K14L1o8j90k1J53j82j42K28
7096BL1J32k14N1J07N0l64J58o8J05J92k66K25j07j63r9J84K77K1l49J68r8J33
7119A08j57J8L04k89QJ72p5j22p7j5J7J26j05R2L3r8J63k21K49K73m81J32j33
7142g8N4J56M3m9q5j68N4j80L23J19k38J98k01K1m9L5l98N82j90j0L29l87J18
7165aj00j08n4L81m9mj29J67j26MJ31J67l2j38m3k16K18l20J98l8J66l10K03j67
$$ y = [-85, 146, -11, -75, -8, -113, -79, 14, 68, -10, 196, -23, 134, 245, 290, 103, -27, 20, -65, -24, 39, 105, -85, 154, -116, -11, 281, -14, 212, 1, 2, 345, 187, -41, -135, -52, 128, -72, 108, -7, 49, 83, 44, -128, 126, -223, 114, 330, 21, -170, 66, 202, -201, 27, 41, -12, 93, 183, 199, -177, -165, -182, 24, -93, 61, 200, 167, -18, 127, -180, -315, 312, -375, -290, -48, 42, -71, -158, 272, -73, -132, -21, 193, 224, 156, -34, -55, 98, -84, -226, 2, 33, 165, -49, 2, 109, 159, -205, -47, -115, -10, 182, -84, 141, 34, -129, -228, -44, 233, 254, -95, 73, -25, 108, -49, -31, 273, -16, -8, 164, 89, -33, -110, -125, -108, 18, -87, 5, 38, -60, 103, -118, 131, 404, -77, 55, -78, -24, 132, 175, 126, 41, -127, -73, -253, 70, 189, -49, 149, -52, -31, -80, -45, -443, 139, -51, -61, 268, -119, -1, -101, -209, -263, 118, 69, 65, -64, 103, -23, -19, 112, 279, 247, 109, 66, -150, 68, -252, -54, -92, 74, -236, -33, -200]
7189b00N20k01j67J65j24R6j90K89j20j29o7O5J27j75M60n43K30K03j54j38K03
7210A50j89M5L2p2Kl9J06m3k6k74Q6J07L35l38K39l7k03J76l2k11L71Mk38N4k6
7235b1N6j33N1l00M02Ol65J50P0J65Q3l12M40m30J80Q7J0m47O20l48Q9n7R9r2
7259CP1k42J00L93k80l0j57J31j10J82M0P7k97K91k32K28k54J24r3N4q6n3L19
7282A79j81J74j29k44M25p6k05p7J18k57J87K91Pj49n4j03J32O0pl23L1O01k89
7305A11n4%j03q4R4l6J97M6j74j96p4L80q1oK94J15n22j4j75L33K02k23k30N0
7329a50J02J06j29q0L0K70K7l36J12K96l56K05l08K33K73m77m6J75J15o5J69n14
7351c48L20j13R7m3k3J33j20J4K20j33M4K63n17K7J46j51J42L82k01k4j07k2J12
$$ y = [-200, 320, 119, -48, 117, -7, 89, -101, 188, 68, -61, -128, -63, 64, -111, 349, -194, 36, 239, 85, -53, 150, -39, 6, 38, -34, -32, -71, 35, -8, -34, -308, -222, -115, 220, -118, 121, 84, -119, 57, 25, -186, 185, 189, -49, 5, -21, 35, -98, -47, -347, 55, 61, -304, -154, -84, 81, 164, -148, 292, -138, 42, 129, 139, -308, 312, -36, 53, -4, 95, 3, 74, -168, -68, 325, 45, 15, -142, -11, -121, 61, 101, 178, -119, 172, -60, 168, -86, 38, -55, -1, -87, -140, 179, -2, 172, 43, -201, 224, 148, -57, -134, -16, -273, -86, 205, 212, 63, 9, -94, 38, 98, 91, -232, -201, 400, 111, 57, 57, -46, -130, -36, -72, 125, 171, -3, -199, -273, 107, 26, 20, 314, 429, -93, -107, -282, 51, 253, 30, -200, -150, -48, 58, -71, -151, -121, 149, 176, -160, -48, 248, -108, 97, -211, 22, 295, -182, -228, -53, 62, -3, 166, -348, -28, -141, -44, -87, -110, 23, -97, -83, 137, 4, 48, 311, -206, -179, -33, -184, -42, 340, 139, 115, 8, -14, 98]
7374I8O8l0k76K94j75M0K13Lk59Q0N9K2r9m2P5j85K51r6O5p4K81m80J11K4J21
7399H9J3k82J86R7J5q6j41J32J18%k13j22K61k50j17L09L2r4r6J07J90K2j31k86
7423b47O6J76M0l24M04n0j31j8J01j2l5j19L59j27m50N19l29L28M8k25p2j08K54
7446D8K08o12K19K34q6K6K03j52J28j00k46j53L39j66m5J07jJ15o1j01J96R6j65
7469C1j4J41k32P2K60k29k6j19J60M7j84l1P2K87j03j79K27n4j05k5j0o7J67K3
7493A09j00N7l31L98l16J55p0J20K42l26p8L22N8l61K45j18k64K02r2J40J2K1
7515B5k65K30j45L06l83J13J89lr6q9K75p3J10l54O4j91L28k3j51L85j62m4L64
7538D10k22k01N1P5j59K46j91J82O2l38j40L73r3o5k74M41N0M8k39J98k69M2r5
$$ y = [98, 166, 136, -140, 154, -21, 19, 232, 235, -24, 56, 115, 137, 38, -4, 71, -114, 137, 41, 106, 32, 313, -167, -56, -32, 89, 102, -180, 6, 103, 118, 32, -109, 23, 141, 141, -72, -194, 67, -183, -300, 9, 41, -53, -149, -42, 148, 170, 39, -247, -181, -5, 35, -289, 115, 65, -66, -84, 17, 5, -30, -149, 210, 83, -367, 152, -177, 151, 199, -26, -98, -206, 48, 256, -356, -137, 97, 11, 37, 240, 88, 216, 116, -130, -283, 56, -110, -155, -48, -49, 66, 5, -96, 100, 196, 31, 17, 158, -74, -2, 258, 29, 3, -116, 44, 91, -93, -124, -52, 235, 132, -47, 180, 126, 21, -4, -14, -81, 86, 109, 9, 66, -265, 133, -183, -28, -98, 22, 264, -62, -140, 182, 240, -121, 124, 6, -258, -56, -148, -8, 4, 25, -240, -10, -155, 151, -232, -119, 70, 67, -29, -118, 157, 84, 194, -160, -96, -287, 41, 18, -133, 252, 90, 46, 410, 188, -13, 38, 113, -46, 200, 9, 191, 253, -85, -225, 148, 55, -10, -284, 157, 207, 255, 16, 214, -55, -13, -108]
7561a08J48k22J52pjk01N2K47k40J18j12L31k56M4n3p0j98K49M69l59j18J68q9
7584e6k7L27k44o6M6K10n24N25n2R4l42J0mK38k45j06L5K26m4K5J05k77K23j44
7608f7O0j54J4R3L9J44m16K62j12J90M9l76L24k25p4R9K94J51l28r8K5K54P1k83
7632f4N5N4n5k3N0K2j61N02m82K98l31K44p6l22L72J79m40J68J9j88j33N10j77
7655B1J65k80j00L61J12m15J97J69k48K01l57j45M68j66q6K23O7k01J03j72Q2
7676aJ19j15L9n8N1j00J31K02n09L71l00K16J7j97J45J1J3j97P4J73L19m34M6
7699A6k08O0R4J66rp6k5o3qj01Kj11K13J29q3j33Q4L8k48L83k87KL76j96P1m24
7725c38L87j11j14R3L8r5J89k74M05L9j91q7K82k58J34j60O2n3J84r1r0rN0j00
$$ y = [-108, 40, -182, -30, -37, -38, -239, -187, 60, -180, -62, -174, 157, -99, -55, -108, -178, -376, -127, 342, -17, -135, 33, -56, -83, 244, 0, -66, -20, 190, -334, 191, 139, 233, -109, -99, -103, 135, -110, -216, -181, 45, 1, 26, 131, -146, 77, -67, -7, -161, -147, -54, -15, 129, -287, -25, -137, 53, 102, -274, 50, -175, -249, -150, 144, 295, -33, -131, -106, 148, 219, -64, -9, 45, -10, -33, 17, 39, -122, 380, -102, 196, -135, 109, 33, -289, 83, 262, -178, -10, 9, -179, -312, 198, 21, 186, -94, -194, 167, 279, -136, 61, 230, -18, 183, -174, -319, 149, -17, -103, 120, 187, -14, 89, -83, -1, 118, 3, 42, -16, 35, -65, 66, 268, -241, 130, -170, 46, 63, -134, 11, 22, 35, -162, -88, 85, 404, -30, 16, -192, -132, -38, 128, 119, 43, 18, -45, -53, -154, -152, -263, -50, 79, -4, -137, -53, -15, -263, 120, -167, -165, 211, 15, 86, -338, 49, -62, -176, -83, -45, -140, 49, -225, 180, 219, 28, -59, 223, -35, 99, -61, 1, -52, 132, 41, -49, -58, -8, -108]
7749a08L2j5OK24l13L42k00L61m05J7J76k19L67o8Q9m36J6K13k02K80k3l2N6k22
7773f4J56L0j03O3l65O25l46O7k07K70j14j60J2J47K55j92l8m4j62M34j73q9j62
7796a60O6Mj11J11j25K78j47L51j71K12m61j8L36Q4n4k98L38j08j14r2J45k43
7818a77R8l76N25J52m32J51J71q1Km0k34N1l5K30j22p4J96M1k74K15r1R8Q9j38
7842e5J07r3P8J7J74j18j00j57J72K71l60K31l04M5P8k65K33q1L5L0K09J85l39
7865gq7p5M9L08j25P1j75P4Prj70K84p0j64j24J9K12jk49N25j46l26M7M2K80j94
7891dj83K24j0m6r6M8J23J1l01P4K35J1K70l75N6j55J95k94L61l70j03N23r0M
7915A08j57m2J26J85j02q5j62N8J62J60Jl89J80J20k11M1J41r6N6l39J27KJ70
$$ y = [-108, -76, -91, -85, 139, -174, 168, -32, 329, -76, -59, 117, -102, 265, 197, 286, -150, -134, 79, -123, 157, 134, 102, 158, -64, 92, 122, 19, 82, -283, 342, -4, 63, -144, 126, 12, -148, -136, 11, 266, 74, 36, -8, -170, 264, 91, 2, -160, -94, -90, -201, -90, -215, 63, -84, 267, 96, 308, -153, -171, 165, 249, 195, -103, 235, 127, 13, -79, 66, -177, -79, -455, 70, 222, -210, -59, 112, 31, 33, -7, -241, -190, -225, 5, -117, -191, 5, 46, -228, -13, -104, -6, 83, -55, 52, -41, 37, 54, 228, 110, 10, -147, 25, 296, -64, 167, -137, -92, -14, -279, -46, -127, -92, -62, 147, 332, -7, -94, -169, -120, 188, 63, 134, -41, 33, 40, 31, -139, 145, 75, -89, -213, -194, 18, 17, -232, 293, 147, -179, -132, -90, 190, -4, -187, 37, 27, -19, -115, -67, 56, 67, -234, -160, 75, 86, 356, -19, 37, -118, 77, -217, 144, -226, -329, 194, 104, 108, -49, -91, 35, 220, 118, 33, -129, -71, 91, 251, 252, -137, 43, 163, -48, -7, 134, 38, 94, -245, -118, -116, 54]
7938E4N5l84N69l16J97l96L7L42k12L27m29K13j20M6J48j22R8l6j08Q4l68M51
7960A30m3k12o6J94k1J30o4R6k61J35m2J34j68K46j37k62N84m78J45j17l8J04
7982a1Q7o2r0M2Q%J2j70P2J81m48K49K12j13N5P1j49j67K36r9j02J32J06Q5k02
8007f5r6K60J80k49j28J5j3J87K99l17q9o5J43Ll1k29K4K71j72Q7q1J90j20j54
8031a50P1Q0P1j46J8L46k81J15J8ok80J25L1p4j26J86LL4K26M6n31O6N70o40J57
8056g1K42m8L7k28q7J83J11j08J6n8j45J4K96o3j9j78L07q8m4k19m7J34K8K19
8080A84M5k20J76j23Q6q8k14K25k8K5P6J53m01K23r2k11J38J75m5j85K84j66R9
8103A16k46J92J6k0j08%R3j62J79j86n3L34k0o3K01l86p1J66J93j37K76l70K1
$$ y = [54, 109, -275, 294, -22, 175, -221, -184, 158, -54, 273, -156, 57, -63, -17, 131, 9, 107, 71, -37, 47, -321, 130, 87, -125, -191, 3, -18, 112, 48, 144, -117, 18, -24, 110, -58, 188, 51, -211, 373, -105, 40, -77, -115, -11, 76, 14, -76, -34, -26, -26, -14, -184, -112, 69, -379, -130, 82, -31, 24, 95, -54, -221, 15, -84, -186, -54, 52, 137, -65, -161, 99, 279, 30, -98, -83, -96, 91, 390, 73, -16, -81, 62, 65, 34, -195, -171, 100, -72, 15, -66, 124, 4, -150, -79, 1, 72, -74, -56, 290, 9, 124, 142, 136, -144, -19, 12, -62, -188, -2, 1, 35, 261, 307, -224, -158, 412, -228, -71, 171, 123, 160, -68, -155, 28, 139, 31, 47, -11, -156, -142, 154, 91, 72, -106, 201, 113, 69, -150, -197, -63, -35, 184, 229, 9, 185, 62, 148, 60, -154, 71, 43, 68, 144, 297, -104, 119, 27, -184, -46, 129, 84, -101, 183, 17, 116, -130, 62, 78, 58, -50, -50, 43, -119, 60, -126, -179, 155, 135, 72, 273, -113, -184, -18, 175, 38, 314, -56, -35]
8126c5k13NK54j04K84k49K18k44L36o8j97m0K63l70K95q2o4J34P8j04nj06J33
8149A19p2Q5l56J16Q8k63L6J66K55j49Q7k80k2J64K53j74j33J5rJ68n0L4L9r9
8173A8N4k42L24m02K19O7k4kJ86J55k92j40J61m2k63K3J84L15
$$ y = [-35, -248, -243, 11, -93, 191, -58, 160, -84, 252, 184, -13, -53, 210, -160, 135, 53, -11, 123, 201, 97, 92, -14, 119, 47, 132, -224, -108, -20, -283, -247, -81, 174, 25, 112, -168, -190, -26, 227, 53, -80, -65, -74, 94, 44, 78, 117, 18, 72, -170, 154, -248, -29, 38, 14, 12, 198, 353, 61, -79, 82, 40, -223, -200, -16, 299]
8191B99
$$ Imaginary data points
##PAGE= N=2
##DATA TABLE= (X++(I..I)), XYDATA
0@%%%%%%%%%pJ5j6J6k4L2l9N1o2P5r3J12j31J54j79K12k50K91l41L93m50N16n88
32c13O69p59Q59r69J090j225J370j529J704j894K104k333K581k853L152l477L831
49B008m222M652n123N647o230O878p608Q435r377J0470j1750J3270j5116J7413
63I347k0367K4320k9921L8539n3661Q7987l12115k3775M25968j24306q6629o7236
75a31849j1708N9769J95903k0333j07488J8669O5748q3262p585O0920j8930m0857
87b1003O4584k3090q3962L4661O5862o2498P642J00758k9942j03695L8772K3888
99A1977p5237N2658J58132k5382j22222r277j747l6812J06557J28664q3092j31445
111b7226K0487K6069k6040M8738M1194p6760l9235N5360j2719n7166K2555J8797
$$ y = [0, 0, 0, 0, 0, 0, 0, 0, 0, 0, -7, 8, -8, 8, -16, 16, -23, 28, -34, 41, -52, 60, -71, 83, -96, 116, -134, 157, -184, 209, -241, 275, -313, 356, -403, 456, -513, 577, -648, 722, -807, 897, -997, 1107, -1226, 1355, -1498, 1654, -1823, 2008, -2214, 2438, -2685, 2962, -3268, 3610, -3998, 4437, -4940, 5530, -6220, 7050, -8066, 9347, -11020, 13300, -16621, 21918, -31743, 56244, -255871, -279646, 146322, 22016, -64613, -131849, -143557, -83788, 112115, 91782, -15706, 2963, 68711, -14551, -22136, 38784, 19854, -21003, 43581, 20491, -63471, -28810, 37052, -25446, -17804, 82954, 53012, -50683, -11911, 11977, -63260, -10602, 147530, 122148, -74, -9351, -11098, -47910, 58647, 187311, 104219, -27226, -6739, 19330, -6710, 42028, 83222, 6462, -32773, 22587, 9868, -47298, -24743, -5946]
123e946k6359K7528O107j07413k2983J45595O9508o5909j2018J6540n3676N722
135b3304Q6452j1406n3856O4161L5133j19068p5154O1554M0047k797K4816k8470
147a892q0629J5739P3723p898k0474M0226j620m4887J4715K2910k3291K0320M4425
160E1367m2488n0512L3382O936l6808N6783Q3601n0119q2427J5570J6571k3912
172b2056K7674L3786m1571k4548L0133j8911m4292L5544N2210j4215j6844L524
184D34k1328l120M5933J1690l0921L97K982l2905Q159N3659j800l3852J7771J3684
198C0783m1907j9017K7209O445j590J9044j9354n3026P810M9987R79j9073K0531
211H821J5543j8335r773M459j948P696J0874j9624j9540J5139R689j2435R630
$$ y = [-5946, -32305, -4777, 1330, -106083, -129066, 16529, 86037, 20128, 8110, 24650, -29026, -23304, 63148, 51742, -2114, 62047, 97180, -21888, -97042, -35488, 4559, 1762, 26578, -1892, -82521, -66782, 6941, -957, -21431, 18795, 17175, -27712, -12997, 9913, -13378, 6942, 51367, 8879, -41633, -8251, -1315, -38123, 18660, 102261, 52142, -30285, -14715, 1856, -22056, 5618, 39404, -2167, -26715, 3418, -15493, -59785, -24241, 27969, 13754, -3090, 434, -20894, -24014, 21919, 33609, 2688, 3085, 6067, -26838, -18679, 34980, 33180, -672, 17099, 30783, -11124, -30141, -2932, 3513, 1923, 20967, 1613, -51413, -43603, 6384, 7363, -11710, 8821, 24364, 6029, -3744, 715, -1233, 6463, 17337, -2287, -21827, -6688, 3001, -9434, 196]
224A96K3263r179k0154K181J921k17J9206N232l1115j3191K0073l138k5160J0688
238a9394L0558K777j2193k189m348O20J5902N185j4593l299Q071n679r587M850
252c319M899k121J506k918p473N714J2034l855n284O786k338j5277K61J3510J696
267C821m377M026K90o413N10M201k777Q16P145j327r410k985N672J124l705k703
283f092L095O477Q74m593K00P641J604q971n328L376K572j315l417k044J559M570
299B08K01n381J92R552O268n379o444L256N239n010j0463m79O134K553l772k691
315f016L347N681J372l506j574M036L823k387o074j473L661Q38n766m693M190
330d541O926p24l722K673M999j395m382j016J031K040o78l831j965L284K254k637
$$ y = [196, 23459, 14280, -5874, -3693, -1772, -1989, 17217, 22449, -8666, -21857, -1784, -4922, -30082, -19394, 11164, 13941, 1748, -441, -4789, -4169, 11733, 16918, 2325, -974, 7097, 1418, -8169, -3319, 1580, -541, 965, -1953, -9426, -3712, 8322, 4467, -817, 5969, 3631, -11646, -11385, 2125, 3821, -556, 3470, 3760, -2653, -2143, 2058, -719, 97, 7242, 5915, -3495, -6480, -808, 316, -3389, -6092, -2997, 3480, 4354, -239, -39, 7602, 9206, 235, -5093, -1717, 855, -460, -3877, -5921, -4362, 208, 409, -4972, -4780, 4772, 11040, 5661, -783, 2473, 7712, 2702, -7761, -8240, -2106, 447, -3325, -6016, -2669, 3012, 4384, 878, -696, 3340, 7163, 4776, -1298, -2771, 890, 1728, -4038, -8731, -4541, 2385, 1661, -2061, 612, 5611, 4216, -166, -1182, -151, 1889, 1211, -2620, -4585, -1301, 953, -1684]
346a684o11M282K134k330k020K11K290K365l612o735J248M902k475l420N040N379
362D964k786k658M2q86J495M847j694n322J283J752n657j628P966L668m064j492
378a70J664j633J590J916l326q85M864m064j1806J762J1725J237l320J118k367
393a695k975O432M090n379J841R308n860j3425K393O495j960L121O541q478r232
408h783N581L454l584P927N279j3600p814R558l05p411Q389R218p185l523L173
423C74q399J097K2498O613j9685o659P094n284k257J2562q88j1662M616K896j7372
438a4456j380K0081K960q112M275m668j8589O550K3610j486q527O038o025j4338
452a4067J1994J5688j0139j654J6284p316k2379M311J0530l566R044J0172k4050
$$ y = [-1684, -2295, 1987, 4121, 1791, -229, -18, 2272, 4637, 1025, -5710, -4462, 440, -2035, -5455, -415, 4964, 2178, -480, -438, -1324, 171, 5018, 3324, -1998, -715, 1037, -4620, -6248, 1718, 5386, 1322, -170, 1494, -139, 1451, 3367, 41, -844, 4020, -44, -11850, -10088, 1637, 2874, -446, 672, -1695, -4670, 1762, 5852, 473, 2314, 11622, 5762, -7663, -5270, 1225, -735, 2386, 8927, 449, -8783, -3202, 252, -3332, 4595, 9874, -3726, -11540, -1982, -2287, -9698, -1309, 7909, 724, -2799, 374, -8025, -6928, 15570, 22183, 2498, -4161, 2933, -2351, -4608, 7954, 7066, -4596, 20, 2916, -14456, -15836, 4245, 7205, -907, 3368, -1300, -19889, -13339, 10271, 8785, 258, 6296, 271, -14067, -2073, 13615, 3476, 1822, 18106, 10790, -11589, -7278, 3252, -314, 8730, 18902, -5148]
465e148k2227J6706J2976q031P008R854j8096j0840J6364n86j1369J6908J6867
478B0386j5754j0643O620p689k53L0985R316l0369j2409J1597m494k089J7452
491A2656l224k0564O514P573k3952o306K9433R574j2503J879n680k2214J2824
504a3990L5054k799j8013P271k342j8238J1676K0823j1734n736J9047r049k9219
517a7249N354J6117m008Q283J1570l0043k9608K1982K2967r698K285J0142j7255
530i161r900K0763P11j4670K0572K3104j9281j8688O553l114J375L0187M691l7770
544d628j3830J7792l000n924J7259q62k1162N801R438k2704o196L1231J2021j4280
558I56j211m999j8465J6697L6917n560k4367N798L001j5837O911J7299j1275o264
$$ y = [-5148, -27375, -10669, 2307, -5724, 1284, 11138, -6958, -17798, -1434, -2020, -13389, 3519, 20386, 4632, -6011, 609, -7080, -7333, 23652, 32968, 2599, -9810, 1787, -2707, -4796, 12656, 9432, -11132, -4618, 2955, -20997, -27303, 2130, 11704, -799, 1080, -4600, -26814, -13990, 21064, 18265, 252, 7523, 5181, -13057, -1381, 19442, 7708, 1972, 21019, 11970, -17249, -11895, 4222, 214, 8497, 20067, -9976, -39584, -17602, 5365, -4333, -2048, 8094, -9161, -19061, 1702, 2413, -12257, 8315, 31419, 12138, -6550, 3, -3111, -1736, 28451, 33142, -4628, -18458, -666, -3666, -9590, 7669, 6807, -14355, -8554, 884, -21820, -28016, 3215, 15236, 956, -255, -5254, -23719, -7022, 29895, 24335, -32, 5766, 8767, -7070, -159, 17140, 5865, -399]
572c99J7672r317l1215M093K1166p81K051O425k3935k1989K3776K2292j0505j374
586b040J1150j2370q602J6725J885j2439J7661K0035k0084k2008O493L242P24
599C72J9225L4l1290r325J8327j363q038J3795L974j5334K196P453j5200k253
613a7427K7401Q799j6683l291j29j0647J0850K5364o371k0262M514M019j3190
626g053L177J3846o939n423J0541p460k1954N764J9104k06l067L837j3050j2241
640b1124J6807J4960q714j943R059p197q355R219K733o699R687J0108j4876j5058
654a1393P150M924j310Q924P12j8122n217J2528o9n503Q860M534r604p29M830
669E15o644r46J5772M289j1838l297K185m368L972J2217l431j1456K297K359p239
$$ y = [-399, 17273, 7956, -23259, -19166, 2000, 1219, 3270, 9695, -14240, -36229, -12453, 9839, -666, -2040, 9110, -3260, -11862, 4863, 6748, -5691, 11970, 32005, 11921, -10087, -3594, -352, 372, 19597, 19631, -11659, -20984, -2657, -4020, -12058, 1737, 5711, -9623, -7427, 26, -15174, -17427, 9974, 18773, 2090, -1201, -1330, -11977, -1127, 24237, 17866, -2396, 2118, 6137, -7053, -3876, 9970, 3031, -2392, 8149, 689, -21265, -15501, 3603, 3397, 330, 4167, -8883, -21124, -4317, 10643, 1929, -14, 9045, 1848, -6507, 2712, 5445, -1254, 8433, 18541, 3665, -11393, -4243, 681, -629, 8295, 9007, -9115, -14332, -1804, -1873, -7376, 1484, 6018, -3586, -4315, 515, -6129, -7075, 8697, 12986, 1148, -2149, 36, -4332, -360, 11857, 8426, -3030, -733, 1626, -5613]
684e613J295R081k126m683M170k766j0160L767J1197j094l412K290m713n783P286
699a264P775m286j786M303l310n504L984K901k863L003L939p145o432M442K734
714D91r16K996Q95p037k202N121N95k453L935J854m346j193K653j937m29N637
730C664J471n174j251J126r61P35L496n56m030N71J141k089K79L474o03j918P12
747H7k29k817J490L381m62j484N94q27j947J554K398r81o66J186r36j748Q06J434
765H33r33M35O63j318j333J192R40o90P56M20j259p88Q96R1l70R70J97m81r21
784g00N45K48k96R51L8r94k33L24q5k04N70M12o97rJ15j14O0O15o6n14QM0l81
807c67J50M07n2j68n4l7n7M3N64m29n6K79m41K56p7L75j25j91N00k20p65K36K96
$$ y = [-5613, -4318, 4763, 2637, -2046, 2124, -642, -10802, -7035, 4162, 3068, -344, 1946, -2767, -8550, -1264, 6511, 2225, 439, 4742, 1432, -4072, -88, 2813, -50, 2953, 6892, -253, -6685, -2243, 491, -425, 2571, 3466, -3571, -5773, -652, -57, -2510, 1425, 3279, -1067, -2260, 393, -1544, -1973, 3664, 5135, -39, -1290, -164, -1125, -390, 3106, 2550, -1480, -909, 232, -1857, -1578, 1896, 1293, -625, 87, -142, -2959, -1469, 1912, 1450, -34, 560, -267, -2214, -660, 1738, 757, 91, 1277, 341, -1407, -601, 833, -100, 335, 998, -320, -1653, -461, 479, -211, 545, 965, -294, -1082, -186, -95, -465, 505, 702, 221, -700, -155, 93, -203, 748, 786, -208, -441, -117, -202, -406, 164, 576, -121, -130, -15, -129, -69, 546, 480, -34, -26, 14, -367, -217, 190, 138, -30, -84, -121, -178, -135, 429, 0, -56, 223, -218, 38, -39, 336, 211, 20, 520, 300, -465, -229, 67]
830F7P3l8J79n92O2K91J85m9J67K9m41m78L83K93l99O83k24j263L94P03k54l00
852e29J216L19j264o8L19m98N06J651j026j166J76O28j245P21J412q90r45P59
870G6p34j057R47K045q17o01O06j259j095K246J895j521n55Q37r07j618J990Q82
888A360j270M31J190k392k178K440J059n38J037J05l809q47L494K25r38J647K54
905A270l118N4K785j598m50M260O63m519q62J449n83J153L949j936n382R97J976
922A08j966P22L547k263k398J871m46l942K755N821j291l078O57j455k365N357
938A634M532m237k365K345j760l014L809K256l234Q31K477n518m808N126L838
953A912j689J107k60o779n95P795J046l648K990J488n248n03M756j840q04O521
$$ y = [67, 140, 102, 281, -311, -249, 42, 227, 178, 345, 374, -67, -545, -162, 131, -268, 415, 191, -1072, -678, 25, -229, -529, 687, 1006, -258, -326, -7, -505, 1, 1652, 626, -540, -364, 264, -981, -260, 1152, 262, -683, 76, -658, -1715, -768, 1277, 460, -141, 465, -794, -1889, 357, 2252, 731, 176, 1013, 106, -1512, 478, 1360, 90, 521, 1711, -681, -2859, -419, 640, 102, 1139, 1244, -2565, -3412, 82, 307, -631, 1016, 1270, -1848, -1794, 991, -607, -1057, 3203, 3866, -653, -1515, -66, -649, 504, 4453, 2517, -2865, -1868, 108, -1858, -1136, 2411, 148, -2250, -379, -825, -4767, -2012, 3809, 2518, -560, 97, -1358, -3723, 1634, 6166, 1929, -436, 1909, 149, -2865, 944, 3200, -34, 797, 3274, -2244, -7052, -1926, 1912, 223, 1330, 1070, -5709, -6304, 1491, 2537, -1111, 1879, 3367, -1881, -2384, 2372, 532, -272, 6249]
969F249K54q428j608L440p28J934N393m075q762K103M644l522M49N290k029m451
985c847K860k27n094M366Q869j823n940Q22j358k184P310N686o837m555M320j816
1001E52m704M263L630m602J013K698p145o311P541O279k668L98o38p111k79J0255
1017C171K028n640K493L114o203j259N308j515j318P264l12j0958k710N722O71
1032a44Q12M450m586r275K865O655l439m67O421j902m913K768N48n098M853J0160
1048I708l068q006Q65k34j641O724M865p602n313M613r42m906L592L857l573L6
1064a025K327o524m818Q443O767l690j283M42n830Q00R222J524o163J747L448
1079E387n698k050M567n38j659N526n80j0390k421P058J291n23K744l223p182
$$ y = [6249, 6503, -1925, -3533, -93, -821, 1113, 6506, 2431, -6331, -4228, 416, -3106, -2657, 2633, 604, -3847, -987, -1214, -6308, -1942, 6927, 5104, -836, -14, -1372, -3556, 3754, 9440, 2603, -1952, 2368, 552, -4152, 111, 3741, -861, 152, 2850, -4295, -10606, -3065, 3214, 546, 944, 306, -6805, -7084, 3171, 5199, -441, 2052, 5166, -1037, -2296, 3012, 1497, 179, 7443, 7131, -3827, -6537, -815, -144, 668, 5118, 532, -8743, -5878, 777, -2662, -3129, 3292, 1390, -3523, -755, -207, -5305, -452, 9708, 6640, -1366, -501, -735, -2376, 4348, 9213, 1611, -3702, 911, -31, -4937, -1345, 2512, -1061, -1025, 1302, -5222, -10040, -1597, 5170, 1480, 197, 639, -5191, -4391, 4831, 6355, 192, 1939, 5387, -311, -2361, 2206, 1668, 9, 5535, 4955, -5435, -7856, -798, 493, -30, 2714, -509, -7691]
1094g691L271N932k953p78N579p26m803J644J022l371M153P408l457p502P41J392
1110a39j264M151L163o019m307L963n8m355K815M057k366r48J448m133k561P177
1126F24M779l682j974R28k902J33N811P98m299J055J828m248j966M079L05j413
1142a44K886o17o917o74N526O81o52J364j853l999K232L925j947n78L524l09l622
1159a174N77J334j602K175L528k387m778P92J631q39J457K115l367k129K073J40
1175d54k295J749L129j685j220P80j451j243L648K483k319j380O50j021n08K800
1191A663N50k355J85J130k101j012K172M78q20R55l98k785rK902K55r99J046m86
1209C71k068P63J533k97l63J492k99j844L78N20k97O61J243j209j848J85J184
$$ y = [-7691, -4420, 1512, -1441, -2219, 3360, 2634, -2169, -525, 497, -2874, 1279, 8687, 5230, -2272, -1531, -139, -1403, 2748, 5911, -108, -4415, -452, -510, -4865, -2050, 2007, -359, -1307, 141, -3992, -6553, 624, 5403, 1721, -253, 675, -2227, -2094, 3717, 4515, 216, 1271, 3099, -1149, -3115, 964, 1269, -144, 2742, 2125, -4792, -5466, 60, 741, 89, 1453, -400, -4399, -2167, 1758, -189, -767, 2757, 2448, -1174, -597, 737, -865, 1310, 4838, 2451, -2327, -1535, 96, -743, 714, 2829, -538, -2667, -594, -454, -2749, -1000, 2129, 444, -776, 4, -1447, -2690, 958, 3441, 1122, -258, 392, -629, -1137, 1663, 2213, -142, 43, 1173, -928, -1940, 232, 710, -110, 845, 447, -2338, -2347, 555, 810, -189, 857, 371, -1697, -934, 599, 302, -61, 1431, 1132, -712, -334, 186, -111, 550, 1793, 584, -1264, -1079, 105]
1226A05l54N76M38p77j056O39M58n94K63J462o55r45K01r2n63J190R97q42o80
1245b29M75l99m07J075J63n38k32O2n00l85Q09J79j51K09J20q51j53J060P1m42
1265f4m7J70k79R8L74j89P8K74N8r55J22M09nL2Q0k30k30K34R5q8L04J89j48l86
1289a04j18K34j50L35p3p3j44J81p9M8RQ3J77m29P4M5q1l2M10n46M32k05n3j30
1313a89J04L25j05q1N5l07K27J4P5l1j0J9k94L8K95j83j7M97n36k73J24M04L9
1336A90k47M02m46l92J77L46J08JK52k59k34k96M94l47K58K61n20j30J3L75j70
1357a64J66M02o82K0L57k71K2N31J56m83n6K33o54K24R27l97o60J95L02p83q9
1378g04J222k43m33N23m33j004M48J177L3m82K5l78q16O76J024j29l81N99n94
$$ y = [105, -249, 327, 765, -12, -1068, -429, 29, -565, -302, 1160, 505, -440, -239, -331, -894, 296, 1293, 451, -229, 246, -153, -560, 515, 678, 140, -92, -30, -530, -915, -106, 73, -78, 131, 251, -600, -753, 307, 378, -64, -111, 59, -220, -122, 252, 63, 141, 415, 473, -482, -360, 49, 44, 76, 156, -74, -304, -70, 25, -63, 241, 430, 282, -104, -222, 12, -138, 197, 124, 51, -93, 88, 9, 57, 66, 149, 326, -103, -29, 16, -65, -97, 313, -233, 199, -6, -59, -189, -85, 240, 135, 54, 109, -198, 29, 43, 118, 87, 77, 96, -198, -160, 135, -48, -65, 432, -104, -377, -253, 151, 190, -57, 345, -101, -493, -316, 30, 138, 139, 391, 132, -102, -398, 96, -251, 7, 268, -252, -382, -369, 6, -164, 2, 404, -278, -258, 99, -172, -150, 381, 537, 54, -2, 231, -423, -199, 728, 331, -329, -134, 168, -615, -704, 518, 275, -158, 365, -68, -1072, -624, 553, 586, 104, 129, -249, -1065, -389, 635, 506, 125, 724, 130]
1397A30p76M02Q66o68M68Q23j163j527J067L79p0L45K80j081p67J333k35l71Q51
1416B86M89r78j74L68j59k51J475L69j348q59P54o7O9J764o50k072K90Q84j180
1435i90l45K009j07j143O25m25j933J073K714j06j293j4j39j088J513J598j119
1452H30p37J138q21j547R47R28p77N30J031k329k038J529J915r78O82K25k259
1469a731k98K119O62j551J503J278j940j086J412l35k93K561M37l309j115J683
1485cl35q3K151o78k697K53J384j403k73K434J31j672P87k10k157J267L642m27
1503B111k236K99J5j502K018K022j800j317J648p14k438Q41J470l94J09J113l069
1520a824j677K465J990p75k43N32j928m20K653L94j451J076J455k072j032J256
$$ y = [130, -646, -244, 622, -46, 422, 1245, 82, -1445, -378, 1, -69, 276, 556, -525, -1292, 41, -194, -565, 286, 775, -203, -377, -9, -168, -419, 1056, 1425, 77, -782, -28, -95, -26, 1738, 1088, -984, -694, 190, -990, -1335, 674, 567, -576, 49, -376, -2309, -1236, 1478, 1372, 79, 65, -74, -1162, 351, 1949, 830, 93, 1231, 410, -1137, -190, 738, -39, 491, 1522, -807, -2845, -1316, 599, -379, 303, 528, -1731, -2029, 90, 752, -799, 704, 1982, 42, -1044, 368, 33, -260, 2301, 2738, -571, -1686, -3, -338, -421, 1730, 1052, -1645, -1392, -8, -1411, -1684, 750, 881, -791, -4, -214, -2371, -1104, 2538, 2111, -125, 174, 189, -1313, 705, 2727, 927, -390, 1258, 544, -1894, -1053, 417, 23, 132, 1245, -1824, -3501, -1036, 954, 179, -64, 468, -1460, -1880, 773, 1167, -284, 792, 2247, 175, -857, 399]
1536C99m70j26K603K09l885j232K177j8j24J717r98k133N07J652j751j69L041
1553A399J34j866L88j53j855J787L360j433k203L45K03o77Q88K035k108r64J360
1570F40n48k247J052J940p57J43L16k027j541K641K138j320j05J99j785rK329
1587A059L27j573J246J069k542j002J612k00k32K032k88l497n28K143M02o50J339
1604G17n88k055Q57J651j393K2K470j08j538k91K19o25J080K253j562j803N33
1621a61K96p67P24J583j633q36J067m67j646J261J451o41m71J41j052p53K348
1638D44J182j027n23M54p48m04J359K26r53O77P64j800r82J262M15j97L66r2j687
1657a264k15J451L5j97P55k75j386M91Q93p95K91J090K13j353PL90p21Q51J202
$$ y = [399, -71, -197, 2406, 2615, -1270, -2502, -325, -343, -467, 1250, 252, -1881, -1374, 278, -1473, -1642, 1399, 1533, -333, 55, -98, -1953, -166, 3194, 1761, -442, -97, 106, -571, 317, 2352, 244, -720, 640, 92, -2155, -1103, 837, 80, 223, 539, -1488, -3029, -388, 1750, 430, 325, 524, -1261, -1270, 1059, 1386, -187, 1059, 2128, -414, -1416, 196, -4, -236, 1796, 1508, -1989, -2517, -374, 28, -622, 717, 129, -1926, -1069, 582, -811, -789, 1681, 1573, 35, -256, -37, -662, 418, 2671, 1109, -694, -161, 135, -632, 92, 1675, 42, -794, 273, -194, -1840, -579, 872, 231, -240, -99, -1151, -1904, 444, 1626, 599, 76, 530, -218, -622, 737, 963, 10, 687, 1451, -349, -1331, -69, 346, 149, 515, 423, -1264, -1479, -28, 7, -190, 565, 290, -1096, -605, 288, -507, -216, 874, 1087, -266, -259, 131, -590, 261, 1463]
1676A463j115j020L11L00l72K93P83p01k07L52k43p03O91Q91m52O2p4q01n6Q33
1696B35Q90j066k39M57o49O6L42L91n30M07M5q83k43O96J16l7R6Rl73j44Q58l50
1718I4k28L24L45o38K16k28R9L61J89l57n65J36M04l06J34N87l98j78q3j7p9J42
1740d6J18l74K44K31k86l92L26N13k47P8m0k83N8M66J8l71j35J45k27l08N53N1
1762I2Q2j37r1K10j72k7J67l03K98l44k14L27J55J56j34n9J03p6O6J9l1j75M51
1785C63m61k30J84L6Q1j82J49L73l48L5j23r0K72M23n05j14K15p2j59M0L39K29
1807D55m95J15o3L3l4N6J77k97OK2k51K40J95P1j93J77k39K77j27P0l02L73o6
1830B00m81j1J74L42n3K12o36P9J53M8l13J17L28J57k69l36N04k39j0R3J42j19
$$ y = [1463, 348, -672, -361, -61, -433, -140, 643, -58, -265, 87, -156, -859, -168, 723, 271, 333, 259, -542, -598, 235, 1125, 59, -180, 277, -372, -306, 36, 427, -103, 304, 349, -534, -777, -81, 35, -2, 94, 103, -270, -414, 444, 94, -134, 190, 535, -103, 113, -115, -16, 345, 534, 177, -388, -252, 152, -154, -20, 567, 169, -9, -92, -109, -188, -46, 72, -302, -58, 173, -113, -505, -179, 334, 87, 165, 125, -158, -100, 366, 384, 13, -122, 23, -204, -512, 41, 92, 174, 37, -54, 156, -16, -43, 124, -179, 119, -225, -439, -112, 43, 199, 65, 6, 109, 33, 99, 118, 87, -88, 363, -98, -328, -144, -108, -27, -209, -60, 313, -35, 0, -123, -213, 59, 482, -23, -137, 78, 6, -153, -113, 226, 455, -40, 75, 12, 45, 11, 67, 244, -53, -47, -25, -276, -36, 159, 230, 37, 214, -25, 252, 125, 195, -107, 266, 200, -281, -292, -118, 224, 171, 383, -253, -174, -21, 27, -286, -169, 159, 316, 47, -289, 215, -24, -34, 59, 201, 82]
1852H2m3J30q3J4J28Q3n15L9N5R6j41J64l23J18K47j44l05N39J23j44j52J51n43
1875d24Q1N27J48m29K7m7j21k59R42j11l10r1P3k13j83N24l3k70L16j88p46O16
1897a71L58J21k25Q9l44j78N47k0M7p3K50m14o20N67N29m68L47P9n40n57K99M54
1919G7l8J72K35j173K4Q15j54n15R39K00n11l78kK32k3P34M6j007PM93n10l61
1941f98R89K42j019N37j37m60m32J300J16n83L29n81n55N34J379l51q66N02k52
1960fk54O29M05q15K64P20q99r71N58Q24n65L45J85j171l89J147M86q45O30R7
1980C75o45k26O14J65n16Q71M66r75l96L63j65J00J173L2j694m70R19l70n7O32
2000A96k31p60N44L73j064Q2J690p1j038L94k91q29J052J148l81q79N73o13n02
$$ y = [82, 39, 169, 86, 100, 228, 311, -204, -165, -110, -14, -155, 9, -314, -196, 51, -93, -398, 141, 264, 120, -32, 119, -424, -343, 184, 332, -97, -70, -117, -238, -497, 445, 334, 24, -67, 6, -207, -390, 134, 101, -169, 147, -41, -787, -171, 187, 308, 83, 172, -172, -350, 197, 177, 224, 151, 401, -13, -633, -66, 463, -5, 342, 421, -119, -676, -377, 77, 39, 211, 446, -727, -703, 112, -42, -557, 382, 582, 71, -307, -309, -77, -100, 634, 680, -327, -320, 173, -337, -698, 291, 533, -486, 51, -86, -546, -978, 322, 438, -145, 184, -397, -952, -418, 961, 610, -256, 246, -6, -260, 369, 774, -41, 223, 943, 44, -927, -369, 455, -110, 235, 420, -751, -1140, 7, 493, -352, 278, 375, -270, -496, 118, 283, -233, 638, 1104, 129, -267, 96, -69, 31, 1204, 1236, -458, -928, -9, -379, -436, 196, -35, -795, -251, 122, -942, -860, 830, 759, -279, 115, -176, -1005, 47, 1195, 814, -65, 508, -105, -607]
2019f07Q96O04o77k12R10o41j666P80Q52k78N30l31j303n09J619P98r08J10O55
2038F22p67k09O79q7l31J036N94j642p04P34J89j80Q05R6j673k58J082k1o1L74
2058B78m23o30L96M73j020m1K088j41q98j05R2o31R93R98q00q90L68m4o71N55
2078e3Q04n50o83J042p38r71O49P32k7q9O0j137k49J133R74p84j77O23o35k76
2098c52J020o34k97R14M98j589k14O79L3L1L60n0j104N7Q90k93k51P87k43q23
2118e81M01K72o81P89N19K00j220L51k05l08J105O99r19j081N61J54n68M1R94
2137E23n89l55N02o03n53Q97R09k42j73j40n68k20P59N35m67M3N9n99j30O98j12
2158A74l00N29J17p91k14K1O78p8J32l53n88K86Q94o04K9N24Ql97J9j86j44K55
$$ y = [-607, 289, 893, 216, 4, 914, 273, -1393, -613, 239, -39, 491, 160, -1143, -1652, -33, 765, -143, -33, 622, -145, -354, 325, 238, -93, 943, 1537, -105, -809, -75, 114, -66, 739, 835, -838, -1096, -14, -35, -96, 278, -145, -775, -379, 94, -926, -967, 1121, 980, 82, -23, 69, -562, 431, 1429, 629, -261, 107, 63, -608, -53, 751, 201, -482, 560, -178, -1149, -500, 232, 205, 116, 176, -961, -1210, -77, 897, 113, -64, 559, -76, -352, 668, 34, -263, 651, 1149, -440, -654, 25, 58, 89, 449, 399, -705, -648, 242, -51, -302, 485, 242, -581, -180, 92, -589, 200, 719, 919, -301, 50, -155, -463, 642, 1341, 422, -659, -98, 56, -512, -471, 523, -66, -421, 81, -522, -1075, -178, 731, 489, 316, 176, -392, -612, 147, 682, 215, 258, 317, -282, -412, 286, 174, -126, 403, 520, -271, -485, -464, 214, 136, 268, -85, -673, -387, 507, -97, -68, 456, 464, 67, 86, -100, -244, 11]
2180A1L97r3o70J98K2j24M74K13k34m47K18k7k98M35K41l59L0J7j67k38M46M57
2202E02l73l24J55m6K2O55m83J2r0r7l29j54N18J03m0L19j44k68k17O8L85k47
2224g3K42k66j46j74M87l7o2K98j27k14j30k0K21Q5j25J82k65j05M14j63j91K42
2246G3n1J79m39npM07J14q9l43j5K20j75J34J98p8N8j36q8r1J52n3K78l21K60
2270A82l13l51o8N57j55L06m5k19j79M05j6o6M1J09l73j07K96q1K79j32K89k47
2292A12j13Mq3OO6j50ON3J52m8k2q1j1R1M6j9j40J72K21o4k01j86J97j28K44K4
2318A48k8k19K64l76L29K17m7l01n1L9K16j62Q6J36k89P5K42K0l73J59R9j18Q9
2341A55j43j21J52M90k90m18L19l65rJ06J68J03k17K02P8m24L62N5m54J39m4K16
$$ y = [11, 408, 315, -355, -157, -135, -259, 215, 428, 194, -253, -35, -62, -360, 75, 316, -43, -13, 4, -163, -401, 45, 502, 129, -195, -40, -86, -64, 591, 108, 120, 30, -67, -396, -550, -32, 71, 31, 350, 206, -62, -279, -211, 174, -73, 169, -97, -243, -417, 70, 33, -29, 269, 142, -72, -202, -222, -1, 84, -41, 141, -124, -229, 185, 22, -169, 73, 22, 201, -238, -243, -250, 157, 271, 182, -161, -176, 44, -131, 3, 201, 123, 181, 45, -43, -134, 18, -35, 243, -78, 182, -131, -482, -550, 7, -148, 158, 113, -106, -285, 120, 104, 38, 79, 188, -185, -292, 4, -77, 202, 70, 359, 112, -1, 3, -80, -74, -8, -158, -152, -99, 53, 5, -17, -98, -109, -18, 28, 9, -131, 41, 262, 198, -3, -189, 8, -120, 124, 148, 120, -99, 165, -211, 118, 335, 288, -13, -64, -25, 191, 29, 115, 251, -38, 37, 279, 299, -74, 85, 184, 66, 155, 12, -109, 43, 533, 243, -175, 144, -221, -230, -124, 44, 147, -70, 132, 210, -214, 148, 203, -251, -112, -156, 60]
2363F0m06K19K88l17M03M4k40k28K09j59KR2K18l36k25L32L2m07O37O1j88l35
2385b44L85k88K33J16M36p46K6J64l00k0M26q8l30L28j18o00K48L53J82l02N63
2406D24o73k54L05O89m80j13L40Mm87L13J97r7O8J72l73o50N25J49n3J35L0n53
2428c82j08J54K39j66N28K21o69j75J94J38l55P02O08r66q8J27k44R6Q85k75r75
2449e11L16j5j86J4L63J87m54L63Q8j016O24M83K12n82J88K9p86Q50K11k86m21
2470c29N29P3o53M79L65l88L8M50o93o16M64O09j30J04k34n81j14N38L42o28K86
2491h9M05l8n93M62k83m2N80N07q54m88N53l10m1R69n78q01L22J90k39k48Q25
2512B09k48k99L55J8o43J80J046j69n22L24l61m44N15J002q83j63N90k05o67K18
$$ y = [60, -346, -127, 161, -156, 247, 291, 51, -177, 32, -127, -125, -33, 185, -151, -376, -44, -12, -419, 218, 279, 91, -244, 141, -147, 86, 202, 638, -108, -82, 82, -218, -238, 188, 100, -230, 98, -20, -620, -372, -19, 163, -139, 424, -249, -503, -198, 491, 11, -102, 238, 242, -245, 68, 265, 168, 236, 408, 35, -615, -90, 59, 6, 141, 171, -382, -490, -336, -97, -263, 265, 486, -183, -358, -164, -26, -381, 321, 929, -37, -125, 2, -242, -146, 739, 464, -511, -195, -210, -396, -382, -19, 168, -286, 77, 165, -851, -227, 256, 468, -114, 74, 103, -683, 167, 378, 92, -329, 200, 273, -380, 99, 464, 76, 114, 564, -129, -745, -281, 328, 198, 302, 68, -513, -627, -89, 253, -375, -89, 316, 278, -315, 147, -136, -178, 402, 909, 55, -433, 120, -190, -231, 738, 160, -641, -319, -129, -368, -616, 209, -39, -338, 17, 35, -608, -428, 618, 449, -73, 251, -110, -554, -39, 963, 80, -83, 507, 302, -365, -147]
2532a47N61l55mM78n16j224J056K91M0j36K85q47n19J237J47p64N20L85o01k14
2552c27J57J38k88Q19P56j243p79O02L17j33M14j79m78o2lK0n0N80J07o05K31
2573fr4l08l6J093m6o19J68k25k04L66O98k25o34L51l76m10L14M76m81K67K34
2594C03n03p98N50P36j58l78M58n12k55M65N52m06Q1L82n50k12M4M55m93P85J68
2615G14q02q11R43j6k11K02P3n69R3M99o6l61N15Mj95k98J86l13J68R73l43m93
2637a08o1K08j00Q0M23j59k62P5J48n19L7M10k28J69K1k41l10N69K47j96m6K25
2659C82o04j88N64K05k17k42N12k78l61K59N9J14J45j68m49k22L23K45k59L62
2679A82q4k35q2J31k2K38R9J22m45k23M40l02J86K39J72m17j79L07l20m4L54J98
$$ y = [-147, 414, 59, 55, 533, 17, -1207, -151, 140, 180, 44, 329, -518, -1037, 200, 347, -417, 103, 488, -113, -327, -170, -32, -320, 499, 1255, 12, -767, -165, 152, 19, 433, 254, -224, -286, -289, -269, -319, 261, 368, -237, -6, -100, -408, -444, 649, 603, -16, 152, -73, -277, 89, 787, 562, -72, 279, -97, -507, -193, 283, -198, 69, 303, -200, -998, -448, 288, 130, -248, 210, -302, -557, -92, 460, 54, 135, 517, -33, -245, -201, 254, -239, 546, 714, -88, -899, 44, 28, -183, 19, 92, -477, -384, 115, 49, -312, 203, 207, 12, -286, -100, -413, -245, 728, 385, -108, -169, 39, -61, 19, 442, 283, 21, 96, 244, -275, -238, 172, -56, 113, 134, -107, -417, 152, 399, 203, 157, 382, -222, -410, 154, 359, 142, -100, 412, 134, -227, 32, 91, 205, 350, 182, -267, -489, -166, 79, -180, 182, 98, -137, -219, -88, -110, 128, 227, 349, -96, -319, 121, -181, 5, 244, 416, -1, -180, 127, -193, -237, 117, 315]
2701C15j66k26J51j15p8J36M5o0k1P8k55j66M64O8j47J07J94k53l3M5k58K92m7
2724G0j17N4J56m1k93M7K09m03K09J05j58J52K36Rl32j47L66q0Q4N8k14j82L05
2747I3J60m89J86j2J98j16Q3P1m11N9K76mP4k6k73P7j2J00J43k40m3r3L81M4j36
2772I0j56K00o5N7m25K82m4l0m8J35K50j58jP0l13K26J75k42k7K12l37Q9r6J24
2796c2j82M54k46J86k70O4K05l73J06p1J70J26o6K43l74J02j49K10j15R5l14M2
2818a89K02j86L12k6R5n08M37N4k29K5j5K2K58m32J80j18j27R5L41j84j2j74K49
2841G0l47N68k70k64M46o7J58o26K31K61j7r8N0l19L5K96l23L51Q7j29r5j27J08
2864b1j74P2K48n2k52P8J7K10p7J93k51k81L45j98J40M1K32j06l61M4J54j4j79
$$ y = [315, 149, -77, 74, -41, -119, 17, 62, 2, -19, 59, -196, -362, 102, 170, 23, 130, 324, 71, 38, 83, -175, 117, 70, -47, 7, 163, 122, -171, -124, 85, -318, -109, -4, -162, -10, 226, 235, -97, -244, 122, 42, 126, 184, -30, -212, 93, 253, -236, -50, -62, 136, 20, 103, 174, -237, -178, 98, 94, 168, 142, -131, -54, -66, 34, 177, -63, -106, -199, 182, 226, 90, -66, 134, 69, 126, -299, -17, -61, -91, -139, -4, 246, 88, 87, 157, -156, 70, 245, 3, -24, 188, -149, -60, -156, -32, -214, 240, -6, 180, -90, -26, 179, -194, -88, -159, 11, 137, 71, 314, -60, 42, -107, 103, -12, 83, -231, -189, 13, -173, 139, 113, 208, -300, 137, 191, -38, -13, -28, -6, 252, -180, 0, -118, -245, -150, 191, 7, -5, -179, 70, -277, 291, 21, -243, 203, 136, 294, -332, -101, 160, 143, 45, 95, -224, -189, 107, -216, 135, 222, 93, -2, -129, -21, -195, -123, 125, 73, -179, -101, -84, 126, 49, 242, -9, -290, 55, -143, -3, 38, 270, 164, -197, -153, 1, -13, -192]
2887a92L15J19k12Q6Nk08oM66k77j23K39m24n1K47J38l17k3M15m79j34O32M0l43
2910h7M05j94j72o5J40O0j42J47Nm35L39R6m3l54N01j53l99L41P7M2k29M55j23
2933B12n45K95L28m56J18N3J2k36l7R0j65J77N17l65k18L90k57o8K17L71m67l4
2955f8J47l46K90j22M03j47O8j70k44J23J39n7K37j66j05k94j20L93L59l59J50
2976A11o6j80K68J6p4k1M55q1m68J05O8Q4r5M29m25l10k33N41N5l66L22j92q2
2999a39o0K58m46K43L85rl39l5N4j88K43N89k80m81Q5L00l93N08L7m03K7P4l89
3022c59P7M52k30j65K01J12k79l49R15r5k65N6K81o82L72L47m56J78J56j39m05
3043b77K02K14J0o0L27k93q29L58M06k21J84M3k06j66K78K97k51n7L80l1l75K1
$$ y = [-192, 123, 242, 30, 116, 121, -87, -93, 373, 96, -27, 212, -212, -263, -16, 122, -195, -218, 197, -282, -416, 216, 256, -87, 318, 124, -48, -113, 27, 87, -55, 92, 97, -338, 1, 97, 54, -300, 201, 48, -351, -10, 67, 109, -120, 335, 212, -333, -38, 290, -166, -48, 5, 17, -219, -256, -166, -331, -154, 363, -2, -220, 170, -87, -155, 62, 433, -34, -68, 79, -267, 23, -99, 304, 157, 225, 55, -189, -66, 73, 16, 253, 87, -18, -312, -432, -39, 320, -39, 111, 45, -135, 133, 149, 75, 54, 509, 428, -40, 65, 133, 217, 122, 551, 126, -184, -417, 124, 179, -187, 135, -57, -139, -199, 59, -387, -144, 241, 232, -107, -142, -88, -276, -33, 556, 276, -205, -120, 180, -213, 295, 332, -71, -44, 30, -359, -282, 170, -60, -225, -24, 88, -191, -540, 375, 280, 15, 71, 352, -330, 42, 389, -67, 111, 267, 128, -277, -75, 139, 149, 89, 416, 123, -706, -348, 58, -163, 21, 64, -142, -308, -30, 267, 16, -41, 339, 308, -67, -46]
3065d6r2J18L40M17m09n49k9l6M1N99j95j70k09K49k30j06J80L74j40j41k19k72
3087e25L38M30J29l32O0j15m3j85O53o2m72K05J60n72J92K39J62l35J08n8p2o8
3109a63O31n43K66l29L64m75K77m5p2J42K18j40k59J14j3J31J05K48n36K46K02
3130C69m02r9K79l19J39m1L35k25k56L90Q3j25k22N0l3k88N05k60J42K2N4j58
3152f0J75O3K3k55j31J73j49pM3L31N6r1k27k18M32J25k77j40K70j99N2o0K56
3175A85j34l7N38o77r4K7P1k0R3J54L5l94L55N5j3M9J03k09M7j39j03N8j06J81
3199B5l5NJ31r6n0R6K0Qk93J87j11j10L25j73M7J38j49K6p0J73j9j11J31K24p17
3224c98J97J48j92K36q7M11l12j03J45k10L84j86j12R4o1L5j52J9L01l75Q6L52
$$ y = [-46, -138, -20, 320, 737, 328, -221, -250, -286, -245, 354, 159, -11, -220, 29, -201, -307, -127, 247, 107, -34, -253, -525, -187, 243, 372, 40, 100, -15, -58, -243, 410, 348, -124, 81, 241, -331, -139, 100, 262, -73, 35, -23, -95, -163, 468, -75, 191, -138, 226, -249, 28, -17, -89, 53, 271, 131, -128, -14, -27, 104, 209, 457, -79, 167, 369, -33, -132, 147, -172, -33, -74, 261, 36, -220, 170, 253, 128, -94, -44, -77, -365, 140, -120, 22, 44, 98, -60, 115, 178, 201, -54, -185, -12, -161, -168, -125, 206, 262, 171, -56, -274, 158, 283, 6, -134, 136, -63, -11, -71, 185, 51, 14, 552, -125, -219, -192, -121, -141, -48, 106, 141, -253, 102, 157, 144, 193, 296, 87, 134, -5, -108, -50, -156, 25, -10, -5, 126, 30, -20, 76, 96, 104, -189, -2, -113, -223, 102, -71, -24, 114, -35, -9, -79, 94, 75, -36, 95, 319, -398, -201, -53, -245, -9, -96, 315, 3, -100, 45, -165, 219, 33, -79, 15, -46, -11, -163, -144, 157, -218, -132, 220]
3246B20k85L10l11o2L10k35K34j79o1M95m59J1j22qK9QJ78Q1j40r4J36r0l76L19
3270i1L6n5J28rM7j04K22l11J82k18K74j01j45J09m4r3J27O7j8K15J62m69j57
3293b46L08k70o1J5K24J12R4k77J78j10j05K89j74K08j49j66R0l3L74k09J33m1
3315A84j83L4J43m09M58l53M01k35j22O2j74R3mJ44rr1P8J71k30K33j79%p7J3
3339e2l1K4o4J92j23L33j82pj93J21o8K36k03J4k07J98j33J07J02j42M45n55L30
3362A42j89R6j59J81j98J61O1j89j94M03J4j67J36q2j23K33m9l2k1j07K12j89
3384f0p6K34p4k66J16lJ89k47K76j64k83K05K04j38J74j47M8nj01Q5l0K36k14
3407d1N2K22j42k04Q8M0J12K3j25Q2l15L43k30J00K73o9k07j34K23j57l8M0R3
$$ y = [220, -65, 245, -66, -128, 182, -53, 181, 2, -59, 436, -23, -12, -134, -142, -113, -105, 73, 154, 14, -80, 56, -34, -410, -91, -55, -110, 18, 9, 56, -48, 174, -137, 45, -173, 101, 0, -145, -36, -80, -173, -46, 21, 3, 218, 380, -89, -246, 62, -208, -269, -254, -30, 82, 176, -101, 77, -33, -138, 151, -23, 185, 36, -130, -40, -73, 301, 92, 225, 184, 1, 35, 178, -231, 227, -126, 275, 40, -82, -20, -194, -101, -105, 39, 30, -61, 17, 188, -42, 191, 12, 12, -65, -52, -83, -59, -123, 69, -54, 279, 97, 90, -103, 18, -50, 186, -17, -3, -210, -12, -145, -38, 64, -78, 367, -188, 142, -47, 49, -110, 71, -127, 34, 95, -94, -288, 115, 129, -38, 98, 16, -107, 126, 77, 45, 24, -83, 129, -60, -136, 98, 24, -242, -126, -129, 60, -187, 89, -75, -358, -153, 51, -87, 87, -60, -12, -17, -118, -33, -63, 173, -41, 11, 233, 91, -113, -25, 15, 127, 150, 25, 107, -208, 135, -95, 5, 278, 209, 2, -132, 91, -66, -104, -64, 29]
3430B9j36O6j93J5K28N3J35m30J03J53o6q0J72Q5j98J63j85K12k17N1J12k54J24
3453e8J5N6J22n2l0Qk21J59K51k65Q7r2j83K46P4kr8Q4j0j88K03q6j52L1K07J09
3479B15m73M03k35j02J52k5P5m9N9Qk35J72Q2J7K5j13K55k59o7K21Np1J70k03
3503B7j44l7L96k30q6J31J23m25K73l04J5K55Q0qR6j16l9l0L06m19J88j0Lk1k80
3528b56J74J13k60K09l0J17l86K56K74k11L5J33l95L06K50l16q4j7l1n6m7J54
3550f8j64J96J26n8N1j90K48k10L5J40j85P0K45l09r2lj6J78J15k33j39M00l67
3573b30L70M4k6j21P4j16j36L88k66p6Qj01L36l30K26J39m31J48N6l10L11K8j77
3596a92L54l87k6K03K55n0k15M0J00p0j97L79n3Kj37JJ76m89L24K89m44M7J46
$$ y = [29, -107, -41, -234, -219, 9, 62, 197, -233, -130, 23, -43, -123, 49, 134, -64, 99, -86, 126, -91, -40, 72, -182, -58, -43, 13, 135, 83, 53, 61, -160, -1, 250, -15, 72, -20, -203, 43, 117, 115, 17, 101, 91, -97, 106, 20, -132, -101, 106, 215, -258, 145, -90, -192, -40, -65, 10, -39, 20, 28, -207, -35, 47, 64, 89, -24, 231, -28, -95, 126, 131, 60, 230, 27, -117, -154, 242, 12, -74, 57, 180, -245, 28, -276, -261, -6, 74, 66, 162, 46, 7, -23, 283, -136, 52, 42, 45, 24, -256, -82, 31, -229, -20, -50, 67, -319, -63, 211, 0, 35, 168, -227, 79, 329, 13, -71, -88, -119, -175, -222, -68, -232, -36, 90, 32, 83, -107, 141, -69, -34, 106, -79, -9, 236, -73, -165, -168, -184, -6, 109, -124, -263, 137, -230, 140, 184, 158, 37, 111, -5, -141, 247, -19, -95, -87, -188, 148, -182, 44, 183, -248, -100, -44, -354, -43, -15, -192, 162, -225, -251, -48, 207, 157, -58, -18, 82, 12, -185, 194, 141, 143, 6, 7, 183, -306, 18, 307, -137, -90, 56]
3619E6j69K07j00K11k76j96L47q1j13R2j56K01O6j42j14J64J10r6M3L8k19j70
3641b97K84K25j67O5O0L4j89J0o6J18l57L03O4k96R7r3J26J40M1J28k87j0M0k2
3665d9L85k23k18N4J43k28j16K55j83K96Kk70L6J57Q9k24J81J57J11l28j02q7
3687a62L37j14J64j52ON9k22L75l32K1J11k22K31k42l51M05K21k42J20k57K04
3708d2O2j22oL05k46J91k27J5M6L86m96L3q6K20j27J59j58k16K56k6J39j64L1
3731g3J68o1l2J96j60l35K12p1K45J31l70J81j31J85q8J59l13L29J3p6j49J55
3753A15o3K12l21K5J57r9k69K17J32N3l44R5J00q1N1j86K35Q8k98jL03k27J10
3776DJ91j02j74pJ01R7o3k55K68J08K6r4q9k7J22j06k88K21K82m82L55K6l18J70
$$ y = [56, -113, 94, -6, 205, -71, -267, 80, -1, -114, -22, -178, 23, 89, -53, -167, -3, 107, 11, 54, 92, -127, -297, -13, 212, 45, 110, 170, 204, 15, 25, -41, 77, -280, 23, 87, -209, -112, -205, -79, 61, 102, 230, -57, -67, -27, -49, 336, 113, -105, -51, 92, -136, -252, 3, -180, 116, 118, -152, -116, 41, 130, -94, 87, 244, 355, 27, -75, -162, 175, 61, 225, 73, 79, 138, -84, 291, -41, -20, 91, -131, 100, -142, -493, -88, 133, -109, 11, -246, -42, 20, -102, -108, 197, -49, 142, -85, -70, -24, 362, -134, -101, -187, 33, -94, 65, -93, -309, -53, -79, 60, -104, -73, 95, 34, 2, 198, 38, -297, -85, -156, 89, 220, -150, 31, -100, 85, -3, 156, -157, 172, 185, 109, -40, 115, 52, 264, -57, -32, 125, 26, -243, -26, 106, 159, -185, -90, 10, -71, -20, -206, 29, 117, -181, -182, 121, -106, 4, 195, 93, -81, -88, 13, 110, 47, -208, 60, 168, 194, 100, 11, -16, 106, 0, -288, -67, 215, -267, 88, 114, -204, -34]
3800c4j21N0k47M14j54k94K80O0J37j08J72q8j16kj01K51j31J26J03l17MJ21j7
3823a2J58j6n9o2n3J39n4j87K3K11k78r0L14j60K22j64N06l33O6k83J99j51l4
3846i8Q9N7j42q7p5L54j71O0k3j76L18j92J63j44K14J11k22K07j35m90K60L30
3868B08k50q3J4M2K6Q4k89J30K15L34l80m9K10q4k7k7o1l7qP1j90j65N39o1k49
3893h7K2J90j03J28O2j09j77J60k33K86p4J94m48N4K00p9J58q3o1N2M6R7mk77
3917h6OJ32m6r9L80l21K59N2m20J70J47o8k59J20K4lJ44q6l1n0J08n8Q2J16J5
3942B28j74n6j41J68K20l60qj25o6N57m11l0K30K01l43J58O8j51J26M9r2j87J86
3965D7j95J59J52m5j46Pr1j7j7J68N7j18J68k75R1j55K30o6J10o4J41k01k4J31
$$ y = [-34, -155, -105, -352, 62, -92, -386, -106, -46, 91, -17, 155, 67, -49, -51, -152, 99, -32, 94, 197, -120, -116, 5, -12, 146, 130, 71, 9, -44, 95, 41, -146, -123, 88, -190, -280, 34, -126, 96, -68, 438, 105, 171, -112, 87, -64, -98, -9, 48, -94, -181, -256, 98, -73, -13, -36, -212, 106, -86, 77, -67, 147, 258, 36, 243, 108, -382, -122, 208, -42, -125, -111, -69, -43, 41, -248, -118, 97, 431, 51, 2, 212, 128, 101, 74, 13, -24, -32, 39, -151, -316, 223, 162, -87, -65, 125, 22, 150, 212, 103, -74, 86, -147, 139, 65, 259, -189, -135, 65, -14, 144, 61, 0, 52, 98, 195, 191, -86, -80, 52, 6, -93, 287, -34, 225, 277, -143, 27, 174, 106, -153, -33, -9, -12, 132, 46, 15, -35, 73, 15, 97, 213, 228, 54, -2, -143, 25, 245, -115, -123, -248, -314, 243, -168, -198, 32, 233, -110, 48, 116, -35, 91, 140, 48, -139, 47, -148, 11, 163, 118, -28, -21, -112, -129, -146, 22, 79, -39, 129, -146, -55, -210, 20, -46, 64, 0, 141, -60, -84, 47]
3989D7j01L6K37l25K82k6k70Q2l7j8R3oM8K1j0o9k24L43j47K35m7k37R4q3J27
4014D5L5j95j5K80k77J09j08M07q6L9l96J03K32J4j30R5k9n50K82K97j77Q1j30
4037g4P8j46J59L1J39l22J49j42r0J17j6K08k36M5l1j11K40M8k18O6L5R8k15J70
4061a8P9k08J12R4J06l48J59K93m6k64j85m4K95J0N2k06L53m22K77Ro09N86j57
4084h2j3L2k36K34o6K16O9j97K74k06J51o4ql19K58L5p9j71M45m91K60m40L29
4107f9J62j53O9J5L6RR3l0k34J02O6l32K23P6P4j21n6M2NJ69k62N0k99L07L74
4132C16m91K26J30k95K6r7J10n4K58j09Q1j84J23O8l02J52qj21J33J82k0j80l2
4155h8J80j81L7K95m07J62K1J16p4q9J50k6K14m81K84l80L79K05m12L02j47m9
$$ y = [47, -54, -18, 219, -106, 176, 150, -120, -38, -75, -93, 0, -6, 42, 63, 53, -16, -240, 103, -44, 191, 144, -93, 1, -82, 45, 80, -115, -130, 150, -127, -18, -126, 281, 195, 234, -162, -59, 173, 187, 57, 152, 123, -427, -145, 152, -25, 56, -74, 4, -142, 17, 48, 187, -135, 14, -128, -218, -101, -117, 91, -145, -100, -131, -242, -2, 46, -172, -106, -71, 27, -188, -18, 61, -147, -35, 59, 165, -183, -24, 269, 223, -41, -226, -270, 25, 35, 87, -119, 234, -188, 89, 98, -511, 75, -82, -95, -63, -299, -65, -131, 85, 154, -43, 231, 25, 176, 112, 104, -215, 43, 78, -1, -172, 273, -218, 42, -398, -69, 93, -60, 9, 24, 60, 69, 162, 132, -102, 0, 66, -266, -43, 33, 107, -14, -70, -28, -23, 146, -116, -66, -365, -58, 316, -175, 51, 181, -114, -88, -185, -75, -129, 129, 20, 101, -83, 40, 108, -194, -42, -50, -171, -38, 144, 124, -56, -88, 92, -89, -52, 243, -164, -2, 19, 135, 61, -28, 122, 96, 310, -171, 113, -267, 112, 317, -95, 207, 60, 11]
4177A1K3J07j06k53J38Ql5J85j79J93o2j57J14q3l9R4o8J69K46l07o2K01k8q0
4201C0j58K73k35K15N0l20M6K0l0j50L35j26J03or6P9l5p0l2R8J23M9l53QK07
4226B5q9K05j94J80q2P4K3j20p0J36j59O6Pp6J65Q8k39j18L85k11M8J34m7K4l
4251A52k84J82j4m9l35L58Nl6J04O2m7j63P6P9J20m31J56J49k22N7r9K67l94M68
4275A61O1j25m45L96j59J28K5Q7k68K57n5r3L5J76j12n8j3K6o2j50J7j8K04k72
4299b57K89n0j26K99j60l3K8L9L4P2l18q3P2J51mP3q9L38m73J02J02K41r8j65
4323a6n4J91N0k65J31j05j30r6L01R7j27J13J09l11K54j07j96K39J17l21R9Q4
4345E7r1l9J89l26m6OK98q4J07j0Q5j09K32m93K49K48l67J3J76r9K72k19p6K18
$$ y = [11, 34, 141, 35, -218, -80, -72, -107, 78, -101, 92, 30, -127, -13, -96, -135, -41, -109, 60, 306, -1, -63, 138, 110, 30, -128, 145, -90, 125, 175, -145, -99, -79, -109, -259, 76, -50, 53, 47, -49, 30, -5, -75, -107, -9, 114, 163, -190, -182, 25, -64, 141, -53, 127, 45, 119, 142, 22, -48, 88, -71, -5, 2, -74, 91, 179, -60, -178, 207, -4, 44, 178, 131, 155, 152, -132, 50, 36, -13, -348, 10, 15, -21, 83, 145, 98, -65, 11, 90, 210, -221, -65, 84, -138, -81, -180, 87, -307, 161, 222, 97, -348, 48, -111, 17, 42, 129, -139, 118, 63, -30, 5, 181, 69, 11, -2, 24, -38, -188, -171, -189, 15, -257, 32, -18, -144, 155, -5, -38, -10, 29, 63, 135, -183, -266, -194, -43, -47, 26, -63, 275, -198, -96, 6, 247, 149, -16, -70, 121, 171, -94, 37, -68, -198, -294, 7, 104, -23, 90, 199, -112, 142, 35, -161, 78, 195, -126, -27, 57, -34, -73, 116, -210, -256, -250, 48, -36, 71, 61, 146, 37, 269, -224, 25, 273, -94, -81, 95, -4, 268, 49, -27, 191]
4369A91k12k50J77K43m26L26Q7J26l35L43j28k21j8l5J51O4K10k14q3J96k74L4
4391d8N8J11k9Q8j62ok38J59J39j97J20J8j16L27j8l35N1L2N9k68MM66j55m8R1
4416A03J20n50N28k15q8J34j41M21k61l53O68n17P4J20L4k20L90j82l4j0m5r5
4438a19L65l30n0J37J39p5P4J20l65K07j44J20j58J00j34L66j21l48J7K84l57
4459b72N30k4m12J32P2J21k31J97J8m2j22J73j77p4J38o8k51L00K9l02K9L13L05
4482C82j72j32K3N4j73j27j71L64j12L95m43L68k25j68P0j39k8K18j23L92j63
4503I0O9l05J04j95K49M0J11J27j20l9j67k1n5K39k79J99j23J37j04R0j28J03
4525B2j2k29K10K09j61k46M38m92Q5K38l41O2J95J23p9M7m5J0k73J78k96J53R5
$$ y = [191, -21, -271, -94, 149, -277, 49, 136, 262, -73, 270, 142, -79, -97, -132, 19, 83, 293, 79, -4, 192, -82, -48, 10, 121, 92, 180, 18, 12, -226, -67, 72, -125, -5, 13, -103, 224, 206, -129, -78, -46, 13, -255, -251, 215, 60, 12, 103, 223, -327, 201, -14, -102, 32, -109, 312, 51, -302, 366, -151, -77, 43, 77, -143, 247, 65, 31, 21, -24, -119, 246, -84, -134, 3, 142, 67, 141, 261, -104, 103, -41, 79, -79, 21, -113, 253, 132, -216, -199, 85, -272, 258, 234, -178, -46, 26, 147, -84, 113, 131, 89, -33, 140, -37, -111, 27, -41, -292, 8, 37, -265, -236, 77, 382, 210, 78, 101, 155, -18, -145, -316, 48, -64, 331, -112, 256, 31, -137, -67, -206, -234, -16, -139, 253, 90, 159, -146, -42, -237, 12, 52, 163, 290, 170, 131, -36, -57, -112, 127, -152, 47, -76, 61, -43, 47, -81, 22, 10, -219, -9, 200, 39, -207, 231, -261, -176, 62, -279, -217, -22, 101, 22, 69, 24, 34, -239, -61, -357, -204, -109]
4548a09l4K04J15m03j0K48j67R2O6p4P2R5j17O5j04j06K93j5J8J15m62J32j17
4571b03L17j00Kk05M01Pl21j56K89l03L95j49o9j9L6N5j04R7N0j88J01J37l2r3
4595e5P5J1j50J34l80L78j01k5J44J06N3k04K29k41M2P3J17l5j83O5n5o0J66j50
4619d6k00J24J28m4j1J15O2j08K23l33K12k17M0K2jk1Q9j45K05J48j31j43K47
4642B15l30N4Kj12m4J87K40l2k63K13J07RQ7m41R1J14L5j16k0j8L69k85R2k12
4666e8j61J27J30q7M6m1K18k62J28j19P3k61L30N1M1l04R1Q1J13k55L95j72j37
4689c3K90p6P1m00L5J69j88K44k2j2m8J44k91R3J23l12M61p2k9k74J55J33l17
4712a56K84O9m06J33K17p2r1j5J08N0q9j2r7K2J11k08J0J54j60k31K80J62k44
$$ y = [-109, -143, 61, 176, -227, -237, 11, -156, -64, 2, -72, 0, 95, -22, 43, -61, -167, 126, 111, 129, 244, -218, -86, -203, 114, 14, 16, -189, 212, 219, -102, -258, 31, -272, 123, -26, -95, -114, -78, -23, -127, -30, 20, -168, -67, 70, 38, -55, 20, 31, -119, 15, -365, 13, -88, -113, 31, 137, 190, -14, 215, -26, 16, 89, 206, 171, -12, 53, -2, -62, 104, -46, -246, -122, 6, -38, -49, 66, 128, 20, 243, -90, 122, -95, -55, -33, -34, -55, 34, -111, 94, 242, 111, -32, 215, -115, -61, -59, -171, -215, -28, 212, 180, -83, 130, 237, 246, 333, -108, -17, 97, 132, 16, -4, -22, 347, 62, 154, -58, -219, -92, 38, -49, -3, -44, 174, -88, 40, -79, -6, -267, 63, 114, 155, -149, -58, 23, 136, -119, 276, 104, -33, 257, 181, 252, -148, -113, 56, -132, 112, 90, 78, 30, 174, -117, -24, 99, -213, 248, 176, 147, -127, 28, 161, -156, 128, 197, -209, -76, 141, 69, -22, -37, 71, 121, 32, 20, -77, -55, 56, -152, -142, 12, -148, -379, -99, 63, -181]
4735a81J05K23n7K3j31J0ON4l1o1J46r1j02m1N6J06P1j15J33j64J25J57l74j67
4759c00N5N13j62n5L92k82m08J5J18J08Rj58PP4R8p1q4j07K81J6J13k05OJ20M3
4784A36k17j09P8m5J58J37j29K29j51L8k20J83j16j30J63j14J45l0j52J63k52
4805b35L02k86K42QK29j81j86N3R0j21J5l3J96l05L20r7J67j57k6k09J56L76k76
4828D2j86QK08k6K64j38k68K00j5l95J08L78l6L7m1l57J71k1Kk47M30j10k47J57
4852h2k6o0L63k16l76N39k93J55J00j82QJ54J02l07L57o7n82N82l18J20j17L40
4874A94l41J05K87l1k17K79j62m3K6p8q9J06R0ko5r3O8j63J46L8J83l83P3o2L55
4899B21m37j30K86m8J51j43J1M4K68o6M2r7Rj55K6J45l48NR9m0K4J88k35J03o7
$$ y = [-181, -76, 147, 90, 113, -18, -8, -2, 52, 21, -40, 106, 15, -87, -128, -72, 34, 105, -10, 123, -41, 84, 241, -133, -300, -245, 268, 106, 51, 443, 161, -247, -232, -114, -6, 3, -155, -148, -74, 24, -47, -131, -238, 43, 59, 172, -33, -27, 93, 136, -81, -190, -112, -157, 1, 138, 9, 238, 87, 125, -95, 88, -28, -158, 5, -109, 36, 6, -146, 17, -235, 67, -219, 23, 31, 260, 79, -107, -54, 36, -85, -70, -103, 93, -212, 108, 11, 178, 21, -5, -214, -58, 318, 42, -144, -136, 72, 46, 310, 172, -96, 104, 89, -306, -198, 180, 144, 181, 140, -217, -46, -67, -65, -312, 118, 8, -239, -82, -108, -168, 195, -21, -397, 142, -151, 4, 104, -78, -70, 84, 186, -121, 236, 169, -413, 169, -149, -29, -146, 194, -147, -42, 245, 214, -3, 276, 114, 71, 97, 19, -70, 36, 126, 124, 59, -34, 34, -129, 17, 55, 238, -145, -72, -134, 221, -216, -346, -60, -108, 43, -100, -89, -45, 223, 157, 199, 102, 111, -44, -18, 127, -221, -216, -117, -157, -133, 55, -180, -77, -144]
4924a44L27k16o4qmK25J0k09J68r9K15m5m9k91MR3j22R9j4K33k85J5P7j03J21
4949f6J45j30j03J95j23R7K56l36ML30l39o9J70j11K78j79R0j73L38k86K33l07
4971h6J68m6OQ4k02N1P1k82M26k87l45N50j54M8m5q5o5J50J58k12J36j07J01K01
4995B34j71R7k10J57p3pk86M19r6j63r0L69j34O4l8r4N5o7p1O5J1N5j50K3J06
5020EP3M7k40J34k62J41m8N9K7J72J27j43n7J28j74j6j03J91j56J15l31K41J46
5043G6M0J16l2l88O8K28j79J49j9r9j68K59p6j7j19j36J63J88Q2q7j7k00N82m33
5067a9O7j87k3L4M35m24J7J52q5rNK60o0p4j05j13L11j66q3P9j28K82k34N0J19
5092A01l0n7J48j87K26k93K26j21J06n4j63L07n33L64j02J81j50K01j88Qk07K90
$$ y = [-144, 183, -33, -97, -105, -109, 116, 126, -83, 85, -14, 201, 156, 107, -184, -180, -87, -209, -110, -124, 109, -176, -161, -84, -187, -66, 79, -51, -154, 41, -82, 15, 271, -65, -61, 269, -70, -139, 31, -80, 198, 19, 109, -64, 274, -12, 221, -86, 82, 36, 42, 126, -76, -25, 46, -236, 190, -97, -442, 108, -46, 2, -43, -128, -193, -43, 115, -97, 39, -68, 33, 234, 63, 160, -50, 107, 34, 27, -259, 160, 64, -99, -189, 180, 46, 110, 72, -22, 33, -34, -105, -40, -29, 26, -124, -101, 5, 78, 125, -115, 19, -243, -102, -150, -91, -64, 108, 235, 92, 35, 163, -11, -27, -130, 61, -95, 20, -311, -70, 76, 116, 232, 200, -188, -120, 108, -71, 78, 59, -40, -208, 51, -25, -42, -161, -297, -134, 54, 136, 49, 32, -168, 414, -19, 48, -139, -162, -128, 307, -117, -100, 52, -33, -42, -37, 223, 163, 89, -16, -129, 182, 16, -67, 12, -116, 166, -68, -18, 101, 71, 14, 162, -25, 201, -92, 134, 13, 119, 65, -98, 209, -324, 40, -62, 119, -31, 170, -18, -10, -217, 73]
5114G3k72J77K44j66k45J75O0r0K36k13J73j20l0L3J08k8k09J07J51j50l60K23
5136a23K2N1p4J9K22j95r8K18J32r4j84L06l3k19K4R9r6R7k47K10N1j86J31K8
5160F1J36l47k05N83l11n8J98j38J33j80nK08j21J95k6j6L3R4l18J47J3k33QL70
5184B21k62L50l69j1J11o5L63k58O3l49J26J11J32m0j48J43o8J46N9j88r6j16
5206a45r7J68K19j9J20r8l17K99l59K7J65L2j87J25J87k63K09j65J50j14jJ37
5228G3j29j64P3R0l7m0K31k12k05L83j7K75k62j77J8N2l83N42l63J94J11k93L03
5251F3m9n0k34M64l10Lj00K31j41J87p3M4M5k15K49NJ8j12k0J02q0l21L35l01
5275b60L42m5o0k35N27k98O2J41J7q3l63K74J43J10k54J00l9j37K0L1K1n2J03
$$ y = [73, -199, -22, 222, 56, -189, -14, 46, -44, 192, -21, 152, 32, 2, 35, 143, 115, -94, 13, 164, 14, -346, -123, -101, -50, -124, -105, 117, -78, -176, 42, 174, 80, -104, 202, 169, -50, -26, 73, -23, 74, -173, 37, 88, -98, 33, 61, 197, -150, -355, 228, -83, -141, 57, -81, 52, -128, -133, 75, -46, 149, 123, 107, 140, 234, -84, 63, 76, -157, -149, 221, -41, 309, -60, -71, 40, -25, 338, 80, 143, -206, -80, 31, 163, 123, -25, 118, 50, 196, 255, 67, -29, -145, -242, -74, 145, 126, 246, 148, -169, 130, -229, -202, -37, -5, -192, -67, 120, -143, 66, -99, 51, -63, -64, 73, -56, -220, -147, -57, -94, -134, 97, -115, -320, 63, 46, 321, 59, -118, -100, -48, -431, 111, -252, -58, 53, -240, 63, 14, -36, -270, 194, -116, -113, -213, 18, -123, 64, -9, 35, 80, -135, 114, 119, 137, 25, 5, 107, 27, -294, 41, -260, 82, 37, -23, -258, 269, -29, 33, 174, 191, 108, -255, 19, 162, 272, 18, 118, 79, -58, -38, -7, 14, -38, 65]
5298F5P5n2j07k1L6J85m7m05J20J71J81m7k10J71J82k15k37K08K0j71L04j46k27
5321a67N8J02j79J26K27J9l28O1j0K31O1l48J24O8n6K4O4k98P8M96l17K65l85
5344h4Q5J61l37K46j84n2P5k10K61jj22L14l93J59J21o4J02p5Qj15J74J47k86
5367g0J67K30n22L28l46O4j32M80m86K53L05j83Q2l5J6j25k46K44K93m72K25k6
5389D4m6K20m14L27Lj06p5p5P0L26k99j8j27K08J19k29Q6j22J37j4n7N6r8m4K57
5414A29k66J01J09J50j38k4J08j53j5j56M02k24K20k91JJ13J19l06J12Q6L5n6
5436E6k74J62J29j47L38O1l61R5k35KK89j65j14J40P3k92r0N22n7k54J51J32j17
5459D4j39m6K64j10j4k7J10j71Q1l1J54j15K24m75J08K7k8J19K02k39P1J50l44
$$ y = [65, 140, 88, -19, -40, -4, 181, 134, -271, -151, 20, 201, 154, -56, 115, 297, 82, -155, 53, 73, -98, 206, 60, -167, -109, -7, -186, -60, 167, 186, -142, -81, -91, 140, 201, -147, -23, 45, -11, 13, 77, -221, -143, 353, 36, 301, -84, 1, 162, -175, 71, -113, -165, -90, -300, -39, -40, -162, 152, -241, -82, 39, -25, 77, 2, 10, -105, 69, 216, -70, 97, 327, -195, 133, -213, -149, -281, 199, -287, -34, 271, 88, 170, 135, 151, 26, -220, 24, 317, -155, 70, 44, -2, 218, -196, 131, 134, 28, -47, -122, -52, 274, -25, -43, -170, 38, 157, -72, 14, -108, 29, 15, -42, 14, -84, -128, 129, -137, -36, 73, 223, 85, 61, 169, 16, 1, -155, 247, 23, 243, -48, -47, 66, 185, -121, -9, 77, 112, 56, -218, -56, 73, -74, 264, 325, -36, 59, -176, -174, 115, -50, -164, -24, 49, -243, -333, 189, 132, -122, 29, 161, 44, -95, -141, 123, 13, -1, -28, 82, -89, -8, -39, 115, 0, 224, -251, -143, -116, -144, -25, 177, -62, 9, 159, -185]
5482a85P3j0L53k94M2l02L34J9P6j80jJ8j6l3K00m2J46k86J50j44J73j39j08j20
5506b76J11k0M41l15J71k20r3L43k25L09j49N7k46J82l8j16J0K10JM8k98l1L36
5529A92j97k18K07J52k1j68J04J46k69J70J41l65J16J11k50m6M39j96J98k86R1
5550E1k35L41R2j05j29j64R0k69K86r3K02j94L95l28L9M1R5q9k62O0K02l52K77
5573d9J70k40%Q8J01l5l75K59j10K26K29q1J5K3j34O7n3KO9j99pK44m42K51J4
5598C3N4j85J02j17O1P5j22L05j22J58k30k04K26r5o4J87j59j9J79r8O6j62J22
5621ij1J1m0R2J22k68K27Kp1m4L4o9j47K1j42K26J21J22m41K48N6k19L93J2k64
5646c8j44J72on3QM3J5k55J58J19L89m96K19km08K23L1J16m6k38qK8J90J12k73
$$ y = [-185, -112, -122, 231, -63, -21, -323, 11, 30, 106, -74, -75, -57, -73, -106, 94, 52, 198, -88, 62, -82, 91, -48, -156, -276, -165, -185, 256, -59, 112, -108, -201, 142, -83, 226, 77, 134, -112, 70, 32, -84, -74, 136, 137, 185, -113, -144, 192, -5, -223, -16, 136, 115, -53, 51, 197, -72, 98, 239, -126, -10, 101, -149, -195, 244, 48, 246, -40, 51, -184, 157, 249, 144, 15, -149, -59, -328, -42, -135, 67, -127, 268, -60, -21, 20, 115, 26, -236, -176, 26, -326, -49, 121, -119, -119, -31, 70, 35, -340, -81, -191, 35, 264, 183, 198, 221, 87, 154, 101, 103, 172, -27, -34, 210, -232, 19, 33, 87, -98, 4, -113, -52, 23, -99, 206, 84, 242, 12, -192, 34, -61, -125, 62, -97, -116, 63, -35, 31, -131, -9, -20, -9, -49, 43, 165, -103, 124, 126, 55, 11, 45, -24, -171, -150, -292, -66, 55, 177, -264, -16, 40, -179, 214, 226, -38, -182, -10, -16, -69, -61, -18, -3, -258, -100, 19, 408, -88, 131, 129, -279, -56, -25, 91, 45, -193, -201, -173, 17, 129, -144]
5671a44K20q5J58j69j15L09Q4j68o3k20L35k44kN9j48K38L5n4k8k02K60O5K5j38
5695Hj53J82j19J76j23J69k27J39j78m8J93q6P6M2jm4K35k18J25j5k12O5P9m2
5719B3k09R7m9J96o1j95L03k48o9K41o9Q2R4j60j06K91l89J15j58K54k80L06j04
5742i5J23j42j46K97J33k44n9j14K80j67K21j82J15j1r4K70l83J11K89l72O7R9
5764dL2j69j7o5J94o8Q5K91m21M94o12J41N6j02K6L5J86N9j95Q0J9J30r0j17M4
5789A2j36J77j08j38K24r2K09j03P4k6p7j35K9J45k5k7j34O3O4l19J36K18j43
5812a12LQ3L26j50J4j4j24k47K17k5J75j16j25qJ93L7L3l12L56k95j33M20l14
5835a18K16j29M1l8l9j21R1J56k35L3L7K15K0q1J6q1j5m5K23R5j74l70K51j21
$$ y = [-144, 76, -9, 149, -20, -135, 174, 258, 90, 27, -193, 142, -102, -104, -45, -193, 45, 80, 26, -2, -204, 56, 121, 146, 8, -145, 37, -82, 94, -29, 140, -87, 52, -126, -174, 19, -67, 9, 51, 50, 6, 241, 23, 148, 133, -79, -14, 65, 23, -186, -89, -138, 58, -3, -198, 105, -143, -212, 29, -40, 42, 136, -24, -130, 161, -228, -113, -271, -17, -297, 9, -95, 28, -114, -260, 37, 170, -74, -133, -247, 33, -134, 87, -95, 20, 9, -85, 185, -198, -87, 202, -170, -103, -4, 28, -141, -158, -223, -29, -97, -12, 279, -142, 352, -260, -119, -63, -165, -139, -104, 82, 141, -54, 26, 45, 175, 85, -32, 12, -124, 53, -55, -193, 31, -61, 148, 45, 119, 93, 16, -119, -90, 55, 30, 3, -131, -68, -4, -323, -187, 31, -112, -109, -26, 300, 150, 164, 150, 26, -221, -4, -29, 146, 30, -95, -103, 90, 127, 160, -152, 204, -91, -224, 196, -118, 98, -31, 10, -28, -67, -188, -97, 59, -176, -143, -106, 109, 129, 48, 64, -17, -32, -77, 146, 241, 67, -303, -52, -173]
5859a73L69j81l6P9n1n4Q3J4L1M2K4k18l3J28n3k6j55J33J98l3j40p4L82k54L0
$$ y = [-173, 196, 15, -21, 58, 7, -47, 36, 50, 81, 123, 147, -71, -104, 24, -29, -55, -210, -77, 121, 88, -52, -126, 256, 2, 32]
$$ [...]
8191b13
##END NTUPLES=NMR FID
##END=
