##TITLE=1H_Pr NCO-D
 200.13MHz, DMSO,
 8 sc
 
 6.8.2025
##JCAMPDX= 6.0         $$ Bruker NMR JCAMP-DX V2.0
##DATA TYPE= NMR FID
##DATA CLASS= NTUPLES
##ORIGIN= UXNMR, Bruker Analytische Messtechnik GmbH
##OWNER= pz
$$ XWIN-NMR		Version 3.5
$$ Wed Aug  6 16:31:08 2025 Russian Standard Time (UT+4h)  she@DPX200
##.OBSERVE FREQUENCY= 200.1313
##.OBSERVE NUCLEUS= ^1H
##.DELAY= (6, 6)
##.ACQUISITION MODE= SIMULTANEOUS
##.ACQUISITION SCHEME= undefined
##.AVERAGES= 8
##.DIGITISER RES= 18
##SPECTROMETER/DATA SYSTEM= spect
##.PULSE SEQUENCE= zg30
##.SOLVENT NAME= DMSO
##.SHIFT REFERENCE= (INTERNAL, DMSO, 0, 14.3821)
##AUDIT TRAIL= $$ (NUMBER, WHEN, WHO, WHERE, WHAT)
$$ ##TITLE= Audit trail, XWIN-NMR		Version 3.5
$$ ##JCAMPDX= 5.01
$$ ##ORIGIN= Bruker BioSpin GmbH
$$ ##OWNER= she
$$ F:/spectra/data/she/nmr/H-C/1/audita.txt
$$ ##AUDIT TRAIL=  $$ (NUMBER, WHEN, WHO, WHERE, WHAT)
(   1,<2025-08-06 16:30:02.59 +0400>,<she>,<DPX200>,
      <created by zg, POWCHK disabled, PULCHK disabled
       configuration hash MD5:
       00 E9 B6 7A A2 85 ED C7 34 08 36 98 17 FE 4E 26
       data hash MD5: 16K
       97 5A EF 5C 04 16 80 44 C5 02 8E 3F 93 A9 03 E9>)
$$ ##END=
$$ 
$$ hash MD5
$$ 0E 58 F9 17 58 A3 C4 D2 9E 93 9C 34 AE 55 6D 51
##$RELAX= 
##$RELAX= 
##$RELAX= 
##$RELAX= 
##$RELAX= 
##$RELAX= 
$$ Bruker specific parameters
$$ --------------------------
##$DU= <F:/spectra>
##$EXPNO= 1
##$NAME= <H-C>
##$PROCNO= 1
##$TYPE= <nmr>
##$USER= <she>
##$AMP= (0..31)
100 100 100 100 100 100 100 100 100 100 100 100 100 100 100 100 100 100 
100 100 100 100 100 100 100 100 100 100 100 100 100 100 
##$AQSEQ= 0
##$AQ_mod= 1
##$AUNM= <au_zg>
##$AUTOPOS= <>
##$BF1= 200.13
##$BF2= 200.13
##$BF3= 200.13
##$BF4= 200.13
##$BF5= 200.13
##$BF6= 200.13
##$BF7= 200.13
##$BF8= 200.13
##$BYTORDA= 1
##$CFDGTYP= 0
##$CFRGTYP= 5
##$CHEMSTR= <none>
##$CNST= (0..31)
1 1 145 1 1 1 1 1 1 1 1 1 1 1 1 1 1 1 1 1 1 1 1 1 1 1 1 1 1 1 1 1 
##$CPDPRG= <>
##$CPDPRG1= <>
##$CPDPRG2= <>
##$CPDPRG3= <>
##$CPDPRG4= <mlev>
##$CPDPRG5= <mlev>
##$CPDPRG6= <mlev>
##$CPDPRG7= <mlev>
##$CPDPRG8= <mlev>
##$CPDPRGB= <>
##$CPDPRGT= <>
##$D= (0..31)
0 0.7 0 0 0 0 0 0 0 0 0 0.03 0 0 0 0 0 0 0 0 0 0 0 0 0 0 0 0 0 0 0 0 
##$DATE= 1754483401
##$DBL= (0..7)
120 120 120 120 120 120 120 120 
##$DBP= (0..7)
150 150 150 150 150 150 150 150 
##$DBP07= 0
##$DBPNAM0= <>
##$DBPNAM1= <>
##$DBPNAM2= <>
##$DBPNAM3= <>
##$DBPNAM4= <>
##$DBPNAM5= <>
##$DBPNAM6= <>
##$DBPNAM7= <>
##$DBPOAL= (0..7)
0.5 0.5 0.5 0.5 0.5 0.5 0.5 0.5 
##$DBPOFFS= (0..7)
0 0 0 0 0 0 0 0 
##$DE= 6
##$DECBNUC= <off>
##$DECIM= 32
##$DECNUC= <off>
##$DECSTAT= 4
##$DIGMOD= 1
##$DIGTYP= 9
##$DL= (0..7)
0 120 120 120 120 120 120 120 
##$DP= (0..7)
150 150 150 150 150 150 150 150 
##$DP07= 0
##$DPNAME0= <>
##$DPNAME1= <>
##$DPNAME2= <>
##$DPNAME3= <>
##$DPNAME4= <>
##$DPNAME5= <>
##$DPNAME6= <>
##$DPNAME7= <>
##$DPOAL= (0..7)
0.5 0.5 0.5 0.5 0.5 0.5 0.5 0.5 
##$DPOFFS= (0..7)
0 0 0 0 0 0 0 0 
##$DQDMODE= 0
##$DR= 18
##$DS= 0
##$DSLIST= <SSSSSSSSSSSSSSS>
$$ [...]
##$SUBNAM0= <"">
##$SUBNAM1= <"">
##$SUBNAM2= <"">
##$SUBNAM3= <"">
##$SUBNAM4= <"">
##$SUBNAM5= <"">
##$SUBNAM6= <"">
##$SUBNAM7= <"">
##$SUBNAM8= <"">
##$SUBNAM9= <"">
##$SW= 18.0517328524113
##$SWIBOX= (0..15)
0 0 2 0 0 0 0 0 0 0 0 0 0 0 0 0 
##$SW_h= 3612.71676300578
##$TD= 16384
##$TD0= 1
##$TE= 0
##$TE2= 300
##$TE3= 300
##$TEG= 300
##$TL= (0..7)
0 120 120 120 120 120 120 120 
##$TP= (0..7)
150 150 150 150 150 150 150 150 
##$TP07= 0
##$TPNAME0= <>
##$TPNAME1= <>
##$TPNAME2= <>
##$TPNAME3= <>
##$TPNAME4= <>
##$TPNAME5= <>
##$TPNAME6= <>
##$TPNAME7= <>
##$TPOAL= (0..7)
0.5 0.5 0.5 0.5 0.5 0.5 0.5 0.5 
##$TPOFFS= (0..7)
0 0 0 0 0 0 0 0 
##$TUNHIN= 0
##$TUNHOUT= 0
##$TUNXOUT= 0
##$USERA1= <user>
##$USERA2= <user>
##$USERA3= <user>
##$USERA4= <user>
##$USERA5= <user>
##$V9= 5
##$VALIST= <valist>
##$VCLIST= <CCCCCCCCCCCCCCC>
##$VD= 0
##$VDLIST= <DDDDDDDDDDDDDDD>
##$VPLIST= <PPPPPPPPPPPPPPP>
##$VTLIST= <TTTTTTTTTTTTTTT>
##$WBST= 1024
##$WBSW= 4
##$XGAIN= (0..3)
0 0 0 0 
##$XL= 0
##$YL= 0
##$YMAX_a= 300888
##$YMIN_a= -352794
##$ZGOPTNS= <>
##$ZL1= 120
##$ZL2= 120
##$ZL3= 120
##$ZL4= 120
##$ABSF1= 10
##$ABSF2= 0
##$ABSG= 5
##$ABSL= 3
##$ALPHA= 0
##$AQORDER= 0
##$ASSFAC= 0
##$ASSFACI= 0
##$ASSFACX= 0
##$ASSWID= 0
##$AUNMP= <proc_1d>
##$AZFE= 0.1
##$AZFW= 0.1
##$BCFW= 1
##$BC_mod= 2
##$BYTORDP= 1
##$COROFFS= 0
##$CY= -3
##$DATMOD= 1
##$DC= 2
##$DFILT= <>
##$DTYPP= 0
##$F1P= 0
##$F2P= 0
##$FCOR= 0.5
##$FTSIZE= 0
##$FT_mod= 4
##$GAMMA= 1
##$GB= 0.15
##$INTBC= 1
##$INTSCL= 1
##$ISEN= 128
##$LB= 0.25
##$LEV0= 0
##$LPBIN= 0
##$MAXI= 10000
##$MC2= 0
##$MEAN= 0
##$ME_mod= 0
##$MI= 1.114404
##$NCOEF= 0
##$NC_proc= 0
##$NLEV= 6
##$NOISF1= 3.799351
##$NOISF2= 2.8
##$NSP= 1
##$NTH_PI= 0
##$NZP= 0
##$OFFSET= 14.38212
##$PC= 1
##$PHC0= -1199.852
##$PHC1= 9.1923
##$PH_mod= 1
##$PKNL= yes
##$PPARMOD= 0
##$PSCAL= 0
##$PSIGN= 0
##$REVERSE= no
##$SF= 200.129724274929
##$SI= 16384
##$SIGF1= 3
##$SIGF2= 2
##$SINO= 400
##$SIOLD= 16384
##$SREGLST= <1H.CDCl3>
##$SSB= 0
##$STSI= 0
##$STSR= 0
##$SW_p= 3205.1282051282
##$SYMM= 0
##$S_DEV= 0
##$TDeff= 0
##$TDoff= 0
##$TI= <>
##$TILT= no
##$TM1= 0
##$TM2= 0
##$TOPLEV= 0
##$USERP1= <user>
##$USERP2= <user>
##$USERP3= <user>
##$USERP4= <user>
##$USERP5= <user>
##$WDW= 1
##$XDIM= 8192
##$YMAX_p= 0
##$YMIN_p= 0
$$ End of Bruker specific parameters
$$ ---------------------------------
##NTUPLES= NMR FID
##VAR_NAME=  TIME,          FID/REAL,        FID/IMAG
##SYMBOL=    X,             R,               I
##VAR_TYPE=  INDEPENDENT,   DEPENDENT,       DEPENDENT
##VAR_FORM=  AFFN,          ASDF,            ASDF
##VAR_DIM=   8192,          8192,            8192
##UNITS=     SECONDS,       ARBITRARY UNITS, ARBITRARY UNITS
##FACTOR=    0.0002768,     1,               1
##FIRST=     0,             0,               0
##LAST=      2.2672688,     0,               0
##MIN=       0,             -352794,         0
##MAX=       2.2672688,     300888,          0
$$ Real data points
##PAGE= N=1
##DATA TABLE= (X++(R..R)), XYDATA
0@%%%%%%%%%%%%%%Qj6J6j6J6k4L2l5M3n2O0o9Q1r2J04j23J43j61J84k08K33k64
36a40K97l33L71m12M58n12N68o28O95p67Q49r35J028j134J249j375J517j675J849
55I70k048K276k533K832l186L613m140M801n662O845q576J1355j6568K9691j27268
70a07598k45196K49007L27263k3453j85981n0077j2848q75K387J21743M2885q4320
82C2937r2419p8493K3631J08935J50387J0833k10355j19387P2782J77675O8278
93A44804n0630o7948j23374l6515J04677J43894J4050j46686p4345m439L8408
104e8104Q4427P9214R71j48462q3033O7846R6711N5753j5426m2535j19233o3705
116a45576J23413J37998p844j39700n1677L8883K030L9534Q6366L8153j29758
$$ plain form
0 0 0 0 0 0 0 0 0 0 0 0 0 0 0 0 8 -8 8 -8 8 -16 16 -19 24 -28 32 -37 44 -48 56 -67 76 -85 99 -109 124 -140
36 -140 157 -176 195 -217 241 -271 297 -331 364 -403 446 -489 539 -595 654 -721 796 -879 970
55 970 -1078 1198 -1335 1497 -1689 1924 -2216 2585 -3077 3768 -4808 6547 -10021 19670 -107598
70 -107598 -352794 -103787 223476 200023 14042 -36035 -48883 -49758 -47371 74372 117257 32937
82 32937 -59482 -137975 -114344 -5409 144978 155811 -54544 -173931 -101149 76526 144804
93 144804 94174 26226 -97148 -133663 -28986 114908 128958 -17728 -92073 -96512 -58104
104 -58104 26323 105537 106508 -41954 -124987 -57141 39570 95323 79897 37362 -81871 -145576
116 -145576 -22163 115835 107991 -31709 -83386 -44503 -42473 -2939 83427 121580 -8178
127h178j40428O5874J45204O0317p0159q2715m0622j1301P9047P8218m348p7395
139f486n8067K1736J4771L7998N8895N597p6103r5645K6010R4627O4416r615q9894
152a1760p8057k704J06271Q8453m8449q7276k8740M1935J8046M232M8227Q677
164E8855o3712p6450K2674R0753L6150k0797o0489m7890j010N8361P4641j5324
176E5762o5327m0158Q175L2660K9241L9554j7283p5372m0302M2707P6600N124
188E1381l8087k8312j8518o67K1077N1995J5899m5612n0269j3110M3427M8912
200C8116J6280l4507o1116q329L9061L9470K548j8024j2821l0940j3377L5989
212g650N5810M737o2375l9076J5698M0370K4121n142j6231l0511j3388J7767K9136
$$ plain form
127 -8178 -148606 -82732 62472 122789 52630 -30085 -70707 -82008 -2961 75257 70909 -6486
139 -6486 -64553 -42817 -28046 9952 68847 74444 -1659 -97304 -71294 23333 87749 78134 -11760
152 -11760 -89817 -92521 13750 102203 53754 -33522 -62262 -20327 -2281 1951 50178 58855
164 58855 -4857 -81307 -58633 32120 68270 47473 -13016 -60906 -61916 -3555 71086 55762
176 55762 -9565 -49723 -41548 -8888 20353 59907 42624 -32748 -73050 -30343 46257 51381
188 51381 13294 -15018 -33536 -34203 -13126 38869 54768 9156 -41113 -54223 -10796 38116
200 38116 54396 19889 -41227 -49556 -10495 28975 31523 13499 678 -30262 -43639 -7650
212 -7650 48160 52897 -9478 -48554 -32856 7514 31635 26493 10262 -20249 -33637 -15870 13266
225A3266J9847j1106k6369l0474k010M2791L7053q060m8518k4036J8661K4126
237E171J5824O20j1000k5901j8583J9903L1877J3733j8216k7489j2750P005K9288
250I482J9663r276k7131j7618Q952J5405J7094P296j5656k6157j2542K3008K9052
263B1572L310j8951k2085l049Q922J8343J3145q254j8493j3391M875J5098J3620
276A4662N374j5926k1774n370K0302K3107j999j7395j4713q22R195J1975R288
289A5904o162j5171j0138L092J5407J1676N03j5213j6903J332J6521J5363l931
302A2280j3384q232j681O737R664P915m123j5256q328N196J4701P896m830j1415
316b860j0385M223J1237Q055j066r060o941l222N828J0978N620o983j3709l565
$$ plain form
225 13266 33113 22007 -4362 -34836 -36846 5945 42998 34938 -13580 -37616 -18955 5171
237 5171 20995 21615 10615 -15286 -33869 -13966 17911 31644 13428 -14061 -26811 -19806 9482
250 9482 29145 19869 -7262 -24880 -15928 -523 16571 23867 8211 -17946 -30488 -7480 21572
263 21572 24882 5931 -16154 -19203 -10281 8062 21207 12953 -5540 -18931 -14056 1042 14662
276 14662 20036 4110 -17664 -23034 -2732 20375 18376 981 -13732 -14554 -5359 6616 15904
289 15904 9742 -5429 -15567 -12475 2932 14608 15111 -102 -17005 -15673 848 16211 12280
302 12280 -1104 -9336 -11017 -4280 5384 13299 9176 -6080 -14408 -9212 5489 13385 8555 -2860
316 -2860 -13245 -9022 2215 10270 9204 144 -6797 -10019 -4191 6787 12407 5424 -8285 -11850
330a1850Q123R932L603n875o947m745R62P882O612N16p950p910j116P347R341
345G925J182p857q570l67P299N079J129k539n574m014N40O861O487j540p871n792
361g622K349O691N139j424n844m355K55M248M484R04k228n427k887K532O038L482
377F335l448n519k377J905M755K533l03m232l567k01L326M268R79l117n162q43
393d668L561M194J334l689l108j090J823K932J522k90l163k718M08L460L059p77
409B790k690k958J05K549K360L67j858k350n54R25K350J773j144k611k218J673
425a491K708J237j443j815r86O12J586P05Pp34j320n61Q20J523P59q94j439q96
443a622J170J587J71j216q59J8O73N89K03k47q63O6K6N51M42n86o17l03P09R41
$$ plain form
330 -11850 -3727 6205 9808 3933 -3014 -7759 -6797 1085 7697 8213 263 -7647 -8763 -1416 7925
345 7925 9107 1250 -7320 -7687 -388 4691 5820 3281 -2293 -6307 -5767 1094 7581 6041 -1830 -7622
361 -7622 -5273 1418 6557 5133 -711 -5066 -4811 -563 3921 4825 2597 -2830 -5717 -3185 2853 6335
377 6335 2887 -2632 -5009 -3104 1651 4184 3881 -351 -3918 -4119 -793 3475 4454 1337 -3825 -4668
393 -4668 -1107 3087 4421 732 -2376 -3466 -1643 1289 2811 2521 -642 -3360 -2952 508 3567 2790
409 2790 100 -2858 -2753 -204 2156 2523 665 -1685 -2239 -1314 1036 2809 1665 -946 -3164 -1491
425 -1491 1217 2454 1011 -804 -1790 -1178 408 1113 1120 386 -934 -1495 -675 848 1607 713 -726 -1622
443 -1622 -452 1135 1306 90 -769 -751 -78 511 714 467 -396 -330 -304 247 689 103 -514 -817 -108 833
463H33n05l22o59m64O71J030N18r18j513J4J368J031J7j236j019m8R03J048N28
482A277p52j393n55N88J356J219k19k017j439M57J787J833q25j522j448K46R27
499d80J701J096j088k983j292J799L268J486k968k606m54K237J914j6n52j108
515d6j286r35J115K992J203j971l375j119K099L236J766j765m087j964K503M214
531B580O02k080k761k51J10J740J942Q36j793l353o16K122L101J034j711l000
547a498k227J088M066K513j393l824k648J520L734K363j105l001k426O8K145L091
563B466J080k234l941r64K488L400Q10j565k387k028j03L012L958j62m425l422
579d017L96L684L009M06k258m166j599L024N005Q53l241l994M1K344J461J225
$$ plain form
463 833 328 6 -653 -1117 -446 584 1102 184 -1329 -1315 53 1084 1101 -135 -1154 -1202 -299 749 1277
482 1277 525 -868 -1423 -835 521 1740 1521 -496 -1935 -1478 309 2142 1317 -205 -1653 -1407 -480
499 -480 1221 2317 1229 -1754 -3046 -1247 2021 3507 539 -2067 -2521 -284 1630 1614 1062 -46
515 -46 -1332 -2267 -1152 1840 3043 1072 -2303 -3422 -1323 1913 3679 1914 -2173 -4137 -1634 2580
531 2580 3182 1102 -1659 -1910 -1800 -60 1882 2718 925 -2428 -3044 -922 2179 3213 1502 -1498
547 -1498 -3725 -2637 1429 3942 2549 -1275 -3923 -2403 1331 3694 2589 -412 -2838 -2770 -625 2466
563 2466 3546 1312 -2629 -3593 -1105 2295 3105 1540 -847 -2875 -2978 34 3992 3830 -595 -4017
579 -4017 -3621 63 3072 3478 1220 -2946 -4545 -1521 3484 4337 1096 -2898 -2857 -513 948 2173
595B173K65j914k855j572K484M772J007l060m844j447L781M851N94k987l797j543
611d092K271L608J805j386l563j783N46K682K504P72k097m091j554L375M028R68
627C993l168l027j242Q79L919K817q57m429l368J617L837K613o88l073k842l83
643c402K609L624Q68k583l672p21J920K799J880j385k702k581K63L144L311M04
659C776l349m021n41M008L548j9k897l047m46J953K794J216j177l051j938J081
675b110K783K358n09k283k850q42K974L280O91k919l259m26K132K833J295j368
691A780l610j164J477K680J754r25k166k277J13K390K156O89k966k335l88K442
707c50K168J010j369k904r44P26K424J774o81k252k141K93K653K071j76k472j824
$$ plain form
595 2173 2438 524 -2331 -3903 -1419 3353 4360 1300 -3544 -4991 -1210 3641 4235 1248 -2549 -4092
611 -4092 -1821 1787 3592 2206 -1357 -3140 -2594 88 2592 3364 1267 -2824 -4378 -1003 3025 3993
627 3993 825 -2202 -3444 -2565 1354 4171 3314 -1115 -4483 -2866 971 3584 2896 -177 -3019 -3402
643 -3402 -793 2831 3699 1116 -2556 -3277 -1357 1442 3322 1937 -765 -3346 -3083 61 3372 3776
659 3776 427 -3594 -4135 -127 3421 3402 505 -2542 -2988 -1035 1759 2975 1798 -1253 -3191 -2110
675 -2110 673 3031 2522 239 -2611 -3453 -479 2801 3492 573 -2686 -3112 -980 1853 3148 1780
691 1780 -1830 -2994 -1517 1163 2917 1992 -174 -2451 -2338 52 2208 2897 -69 -2404 -2792 -350
707 -350 1818 2828 1459 -1445 -2389 -1663 761 2535 1854 -398 -2539 -2246 407 2478 2302 -170 -1994
724a994k83J939J895P45j266k403q21J136K101J169n37k216j727M21K301J625
740B085l84j705k094J84J686J609N68j579j782o08J385J808P96r05j815j101O09
757a243J485J640k58j933j536N13J226J409L97j481j387p92J686J153P38q12j270
774d65j007M65J244J656r22j673p94L27J383Q65L31j135j334k35J037J273J07
791A123q00j007o91O22J265P86n87j358o60P30R69Q05l28q77j011J93P06J273
809A153j37r30n05q11O66J069N20n30j073n27O69O72N38l96p88m15K52P12M56
828E95L12r80p73l4R48N82J70n48n65k26M61O67K60n59q61q9J19Q08M76k98p49
849b84m44N6R98K74m1q98k11J90L56Q40l3n61o51l12K61R79K14m37p00k85L15
$$ plain form
724 -1994 -2277 -338 1557 2302 1036 -1367 -2188 -1052 1049 2218 1681 -535 -2262 -1841 460 2085
740 2085 1701 -4 -2098 -1914 -228 1381 1949 370 -1412 -2020 -635 1173 1969 1064 -751 -1852 -1243
757 -1243 242 1882 1624 -309 -1845 -1332 -106 1303 1700 219 -1168 -1960 -274 879 1617 805 -465
774 -465 -1472 -1007 237 1893 971 -702 -1496 -1169 214 1079 1410 275 -1059 -1294 -257 1016 1123
791 1123 323 -684 -1375 -753 512 1298 711 -647 -1307 -577 392 1197 869 -8 -1019 -826 -120 1153
809 1153 1016 86 -419 -1230 -564 505 1025 495 -578 -1105 -436 236 774 378 -410 -825 -573 139 595
828 595 907 -73 -846 -880 68 650 820 272 -293 -519 -58 609 869 310 -551 -640 -521 287 763 465 -284
849 -284 -728 -672 326 600 559 -339 -550 -360 -4 836 803 242 -409 -721 -460 519 733 296 -404 -689 -374
870c74O75K72J52p27n89m6N44Q06n7n68o96K34L39N49P2m22q00m3Q34O0K22j8
892D19m62o37M90L35M13l16m57m85K05L93P25K1p57k51p4M46N43j62k30m29j66
913d36J85P04O0k26m03l20K01K39N66r2p03l95L86M38N27n52j62o94M3O52L63
934C81O1l19l02l96M74M22K56l24p37o2L15N97K00m43m81k23L16M26L16M8m48
955G7l74j36K58O47R7m27o99K43J33N02K67m30m28k60K59M99K62l49k57j28p9
976c23J47M94k5p8o48k73N22M88p5n8l48l84J87P82n2m12l37Q8J50L82j32J51
998B46k57k80JK22K81M32o27o52J77K85J63R6P8m55k84Q3Q03m0j7m36k95j13P89
1021B00ML39o11l60J93L24J40J91l97n26N11m30N62L21q6m80l49Q7O21L88k41
$$ plain form
870 -374 301 573 725 -2 -591 -637 -93 713 656 88 -608 -374 -35 514 586 164 -636 -679 155 215 437 419
892 419 -43 -680 -190 145 558 242 -215 -700 -495 -102 623 644 -113 -364 -438 8 551 389 159 -270 -436
913 -436 -251 453 513 287 -116 -436 -235 4 570 478 -225 -620 -234 204 731 179 17 -677 -634 18 381
934 381 442 123 -179 -575 -101 321 577 253 -484 -546 -231 366 566 123 -358 -581 -265 161 477 525 77
955 77 -297 -433 -175 472 569 142 -557 -314 -181 321 588 158 -270 -530 -271 228 490 141 -116 -244 -323
976 -323 -176 318 293 215 -433 -706 -184 304 229 171 -177 -561 -374 408 356 -56 -393 -305 -155 227 95 246
998 246 -11 -291 -290 -68 213 645 18 -634 -457 -172 -9 87 165 -290 -574 -491 312 272 255 -181 -476 -589 200
1021 200 204 543 -68 -428 -235 89 229 420 23 -503 8 -422 140 461 375 -105 -454 -367 254 642 401
1042D01l50n44O2K42N90J92n86m22K08L12o0J82n10R9l54J34N82K23j87l29k42
1063c57j07M05L85j9m77m4k57M92L48J11l23o15lL18L64L32k47m45kp4K51K47
1085B83j49J20o51K16K58K08J48k26m40j03K66K64K07k07o20K98o7K79L03j1n25
1106a49j41o5L77M39o6k83m33n4J26L38L28l96k85j55l2P72L30m10m17k73J44
1127c05M39p1L97n34k15J27J96K90J40o27K12m42K7O36K12k83m87K2K4M72j53
1148G7R2m20J28k77M07J87N0j52m67j06L09M68o4J35o57K38k66L44J36j3m21j45
1170d17KL08L12n5j24k30J65L57k08n4Q4m47J79l1J39L27j72l63RJ98J31r6J63
1193A77j24k63L3L30L68o15J93j61j71Q0K24m1RL09m67l1J59K3l7k12j37R3M9
$$ plain form
1042 401 51 -493 -431 -189 401 593 7 -415 -207 105 45 227 -283 -184 -538 -404 178 401 214 -115 -357
1063 -357 -464 -59 326 307 -170 -214 -471 21 369 480 157 -458 -461 -143 221 553 306 -139 -141 -215 36 283
1085 283 134 254 -397 -181 77 285 433 207 -233 -336 -70 194 401 194 -426 -128 -195 84 387 376 -149
1106 -149 -290 -355 22 461 395 112 -321 -375 -249 89 417 21 -264 -419 -451 321 651 241 -176 -449 -305
1127 -305 134 63 460 -74 -289 -162 34 324 464 -163 49 -393 -366 270 482 199 -288 -266 -242 230 77
1148 77 169 -251 -123 -400 7 194 244 92 -375 -481 -172 296 232 367 -290 -52 -318 26 162 149 -272 -417
1170 -417 -415 -107 205 150 26 -204 -39 318 110 56 140 -307 -128 -159 -20 307 135 -228 -219 -21 110 14 177
1193 177 53 -210 -177 153 521 -94 99 -62 -233 -153 71 30 39 348 -119 -150 9 32 -5 -217 -354 -261 -212
1216b12L26N7l21J35q0J07L32l03L65m53l88M52P9o2Q5J75m00j05K44Q2j35K03
1238A83k68o3NL56J50l11l85n8L53o4M30l1m37Q1k0L38r7j02l8k33J33j18J98
1261BJ98k59K35k64RL01J38j20k71l05N2L02J70q2l8k78K5K87J36l3n3k13j52
1284b13K53N2o1j13q4J3J57K41l89N01k78m00K62O2J09j39J75k48j03K28l4o5
1306g4J64k99K0J27L68j82k84K75l0Q7k98R8L2J49k11o6P4K03j70l7K3j20J05
1329d6O8k60L95q8l2L48k43M8n9k11J00RL0k02K4kJ64O2l04J96M1m5r5l5M0R0
1355g%j54K10q7L1K37k74l00M00o0n8m4J51j22P8j81L27j88J96OJ01k02j68L63
1379B55k05l56J62L53m2l65K12R4l90N52l34K31j29O0N3j30J19l39K91jk24L02
$$ plain form
1216 -212 114 171 -150 -15 -95 12 344 41 406 -47 -435 17 96 34 119 294 -106 -211 33 115 -20 183
1238 183 -85 -148 -143 213 363 52 -333 -391 -38 -102 328 297 -140 -59 -79 259 162 60 22 -211 -78 -196 2
1261 2 200 -59 176 -88 -79 222 360 240 -31 -336 -284 18 188 106 68 -210 -185 102 238 205 152 -61 -213
1284 -213 40 92 31 -82 -166 -153 4 245 -144 357 79 -321 -59 3 112 -27 148 -100 -203 25 -9 -74
1306 -74 90 -209 -189 -62 306 124 -160 115 85 172 -126 -28 4 153 -58 -124 -50 153 -17 -54 -31 -151 -46
1329 -46 22 -238 157 69 37 385 142 190 131 -80 20 29 59 -143 -119 -121 43 105 -199 -3 38 -7 -102 -137 -97 -7
1355 -7 -7 -161 49 -38 -7 230 -44 -344 56 -4 -62 -106 45 -77 1 -180 147 -41 155 161 262 60 -108 255
1379 255 50 -306 -144 209 167 -198 14 108 -282 270 -64 167 38 98 151 21 140 -199 92 91 -133 169
1401A69j11L4k58J42q8R0p9J06J78j68K1j68Q5J51O3r6n0o4Q9J84j42j41K39J6
1425B02m66L00k02K89m96L37M9m3K49Jj91k29J01j23J86K32p1m8j51k21K68j41
1447a68K89j4j12m7m2k74N28k6J06l71q3l5L71q6j43j73J67p2K90J86r8j58m28
1470c93M54Q8k8j87j57O8J0K04k21L13l89l6L95k28O7K46j53Rk94J36J74j03K2
1493cK6k44J73J43Q5l91J46J51n1J65k46j18K67k35P9j88K61l4o7R3k21K17ok18
1517b16J22J7m1n4K43N1mk36j03J95J21J41J05l01k4j99J52J60j05K24o0j8n33
1540c63M30J82k59Q6j75m7K4K44J70l29K6J05k89r3O78k96j94j63jK37M23m60
1562f4Q2l88K99j90N51k38J73l73p2j06L84p4j36Q0P5No7L29j46Q2n19L11j12
$$ plain form
1401 169 58 92 -166 -24 -112 -22 -101 5 183 15 36 -132 -47 104 167 71 21 -43 46 230 88 -53 186 202
1425 202 -264 36 -166 123 -373 -36 13 -30 219 220 29 -200 -99 -222 -36 196 125 77 -74 -295 -27 -168
1447 -168 121 107 -5 -52 -94 -368 160 134 240 -131 -214 -249 122 36 -107 -280 -113 -185 105 291 193 35 -393
1470 -393 61 149 121 -66 -223 -155 -145 59 -162 151 -238 -274 121 -107 -40 206 53 62 -232 -96 78 -25 -3
1493 -3 23 -221 -48 95 180 -211 -65 86 35 200 -46 -164 103 -132 -53 -241 20 -14 -81 12 -209 8 2 -216
1517 -216 -94 -77 -118 -172 71 122 118 -118 -221 -26 95 236 341 40 16 -183 -31 129 24 248 188 170 -363
1540 -363 67 249 -10 76 -99 -146 -122 122 292 -37 -11 94 -195 -288 390 94 -100 -263 -264 -27 396 -64
1562 -64 18 -370 -71 -261 290 52 225 -148 -220 -326 58 -16 -152 -72 3 8 -59 270 124 206 -313 -2 -114
1585a14O5J29l16J15j30J90N7l3l8L9p2k5m5N05j07m27M8j48QN03j86j60k8qP4
1610a04O3L82k89ql44L56j46M86j16k76j47K51r2K73j52j80nQ1k28L39j47K80
1632B77m46O3j38K65J35L5k11k37K85j87K86k39L41k87k19L80N5r5o8k29J8K91
1654G5J27lr9k17j5O7K33j49J42k55m4J21J0L89m81J46p9j97k4J29K73k9j7p8
1678B5K8n5J44M6q1l71J59L24n2k10K5k39J33m8J65j28M24l48J03j68Q2K41K25
1701D24j78m65L12L03l25j1k91J04K26p0j77L87j74q8r7L6J94ok40j1K37J32o4
1724A58m26J79J50Nm0k63J37M9L76l88j08L12o9J86k87o3J36j48N9oK6J25j36
1747c6pp2J73j04K2K10k50K70Q2k59M6j81M8J3m2L56j59J98r0l31k6P0J79P3l31
$$ plain form
1585 -114 -49 80 -236 -121 -251 -61 -4 -37 -75 -36 -108 -133 -178 327 220 -207 -159 -307 -299 204 18 -142 -170 -178 -104
1610 -104 -41 341 52 44 -300 56 -90 396 280 4 -143 108 16 289 137 -43 -48 33 -195 144 -3 277
1632 277 -169 -106 -244 21 156 191 -20 -257 28 -159 127 -112 229 -58 -277 103 158 63 -5 -234 -216 75
1654 75 202 199 100 -117 -132 -65 168 19 161 -94 -138 -17 -7 382 -99 47 -32 -229 -253 -124 149 120 103 25
1678 25 53 -2 142 188 107 -264 -105 219 167 -43 -18 -257 -124 -172 -7 -135 289 -59 44 -124 -42 199 424
1701 424 246 -219 93 396 71 60 -231 -127 99 29 -148 239 65 -23 -120 -84 110 104 -136 -147 90 222 158
1724 158 -268 -89 61 66 26 -237 -100 -51 325 -63 -171 141 72 258 -29 -92 44 -104 -45 -51 -25 100 -36
1747 -36 -43 -115 58 -46 -24 186 -64 206 288 29 75 -106 -58 -45 -87 269 110 308 218 -113 -139 -69 110 183 -148
1772a48K19o0M7J00j95r6K35k53r0N47j15j32k71J82O4L1J25k76k3M7J51j05K61
1795B45r1k83m3N3K22R6K1j80k10R3K58j06r1r3k8M40l34K09Q2k27k53J62J13
1818E5J5L40l37R8K1k98J52k62J75Qj21N55n40R6K10l7k74Q3J97J00l41K2J25
1841D2m4K3q2Q9o7j22J78l4M4Q3J83j58j10l84O06p3K6N3l97MJ61O7j16R2j63
1866i9J09k24K52m1J8j2j48n6N53n44J63K07j75j8j09K37j10M8j74J04lK8p1K21
1890A56j62K22k15J43j12q8J53K00l95J94q6K02k67r8j1M4K79j92L4k12J00R8
1912a3k66J59p3J36J30j94K34J28l25N0J44j83p7j38M5J78l06N17k89L42l93J96
1934BJ42j00k2o7L15k02k14J69J69k75L20l06K04r3kn6k24K25J71j60J48j17j26
$$ plain form
1772 -148 71 11 58 158 -37 -133 102 -151 -241 306 191 59 -212 -30 34 65 190 -86 -109 -62 89 -16 245
1795 245 154 -129 -172 -119 103 199 220 40 -170 -77 181 75 -16 -109 -137 303 -31 178 260 33 -220 -58 55
1818 55 70 410 73 171 192 -106 46 -216 -41 -33 -154 401 -139 -43 167 130 -144 -61 136 236 -105 -83 42
1841 42 -2 21 -61 28 -39 -161 17 -17 27 110 293 135 25 -359 247 174 200 253 -144 -140 21 88 -28 64 -99
1866 -99 10 -214 38 -3 15 3 -145 -201 352 -192 -29 178 3 -15 -124 113 3 51 -123 -19 -22 6 -65 156
1890 156 -6 216 1 144 32 -56 97 297 -98 96 10 212 -55 -153 -164 -120 159 -33 1 -211 -111 -13
1912 -13 -279 -120 -193 -57 73 -121 113 241 -84 -34 110 -73 -150 -288 -243 -65 -371 146 -143 199 -194 2
1934 2 144 44 22 -45 270 68 -146 23 192 -83 237 -69 135 42 40 -16 -240 -15 156 -4 144 27 -99
1957i9K06lq9q8j9J42q8Q3K39k59%k66K99j78J38j85M84k91j05J29k13Q0J2K36
1981A65k62K5J70L9n11L03j32L40p9O5P5k38K09j18j87R8J05n6q9j24j7M88k84
2004a5j55K88q1k92P4J00K62k00J13k33q6L38k17J67K12k49J75n97K69J58K32
2025B63q1l18J96r4M50m59j09K23j72N8J9j63J49k0k8j03K44j11J91k21J26q7
2047d7m3J87j4j99J4J84k50R0p9O2K26k29M9O9J95j48l6j23J89M06p24K47j41
2070a15R7k29K7K30K11O6k72m6r3J96p9j02J55Jk13K60l41M81k43k10M20k11J80
2093A70L2j50j00J40m3j12L5p7J16j10J03k0j39L54l34N6j3K13P5l14K13P6j61
2116A0p8o2J66K95k09r1j18R6J01k66R1l3L73k66j03K1R4J49k83K42k45P7J29
$$ plain form
1957 -99 107 104 15 -73 -92 50 -38 45 284 25 25 -241 58 -120 18 -167 317 26 -79 50 -163 -83 -71 165
1981 165 -97 -72 98 137 -374 -71 -203 137 58 123 198 -40 169 51 -136 -38 67 11 -78 -202 -219 269 -15
2004 -15 -170 118 37 -255 -181 -81 181 -19 94 -139 -225 113 -104 63 275 26 201 -396 -127 31 263
2025 263 182 -136 60 -34 416 -43 -152 71 -101 -43 -24 -187 -38 -58 -86 -189 55 -56 135 -86 40 -47
2047 -47 -90 97 83 -116 -102 82 -168 -78 -157 -95 131 -98 -49 20 215 67 31 -92 97 503 -221 26 -115
2070 -115 -18 -247 -220 10 221 287 15 -31 -124 72 -7 -109 46 47 -166 94 -247 234 -9 -219 201 -10 170
2093 170 202 52 -48 92 49 -63 -28 -105 11 -99 4 -16 -155 199 -135 -79 -92 121 196 -118 95 171 10
2116 10 -68 -130 36 331 122 31 -87 9 110 -156 -65 -98 275 9 -94 -73 21 170 -113 129 -116 -39 90
2139I0j62l5L3L01Mm37L88L54n65j54J49k4J18q6L98n24L68l03J02j3P4L62n14
2162g6J09J4l08K39L8q8J71J6Lk36K76m12L82K35l95q5L71l4l66j6p7L55j71j73
2186b28J23R5k3j04K40l0L0l45L05j81P2J40Kj38R1j94k1j70J43M46k09L1Qj71
2210h8j13J48k95J12J91L84l00o3L9K7M3j08j48j31L46j24K42l17J40jO9Q1l38
2233b04K13o1Mq3J87N6k85k1J55L02j39j68k1Q7J05j07J42l30l6K29j15jK03J04
2257B16k09P1o1O4Jj07m7K8J19R6k15j50K16k72L16j20Q2k25L08o8Q3m9k03K22
2281I6j87J36j51L4j05J69J92j89R5k70L93j38j12l08K77L58l45m5L55j70j97
2302a12L54k85o4K27o2k17J89k05N14n53K05M7m7Q%J41l14L65M8k06Q9k64L8O1
$$ plain form
2139 90 -72 -107 -74 227 231 -206 182 536 -29 -183 -34 -58 60 -26 372 -152 216 -87 15 2 76 438 -76
2162 -76 33 47 -261 -22 16 -72 99 115 118 -118 158 -254 128 363 -32 -117 254 220 -146 -162 -239 116 -55 -228
2186 -228 -105 -10 -33 -137 103 73 103 -242 63 -118 -46 94 96 -42 49 -145 -166 -336 -193 253 44 75 83 -88
2210 -88 -201 -53 -348 -236 -45 339 39 -24 15 42 85 -23 -171 -302 44 -80 162 -155 -15 -16 53 134 -204
2233 -204 9 -52 -48 -131 56 112 -173 -194 -39 263 124 -44 -65 22 127 20 162 -168 -204 25 -90 -91 112 216
2257 216 7 78 17 81 82 -25 -72 -44 75 171 -44 -194 22 -250 66 -54 28 -197 111 43 126 77 -126 96
2281 96 -91 45 -106 -72 -177 -8 184 -5 90 -180 213 75 -37 -345 -68 290 -55 -100 255 85 -112
2302 -112 242 -43 -107 120 58 -159 30 -175 339 -214 -9 38 -9 -1 -1 140 -174 191 239 33 122 -142 -104 -43
2326d3Q4o1O7Lo4p2L08q6l34KL22k65J80j43p9L08j85K11k33M6L8K81k90r9K7
2351g7m9K73M9o2r9J13k33j24K40J74k70P3k02J42J07M0J01n63K37o8L4K6L38
2374B00r1l03J01Q9K88r5m54o0M07j01J60J23o0j11k95K74j46L63l83M9O3P6m0
2397E4k95M8L54j92M6j5K1j03M16n26r6L10r8M1J50k13J59l56N60o8m48J84j86
2420b53J1K88m8J36r7o6K49l23J85N1J9l84K15j40L03k07k6J49J52k38j9Q3n5
2443a5L15l08N6q0L05n21K87O3J68k76m8j14L31k62L26j29pK1q8J23k51J10J02
2466A08j39M3J58j01J67R3k20o3rJ2j3j58Q8J34m8O7m85M80l37J70L6k95J21k21
2490d12K53m6K44p7J3j38K16N6j60J52jj6M4j26p3n3J44j33J38j72O0L8J0j19
$$ plain form
2326 -43 41 -20 47 50 -14 -86 222 136 -198 -196 126 -139 41 -102 -181 127 -58 153 -80 -34 4 285 -5 -104 -77
2351 -77 -126 147 196 134 35 148 -85 -209 31 205 -65 8 -194 -52 55 95 196 -367 -130 -198 -164 -138 200
2374 200 109 -194 -93 -4 284 189 -265 -325 82 -19 141 264 204 93 -202 72 -74 289 -94 -45 18 94 54
2397 54 -241 -193 161 -31 15 0 21 -82 334 -192 -288 22 -76 -35 115 -98 61 -295 265 197 -251 -67 -253
2420 -253 -242 46 -2 134 37 -29 220 -103 82 133 152 -232 -17 -157 146 -61 -87 62 214 -24 -43 40 -15
2443 -15 300 -8 48 -32 273 -248 39 102 270 -6 -54 -168 163 -99 227 98 91 112 24 147 -104 6 108
2466 108 -31 12 170 69 236 329 109 46 37 49 36 -122 -34 100 52 119 -366 114 -223 -53 -17 -312 -191 -412
2490 -412 -159 -205 39 -38 -25 -163 53 109 -51 101 100 84 128 2 -71 -124 20 -113 25 -147 -87 -49 -39 -158
2514a58J72L87k20l6r5j40J3K47k39P0n1J97k41k68O16l72RJ66R9k99L63j49m28
2537c57J79p4L29m58L17J79L1k17K58k95L23l72J42K86m97J49O6J65o4j53J82
2558A19Q8o8K86l75j8K6j89J41q8J21j11R2K2k02K97j32j23J05J9q7J56J97k38
2581C8K09J27l68q3J31m0j19K88k48K05n6j41M3j74N65l43n1R1J42l08J27L17
2603C52m77K65K8r1l48K42j7j34J89k5k24N8L85J1j97p1NJ22k2l73M63O8j84R2
2627A17j22Q8J11m56L61j50J05r5Q0j21J85r8l3J35m3Ol18K70L1K1J32k57l7K06
2651A18q5k25J03j74K09J02K01k61K9j34p8K98k63J23P0j55N3p5K86j22j07J29
2673D2M0o8J11p1q8J5J44j46k0J17Qq7m3J96r7J04p8j10p3j7J62o5j6mJ69j69
$$ plain form
2514 -158 14 401 181 145 50 -90 -77 170 -69 1 -50 147 -94 -362 254 -118 -109 57 156 -143 220 71 -357
2537 -357 -178 -252 77 -381 -64 115 146 -71 187 -108 215 -157 -15 271 -226 -77 -11 154 90 -63 119
2558 119 207 139 425 50 32 58 -131 10 -78 43 -68 24 46 -156 141 9 -114 -9 10 -77 79 276 38
2581 38 247 374 6 -77 54 14 -105 183 -65 140 84 -57 -14 -188 377 34 -17 74 216 -92 35 352
2603 352 -125 140 168 77 -271 -29 -46 -180 9 -16 -240 -182 203 214 17 -54 -49 73 51 -322 141 209 25 117
2627 117 -5 83 194 -262 99 -51 54 -41 39 -82 103 5 -28 107 64 70 -248 22 53 74 206 -51 -88 118
2651 118 33 -192 -89 -263 -54 48 249 -12 17 -117 -195 103 -160 -37 33 -122 -69 -144 142 20 -87 42
2673 42 82 14 125 54 -34 -19 125 -21 -41 76 84 -3 -46 150 53 157 79 -31 -104 -121 41 -24 -40 -44 125 -44
2699d4K1m6k2L31p1j9j40m7rJ9J93N0n71M79j56p6J27k20R6j6K38k63o4K01m5
2724e4q7K09J5j95m6J40J32J08J4k14P8r2P6o5%J0L1J59j38O8l03l9j35L17K40
2749B29r5k31J6j01J7K6j56L06J3N8n0J06l15j5K87k47K96j64j50J14M04j76o3
2772A09M8k44K47j45j84J52j81L21j25mK95k99k3J20k08R0J63J1j08J58k24K62
2794B31o14M80J4j27K22rk40J18j22J88j96J9M8j43J67J2j8j52K82j71K35k60
2816c6p7J88J2k53r9J95K27Kk15L64m71K20R2K3o2r9J11K5m73L70P9P6k45O8k56
2841b34J38o0L16q9J01j39j04qJ85R3j92O0q0l3l6l3L01j13k26K42J5j85K25j38
2865FNJ28j94LL47l42L0j72J46j46J90R0j01j54K5J01j41L06k65n7K11J40k12
$$ plain form
2699 -44 -23 -69 -91 240 169 150 10 -37 -46 -27 166 216 -355 124 -32 -108 19 -201 -105 -121 117 -146 -210 -9 -54
2724 -54 -141 68 83 -112 -158 -18 114 222 236 22 100 8 84 19 19 29 60 219 81 149 -154 -193 -328 -11 229
2749 229 134 -97 -81 -182 -165 -139 -295 11 24 82 32 138 -177 -192 95 -152 144 -20 -170 -56 348 172 109
2772 109 157 -87 160 15 -169 -17 -198 123 -2 -6 289 -10 -33 87 -121 -31 132 143 35 193 -31 231
2794 231 -383 97 111 -16 206 197 -43 75 -47 141 -55 -36 12 -131 36 48 30 -122 160 -11 224 -36
2816 -36 -113 75 87 -166 -265 -70 157 159 -56 308 -163 57 149 172 110 11 122 147 -326 44 123 199 -46 22 -234
2841 -234 -96 -156 160 71 172 33 -71 -79 106 199 7 67 -13 -46 -82 -115 186 73 -153 89 104 -81 144 6
2865 6 11 139 -55 -52 295 -47 -17 -189 -43 -189 1 91 -10 -164 -139 -38 -179 127 -138 -195 16 156 -56
2888e6R5M7k16L23k82Po2J08J22J7p5j39J05o3j03L66l27J64k79O1J50J17k41
2911a61L03p0Q5n87M43J34j59k6L8J47k33k37J90o1L19j89K31LJ45j63K5k01l5
2934e9J40j4mj1J18k10K2j17l8K48N1K2k21N2j1J68j52m7j0J9O0k19R0J85j48
2959h6M1J90m24K59M2P5q1k3Q1m0J15k49K15j31k9N3k48K72J03k06Q0N8J93n02
2983b42L06jp2J24j70O0K01k62P6J54j63j00j63M07k0j14J39j3k35l3M8J15qj15
3007h1J09l3P6J10R7p2j73K58m07K54k55L46j42J63r8r8mK7k7J2m5J46j78j1l7
3032f3JL46J06m81O1j81K87k16q9R8K10j14j58j24K54j8K6Q9q6P0k30M06j73O
3056B7K08l07k26N08m00J59k26J03o8K50L0j96K42k9k1K9j7o3P5K4Q9m73N12m2
$$ plain form
2888 -56 39 86 -130 193 -89 -82 -144 -36 86 103 28 -111 -6 -69 -172 194 -133 31 -248 -187 -37 80 -161
2911 -161 142 72 157 -430 13 147 -12 -38 0 147 -86 -323 -133 -194 125 -64 167 170 315 152 177 -24 -59
2934 -59 81 67 63 52 170 -40 -18 -135 -173 75 126 148 -73 -21 -32 136 -16 -63 -73 -54 6 -213 -123 62 -86
2959 -86 -45 145 -279 -20 22 97 16 -7 74 34 149 -100 115 -16 -45 8 -240 32 135 -71 9 67 260 -242
2983 -242 64 63 -9 115 -55 5 206 -56 20 174 11 -89 -252 155 135 21 160 147 -88 -121 -73 42 34 -81
3007 -81 28 -5 71 181 278 206 33 291 -116 138 -117 229 87 250 152 54 50 77 50 62 17 163 -15 -26 -63
3032 -63 -62 284 390 -91 -30 -211 76 -140 -229 -131 79 -35 -193 -317 -63 -81 -55 34 -52 18 -212 194 21 27
3056 27 235 -72 -298 210 -190 -31 -257 -154 -222 28 58 -138 104 75 54 83 66 3 78 102 191 -282 230 188
3080A88k33j84M23N9k43j64K58j51K15k99K72k05j34K43j33J47j50l6n1J6L05
3101A43K8l02L47j25J22k93L91l09J50k34K68p0o7n7p5N0O5Q4k39J13J4J48j99
3124d7Q6M6j04j08K43k16L29l01mj55K84K07l20k43L34L0J31k26K10j32J6J08
3146A68k71K41k01K60r9J44j31q8p9o1j7K63j00k57J51K14k6qm9n3k11l7K79m4
3170a2o3J87m63L71j57OJ56l2J28j45J06K0j57L84l99J05P8k04Kl4K76p3j81l3
3194a34J87J55k09k78N25k07j17O3R6N1j45p6J05J50l2j20K99l76r7k49N16k47
3216a40J24j75K38j02R1q9jL01l16K34j62J27J00j79o0q4o0J70k70M39k69P4O
3239cJ04j23Q3M9j81K79l92J36Q1L6J18N0k69j83J15M7j48K89q2q9J09l38L35
$$ plain form
3080 188 -45 -229 194 253 10 -154 104 -47 168 -131 141 -64 -198 45 -88 59 -91 -127 -178 -162 143
3101 143 171 -131 216 91 213 -80 311 2 152 -82 186 116 49 -8 -83 -33 32 116 -123 -10 4 152 -47
3124 -47 39 85 -19 -127 116 -100 229 -72 -76 -231 53 260 -60 -303 31 61 192 -34 176 44 60 168
3146 168 -103 138 -63 197 98 242 111 23 -56 -117 -134 129 29 -228 -77 137 111 103 54 1 -210 -247 32 -12
3170 -12 -75 112 -351 20 -137 -131 25 -7 121 -24 82 102 -55 329 -70 35 113 -91 -89 -123 153 80 -101 -134
3194 -134 53 208 -1 -279 246 39 -78 -15 81 132 -13 -89 16 166 134 14 313 -63 -160 -409 107 -140
3216 -140 -16 -191 47 -55 36 -53 -54 247 -69 165 3 130 230 51 -9 -93 -153 17 -253 186 -83 -9 -3
3239 -3 101 -22 61 110 -71 208 -184 -48 33 69 187 237 -32 -215 -100 -53 -201 88 6 -83 26 -312 23
3262B3J42j61j55n6L60r1J92m39K7m3K49n7j35K82J31l73M3K23o7l5Q0J3l37m9
3286b33M11l7k50Q6J04k2qK02m21o3M94l92Q9J61n1K1k07r2K83K08k94L29k16
3309A02j16j3l17L95j56j03J82J55k68L96m33L96l56J2M3L93l56q9L99r3o5J97
3331C05j86k79J50K7Q4l4r4j26Q6K42l29K25m05N58k20J14r9L1K65n49L72j49
3353a1j22j63L41J08k12P7k14J43L18l29O5j22K45k1p8O8j11J13p4k11J61P7J05
3376A53k4k28L6k49K75r8N1r3J12O6N7op1j26L57l6m05L45l36J05N55q60L47K66
3400A93m36K81J99o9k92p3M55l22J24l36K22k50K95K21m83J53Q0m7J35K07k85
3421b8m5NJ01k45M86k07M8K7jk37K39R8j70j77J38r4K66k59j47M3N4m9J64k94
$$ plain form
3262 23 165 4 -151 -207 153 62 254 -185 -158 -201 48 -9 -144 138 269 -104 -61 162 95 60 140 153 -184 -233
3286 -233 178 141 -109 -23 81 59 51 253 -168 -231 263 -129 -40 121 70 91 -116 -208 75 283 -11 318 102
3309 102 -14 -27 -344 51 -105 -208 -26 129 -139 257 -176 220 -136 -124 -81 312 -44 -133 266 173 108 305
3331 305 119 -160 -10 17 101 67 -27 -153 -67 175 -154 71 -334 224 4 118 19 50 315 -234 138 -11
3353 -11 -133 -296 45 153 -59 18 -196 -53 265 -64 1 -121 124 103 25 93 -18 95 21 -190 -29 48 153
3376 153 129 -99 -63 -312 -37 -135 -84 -177 -65 1 58 52 -19 -145 212 176 -229 116 -220 -115 440 -420 -73 193
3400 193 -243 38 237 168 -124 -197 258 -64 60 -276 -54 -304 -9 212 -271 -118 -38 -85 50 257 -28
3421 -28 -73 -68 33 -212 274 67 115 142 141 -96 143 241 71 -106 32 -62 204 -55 -202 -159 -105 -154 10 -284
3445b84K76K5J08j6j79J67k21J80J55k08L3L26j09k68k6r8J86J8o4j56J41K37
3467B23k59K64p1j55Jj0Q2P6j48o1K0k31L96k89P5J3Q4j55K20k75K35Q0Qj65m6
3492h8q8l6K76J85j59m5M4l26K26J59k47N62j51m22L93j09n09M26k03j22K90k56
3514b00L61j99j05N6O5L8J47M9k03K4q0R4p1J86j16j07R7j78K0o7L22R0j65L2
3538I0PJ8L7p6k8J65j77o3J49j34J36j01L9l6R5K1j53oK0p2K5j0N0nn0J07o9q2
3566a03J07K8O6j11j1J03ok63L93j88J09j85pK38o7O9r5j90j95K31J90p4Q9j80
3590e2Q3O8j79j54K65r3J7J5j04RK57m97J90J02J9J92j92K31m21N40j04l60K3
3613a45J96j40J30J8j59m3L59O3j90l8Rj68K21K6R1l06r9J85n9p0j41L38k28K31
$$ plain form
3445 -284 -8 17 125 109 -70 97 -124 56 211 3 36 362 253 -15 -41 -139 47 65 1 -155 -14 223
3467 223 -36 228 157 2 3 -7 75 151 3 -58 -38 -269 127 -162 -87 -74 10 -145 75 -200 35 115 123 -42 -88
3492 -88 -176 -212 64 249 90 45 89 -237 -11 148 -99 463 312 -110 283 174 -335 91 -112 -234 56 -200
3514 -200 161 -38 -143 -87 -22 16 163 212 9 33 -47 47 -24 162 46 -61 36 -142 -122 -189 133 223 58 90
3538 90 97 115 152 76 48 213 36 -27 122 -12 124 23 62 26 121 142 -11 -17 3 -69 -44 -54 -4 -9 -59 48 -21 -103
3566 -103 4 32 98 -13 -24 79 73 -190 203 15 124 -61 -68 170 103 172 77 -113 -308 -77 113 39 128 -52
3590 -52 31 99 -80 -234 31 -62 -45 -30 -134 -125 132 -365 -175 -73 -54 138 -54 177 -244 296 192 -168 -145
3613 -145 51 -89 41 59 -100 -143 216 279 89 51 60 -108 113 139 230 -76 -175 10 -49 -119 -260 78 -150 81
3637H1k01K25r1k78M45l23P3J27j87K87k31J60L9k9j34J41J95j87m9Ol53M36n03
3660c51M87j12j65J45Ll46N40n8k57K74j88J26l4J20k73O7j61K49J60k26q8l2
3682a20K27J06k05j22N1J67k94R9K9J31j19J34mN0j23L96m48j62O44m56k53J92
3704h0J49m5K58l07O8j45J97j06N2j6P6l4n6j2j2j63L20j8k77L4K1n4J07Q5p8
3729c6K32j05JL7P8j2j14k7L9p5J23Q2K13n19J0j0p9J96K9k18K83k99K82l14J68
3754c5O5K68n28N82k36j24k8M5j22Q8J00j26J29j91K68l89K51J3l8J45l83M6J79
3777b1O2o7P7Ll17L64n3j05O0K80m58N31l91j09L46j52j48K77O5n17K34K70m60
3800b29K83lj41J87k16Q3l5K02ll0J76k59j83J37Q7j10pN9K20j15K30k16J15k8
$$ plain form
3637 81 -120 105 14 -264 181 -142 -69 58 -129 158 -73 87 126 97 -37 104 299 112 63 69 -284 152 -351
3660 -351 136 24 -141 4 7 -339 201 143 -114 160 -28 98 64 184 -89 -22 -183 66 226 0 -88 -120
3682 -120 107 213 8 -114 -63 104 -190 -91 -62 69 -50 84 80 130 7 403 -45 -207 437 -19 -272 -80
3704 -80 69 24 282 -25 43 -102 95 -11 41 25 101 67 11 -1 -13 -176 144 126 -151 -117 -96 -150 -43 42 -36
3729 -36 196 91 92 129 207 195 81 54 93 18 141 223 436 -83 -73 -83 -162 34 63 -155 128 -171 111 -203 -35
3754 -35 30 298 -230 352 116 -8 -36 9 -113 -25 75 -51 78 -113 155 -234 17 30 -8 137 -246 -200 -21
3777 -21 41 -26 51 54 -263 101 48 -57 3 283 -175 356 -35 -144 202 50 -98 179 244 -273 -39 231 -229
3800 -229 54 51 -90 97 -119 -36 -71 131 128 98 274 15 -168 -31 56 -54 -61 -2 218 103 333 117 232 204
3824B04l96n4L06Jp3J06k27J14O7o6j87K40k78K31O9P2j23P8pk07N8j58L17P1
3848A58k09P2K10r9n6j90J71j52J97J4o7j07K5m2J12n2K47l19J84m2J90n42K57
3871d0J7O8Q2j55J40P8j68p2P6l51M13M4j85K75J6k12j7k01K58j10j9K83j50k50
3895a80P8J32l2Q9L1j27q5J39K0j0j14J0k8%q5J89k6J11m8k21J87k1k17Q8j39
3920b59J27K18J67k53n1n5K54l00K40n6J05M5k60qJ08J42k9M8O7m07J46K6j85
3943a70J92l3j15K14m35L33K23k79J24k26L9K37k58L0K50l73K81J79k15R7k65
3964a70J53rJk10J10K59k95J77R9k00K27m60M40Oj19%k38J07k55K26O38m53o0
3987b6k59J22J49J02m8L7j28p5K45m45M35L0Kk16J33j92L46k08j55L08p0J07p3
$$ plain form
3824 204 -192 -246 60 61 -12 94 -133 -19 48 -18 -205 35 -243 -12 57 129 6 84 77 -130 -72 -230 87 158
3848 158 -51 21 231 132 76 -114 57 -95 102 116 49 -58 -33 -75 37 -15 232 -87 97 55 245 -297 -40
3871 -40 -23 45 127 -28 112 190 22 -50 26 -325 88 132 -53 222 238 26 9 -192 66 -44 -63 220 70 -180
3895 -180 -102 30 -2 87 118 -9 -94 45 65 55 -59 -49 -77 -77 -162 27 1 112 64 -157 30 9 -208 -120 -259
3920 -259 -132 86 253 0 -51 -106 148 -152 88 32 137 182 -78 -86 22 164 135 183 250 -157 -11 15 -170
3943 -170 22 -11 -126 88 -347 -14 209 -70 54 -172 -133 104 -154 -124 126 -247 34 213 -2 95 -170
3964 -170 -17 -26 -25 -235 -125 134 -161 16 115 -85 142 -318 122 128 9 9 -229 -122 -377 -151 487 34 -26
3987 -26 -285 -163 -14 88 40 77 -51 -126 119 -326 109 139 141 -75 58 -134 212 4 -151 157 87 194 121
4010A21l67J19K70l3N5l2k5p9K1J61j64l4J33m06L90m5n2m0J38O2j4j29O0l04
4034a94J62j0K31k60K16j45k9j7r7J20M0J92k67K36l18k1K75k93K0o0K05J76j61
4057AN6j30k2J28l12K46J07n0j10O2J83o4L0j92J05k13J46O2j15J72r9j60L8J14
4081a7J13k09J20j03J63n8j8j07Q7j6K55j08j74j13P6J19j55J88n0L0k33J86J48
4104A24l6J26m37J71K80l06J52q6l4L39m38L50j44K0o6K14k18J5o7P3o5j12r0
4127b35JK13j2J83n1p0q0N4JN3J1J6l18K17J16M9l61K65k7l05L16P3k22PL17m93
4153b82K52J07q6J47K9j9j79J57N0k52jM4K20rm25k7K50o8J89k7K01n03K97k64
4177a99n1r5L38J61r7j70q5N52n05K72J13k02m5M22o05K20N6k08J54jL27k98j46
$$ plain form
4010 121 -246 -127 143 110 165 133 108 29 50 211 47 13 146 -260 130 85 33 -7 131 193 179 50 110 -194
4034 -194 -32 -42 189 -71 145 0 -29 -46 -143 -23 17 209 -58 178 -140 -161 114 -179 -159 -219 -14 162 1
4057 1 57 -73 -95 33 -279 -33 74 24 -86 -24 159 95 125 -67 38 -175 -29 33 -82 90 -9 -169 -131 -17
4081 -17 96 -113 7 -96 67 9 -9 -116 -29 -45 210 102 -72 -185 -109 10 -145 43 -7 23 -210 -24 124
4104 124 88 214 -223 -52 228 -78 74 -12 -46 293 -145 205 61 81 15 229 11 26 -41 32 -33 -145 -235
4127 -235 -234 -21 -33 150 99 29 -51 3 4 57 68 84 -234 -17 99 148 -213 52 25 -280 36 109 -113 -106 211 -282
4153 -282 -30 77 -9 138 167 148 -31 126 176 -76 -77 -33 187 178 -247 -274 -24 -92 97 70 271 -232 65 -199
4177 -199 -250 -345 -7 154 57 -113 -198 354 -151 121 234 32 -13 409 -196 24 80 -128 26 25 352 54 -92
4200i2R7N7l52L06J68m33L3k0K85j4p9k94J95J73j55O8Q5j02j15J02J40k44K44
4223E3p2j53m3L22k6k6r8j51P7K67n6q1K9k08J8J9J69j13p7j65Q1L15j28J27q4
4248dJ7q7J27j80l5M82k77R3m6r8L61k82j11O6o1n4J70j77J85J6M7P2j19l70M22
4273A57q1k55J82N5k62j87L21K38l68jL22Ln7L7p8R2q5%o6N0J0k88L54k36K2O7
4299e4J68k46J19r5K96k06K31k42m6L70j77j38M6J93l52J69j33K31k19K12j83
4320e6M2N3n7j5NNO2J23k2l06K89l8j32n0J06k6j29R5j67J78N7j35J99pO0n4k09
4347a29O2O5q6Oj6K27l3j03k1n4K0j5m4J87j71K25q2j99l1J84k5Lk0J40l05L32
4373A17J99j68j72P2r6K86l16k5J12k15J69K8o9M0j31L72j44j25J82q8J65j6q8
$$ plain form
4200 -92 5 62 -290 16 184 -249 -216 -236 49 35 -44 -338 -143 30 -125 -57 28 -74 -189 -87 53 -191 53
4223 53 -19 -172 -215 107 81 55 -43 -194 -117 150 94 13 42 -166 -148 -129 40 -73 -150 -315 -234 81 -47 80 -4
4248 -4 13 -74 53 -127 -162 320 43 136 90 -8 353 71 -40 26 -35 -89 81 -96 89 105 152 224 105 -265 157
4273 157 76 -179 3 58 -204 -391 -70 168 -200 -201 121 124 67 104 26 118 33 33 -33 17 27 -261 93 -143 -121 -54
4299 -54 114 -132 -13 -108 188 -18 213 -29 -75 295 118 -20 26 219 -133 36 -97 134 -85 127 -56
4320 -56 -14 39 -18 -33 -28 -23 39 162 140 -166 123 85 -47 -97 9 -17 -146 -51 -218 -40 17 -118 81 74 134 80 -129
4347 -129 -67 -2 -88 -82 -98 129 96 -7 -28 -82 -62 -77 -121 66 -105 120 38 -161 -192 -8 -33 -30 -50 90 -215 117
4373 117 316 148 -24 48 -48 238 -78 -103 9 -206 -37 -9 -78 -38 -169 203 59 -66 116 28 193 177 89
4396H9L9Nl17Q1J7k5K26l0k47K66n9r2r6R3m6J16k98K67J20l67J59K41k90K96
4420A48j93Pj4K46l26q3R2K01R5k64L28k99P0Mj56K75l10K85m58K48J73J8j7j51
4444h1r9J04J78k1L04n92M34k5j53j35J0k2J0K33l30J01N8J62J50l44J26r6j35
4467a63L26m31J48n7K24J45K6m0R8j45m0r5k79Q9j00J02M33j1k55L39l87K71R7
4490B95ll54OJ37j85K12r8l00K67m8Q7j2p9k0J36N2P8k14j9L2K18l0k79Q2k23
4515b62K84q1n7R7J36J72k06q9N1k33R1J69k45J34NK84p0j26J49j1On03K74M7
4539A6J49r1J7k18k8K36k04J55p2N5L3l66L33k38J41P4M0J15qj89k20L83O4Q9
4563B66m06P8P5j99J76J62j61l9k58R1K36J28j0k00L3j8Lr4L68j72r8K38k82n9
$$ plain form
4396 89 128 133 -184 -103 -86 -111 115 85 -162 104 45 -47 -143 -50 -96 20 -278 -11 109 -258 -99 142 -148 148
4420 148 -45 -38 -52 194 -132 -215 -123 78 173 -91 237 -62 8 12 -144 131 -179 106 -352 -104 69 87 70 -81
4444 -81 -180 -76 102 81 385 -207 227 202 49 -86 -76 -98 -88 145 -185 -84 -26 136 286 -58 68 -28 -163
4467 -163 163 -268 -120 -177 47 192 218 178 276 131 91 -4 -283 -194 -294 -192 241 230 -25 314 -73 198 295
4490 295 292 -62 -56 81 -104 108 10 -290 -23 -71 16 4 -75 -95 41 93 171 -43 -62 -30 188 158 -121 -39 -262
4515 -262 22 -59 -116 -19 117 289 83 -6 45 -188 -97 72 -173 -39 -34 250 180 54 203 192 198 -305 -31 16
4539 16 165 74 91 -127 -155 81 -123 32 -40 15 48 -318 15 -223 -82 -8 32 147 139 -50 -270 113 177 266
4563 266 -140 -62 13 -186 -10 152 -9 -48 -306 -215 21 149 139 -61 -28 -46 -43 -137 231 59 -39 199 -83 -142
4587a42j3Q4J55M4j35l2J0J47k70J45q3k01M58j22k85M72k81j26K85l44J45J70
4609H1O2j65j8k26L68j02J03j57R1K05j61jk9j8M3k60J46m6L16J6l86K87j20j04
4633g5M6P7K3n1j66J00OJ18r6p7p7K43n7j86R8J09J7j97K5N0K63J3j85O8N7q8
4659E8j35P1k36M57j05o3k44K84n8M6k39K31J02k39J98l00L71k45J8J03J6R0l00
4682a19J00l0O2k25K90j69J47r3N9j27K02q4K85j05k82P9o1L7J20p4j30J05N0
4705C7O1l85O43m11j30L20p3kj90J46o0n3J12j65J42j84L27P9j80k36K58J3l41
4728b72L24m43L58r8K37j00P7m5j27P8K04j53J40j37j12JJ92j27N0l2K4K1J08
4751A68L9k11L9K73l89k1K46o8k58J35l6O3J8M0L14l57J24n9M6p3J40l14K14j20
$$ plain form
4587 -142 -155 -71 84 128 -7 -39 -29 118 -152 -7 -90 -291 167 45 -240 232 -49 -175 110 -234 -89 81
4609 81 143 -22 -40 -266 102 0 103 -54 37 242 81 80 51 33 76 -184 -38 -84 232 248 -138 149 29 -75
4633 -75 -29 48 71 20 -146 -46 -40 78 -18 -95 -172 71 14 -172 -74 35 52 -145 -120 -70 193 206 21 89 146 58
4659 58 -77 -6 -242 215 110 47 -197 87 29 75 -164 67 169 -70 128 -172 199 -46 -28 75 91 181 -119
4682 -119 -19 -49 13 -212 78 -91 56 -37 22 -105 97 13 298 193 -89 -10 -71 -34 86 12 -118 -13 37
4705 37 98 -287 356 -55 -185 135 62 60 -130 16 -44 -97 15 -150 -8 -192 135 214 34 -202 56 69 -272
4728 -272 52 -391 -33 -131 106 6 83 38 -89 -11 193 40 180 43 -69 -68 124 -3 47 15 39 60 168
4751 168 207 -4 35 308 -81 -102 144 76 -182 -47 -83 -20 -2 38 352 -5 119 60 106 33 173 -141 73 -47
4775d7K05r3ql38L29J22l58M69n06K15q5R7p4R9N6%l77J94J82p9K02k20n6J77
4799A06l7O5k99L90k30j0O3K49l36m7M4k61L82Q9k07k3M2n7N7m2j3J7O7Q9ooJ7
4826A03kp2K40P3j74j42L2j98K69l96L61O9k16K55l66J01m9K89k54j90K48l8J58
4849A01q5q4r7J05K29k08M2J27j31P7k8J44m7r5j34K64l41L41j12r9K57j44j13
4872c1J30k55K63p0o5j59K04O0J99L2k38L9K4j91J02J77l90K62j44R6j8K04k98
4895f7k27K87J19J36j78k2J4q9l62M95n2j37J0M03m27N5O1j53%K32J04M8J44m52
4919e8n4K39k71Q9J65p0k27p7L30j37K03m00l5O21k16j86K16r8k9J23m25M28k32
4942a01J0J36j20J99j89K8J65J43j02k58J12J30%R7m07j13L64J54m79L59j06J65
$$ plain form
4775 -47 158 65 57 -281 48 170 -188 281 -225 -10 -95 2 -72 27 83 83 -294 -100 82 3 205 -15 -71 106
4799 106 69 134 -165 225 -5 -15 48 297 -39 -86 -42 -303 79 168 -39 -62 -20 -77 -20 -62 -75 -58 9 98 92 86 103
4826 103 101 29 269 342 168 26 58 -140 129 -267 94 163 -53 202 -164 -63 -112 177 -77 -267 -19 -57 101
4849 101 16 -68 -165 -60 169 -39 3 130 -1 76 48 192 145 50 -84 180 -161 180 68 -31 226 82 -31
4872 -31 99 -156 107 37 -28 -187 17 77 276 308 70 109 133 -58 44 221 -169 93 -51 45 27 231 -67
4895 -67 -294 -7 112 248 70 48 62 -27 -389 106 54 -83 -73 330 -97 -42 19 -134 -134 98 202 250 394 -58
4919 -58 -112 127 -144 -55 110 40 -187 -264 66 -71 132 -268 -303 318 102 -84 132 34 5 128 -297 131 -101
4942 -101 -91 45 -75 124 -65 -37 128 271 169 -89 23 153 153 250 -157 -270 94 248 -231 128 22 187
4964A87J44j71j82r7M99l44r2j06P4J75k8L5j62J11P6j51k28J62L22k31N6O1q7
4987B3k74P7J08J69J13l69O8J74k12K7K95Kj70k6l4n5rK9N1Q1J03l1l80N6M27
5012B43l63j5J12J38l51J24J67n2N0l56J79N14k40j68j12K42j07J2K46l46M9j32
5034a66J51J21K08m05l2Q7K19j6k87J16j65L5J6p4J15jK54j20J0p7K7l7J73J22
5058B74n17N5J24p0J4j09O7L65k76j3O8J43j54P0M8M2j23J59j7k82J84k26J99
5081B5R6j09qm3j43K25P6k02p9Q0L12k9j98p1K4J06R3p1J79l10J62p6J06R7k71
5106b9K02j73J93k64o5K58j24j20J25l6j23J12J83j33J75k54J57j49j17K93j62
5127e1k6K50n5l60J55l3n3J29j92J72R1m30P09p7k44m2p0K17K4k9j12K33o7n0
$$ plain form
4964 187 331 160 -22 -119 380 36 -56 -162 -88 87 59 94 -68 43 119 -32 -260 -98 224 -7 49 110 23
4987 23 -251 -174 -66 103 216 -153 -85 89 -123 -96 199 201 31 5 -29 -84 -93 -64 -13 68 171 140 -240 -184 243
5012 243 -120 -135 -23 115 -236 -112 55 3 53 -303 -124 390 150 -18 -130 112 5 17 263 -83 -34 -166
5034 -166 -15 106 314 -91 -123 -36 183 167 -120 -4 -169 -134 -118 -192 -77 -78 176 56 66 -11 16 -21 152 274
5058 274 -243 -188 -64 -134 -120 -229 -162 203 -73 -86 -18 125 -29 41 89 131 8 167 150 -132 52 -174 25
5081 25 121 12 4 -39 -182 43 119 -83 -162 -82 230 201 3 -68 -44 62 155 84 263 -47 115 39 145 242 -29
5106 -29 173 0 193 -71 -136 122 -2 -122 3 -33 -156 -44 139 6 181 -73 84 -65 -182 111 -51
5127 -51 -77 173 118 -242 -87 -120 -173 -44 -236 -64 27 -403 306 229 -15 -57 -127 90 114 85 -27 206 139 89
5151H9j21K6j90K90k12J48k0j43K29q1j18K51k23J28K24k03l54N91k03p9l7Q0
5173G2mr7R1j69J36k47K27k47K62j8J88k09J71j77j39M42l27k31M10j14N0K88
5195C58m41J94k48R7J93j05QJ14j00q2J71p5j26M3O9o9j18N4O4pK04l57K31j46
5219g4pJ49j59j11J57J7K5qj59J7J75P4K9j04j56L4K58k32n7Rn1K68k36M58k74
5244D2n3K6J33l36K74R0k72K7J24j73J04J26kl02L77k38J9J91m21J62J35J14k06
5267e9Q6J84j21j14L74m09P0K8J22j74q1N5k37K04j10j1K31k37J18o4J32p8m2
5290a33J92j78J74j03J62j49Q7P1k12J06J80Rj13r9J11j70N6l9p6L32j95j8J27
5313A22k9q8k55K22o3J55M7J51j89P3j4k50K42p0j56n7K26q2O6k27K48J55j39
$$ plain form
5151 89 -32 -6 -196 94 -118 30 10 -133 96 15 -103 148 -75 53 277 74 -280 311 108 29 -8 72
5173 72 68 -29 62 -107 29 -218 9 -238 24 6 194 -15 156 -21 -160 282 -45 -276 134 20 70 358
5195 358 -83 111 -137 -40 153 48 56 170 70 -12 159 84 -42 1 70 1 -117 -63 1 -6 198 -159 72 -74
5219 -74 -81 68 -91 -202 -45 -28 -3 -11 -170 -153 22 96 125 21 -135 -101 157 -75 -132 -123 -174 94 -142 316 42
5244 42 -11 15 148 -188 86 176 -96 -69 55 -118 -14 112 110 -192 185 -53 -34 157 -264 -102 33 147 -59
5267 -59 27 211 90 -24 350 -59 11 39 161 -13 -94 -39 -276 -72 -182 -193 38 -199 -81 -145 -13 -91 -133
5290 -133 59 -119 55 -48 114 -35 52 123 -89 17 197 206 93 -6 105 -65 -9 -48 -124 208 13 -5 122
5313 122 93 5 -250 -28 -91 64 111 262 73 146 132 -118 124 54 -102 -159 67 -15 51 -176 72 227 88
5336H8RO0j64q8J01K60r8j81J94l10K43j53j52J8L2O2K08l32J94J35j67K68m24
5359a97L87j26J01j29j46J15M2Q4j88k68M78l86L32L7j49J6J44Q7k92j9Ok1J09
5382A7o3J0p4K24o0p6j14K41j02J02n2R6j93M2O0J08k66J08k17K98J92r0l53j2
5406a74L12j71J80l7q7R0m5p8k46M06O4j92k31K56o9p6j02L5K3N6J51j54K52l38
5430a75K81q4j21J35K36m61K74r2M9O2k46J42j97O2K93o3PLj06k8j88L23r5M4
5454E5p2R8l13K49r0J51k85j13M14k49K60j71K6j06K31k37R8O2p8N7j04lJ6l4
5478a38k3J00J35Lj16M15j68l34j25M27j89L0r5L46l07J26J19l13Q3J68J29m34
5500a61J96j00p1J0l9L95m52L30J83m8j63j54J32j77%K35J58m39K83l2J28j66
$$ plain form
5336 88 97 157 -7 -95 6 266 168 -13 181 -129 114 -39 -191 -173 -141 -79 129 -203 -9 126 -41 227 -197
5359 -197 190 64 165 36 -110 5 47 131 -57 -325 153 -233 99 136 -13 3 147 234 -58 -77 -71 -92 17
5382 17 -46 -36 -110 114 54 -22 -136 105 3 105 53 149 -44 -2 58 166 -100 8 -209 89 281 191 -162 -174
5406 -174 138 -33 147 110 23 113 68 -10 -256 150 214 22 -209 47 -22 -98 -200 -165 -142 -86 65 -89 163 -175
5430 -175 106 22 -99 36 272 -189 85 -7 42 104 -142 0 -197 -135 158 95 102 105 -1 -29 -217 106 11 55
5454 55 -17 81 -232 17 -73 78 -207 -320 94 -155 105 -66 -40 -146 85 -152 -54 8 -70 -13 -117 -120 -104 -138
5478 -138 -161 -61 74 77 -39 376 208 -126 -251 176 -13 17 -78 268 -39 87 206 -107 -24 144 273 -161
5500 -161 35 -65 -136 -126 -165 230 -222 108 291 243 80 -74 58 -119 -119 116 274 -165 118 86 214 48
5522D8j10p7K36J40j92R2j95j06l5J71J37j87j46L28Kj08J39k1l84J82k1q1J3
5545a75K20o3M07k91k02J34k23N3J01p4R9l1J9O5K80k84N9j38L1J81l15m4K84
5568I3o5j28K06j23J5J51m05K58K77j90J20l25J78P6l5ok77n4J44N6J05j91P4
5591d6j57L02j35p1J12j31j44L50r1q6J50L5r1j61L30q3k12K50q1j25N5K92k83
5614b1L74r9j96K17m22m8K11k85K56j8K5Lo2J7O6N4p3K9J1j37lJ84k24J36J75
5639A70k95j41L34J26j07k3J7j12J04P2k01M3Qj97L89k4j46J36Q8k45l17L36n9
5662d4K44k44K93m7k67M32m87k6J98J3J41k00J09q0k6Q4J0J09k64K26k7j23k55
5685b31K98k01J23j66K45o2j49K14j65O8O6O6k85L08j79K64k47P6j49O8K73l55
$$ plain form
5522 48 -62 -139 97 237 45 137 -58 -164 -199 -28 109 -78 -224 104 106 -2 137 116 -268 -86 -107 -188 -175
5545 -175 45 -18 389 98 -104 30 -193 -140 -39 -113 -14 -45 -26 39 319 35 94 -44 -13 168 -147 -191 93
5568 93 28 -100 106 -17 -2 149 -256 2 279 89 209 -116 62 138 103 97 -180 -234 -90 -34 71 -120 -46
5591 -46 -203 99 -36 -107 5 -126 -270 80 -11 -97 53 88 -3 -164 166 83 -129 121 40 -85 -30 262 -21
5614 -21 353 254 58 275 -147 -195 16 -269 -13 -31 -6 -3 -65 -48 18 72 -1 28 39 -98 -101 83 -141 -5 170
5639 170 -125 -266 68 194 87 64 81 -31 73 145 -56 -13 -5 -202 187 163 17 153 241 -4 -321 15 -44
5662 -44 200 -44 249 202 -65 367 -120 -146 52 65 206 6 115 35 9 93 103 212 -52 174 147 24 -231
5685 -231 67 -134 -11 -177 68 6 -143 71 -94 -26 40 106 -179 129 -50 214 -33 43 -106 -38 235 -120
5707a20Q4K44o1J3j38m9P0J01j89n1K10p4j80J56o3J33j53J15l1O5l8j40M9m1
5731h8K09M6r7n9j88L63P0k57N1J42j90n4j51J77Qj23J56j25L33m38L65k89O8
5754g1k77M20l4J18q8l24K20o6K15j49j1nK31j42l10J20j8J0K64J8N9k17q6m3
5778a66K2J52k5j15k4N6j68K7J18J76L6LM9l36M43j61k19K90P2j28k93J78P1j02
5802d4J25k5r3k31K31l05J73P9O2j48Q6j82K48n8J66K29k19n9q5O1m6K6J7R7m25
5827c20K38p6O7j35M10k39NJ26K01j89O7j53j4j92J77m1K45k91N9N6j12O1J08
5850E8j70p1K35j06MJ07J97k31J4j67J15m3m2K08J8j56N3j95L01k88J07k5J22
5873D5J26q1lJ9J77l90K16Or5n9J77k04j02K32r1J3n1J94k43J44J41j82J23j28
$$ plain form
5707 -120 -36 208 147 160 22 -27 43 144 -45 -96 114 40 -140 16 -47 86 -67 48 17 82 44 -96 -47 -88
5731 -88 121 167 70 11 -177 186 256 -1 50 192 2 -52 -203 -26 -18 -141 15 -110 223 -215 150 -139 -71
5754 -71 -348 72 38 156 68 -256 -36 -102 113 -36 -47 -52 179 37 -273 -153 -171 -161 103 121 180 -37 -123 -166
5778 -166 -144 8 -17 -132 -156 -100 -268 -241 -123 53 89 92 141 -195 248 87 -132 158 230 102 -191 -13 58 -44
5802 -44 81 56 -37 -268 -37 -342 -169 -90 -28 -176 -90 -272 -24 -82 84 313 94 35 -50 11 -35 -9 8 105 -320
5827 -320 -82 -158 -91 -226 184 -55 -50 76 277 88 155 2 -12 -204 -27 -68 177 -114 -55 1 -111 -50 58
5850 58 -112 -183 52 -54 -50 57 254 23 37 -130 -15 -58 -100 108 126 -30 23 -172 129 -159 -52 -77 45
5873 45 171 90 87 106 283 -107 109 115 20 -39 138 -66 -168 64 -27 -14 -65 129 -114 30 171 -11 112 -16
5897a6J20m7kJ33K2k06J39k41J16K2Pk62p4K80L7K16j93J79j08j14O8j98k68L84
5921fK51m37N07m57J20m1J13O6j50J94O4j29r1J55k31J27m7J61k28l9K98P3k61
5944A2R9j92M6r7J12J46l27M27l37K60m09M65j59N8k9J4K09m23K34Q7l19J69q3
5967c7l5L92m13J82J47k91k2L7R7%k6K2O5l75P3l4K38r4R0j91K11Km5O2k53L81
5993A83k40j13K6J48k51M44j52l1o9O2L0K01l35Q6J16nK5j05J71l64J39n1R9R4
6017A08q8n5MN2l50L31M7m8p4K33j10p2k89K94o4L17l56KL03l83K59Lj14l43N08
6042A15j77J74k4j44j3J96k14J00j14m1J11L00k32kj8J4j01K56j76Nj60J61L63
6065C79j94l81M24r9j46j3J16l8P7q0J12j86j92K73M0q0J37r3J31k49O8J17j20
$$ plain form
5897 -16 104 57 55 188 210 4 143 -98 18 40 47 -215 -289 -9 28 244 51 230 122 8 76 -122 -390 -6
5921 -6 245 -192 315 -142 -22 -63 50 116 -34 160 224 95 4 159 -72 55 8 169 -59 -98 200 273 12
5944 12 111 -81 -35 -132 -20 126 -201 226 -111 149 -260 205 46 104 75 89 298 -125 109 196 -123 46 -37
5967 -37 -72 320 -93 89 236 -55 -77 -40 57 57 31 53 118 -257 -184 -218 20 -74 16 -175 36 38 -7 55 -198 183
5993 183 -57 -170 -144 4 -247 197 45 14 -55 7 37 238 -97 -11 105 100 125 20 191 -173 -34 -85 14 108
6017 108 20 -35 -31 21 -329 2 49 1 -73 160 50 -22 -311 -17 -81 236 -120 -118 185 -198 61 64 -50 -393 115
6042 115 -62 112 88 -56 -69 127 -87 13 -101 -142 -31 269 37 35 17 31 -70 186 10 15 -145 16 379
6065 379 185 -196 228 129 -17 -30 86 48 125 45 157 -29 -221 52 92 12 149 56 187 -62 6 123 3
6088CL9o4j25K07j70j5K9K6J55mn4p1J67j27P8j02k1l2p8K03K0n0L0N7l27J81
6114d5k2K09k5j27q3J15k35M6p9J75J55k06J67k38j05L86k67J8J36J31j46j45
6136a85N8K33k06K65JJ3n4k58K72l09L25j95lj61Q9L53l13J12Jj71K08jl47L76
6160A03n5J08j15l45N17l14J65n4p3Q6J34o6j81K7J22J01j45K7k08P0L39j40j31
6183b8J08J07k96J80J93l79J15o5K2J85j71n7P6k99L29J23k43K43k40j40J48L3
6205e6O9K69l12J38j49Q1O4j02k4j19J81r5L24l66J2p9k6L75j27Q3J39k23j0q9
6229d2J90p0j84Qj94L22J58l23q7j7L26j51J2q3l7K7K48m99K20L34k20O2J55j21
6253C4j6l1M6N9q5q4Kp7K01J05M4o1j14O9j15K01k97K05Mj45R1j11J07j71K52
$$ plain form
6088 3 42 -22 -147 60 -110 -125 -96 -70 85 81 27 -44 123 -4 74 -28 -49 -81 -159 44 64 14 44 101 -226 -45
6114 -45 -67 142 117 -10 -93 22 -213 -167 -246 -71 84 -122 45 -193 -298 88 -179 -161 -25 106 -40 -185
6136 -185 -127 106 -100 165 166 179 125 -133 139 -170 155 -40 -43 -204 -115 238 -75 37 38 -133 75 74 -273 103
6160 103 48 156 41 -304 213 -101 64 10 -63 23 157 91 -90 -63 59 160 15 42 -166 -96 243 103 -28
6183 -28 80 187 -109 71 264 -115 0 -65 -43 142 -29 -86 -10 -309 20 143 -100 143 -97 -237 -89 -56
6205 -56 13 282 -30 108 -41 40 104 2 -22 -141 40 -55 269 -97 -85 -164 -190 185 58 141 280 57 47 -42
6229 -42 148 78 -106 -98 -292 30 188 -135 -222 -239 87 -64 -52 -135 -172 -145 103 -396 -176 158 -62 0 155 34
6253 34 18 -13 33 92 7 -77 -75 -152 49 154 198 137 23 92 -23 178 -119 86 90 -55 36 -75 32 -139 113
6278A13n1r0J5N1N5l7Q3p1l32K20q8L00l59K17r3J47j44Q6j54R4K19k6K5l96K11
6303eK7k64K65j17kL49n11L72k79n4M03n3j60n4m9K26j24J55k56J9K78l77M8K95
6327A32k32K36r0k9P2j21R3r0j57K91j00p9k4K18Kqj46J01j2p6L11l19J38K6k56
6352a19P7j57J51P9q0L85n85K05j16J43j46J51j25J8J3kjJ20K16p5k54j86M27
6375A39q7N7j26k1J41J31l07Q1J37k33o9K05l00N06j16j63J91k78J56j03J39k75
6397a95O6M2L13j63J54k08J07l03M85m35K04k7j42L70j51Pj80N09m14Q0n0r4P4
6420D9j86j0M99m38O6k1J78j52J74k79Q5R2l33M06j53j18j03P8K64m10J43K39
6442G0p6J99qO3j68M2K7j31K37q1j68j46L01P5m37Q5J63k62J07K59k21J75J13
$$ plain form
6278 113 62 -28 -13 38 93 56 139 68 -264 -44 -132 168 -191 26 -67 80 -64 22 -132 -38 181 155 180 -216 -5
6303 -5 22 -242 23 -94 -96 253 -258 114 -165 -219 184 131 -29 -83 -132 94 -30 125 -131 -112 166 -211 -163 132
6327 132 -100 136 46 17 89 -32 61 -29 -186 105 5 -74 -98 120 122 114 -32 69 57 -19 292 -27 111 137 -119
6352 -119 -42 -199 -48 31 -49 336 -249 -44 -160 -17 -163 -12 -137 -119 -106 -108 -109 11 227 152 -102 -288 139
6375 139 52 109 -17 -38 103 234 -73 8 145 -88 -157 48 -252 254 138 -25 166 -112 44 -59 80 -195
6397 -195 -129 -87 226 63 217 9 116 -187 298 -137 67 40 -102 268 117 124 -56 453 39 119 69 -25 49
6420 49 -137 -147 352 -86 -20 -41 137 -15 159 -120 -35 57 -276 130 -23 -141 -244 -166 98 -312 -169 70
6442 70 -6 193 185 248 80 122 149 18 255 174 6 -140 161 236 -201 -116 47 -215 -108 151 -70 105 218
6465B18j9k13Q2j42K26j78k3J47j22J91j88J81j78PK51l85K40j04n8n9J63k16
6487a79K83J0k77R9J71J21k29Q0Lj27j84L92j1l02j45K63N1n3j07P4K8J21l83
6510c01L73M3k75J81p5J23J11j49k61m0K21K4k1Q1n1p5L2p9L58l92J05J64j98
6533a01J03j79J18j37n5k1M84k02l7L50l93O4J2p1K76j51l5o3R8r4J78l77M34
6556B01O3k34p7K1m0j72M18j21m37P4M66k18Q3l75K30p0L8j44R3J29J29n6p7P
6580f9J1J98k03j8Q6qj02j2J81j19J60j38j12K12p5L7q2J50Jl2m0j85K14j63R2
6605a6ppj05q7O30l29j61J66l18K49L5j99K18o0k6J81j40Q3j63N9o1N3M1j79J37
6630fL4J30m48K37J19J60l12PJ32J23m13M73j96j28R0k28K51k8mL4m9K15N0k75
$$ plain form
6465 218 199 -14 68 -74 152 -26 -49 98 -24 167 -21 160 -18 -11 240 -145 95 -9 -67 -126 37 -179
6487 -179 104 114 -163 -64 107 228 -1 79 82 -45 -229 163 152 -150 -295 -32 19 -34 -141 -67 -39 82 -301
6510 -301 72 115 -160 21 -54 69 180 31 -230 -270 -49 -25 -46 35 -16 -91 -59 -138 220 -172 -67 97 -101
6533 -101 2 -177 -59 -196 -251 -272 212 10 -27 323 -70 -6 6 -65 211 60 25 -38 60 -34 144 -233 201
6556 201 264 30 -47 -26 -66 -238 180 59 -378 -304 162 -56 27 -348 -118 -188 -150 -294 -201 -72 57 1 -76 -69
6580 -69 -58 140 -63 -81 5 -3 -105 -117 64 -55 105 -33 -145 67 -8 29 -53 97 98 66 26 -159 55 -108 -16
6605 -16 -23 -30 -135 -222 408 79 -82 84 -234 15 50 -149 69 9 -17 164 24 107 -56 3 -58 -5 36 -143 -6
6630 -6 28 158 -290 -53 66 226 -86 -79 53 176 -237 236 40 -88 2 -226 25 -3 -7 27 -22 193 243 -32
6654c2M9N0k23L22n4j18o0K0K4j32J06J1J56R6k98o3K85j56P5Q0j52l6K54j86
6678A8k9N4j93K08j94Q4r3K66q7q6J13J31k54r4J93k37K76p4J12k58J10K70k11
6701B5j40J92p1j50L2J69J57k81o0P6j21K9J45mK19k98K26k31L63k41k1j65K78
6724A28J13l31J65k55K27M5j10J37k23l3j9JJ31J34k21K0l0L15k5j23M0l3l59
6747c06L47R6j63o7J92k13O0j9rJ05N4R2l17K31rpj74L02k80j52P4L49j75p8K3
6772d4%j0P6N6j58J65j06k25K49K21l59p8J79K9J25j10K03k81o3J50n3oO9J5j64
6797a20J57J7J16k4j96L0j56J82j04n9J80k0J1J9k05K00K2R7nq0k68L59j18J9
6821E4j36r6K54M2j39J46j51l9L7P5K2l0j13L03l38J99j79M3J52k88R4j04N6L01
$$ plain form
6654 -32 17 67 -156 166 112 -6 -66 -46 -22 -154 -48 -37 119 215 -83 -146 139 -17 58 138 -14 -50 204 18
6678 18 -11 43 -150 58 -136 -52 -145 121 34 -52 61 192 -62 -156 37 -200 76 2 114 -144 -34 236 25
6701 25 -115 77 6 -144 -112 57 214 -67 -127 -51 -172 -143 2 -2 217 -81 145 -86 277 36 15 -150 128
6724 128 241 -90 75 -180 47 92 -18 119 -104 -137 -156 -155 -24 110 -111 -91 -121 194 169 46 86 53 -306
6747 -306 41 137 -26 -93 99 -114 -54 -73 -82 23 77 169 -148 83 74 67 -107 195 -85 -237 -163 186 11 -67 -44
6772 -44 -44 -54 22 78 -80 85 -21 -246 3 224 -135 -213 -34 -5 120 10 213 -68 -131 19 -34 -40 29 44 -120
6797 -120 37 54 170 146 -50 -20 -176 6 -98 -157 23 3 14 33 -172 28 50 147 142 62 -206 153 35 54
6821 54 -82 -178 76 118 -21 125 -26 -65 -28 47 69 39 -74 229 -109 90 -89 -46 106 -182 -88 -192 -136 165
6845A65l08L25o7k72J83k5r6L43m15J57Q5j35K14k17Q7Q3l9M9L5m83M39j12R1
6868H7j37k02L18j11l8K56l45J17R5j11j98J34j12J19J48j3j31K22L6m7j76J55
6890F6n8k54j7L63j66J52P7j10l05L48k35K68l07J14R9j7l5l06K36J91J7j45j41
6913a65K68m1k25K83Ln5j25n2J25o5J96o1j08j5m4K17l7r8J21M6L0q8J92j67O8
6938B03j51L6j53M5j4K30m7jl35L23o8l46L09Q5oM7j88p0K27l37L19j18K43j19
6962A14r6j80K45k07Q4N6q6K32k24K96m89p5J53K46k72J97J19J26j54p3Q3k36
6984a41K15K01m83M10k09N2M2j44J02l2K01k18j77K03l4r3j3J61j28k2L30m30
7006b07K69j02M6M6JJ12m4j14p4j27N08m79K17l31N70m97J12K11j15k30R1L39
$$ plain form
6845 165 -143 182 115 -157 26 1 -95 248 -167 -10 75 -60 154 -63 24 107 68 117 152 -331 108 -4 87
6868 87 -50 -252 66 -45 -83 173 -172 -55 40 -71 -269 -135 -247 -128 20 7 -124 98 134 87 -89 66
6890 66 8 -246 -263 100 -66 86 163 53 -252 96 -139 129 -178 -64 35 18 -17 -323 -87 104 121 -24 -165
6913 -165 103 62 -163 120 123 68 -57 -109 16 -49 147 86 -22 -37 -81 136 99 1 122 168 198 110 302 135 203
6938 203 52 88 -65 -20 -34 196 149 148 -187 136 68 -278 31 116 110 157 -31 -101 126 -211 108 -10 233 114
6962 114 18 -162 83 -124 -40 16 -70 162 -62 234 -255 -330 -177 69 -203 -6 113 239 85 12 95 -141
6984 -141 74 275 -208 202 -7 45 87 -57 45 13 214 -4 -181 22 -12 -105 -118 43 -85 -107 223 -207
7006 -207 62 -40 6 52 53 165 121 7 -67 -194 314 -165 52 -279 291 -206 -94 117 2 -228 -137 202
7028B02j84ok09P4NP5j02J21l1J78j34l17K01Q2K3M4j21j86M55l44J06j93L24
7051F3l47M60j07j2j97j0O4j67J72%o4J42m2L5M6J35j42j12R6J7rP0n3oR2j26
7077bJ68k27p2K27j44J5L98n30J08J51n2j54J95j41K15L4j4l19R4O9j23q0N3P1
7101f0J60k85K12R4k23K7J09j15k81J90Q2N5R2J25k01J36O4qm80N04q0J1m6J90
7125B72m13L16k1k94O9OM3JJ33j4L1k70n7Q3k6J4N3J44k86J81m6Q0p3J8J1J45
7151A00k54K35j17m55K50L15k85K76j67J61j73pK35o2j33K46q5m44J15K98J76
7172B25k31J90l13M9J91o1j99j25M22l14J51k00K73P1p4k55P2j5R0j32K77k1k72
7195b01K11j39P1N6J92m42K32K64k35q0m8k24L73n3k05l7L04k66L74j86j37J82
$$ plain form
7028 202 18 12 -197 -123 -118 -43 -145 -24 -55 123 -11 -328 -127 -45 -22 22 -99 -285 170 -174 -68 -261 63
7051 63 -284 176 69 57 -140 -150 -86 -253 -81 -81 -145 -3 -45 -10 36 171 29 -83 13 30 21 91 38 32 124 -2
7077 -2 166 -61 -133 94 -50 -35 363 -167 -59 92 40 -114 81 -60 155 189 175 -144 -50 19 -104 -184 -131 -60
7101 -60 100 -185 27 121 -102 -75 34 -81 -362 -172 -90 -35 57 182 -19 117 181 173 -307 197 117 128 82 272
7125 272 -141 175 154 -140 -71 -65 -22 -21 112 98 129 -141 -198 -115 -141 -127 -74 70 -216 -35 -81 -1 -74 -56 -45 100
7151 100 -154 81 -36 -491 -241 74 -211 65 -102 59 -114 -121 114 52 -81 165 80 -364 -249 49 225
7172 225 -6 184 -129 -80 111 50 -149 -274 148 -166 -15 -215 58 129 55 -200 -128 -143 -53 -185 92 71 -201
7195 -201 10 -129 -58 -2 190 -252 -20 244 9 -71 -119 -343 30 -23 -228 -265 39 -227 147 -39 -176 6
7217Fj39L21m14K47K59k09j4j0K58k20p3J65L3N5j95k29k4K95l55M09j57m21N28
7240A16J01j60l12k4L80k47R9j06L91j74J06M5k33r0p5P6J2j68K01Lr9K27R3j41
7264B1k13L38J69n22L17Q6j31J01r2j39o3L41m40R4J63J92m00K03n2J48l02P7
7286a04P1l2L2j04K42l86M24k39K86k42L49k99O3k07Q6j9K54j14L26m18J90k29
7308g0N9O7k53J90M6j83J98K6p2O9N5j11j10J55j92J08j45j0K08K6j24J8j25K37
7332F7j04J01j71nK96n5O9l05J29M7j29n2J84q6l71N04k07j21K31k7L53m66L16
7355A98j45N8m4j77M4K59m09L73n5l62L54j22p6K56j50J58K0j66n2l62L36L28
7377B64k54L29o41L76j5j81J52j02N0J28rl26J18K63j40j26m6k5K57k7j11L19
$$ plain form
7217 6 -133 188 -226 21 280 71 57 47 305 85 12 177 210 265 70 -159 -183 112 -243 166 9 -412 116
7240 116 217 57 -255 -279 101 -146 -47 -153 238 64 170 215 -18 -108 -183 -107 -95 -263 -62 -59 -158 69 162 21
7264 21 -192 146 315 -207 110 196 65 166 74 -65 -128 213 -227 -133 30 222 -178 25 -27 121 -181 -104
7286 -104 -33 -65 -33 -137 105 -281 143 -96 190 -52 297 -2 61 -146 -60 -79 175 61 387 -31 159 -70
7308 -70 -11 56 -197 -7 39 -144 54 80 8 77 132 21 -89 66 -126 -18 -163 -173 35 61 -63 -45 -170 67
7332 67 -37 64 -107 -112 184 129 198 -107 22 69 -60 -112 72 -14 -385 119 -88 -209 22 -5 348 -118 198
7355 198 53 111 67 -110 -66 193 -216 157 102 -260 94 -28 -104 152 2 160 180 14 -38 -400 -64 264
7377 264 10 339 -302 74 59 -122 30 -72 -22 106 97 -229 -111 152 12 -114 -160 -185 72 45 -66 253
7399B53k52J6J57n6l3Q6q6l53L39l57J94J57j13m35M28j24l3J81r2q0K67Or7M2
7423A5%k02K14N4j4r1k0m3J40P2k77J65r0J59L7N5n41L80J92K1j76K6Q4j32k32
7448b04J31J49K2k45L3K88p4J39k76J1J75kl70M77k58K46k54K9q4J87j45J78o7
7471H6k38M16j33k9l68L47j91J07k7J04Qn06J93L28k40J89j4k4k08L87l73j54
7493c40M08p3J55j37j91l21O00J6k83K21l13M05o5j04j69J95J97k46O5M8r5K73
7515B46k42k1J71l4rj78j48J37K42k02m6J7J83j40L41m88R1k36K48J82m8l14K11
7538c7K07j30m20L77K05o5k21N6j6J35R1j60K32j87J30k78K85j89r1p3j26M10
7560A35k3j22j26J08j79J72K5J6p7j52J51j50R3m4J86K6J00r2o6J8j51K29j49
$$ plain form
7399 253 1 17 174 118 85 171 85 -268 71 -286 -92 65 -48 -483 -55 -179 -212 -31 -123 -203 64 70 -27 15
7423 15 15 -187 27 81 67 -24 -44 -87 53 125 -152 13 -77 82 119 174 -367 13 205 226 50 76 160 28 -204
7448 -204 -73 76 98 -147 -114 174 100 239 -37 -26 149 147 -223 254 -4 242 -12 17 -67 120 -25 153 86
7471 86 -152 264 131 102 -266 81 -110 -3 -30 74 82 -424 -231 97 -143 46 32 8 -200 187 -186 -340
7493 -340 68 -5 150 13 -178 -499 101 117 -166 55 -258 147 82 -22 -191 4 201 -45 20 68 -27 246
7515 246 4 -17 154 120 111 -67 -215 -78 164 -38 -84 -67 116 -24 317 -171 -80 -316 -68 114 66 -248 -37
7538 -37 170 40 -380 -3 202 137 -84 -28 -44 91 182 22 254 67 197 -81 204 15 -76 -149 -275 135
7560 135 112 -10 -136 -28 -207 -35 -10 6 -71 -223 -72 -222 -129 -173 13 39 139 47 -19 -1 -152 77 -72
7583g2l18L74M7r4Pj67M41k03j39J34k07K06R9m7k62M7M25l94J16R4O1J32l37
7606e7j6K68k23P3j80M60j19k16k0J71l61K95Q0o1P4j39l3r9O7j45L88j67J35
7629A75k07J49m06K01K86K8j51r5k85K94n2l9M4L4q8Q7J21M0m36L23N9j29J6J56
7653A25j60LPN1j45K12m8p8j90K22L11l92J59l4k28PJ91k23L48o4k46L48p3j64
7677f1J38j5N7l66L70k22J42J87j11M0k50R5j41J26l5m9n3K3k7j19L23k31J56
7700b3j2j19m0L16n3j80L2J4J38j71pL21l9o4K14l31J54J3k31Q2K36j49O3k15
7724e1k8q2L44j20j91K76j01m4k9M8o9L3Ql0J32j42Q8k1o6j15K46j04J36j09J96
7749B05k66O1j15K97j16l16K77j29o0L04ol48K70j08J9J6R5p9J05n8n7j43q9K47
$$ plain form
7583 -72 -390 -16 31 -63 -56 -223 218 15 -124 10 -197 9 108 61 -201 -154 271 -123 -7 87 148 280 -57
7606 -57 -73 195 -28 45 -135 325 206 -10 -30 141 -220 75 155 94 168 29 -4 -103 -36 -181 207 40 175
7629 175 -32 117 -289 -88 198 226 75 -20 -305 -11 -63 -102 -58 -24 -112 -25 96 136 -300 23 82 -47 -31 125
7653 125 -35 -32 -25 26 -119 93 45 -33 -223 -1 310 -82 77 43 -185 -178 13 -210 138 74 -172 176 103 -61
7677 -61 77 62 119 -247 123 -99 43 230 119 159 -91 4 -137 -11 -46 -95 -148 -125 -152 -271 52 -179 -23
7700 -23 -35 -154 -194 122 69 -111 -79 -65 73 -98 -105 216 177 113 327 -4 150 163 -68 14 250 101 164 -51
7724 -51 -79 -161 183 63 -128 148 47 3 -26 22 -47 -14 -6 -36 96 -46 42 21 -45 -160 86 -18 118 9 205
7749 205 -61 0 -115 182 66 -250 27 -102 -162 142 136 -212 58 -50 -31 -15 80 1 106 48 -9 -152 -241 6
7773Fj9r5NJ89k1J58r6J05J05l96J4k73L0K95j03j9J95J6n9m4J2j6k74L81l16
7798b20j3J90J87k48K44l24J10K4l3J82j85j4l1P1M0j8j08K51j7o1k32J28J74
7821I7J50l66K94k25N7o5L5j16qJ19J45M7k11J33J49k74K82l03N0n4K88k23L7
7844C8Jk27K66J5o9q9L6R1o0j6L50l26j6r8r5J17L04k55n8K60m3k8o2q2K11k43
7870g8L8J17J61j00j90R3o8J03k12M29j37k64J7K0L0K06l84M9J94kj01J53J4J7
7894A05L3k43m2K31L9j70J28j83jJ81j9J69j05o9j78P0j5L3K14k95N8J16q7q4
7918a14J48k89R2J45J42nJ41k04j6J38l54K12R5j71Nj5j76L46J2l1k05K29k98
7941a73J66p5q1n0Q8j18K62K33k04J4j59J27K33n56L43j13R1j81K79j15j97K64
$$ plain form
7773 6 -13 -108 -103 86 65 223 127 232 337 -59 -45 -318 -288 7 -96 -115 80 96 37 -7 5 -11 -285 96 -220
7798 -220 -233 -43 144 -104 140 -184 -74 -50 -83 99 -86 -100 -131 -60 -20 -38 -146 105 88 27 -205 -77 97
7821 97 247 -119 175 -50 7 -58 -23 -139 -147 -28 117 164 -47 86 235 -39 243 -60 -10 -64 224 1 38
7844 38 39 -188 78 93 24 -65 -29 62 2 -14 336 10 -6 -104 -199 -82 222 -33 -91 169 126 98 36 -46 165 -78
7870 -78 -40 77 238 138 -52 41 -27 76 -136 293 156 -108 -91 -71 -41 165 -219 -170 24 22 -79 74 88 105
7894 105 138 -105 -147 84 123 -47 81 -102 -103 78 59 228 123 54 -124 -54 -69 -36 178 -117 -59 57 -30 -114
7918 -114 34 -255 -163 -18 124 119 260 56 40 178 -176 36 131 -40 -35 -50 -226 120 132 101 -104 125 -173
7941 -173 -7 -82 -163 -213 -125 -243 19 252 48 62 -97 30 263 -293 50 -63 28 -153 126 11 -186 78
7963G8m5R5k10o5K29j19j39K0J12q2K81j24k49M32L9j90J47m15J34lkj23L36k62
7987a25J72k68J61K08jj90K8k0l9J33j2q1J42m04N41j62L9k33K25J29k22l11L95
8010A05k64N4J48l9j59j3N08j83k85L21n05K53L2O7Q7j63j63K76j74R2k2j82l
8033b12L78j96j11M2P6n7k37L66j50J5j24K28k76M08m76L12j14O4j0P4q8J87n7
8056D2k65J61K63j15k04L08k69J80l6k9q1J05LR2m05J91l5J54J57n4K0o3j4k56
8080a50k6K49j26q5k34N67j95R2q3m5J28Q6K8j55Q3j45r0Q4l44O47l49J20K97
8103C54l68pN2R6j43o9l5J96n4k42L35l05j01K68J8L5M5M2k38o2L91k80O3m7j06
8128a62K01lL4K16k01j47q1m4P5K7J20j73M2L7N3K01j86R0J7N4j01l1k29NJ09
$$ plain form
7963 78 33 128 -82 -147 82 -37 -176 -156 -44 -126 155 31 -218 214 253 63 210 -205 -71 -74 -76 -199 137 -125
7987 -125 47 -221 -60 148 147 -43 -15 -35 -74 59 47 -34 108 -296 245 83 122 -111 114 243 21 -290 105
8010 105 -159 -105 43 4 -155 -168 340 157 -128 193 -312 -59 -27 40 127 -36 -199 77 -97 -5 -27 -209 -212
8033 -212 166 -30 -141 -99 -23 -80 -317 49 -101 -86 -210 18 -258 150 -326 -14 -128 -64 -74 0 -88 99 42
8056 42 -223 -62 201 86 -118 190 -79 101 65 36 -45 60 63 155 -250 -59 -94 60 217 163 183 120 106 -150
8080 -150 -176 73 -53 -138 -372 195 0 92 9 -36 92 178 206 51 134 -11 -101 -17 -361 286 -63 57 354
8103 354 -14 -21 31 127 -16 -85 -120 76 22 -220 115 -190 -291 -23 -5 30 75 117 -121 -183 208 -72 -9 -56 -162
8128 -162 39 36 70 286 85 -62 -143 -187 -112 -85 35 -138 -96 -59 -6 195 9 99 116 170 69 38 -191 -186 -77
8153g7R5J91l19L6p2L26l03K41p1k29J27R1j91M38l30Q1J14j04n3K7N9k85l2J75
8177f5J80j33R5J87l10J63p9k3k80R3J34J76K9l43
$$ plain form
8153 -77 18 209 -110 -74 -146 180 -123 118 47 -182 -55 36 -155 283 -47 34 148 44 -9 18 77 -208 -240 -65
8177 -65 115 -18 77 264 -46 117 38 15 -265 -172 -38 138 167 -176
8191a76
$$ Imaginary data points
##PAGE= N=2
##DATA TABLE= (X++(I..I)), XYDATA
0@%%%%%%%%%%Qj6J6j6J6k4L2m0N1n9P2q8J04j20J44j71J96k30K68l07L52m01M56
33B43n19N86o59P41q31R32j042J160j289J432j588J757j943K146k366K607k871
50a504L162l485L839m234M675n169N733o374P111p978R007j0253J1804j3790J6443
65H987k0182K5886l5771N7684j95558J02393L57449j68095k18890p8919J34940
76c0076J4913N0992P9603k796j02482j07952N117P3616Q3775Q9656j03158j78730
88a27522q5003J58488J90877j0637r7628r8665l7819L9864J15604J27606p7967
99I7198j54224o5212N9172Q7129L3299L5811o6351j33111k8831J03998J31987
110A00865j1270n6942n7460p3193J7758J19551J20659p6132j66176k1019P0354
$$ plain form
0 0 0 0 0 0 0 0 0 0 0 0 8 -8 8 -8 8 -16 16 -24 27 -32 40 -48 56 -64 80 -91 105 -125 143 -164 188 -213 243
33 243 -276 310 -349 392 -439 493 -549 611 -678 754 -834 923 -1020 1126 -1240 1367 -1504
50 -1504 1658 -1827 2012 -2222 2453 -2716 3017 -3357 3754 -4224 4783 -5470 6334 -7456 8987
65 8987 -11195 14691 -21080 36604 -158954 -56561 300888 132793 -86097 -165016 -30076
76 -30076 -15163 35829 115432 112636 10154 -97798 -92681 -19065 64710 154366 51208 -127522
88 -127522 -212525 -54037 136840 126203 28575 -70090 -107909 -68045 47559 175165 97198
99 97198 -57026 -122238 -63066 24063 57362 93173 26822 -106289 -135120 -31122 100865
110 100865 89595 32653 -24807 -98000 -80242 39309 159968 83836 -82340 -103359 -33005
121c3005N4213L661M1191k901j37177p2654R9310J66109P634j27697o9965o279
133g7560N4490P0018M3995l7703j07654k3195M3803M6100K5450J0177j1659q8238
145e1976m6341O4498J00452L6720p3016q1736m1813M6146J13374L8012p4621j06421
157g6722K965P4447K3268l15N397j479o1698m9196O2127Q3452J6461o5668o1362
170d8323j0428K5691P1307L6450m1957p5992k5806M9441L8185K1193K933l6124
182F570n6458j8638P3185O3844k0491n8333l2158J4471J3937K7881L2761j2943
194C3628m9640m3387K2305N5097L3154r259n5083l9268J1882N5638L4609k4817
206B4859k9126j7362p818O954L4844M2607k4511o2680k4760L9219N1133K961k0864
$$ plain form
121 -33005 21208 24869 66060 63159 -74018 -146672 -47362 118747 126381 -1316 -71281 -77560
133 -77560 -23070 46948 90943 53240 -54414 -77609 -33806 12294 37744 47921 36262 -51976
145 -51976 -98317 -33819 66633 103353 30337 -51399 -93212 -47066 66308 104320 29699 -76722
157 -76722 -73757 690 23958 23643 29040 27561 -34137 -83333 -21206 62246 78707 13039 -48323
170 -48323 -58751 -33060 38247 74697 32740 -43252 -69058 -19617 18568 39761 42694 6570
182 6570 -49888 -68526 4659 68503 48012 -10321 -42479 -28008 -14071 13810 46571 33628
194 33628 -16012 -59399 -37094 18003 51157 41898 -13185 -52453 -40571 15067 49676 24859
206 24859 -4267 -21629 -29447 -22493 12351 54958 30447 -32233 -56993 -17774 33359 36320 15456
219A5456k7659j7559O106K4501L0057k038k3905k6480j5138K0695L8005K3722
231D5763k8985n0104o603L2287L3099j35j4288j5871k0266J180K4998K9380k729
244B7726l1769k1116q86K2727K5075N127j9384k9970l184J9010K0731P668q845
257A2910j7441k0956L321K9352K1292q117l0014j3959Q164J7260J6303m13j4405
270C297j9264l647J5306J5251P885q362j7423j4718N321K6187J4226j1284k2745
283i970r721J0671J2655J0021p00j1502j3698l762J2268J4666N291q869j6872
296i522q560Q693J9855Q054j1941j5293n386P988R142O877J444j0237j2502k560
310a3948J2212J4048N06j0146j2722k623Q949J1966L982q147r857m008L150R019
$$ plain form
219 15456 -12203 -29762 -23656 845 30902 28864 4959 -21521 -36659 -15964 22041 45763
231 45763 16778 -33326 -39929 -7642 25457 25322 11034 -4837 -25103 -23923 1075 30455 27726
244 27726 -4043 -25159 -26045 -3318 21757 26884 7500 -22470 -25654 -6644 14087 21755 12910
257 12910 -4531 -25487 -22166 7186 28478 20361 -9653 -23612 -15448 1812 18115 17702 3297
270 3297 -15967 -19614 -4308 10943 18828 10466 -6957 -21675 -16354 9833 24059 12775 -9970
283 -9970 -19691 -9020 3635 13656 12956 1454 -12244 -16006 -3738 10928 16219 7350 -9522
296 -9522 -18082 -9389 10466 18520 6579 -8714 -14100 -6112 3030 9907 11351 1114 -11388 -13948
310 -13948 -1736 12312 12818 2672 -10050 -12673 -3724 8242 12224 4077 -5780 -9788 -6638 2381
324B381P468K96j1306j0713K061J1801R285l476q473o928k30O015O854L656m409
339D282r092m493L775R664N471l617r541o103M704Q198M138l007n447l600j037
354e705L813O902K704m828q441k137N225P393K255m907o047k597L611N299K602
369E142j430m895l686jM625N581M60n596n584R04M478L626M24k777l892j560J411
386b770M616K383j178m637l276J546M691L302j864l921k841J107L560J886K03
401B807k134k820j189J455L958J458j878l516j412J914K526J785j391k657j230
416b324N29J740K104K96j946k584m16K225K960k90k157j840j42J630J647k01o49
433E82j071p43M29J203J128j02j391j308O7J494J213o06j318n99L62J075M22m11
$$ plain form
324 2381 9849 10145 -1161 -11874 -9813 1988 11273 7797 -676 -7604 -7834 -1819 5035 8691 4282
339 4282 -4810 -9303 -5528 4136 9607 5990 -3551 -9654 -4950 3248 7386 4379 -1068 -4668 -5705
354 -5705 -1892 5010 7714 2886 -5555 -7692 -2467 4926 7181 2274 -3773 -6370 -2759 2540 5142
369 5142 3712 -1183 -4869 -4870 -245 5336 5796 200 -5384 -4480 -2 3624 4048 1271 -2621 -4181 -2770
386 -2770 1846 4229 3051 -1586 -4862 -3316 1375 4677 2813 -1108 -3949 -2842 718 2604 2807
401 2807 673 -2147 -3336 -1881 2077 3535 1657 -1859 -3271 -1357 1169 2954 1563 -1094 -2324
416 -2324 -1795 -55 2049 2345 399 -2185 -2601 -376 2584 2294 137 -1703 -1845 -215 1432 1231 582
433 582 -489 -1232 -803 400 1528 1426 35 -1273 -1206 288 1501 895 -423 -1022 -660 415 837 426
451D26m78l79q4M67P92k72p02n28R2Q68O80n60m90n36J42P20N60J89j293r36L08
472a014J996M92p92j446m02O26Q26Q16l11j039j100j4J273J252P7p59j649q61
490b029J343K314J66j389j881m61J199J569R12j79j661k105l47K865K596l11l312
507g11k551J376K590J802q52j764p78o55l6K017J733L71l147k580Q54K834K631
524C134%l133l798M05L879L328p26l913k335J068J811J806P31p02k338k137P45
541b175K833K338o51k931k639J41K708L085J246l146m119j031L562L911N17k949
557G00l145o72J415L136K023r99l151k897N43L649L034j181k673k418j04J384
573a356L233K165j896m556j816K532L973J698j729l462k888O39M324L721j432
$$ plain form
451 426 -52 -431 -515 -48 744 472 -230 -758 -666 202 882 322 -168 -704 -562 158 718 907 -386 -1322 -1014
472 -1014 982 1474 682 -764 -1166 -540 286 1102 791 -248 -1348 -1362 -89 1163 1240 481 -1168 -2029
490 -2029 -686 1628 1794 405 -1476 -1937 -738 831 1743 1564 -97 -2202 -2549 316 2912 2601 -711
507 -711 -3262 -1886 704 2506 1654 -110 -888 -1543 -1579 438 2171 2542 -605 -3185 -2331 503 3134
524 3134 3134 1 -3797 -3392 487 3815 3089 -824 -3159 -2091 -280 1526 2257 1555 -783 -2920 -2175
541 -2175 658 2996 2345 -586 -3225 -3084 -376 2709 3955 809 -3310 -4341 -779 3132 3649 700
557 700 -2445 -3117 -1702 1434 3457 2458 -693 -3590 -3047 602 3636 2455 -218 -2636 -2740 -1356
573 -1356 1877 4042 2146 -2410 -4226 -1694 2279 3977 2248 -1214 -4102 -3463 861 4582 3150
588C150m445k765J571L503J613n36j104k110j655J76L542L461j279m371l634J377
604c506M946L330j441m278l100N86L911K829K91l368l243l87K534K673J757j549
620A985k882k942J005L792L354j161m366k268O49K634L201O84k767l952j354L481
636i07M071Q44k757l304j322J497K973K415r11l718k697R67L321K640j95k299
652F18l095j051K035L286J909j725l923k305J748M525K356k001m362j717J633
667b069L007J691j37k358k984J24K137K750P85j533k704j676Q21L741J999j216
683B378l851k151J658K923J830m48k440k425k29K655K564J13k218k207p72J406
699a214K443J831j097l008j934J172K543J807n53k245k115J52K047K239L34j943
$$ plain form
588 3150 -1295 -4060 -2489 1014 2627 2091 987 -1123 -2778 -2602 940 4401 3122 -1249 -4883 -3506
604 -3506 1440 4770 3329 -949 -4049 -3463 448 3277 3568 200 -3043 -3430 -896 1777 3534 1985
620 1985 -897 -3839 -2834 958 4312 3151 -1215 -3483 -2834 -200 3001 3685 918 -3034 -4388 -907
636 -907 3164 4008 1251 -2053 -3375 -1878 1095 3510 2599 -1119 -3816 -2849 472 3112 2917 618
652 618 -2477 -3528 -1493 1793 3702 1977 -1946 -4251 -2503 2022 4378 2377 -1985 -3702 -2069
667 -2069 938 2629 2492 134 -2850 -2726 -589 2161 2946 1413 -1291 -2967 -2146 1595 3594 2378
683 2378 -1473 -3624 -1966 957 2787 2339 -101 -2526 -2755 -100 2464 2577 359 -1848 -2620 -1214
699 -1214 1229 3060 1963 -1045 -2979 -1807 736 2543 1990 -255 -2370 -2218 -171 2068 2402 459
715D59k082j199J805K641J197j753k706r52J088K321J640j047j695j841P8K085
731C9K061J05j756k005q24J763K011J057j458k410o77J122K191O82q42j681j159
748a781K79J889J287o2j614j539q9J211J623O16r57j989q92J419J605Q54r91j677
766h08j080P00J873R75m51j505j073q8J533J136L28j304j657n0R75J485K20n37
784F72j314o69L05J435Q71j48j493r37R9J317J123k73j326n84k29P60J439J76
802A224r31p81o06L30J530L94n78j226m39K73J126M82K54j231o56j19Q22J049
820I17M3p16q88m18Q89R62M4l46j215j85M46J031K97l52r07o46M96O57O05L3o54
841I3o80m43J169O86k49l85q15l79R69M18M04n00m40m52J1Q89M16l2r87o3j66
$$ plain form
715 459 -1623 -2822 -1017 1624 2821 1068 -1638 -2590 -1502 819 2459 1412 -283 -2124 -2046 39
731 39 2100 2205 449 -1556 -2380 -617 1394 2451 993 -1417 -2094 -972 1219 1901 1059 -622 -1781
748 -1781 -1502 387 1674 1612 -2 -1541 -1630 -419 1204 1820 863 -1126 -2018 -599 1006 1860 869 -808
766 -808 -1888 -1188 685 1660 1209 -296 -1369 -1457 76 1212 1540 236 -1421 -1471 -496 989 1209 672
784 672 -642 -1311 -1006 429 1300 1152 -341 -1278 -1179 138 1261 988 -338 -922 -1151 -391 1048 1224
802 1224 293 -488 -1094 -764 766 1160 582 -644 -1083 -810 316 798 1052 -179 -835 -954 -132 917
820 917 960 244 -644 -1062 -173 789 833 487 -728 -913 -467 564 861 509 -398 -1044 -548 109 714 747 93
841 93 -587 -1030 139 825 576 191 -624 -1003 -34 384 788 288 -152 -604 -593 296 712 680 -307 -370 -536
862e36R01L59k18o45m50J86K53P21P0q37m02j17O70M23K42l34n79l07L6J036K74
883G46l91m88n20M82M04J68J30k97n21k02N66L43R1k68m48o56N12M49M37j22o80
904b65n46M35Q24L77o53o63o6K58L20N20k02m94J2k52M01J81L02o22l76L0L93
925h6O35j58k5p92j45M34M53K06k70l01m81L5O01L01j92k39l89q0N92N16m19j38
947E8n83N6K10L49L39M2o74l34J77N43L96k02n96k34l07R74M35l33n78k31J4N53
969G4O43l92j00o34R9M40J20J00P8n46l60m4P17M41j32m15o32k18R27M36j30n21
991d9o13K28M17M10q1j85m94O9q3O59J06j47k12m88M7K52Q12l10k02m74r5M89
1013E6M80j34k92n87M4M05M10J54k16k83l34p5K31N69r7k82o13K26L24M6M63m73
$$ plain form
862 -536 365 724 506 -139 -589 -403 -150 571 641 -196 -598 -715 -45 378 620 286 -293 -600 -564 472 746
883 746 355 -133 -653 -171 233 401 531 234 -287 -489 77 420 511 243 -205 -861 -349 100 537 415 -265
904 -265 -811 -376 448 825 172 -491 -557 -299 21 541 339 -155 -143 -395 6 187 489 -133 -509 -479 -86
925 -86 549 391 366 -426 -571 -137 316 522 252 -49 -530 -495 106 407 215 -24 -413 -493 99 615 196 58
947 58 -525 -469 -259 90 429 471 -203 -537 -360 183 579 377 -219 -453 -760 214 649 316 -262 -493 -479 74
969 74 717 325 225 -409 -310 130 250 350 428 -118 -478 -522 195 636 504 89 -543 -761 166 602 472 -49
991 -49 -662 -434 -17 393 312 127 -367 -298 -381 278 384 237 25 -463 -416 -164 648 338 136 -338 -433 56
1013 56 536 402 110 -477 -433 -28 382 536 320 37 -297 -372 -141 428 331 49 -564 -338 -14 32 495 22
1035B2q1l43K25K28L59N7p50l49M97L08K6p4n13l4R7O13Q5j35j12m32M0K46L27
1058C07K75m16m64n3J95M15L51n65l82o0j00N52J29R6l67l30J42M41K42m0j51
1079B17m90j03M99K55J0j70l85j35%O22k10J17l21l5O1L45P7l60J03o78L14J37
1101a30K95K31k95j47k60M07J02RO5l90j73k9O74R7l60k33j61k35N14M09j79k54
1123d3l39o5K24M91k1j88J5l76M25J57k05J99l42j24J50L52K2j85k41l56J90K09
1145e1J64K77m70k29J25j97R26r3n60J00j11k68L51J63J03j82l63K64j55L82J60
1166C36j29n01k7L21K86P5k99l22K46p3K79K19j69k84q6L3N8L94j4l55k54J75
1188i1K9M12k78o7k73K03R9L37k80J91k37j59j76M72j94JR3l98qK99R1J58r3k52
$$ plain form
1035 22 -59 -402 -177 51 410 467 -283 -632 -135 173 199 125 -388 -422 -325 288 373 238 126 -306 -266 -20 307
1058 307 582 166 -298 -351 -156 259 610 45 -337 -397 -497 55 184 280 -87 -417 -275 166 408 368 217
1079 217 -273 -376 123 378 388 218 -167 -302 -302 320 110 227 -94 -129 -68 277 354 -6 97 -581 -267 -130
1101 -130 165 396 101 -46 -306 101 203 212 277 -113 -286 -315 359 456 96 -137 -298 -533 -19 390 211 -43
1123 -43 -382 -447 -223 268 247 59 74 -302 123 280 75 274 -68 -192 -42 310 332 147 -94 -450 -260 -51
1145 -51 113 390 -80 -309 -184 -381 545 452 -108 -8 -119 -387 -36 127 230 48 -315 -51 -206 176 336
1166 336 207 -294 -321 0 286 361 62 -260 -14 -87 192 411 242 -42 -128 -95 -37 357 343 -12 -266 -91
1188 -91 -62 350 72 5 -268 -65 34 371 91 282 45 -114 -290 182 -12 -11 82 -316 -324 -25 66 224 131 -121
1212a21j63K08J55K68J1k39l34K59J74K0j3j36M8k59J7L62k22j02J55j43j07K78
1234A16O5J97n03l54K81M4J96J15m50P4pJ48L83j45j80j15rj62O31l01j74J13
1256c7k54Q0L77k05L1j0L2J13qn7j84J74o4k4N6M04l51J98j25l39J26l0M51l82
1280b8K8m9j76K02K96l55k7R3j77L06j88J66M4K2j0q0n4J22j16Lj84j6J52K89
1304B63l20L66l09j77L16o9J60j83j05m7K71r1l6Qj07K65R6j11j51J66l05k1K35
1327A14j71P5P7k9j44J58j60QJ55j18p1P1q5K8J06j17J91j50J37l5K6K13k72j13
1351a06r9K74j03n2K67m0j88N2q0K35K3m25K31l2J65k34P7K0Q6r9Q3m6J00l9m3
1376B7O0j33L8m8R3R7k02M5k4m4J5J81P2k00K06L9j46o6j05J25n2k76K89M9O7
$$ plain form
1212 -121 -284 -76 79 347 358 119 -215 44 218 238 225 89 137 -122 -105 257 35 -67 88 -55 -162 116
1234 116 181 378 -125 -479 -198 -154 42 157 -293 -219 -226 -78 305 160 -20 -135 -144 -306 325 24 -150 -37
1256 -37 -291 -211 166 -39 -8 -18 14 127 119 62 -122 52 -12 -36 20 424 73 271 146 -193 -67 -97 354 -28
1280 -28 0 -49 -225 -23 273 -82 -109 -16 -193 113 -75 91 135 157 147 67 13 135 19 22 -162 -178 -26 263
1304 263 -57 309 0 -177 139 70 230 47 -58 -105 166 75 39 47 -60 205 301 190 39 205 -100 -121 114
1327 114 -57 18 95 66 -78 80 -80 -72 83 -35 -106 -35 -120 -92 14 -103 88 -62 75 40 66 279 7 -106
1351 -106 -205 69 -34 -86 181 141 -47 5 -75 160 183 -242 -11 -43 122 -112 -35 -15 71 -28 55 9 109 70 27
1376 27 87 -46 -8 -56 37 134 -68 -23 -47 -91 -76 105 177 -23 183 222 76 10 -95 30 -22 -298 -9 40 107
1401A07n6n2j81K55j07k7J53k09L33m5P1k54L4k19M04k28m21M18J67J9M4q2n2
1424G2R6J38j95O4l42j66K68J84n2K46l72K98q8j01n3K3J94k63p3R2j97K96p1
1447bm9L10j87J94n6j56K15l17r5k3K11j25J65k70K20j40J53M36l93p1j46j20
1469b46J45nJ24N3j47j39L39lK0l32R4J26k75J89K91k30J11jj93N1K7o2K70n2
1493A55l69K1K74L9O1k68R9R0N3J3m11J35r9J89j05q9K34j67J49qJ44O7J01l73
1517f5J32l05Q6L41r2P0m5j04r2L60J64j33l57j07K85j49J22k46K92o6l31K45
1539E%p1J91j98LK64r9Jk12L14j49j09Q8K5q6N5j52Q7M8k33K23R7j76j59L01O9
1565A27J60j00p2k25N6k54K96K11k40k31K74q8K92K25j44l11Q6J26k7p8m2J3l46
$$ plain form
1401 107 51 -1 -182 73 -34 -61 92 -117 216 171 242 -12 22 -197 207 -21 -442 -24 143 162 206 124 72
1424 72 168 306 111 175 -167 -333 -65 119 67 313 -59 239 151 50 -3 20 214 -49 -122 -30 -227 69 -2
1447 -2 -51 259 72 266 210 54 269 -48 -143 -166 45 -80 85 -185 35 -105 48 484 91 20 -126 -246
1469 -246 -101 -106 18 71 -76 -215 124 121 141 -191 -97 29 -246 -57 234 4 115 114 -79 -28 -1 -63 207 155
1493 155 -214 -193 81 120 181 -87 12 102 155 168 -243 -108 -207 -18 -123 -212 22 -145 4 -4 140 207 308 -65
1517 -65 67 -238 -152 189 97 167 122 18 -74 286 450 317 -40 -147 138 -11 111 -135 157 91 -240 5
1539 5 5 -66 125 -73 -70 194 95 96 -116 198 49 -60 28 53 -33 22 -130 -43 5 -228 -5 92 -84 -243 58 127
1565 127 287 187 115 -110 -54 -308 -12 199 -41 -272 2 -86 206 431 287 -24 62 188 161 83 41 54 -292
1588b92J85M39k22k71K31m29K51J74M9J30l36nj5J4J59J18j5m26J9L4J37K16J58
1611C03k43l23l5J51J44N8j30J27j34j01M75k93J76l72L9K49l99M75j05k52j02
1632b92J67J72J78Q5p1j86jj87L62o0k69P1K00m56M28K83j26m84m8J41J86J21
1654B14J86k95n36M25l6K66n0j87j21J72k08J25M07j46k59J05q3j37L38k3k62
1675a05K02j32p5K30J14j32m0j57qK35R4M3k70r2m7K44J08o9j8r5K98l50J48n9
1699F7j43J33Rj20Q7K15k34j93M59m64K14P8q0Oo3j70lO03l66J0l94P4J18K31
1723G4k6j12N9j11l55M73J56k50K09k89j10M35kM9j51l35K95J03j58M1j8j80Q0
1746a23J17L29o5k68K39n29L13L0Q8j41P9J8q1M5k7L90l33J15k30o1J52J50l08
$$ plain form
1588 -292 -107 332 110 -161 70 -359 -108 66 115 245 -91 -96 -111 -97 62 180 165 -261 -242 -208 -71 145 303
1611 303 60 -263 -298 -147 -3 55 -75 52 -82 -183 292 -1 175 -197 -158 91 -308 167 62 -190 -292
1632 -292 -125 47 225 310 239 53 52 -135 227 167 -102 -31 169 -287 141 424 298 -186 -234 -93 93 214
1654 214 400 105 -431 -6 -42 224 174 -13 -134 38 -170 -45 362 216 -43 62 -21 -158 180 157 -105
1675 -105 97 -35 -110 120 234 102 62 -95 -103 132 226 269 -1 -93 -140 104 212 143 125 30 328 -22 126 67
1699 67 -76 57 66 -54 33 248 14 -179 280 -184 30 108 28 34 -29 -199 -202 401 35 45 -349 -275 -157 74
1723 74 48 -64 -5 -116 -471 2 158 -92 117 -172 -282 153 151 200 49 -286 9 112 -46 -5 -23 -203 -123
1746 -123 -6 323 258 -10 229 -300 13 43 131 -10 69 87 6 51 24 414 81 196 -34 -95 57 207 -101
1769a01J76j33o2K23J88m8j70j5J22k69j49M35k35J77j63l2q2M14m64L0K2Q7J22
1792G3k06K44j24J40o1k92M33m25M0M9j39M11K0j72N9k47J83j28K11k01JM61l37
1815gj13M1L67p0j97j02j5P1O8Q5q0O1l29K86k85P9K03k27m6J87R9r2j99M54j07
1840A32j34J54j7l38K26j1j09J70k92J99K02j79j78L02j49O8J0P7p1j47J58j58
1862h5J03j2p0R5n3L30m43J70k33L75j97J6j19L12k57K02l04k27M96j20L11r2
1884A98l87L34K20l30j59J88L5k15K33p3J14K0j09k5n5L20k1k75J31k83K20m9
1906C2o9J9j9J16j77l22K31J23k3K10j33p9O8r6j79J50NJ29n3M8l15M06J41j97
1930A6k76M74j69j15r0K25r5L7k83J98L7J76k75l0L87j00j62J39j61j98K70K20
$$ plain form
1769 -101 75 -58 -120 103 291 243 73 58 180 -89 -238 197 -38 139 -24 -56 -138 276 -188 -158 -136 -49 73
1792 73 -133 111 -13 127 66 -226 207 -218 -178 -129 -268 143 163 -9 50 -197 -14 -142 69 -132 -131 330 -7
1815 -7 -120 -79 288 218 21 -81 -96 -25 43 128 48 109 -220 66 -219 -140 63 -164 -210 -23 76 -16 -215 239 132
1840 132 -2 152 135 -203 23 12 -97 73 -219 -20 182 3 -175 127 -22 46 56 133 62 -85 73 -85
1862 -85 18 6 -64 31 -22 308 -135 35 -198 177 -20 -4 -123 189 -68 134 -170 -397 99 -21 290 198
1884 198 -189 145 365 35 -124 64 99 -116 117 44 158 178 69 44 -11 309 288 13 144 -139 81 32
1906 32 -37 -18 -37 79 -98 -420 -189 -66 -89 121 -12 -91 -23 -119 -298 -148 -143 -14 -67 -19 -334 72 213 16
1930 16 -260 214 45 -70 -160 65 -30 7 -276 -78 -41 135 -140 -170 217 117 -45 94 -67 -265 5 225
1952B25r3j55j6J08p0K4j72J36j07O7L1K6J77j79O7r1M2k16J08K8J23n3p6K3J15
1977G2pQ8k22P1O6k3J70k96n9NK20R5l48K49k05K68k8l28J59N0%l13K59J59r2
2002A0k16L0L1K84j00l45K63J84m5k10L22j01l5K6k56m6J02K19k01J5l3K57K29
2025C84l59J15m1K14n35K31K10r9Q7m62J52L08J70l66p9K14lj29O2j69j25M15
2047A95j49j26j08J31O7M6k20K47J06O5k12k04K26k79nK22j48L58l7l97J29L23
2069B30j84p9J09q2n1J64j64qK25R5l81mJ71OJ42jm91M08J61l73J52j21J30k48
2093a94M3k24M18j88mK25J48l54p6L26l07r5M65k04m28L93R5p9j51N7j8K43k62
2116a71K55L8k40J14K75n01L3M24k55l6K24k6q0J1k73J72K79l27k05L77p9k1j41
$$ plain form
1952 225 132 -23 -39 69 -1 23 -149 -13 -120 -53 -22 4 181 2 69 -22 20 -196 -88 -60 63 10 -66 -43 72
1977 72 65 153 -69 2 68 45 215 -81 -140 -135 85 180 -168 81 -124 144 116 -212 -53 -3 -3 -316 -57 102 10
2002 10 -206 -176 -145 139 39 -306 -43 141 96 -114 208 107 72 98 -158 -204 -102 117 -84 -69 -102 155 384
2025 384 25 140 99 313 -222 9 219 120 207 -255 -103 205 375 9 -70 144 141 12 74 -95 -220 195
2047 195 46 -80 -188 -57 10 56 -164 83 189 254 42 -162 64 -215 -220 2 -146 212 175 -222 -93 230
2069 230 46 -33 76 -6 -57 107 -57 -65 160 255 -126 -130 41 47 189 188 -303 105 266 -107 45 -76 54 -194
2093 -194 -151 -375 43 -145 -149 76 224 -130 -206 120 -187 -282 183 -21 -449 -56 39 -40 -191 -134 -152 91 -171
2116 -171 84 122 -118 -4 271 -230 -197 227 -28 -64 160 134 54 65 -208 -36 243 -84 -289 88 9 -12 -153
2139a53L30j91j0M34n26J27J47J72k03q3l00L55Q0k27K1q1J36j25J2J05nK65j46
2162A34j04j19K41m79J18J30Q7J8k80KL82J63k20k56L32J07k80q7O5r4J96j97
2184a41J55j27p5J1J42j52L49j81M3l3L8nL0j98m3J10J53N8k33k63K26o4J43K
2208e5J4r9P3m4K72j26P0l2J90j56r3J33q3l3P3N1j35j92J10j49L68%l61J64j48
2233a88J71k6o1p1J43j7K44l76O5J3J78j52K71N9m25j01K27J8K0NJ83l14J67k58
2257b25L29R3rk11J34m15L35J41j86O9k19q1M09j83P0N3l61N86n63j68M73k5j64
2280a18J66q0M3J19k95p9J8K24L12m97J63M07j67o36L95rp4k5r6Q0J99j30L8j38
2304a80O7K05j32p0O3m7L66l60k1L8K77q6l58K60J00Kk80K42l07K56J88l90J44
$$ plain form
2139 -153 177 -14 -24 410 -116 11 158 330 127 44 -256 99 179 -48 -27 -108 28 -97 -85 20 15 280 134
2162 134 30 -89 152 -327 -209 -79 8 26 -254 -252 130 293 73 -183 149 256 -24 -111 -46 -140 56 -141
2184 -141 14 -113 -188 -177 -35 -187 162 -19 24 -9 29 24 54 -144 -187 -77 76 134 -99 -362 -136 -200 -57 -55
2208 -55 -41 -140 -67 -111 161 35 105 73 263 107 14 147 64 31 104 155 20 -172 -62 -211 157 157 -204 -40 -188
2233 -188 -17 -43 -104 -175 -32 -49 195 -181 -116 -103 75 -77 194 253 -172 -273 -46 -28 -8 -3 180 -134 33 -225
2257 -225 104 197 188 -23 111 -304 31 172 -14 55 -164 -245 164 -19 51 104 -257 329 -234 -402 71 46 -118
2280 -118 48 -32 11 130 -165 -244 -226 -2 310 -187 -24 383 216 -420 -25 -34 -108 -133 -229 -149 50 -80 -42 -180
2304 -180 -113 92 -40 -110 -47 -94 272 -88 -109 -71 206 120 -238 22 122 124 -156 86 -221 35 223 -167 -23
2327b3L10q3N9l85L9J84j28J55k21P9j35J45Pl14K76j09Q5M5K5j5J72l63J55O5
2351B5L4L5j03j9j2O0L0R7l46K81l6J29l13K69j15o1j30K7J97J98m39K89K13o79
2375c69L96k08J22N7j47K35l62J51L64k70J81k79L24j05N6p8k98K16J9Rl71M22
2397F5j52o0K35j9j42j84M71J28m31m0R8K03N7M0l59M0j77J81J14L8N3j77j9N9
2421B2j89J01J33j32q2K3kL38p3q0j3Pn1j45L01l44L12J55k04j53R2m7K3J33r9
2446B6K30k00j19K11j74O2r4J65j84R7p1P6J09n9k21j48N26k20k6l6j59M88j58
2469A21j77M1j0LM9Rj42Q3J2q4N25n89J73K06k19K36k24k77L49j73r0L09p4j11
2493e4pK27j47J50Pj22k38J65Q5n1P4k23JR5J12j47J57o7Jp9J80k31L4O4P3k58
$$ plain form
2327 -23 287 204 263 -122 -83 101 -27 128 -93 -14 -149 -4 3 -311 -35 -144 -59 -14 11 -4 168 -195 -40 25
2351 25 59 94 -9 -28 -40 20 50 147 -199 82 46 175 -138 131 16 -45 -175 -148 49 247 -192 97 310 -369
2375 -369 27 -181 -59 -2 -149 86 -276 -125 239 -31 150 -129 195 90 146 68 -230 -14 5 14 -357 65
2397 65 -87 -147 88 69 -73 -257 214 342 -89 -129 -31 172 229 269 -90 -50 -227 -46 68 106 159 -18 -37 22
2421 22 -167 -66 67 -65 -147 -124 -126 212 139 59 46 53 2 -143 158 -186 126 281 77 -76 16 -31 -8 125 26
2446 26 256 56 -63 148 -26 36 -58 107 -77 20 -51 25 134 75 -146 -294 232 12 -14 -50 -209 279 121
2469 121 -56 -15 -25 -22 27 36 -106 -23 -11 -95 430 -159 14 220 1 237 13 -264 85 -88 -178 131 57 -54
2493 -54 -61 166 19 169 176 54 -184 -19 66 15 89 -134 -133 -38 74 -73 84 17 18 -61 119 -112 -78 -14 59 -199
2519a99J08J22k60L32l14K68k12L27j70J64j82k7J35k68M18l03O4j2N9l44N84
2540B90k24Q6l35j4K07l9J71k59K29j08J23J80m95k1K04J20k76M08j54j3J6Rk24
2563a19Q9r5K16m10M60k93J2J65J96j79J31q5k60KN6J5L02j73J0j00J76k80J06
2586e8J88j57j60K21L7k59J84j44P9M34j02n22L20j60L6JK4J05j24R7q8j86N28
2609B94k71J4l02M15k05L6K24k21j8p0K89l57J27J05J54l83K32Q2j06N1j57k28
2631b95M2L05k84K92k8R4j46M1j18J16k8j27K27L5R1k13l5k2K6k13K55k69L19
2654F5k45J75K14l66J43R6m9R4j62rJ94J60l85R8J15O7m4L5m6Rk49n8J45K13q1
2679A29l42J38M5J28k90J46R0j70K11q3J24l6J87l88rK25l70L27j05N9k7K20k22
$$ plain form
2519 -199 -91 31 -229 103 -211 57 -155 172 2 166 -16 -43 92 -176 242 -61 3 -9 50 -294 290
2540 290 66 152 -183 -197 10 -29 142 -117 112 4 127 307 -188 -209 -5 115 -161 247 93 80 96 105 -119
2563 -119 -30 -125 91 -319 141 -152 -140 25 221 42 173 88 -172 -170 -114 -99 203 30 40 -60 116 -164 -58
2586 -58 130 -27 -187 34 71 -188 -4 -148 -69 365 263 -259 61 -99 -63 -62 -38 67 -57 40 -48 -234 294
2609 294 23 37 -265 150 -55 -19 205 -16 -34 -104 185 -172 -45 60 214 -169 63 145 39 90 -67 -295
2631 -295 -253 52 -232 60 32 126 -20 21 -97 19 -9 -136 91 126 217 4 -31 -53 -27 -240 15 -254 65
2654 65 -180 -5 209 -157 -14 82 33 127 -35 -44 150 310 -75 23 138 205 161 196 150 159 -90 -148 -3 210 129
2679 129 -213 -75 -30 98 -192 -46 44 -126 85 2 126 90 277 -111 -120 105 -265 62 -43 16 -11 209 -13
2702a3K05l48p7K21RJ76j23J24j66Q5mj54J44P6k20k8P7K09j33j85K76k18J95
2725A28J1q9n9j59J88RR5Kk69L6J41n2J91l01K78Lj75PK26j00l10K01p1J99k45
2750a15J27M5r4R4R1j03J64k48K58l56L78Nm53M32k46R6j82J80l8qj60jL94n22
2774b62L45J3rJ70k45J00j39J69k75J20J26k29j30k5J10K09m4k61M43j94J62k91
2796a37J4K39q7J8k72L57j40O2j83q7L16k38K8J58P4k95J05N1K3K9k53J74P6J10
2820A42j48k6J04K2j60R0k58K12L99k62j45j03J45nn5K81m2l51J73p6J16L51l79
2843B5l0J25j63n8J30Qj53J52k53K50Q8k92l2k6K11O5%n8r6M3J32j87J30k22J41
2868g0q1M56l4m18J48J42K7J1n6j37L0j6k14J70K54j75J9j45K55J06l64K26j82
$$ plain form
2702 -13 192 -156 -233 -12 -3 173 50 174 8 93 89 -65 79 155 -65 -93 -16 193 60 -125 151 -67 128
2725 128 139 50 -9 -168 20 29 124 126 -143 -107 34 -18 173 -128 150 153 -22 -15 211 111 -199 2 -69 130 -115
2750 -115 12 57 -37 57 148 45 209 -39 219 -137 241 246 -207 225 -21 75 -107 73 35 27 -133 -134 260 -262
2774 -262 83 96 87 257 12 112 -27 142 -133 -13 113 -116 -246 -271 -161 48 4 -257 186 -8 154 -137
2796 -137 -123 116 29 47 -225 132 -8 54 -129 -216 100 -138 -110 48 122 -173 -68 -17 6 35 -218 -44 32 142
2820 142 -6 -32 72 94 -66 24 -234 -22 377 115 -30 -133 12 7 -48 233 191 -160 13 -63 53 404 25
2843 25 -5 120 -43 -101 29 37 -116 36 -217 33 121 -171 -203 -229 -18 47 47 -11 -107 -64 68 -119 11 -211 -70
2868 -70 -151 305 271 -147 1 143 170 181 125 -12 18 2 -212 -42 212 37 56 -89 166 272 -92 134 -48
2891d8J17j32j2J72j59NK97p5k01J63k54N8O4q4L69Lr6K5m70J94o8p7K16k35J61
2916f7Q5r5J77p6Rp6j1OQ1r3k5P8k3j99P8joM47J08l66k15K69j03O9k50J51M3
2943eK2K02J85k81J57m77J88p1R7N9l77jM99k97J80J66k09P0j6L0j91L50k00k4
2967E6j28k8J25k47L74p7o4r7J83p1j19j92K69N5J07m39L26k08K21r3K92o4j98
2990a7ol9J48K01k41m3J94k41J07j33J58j39o5ML10Qm9nJ2k10r4L43j62o3j40
3015a62O9J25J02l05N8N8j07J91j23J20j82L37l40J2L15k37P6j3pL49l99J07j78
3038a34q4M50l61p1K57j01r3P6M07j64k00o3J15k79M01j71Q3j30LJ19N6j65L5
3061a4J24k94p2L65k45m4K79m9J21O1l42J66J6k98K94j8r2q4J11m0J57J10l32
$$ plain form
2891 -48 69 -63 -75 97 -62 -57 240 165 -36 127 -127 -69 -5 -89 280 283 187 212 -258 -64 -132 -209 7 -228 -67
2916 -67 18 -77 100 24 33 -43 -54 -48 33 -60 -85 -7 -30 -229 -151 -152 -158 289 397 31 -184 85 -18 51 -199 -48 -5
2943 -5 17 219 404 123 280 -197 -9 -80 17 76 -301 -302 197 -100 80 246 37 107 91 121 -70 280 80 56
2967 56 -72 -100 25 -222 152 75 11 -86 97 26 -93 -285 -16 39 146 -293 33 -175 46 -47 245 181 -17
2990 -17 -23 -62 86 287 46 3 197 -44 63 -70 88 -51 -116 -112 198 206 157 152 164 -46 -140 203 41 -22 -162
3015 -162 -93 32 134 -171 -113 -55 -162 29 -94 26 -156 181 -159 -147 168 -69 7 -6 -13 336 -63 44 -134
3038 -134 -218 232 -129 -200 57 -44 -137 -61 346 182 -18 -81 34 -245 156 -15 68 -62 -59 60 116 -49 -14
3061 -14 110 -184 -256 109 -136 -180 99 50 171 232 -110 56 72 -226 68 50 -42 -126 -15 -55 102 212 -120
3084a20L4J2K39p2j59j34L81j19j83J05j37J25j32m0J88P8j11N2N9o3k3K3k0j12
3108a29P7j00K28k37J85J90j16k06L66k66q7L5M5L7k29K19L4J18k88L6J14k5M0
3131D1J96l9k46j75K91j91J86j99j3L6J90J01r7m3j7k05j96K08L5J58p1M0m84
3154d94O31k15J34k17R9Q1k33K88r8q8N0o0r8K40O2l7K2J37n4k88R3Q7O2k00R9
3179Cq3m9J15J26r1n3J61l30K94J12j71qj30K97n18K69L38l49N8j77K11N1P3k0
3203A29l79L36J0j15j3N1O2k3j92K31q1k02K45j6J94m10J15j21K97j3p1j50jl9
3227a56K63k15q3L16m8j31M5K5Kr5R3m14L85j09K11j07J40N1p8N4j80N1j20J75
3251G5j84J44J98j14m8j00K69j01j91Qk94L24q7J5J2K96l04q4L98l82M2jJ36J36
$$ plain form
3084 -120 -86 -74 165 93 -66 -200 181 62 -121 -16 -153 -28 -160 -200 -12 66 -45 7 66 3 -20 3 -17 -129
3108 -129 -52 -152 76 -161 24 214 98 -108 258 -8 -95 -60 -15 22 -207 12 46 164 -124 -88 26 1 41
3131 41 237 198 -48 -223 68 -123 63 -136 -149 -113 77 178 81 38 21 -184 -380 -172 -137 21 -50 -10 -494
3154 -494 137 -78 56 -161 -62 19 -214 74 -24 -112 -62 -122 -220 20 82 45 67 204 150 -138 -45 42 104 -96 3
3179 3 -80 -129 -14 112 21 -32 129 -201 93 205 34 26 -104 193 -325 -56 282 -67 -9 -186 25 76 149 129
3203 129 -250 86 96 -19 -32 19 81 58 -134 97 16 -186 59 43 237 -173 -58 -179 118 105 34 -116 -117 -156
3227 -156 107 -108 -191 125 77 -54 -9 16 18 -77 16 -398 -13 -122 89 -18 122 173 95 149 -31 20 -100 75
3251 75 -109 35 233 119 71 -29 240 139 -52 -44 -338 -14 -101 -86 -74 222 -82 -166 232 -150 -108 -109 27 163
3275A63J81l95r5K16k00p1L50N6k32J25j38J07k00K09k01L1J00kJ31k03J86k69
3297a51J02J79m5O5p7K04k1l34N3J32k87J07r0J30j38K74o4j14K8J06k23J25J01
3320F2J7k25J84M2k15K40k42O3O1N5l6K26j62r8N6j5J65j36k04Q2N9K04q0m14
3344c11L52Kl6n2J22k27k3J99k02J64N9j49q3L5K89j48n9P8l13P8N8J58l9m7L26
3369B31k65K06q4K2kj04K42j0j15j9M5r9q4L21m19J02j10K2n4K12N3O5l85J59
3393g0j3m3K85o2j99J45m5J44pj43k33K46p1L39l33J12J79k93J7k32M02M7j36
3416C6k86O6K32K40k41j70K65k37M72l31k14R8K69p6l99K77J01j42j07J4L29k68
3438g2R4J92j06J6J4J52j19k15J39k57p0K58k70K79L9k09K91k61K16m27R1J12
$$ plain form
3275 163 344 -51 -146 70 -130 -201 149 205 -27 98 -40 67 -133 76 -125 -94 6 4 135 -68 118 -151
3297 -151 -49 130 85 150 73 277 256 -78 -25 107 -180 -73 -163 -33 -171 103 39 -75 -47 59 -164 -39 62
3320 62 79 -146 38 80 -135 105 -137 -74 -13 42 6 232 70 -28 28 13 178 42 -162 -80 -21 183 103 -311
3344 -311 41 43 7 -45 77 -150 -173 26 -176 -12 47 -102 -185 -150 139 -9 -68 10 -303 -225 -167 -9 -48 -95 231
3369 231 -34 172 88 110 108 4 246 236 121 102 147 48 -36 285 -134 -32 -142 -120 -174 38 91 156 -229 -70
3393 -70 -83 -126 159 97 -102 43 -2 142 135 -8 -241 5 -66 273 -60 52 231 -62 -45 -277 125 172 36
3416 36 -250 -184 48 288 47 -123 142 -95 377 46 -168 -70 199 123 -276 1 102 -40 -147 -133 196 -72
3438 -72 22 214 108 124 138 290 171 -44 95 -162 -232 26 -244 35 74 -135 156 -105 111 -316 -225 -113
3460a13J12j36K28n8j17K55J6k76n7K7J01rj20l7J81j40J45J07l68M16j05n7J09
3483A04k17K16nn2J59k81R1J77k83O6O8j92L26k92K1L3N4m7J44Rj70j44K5K06
3507A6J70j8n3l2l5p3k02M50k03j63K32O3m12Q1O6R7R6j02Q6J08q0j76n6J15l6
3532f1J02K09k13P8l08J21k26L94L0k3M4j1k75J3R6P9j24K16j80j46K17j09N9
3555a8J50n4k7j57J90j30N5M1l78K04R2k40J58L11j07j29m6R4J3O8k52J34L6k
3579FJ03O2j47r6K28K7j80J1N1j00J23M9j73k0J82j86m1l1p1J82Q1k3J53q0j78
3604f8K30j35n9K76l40N2J78L5L5j35kj2rl9o9L9k9K65j44k84J43J13q0J74m4
3629I1k02K9J4k2Q8N4q5K15j04o3M0l93N42m5m42J42j18K27j65M73l23K8J40j
$$ plain form
3460 -113 -1 -137 91 33 -84 171 187 -89 -146 -119 -18 -27 -147 -184 -3 -143 2 109 -259 157 52 -5 104
3483 104 -113 103 98 46 205 -76 15 192 -91 -25 43 -149 177 -115 -94 -61 -7 -54 90 99 -71 -215 -190 16
3507 16 186 168 115 83 48 -25 -227 223 20 -143 89 152 -260 -179 -113 -16 80 -22 64 172 92 -84 -140 -25 -61
3532 -61 41 250 37 115 -193 -72 -298 96 126 103 147 136 -139 -126 -30 49 -75 141 -39 -185 32 -77 -18
3555 -18 132 78 51 -106 84 -46 9 50 -328 -124 -32 -272 -114 197 90 -39 -85 9 22 90 -162 -28 8 6
3579 6 109 171 24 -72 156 183 3 14 65 -35 88 137 -36 -56 126 -60 -101 -132 -203 -21 60 37 190 110 -68
3604 -68 162 27 -32 244 -96 -44 134 169 204 69 67 55 46 7 -62 -23 -52 213 69 -215 -72 41 -39 135 91
3629 91 -111 -82 -68 -90 -2 52 -33 182 78 15 55 -338 204 159 -283 -141 -259 -32 -197 276 -47 -19 121 120
3653A20k19j6L5m6J27Kj63K93k60Q3L08l51J40J8J36m55L21j15R1j00J14k52P5
3676a14J34k64M19l17L37r6j53Q5J67j82k02J61K04k57K75K9j50j15J68j82j56
3697b09K09j71mM02j65j25k9J04j79J29N8J78k52K85m44K41q9K30k84m3ON0J23
3720B1O8j4r7K09k64J40n5j6J32O1j40k42J2L23k16j18J44Nk0P6j52L15j9j78
3744b5J06k7r0N8J22K73l42j50L1j22L18j75k54M59m09K88J4J88l39j11J17M39
3766C69m35R6k2k00L40j53J22k09l2lJ42j56j37K90K5l31L85R0k63J04j33j0J54
3789C3P4r8k80L17l08L78O4k04K78m22K36j66J47k20M77l79k6K5n3J23R8j18j41
3812a65K65j47J52k39J03m4J80q5K38l07j27m6J04J40K13m19M46k57l02M18j97
$$ plain form
3653 120 -99 -115 -80 -126 1 3 -160 133 -127 -44 264 -87 53 71 207 -248 73 -42 49 -51 63 -189 -114
3676 -114 20 -244 175 -142 195 99 -54 31 198 16 -186 -25 179 -78 197 226 76 -39 129 -53 -209
3697 -209 0 -171 -175 227 62 -63 -92 12 -167 -38 20 198 -54 231 -213 28 -61 169 -115 -158 -152 -102 21
3720 21 89 75 -22 187 -77 63 8 -8 124 185 45 -197 -185 138 -78 -196 -52 -47 -67 9 -143 172 153 -25
3744 -25 81 54 -36 22 144 417 75 -75 -44 -166 152 -23 -277 182 -227 61 75 263 -76 -187 -70 369
3766 369 -66 30 8 -192 148 -5 117 -92 -124 -127 15 -141 -278 12 37 -294 91 181 -82 22 -111 -121 33
3789 33 107 9 -271 46 -262 116 180 -24 254 -168 68 -98 49 -171 306 -73 -99 -74 -127 -4 94 -24 -165
3812 -165 100 -47 105 -134 -31 -75 105 20 258 -49 -176 -222 -118 22 235 -184 262 5 -297 121 -76
3833g6K10l81J63L9R3l7o5L09l15MK86l55L91l92J82j45l3J28n2k1J21l75L47
3856B6K02r6j68K0j4Pn3j0Q3k98L54K73l50m0J76j36m3P5pj42J00j1O5O4k13J65
3882B9k5o0j02J57qJ92j26p4J97m64N07j73k74L98j28j64KO0p3L37k20n8J35j02
3906c7J36K3j7k52k8J26q6M21l30J84l03K91j09j72n8K15n5K23m5k80O9L15j17
3929A14k62J64n9J45J09k38J02j56j08J64J10j18J45p5n8j1j15k2o1L11k9j07
3951e5P7J35j53P9l3M7j48M2J81qQ4l20j8K13j2K1m82M43N2k19j18J80R7j34J82
3976A33k70P0J71L8k88L68l87K72k43L29k79J46r0j81J2J64k96K20N8r7K88k89
$$ plain form
3833 -76 134 -247 -84 -45 48 11 -54 255 -60 -56 230 -125 266 -126 56 -89 -122 6 -46 -67 54 -321 26
3856 26 228 132 -36 -16 -30 -23 -76 -86 -3 -301 53 326 -24 -64 112 -24 -67 8 1 -141 -41 -52 13 77 -136 29
3882 29 4 -56 -158 -1 -9 183 57 -17 180 -284 223 50 -224 174 46 -118 -116 -56 -129 208 -12 -70 65 -37
3906 -37 99 122 105 -147 -175 -49 -135 286 -44 140 -163 128 19 -153 -211 4 -51 172 127 -153 -84 231 114
3929 114 -148 16 -43 102 211 -27 75 -81 -189 -25 85 -33 112 37 -21 -32 -147 -169 -230 81 52 -55
3951 -55 22 157 4 83 50 97 -51 -9 172 164 248 -72 -90 123 111 132 -350 93 145 -74 -192 -12 85 -49 133
3976 133 -137 -67 104 142 -146 222 -165 107 -136 193 -86 60 -30 -211 -199 -35 -331 -111 -53 -150 138 -151
$$ [...]
8191A23
##END NTUPLES=NMR FID
##END=
