##TITLE=1H_Pr NCO-Bn
 200.13MHz,DMSO,
 8 sc
 
 4.4.2025
##JCAMPDX= 6.0         $$ Bruker NMR JCAMP-DX V2.0
##DATA TYPE= NMR FID
##DATA CLASS= NTUPLES
##ORIGIN= UXNMR, Bruker Analytische Messtechnik GmbH
##OWNER= pz
$$ XWIN-NMR		Version 3.5
$$ Fri Apr  4 15:37:10 2025 Russian Standard Time (UT+4h)  she@DPX200
##.OBSERVE FREQUENCY= 200.1313
##.OBSERVE NUCLEUS= ^1H
##.DELAY= (6, 6)
##.ACQUISITION MODE= SIMULTANEOUS
##.ACQUISITION SCHEME= undefined
##.AVERAGES= 8
##.DIGITISER RES= 18
##SPECTROMETER/DATA SYSTEM= spect
##.PULSE SEQUENCE= zg30
##.SOLVENT NAME= CDCl3
##.SHIFT REFERENCE= (INTERNAL, CDCl3, 0, 14.3821)
##AUDIT TRAIL= $$ (NUMBER, WHEN, WHO, WHERE, WHAT)
$$ ##TITLE= Audit trail, XWIN-NMR		Version 3.5
$$ ##JCAMPDX= 5.01
$$ ##ORIGIN= Bruker BioSpin GmbH
$$ ##OWNER= she
$$ F:/spectra/data/she/nmr/H-C/1/audita.txt
$$ ##AUDIT TRAIL=  $$ (NUMBER, WHEN, WHO, WHERE, WHAT)
(   1,<2025-04-04 15:35:40.42 +0400>,<she>,<DPX200>,
      <created by zg, POWCHK disabled, PULCHK disabled
       configuration hash MD5:
       00 E9 B6 7A A2 85 ED C7 34 08 36 98 17 FE 4E 26
       data hash MD5: 16K
       72 AF C9 E0 94 B8 A6 99 FB E3 CB 70 DB FE 4F 21>)
$$ ##END=
$$ 
$$ hash MD5
$$ A8 7C 21 05 D2 58 1E BF 65 BC 74 21 05 85 8E 41
##$RELAX= 
##$RELAX= 
##$RELAX= 
##$RELAX= 
##$RELAX= 
##$RELAX= 
$$ Bruker specific parameters
$$ --------------------------
##$DU= <F:/spectra>
##$EXPNO= 1
##$NAME= <H-C>
##$PROCNO= 1
##$TYPE= <nmr>
##$USER= <she>
##$AMP= (0..31)
100 100 100 100 100 100 100 100 100 100 100 100 100 100 100 100 100 100 
100 100 100 100 100 100 100 100 100 100 100 100 100 100 
##$AQSEQ= 0
##$AQ_mod= 1
##$AUNM= <au_zg>
##$AUTOPOS= <>
##$BF1= 200.13
##$BF2= 200.13
##$BF3= 200.13
##$BF4= 200.13
##$BF5= 200.13
##$BF6= 200.13
##$BF7= 200.13
##$BF8= 200.13
##$BYTORDA= 1
##$CFDGTYP= 0
##$CFRGTYP= 5
##$CHEMSTR= <none>
##$CNST= (0..31)
1 1 145 1 1 1 1 1 1 1 1 1 1 1 1 1 1 1 1 1 1 1 1 1 1 1 1 1 1 1 1 1 
##$CPDPRG= <>
##$CPDPRG1= <>
##$CPDPRG2= <>
##$CPDPRG3= <>
##$CPDPRG4= <mlev>
##$CPDPRG5= <mlev>
##$CPDPRG6= <mlev>
##$CPDPRG7= <mlev>
##$CPDPRG8= <mlev>
##$CPDPRGB= <>
##$CPDPRGT= <>
##$D= (0..31)
0 0.7 0 0 0 0 0 0 0 0 0 0.03 0 0 0 0 0 0 0 0 0 0 0 0 0 0 0 0 0 0 0 0 
##$DATE= 1743766539
##$DBL= (0..7)
120 120 120 120 120 120 120 120 
##$DBP= (0..7)
150 150 150 150 150 150 150 150 
##$DBP07= 0
##$DBPNAM0= <>
##$DBPNAM1= <>
##$DBPNAM2= <>
##$DBPNAM3= <>
##$DBPNAM4= <>
##$DBPNAM5= <>
##$DBPNAM6= <>
##$DBPNAM7= <>
##$DBPOAL= (0..7)
0.5 0.5 0.5 0.5 0.5 0.5 0.5 0.5 
##$DBPOFFS= (0..7)
0 0 0 0 0 0 0 0 
##$DE= 6
##$DECBNUC= <off>
##$DECIM= 32
##$DECNUC= <off>
##$DECSTAT= 4
##$DIGMOD= 1
##$DIGTYP= 9
##$DL= (0..7)
0 120 120 120 120 120 120 120 
##$DP= (0..7)
150 150 150 150 150 150 150 150 
##$DP07= 0
##$DPNAME0= <>
##$DPNAME1= <>
##$DPNAME2= <>
##$DPNAME3= <>
##$DPNAME4= <>
##$DPNAME5= <>
##$DPNAME6= <>
##$DPNAME7= <>
##$DPOAL= (0..7)
0.5 0.5 0.5 0.5 0.5 0.5 0.5 0.5 
##$DPOFFS= (0..7)
0 0 0 0 0 0 0 0 
##$DQDMODE= 0
##$DR= 18
##$DS= 0
##$DSLIST= <SSSSSSSSSSSSSSS>
$$ [...]
##$SUBNAM0= <"">
##$SUBNAM1= <"">
##$SUBNAM2= <"">
##$SUBNAM3= <"">
##$SUBNAM4= <"">
##$SUBNAM5= <"">
##$SUBNAM6= <"">
##$SUBNAM7= <"">
##$SUBNAM8= <"">
##$SUBNAM9= <"">
##$SW= 18.0517328524113
##$SWIBOX= (0..15)
0 0 2 0 0 0 0 0 0 0 0 0 0 0 0 0 
##$SW_h= 3612.71676300578
##$TD= 16384
##$TD0= 1
##$TE= 0
##$TE2= 300
##$TE3= 300
##$TEG= 300
##$TL= (0..7)
0 120 120 120 120 120 120 120 
##$TP= (0..7)
150 150 150 150 150 150 150 150 
##$TP07= 0
##$TPNAME0= <>
##$TPNAME1= <>
##$TPNAME2= <>
##$TPNAME3= <>
##$TPNAME4= <>
##$TPNAME5= <>
##$TPNAME6= <>
##$TPNAME7= <>
##$TPOAL= (0..7)
0.5 0.5 0.5 0.5 0.5 0.5 0.5 0.5 
##$TPOFFS= (0..7)
0 0 0 0 0 0 0 0 
##$TUNHIN= 0
##$TUNHOUT= 0
##$TUNXOUT= 0
##$USERA1= <user>
##$USERA2= <user>
##$USERA3= <user>
##$USERA4= <user>
##$USERA5= <user>
##$V9= 5
##$VALIST= <valist>
##$VCLIST= <CCCCCCCCCCCCCCC>
##$VD= 0
##$VDLIST= <DDDDDDDDDDDDDDD>
##$VPLIST= <PPPPPPPPPPPPPPP>
##$VTLIST= <TTTTTTTTTTTTTTT>
##$WBST= 1024
##$WBSW= 4
##$XGAIN= (0..3)
0 0 0 0 
##$XL= 0
##$YL= 0
##$YMAX_a= 84888
##$YMIN_a= -138854
##$ZGOPTNS= <>
##$ZL1= 120
##$ZL2= 120
##$ZL3= 120
##$ZL4= 120
##$ABSF1= 10
##$ABSF2= 0
##$ABSG= 5
##$ABSL= 3
##$ALPHA= 0
##$AQORDER= 0
##$ASSFAC= 0
##$ASSFACI= 0
##$ASSFACX= 0
##$ASSWID= 0
##$AUNMP= <proc_1d>
##$AZFE= 0.1
##$AZFW= 0.1
##$BCFW= 1
##$BC_mod= 2
##$BYTORDP= 1
##$COROFFS= 0
##$CY= -3
##$DATMOD= 1
##$DC= 2
##$DFILT= <>
##$DTYPP= 0
##$F1P= 0
##$F2P= 0
##$FCOR= 0.5
##$FTSIZE= 0
##$FT_mod= 4
##$GAMMA= 1
##$GB= 0.15
##$INTBC= 1
##$INTSCL= 1
##$ISEN= 128
##$LB= 0.25
##$LEV0= 0
##$LPBIN= 0
##$MAXI= 10000
##$MC2= 0
##$MEAN= 0
##$ME_mod= 0
##$MI= 1.114404
##$NCOEF= 0
##$NC_proc= 0
##$NLEV= 6
##$NOISF1= 3.799351
##$NOISF2= 2.8
##$NSP= 1
##$NTH_PI= 0
##$NZP= 0
##$OFFSET= 14.38212
##$PC= 1
##$PHC0= -833.0677
##$PHC1= 13.19221
##$PH_mod= 1
##$PKNL= yes
##$PPARMOD= 0
##$PSCAL= 0
##$PSIGN= 0
##$REVERSE= no
##$SF= 200.129724274929
##$SI= 16384
##$SIGF1= 3
##$SIGF2= 2
##$SINO= 400
##$SIOLD= 16384
##$SREGLST= <1H.CDCl3>
##$SSB= 0
##$STSI= 0
##$STSR= 0
##$SW_p= 3205.1282051282
##$SYMM= 0
##$S_DEV= 0
##$TDeff= 0
##$TDoff= 0
##$TI= <>
##$TILT= no
##$TM1= 0
##$TM2= 0
##$TOPLEV= 0
##$USERP1= <user>
##$USERP2= <user>
##$USERP3= <user>
##$USERP4= <user>
##$USERP5= <user>
##$WDW= 1
##$XDIM= 8192
##$YMAX_p= 0
##$YMIN_p= 0
$$ End of Bruker specific parameters
$$ ---------------------------------
##NTUPLES= NMR FID
##VAR_NAME=  TIME,          FID/REAL,        FID/IMAG
##SYMBOL=    X,             R,               I
##VAR_TYPE=  INDEPENDENT,   DEPENDENT,       DEPENDENT
##VAR_FORM=  AFFN,          ASDF,            ASDF
##VAR_DIM=   8192,          8192,            8192
##UNITS=     SECONDS,       ARBITRARY UNITS, ARBITRARY UNITS
##FACTOR=    0.0002768,     1,               1
##FIRST=     0,             0,               0
##LAST=      2.2672688,     0,               0
##MIN=       0,             -138854,         0
##MAX=       2.2672688,     84888,           0
$$ Real data points
##PAGE= N=1
##DATA TABLE= (X++(R..R)), XYDATA
0 0 0 0 0 0 0 0 0 0 0 0 0 0 0 0 0 0 0 0 0 0 4 -6 8 -8 8 -8 8 -9 15 -16 16 -20 23 -24 29 -32 36 -40 45 -50 54 -61
42 -61 68 -75 84 -92 101 -112 122 -136 149 -164 181 -199 222 -245 272 -304 339 -385 438 -503 585
63 585 -698 851 -1083 1465 -2213 4231 -22129 -57557 -6120 49597 73313 73276 75456 63139 36754
78 36754 11798 5232 8813 13776 -673 -38252 -71980 -72865 -48204 -16610 2743 7603 10874 17522
92 17522 22836 35008 61259 84888 76856 43891 19336 9635 2592 4581 11767 3746 -20688 -40282
106 -40282 -41184 -26472 -2554 20492 25295 13255 7180 13730 21729 32209 46694 49223 29027
119 29027 -2018 -15939 -3535 13818 16992 7361 -3569 -12231 -21155 -19564 934 20966 20307
132 20307 4854 -11071 -18615 -9836 10525 24782 20496 7371 -430 -5472 -7672 5535 27263
145 27263 32686 13614 -11027 -19862 -12030 -2337 2523 837 -7769 -19987 -29878 -27763 -9496 12748
159 12748 23323 17174 1939 -4660 6375 22042 29084 25437 15528 533 -18926 -28647 -18224
172 -18224 -3216 -2506 -14619 -27327 -30725 -22317 -5252 14418 26221 24634 15181 5384 4282 14794
186 14794 25792 24502 9381 -10649 -23600 -26625 -23310 -13425 -3436 -4170 -15361 -24140 -16235 5510
200 5510 23165 28130 24750 16624 6805 670 2630 11861 16549 6859 -12784 -29298 -30037 -16405
214 -16405 -3444 1250 497 -2668 -6976 -9028 -1105 17768 30870 25147 7537 -6372 -7974 -1864
228 -1864 3056 5267 3008 -6008 -17817 -23620 -16271 963 13101 12019 1094 -7646 -6261 1607
242 1607 9222 14737 15315 6868 -7698 -16597 -11796 1687 9512 5332 -3633 -10623 -11840 -7222 1652
257 1652 11670 14487 5842 -6789 -13053 -7657 4384 10888 7858 -346 -7987 -11810 -9722 -1255
271 -1255 10416 14619 5853 -6604 -11163 -4482 6262 11272 9543 3316 -5945 -13460 -13412 -4864 6672
286 6672 10485 2701 -7908 -11991 -6293 4451 11302 12923 9692 1954 -6131 -7730 -422 9749
300 9749 11156 2090 -9175 -14561 -12017 -4917 2370 6467 5223 -1649 -8326 -7312 1933 13070 16208
315 16208 9524 322 -5412 -5199 -590 4582 7860 4603 -5500 -14686 -15177 -6540 3858 7254 3457
330 3457 -1874 -5892 -5177 510 8531 14309 12425 2558 -6506 -7695 -1475 5628 7032 2116 -4392
345 -4392 -10833 -12994 -8775 -148 7490 6926 -722 -7170 -6236 423 7992 11159 9196 3721 -3999 -7786
361 -7786 -4918 2268 7575 5559 -3434 -10590 -11219 -5921 927 5546 6194 2427 -4034 -7369 -3564 5022
377 5022 10703 8868 1063 -5560 -7357 -4711 956 5506 6624 1826 -5799 -9375 -5824 2133 8189
392 8189 7360 1163 -4082 -6591 -5104 103 5454 7087 2003 -5338 -8880 -5295 2280 8216 8117 3972
408 3972 -711 -4200 -3674 1145 6591 7473 2077 -5857 -10121 -8292 -2262 2954 3577 660 -2966 -6027
424 -6027 -4516 2321 9775 12114 8060 868 -3597 -2815 930 4028 3674 -171 -6175 -11443 -11613 -5256
440 -5256 1404 4640 2628 -1628 -3467 -1150 4329 9822 11751 8953 2793 -3913 -5655 -2479 1352
455 1352 1782 -2153 -7800 -10929 -9936 -5264 1498 5413 5728 2434 -1628 -1122 4228 9451 10825 7073
471 7073 743 -4559 -7072 -5219 -1413 888 -679 -5476 -9555 -8541 -2975 3173 6920 6954 3604 -328
487 -328 -1736 1158 6084 8033 5614 -248 -6100 -7472 -4764 -908 1604 1186 -2017 -5544 -6527 -3109
503 -3109 3343 7412 6768 2086 -2938 -3419 -659 3185 5178 4782 1072 -3391 -6364 -4350 916 4766
519 4766 4349 -21 -4911 -6243 -3591 822 4202 4475 1179 -3045 -5389 -3038 1956 5714 6341 3824
535 3824 -906 -3407 -1868 1584 4869 4622 539 -4730 -7752 -6399 -2449 615 1985 286 -2826
550 -2826 -4495 -2614 2174 6944 8659 6450 1944 -1100 -659 1789 3224 2481 -997 -5927 -8906 -8767
566 -8767 -5635 -1023 1293 467 -2095 -3011 -298 4429 8252 9541 7739 3343 -704 -1755 102 1771
582 1771 1061 -2164 -6916 -10253 -9171 -5545 -1122 2252 2330 -58 -1286 427 4167 7993 9742 7716
598 7716 2591 -1550 -2652 -1750 -449 103 -1760 -5630 -8619 -8333 -5024 -377 3039 3491 1318 -363
614 -363 359 2930 6144 7968 5962 1797 -1820 -3176 -2403 -402 1261 -17 -3561 -6430 -6325 -3831
630 -3831 261 3517 3200 794 -974 -978 617 3714 5800 5152 1370 -1745 -2884 -2062 687 2888 1550
647 1550 -1727 -4280 -5108 -3449 -283 2254 2296 76 -2093 -2924 -1596 2082 5042 4324 1572 -686
663 -686 -1938 -1178 1583 3466 3010 147 -2987 -4716 -4182 -1182 1494 1423 -454 -2760 -3553 -2053 1250
680 1250 3971 4539 2711 274 -1184 -977 1763 3826 3090 759 -2501 -4928 -4581 -1671 638 1054
696 1054 -228 -2377 -3371 -2266 815 3861 4733 3444 794 -1324 -882 1223 2871 2882 906 -2093
712 -2093 -4316 -4157 -2150 343 1352 603 -1505 -2902 -1963 590 3336 4526 3217 660 -1445 -1687
728 -1687 42 2324 2427 1387 -1596 -4210 -4113 -2105 416 2039 1425 -728 -2064 -1923 166 2695
744 2695 4134 3180 674 -1691 -2266 -779 1142 2255 1388 -1162 -3068 -3767 -1856 500 2024 2196
760 2196 253 -1432 -1796 -216 1935 3395 2697 732 -1641 -2558 -1418 634 1776 1431 -245 -2395
776 -2395 -2802 -1623 471 2274 2006 641 -1195 -1995 -564 1425 2833 2308 73 -1748 -2677 -1774 184
793 184 1689 1507 -52 -1853 -2817 -1645 562 2342 2721 1067 -1006 -1754 -979 856 2151 2055 664
810 664 -1586 -2980 -2213 -509 1512 1937 475 -1015 -2005 -1501 562 2095 2461 1390 -503 -2037 -1406
827 -1406 195 1613 2083 668 -1145 -2392 -2289 -541 1295 2027 1038 -633 -1796 -1416 316 1921
843 1921 2472 1466 -566 -1648 -1786 -343 1377 1791 788 -864 -2248 -2014 -844 1266 1998 1213 -76
860 -76 -1599 -1516 -287 1491 2253 1518 -252 -1641 -1671 -772 1198 1800 1216 -370 -1747 -1983 -905 910
878 910 1745 1379 -134 -1328 -1522 -541 967 1961 1484 -1 -1342 -1639 -570 760 1836 1363 -150
895 -150 -1506 -1916 -1316 434 1380 1302 -20 -1192 -1811 -759 762 1973 1796 495 -829 -1276 -836 527
913 527 1709 1262 -109 -1410 -2002 -1241 200 1177 1288 205 -807 -1217 -844 861 2044 1904 754
930 754 -641 -1354 -871 268 1337 1160 -44 -1239 -2095 -1683 -296 881 1144 578 -675 -1240 -573 807
948 807 1910 2064 880 -113 -1233 -1355 -20 947 864 22 -1151 -2041 -1707 -502 973 1390 653 -128
966 -128 -974 -681 869 1714 1696 1199 -209 -1292 -1382 -465 462 884 379 -851 -1813 -1734 -484 615 1364
985 1364 1256 115 -820 -626 354 1479 1845 1104 -89 -1339 -1425 -703 48 590 398 -573 -1613 -1402 -674
1004 -674 543 1213 1158 501 -471 -656 336 1199 1501 1296 -109 -1054 -1560 -858 -17 522 195 -541 -1434 -1379
1024 -1379 -524 536 1286 1353 543 -310 -590 81 782 1343 1248 49 -972 -1560 -1180 -217 448 453 -380 -1280
1044 -1280 -1219 -492 556 1345 1249 608 -256 -540 -91 732 1352 1298 126 -1049 -1244 -1124 -194 507 472 -100
1064 -100 -906 -1329 -891 136 1003 1094 609 -149 -585 -499 330 1014 1163 551 -458 -1189 -983 -330 430 536
1084 536 50 -662 -1130 -776 -93 630 980 546 -342 -663 -390 174 1012 1262 721 -88 -870 -649 -99 330
1104 330 567 150 -577 -1028 -1028 -536 276 540 93 -143 -457 -614 239 1038 1416 1067 277 -300 -465 -181 488
1125 488 394 116 -580 -1311 -1346 -757 67 753 369 -65 -286 -310 190 1110 1464 1208 329 -310 -704 -474 111
1146 111 450 6 -538 -1283 -1384 -883 23 576 671 358 -208 -263 96 1000 1532 1253 516 -226 -676 -487 -144
1167 -144 211 274 -376 -883 -1300 -651 -74 795 695 339 -22 -269 63 510 997 1120 541 -331 -808 -588
1187 -588 -294 357 288 -190 -642 -940 -753 157 572 731 417 -191 -292 -353 346 722 797 450 -150 -609 -616 -149
1209 -149 285 333 198 -420 -683 -599 -113 606 620 359 -112 -608 -509 144 467 543 623 -54 -479 -503 185 186 541
1232 541 341 -201 -663 -619 -204 298 511 326 -189 -590 -587 -270 627 529 645 94 -562 -215 59 382 849
1253 849 399 -130 -659 -673 -381 351 310 424 -159 -375 -512 -121 286 503 528 96 -266 -472 -193 211 526
1274 526 331 -77 -579 -574 -272 161 485 309 113 -343 -371 -245 409 475 522 110 -317 -422 -165 256 542 424
1296 424 -208 -384 -438 -246 233 458 317 195 -306 -399 -346 -98 274 361 -67 -268 -448 -337 83 393 413 129
1318 129 -163 -173 -177 239 444 587 124 -279 -445 -496 -170 165 150 41 -419 -387 -394 134 280 566 463 164 -375
1341 -375 -113 95 413 451 392 -301 -563 -518 -339 119 235 226 -368 -415 -355 87 468 640 434 -62 -91 -141 -23
1364 -23 296 398 228 -294 -407 -288 -480 -214 118 -24 -315 -466 -479 -84 462 483 532 389 64 -32 206 194
1386 194 528 460 37 -497 -421 -479 -144 -55 -41 -339 -548 -544 -75 369 608 723 515 195 128 235 441 528 239
1409 239 -172 -408 -803 -614 -290 -155 -155 -137 -319 -360 -245 129 722 697 567 133 190 215 219 242 181 -12 -435 -724
1433 -724 -732 -403 -86 -239 -194 -375 -429 -36 282 770 678 641 348 40 19 233 284 182 -44 -439 -662 -797 -483
1456 -483 71 25 -112 -155 -113 -52 145 556 638 417 122 196 -119 313 229 184 87 -295 -470 -500 -165 88 -105
1479 -105 12 -190 -286 -154 36 468 447 374 157 86 -82 -21 106 279 170 -15 -359 -366 -323 -70 -16 -31 -212
1502 -212 -168 -316 -273 159 397 364 156 -4 -92 154 252 283 328 -37 -280 -319 -221 -191 -143 -126 -301 -360 -347 -134 177
1527 177 223 361 284 16 62 140 124 418 281 147 -145 -254 -355 -226 21 71 -294 -432 -262 -5 -11 356 458
1550 458 345 271 289 192 160 370 264 -194 -135 -251 -229 -277 50 -149 -95 -272 -362 23 94 413 368 307 262 177 8
1575 8 71 350 138 -70 -152 -310 -446 -213 5 23 -41 -248 -293 -93 2 197 311 342 123 -55 155 42 107
1598 107 287 13 -31 -186 -322 -306 -28 155 -16 -329 -87 -138 -302 196 165 84 114 191 -133 -56 435 288 109
1621 109 -11 -129 -350 -244 -18 161 -135 -154 -406 -226 -79 182 221 112 -16 -13 50 -97 156 352 369 225
1643 225 -145 -355 -87 -111 24 -37 -71 -373 -344 -295 76 145 87 8 70 55 123 229 294 250 68 114 -149 -290 -134
1668 -134 -140 80 -255 -383 -111 -380 -31 -37 -9 91 34 -76 -54 6 343 363 41 17 43 -37 60 -61 92 -11
1692 -11 -106 -219 -279 -301 -38 14 12 177 -101 66 189 308 219 194 1 115 -124 61 103 -131 -47 -73 -311 -143
1716 -143 -116 -238 -24 184 15 -122 -121 60 191 266 122 103 -52 -122 -83 29 269 -36 17 -325 -92 -159 -66
1739 -66 101 100 138 36 89 56 157 319 289 11 -71 -30 -51 158 94 6 68 -74 -264 -276 3 -5 90 40 -38 -113 -171
1766 -171 104 188 209 190 -37 -189 -67 -69 -23 63 -5 164 -178 -161 70 -94 -128 98 -67 -157 -78 54 72 22 -96
1791 -96 -42 -19 -34 69 142 225 134 -62 13 -53 -100 -13 7 -54 -153 -109 -184 -41 164 92 109 81 -36 188 159 46 47
1818 47 16 22 -168 -144 -142 -37 -174 -188 -278 -156 -182 77 30 251 149 309 220 118 115 277 267 162 -55 -46 -139 -187
1844 -187 5 -31 34 -80 -230 -126 87 108 147 177 63 155 92 -80 58 100 110 -102 -169 -177 -103 40 -233 71
1868 71 -62 37 -112 -174 155 102 169 176 -37 29 -198 -2 100 -24 86 4 -250 -134 59 5 41 -66 -99 -30
1892 -30 113 35 -12 162 -53 -37 -12 -18 -75 10 124 40 43 59 -27 -235 -103 6 31 -4 -148 -60 -67 27 1 195 84
1919 84 -92 14 -109 100 132 220 150 42 36 5 -119 -67 -226 -47 -10 -343 -92 39 23 7 251 -77 72 292
1943 292 44 49 261 65 115 -154 -44 -34 -74 -160 -199 -161 -128 -53 -83 92 152 133 160 124 117 77 80 354 -234 -116 8
1970 8 -112 37 4 -188 -253 -291 -131 -52 154 288 51 99 58 48 -44 59 52 28 14 -178 -220 -47 -134 88 -25
1995 -25 -72 -162 -88 -40 -146 -6 65 38 -131 51 172 -43 46 220 157 33 33 -197 -67 153 25 36 10 27 -61
2020 -61 42 -210 48 8 363 -27 94 199 134 12 -24 -208 98 148 -46 -91 -48 -174 -67 -208 -142 13 -134
2043 -134 185 64 108 -10 78 144 42 326 319 0 15 147 82 7 -177 -152 -27 -232 -17 40 -202 60 -8 -5
2067 -5 -89 107 236 52 241 185 255 236 46 -143 117 -143 -51 -14 -169 -267 -200 94 -89 46 15 115 100 -7
2091 -7 144 94 102 83 87 -13 -112 -36 -100 -49 -209 -85 -153 -139 -155 6 -30 -12 73 -1 22 25 -56 151 190 15 -148 -71
2119 -71 9 -89 -1 -24 -145 -44 -73 -96 -24 98 150 43 -58 223 147 59 34 200 -24 -30 -194 -31 112 -83 -169
2144 -169 -106 -28 -121 -25 -108 68 -20 154 -42 -32 90 67 5 -75 -94 63 -73 68 14 62 95 48 -289 -82 -39
2169 -39 272 -160 80 -6 33 47 132 -13 -22 245 66 -69 -110 -89 -45 187 37 -146 95 -29 -115 -211 -131 60
2193 60 4 8 -6 8 -154 174 99 12 91 33 -158 65 82 87 63 122 75 41 -39 -128 -153 -59 -71 -132 -142 173 175 58 93
2222 93 15 -88 160 53 -68 86 -57 -21 -10 31 -51 -155 -37 -98 -95 -32 -199 55 -83 142 79 79 -98 87
2246 87 92 78 64 5 40 -160 -93 -64 -4 0 146 -71 36 94 -11 116 -31 127 175 64 -71 84 -34 70 43
2271 43 -29 24 46 -23 114 -79 56 129 93 73 38 -34 87 119 138 196 -2 85 5 -41 67 76 -104 28 79 -62
2297 -62 56 142 -117 -101 -15 -20 -12 -96 -105 -119 -132 -12 3 145 50 -73 242 63 -100 -37 -39 23 124 -212 -67 -58 -47
2324 -47 -93 -16 -77 -6 25 143 106 -42 -137 2 -124 -9 -5 -71 71 10 2 -148 -148 -54 -125 -33 -23 220 -140 189 -30
2351 -30 -15 244 96 -100 13 180 -52 -221 -71 -190 -64 -112 105 131 104 158 82 274 110 119 94 14 -50 50
2375 50 -12 -51 -133 -42 -56 110 133 -55 -60 -222 25 -2 121 33 123 6 65 -82 -89 -98 -161 6 29 -204 -86 -49 -37
2402 -37 -1 -137 -125 77 248 -64 10 -9 -25 220 130 57 -127 78 -273 24 116 -104 -20 64 -17 -24 21 23 -21 -29 -96
2429 -96 111 141 -109 -65 -63 -85 -36 53 -60 -61 -65 58 -56 -92 -48 30 35 0 -61 44 9 98 -12 -84 9 57 -26 -30 -279
2458 -279 116 -80 -59 -34 -151 72 -124 56 1 90 -16 44 53 92 44 170 28 -70 181 -77 -127 110 -34 -71
2482 -71 -14 40 14 -128 31 59 -36 -93 15 21 -2 -88 -84 42 18 -42 -73 -122 -67 31 43 -53 43 -164 -42 -2 -48 131
2510 131 -74 322 5 31 74 64 -52 100 141 -52 103 99 -72 -128 -18 186 -83 -44 39 35 90 -31 151 -96
2534 -96 -45 15 -5 -153 180 -44 -154 -71 53 80 -79 -161 153 185 -65 67 96 58 110 -18 -3 66 128 -67 -67
2559 -67 148 -118 -20 -37 22 66 66 51 109 -46 -37 -231 121 4 61 -66 44 -74 -130 46 128 62 -156 74 58
2584 58 -102 86 -42 -120 32 -24 -55 102 122 -90 149 85 -19 -79 -79 -121 60 -134 -79 -89 -256 86 -54 -71
2608 -71 -81 11 -4 51 135 58 108 78 -98 -117 -158 74 -122 7 -26 -20 -151 2 138 -77 116 -29 34 15 -19 48
2634 48 131 65 24 -5 -48 12 -15 5 -184 -18 -64 -141 68 -50 -31 -157 -159 -18 43 -55 -78 -31 6 -197 71 182
2660 182 -106 -113 81 27 10 -139 68 -19 63 -30 219 -68 -99 97 195 -144 -47 -83 69 34 -107 70 -34 -32 -16
2685 -16 237 109 40 -32 -151 100 92 -68 -84 52 31 100 38 -46 59 111 -17 72 73 86 110 -120 -4 -112 21
2710 21 -199 -20 42 -133 86 -2 96 29 127 -25 76 112 4 -29 74 -145 84 -83 -125 -64 -98 -132 -60 -76 118
2735 118 -52 39 -21 144 103 -88 224 127 25 118 109 176 113 6 4 -62 -188 -59 -82 11 -12 -68 -50 -241 -175 170
2761 170 153 -40 53 81 86 66 117 -67 -31 -54 154 222 35 -17 -399 32 -1 31 23 10 1 -58 25 -61 17 67 104 53
2789 53 23 -215 251 70 21 141 -42 100 53 -4 -23 -24 103 34 -117 124 -10 102 -59 40 -130 15 -16 50
2813 50 148 36 -17 0 16 -123 70 -32 120 -68 101 48 172 64 14 101 4 57 -21 -1 21 -90 -140 72 15
2838 15 51 -97 0 -62 -75 80 -86 -56 91 -45 -74 65 5 136 -10 -10 201 23 32 29 79 -48 -51 30 -168 207
2864 207 -20 119 -90 -252 82 34 107 -38 142 -73 -7 -29 23 108 142 5 20 -93 -64 77 -30 8 -1 97
2888 97 -87 126 -11 -79 0 116 -24 67 -66 13 -38 19 -122 58 -49 74 -38 17 -205 -37 -192 54 117
2911 117 58 -130 57 43 -47 -87 77 90 30 -17 -76 50 -13 -95 81 -1 35 -20 -46 67 69 80 4 26 20 108 -53
2938 -53 -24 34 82 85 81 -160 4 142 -130 -40 -99 92 38 2 -121 -37 14 39 -71 80 30 -145 76 -4 8 -69
2964 -69 -10 118 6 144 98 147 107 -147 -118 -45 -133 -87 -89 -33 -8 -64 90 -14 -24 -2 1 -51 157 87 -46 -87 20
2991 20 -62 36 -21 -63 134 78 -198 -230 -14 -2 128 41 -92 -33 -13 5 50 -228 85 -5 37 125 -42 37 -8 17
3017 17 -52 -43 -104 -150 -47 -102 -25 43 119 4 81 43 -7 106 -43 -47 -127 75 -32 -9 -235 -107 37 -54 -22 -112 62
3044 62 90 56 -194 165 -85 -7 100 99 54 -63 61 14 99 -102 103 -64 108 -105 -98 -31 64 -49 -27 -60 -30
3069 -30 116 154 -136 -40 -57 -77 -90 30 -27 -130 -134 -26 -82 -124 5 -54 49 -18 65 -187 145 132 101 51 146 38
3095 38 16 201 24 -22 -7 16 -81 185 128 -168 -130 -161 45 -94 -107 -115 85 75 86 49 -31 120 108 -15 95 27
3121 27 -66 113 3 -175 48 48 18 32 -57 61 67 147 71 -36 154 -91 41 -233 57 6 -7 -34 -89 -113 -20 -277
3147 -277 -274 13 -71 1 -119 -13 122 53 -24 -85 130 -171 -12 31 -5 105 -114 -58 -24 181 -60 -133 74 19
3171 19 -71 -37 -38 90 121 -130 7 -110 49 143 -17 -71 36 -42 -91 -74 98 90 -27 -120 119 -121 -178 -63 146
3196 146 31 124 96 -41 -34 7 14 -37 107 -65 -24 -60 174 72 -65 -50 10 -25 36 77 -11 -2 -139 -177 -29 -3 -45
3223 -45 -106 157 216 -66 -29 25 -19 -80 -195 48 -108 -35 -13 -20 2 38 -24 79 14 -91 71 159 -36 -22 37 -74
3249 -74 -12 -164 -79 14 113 67 -71 -116 22 37 62 60 49 -64 235 -50 -19 -92 213 -48 -125 14 -63 114 108 275
3275 275 79 -212 49 88 14 29 39 62 133 -202 11 64 90 78 -7 -35 60 -4 -77 -137 -62 32 -53 203 179 41
3301 41 -13 75 -16 60 -132 26 29 -145 2 -96 -33 -8 -50 -14 46 57 -3 -49 -40 17 55 -101 96 41 -33 5 -4 -99 -119
3330 -119 106 42 210 20 -57 131 92 41 -132 -43 28 -146 238 18 121 0 -77 13 -22 108 221 -3 67
3353 67 12 6 -88 -97 38 72 -84 -32 60 -10 26 -97 66 -106 90 211 -20 47 24 -4 -18 -81 16 31 -110 -13 109
3380 109 -44 -74 -23 66 62 -114 41 47 -88 53 -53 164 73 -7 30 -120 -24 144 77 -126 -78 -28 -24 59 -39 -72
3406 -72 -158 40 191 46 -30 159 -170 85 187 11 -62 81 27 22 -65 -50 -94 -49 -43 60 124 8 -21 121 5
3431 5 30 -56 91 -43 1 3 13 -2 29 -38 -98 95 27 -100 -52 -12 -66 -5 -108 -157 60 -94 -194 10 -105 -26
3457 -26 -19 141 19 73 -59 52 4 93 -155 61 -43 127 -53 207 -108 -45 -10 13 -129 83 248 -23 125
3480 125 119 110 67 5 44 26 210 23 5 7 -79 -56 -160 -51 30 -192 -68 128 -45 -91 -98 18 95 3 47 -12 90
3507 90 85 -156 -70 45 -26 50 -92 -54 1 -54 -197 -65 31 215 47 24 57 -20 -31 96 158 -48 52 -72 53
3532 53 7 -165 49 34 -70 44 -54 38 -37 20 36 23 -31 -92 -81 247 14 8 117 29 44 -40 -238 -22 54 -152
3558 -152 -141 -168 -32 -92 27 -104 -117 -121 86 13 85 -10 28 104 61 -36 -7 44 86 -12 -46 -37 -168 -37 -119 -87 28
3585 28 8 9 -23 17 -91 25 76 9 -7 2 -28 30 12 20 -164 113 -12 -31 73 -86 -55 77 -211 152 197 -149
3611 -149 185 -7 -210 -45 -107 -120 -4 33 89 -147 -67 -59 -93 57 -50 24 108 61 -22 176 0 103 15 -79 34
3636 34 -68 21 -27 65 -28 122 -74 -203 -8 41 135 30 21 -121 -89 -26 -16 -156 -82 -40 57 41 94 -112 -49 140
3662 140 159 -135 77 -73 -112 -17 -100 -23 -4 76 68 26 16 117 27 -9 109 -24 18 45 -68 46 -151 -29 -123
3687 -123 42 75 -38 136 -78 129 11 -235 -76 152 110 8 -199 18 -111 -52 -53 -81 -118 -221 47 48 49 123
3711 123 121 69 161 67 -10 39 253 56 -117 -4 56 -20 66 -196 -22 -24 -75 -11 91 -108 -111 -10 64 -134 19 94
3737 94 181 -107 41 -105 -111 15 -99 -76 -24 -90 -98 -11 -31 -9 -247 5 8 -43 63 -192 79 -81 -127 -23 26 68
3763 68 -79 -112 100 -48 -69 57 62 -232 -66 -68 -203 -63 39 -134 -55 15 47 71 103 -74 88 49 -18 83 -66
3788 -66 -9 -10 56 -57 -99 -27 -40 -72 134 -112 153 3 60 1 49 81 126 -73 115 107 123 -49 16 -58 -121 52 -109
3815 -109 147 -241 73 -29 143 -15 60 71 81 -1 56 76 -49 108 -55 112 -33 -87 41 -45 -51 -123 -107 39
3839 39 -174 -63 220 68 95 23 -83 57 -81 -22 10 154 38 26 -85 -49 -102 44 -63 -141 236 16 -132
3862 -132 102 22 62 -132 76 -49 38 -57 45 -58 -15 -287 83 -9 -99 13 -4 107 -193 -8 -96 85 67
3885 67 -62 -95 106 20 -110 -156 189 77 204 12 -3 -158 -74 -102 -101 -7 -41 -61 -128 95 -61 51 100 -186 -43
3910 -43 76 109 -101 82 -24 -67 90 29 78 -43 -57 -138 -96 -67 -146 18 26 121 203 -68 -138 97 48 151 -81
3935 -81 106 3 -29 -132 27 117 -118 14 -11 -41 -73 14 -41 53 51 49 45 72 1 20 13 -102 91 -146 72 120 -30
3962 -30 66 6 -71 22 56 -16 -110 -49 61 -257 -104 -164 32 -18 113 -112 140 62 -96 35 -6 61 14 -36 18 -59
3988 -59 -67 238 -139 -61 -178 -175 124 98 -139 74 201 46 80 -68 -266 155 -82 73 8 -42 144 -62 -171
4011 -171 -4 -154 -74 68 13 12 -93 3 19 4 -2 50 58 67 -101 49 -133 -24 -106 -86 117 -53 -53 10 -29 -137 -48
4038 -48 -72 8 74 -76 104 -12 121 -149 28 189 103 -64 76 -8 -256 -54 308 103 -126 87 -29 -42
4060 -42 3 166 -65 4 62 63 50 76 -56 13 -40 42 -95 -68 -132 -59 -22 -66 -38 38 -17 -28 -34 0 65 -85 -111 103
4088 103 -49 -348 67 12 33 -3 -103 18 -70 31 88 -78 18 -6 101 29 42 3 -7 -63 -26 48 42 -153 68
4113 68 9 -81 -227 80 -92 -10 -51 85 17 -209 -8 -103 36 -13 26 -29 97 64 139 -51 -64 -32 -12 -61 14 53
4139 53 -43 155 93 -82 -71 -113 209 65 -94 -42 50 -85 134 -62 -33 231 -24 68 -41 90 -110 -130 77
4162 77 -52 81 33 35 -6 -73 67 -62 -106 58 119 41 132 101 11 2 -12 -4 -109 0 -1 -174 -32 -178 11 21 3
4189 3 23 7 31 95 15 82 -53 151 -30 -37 -102 -78 174 217 35 -36 -117 -97 4 -56 -52 11 83 288 -8 -29 76
4216 76 97 146 126 38 -27 -59 -74 -148 43 3 -36 33 -44 121 20 -58 -158 62 -85 34 94 -53 10 -56 -50 -33 -15
4243 -15 78 -21 -179 -110 -117 215 -70 -14 116 -48 84 67 89 -61 15 -11 4 -9 30 -27 108 38 41 -33 120 132 26
4270 26 67 -11 -102 52 18 -138 -130 21 31 91 191 95 -79 -12 -17 71 -259 21 77 -7 45 -41 81 -28 55 -105
4296 -105 -40 -92 221 98 86 0 -50 -182 127 -147 -3 144 38 26 17 -18 40 162 -56 -29 58 194 -59 211
4320 211 -9 -14 -24 31 175 74 31 -81 -62 -184 90 108 -34 106 -102 -127 68 -138 -23 169 31 46 -10
4343 -10 -1 71 -84 -112 94 -64 45 17 -53 -69 32 -77 36 -65 -9 -26 44 -184 138 -85 -9 109 -152 -167
4367 -167 20 -254 39 -61 60 0 146 -78 -1 -142 -154 68 25 -79 -145 -4 67 -37 124 121 -65 15 -45
4390 -45 38 143 -162 15 -140 -81 59 -10 -56 -44 84 34 6 65 78 -42 -5 70 -120 -71 99 156 73 -83 -12
4415 -12 95 -22 173 -102 75 103 -137 44 -74 -83 33 -94 28 19 -50 44 -119 41 64 -101 -103 -85 -1 -61 -100
4440 -100 -31 51 -88 102 -110 -14 -18 32 32 14 40 -40 -134 87 75 -13 -12 -36 -48 137 166 -7 3 8 124 62 -98 -36
4468 -36 33 -21 -1 -17 46 -31 23 35 -25 -20 13 -19 187 -74 191 -32 -20 -84 57 -217 -97 -81 25 -39 -96 154
4494 154 77 93 6 188 -56 197 -120 -31 72 131 -211 -11 207 -102 -110 -168 166 -88 -90 117 -106 -116 33 45
4518 45 -141 -87 138 96 231 46 31 2 -28 -43 -76 81 22 22 32 196 30 49 -205 53 -63 56 -150 36
4542 36 23 -16 -42 109 36 -53 -120 -170 14 130 179 14 51 -71 2 -47 -119 125 -77 142 -102 -41 23 -130 7
4567 7 -8 -11 127 38 30 26 -100 64 -57 -13 -212 -75 -13 -69 47 -82 -26 -64 74 -134 248 133 16 18 45 -56
4593 -56 -40 89 -84 -144 18 -86 -50 -40 -36 -32 34 -16 -16 34 4 -40 28 90 -242 179 27 91 -45 -16 -95 144 -84
4620 -84 -30 -78 44 35 -186 64 153 124 -165 -146 -71 90 -33 -38 -40 -63 92 5 5 -125 35 80 -158 -5 75 -47
4646 -47 -156 -25 13 -112 8 61 -72 -190 -141 15 54 152 -17 -26 -49 -94 29 17 -46 76 -72 123 196 -33
4670 -33 -2 -109 14 167 -48 103 49 43 -140 11 -20 69 110 -106 -50 78 139 -152 -14 -118 -102 -165 -38 -150
4694 -150 31 106 8 -53 -65 -54 -152 76 107 -36 82 -71 84 7 110 -123 68 -63 10 -57 -38 18 26 -3 9
4719 9 -92 -36 26 -75 33 -111 -5 12 -87 -206 8 69 -80 134 -68 -73 -104 -133 172 112 76 -94 39 79 170
4744 170 -41 -64 -51 -35 -120 13 26 -45 27 96 -153 12 -148 245 -2 253 25 3 -23 -176 -70 -32 -39 79
4768 79 72 -211 -48 96 -62 -28 5 77 22 77 -60 29 144 6 -92 91 32 -28 -160 99 86 -68 46 -121
4792 -121 -16 -29 -179 -202 86 0 -160 35 -197 6 119 -13 -106 83 32 -60 104 -43 24 123 36 -53 57
4815 57 -34 28 41 46 43 17 -98 -62 -46 -29 -164 -31 -155 -70 54 10 -49 128 45 184 0 78 -3 -125 72 11
4841 11 -29 58 63 1 7 134 -2 11 131 129 67 -16 114 -185 38 86 -95 -39 -34 -211 14 -115 54 -80 -114 97
4867 97 80 31 -87 -103 11 73 19 -132 -99 13 25 16 -24 -49 57 -87 -10 107 148 -110 1 31 -73 -86 -3 75
4893 75 -122 -9 -62 -50 -39 144 27 2 45 97 137 81 -30 -111 88 -139 -6 14 -10 65 -110 27 -15 -47 62
4918 62 24 138 60 -92 88 157 16 -142 -61 81 55 -37 -119 -180 -56 -103 -96 9 160 -62 -31 -89 100 -14 -68
4943 -68 23 -33 92 -129 -159 -156 30 47 66 2 -112 -61 -68 -7 67 158 -21 160 -44 94 92 -43 -14 -155 55 -209
4969 -209 63 -26 63 67 -2 90 20 18 -73 3 -40 19 -35 47 -88 41 -114 105 -135 59 24 -97 -151 143 -27 -132
4995 -132 112 179 -84 -38 -50 12 -64 61 136 -55 -28 12 -12 -254 145 82 -92 -69 97 108 66 48 98 -52 -140
5020 -140 157 27 -45 53 -12 -117 -123 -150 -92 -98 14 -13 -15 -77 100 103 -62 94 -107 -61 65 -110 -160 50 -140 52
5046 52 -87 -29 45 -15 24 31 -69 217 36 -56 61 83 -130 25 76 171 -131 82 102 32 -240 80 -163 17
5070 17 -7 78 -25 -119 70 -47 -22 -31 95 70 -50 -100 -69 -36 152 -153 130 50 -24 -50 93 31 -22 65 -94 -52
5096 -52 -125 -181 -9 -94 -76 -41 -85 -4 118 -130 218 136 -20 -49 -55 234 -21 13 -18 -155 31 -17 -46 -43 19 106 -63
5123 -63 125 -40 64 98 98 -28 -43 -78 66 108 14 65 75 -127 25 -66 -13 -82 72 74 -49 6 89 -46 7 -54
5149 -54 224 -13 103 -151 9 -108 -169 -163 -71 32 197 -68 -84 94 -39 -5 12 -2 -59 -33 80 -201 -23 -29
5173 -29 -157 133 -82 -66 -66 73 96 96 -78 -37 -72 -44 -68 78 108 145 -68 198 16 24 72 46 -111 60 -72 -107
5199 -107 85 -198 -4 -15 25 -125 139 3 148 -15 -7 208 -3 -40 68 43 129 -28 -61 -14 86 25 116 7
5223 7 -169 70 47 -9 6 -103 30 -62 -64 -79 -19 -120 61 -48 45 15 -52 179 -116 -130 57 5 -208 16 -76
5248 -76 24 -66 -143 -23 -105 58 19 -120 -73 46 -71 -19 -101 -5 -65 -23 63 -110 9 -132 12 17 -4 -37 -18 56
5274 56 -79 -35 18 -141 -116 -74 -67 -15 56 97 17 -41 -101 31 -5 -130 65 36 -25 -48 18 11 31 -94 -23 -25 -66 22 -17
5303 -17 -99 1 -138 -64 22 -9 90 51 -45 -79 -21 31 110 20 80 -59 83 -117 53 -40 79 -98 42 79 -93
5328 -93 166 -176 127 -12 7 9 126 132 -78 35 71 80 57 92 66 -50 167 -34 56 -123 -149 69 -74 -162 123
5353 123 -90 -7 69 173 181 -74 -42 33 134 -40 52 -42 29 -28 -166 -31 16 -94 63 -53 84 -33 57 62 100
5378 100 1 30 121 121 175 52 -3 -54 243 -29 29 69 -108 118 96 63 150 -204 38 -54 59 81 -103 -65 -170
5403 -170 -50 45 43 -85 102 -75 67 269 32 -67 3 22 -66 75 100 -112 -54 81 82 -174 -41 -207 -7 -86
5427 -86 43 35 17 0 58 -128 50 -122 50 255 98 -5 47 42 -90 -68 9 -224 80 36 14 -60 -74 53 58 65
5453 65 -51 -64 -66 -206 30 -69 -3 33 130 85 4 170 73 32 -33 129 -234 -96 46 -66 -85 -23 197 76 83 -75
5479 -75 -43 76 206 41 58 -56 14 -45 -14 -67 -105 21 -59 -115 -73 -89 -92 93 -13 72 20 -98 -36 93 -83 -96
5505 -96 -119 -74 144 39 8 91 -57 -130 -92 -101 -17 25 38 -55 69 51 -53 49 -66 -35 -44 -61 -92 43 -146 77
5531 77 192 -16 -98 11 130 161 -55 -115 102 -139 169 -183 -86 -123 -5 -155 -97 61 119 -20 176 43 -24
5554 -24 9 27 203 -43 160 -101 49 27 -40 -68 107 23 65 180 -118 -95 -85 -149 33 -49 -4 -26 -160 67 -72
5579 -72 136 -186 45 -178 -38 19 68 -102 69 12 61 -121 43 19 66 -77 -98 4 5 137 49 -113 89 69
5603 69 20 48 55 65 -103 18 -71 -165 -9 83 24 82 -11 81 -1 78 -66 -74 14 21 -91 188 -75 100 -3 -36 -58
5630 -58 59 69 -82 -57 157 47 2 -134 -230 -161 -48 86 -19 -38 132 140 -21 30 61 163 21 23 -46 50 -69
5655 -69 -97 -45 92 56 -47 -28 88 197 -107 88 110 65 16 45 -119 141 -126 72 97 -230 59 121 82 -92
5679 -92 123 45 13 1 -94 -169 -45 39 -110 65 -87 17 -159 9 -104 -100 32 146 41 -82 -26 -68 -60 96
5703 96 -134 47 -45 -51 9 81 120 63 -26 36 54 -34 -129 -72 152 88 -2 8 -57 86 -47 -157 85 -66 -89 -59 199
5730 199 68 -28 -125 -14 50 -21 -102 -103 -212 -138 -31 0 -118 -74 -11 66 58 -28 93 -44 57 115 42 -7 89 -67
5756 -67 105 93 -6 -96 45 -52 38 -24 24 -49 -9 -69 124 91 121 -9 23 -12 75 -12 46 -1 165 41 10 -25 -94
5783 -94 22 -79 -140 64 110 0 179 -34 -63 62 -19 -89 -17 65 34 22 -91 195 -11 130 38 32 127 -65 157
5808 157 -90 28 -23 32 47 -10 51 106 -80 90 205 72 29 10 -9 -16 -174 114 105 -81 -55 100 -100 32 -62
5833 -62 61 13 144 -38 23 184 181 -48 77 -98 -5 61 37 -1 2 174 26 -42 32 -53 -25 206 64 -49 117
5858 117 -21 15 18 23 -219 -27 42 -40 -232 -120 -13 110 64 -83 -15 15 57 106 -96 -14 51 -44 230 119 170
5883 170 -130 -9 63 -42 -73 -3 -12 105 -28 -55 -9 22 11 46 -92 -78 -185 -9 9 -42 114 2 36 -65 -127
5908 -127 -122 247 -26 49 -140 48 -39 20 -74 -51 -47 19 32 -23 108 -156 96 -1 -12 179 29 -108 13 -58 -98
5933 -98 31 -62 115 9 -52 150 71 57 116 -9 228 -103 38 -130 -112 62 -45 -121 -23 -33 16 -63 -94 -86 -4
5958 -4 138 13 -12 97 86 -23 -34 -23 52 -3 -55 -84 -270 -129 134 -116 -37 -102 103 111 -134 12 101 -52 54
5983 54 6 -48 21 83 -177 13 27 37 -13 63 10 44 12 55 27 12 -90 63 42 -8 -20 41 33 66 13 97 58 63 -62
6012 -62 16 31 42 184 111 -27 -40 152 61 15 -45 30 -200 -82 120 117 -21 23 108 46 17 73 -56 14 -61 75
6038 75 33 -10 29 -18 -119 145 95 -13 175 -10 36 -165 208 -58 -136 -144 113 14 151 33 63 80 15 129 -128
6063 -128 -37 88 86 94 -10 67 -8 45 62 -2 93 6 -29 -224 -68 -83 3 92 109 35 -110 -70 -154 175 -42 -172 112
6090 112 -34 107 339 46 -196 -72 -21 -39 79 -91 -107 43 -21 -152 28 -31 -94 -122 -145 49 -37 11 81 -27
6114 -27 -78 -89 110 -109 -216 137 26 -60 -66 -126 -67 -45 60 -107 -18 54 113 -29 -59 -134 -57 60 183 96 172 41
6140 41 -30 36 45 23 -25 -112 -91 82 34 31 47 -41 145 11 -10 -6 4 39 3 -35 9 -43 200 -20 111 -33 -89 -10
6168 -10 -128 20 124 32 11 -225 77 -43 41 -25 32 98 -28 -19 -1 -12 103 -37 42 -33 35 7 57 -4 52 -28
6194 -28 29 73 -143 -28 -65 -160 -80 62 189 62 -161 -89 13 -170 -41 199 -19 119 88 152 -46 56 47 11
6218 11 111 -77 -49 -38 84 60 -29 -5 171 155 67 -118 12 -50 -99 73 67 17 -3 133 95 49 126 20 -32 -69
6244 -69 -65 36 -63 100 60 74 -70 85 -22 -49 -18 24 36 -109 -38 174 93 -14 72 -172 -28 -58 -25 -51 32 -15
6270 -15 57 19 99 -27 -67 -39 91 34 104 183 87 -3 64 54 -158 15 -146 7 59 68 -52 -49 -45 41 -20 37 -80 -32
6298 -32 -144 9 66 -101 -15 14 219 25 -58 108 -136 178 -86 48 45 -23 -114 72 130 121 91 -77 -56 25 87
6323 87 16 -95 60 -230 5 44 -9 -43 33 -104 -223 133 -93 100 -54 -34 84 -122 -49 0 -152 35 -191
6346 -191 -9 -99 37 -12 -151 114 55 -41 116 -72 293 94 -56 -45 26 6 6 31 69 137 41 -27 136 -122 -43
6371 -43 -111 -80 58 31 32 -96 67 -47 -15 -126 127 64 -29 221 -25 -84 23 31 141 139 -144 -32 165 106 57
6396 57 114 -19 18 -73 50 6 90 -54 -99 24 -145 76 17 101 -8 -145 -169 -203 13 -61 -22 90 -40 -31 -76
6421 -76 71 -54 -168 -82 13 -164 90 24 61 -63 11 164 2 46 -133 188 63 196 120 -6 128 33 -90
6444 -90 51 211 0 131 -80 88 -65 208 -214 -6 51 -89 14 -56 60 -81 68 -5 -9 -70 40 -69
6466 -69 -4 -51 4 -91 -28 2 47 253 35 -45 68 52 21 35 -45 -14 217 -60 -77 63 -157 -98 -84 -2 -303 -112
6492 -112 -48 43 89 -2 -109 -182 -86 -122 -6 -172 -74 46 -24 67 -75 24 -45 -97 176 11 -125 -1 148 70 -75
6517 -75 104 -30 -69 -139 18 176 127 -100 -46 39 125 18 193 54 -20 86 147 -33 211 26 34 -15 65 -22 -145
6542 -145 -64 -6 41 -33 4 -47 91 150 -7 -24 115 11 123 -40 112 -81 44 -20 41 4 150 102 -85 -53
6566 -53 -54 -22 51 88 41 -1 6 127 136 109 192 -29 86 97 -114 83 -74 -12 32 -38 -41 -62 -88 65 4 -24 -96 -144 -21
6595 -21 -179 -4 -57 118 -181 16 17 62 72 -45 189 167 93 14 47 -131 133 8 149 32 214 -217 -128 50
6619 50 -56 -15 -84 40 -10 -5 -1 -70 97 -166 -35 89 144 64 -50 149 -134 22 130 139 -77 66 159 112 -36
6644 -36 87 -25 -102 -51 51 -34 138 -96 -24 144 -64 -25 191 75 -65 -102 0 41 121 80 -124 36 9 -28
6668 -28 -166 24 1 -153 -141 37 120 56 -9 163 154 22 -9 55 -144 158 42 -106 152 -9 57 -96 -14 -3
6692 -3 120 -13 -256 -24 -36 39 185 21 -56 -32 -176 67 107 53 -153 58 -66 -13 -68 -20 88 -91 126 -70
6716 -70 -73 -164 23 -77 92 -58 12 45 -44 -52 -180 -133 266 98 -46 -16 -5 -17 83 39 83 70 56 -73 -33 48
6742 48 -6 22 -130 96 -147 -72 -90 -50 20 64 150 -111 83 26 -58 81 29 -47 156 126 -62 -163 -51 -141 -118
6767 -118 -6 -134 -105 55 -98 -118 126 -218 89 -21 70 10 -31 30 -51 98 -78 -113 -31 -72 -171 -157 -14 73
6791 73 -67 74 -78 82 55 8 -87 106 31 -29 -12 14 -59 0 -65 -93 46 59 191 -49 -52 3 -128 -93 -155 -38
6817 -38 4 32 -102 -83 121 29 -104 -104 -166 -88 250 -55 22 -67 -154 -29 4 -192 -25 -107 10 135 -95 -7 -85
6842 -85 141 -56 -24 137 166 -137 -123 23 -56 94 15 59 -59 -117 -4 -90 -15 -117 -61 -136 47 -120 49 87
6866 87 22 5 -47 -108 123 -1 -107 3 54 50 84 52 194 -37 -157 -9 18 -64 -20 -94 -40 10 53 -4 -78 4 46
6893 46 -10 -20 -9 -117 103 -62 229 -96 -21 110 136 30 65 195 -42 158 -90 -171 -113 -59 -47 -189 15 38
6917 38 -55 -31 -122 34 -204 65 159 -126 52 67 93 156 -66 -35 -59 88 -102 -55 -127 43 69 -57 -25 20 8
6942 8 223 68 179 -6 -23 -43 -2 -24 -118 88 -54 -75 -213 -66 -23 -28 131 48 -62 75 12 -63 103 -34 105
6967 105 -46 -17 74 -22 -96 -31 21 -101 7 95 17 -34 -59 131 -3 -68 64 -23 217 -67 -16 126 54 -37 16
6992 16 -102 76 -48 -60 138 -129 -157 -28 81 136 199 -73 163 36 -107 65 -91 20 -43 69 65 318 60
7015 60 263 132 19 74 -277 50 133 -66 17 149 -54 -117 -85 0 -127 -13 -93 60 -54 58 238 -92 58
7038 58 93 -112 -154 201 29 5 -99 -37 -142 -23 -19 -47 -72 -51 -166 73 96 -99 78 102 73 -37 -107 133 52
7063 52 52 -98 109 206 108 120 -25 -5 -39 7 -74 -27 -115 -62 -74 21 31 -13 -78 50 2 72 29 -59 -32 -26 117 51 138
7092 138 174 -18 28 67 -57 111 44 -105 58 -70 -7 119 -55 50 136 -12 134 15 55 -37 -103 -216 -18
7115 -18 -104 11 -144 94 -16 78 204 -126 8 -74 -158 -157 -49 -56 123 -126 85 -140 15 24 145 -64 -224 126
7139 126 67 -36 -127 0 88 -47 123 -67 56 -26 -2 -13 161 66 -108 102 -136 88 -51 26 52 126 171 -44
7163 -44 192 -74 95 3 81 231 -118 58 -32 161 29 -53 -41 93 -40 108 -200 -68 111 93 108 -47 -160
7186 -160 -140 -197 -64 3 118 2 134 -86 15 -112 -49 83 67 -60 -106 19 -219 -139 -153 -26 -2 -107 -92
7209 -92 -4 -183 -40 16 -35 -48 -63 -78 97 -42 30 -51 85 84 79 31 -63 -39 -8 -62 7 -185 -23 92 -86 90
7235 90 -7 108 111 78 -68 -155 36 -148 -15 74 100 -72 -111 0 -52 84 115 110 74 153 81 -16 159 -29 -147 49
7261 49 -138 22 12 -19 1 -194 41 78 -96 -123 56 -122 39 33 229 -207 -5 173 93 -17 124 139 -76
7284 -76 26 -16 -3 -81 -79 99 -32 -33 -167 27 -104 -53 60 -28 -72 -2 120 52 -40 250 68 88 -32 24 -129
7309 -129 -32 62 -64 -158 68 -73 -114 -66 -32 -186 25 36 -15 37 15 -133 -155 -128 -39 -23 -77 35 -115 121 -2
7334 -2 -23 -32 30 -81 153 -26 153 -114 12 62 54 -85 38 -46 -54 -152 141 -13 -106 -100 61 130 -65 -111 -47 -95 81
7361 81 74 33 -4 -127 -44 54 -42 179 -75 -67 -59 -42 16 25 -47 41 25 7 61 20 33 4 24 -85 26 -3 87 28 23 36
7391 36 -24 -60 15 -49 -87 69 -129 40 -121 -11 110 -79 29 -94 -28 -5 -163 37 138 -107 -107 38 -90
7414 -90 -10 102 7 99 -169 13 153 47 36 -24 -119 -25 -5 87 49 105 0 -38 51 126 -111 33 17 -37 -124 -82
7440 -82 23 -186 -67 48 -49 50 -133 -29 6 -73 -103 13 -10 -16 37 68 74 -189 -12 -69 -1 -139 56 1 94 -55
7466 -55 62 48 -175 80 51 54 -73 32 119 -122 17 94 11 10 -117 20 -157 -66 97 102 8 8 78 36 60 -126
7492 -126 -57 76 88 -80 -171 78 -76 -90 -54 -6 -2 3 28 49 -28 -46 -32 41 88 77 57 18 134 -73 -140 123 38
7519 38 -56 16 -66 -190 -47 106 72 24 -158 92 -65 -37 -48 89 78 -175 -50 4 -15 -51 7 -194 -64 5 105
7544 105 101 98 14 123 -116 -80 11 -14 -2 22 17 34 -63 34 -6 189 29 -91 -5 58 54 -76 90 -113 72 42 5
7571 5 -4 -17 -67 -65 117 -65 79 -8 -177 106 -59 -6 -46 22 70 -164 34 -65 121 137 -54 -6 148 -128 7
7596 7 74 -121 -36 28 -40 -213 -43 69 69 -67 190 26 46 -93 -167 -107 -26 25 -30 -139 117 14 -78 20 -51 97
7622 97 34 -72 124 142 28 141 -51 43 150 -4 0 82 66 26 -26 43 48 -104 -74 98 -38 13 48 80 -71 -147
7648 -147 37 35 143 142 -77 36 117 109 -159 147 22 -155 -1 111 -15 74 101 17 -22 -77 63 44 42 57 -97
7673 -97 -54 28 57 90 28 -32 26 187 -140 -92 12 0 63 32 22 42 -83 78 119 -29 -29 30 50 164 37 -78
7699 -78 6 -8 53 18 99 125 -106 35 -31 0 -29 16 -22 196 -57 -46 18 -130 -66 4 199 -76 151 -166 56
7724 56 -56 38 46 -186 -61 -10 -3 -51 -156 -290 113 47 -94 -94 -71 -28 37 -46 -38 3 -28 9 -60 -27 -61 -48 -120 -49 94
7753 94 100 -15 -151 125 -70 -49 78 3 -6 132 21 -145 -15 46 -34 41 11 2 43 -56 49 -78 37 -146 -45
7778 -45 119 5 31 -41 9 94 1 6 112 -134 15 15 109 -20 51 51 -40 -44 -52 7 -34 125 -145 -111 258 -54 -50 -55 5
7807 5 -142 -81 -177 -80 -101 84 -23 -4 160 51 30 -30 165 0 -27 -80 103 59 108 38 6 16 -1 -171 134 118
7833 118 -2 111 10 46 -90 100 15 -20 -123 55 -18 83 -14 -143 -66 22 185 228 8 -12 -189 77 -34
7856 -34 -169 84 185 44 -32 -125 -31 50 -11 59 -2 -89 11 -54 -164 -4 165 8 -129 -23 58 34 -113 81
7880 81 54 69 179 -125 65 17 -78 4 116 16 27 -128 -35 124 152 -92 115 28 -53 10 71 -18 93 75 -116
7905 -116 -20 177 59 108 120 -59 -43 -75 -99 81 -65 56 65 5 33 198 -125 -109 -75 -95 -57 -88 -108 -41 -77 12
7931 12 124 -66 119 -57 103 -14 11 30 108 26 32 153 92 155 95 -135 -113 106 43 42 -49 -17 -94 118 -77 3
7957 3 60 152 141 57 -48 191 83 -203 -45 5 -6 40 -73 45 -58 -120 124 -109 78 -11 84 -86 -1 48 -1
7982 -1 -74 70 -31 2 38 86 -38 192 17 -171 107 219 51 -137 -132 51 29 -132 -92 -227 64 -47 55
8005 55 -51 -11 9 -86 5 94 71 -11 -54 127 -14 51 51 173 31 -85 18 51 -133 -27 -55 31 7 -98 14
8030 14 66 126 7 111 10 33 122 94 127 -81 -75 5 148 19 7 71 -82 43 -36 124 151 122 -90 29 26 -36
8056 -36 -77 63 -38 -102 1 -59 -110 4 -21 12 -12 -20 85 7 -104 186 169 -26 -41 -98 42 -116 12 79 44
8081 44 -114 -45 74 -29 50 46 -107 -267 -23 -104 21 6 -22 -51 -73 8 97 -95 2 -95 71 118 -170 98 -79
8106 -79 -92 222 -26 56 36 27 -143 123 -41 30 -14 119 8 -172 195 24 52 -64 -4 76 53 -49 -39 32 -9
8131 -9 -11 60 -102 -56 91 15 -30 100 143 21 17 66 -22 30 137 91 -235 27 -59 36 -71 -166 73 -127 -148 54
8157 54 -23 9 7 51 -43 92 82 -106 -101 74 -2 39 -78 -47 126 -17 -56 -30 -85 -110 -17 65 121 -183 124 -50 -53
8184 -53 91 -9 57 -18 23 -51 33
8191C3
$$ Imaginary data points
##PAGE= N=2
##DATA TABLE= (X++(I..I)), XYDATA
0 0 0 0 0 0 0 0 0 0 0 0 0 0 0 0 8 -8 8 -8 8 -16 16 -16 24 -24 32 -37 41 -48 56 -64 73 -85 96 -109 122 -138
36 -138 154 -176 193 -217 241 -267 298 -330 363 -401 444 -489 540 -595 655 -721 794 -878 971
55 971 -1074 1193 -1330 1486 -1672 1897 -2172 2523 -2977 3603 -4520 5997 -8784 15955 -79916
70 -79916 -138854 -59150 -66442 -62754 -60469 -38527 -34240 -11453 16278 48498 54878 40220 -271
83 -271 -26866 -28689 -14467 -15969 -33986 -64785 -83077 -86010 -76431 -58960 -27771 -2979 -2210 -16615
97 -16615 -10383 14051 33874 44415 49254 33763 3427 -16845 -16897 -8760 -3445 -7226 -23864 -45839
111 -45839 -50324 -33547 -15136 -356 13498 16054 2607 -10548 -3123 22913 40503 33075 12939
124 12939 -2226 -7795 -9045 -3392 12860 21720 7886 -13472 -23635 -18683 -2374 14855 18607
137 18607 4163 -13127 -16972 -11433 -4520 9690 25426 22076 1295 -12675 -4471 16522 29998
150 29998 28420 17791 3592 -9702 -16498 -13059 -1159 6298 -1618 -19546 -33365 -29743 -7874
163 -7874 13416 20031 16162 11104 7894 5766 10977 27017 36435 23296 -1550 -20028 -24623 -18739
177 -18739 -10574 -5837 -9017 -19425 -27428 -24573 -9479 12331 28094 27905 16190 5951 6020 13164
191 13164 18694 19989 14333 -2296 -23181 -34048 -26535 -9433 -1587 -6684 -13615 -15643 -11755 -1478
205 -1478 13690 27963 31803 19883 2744 -5306 370 12498 15007 4131 -9814 -20244 -24943
218 -24943 -22798 -12085 4202 11311 2101 -10677 -11209 1633 16638 22825 20112 12137 555 -9304
232 -9304 -10687 -2212 8688 9534 -2982 -17379 -21223 -12620 671 8661 10079 7638 142 -7854
246 -7854 -6754 4643 17038 17146 4178 -8447 -13124 -9939 -2605 4815 8368 5083 -5382 -13352
260 -13352 -10545 1395 13007 14087 4738 -5371 -10011 -8326 -2359 5293 9957 5942 -6459 -15622
274 -15622 -12691 179 11382 12749 6334 -959 -6194 -6793 -1318 7286 12582 7395 -5793 -15952
288 -15952 -14944 -5188 4587 6834 2425 -3116 -7930 -8777 -2481 8619 16737 13508 1747 -6911 -6624
303 -6624 -233 6201 7421 3416 -3890 -12393 -15392 -9589 773 8636 6700 -2300 -8331 -6582 813
318 813 9017 13264 12221 5972 -3307 -8216 -4025 4788 9641 4772 -5419 -12258 -12814 -8521 -583
333 -583 5664 7018 2285 -5873 -8549 -1964 8482 14553 11872 3976 -2621 -5377 -4017 1398 6337
348 6337 6362 -675 -10661 -14548 -8828 487 6267 5752 1408 -3255 -5670 -3514 3633 11241 12339 5675
364 5675 -4032 -8147 -4711 1875 5753 4810 -336 -6348 -10654 -9321 -1633 6537 9111 3459 -4571
379 -4571 -7367 -3618 2169 7007 7926 4253 -2564 -8149 -7617 -660 6145 7912 2631 -4611 -7641 -5183
395 -5183 16 5424 7503 4548 -2211 -8244 -8198 -1925 4456 6030 1664 -4228 -6858 -5357 -653 6112
411 6112 9836 7413 820 -4868 -4761 529 5995 6853 2252 -4414 -8763 -9543 -6466 124 4444 3060
427 3060 -2323 -6466 -4667 2116 8969 11610 8993 3474 -1322 -4159 -2119 2728 5002 1127 -5825
442 -5825 -11417 -11429 -6569 -475 3977 3911 997 -1839 -2062 2272 9484 12847 9803 3378 -3097 -5272
458 -5272 -3855 -752 1115 -682 -5365 -9646 -11083 -6840 1022 6197 6130 2757 -550 -354 2687 6935
474 6935 9877 8515 2522 -4228 -8165 -6419 -1687 1036 -51 -3478 -7211 -8047 -4911 1445 6862
489 6862 7748 4174 -314 -2033 32 4677 6790 5576 1174 -4134 -7080 -6645 -2526 2438 3068 -619
505 -619 -5122 -6716 -3564 2034 5568 5601 2713 -1179 -3722 -3236 1013 5513 6313 2497 -2657 -5915
521 -5915 -4344 294 3875 4410 1607 -3012 -6114 -5329 -1324 3025 3861 1537 -2370 -5400 -3983 504
537 504 5412 7523 5591 857 -2327 -2461 949 4359 4184 1350 -3180 -7136 -7655 -4778 -896 1731
553 1731 850 -2277 -4230 -3091 1801 7086 8884 7282 3906 444 -784 104 2255 2782 53 -5040
569 -5040 -9139 -9476 -6083 -1509 679 517 -682 -2194 -1347 2956 7931 10399 8802 4405 -43 -2162
585 -2162 -1274 673 863 -1398 -5391 -9553 -9931 -6590 -1702 1842 2766 1061 -977 -375 3144 7117
601 7117 8842 7951 4164 -557 -3221 -2524 -893 164 -914 -4292 -7847 -8469 -5089 -739 2232 3424
617 3424 2075 -434 -644 1742 4795 6708 6492 3499 -1111 -3658 -2767 -356 1079 840 -2095 -5689
633 -5689 -6069 -3988 -882 2436 3466 1841 -1247 -2396 -430 2471 4871 5286 2792 -1122 -2610 -1783
649 -1783 257 2166 2467 -22 -3382 -4784 -3866 -1507 1707 2880 505 -2087 -3158 -2018 733 3793
665 3793 4766 3000 241 -1672 -1100 803 3133 3631 1053 -2518 -4412 -4331 -1961 621 1671 -19
681 -19 -2454 -3676 -2744 -137 3151 4932 3368 954 -893 -863 881 3152 3609 1441 -2023 -4233 -4532
698 -4532 -2886 -131 1501 442 -1811 -3024 -2814 -388 3200 4704 3857 1539 -711 -1075 436 2171
714 2171 2873 1474 -1342 -3982 -4633 -2892 -96 1487 1128 -849 -2399 -2359 -300 2636 4291 3560 1337
731 1337 -1048 -2000 -541 1666 2788 1719 -974 -3620 -4084 -2744 80 1877 1919 329 -1494 -2419
747 -2419 -713 1944 3577 3475 1253 -1205 -2264 -1554 486 2079 1505 -252 -2481 -3592 -2412 -83
763 -83 1960 2350 837 -1123 -1999 -1058 1331 2905 2742 1185 -1006 -2502 -1717 25 1533 1613 78
780 78 -2017 -2986 -2171 81 2107 2379 1356 -795 -1938 -1060 766 2319 2693 845 -1297 -2575 -2243
797 -2243 -540 1300 1966 675 -1478 -2867 -2036 95 1829 2785 1632 -135 -1626 -1410 -6 1799
813 1799 2233 1064 -970 -2602 -2563 -791 1057 1834 1097 -625 -1938 -1878 -81 1751 2304 1636 -100
830 -100 -1614 -1611 -578 1122 1846 1038 -923 -2360 -2452 -855 1012 1781 1536 -100 -1633 -1780 -463 1343
848 1343 2285 1837 56 -1547 -1898 -642 882 1781 1329 -366 -1865 -2100 -898 913 2002 1595 243
865 243 -1380 -1758 -490 1028 1927 1762 329 -1227 -1671 -1039 652 1739 1385 45 -1521 -2098 -1253
882 -1253 393 1691 1594 181 -1313 -1620 -1050 672 1860 1631 677 -1014 -1622 -733 352 1586 1704
899 1704 219 -1299 -2040 -1454 -76 1404 1263 582 -920 -1706 -1065 363 1580 2114 885 -383 -1264
916 -1264 -916 292 1327 1427 431 -1198 -1976 -1608 -431 1040 1300 514 -748 -1294 -956 285 1590
933 1590 2066 1344 -244 -1354 -1009 -207 945 1192 176 -1082 -1867 -1889 -742 688 1446 987 -159 -1041
951 -1041 -977 297 1592 2192 1358 -15 -977 -1429 -470 585 1056 246 -997 -1815 -1983 -861 526 1554
969 1554 1022 245 -475 -691 299 1269 1965 1501 -84 -1141 -1584 -820 298 934 140 -584 -1496 -1846 -1019
988 -1019 334 1525 1210 498 -433 -722 -105 1358 1740 1113 325 -882 -1685 -1027 -17 546 511 -333 -1437
1007 -1437 -1901 -1059 581 1319 1297 893 -16 -541 -66 943 1456 1314 378 -791 -1460 -976 -210 454 443
1026 443 -27 -1230 -1459 -903 362 1147 1249 1103 130 -443 -115 744 1255 1255 465 -901 -1464 -1117 -362 305
1046 305 418 -58 -1022 -1440 -1011 208 995 1418 943 -81 -550 -290 292 1131 1221 519 -366 -1333 -1521 -456
1066 -456 386 644 467 -831 -1152 -921 -113 774 1199 1057 245 -588 -423 133 875 1135 762 -335 -1073
1085 -1073 -734 -349 344 714 487 -333 -1055 -1007 -487 404 831 503 10 -667 -630 114 740 1163 937 23
1105 23 -647 -847 -164 485 650 373 -444 -888 -1245 -929 9 467 500 46 -576 -420 245 824 1378 1254 556
1126 556 -310 -599 -211 243 621 274 -537 -1327 -1392 -948 -199 346 534 257 -197 -340 22 1126 1316 1430
1146 1430 625 -275 -681 -525 -134 358 162 -425 -1141 -1394 -1076 -320 632 801 456 -255 -105 -85 810 1135
1166 1135 1343 640 -178 -661 -666 -236 192 471 -168 -868 -979 -804 -308 370 836 550 9 -388 -259 294
1186 294 910 945 507 -259 -690 -672 -497 335 536 104 -411 -773 -778 -295 532 766 378 -45 -434 -519 59 592
1208 592 867 397 -136 -492 -581 -278 148 544 121 -181 -483 -518 -251 420 533 345 -81 -480 -666 -52 352
1229 352 617 478 144 -313 -397 -230 267 554 411 -23 -482 -677 -399 -53 535 271 -172 -462 -604 -288
1249 -288 257 687 606 376 -247 -566 -356 295 538 265 -43 -480 -646 -469 93 417 409 -31 -221 -631 -180
1270 -180 373 644 492 231 -319 -382 -296 67 386 458 119 -372 -382 -439 -6 450 413 159 -2 -432 -355 23
1292 23 318 474 315 -315 -590 -355 -31 237 269 119 -138 -459 -357 191 400 383 249 -151 -576 -494 -222
1313 -222 44 371 152 -252 -672 -511 -147 373 566 465 -40 -351 -229 102 515 273 313 -223 -351 -501
1333 -501 -335 221 332 218 12 -541 -357 -148 342 439 561 171 -167 -261 122 270 599 185 -272 -353 -608
1354 -608 -391 -35 230 54 -272 -516 -362 -23 186 430 348 107 36 -5 -12 352 504 273 -41 -356 -578 -504
1376 -504 -100 186 60 -434 -491 -314 -207 314 394 501 280 213 -73 -10 350 423 380 66 -356 -610 -628 -377
1398 -377 -31 -75 -288 -371 -403 -263 134 615 674 628 201 164 325 409 480 509 177 -348 -677 -877 -595 -319 118
1421 118 -233 -308 -378 -102 217 416 607 505 428 289 227 204 508 316 -52 -305 -501 -665 -475 -340 -234 -147
1443 -147 -323 -343 -97 185 648 773 511 361 -14 181 102 258 187 36 -270 -531 -573 -503 -18 143 -7 -220
1465 -220 -210 -177 178 551 776 472 98 104 -42 148 67 306 81 -202 -505 -446 -361 -212 -20 -162 -64 -203 -334
1488 -334 -124 378 402 440 319 -27 107 -78 188 401 259 116 -341 -338 -372 28 210 48 -288 -334 -534 -365
1510 -365 43 144 323 171 188 -94 197 208 524 352 179 -158 -472 -319 -339 -130 24 -63 -311 -320 -257 63
1532 63 96 292 271 298 109 91 376 547 397 211 -213 -312 -344 -112 -282 -15 -52 -254 -377 -332 53 279 108
1555 108 379 246 126 168 24 183 136 179 -89 -384 -462 -180 -181 -1 -59 -232 -120 -22 80 204 318 324 62
1578 62 -61 144 46 -59 95 144 -17 -219 -241 -168 -13 80 -65 -237 -145 -188 -11 32 433 239 -38 -205 -69
1601 -69 -72 195 344 213 -56 -215 -171 -64 -102 41 192 -246 -139 -103 -147 35 172 234 79 -147 -69 22 43 316
1625 316 216 116 58 71 -72 -115 -22 165 -60 -208 -111 -244 -299 52 261 13 -80 -111 -35 284 286 335 296 25
1649 25 -57 -339 -212 50 -15 -17 -115 -314 -507 46 29 4 91 83 -98 -202 25 251 357 195 65 -157 -219 -131
1673 -131 -46 6 -36 -32 -330 -295 -161 178 233 196 98 -19 32 -159 104 179 336 151 48 -72 56 168 72 -27
1697 -27 -79 -113 -222 -108 -24 -18 131 144 -97 -145 239 106 271 163 -3 97 90 -116 74 -49 124 52 -222 -410
1721 -410 -178 -59 35 56 57 203 -216 17 230 276 264 54 -13 111 -21 43 38 10 136 -199 -310 -68 -81 -67
1745 -67 113 -33 -109 32 239 -12 40 67 74 183 -155 -8 -87 61 83 101 -171 -146 -288 -213 -55 14 113 -60
1769 -60 -113 84 -112 0 93 -22 75 -75 180 -230 69 115 10 -27 -62 6 -166 -26 66 -12 -15 -107 -144 87 -41
1794 -41 149 175 13 -104 -74 -22 199 122 156 46 46 -67 -135 -152 -47 -228 -270 -150 -108 -104 -104 -121 200 46 165 171
1820 171 116 163 70 348 112 -216 -227 -51 -177 -69 -19 -79 -73 -105 -300 88 380 106 -1 184 36 119 202 2
1844 2 115 178 -127 -39 -280 -64 -137 -105 -129 -68 -103 -122 164 192 279 117 -48 -122 260 162 -14 -4 -139 83 -98
1869 -98 -279 -77 -30 63 -57 -95 -46 15 116 -106 122 140 31 93 -47 -111 105 149 121 9 -197 -112 -132 -121 80
1894 80 152 89 -187 -140 25 -113 298 -41 -159 76 39 17 -9 82 99 -5 -26 1 30 107 8 33 -65 -34 -103 -91
1920 -91 -200 -131 -26 144 57 156 158 131 280 98 197 -68 -172 -119 -116 109 8 -202 -217 -129 -112 63 -126 -10 -9
1945 -9 83 104 -68 184 262 323 110 -74 -42 33 -128 -166 -44 -263 -207 -152 -218 -89 31 170 152 118 105 147 46
1970 46 224 100 -124 132 -214 -357 -243 -52 -148 -173 -80 -185 16 88 30 5 120 156 25 50 146 245 89 82
1994 82 192 17 10 7 39 114 -80 -1 -56 -17 70 92 5 -16 20 15 31 -111 65 82 -25 -124 -208 -23 89 -70 -23
2021 -23 121 -106 -161 -63 -201 -133 190 2 -96 -48 90 54 0 35 72 161 24 -78 -94 227 144 -38 -150 -118 -13
2046 -13 -148 -95 -118 -133 8 83 46 162 -21 371 55 93 76 6 -39 -69 -61 31 -187 -441 -148 -261 -39 -110 32
2071 32 -175 61 50 136 112 286 225 45 63 -72 42 -24 -144 10 -121 -27 -248 -253 -177 -50 191 21 -84 234
2095 234 -103 -26 61 88 26 56 103 22 -106 -38 -122 -211 -31 -9 -218 17 -2 51 25 81 9 -138 182 103 128 128 29
2122 29 106 -172 -152 20 -30 61 -88 -207 -114 -93 -35 -135 -38 101 -47 73 17 -18 -130 32 -111 -177 9 31
2146 31 0 122 -29 -120 62 -185 -35 29 30 -93 99 40 91 -32 38 125 145 -103 -29 -147 -101 -30 125 -115 -46
2171 -46 -144 -88 -110 -88 106 -59 -12 -30 -6 9 96 200 -28 -64 36 22 -66 -106 116 -48 2 -102 -58 -70 4 188
2197 188 -13 54 -21 48 -92 -30 -115 139 96 -123 26 217 122 116 -9 7 118 -278 14 13 -76 10 115 -238 -75
2222 -75 -31 -92 75 1 38 25 164 57 -28 -37 65 -37 2 -81 -168 -13 -163 34 37 -40 -168 -5 7 -50 14 127
2248 127 157 -77 20 106 125 124 57 -79 117 -90 -66 -33 -48 -115 -105 93 -13 -99 -62 111 47 -40 -58 28 -7 27 -54
2275 -54 25 -125 -86 -134 -2 100 61 101 78 -108 -105 -15 -277 -101 38 27 -3 -3 -1 -60 103 42 -32 4 -117 1 95
2302 95 15 -93 8 -53 -139 -200 46 -39 -27 159 -52 227 58 -31 103 139 -162 -185 -183 -51 78 28 -150 8
2326 8 -119 -148 -142 7 -83 -19 -108 95 -13 -144 238 30 70 46 128 -114 163 -19 -36 12 -48 27 -138 -32 -77
2351 -77 -23 -143 53 8 -123 59 72 81 96 51 23 167 -36 -51 -77 -159 -125 -16 -132 -30 0 1 242 195 97 20
2377 20 -40 -28 -43 -85 100 -25 -167 -94 23 -1 -56 71 23 -18 134 -7 -61 95 -7 155 109 -3 -3 23 35
2402 35 -106 -28 26 -123 -5 -127 -9 82 37 8 142 178 79 21 -13 -48 44 -115 105 -118 118 91 -33 -25 65
2427 65 -19 42 -107 155 -19 -14 -71 -182 148 -10 -85 -146 49 -86 -48 54 -181 214 10 -14 -101 33 -50 -72
2451 -72 -29 -37 70 -91 120 67 98 74 -31 30 -103 -139 5 -103 -54 -82 103 -110 -60 -84 -1 105 -119 13 -6
2476 -6 -19 77 -135 -74 -35 -5 74 -63 -23 11 70 -24 -208 -42 -38 -77 24 0 177 -14 -60 43 -59 -136 32 -110
2502 -110 142 -57 -182 209 -112 36 12 84 20 -110 66 -80 25 -77 93 111 73 68 -120 117 -215 -97
2524 -97 203 -30 -81 144 -117 79 -101 142 127 16 40 69 118 -149 141 -102 26 -44 57 -220 172 -12
2546 -12 -54 84 91 -22 -32 -184 -48 109 46 -36 -97 -65 -43 26 -51 -72 -85 -87 -77 -156 -40 -311 -120 -4 -39 -86 -135
2573 -135 11 -155 225 81 13 -102 -38 30 -5 1 -43 -19 11 6 -53 -67 31 -130 -27 96 -40 -22 77 -10 -86 71
2599 71 -93 1 -33 -6 -16 93 -22 -171 -111 213 50 -65 -25 205 123 31 -30 129 101 -77 -45 240 -92 13
2623 13 -74 -54 -61 8 59 -24 -20 10 -85 -56 80 -159 41 -10 -123 86 61 71 -91 -169 72 0 -5 23 -116 4 16
2650 16 -59 26 -131 -42 -135 -77 54 53 -31 -1 0 -30 150 -14 102 -44 155 27 0 -82 60 186 127 107 72 -56
2676 -56 174 -60 66 39 61 95 14 92 6 25 42 165 85 149 -141 -64 111 -6 89 220 53 35 -106 -18 90
2701 90 -3 46 -79 -3 120 -171 72 189 84 43 -97 -133 72 -40 11 50 27 -136 -126 68 85 -142 -92 -20
2725 -20 153 114 66 55 -62 11 4 -147 80 23 -193 26 -30 -26 -329 -146 46 104 76 82 -23 65 122 -108 -156 -9
2751 -9 -47 214 -45 166 -160 64 -119 -145 30 -40 -150 -189 42 -14 -41 44 245 123 -30 16 86 -3 39 -170
2775 -170 -229 46 -84 -134 16 -186 -147 -93 -122 -63 69 150 75 3 18 -14 124 -22 194 42 11 -5 155 -128
2799 -128 -42 118 58 -115 29 14 53 -197 -125 20 -44 81 53 48 47 -30 174 68 -27 -44 165 -13 -74 97 -37
2824 -37 -155 -168 -12 -259 46 60 -105 -24 4 -62 70 52 -61 112 22 56 -69 -23 -38 -127 23 20 72 -54 71
2849 71 10 -30 49 40 -5 -3 45 -33 25 3 12 9 39 -80 157 -20 82 93 24 -52 -97 180 -65 -53 -2 136 90 -85
2877 -85 -8 -148 170 196 -77 112 -38 -62 36 -7 -184 -168 67 -140 -64 -146 -70 -88 -27 -157 -40 -160 -16 38
2901 38 -17 -29 118 -46 -41 33 -52 62 -71 93 -132 -58 -43 9 63 -63 -70 92 87 -79 18 -62 23 -44 -33 38 -73
2928 -73 -44 -13 40 -65 -173 11 17 164 16 -221 149 -144 -5 33 -2 -57 106 3 78 36 -106 80 -142 -82
2952 -82 2 145 22 176 101 166 67 -15 -47 -153 101 -104 124 -41 160 87 3 79 -9 3 -42 -28 27 -21 -118 35
2978 35 -95 74 -134 -107 -154 -113 111 73 68 -79 237 -47 13 225 -130 -37 12 113 -13 -79 -29 23 -29 -58 83
3003 83 41 35 -119 -19 -18 134 17 105 0 -27 -89 -92 205 -22 92 -91 -178 -196 -46 -58 -14 -134 73 115 -46
3028 -46 -7 -53 -95 -49 -109 26 -74 -73 63 -91 94 19 153 -130 32 -47 2 -20 31 -102 -99 -201 84 -4 -123
3053 -123 100 142 39 -58 19 59 56 -34 -26 32 25 -44 -27 -154 51 -81 96 -125 -58 -55 -69 81 19 -157 67 28 -106
3080 -106 77 -122 68 -129 130 -70 -74 123 -88 9 -109 -112 -59 -72 17 20 94 194 13 6 -103 -70 3 83 -89
3105 -89 -182 116 -133 -111 101 21 -102 72 33 -217 -187 -34 99 -31 -69 139 -11 -25 -72 -51 -55 118 70 -99
3129 -99 27 -204 -17 101 -99 12 52 75 7 -33 -17 19 78 -137 -34 -13 4 -221 -94 -39 30 10 -3 -219 -99
3154 -99 58 52 73 -18 140 65 97 152 115 -23 60 -29 -222 145 -107 15 -47 -118 -19 -165 180 -142 -92 -104 11
3179 11 -53 79 74 -92 -71 -27 34 -262 -37 -92 215 -77 -90 -83 7 -118 -230 -190 23 152 86 78 164 -11 139 108
3205 108 51 74 -87 -95 98 5 -92 -1 25 5 17 -100 -226 31 -98 -21 -110 95 47 -1 112 -99 -42 -67 -66 26
3231 26 -71 80 -102 54 -53 -159 58 -91 28 32 -83 -30 70 32 194 58 123 -48 52 151 26 -15 12
3254 12 -156 -100 14 -56 -64 75 -35 163 -152 -11 -11 26 172 107 230 -71 -105 -221 -10 44 -58 -71 -19 14 -48
3279 -48 -149 -116 74 12 -75 49 -27 40 45 129 111 -41 27 172 104 229 106 -65 -82 55 -95 -130 32 -81 -52
3304 -52 -125 -97 -46 7 4 75 -35 -36 29 27 -113 -34 129 18 -204 -24 -56 -15 -3 26 -55 -76 18 43 -49 136 -47 -76
3332 -76 58 -29 66 -68 -1 132 -158 28 39 24 69 121 31 31 230 106 -28 42 44 -49 -189 -26 -6 1 59 -70
3358 -70 -24 -66 54 -80 -47 -32 70 96 78 -34 -4 8 -5 -87 37 -54 38 -92 109 26 2 129 21 22 55 6
3384 6 47 -57 -16 10 28 1 -7 -33 139 38 8 -40 58 -4 -110 108 -77 -47 -38 101 22 -37 161 -77 -105 15 -111
3411 -111 -58 92 -107 185 52 175 -41 72 59 -47 248 -129 25 23 -126 -7 36 -67 9 -150 57 107
3433 107 -9 76 -86 -300 93 -58 -9 -18 11 -63 159 91 3 75 20 -24 -50 22 6 -3 40 66 -55 91 -62 -78
3459 -78 33 118 -13 29 -118 -84 -90 180 -43 -108 89 97 30 -216 87 70 219 -108 24 -63 5 -52 2 -18 -101 -18
3485 -18 46 -110 61 107 -184 -27 -80 -71 -157 -62 90 94 123 -77 48 -35 119 -46 235 48 -45 192 -107 -26 -84
3510 -84 -75 -35 -2 51 122 30 43 -25 -116 43 2 -10 136 106 -127 -102 -8 180 -68 -89 -29 1 115 -106 58 -52
3536 -52 109 175 -8 -31 86 89 183 184 76 40 -4 -40 -75 -84 -140 65 9 6 48 160 -87 70 -33 30 -88 -55 4
3563 4 154 68 29 -92 -191 -111 -227 -119 96 -85 111 206 -65 -101 -72 263 73 -4 -78 -183 -142 -2 -60 71
3587 71 76 -53 -153 20 127 39 85 58 73 -127 62 -37 13 187 156 78 -29 -107 -51 112 14 -28 49 -18 -137 11
3613 11 81 -31 271 -40 131 -65 133 154 -150 46 -67 -2 -140 -80 56 49 46 -75 -18 -21 -79 -63 41 -40 69
3638 69 -47 4 -113 -39 31 34 -57 -70 -55 -39 91 -141 -37 66 -37 -118 17 85 -145 71 92 65 189 190 50
3663 50 11 47 85 85 4 -84 -72 43 12 -40 -188 101 17 171 -138 31 -10 -104 -7 4 -39 -17 -29 51 -128 57 14
3690 14 -37 11 -149 -64 -6 -28 55 126 51 -3 8 -2 87 -34 -57 82 -163 21 29 80 -169 -34 -235 -29 82 -48
3716 -48 1 63 294 -8 -24 97 -206 -60 -119 150 -11 17 -24 -2 -188 -135 -76 -49 28 85 79 -151 8 18 -82
3741 -82 104 115 89 -9 -107 44 -59 -22 -66 42 18 -106 55 63 -25 -48 -56 74 -43 205 111 -91 -101 119 31 7
3767 7 -40 -81 67 176 -21 -104 -181 -116 -19 -114 -187 70 1 141 -61 -125 -181 93 153 27 -12 -114 85 32 101 106
3793 106 -36 161 7 60 174 -12 -39 4 -1 -4 128 83 192 56 59 -28 87 76 125 -48 -50 32 -13 131 -9 2
3819 2 -17 23 22 -61 -184 -83 -115 118 30 91 73 -9 -34 152 -65 13 66 -45 58 58 -36 -102 13 -90 -72 -46 151
3846 151 90 9 -101 -168 35 -21 -8 -51 54 8 14 52 -215 -98 18 -71 92 -138 102 64 64 -258 -65 53 -36
3871 -36 54 36 -100 55 81 -72 51 -47 14 41 -84 30 -75 -125 -85 14 -61 -74 -87 -53 109 9 38 -6 104
3896 104 82 -98 -5 24 -22 -23 -64 -70 -46 144 -55 62 -70 -9 14 76 -38 -93 87 -79 0 124 -46 -19 59 70
3922 70 72 17 40 53 -8 -34 61 -99 -67 -24 -70 72 13 -67 -59 25 63 -70 -3 122 -31 -41 -3 74 180 -38 95
3949 95 0 108 -88 -121 100 108 201 163 38 -27 39 195 47 -1 -123 -12 64 138 99 -35 51 -82 -61 -121 -44 22
3975 22 83 80 -216 -18 -113 87 36 12 15 -12 -104 11 -34 -97 44 64 9 47 -64 -93 -88 -35 66 26 65 -160 133
4002 133 59 14 -103 20 40 110 75 -134 37 -123 40 52 -67 -158 69 -37 -60 -53 -62 212 -140 -59 22 -91 49
4027 49 -77 -90 -35 -24 -139 90 154 118 -90 -65 148 67 -92 86 -89 11 88 -139 151 105 -133 -15 -101 153
4051 153 57 -100 -135 92 -165 -126 -1 -5 -101 95 38 -91 -110 105 61 -173 171 39 41 132 103 -168 127 132 -6
4076 -6 -59 -16 75 94 -29 101 -82 60 15 -137 -159 131 44 -121 92 52 -135 -83 188 7 65 -175 -159 -39
4100 -39 -103 37 -100 -77 -96 -207 -98 -197 141 145 -239 31 158 50 -29 -50 -85 0 -93 28 66 -32 -89 -78 32
4125 32 -37 -243 -5 -151 17 19 95 -97 10 212 103 0 -139 10 157 122 93 -78 -6 -95 23 -32 -74 -28
4149 -28 22 -108 -22 41 -2 -88 -68 12 35 169 165 66 -34 89 47 -119 -69 38 177 23 68 -51 -18 50 -34 61
4175 61 36 166 67 12 66 0 -236 70 21 78 -286 -126 -80 -160 -81 -3 53 -46 -8 -209 -9 52 -170 82 -2 -31
4201 -31 68 111 -158 118 92 107 -54 -146 59 -231 83 3 -133 -129 -143 -150 4 -59 238 -129 -53 18 66 -20 23 -43
4227 -43 -8 -140 -9 21 -88 -49 -257 -204 -158 0 -43 81 28 -35 47 -81 -135 126 -123 127 81 16 -97 -41 -24
4252 -24 -107 47 -64 33 104 -18 -37 -2 111 -29 230 205 82 -75 91 57 -4 86 -167 183 -149 -29 115
4275 115 -12 11 119 26 53 -85 150 -156 81 -71 -88 -153 -6 -52 -28 78 81 -90 174 -46 109 39 94 -10
4299 -10 -33 -61 -24 148 203 84 -237 144 -68 -147 -104 34 -235 110 95 16 -17 13 0 15 -129 -46 55 -39 -72
4324 -72 84 -34 -35 -183 38 75 63 110 -37 168 -159 -25 4 -138 -66 -133 -135 -2 -48 22 64 21 13 150 -126 29
4350 29 79 138 173 -255 -83 -13 96 -64 32 46 217 28 120 83 -104 -109 22 56 28 -54 -4 31 112 -29 87 289
4376 289 -40 89 34 -62 -81 41 -164 189 -21 75 -39 -53 49 -11 -13 -59 19 -111 155 170 -56 41 48 5 160
4401 160 -1 -210 49 -39 -231 -10 -58 52 37 -88 -15 -32 17 74 -109 30 131 0 38 -96 -71 -125 93
4424 93 40 164 -76 53 40 -135 62 10 43 -64 -19 33 -48 -76 114 166 68 72 2 -166 -8 -17 78 45 -83 0
4450 0 4 24 46 84 -4 35 -80 -58 -225 25 -21 40 -61 127 127 143 -163 -108 0 131 19 83 40 -62 -13 160
4476 160 -129 79 13 17 110 55 3 -66 -31 -5 -44 63 -83 116 -5 22 57 9 -69 -106 -28 -127 67 -29 -56 -38 5
4503 5 -50 -87 163 -61 -3 75 52 -121 -51 57 105 1 -152 100 -107 146 38 -119 -42 78 160 -32 22 57
4527 57 -52 5 59 -136 42 -27 -158 78 -104 -46 13 102 -64 -74 -39 74 138 -49 -100 -95 -52 60 -30 18 -103
4552 -103 -32 24 -48 -31 -75 18 152 -94 110 97 -5 -17 -78 46 -168 96 -69 33 -20 -116 -11 9 -3 -40 54
4577 54 -95 26 19 -28 -76 112 -78 -123 -83 81 11 -4 51 -67 98 -102 -14 -10 12 44 -66 125 -44 3 -93 -73
4603 -73 -5 -80 -139 64 -82 -101 -17 133 -195 -107 48 -113 -1 -206 64 -109 -5 -57 49 30 -62 -73 16 51
4627 51 34 -65 -143 40 -53 71 -8 -74 -43 66 36 -11 -2 43 -118 34 -48 -112 34 -143 -125 -104 81 23 -98 19
4653 19 8 142 263 37 10 -45 44 141 -173 -89 -10 74 76 54 187 16 -9 -36 6 211 33 106 -56 173 -113
4678 -113 10 -99 248 11 31 101 -14 6 -64 -143 -216 44 -56 -16 -176 -41 -78 -48 33 121 -11 -137 21 -108
4702 -108 -66 90 10 13 71 22 103 97 -50 -32 217 188 52 -26 -73 52 -26 27 -45 -130 46 -197 93 -133 -101 -14
4728 -14 -96 -4 -196 40 -157 -7 5 -189 50 101 -54 -120 -78 101 137 26 -76 87 -118 -202 -108 -74 152 69
4752 69 -56 160 -91 -24 -137 -87 5 178 -114 33 8 -21 -152 93 105 -15 -39 -1 40 -54 22 67 67 -43 65
4777 65 62 -28 -9 87 61 -73 -23 -5 -113 -118 65 92 -111 41 -157 142 -43 67 62 -137 -41 -63 -210 -6 13 -20
4803 -20 -66 -20 -15 108 -17 -18 58 -12 21 -204 -95 -50 -52 -131 -11 -212 -10 -69 -24 -39 -134 -41 46 -7 -13 138 -38 88
4831 88 98 -61 -44 -6 -110 16 199 -125 -54 72 -81 66 -6 -62 -69 -47 -150 35 -204 -92 -118 8 74 54
4855 54 -96 112 -11 75 -189 -28 42 -35 -251 -3 159 105 -36 10 -109 -18 -43 36 -91 -126 165 34 13 -46
4879 -46 80 74 44 -13 23 -109 32 88 41 163 105 110 -42 -123 18 -97 -105 50 -18 6 -21 -37 -16 36 -37 -137 -106
4906 -106 -132 -95 -124 -26 -56 6 91 58 5 -156 -30 -83 72 146 41 3 68 -68 93 45 68 33 -123 154 -20
4931 -20 60 -59 -2 64 -121 -89 -194 -15 -15 -16 -164 8 -15 -85 -107 -12 2 -70 -125 22 -98 -40 161 -258 25 7
4957 7 52 9 109 -49 -42 -40 -67 -17 -76 155 17 -40 278 68 51 -124 157 -138 -105 -58 -90 -6 -124 111 -151 11
4983 11 -67 152 34 27 77 33 -199 112 -139 -26 52 63 148 56 84 19 -44 -100 -54 -38 -36 -67 199 -91 -193 63
5009 63 -67 209 -103 80 -46 -76 -58 -65 -170 -7 -28 -63 52 4 -99 6 -31 27 149 31 46 -186 -157 3
5033 3 107 -52 53 -182 -138 47 -35 -69 -58 -31 34 45 -3 152 134 160 65 24 28 0 57 -183 -62 -86 -16 -11 -117
5060 -117 68 -107 -10 -65 78 -70 125 -123 -21 21 -64 29 73 -18 154 -133 189 -9 -42 -126 -72 18 23 -73 -181
5085 -181 -19 44 19 -6 -81 60 77 78 19 44 24 -116 103 105 -152 -85 38 92 -7 -17 70 -5 90 52 -5 59 -103
5112 -103 29 -137 68 109 96 -93 -118 -298 -2 13 192 108 -55 -6 -140 -67 131 3 -176 -139 147 -20 132
5135 132 5 79 61 87 20 -155 -206 192 -48 11 112 -63 -18 -42 71 120 63 -29 -34 -97 88 155 -10 -52 14 -125
5161 -125 -72 -10 -13 -59 124 52 91 -76 140 -49 -88 6 -63 -64 208 68 80 -144 -78 -23 185 23 11 55 -118 -61
5187 -61 46 -67 66 -166 43 -66 -17 150 -37 33 -42 -146 53 25 15 56 71 189 -187 60 -110 -31 76
5210 76 61 -32 46 57 27 8 172 120 -19 29 -16 47 -186 -49 -62 -44 33 47 -32 15 17 -99 20 -45 44 57 158
5237 158 -18 -39 15 -91 -111 -40 -13 93 7 37 -117 -124 60 68 106 137 62 -164 64 106 157 76 146 46 76 52 2
5264 2 -10 -41 7 -115 -215 6 -9 118 -72 -23 141 -6 -100 11 -158 -30 -135 -167 17 46 139 16 13 -21 -53
5289 -53 112 84 197 -119 -106 -35 -10 143 -73 23 -73 31 -38 9 -6 45 67 46 -10 -99 14 -182 19 72 -79
5314 -79 -54 -22 90 11 -21 57 -95 -81 22 180 69 -28 -43 -112 12 15 225 127 -134 38 -31 58 27 37 224 147
5340 147 221 146 43 111 -35 13 -24 -112 144 131 -80 38 -76 -110 -101 -74 11 85 21 -23 -2 18 61 15 2 98 29
5367 29 50 57 -5 261 -3 67 209 -18 75 -79 110 -37 105 -155 49 74 -39 -39 -8 -108 -71 0 84 -39 -22
5392 -22 -120 -78 2 -97 -71 46 -132 76 116 -103 -53 -90 12 1 74 13 -92 -27 -8 99 -14 -44 -101 -161 113 -36
5418 -36 -53 -103 108 70 103 108 49 69 55 -18 -49 102 38 61 70 85 7 -194 -131 65 218 -1 -189 9 -32 -10 95
5445 95 53 2 -43 99 -115 -79 1 -112 156 42 189 -36 117 -42 -113 13 -179 -47 53 -31 -217 151 41
5468 41 63 -7 -21 51 -109 111 -1 122 -182 4 44 -95 28 15 70 60 -38 111 -16 -7 -33 109 -7 49 -216
5493 -216 51 -104 -134 74 91 101 -56 -123 44 44 -87 77 -46 54 165 60 147 157 -151 56 136 38 -53 -44
5517 -44 16 65 9 173 92 85 -48 -173 45 -95 -104 -49 -14 -26 143 58 75 158 -69 166 170 -56 -57 188 55 127 10
5544 10 -70 -6 -139 -167 4 34 -6 93 65 109 49 69 -52 47 -27 67 7 31 -15 -72 5 53 15 -10 -132 46 -50 93
5572 93 -159 -75 24 -33 4 -199 50 13 -70 -125 54 -53 70 68 -58 12 32 27 96 6 -26 -142 -39 -110 66 -61
5598 -61 83 56 116 2 43 53 -64 -22 -184 -32 -189 125 21 64 235 38 -126 -41 -22 162 -40 -118 -84 28
5622 28 123 47 24 1 -40 -27 227 -104 240 68 118 -22 53 152 -65 89 -39 -260 119 26 -75 -1 -158 -100
5646 -100 -52 90 80 -120 60 12 -105 -7 -11 -76 9 125 -23 -20 29 38 -132 25 -43 82 106 40 184 12 -110
5671 -110 0 -51 -13 -96 84 -8 9 -100 -97 -126 -77 -90 -144 110 59 -6 40 -32 68 -27 31 -37 -195 47 20 -145
5697 -145 64 16 -81 61 10 -5 -17 -33 21 43 -30 75 60 90 -71 1 53 6 -119 -178 -112 -197 -67 138 20 -1
5723 -1 -41 -188 -76 -276 55 77 47 58 -149 51 61 -13 -82 -24 57 -251 5 -24 -30 124 -180 -44 -185 -154 -77
5748 -77 -4 134 88 65 27 171 -29 47 186 38 102 15 91 18 -182 -79 -81 26 30 74 -121 32 -14 20 -87 -27
5774 -27 110 -70 67 145 -51 36 -23 34 -50 10 -36 108 -85 -34 -80 -43 127 71 88 -135 -105 -5 -19 0 -51 39
5800 39 15 -57 -34 48 -83 -106 82 179 -64 -228 42 138 150 -48 -74 -21 74 -10 75 -109 -31 -27 109 72 18 -72 -224
5827 -224 59 0 -41 -57 96 44 -120 106 113 -19 -6 176 37 -38 -26 66 67 -117 114 -7 264 126 8 62
5851 62 20 -22 30 -7 -69 -131 52 133 -46 215 240 4 -195 -44 65 43 -11 -169 -78 51 19 20 -94 -57 42 -40
5877 -40 -73 170 0 -4 -68 -13 230 -106 41 61 -13 72 55 26 -71 11 133 -53 -48 -169 -49 -152 -113 -121 14 -75
5903 -75 -100 -41 -112 -143 -187 -210 -137 -29 -90 40 -61 -120 5 -74 -67 -58 -15 -9 80 84 -39 -143 112 -31 183 48 -66
5930 -66 -50 85 -65 154 172 -13 9 11 -63 147 -97 72 -119 -144 83 -159 75 -75 -164 -34 -74 -163 72 27
5954 27 -13 -104 30 -131 -110 102 27 -13 -3 -47 -111 -23 84 -15 61 51 -61 -86 49 -46 -131 -33 -61 -64 -159 159 -51
5981 -51 -41 119 -1 1 107 119 19 -129 -80 8 51 151 -92 -52 -50 8 35 49 -6 -88 -6 -8 24 112 -45 -21 21 -84
6009 -84 196 -23 -171 43 55 66 94 -70 -24 0 108 -23 124 -108 -68 62 54 45 45 78 -45 9 -104 -111 -45 -139
6035 -139 81 47 11 34 -149 154 -78 140 44 -90 -83 77 -47 -109 108 184 179 18 267 35 99 15 -154 -140
6059 -140 84 75 54 0 -12 36 50 93 33 -60 -63 73 -132 49 109 -65 -194 -70 -87 -69 -94 22 -27 192 -32 -32
6085 -32 8 -39 -139 29 128 -108 -56 118 -135 41 159 -133 90 -49 129 177 -111 93 56 84 -79 20 -18
6108 -18 -81 37 1 -241 -7 -9 -72 -113 -47 -17 -94 9 -149 -26 12 -19 -24 -101 -96 9 59 -35 70 196 103 106 100 -36
6136 -36 55 36 153 12 -51 -49 65 -183 19 -95 43 102 28 -8 -38 -39 21 6 -151 -23 87 11 43 146 -62
6161 -62 60 19 -10 -99 49 54 40 -182 -75 37 -97 194 -79 -104 168 19 -35 -117 -103 -68 -56 2 109 -38 -9
6186 -9 -78 4 -59 104 54 68 -20 38 115 -18 -73 -172 30 82 82 -6 -128 -25 100 -13 10 -105 11 -6 -79 133
6212 133 38 -31 71 57 -87 -164 69 -15 -117 11 142 -18 -2 -43 -209 231 141 -29 -65 122 65 99 39 -161
6236 -161 -111 -88 -8 -77 114 84 -56 -40 57 29 25 62 114 -129 -130 80 -5 -66 11 89 102 -26 -106 19 -76 -74 1 42
6264 42 -91 -43 15 -101 109 -11 5 -8 12 -56 -128 36 112 72 131 72 6 -63 -185 -160 -161 -36 -109 -175 -99 -146 -108
6291 -108 -114 129 -57 26 -54 -45 -40 -24 23 -22 87 20 -40 -42 9 58 186 71 42 -67 -17 -91 -57 -23 -56 -96 116 45
6319 45 -116 4 -77 28 -239 -64 91 34 7 81 45 42 144 54 64 -49 -165 -40 -215 131 131 122 91 119 36 -37
6345 -37 83 90 -110 6 -12 -28 -61 130 -36 22 -102 -65 92 -107 80 -5 23 7 -96 -81 11 -39 12 21 -39 -67
6371 -67 83 -188 100 127 43 -84 30 -47 142 -7 46 -3 -15 48 65 116 -21 20 -29 34 -52 -15 -53 -106 -247 -116
6397 -116 -14 -60 -150 133 105 68 88 -62 -41 -144 45 -17 18 -65 134 26 -2 -41 -22 124 -19 207 29 43
6421 43 -27 85 69 196 9 106 130 45 58 -113 74 -65 -87 -13 56 -104 -38 113 -14 -90 151 -129 -15 8
6445 8 17 25 -121 -34 -66 6 78 20 164 45 9 213 -124 -69 -32 135 -36 -15 123 -186 105 -54 11 68 12 -5
6471 -5 -73 -8 -59 -26 -65 70 -196 80 80 24 205 -66 -108 38 203 -119 -113 -1 -193 -106 156 1 34 -100 -80
6496 -80 7 -62 -64 -80 47 -11 37 -81 -106 -13 49 94 57 78 90 11 128 5 4 -17 74 -5 12 73 -3 192 -1 34
6524 34 -70 -39 -89 -146 147 22 -53 -80 35 -46 65 -152 -74 112 54 -74 82 16 -17 -35 158 -19 82 -53
6548 -53 -205 126 109 -57 68 54 2 -95 -29 -21 -71 -14 -11 -119 165 -20 -33 106 119 49 -15 -141 121 28 34 -162
6574 -162 -174 -198 -7 -6 -65 35 -106 61 81 108 -120 -79 -4 -85 -74 30 -107 30 -65 119 49 -155 154 131 -87
6599 -87 96 -67 34 -110 -60 13 -21 -102 -14 -118 -132 -88 -82 -56 -39 58 -223 49 125 65 -16 -60 33 -14 13 -142 147
6626 147 -56 97 -186 -2 198 43 105 96 -32 -52 -130 21 71 80 -6 118 154 142 -71 -72 6 -38 66 5 87 48
6652 48 -61 57 61 -6 43 -48 12 111 24 -236 -59 -114 65 -170 142 -55 -25 56 150 22 -57 142 89 64 -67
6677 -67 -21 38 -12 -13 56 15 93 -171 68 -104 -183 -61 -38 -69 -20 86 95 -183 12 -6 -34 -13 39 -125 -83 -176 -3
6704 -3 74 72 6 80 98 31 -50 -70 80 95 134 -63 86 55 33 47 -64 14 27 -140 -1 136 -4 94 -180 -135 18
6731 18 -305 37 -31 -80 -100 -50 -89 -143 65 177 75 -199 7 -5 -10 -126 -48 5 13 32 -129 48 -49 12 39 -95
6757 -95 41 -106 -161 80 68 72 44 -80 -123 33 69 -49 64 -65 -25 27 3 -91 42 -28 -67 -136 71 0 -164
6782 -164 10 29 187 148 -63 -48 7 -61 -8 79 -116 112 -53 58 -43 -48 81 50 -13 -69 17 144 -12 -52 -103
6807 -103 76 -19 -260 7 62 5 -24 -68 -24 -56 3 78 -52 6 150 -183 -61 103 -97 -115 -2 -103 -96 28
6831 28 -42 -25 23 40 123 44 -12 19 6 -91 17 21 -26 -88 75 159 -11 -169 -13 142 163 225 -184 3 -27 -17 -90
6858 -90 77 99 -170 -58 -115 18 150 53 43 35 119 41 -65 124 76 -75 -6 53 -18 58 -286 79 32 1 -60 195
6884 195 -123 -70 86 -55 52 141 196 -74 59 133 -3 -53 -138 -46 -124 -109 148 69 -66 -61 -85 -105 -8 -23 165
6909 165 2 -57 5 -33 -55 -14 91 86 39 58 88 53 -10 56 55 106 114 123 60 19 101 -182 59 -151 -71 -92 39 68 67
6938 67 83 -34 -97 -54 -41 -53 -68 -51 -81 43 -20 -86 -36 -131 130 -71 104 142 109 -25 154 -72 36 1 15 -27
6964 -27 -6 44 59 -4 -199 -85 160 37 -86 -72 -5 37 -170 -103 158 -58 -2 -19 -103 41 -135 -48 120 53 -32
6989 -32 1 -3 -74 -5 -193 -131 -126 -27 42 -14 19 -4 38 102 -100 -43 -147 -45 -73 -21 -128 -57 126 18 -13 46 -89
7016 -89 123 -5 -16 128 37 75 -88 -22 44 -16 -59 -40 -97 43 88 87 4 -57 -110 -202 76 4 67 90 19 122 -99
7043 -99 26 -66 19 32 -111 74 61 40 -68 -133 6 -33 178 -16 56 -30 84 3 -200 -109 93 39 84 -37 -96
7068 -96 93 -146 54 -162 68 -11 -15 38 -19 -29 19 -36 -95 -102 -68 -28 141 74 -112 -74 71 43 69 36 37 13 -17 23
7096 23 -119 3 -165 -103 61 43 56 -14 -23 -74 66 -2 -139 12 146 -139 28 -125 -167 -80 -29 5 -32 -80 -143
7121 -143 62 -140 94 -23 23 -16 46 11 83 1 93 8 -37 39 91 156 96 88 7 73 -114 -66 -4 6 -18 -85 55
7148 55 -32 -54 -112 -102 -44 -106 -202 -12 -72 -46 -69 -138 13 -123 -3 -72 85 -53 -20 85 -43 117 173 40 -33
7173 -33 -57 -62 -51 80 118 165 -134 76 180 71 -6 -114 -25 -125 22 79 -113 31 0 -66 -29 -227 -17 35 -2
7198 -2 43 56 85 52 43 47 79 -24 -11 -80 121 105 -22 34 -29 -26 60 -56 40 -29 -2 121 76 -37 25 22 41 56 -35 -20
7228 -20 48 -9 -175 95 12 -111 -6 -215 23 56 -139 94 -113 -119 -122 38 15 -6 -96 28 67 114 -51 -62 6
7253 6 -109 -13 -134 82 45 99 41 -46 52 -65 -16 -100 45 51 35 -117 95 8 59 61 -1 -147 -15 167 53 -60
7279 -60 135 -46 -89 -100 -75 -12 -316 34 -41 141 -2 -56 27 -4 22 -39 71 -21 -35 -44 12 -58 -5 243 -148 54
7305 54 49 152 -5 -81 -158 56 -68 25 70 -13 -26 132 -18 55 -9 -15 24 -118 -73 -118 158 -120 -11 -105 185 -65
7331 -65 7 159 -113 -109 32 -8 103 116 5 15 -40 55 -70 45 -55 26 56 188 -252 3 -13 -51 6 63 140
7356 140 -29 -96 156 -11 53 -39 70 31 29 81 -210 -122 31 -20 -114 -124 -30 -43 -168 -29 -96 -51 29 -112 62
7381 62 90 42 142 -157 -87 119 50 137 108 -19 2 -86 141 -46 54 61 -23 -101 -74 -112 -26 -86 52 49 105 -8 -87
7408 -87 62 -45 73 -139 8 -46 71 11 21 11 -165 -143 -5 57 35 106 -14 -11 25 -115 -78 -52 29 -18 26 -59
7434 -59 -72 61 102 -62 42 8 -23 158 -151 176 23 -79 22 50 -135 -14 -214 49 -77 -83 -163 40 -13
7457 -13 -70 -123 50 3 3 72 -15 -42 65 -14 58 -98 96 -66 39 -89 86 -20 58 -28 -8 15 27 161 45
7482 45 124 29 86 -118 83 41 52 -89 -30 -68 -53 117 54 -50 1 142 2 68 -99 -60 -52 -8 -81 -169 18 9 -111
7509 -111 24 16 41 -8 19 -42 -41 58 -56 16 -81 -103 47 261 29 -14 19 75 113 11 6 -46 -75 -140 -46 65 39 -90
7537 -90 6 82 211 65 67 -90 29 149 -36 -4 19 46 98 -25 -38 18 -61 119 -104 -23 145 6 -64 -43 130
7562 130 72 206 -173 -117 166 33 -18 -175 -162 -177 85 26 18 67 -50 120 -52 -34 -28 126 -6 82 -65 -119 -50
7587 -50 89 117 -39 4 9 37 22 97 -2 23 75 -62 -50 -44 -54 -12 -239 -125 108 -97 89 -51 -50 50 -64 -81
7613 -81 -22 153 -32 39 28 45 41 77 -215 -74 20 48 11 10 -107 19 95 -15 53 -112 70 -3 -52 -207 86 52
7639 52 -286 55 -29 -4 -57 123 -25 -13 -40 -70 13 72 -153 56 -137 -28 -68 -109 52 36 -61 -96 3 90 -241
7664 -241 -11 -25 -195 79 19 146 36 -65 -47 8 35 -7 63 10 54 -19 31 236 105 109 -181 49 -7 -75 29
7689 29 39 -9 -177 33 113 -79 -124 50 -18 -100 -59 -70 91 20 -124 1 -22 145 -28 13 10 -8 58 -51 29 111
7715 111 -44 110 -52 176 172 -4 155 -87 15 13 44 -8 26 18 -75 53 -119 83 43 -1 141 -12 -63 -59 25
7740 25 109 124 -256 67 -71 164 48 13 -221 -45 -15 -32 33 98 13 -156 53 -8 53 -37 -44 151 -133 27 96
7765 96 -36 87 -82 14 -121 10 118 -184 22 3 -21 -79 221 51 64 153 -107 -29 19 -54 -4 95 -225 -43
7789 -43 59 -134 -41 52 -102 72 -94 -222 -137 -53 38 30 -17 -31 185 18 3 11 50 -86 -65 -73 151 55 -49 100
7815 100 -4 7 -213 -118 -66 -53 -119 20 93 -88 94 -109 -81 133 13 107 33 152 31 -51 -178 95 48 52
7839 52 96 43 -52 67 -77 -16 -3 112 157 24 -33 -17 -31 -73 -170 25 85 -64 -70 41 -49 -66 -34 -16 137 70 113
7866 113 -39 38 11 190 -135 -38 19 -255 89 -164 33 53 -208 -41 -181 54 145 -80 67 -2 -10 -30 156
7889 156 22 -84 226 100 137 156 20 167 58 65 99 -58 -71 -19 126 38 -32 95 44 -138 -148 -9 -100 -215
7913 -215 99 -17 30 -109 3 -13 -27 119 -47 15 75 -97 -86 13 33 -20 -19 -40 115 -158 -23 -6 -17 71 197
7938 197 -114 20 33 105 -157 6 -195 -113 -30 2 103 -42 -57 -124 56 88 -108 14 38 62 131 -34 -17 67
7962 67 -47 -40 108 97 -14 30 139 -21 -74 148 78 -4 -155 54 59 -82 -31 49 -128 -16 33 -34 -43 -111 83 313
7988 313 -43 40 -25 -93 106 46 189 46 105 35 -36 118 65 -190 -76 132 -37 -28 -89 -169 32 61 89 51 102
8013 102 -123 73 -73 -18 11 66 -44 148 -67 28 -11 134 -53 10 -118 7 -5 30 165 -209 39 -94 -13
8036 -13 49 93 -8 73 -178 224 25 -20 59 83 -92 -11 117 93 40 134 182 139 29 -89 44 -76 -32 -13 60
8061 60 124 61 -43 38 -75 58 20 -65 -109 79 -36 102 1 77 35 139 42 -59 -83 10 20 24 30 18 68 -73
8087 -73 2 -125 29 98 -36 -101 30 -94 29 212 127 -36 55 -41 136 -14 -26 34 212 35 98 131 29 3
8111 3 39 -202 -54 -38 16 28 -106 86 121 -37 109 25 -107 121 -162 50 30 113 49 -140 -87 -23 -20 -34 36 94
8137 94 -183 -46 -145 -47 -159 83 -25 114 27 41 145 -158 -80 70 17 -39 -109 177 -85 52 14 135 73 -13
8161 -13 -108 -90 -3 -86 -19 74 -53 -106 46 -123 -141 -12 20 4 -28 -24 5 -74 67 52 122 -102 133 -129 -158 168
8187 168 -206 5 8 -29
8191b9
##END NTUPLES=NMR FID
##END=
