##TITLE=1H_Pr NCO-32
 200.13Hz, CDCl3
 8 sc
30.8.7.2026
##JCAMPDX= 6.0         $$ Bruker NMR JCAMP-DX V2.0
##DATA TYPE= NMR FID
##DATA CLASS= NTUPLES
##ORIGIN= UXNMR, Bruker Analytische Messtechnik GmbH
##OWNER= pz
$$ XWIN-NMR		Version 3.5
$$ Thu Jul 30 14:37:37 2026 Russian Standard Time (UT+4h)  she@DPX200
##.OBSERVE FREQUENCY= 200.1313
##.OBSERVE NUCLEUS= ^1H
##.DELAY= (6, 6)
##.ACQUISITION MODE= SIMULTANEOUS
##.ACQUISITION SCHEME= undefined
##.AVERAGES= 8
##.DIGITISER RES= 18
##SPECTROMETER/DATA SYSTEM= spect
##.PULSE SEQUENCE= zg30
##.SOLVENT NAME= CDCl3
##.SHIFT REFERENCE= (INTERNAL, CDCl3, 0, 14.3821)
##AUDIT TRAIL= $$ (NUMBER, WHEN, WHO, WHERE, WHAT)
$$ ##TITLE= Audit trail, XWIN-NMR		Version 3.5
$$ ##JCAMPDX= 5.01
$$ ##ORIGIN= Bruker BioSpin GmbH
$$ ##OWNER= she
$$ F:/spectra/data/she/nmr/H-C/1/audita.txt
$$ ##AUDIT TRAIL=  $$ (NUMBER, WHEN, WHO, WHERE, WHAT)
(   1,<2026-07-30 14:36:17.78 +0400>,<she>,<DPX200>,
      <created by zg, POWCHK disabled, PULCHK disabled
       configuration hash MD5:
       00 E9 B6 7A A2 85 ED C7 34 08 36 98 17 FE 4E 26
       data hash MD5: 16K
       2D 5F DE E9 2A 68 B6 DD F4 71 DB CA AC 00 54 50>)
$$ ##END=
$$ 
$$ hash MD5
$$ A1 FF 81 C9 3B FD 80 BF F3 94 67 67 91 CC F5 E2
##$RELAX= 
##$RELAX= 
##$RELAX= 
##$RELAX= 
##$RELAX= 
##$RELAX= 
$$ Bruker specific parameters
$$ --------------------------
##$DU= <F:/spectra>
##$EXPNO= 1
##$NAME= <H-C>
##$PROCNO= 1
##$TYPE= <nmr>
##$USER= <she>
##$AMP= (0..31)
100 100 100 100 100 100 100 100 100 100 100 100 100 100 100 100 100 100 
100 100 100 100 100 100 100 100 100 100 100 100 100 100 
##$AQSEQ= 0
##$AQ_mod= 1
##$AUNM= <au_zg>
##$AUTOPOS= <>
##$BF1= 200.13
##$BF2= 200.13
##$BF3= 200.13
##$BF4= 200.13
##$BF5= 200.13
##$BF6= 200.13
##$BF7= 200.13
##$BF8= 200.13
##$BYTORDA= 1
##$CFDGTYP= 0
##$CFRGTYP= 5
##$CHEMSTR= <none>
##$CNST= (0..31)
1 1 145 1 1 1 1 1 1 1 1 1 1 1 1 1 1 1 1 1 1 1 1 1 1 1 1 1 1 1 1 1 
##$CPDPRG= <>
##$CPDPRG1= <>
##$CPDPRG2= <>
##$CPDPRG3= <>
##$CPDPRG4= <mlev>
##$CPDPRG5= <mlev>
##$CPDPRG6= <mlev>
##$CPDPRG7= <mlev>
##$CPDPRG8= <mlev>
##$CPDPRGB= <>
##$CPDPRGT= <>
##$D= (0..31)
0 0.7 0 0 0 0 0 0 0 0 0 0.03 0 0 0 0 0 0 0 0 0 0 0 0 0 0 0 0 0 0 0 0 
##$DATE= 1785407777
##$DBL= (0..7)
120 120 120 120 120 120 120 120 
##$DBP= (0..7)
150 150 150 150 150 150 150 150 
##$DBP07= 0
##$DBPNAM0= <>
##$DBPNAM1= <>
##$DBPNAM2= <>
##$DBPNAM3= <>
##$DBPNAM4= <>
##$DBPNAM5= <>
##$DBPNAM6= <>
##$DBPNAM7= <>
##$DBPOAL= (0..7)
0.5 0.5 0.5 0.5 0.5 0.5 0.5 0.5 
##$DBPOFFS= (0..7)
0 0 0 0 0 0 0 0 
##$DE= 6
##$DECBNUC= <off>
##$DECIM= 32
##$DECNUC= <off>
##$DECSTAT= 4
##$DIGMOD= 1
##$DIGTYP= 9
##$DL= (0..7)
0 120 120 120 120 120 120 120 
##$DP= (0..7)
150 150 150 150 150 150 150 150 
##$DP07= 0
##$DPNAME0= <>
##$DPNAME1= <>
##$DPNAME2= <>
##$DPNAME3= <>
##$DPNAME4= <>
##$DPNAME5= <>
##$DPNAME6= <>
##$DPNAME7= <>
##$DPOAL= (0..7)
0.5 0.5 0.5 0.5 0.5 0.5 0.5 0.5 
##$DPOFFS= (0..7)
0 0 0 0 0 0 0 0 
##$DQDMODE= 0
##$DR= 18
##$DS= 0
##$DSLIST= <SSSSSSSSSSSSSSS>
$$ [...]
##$SUBNAM0= <"">
##$SUBNAM1= <"">
##$SUBNAM2= <"">
##$SUBNAM3= <"">
##$SUBNAM4= <"">
##$SUBNAM5= <"">
##$SUBNAM6= <"">
##$SUBNAM7= <"">
##$SUBNAM8= <"">
##$SUBNAM9= <"">
##$SW= 18.0517328524113
##$SWIBOX= (0..15)
0 0 2 0 0 0 0 0 0 0 0 0 0 0 0 0 
##$SW_h= 3612.71676300578
##$TD= 16384
##$TD0= 1
##$TE= 0
##$TE2= 300
##$TE3= 300
##$TEG= 300
##$TL= (0..7)
0 120 120 120 120 120 120 120 
##$TP= (0..7)
150 150 150 150 150 150 150 150 
##$TP07= 0
##$TPNAME0= <>
##$TPNAME1= <>
##$TPNAME2= <>
##$TPNAME3= <>
##$TPNAME4= <>
##$TPNAME5= <>
##$TPNAME6= <>
##$TPNAME7= <>
##$TPOAL= (0..7)
0.5 0.5 0.5 0.5 0.5 0.5 0.5 0.5 
##$TPOFFS= (0..7)
0 0 0 0 0 0 0 0 
##$TUNHIN= 0
##$TUNHOUT= 0
##$TUNXOUT= 0
##$USERA1= <user>
##$USERA2= <user>
##$USERA3= <user>
##$USERA4= <user>
##$USERA5= <user>
##$V9= 5
##$VALIST= <valist>
##$VCLIST= <CCCCCCCCCCCCCCC>
##$VD= 0
##$VDLIST= <DDDDDDDDDDDDDDD>
##$VPLIST= <PPPPPPPPPPPPPPP>
##$VTLIST= <TTTTTTTTTTTTTTT>
##$WBST= 1024
##$WBSW= 4
##$XGAIN= (0..3)
0 0 0 0 
##$XL= 0
##$YL= 0
##$YMAX_a= 166893
##$YMIN_a= -150871
##$ZGOPTNS= <>
##$ZL1= 120
##$ZL2= 120
##$ZL3= 120
##$ZL4= 120
##$ABSF1= 10
##$ABSF2= 0
##$ABSG= 5
##$ABSL= 3
##$ALPHA= 0
##$AQORDER= 0
##$ASSFAC= 0
##$ASSFACI= 0
##$ASSFACX= 0
##$ASSWID= 0
##$AUNMP= <proc_1d>
##$AZFE= 0.1
##$AZFW= 0.1
##$BCFW= 1
##$BC_mod= 2
##$BYTORDP= 1
##$COROFFS= 0
##$CY= -3
##$DATMOD= 1
##$DC= 2
##$DFILT= <>
##$DTYPP= 0
##$F1P= 0
##$F2P= 0
##$FCOR= 0.5
##$FTSIZE= 0
##$FT_mod= 4
##$GAMMA= 1
##$GB= 0.15
##$INTBC= 1
##$INTSCL= 1
##$ISEN= 128
##$LB= 0.25
##$LEV0= 0
##$LPBIN= 0
##$MAXI= 10000
##$MC2= 0
##$MEAN= 0
##$ME_mod= 0
##$MI= 1.114404
##$NCOEF= 0
##$NC_proc= 0
##$NLEV= 6
##$NOISF1= 3.799351
##$NOISF2= 2.8
##$NSP= 1
##$NTH_PI= 0
##$NZP= 0
##$OFFSET= 14.38212
##$PC= 1
##$PHC0= -4218.896
##$PHC1= 10.3923
##$PH_mod= 1
##$PKNL= yes
##$PPARMOD= 0
##$PSCAL= 0
##$PSIGN= 0
##$REVERSE= no
##$SF= 200.129724274929
##$SI= 16384
##$SIGF1= 3
##$SIGF2= 2
##$SINO= 400
##$SIOLD= 16384
##$SREGLST= <1H.CDCl3>
##$SSB= 0
##$STSI= 0
##$STSR= 0
##$SW_p= 3205.1282051282
##$SYMM= 0
##$S_DEV= 0
##$TDeff= 0
##$TDoff= 0
##$TI= <>
##$TILT= no
##$TM1= 0
##$TM2= 0
##$TOPLEV= 0
##$USERP1= <user>
##$USERP2= <user>
##$USERP3= <user>
##$USERP4= <user>
##$USERP5= <user>
##$WDW= 1
##$XDIM= 8192
##$YMAX_p= 0
##$YMIN_p= 0
$$ End of Bruker specific parameters
$$ ---------------------------------
##NTUPLES= NMR FID
##VAR_NAME=  TIME,          FID/REAL,        FID/IMAG
##SYMBOL=    X,             R,               I
##VAR_TYPE=  INDEPENDENT,   DEPENDENT,       DEPENDENT
##VAR_FORM=  AFFN,          ASDF,            ASDF
##VAR_DIM=   8192,          8192,            8192
##UNITS=     SECONDS,       ARBITRARY UNITS, ARBITRARY UNITS
##FACTOR=    0.0002768,     1,               1
##FIRST=     0,             0,               0
##LAST=      2.2672688,     0,               0
##MIN=       0,             -150871,         0
##MAX=       2.2672688,     166893,          0
$$ Real data points
##PAGE= N=1
##DATA TABLE= (X++(R..R)), XYDATA
0 0 0 0 0 0 0 0 0 0 0 0 0 0 0 0 0 -8 8 -8 8 -8 14 -16 16 -23 24 -29 32 -40 46 -51 58 -68 77 -87 99 -111 126
37 126 -140 157 -175 195 -219 242 -267 297 -329 361 -399 439 -482 532 -584 644 -708 781 -864
56 -864 955 -1060 1178 -1318 1485 -1683 1929 -2236 2640 -3191 3988 -5244 7483 -17497 166893
71 166893 144667 -113652 -122063 15540 60385 -1131 -2814 13582 -25816 -23590 33891 66733
83 66733 15079 -55000 -28840 48271 76966 3428 -34704 2877 16286 -5635 -10965 14576
95 14576 -8211 -24847 20016 22531 -32384 -38359 33954 29032 -37335 -16038 41117 22685 -34388
108 -34388 -4988 35137 -533 -23092 6243 24993 -17584 -40955 -3794 25801 453 -44276
120 -44276 -16251 31399 8555 -39605 -20476 39772 13646 -34588 -1854 48031 16966 -35549
132 -35549 -3459 34815 10211 -23627 -9989 14791 699 -5837 -3501 -7555 -8242 1892 8996
145 8996 -9405 -15764 3415 23304 14626 -12305 -6457 15863 19944 873 -1922 9404 -11927
158 -11927 -20502 14934 34119 -16580 -53338 -3137 39878 6813 -40467 -24993 12268 13636
170 13636 8892 8709 -1057 -17680 -4866 31078 27196 -15852 -35096 6980 39013 6674 -33841
183 -33841 -22197 14185 9321 -12821 -7562 -630 -10662 -12215 13135 19294 -4925 -11445 8437
196 8437 19405 3634 -5894 -454 5784 8108 5381 1201 -7345 -8514 -1646 -927 -7710 -12131 -795
211 -795 6834 -2101 -10047 -755 11388 5782 -1069 2517 6234 3977 2272 7199 3048 -4301 -1336
226 -1336 4458 193 -11019 -10530 -3200 -1680 -5896 -3051 4309 -1952 -7390 1260 12434 5210 -9638
241 -9638 -14 17755 12293 -6018 -3870 9081 3936 -6092 -5355 -468 -6600 -9822 204 2211
255 2211 -5985 -8739 658 7213 854 -5655 48 9990 7331 890 3986 7725 3787 -3102 2139
270 2139 5148 -7065 -12111 -515 5651 -5688 -12703 -3422 4175 -240 -6003 -1508 1850 2408 5315
285 5315 5974 4767 2486 3489 6032 4253 -2300 -5136 -1048 913 -3233 -6616 -3936 -768 -5379
300 -5379 -5223 -349 -970 -3211 -494 5129 6106 3452 3042 5700 5526 3318 1645 -846 -742 466 -1478
317 -1478 -2985 -3111 -3624 -4723 -4590 -3593 -3145 -3019 -1506 2099 3077 3495 4104 3445 5207 4692 1605 883
335 883 2284 1698 -1441 -1820 -555 -2004 -6610 -5556 -1810 -4786 -6660 -2354 2512 1957 -1085 1544
351 1544 7053 6333 1020 150 4109 5754 1544 -2303 1408 2413 -3379 -5472 -1800 -1958 -7983 -7729
367 -7729 -130 1583 -3708 -3242 4040 5117 1655 1098 4000 6053 2948 735 3375 5054 651 -4182
383 -4182 -1884 1322 -3125 -9934 -5636 1155 -2651 -6358 -1236 3692 1052 -1794 2623 6275 2469
398 2469 464 4785 6547 4380 -8 -1837 1473 2489 -3799 -8042 -4368 -366 -3777 -5594 -743
413 -743 447 -3834 -2673 4873 4898 -938 153 6238 7325 2741 998 2902 3005 108 -2863 -2916 -1355
430 -1355 -2561 -6899 -5726 520 1375 -3821 -4951 -242 1579 407 2884 5598 3066 1239 4985
445 4985 7956 2902 -3776 -2790 2114 2996 -1366 -5891 -6979 -4622 -1228 783 -1316 -4219 -3527 -141
461 -141 3021 3696 1115 841 5182 8709 4769 -838 -1153 539 -2229 -1577 3152 1519 -6935 -8417
477 -8417 -2359 -1370 -4263 -2696 1002 -215 -432 3053 3742 633 1836 5179 6310 5738 1841 -4369
493 -4369 -3817 2603 2482 -5148 -4083 2081 -2186 -9716 -4917 488 -2767 -1772 5567 5242 -1933 -870
509 -870 5623 5313 2172 1335 1104 3095 5598 -651 -9176 -4638 3684 252 -6716 -4509 -1369 -5501
525 -5501 -3837 3601 2552 -2238 1800 5590 2870 2550 3687 1521 670 3203 2992 -958 -253 619
541 619 -5750 -6981 303 -62 -6561 -4957 -338 -387 1179 4588 1677 -4769 -254 8801 7238 2143
557 2143 665 -715 569 5077 1364 -6428 -4593 1211 -1406 -5212 -2143 -2611 -8329 -1617 8928
572 8928 3486 -5160 636 4811 -294 -113 7438 6783 190 1145 2491 -1791 -2398 -1787 -5570 -3537
588 -3537 4415 -600 -10397 -4903 2854 -2575 -3741 7267 8099 -4184 -2802 8091 4803 -2139 3266
603 3266 6701 1846 -311 -1263 -6694 -6160 1790 1491 -5777 -2370 2449 -5332 -8171 2032 3606 -2364
619 -2364 2626 9827 2734 -4541 2433 6957 824 248 4097 -357 -3788 -866 -3194 -6703 -1198
634 -1198 2391 -3328 -4679 1941 187 -6890 -350 8504 3546 -638 5479 6118 -1555 -1639 4136 3048
650 3048 -1195 -1090 -269 -2916 -2135 -2166 -5311 -4446 582 -141 -2415 13 1545 -969 1786 6929 4264
667 4264 -1939 1416 6375 1835 -2593 40 1555 -1891 -3015 -1239 -1743 -3552 -3880 -2995 -1520 402
683 402 -570 -1587 2207 4808 2029 651 2826 3820 1291 1018 3219 1990 -1587 -1509 -855 -1944 -3435
700 -3435 -3351 -2438 -1368 -1959 -2149 -1183 773 811 989 2692 3839 2072 411 2096 3866 1086 -978
717 -978 694 1568 -1024 -4482 -3823 -1742 -1841 -3230 -2725 -440 349 -1233 -522 2233 2475 967 2288
734 2288 4340 3442 577 201 2587 1197 -1418 -2261 -777 -1176 -4098 -4090 -1276 -791 -2804 -1613 1039
751 1039 1158 -491 -704 2934 4392 1929 1287 3148 3689 928 -1140 -182 716 -1817 -3460 -2254 -866
768 -866 -2179 -3913 -2076 796 -503 -2006 417 2765 2186 1079 2283 3921 2760 761 1255 1716
784 1716 407 -1715 -2163 -487 -1114 -3714 -3485 -447 -859 -3117 -2096 794 2143 -160 139 3273
800 3273 3803 1893 1318 2716 2604 420 -1114 -98 564 -1948 -3282 -1886 -824 -2070 -4118 -2394
816 -2394 515 -575 -1442 990 3020 2005 1036 2318 3544 2054 -2 1322 1755 75 -1564 -1631
832 -1631 -166 -1599 -3523 -2945 -716 -1376 -2717 -1635 1048 2000 69 544 3343 2966 1106 1103 2311
849 2311 2101 -122 -795 726 86 -2350 -2936 -1687 -1462 -2500 -2820 -1249 194 -729 -437 1408 2336
866 2336 1603 859 2145 3358 1770 -118 1374 1664 -96 -1673 -1502 -635 -2205 -3505 -2315 -719
882 -719 -1482 -1899 -730 1260 1404 -309 746 3325 2560 843 914 2479 2321 -325 -693 664 -595
899 -595 -2639 -2331 -1279 -1853 -2823 -2503 -130 703 -992 -641 1192 2162 1182 727 2716 3501 1068 -146
917 -146 1774 1345 -1151 -2391 -602 -418 -2360 -3043 -1496 -1256 -1702 -1051 -145 714 746 -88 1255 3519
935 3519 2784 347 848 3130 2106 -836 -899 341 -1409 -2669 -965 -629 -2555 -2757 -894 -114 -566
952 -566 -290 -503 573 2543 2226 1040 1985 3490 1030 -1038 991 1810 -1193 -2691 140 58 -3407
969 -3407 -3130 -643 -720 -2160 -899 871 594 48 387 1016 2438 2816 1552 977 2171 1044 -1653
986 -1653 -1408 1009 14 -2699 -1837 157 -2038 -4283 -1712 837 -61 -442 1259 2246 613 -415 1379
1003 1379 3206 2480 1132 601 639 84 -1933 -1925 -660 -305 -1274 -2454 -1924 -917 -2672 -1999 1449 2987
1021 2987 875 86 2180 2313 18 -81 2943 3555 -148 -236 -342 -974 -1809 -1676 -1078 -968 -831 -1417 -2180
1040 -2180 -1227 -28 -521 240 3609 3575 -627 -375 2486 2173 -509 709 2816 42 -2347 -465 -914
1057 -914 -2974 -2162 -605 -777 -825 -318 -1423 -918 1317 1839 93 1126 3657 1059 -995 2062 3171
1074 3171 -939 -1567 635 63 -2838 -1998 -313 -1617 -2644 -661 -317 -951 295 97 -155 1967 2496
1091 2496 -164 -121 2963 2673 -609 207 2449 -644 -3304 -795 613 -2193 -1900 -316 -992 -2001
1107 -2001 -1195 -470 -125 1214 1976 744 1133 2976 410 -1264 2205 3089 -630 -1042 1178 -634 -3924
1124 -3924 -2344 391 -891 -1808 -132 -503 -1850 -331 509 528 1823 2978 914 143 2124 1233 -1567
1141 -1567 -118 2826 309 -2843 -511 -159 -3767 -2725 620 111 -1807 -581 718 -805 -120 1617
1157 1617 1385 1662 3289 1752 -757 803 1962 -682 -1541 1422 1360 -2923 -2697 -41 -1374 -2821
1173 -2821 -331 1171 -425 -895 566 833 727 1735 1718 1079 1943 1444 -727 -754 1646 -160 -2295
1190 -2295 -826 631 -1700 -3441 -839 387 -1459 -1516 921 1241 -135 451 1548 1459 1532 1042 399
1207 399 1207 990 -592 -1323 204 -137 -2269 -2255 -248 -309 -2156 -1078 803 602 -731 229 1874 1198
1225 1198 274 1078 1613 1441 572 116 556 489 -343 -1334 -841 -473 -1647 -2051 -673 5 -920 -1194 435
1244 435 1217 322 298 1464 1875 934 861 976 964 126 -814 -643 -348 -742 -1670 -1379 -406 -918 -1378 -922 264
1265 264 371 -302 194 1241 1306 660 910 1496 1456 441 3 431 262 -907 -1052 -983 -486 -1496 -1742 -527
1285 -527 -221 -788 -788 60 1284 732 287 1426 1891 594 419 1137 1112 221 -974 -369 -102 -982 -1581 -1408
1305 -1408 -591 -950 -1480 -872 573 350 -378 348 1452 1233 549 766 1768 1177 -393 90 498 -26
1323 -26 -1023 -1035 -161 -610 -1850 -1349 -369 -112 -770 -316 935 1112 279 355 1661 1540 724 307 962 1018
1343 1018 -149 -734 78 -215 -1459 -1254 -819 -672 -1180 -1261 -258 522 -107 129 735 1155 844 77 867
1362 867 1558 656 -116 224 429 -198 -1198 -1064 -253 -753 -1550 -953 13 -323 -649 -141 601 1012 617 901
1382 901 1411 1346 583 528 469 661 -207 -1028 -257 175 -1132 -1865 -895 -158 -858 -1163 155 634 -378 -93
1402 -93 1032 1144 564 490 1066 1067 639 -19 -85 -56 -36 -1225 -1275 -235 -498 -1479 -1001 221 -118 -757 22
1423 22 1211 671 -14 743 1217 796 477 768 767 275 -523 -677 -383 -280 -1110 -1445 -622 55 -1178 -1556
1443 -1556 282 631 31 132 1314 1183 75 560 1211 930 120 93 -41 -53 -424 -1201 -1277 -518 -678 -1440
1463 -1440 -845 163 19 -794 620 1131 629 -3 999 1323 514 450 607 207 49 -75 -422 -782 -405
1482 -405 -1003 -1540 -319 -66 -1156 -950 428 475 -517 160 1469 1104 294 357 1234 382 366 184 -121 -390
1502 -390 -575 -870 -786 -267 -700 -1384 -1242 295 -96 -739 730 1683 167 92 1221 1152 111 -72 1058
1521 1058 742 -145 -576 -552 -874 -495 -1083 -802 -542 -382 -791 -822 116 605 -120 467 1696 1141 -195 -39
1541 -39 919 626 260 261 486 -64 -1173 -1145 -889 -584 -712 -282 288 46 -545 -397 194 831 930 862 871 958 580
1564 580 -37 58 781 118 -460 -398 -302 -1040 -1587 -814 -113 -382 -678 286 288 -186 21 549 988 794 1049 745
1586 745 889 416 -103 -401 -177 351 -389 -1038 -532 -340 -935 -1210 429 455 -877 -134 906 121 -70
1605 -70 552 1204 464 467 258 163 -249 109 -547 -565 -186 -144 -1185 -914 250 -397 -857 -100 785 -185 -357
1626 -357 935 1386 85 293 1137 461 141 372 105 35 3 -457 -1166 -614 -120 -643 -1121 238 533 -729
1646 -729 -240 911 825 -120 779 1532 554 -414 371 126 -366 159 51 -412 -444 -314 -1178 -989 -79 -164 -665
1667 -665 -132 1175 10 -626 750 1252 171 264 1024 783 -311 -83 -51 -354 -169 -162 -845 -730 -153 -839
1687 -839 -850 -239 525 -33 -36 901 421 -456 213 1053 683 91 547 406 -330 -725 -194 -410 -553 -340 -677
1708 -677 -631 -443 -263 -631 107 836 398 0 811 1017 464 -27 764 672 -259 -65 130 -95 -643 -732 -300
1729 -300 -492 -316 -750 -376 -226 205 -208 250 784 590 271 522 1117 387 -20 173 303 -342 -446 -432
1749 -432 -134 -586 -541 -472 -389 -256 -282 -196 114 480 238 389 369 642 416 115 649 498 -229 -420 -7 -133
1771 -133 -748 -798 -521 -227 -527 -917 -267 140 -134 69 177 678 581 274 506 1008 324 -166 46 330 44
1792 44 -661 -346 -229 -504 -812 -326 -60 -344 -314 -1 392 505 404 436 618 971 413 134 840 527 -250
1813 -250 -185 -336 -294 -484 -762 -229 -415 -417 -645 96 317 15 112 494 983 282 293 557 455 117 -216 -19
1835 -19 236 -303 -474 -303 -194 -762 -762 -342 -18 -138 -433 109 271 110 -61 479 518 513 -32 291 415 232
1857 232 -223 -330 0 -311 -515 -943 -43 -145 -600 -425 89 123 -98 -165 380 609 394 468 632 568 48
1878 48 14 156 42 -469 -529 -392 -110 -355 -487 -295 -65 -168 -343 145 385 283 227 614 857 426 64
1899 64 249 578 123 -227 -293 60 -416 -473 -510 -295 -159 -128 -146 34 126 144 92 329 581 188 549 700 728
1922 728 18 -135 101 263 -589 -415 -299 -136 -466 -231 -285 -276 58 -360 -277 402 72 99 401 742 594 -163
1944 -163 427 754 72 -324 -47 119 -595 -428 28 -271 -146 -191 -259 0 0 36 20 580 436 261 234 682
1966 682 528 -120 -395 505 -59 -667 -364 -190 -385 -724 -476 -172 -133 -92 165 11 348 434 260 420 938
1987 938 274 -153 229 419 106 -334 54 48 -599 -708 -74 -275 -364 -171 167 275 150 -41 142 44 418
2008 418 337 312 683 329 -207 -183 238 -27 -785 -453 -120 -380 -738 -130 115 141 22 136 -12 325 338 117
2030 117 467 443 243 13 420 469 -26 -597 204 49 -671 -455 140 -306 -336 -509 -201 -190 -47 445 64
2051 64 678 402 198 10 371 119 -216 -113 304 151 -642 -145 -34 -328 -574 116 30 -141 -46 166 18
2072 18 470 134 222 427 477 -24 33 314 27 -318 -442 290 19 -305 -560 -205 -228 -242 -129 343 364 -52
2094 -52 171 132 334 188 55 386 598 99 -600 -61 43 -425 -320 -14 -272 -294 -477 -39 -122 -225 145
2115 145 305 83 450 -234 -112 207 328 180 89 360 88 -307 -482 -14 -424 -458 39 34 -410 -361 -203 122
2137 122 75 319 37 299 423 176 -39 42 259 -122 39 221 -8 -301 -558 -335 -228 -583 -625 -4 -157
2158 -157 -169 -113 161 265 525 155 258 424 507 12 37 293 214 -362 -206 198 -366 -680 -117 0 -248 -342
2180 -342 -323 124 182 288 49 30 196 258 -280 96 275 22 -305 102 -122 -137 -488 32 29 -244 -489 -120
2202 -120 13 -260 119 318 359 132 329 211 409 301 16 229 359 157 -383 -265 -375 -460 -249 -369 -27
2223 -27 -60 -285 -76 199 97 98 109 118 214 48 297 180 -172 28 -272 -17 103 -523 -701 -103 -68 -475 -571
2246 -571 69 140 -189 -45 281 215 81 323 246 290 368 178 83 -86 10 -350 -266 -78 -283 -307 -158 -330 -261
2269 -261 -247 -124 210 -82 -12 355 215 89 99 303 207 -71 -49 -406 75 -22 -225 -516 -84 -86 -444 -382 -46
2292 -46 -60 -169 -307 354 258 -89 -101 157 594 107 7 55 180 85 97 -102 -176 -228 -419 -13 -111 -375 -252
2315 -252 110 43 125 304 210 378 430 15 288 391 -216 -283 -24 -41 -232 -420 -307 -105 -132 -391 -81 46
2337 46 6 146 158 379 172 -5 91 226 318 -153 79 226 26 -134 -156 17 -103 -398 -468 -120 12 34 -245
2360 -245 154 273 -23 222 188 381 103 305 472 147 117 -347 -144 49 -406 -96 -151 55 64 114 -232 13
2382 13 75 200 130 266 12 173 -53 417 142 270 -36 267 -258 -198 -207 -211 -276 -307 -484 -112 -263 -51 -22 94
2406 94 52 89 156 160 109 244 142 127 114 125 -331 -109 16 4 -205 -283 -1 -173 -222 -165 255 -171 183 34 188
2431 188 119 244 113 236 268 236 -55 61 -242 -40 -346 -330 -160 -518 -432 -40 -257 22 7 65 372 -171
2453 -171 255 273 209 247 -24 110 77 27 -356 -29 -281 -24 -329 -64 -102 6 -421 -228 44 -219 -144 107
2475 107 183 58 113 251 382 115 6 73 -61 -90 -58 -377 -76 -91 -229 -123 -36 14 -239 158 185 -147 -68
2498 -68 272 273 114 70 266 36 314 28 7 -335 106 11 -1 -14 -38 -309 -189 118 9 111 -150 241 107
2521 107 -68 301 370 151 -17 -12 55 -244 -289 28 -88 -217 49 7 -267 -228 138 -147 -214 294 191 -129 -194
2544 -194 244 7 -38 39 263 -62 -192 -35 -278 -2 161 -120 -192 -207 -483 -203 57 206 5 -142 104
2565 104 344 157 -159 79 240 243 282 109 79 -179 -311 -145 -78 -39 -5 -14 -395 58 -17 -87 641 -71 28 169
2589 169 526 -102 -200 -68 304 -191 -56 48 -98 -92 -150 -201 -104 18 57 -19 56 204 2 12 98 120 21 -71 133
2614 133 80 -57 -112 10 -118 -356 -115 -87 -71 79 -105 90 -231 152 -108 -106 -1 206 65 227 504 53
2636 53 302 52 32 58 -265 115 -191 -273 -200 -297 -250 -132 3 34 -1 118 138 -39 122 294 -117 182 184 149
2660 149 46 -49 258 63 101 -319 7 -157 151 -40 -76 125 -119 159 89 -58 25 93 129 103 -27 164 104
2683 104 -62 -218 -106 -281 -267 -252 -311 127 84 9 3 -111 95 50 -46 26 184 80 19 24 -30 -208 -231 49 -155
2708 -155 -43 -305 -192 -65 -188 -56 -217 105 -82 -177 -160 -13 52 167 -84 203 -197 40 27 -15 88 -12
2730 -12 -179 -192 -1 -45 -154 -49 80 0 -241 123 242 -212 178 86 154 -149 217 168 -130 -9 -15 -102 209
2753 209 -16 -52 75 -85 79 -244 106 231 -212 211 196 24 264 -44 -17 261 111 8 86 299 -118
2774 -118 31 149 -82 257 -454 -186 -213 -36 -166 -64 27 -35 -132 25 374 15 94 72 6 142 -147 -116 184
2797 184 66 49 -281 -252 56 23 -100 -26 77 -115 80 59 136 190 -26 300 301 -34 -104 -139 -72 -208 -266 66
2821 66 -15 31 -314 5 -269 -102 107 23 -17 22 169 -71 -44 118 192 -53 156 49 33 113 133 -280 83 -71
2845 -71 -220 42 36 -60 197 354 -396 -138 227 -159 -97 -44 199 10 131 63 225 -6 -194 -143 -70 -74 151 -232
2869 -232 68 204 -122 16 58 24 -13 94 157 178 279 -68 176 26 -104 -78 -395 242 -104 -268 -116 46
2891 46 -95 -94 -45 -34 -180 -20 37 97 20 -117 250 274 -107 28 252 140 -75 229 -114 8 -73 -25 5 107
2915 107 -27 -175 -241 97 18 171 -33 -118 48 97 -112 319 117 -254 24 -115 -128 -153 -286 -44 83 -144
2937 -144 114 -300 227 145 292 -205 14 404 -199 -205 35 202 17 154 -45 123 -26 -18 121 -369 -56 168
2959 168 -285 -181 47 73 -224 29 29 -53 72 -106 69 37 117 64 78 133 -24 7 -18 -257 -223 21 -30 -143
2983 -143 -12 215 -94 51 -127 158 -2 -25 68 33 -126 208 -18 -81 7 -310 -323 -47 -261 34 -199 -112
3005 -112 -34 -13 -50 50 16 102 -54 -335 -64 -248 -60 -85 10 -54 12 51 -279 -166 -104 95 -102 -1 -144 21
3029 21 171 -131 -177 -162 179 22 -66 196 216 0 -123 1 -151 268 -186 100 -229 -87 -238 -35 184 -140
3051 -140 -41 -296 160 218 37 -30 279 188 153 -2 -100 146 80 41 -51 -20 7 -141 -54 10 -7 -10 -261 -138 -173 -142
3077 -142 -70 3 281 -149 186 208 -26 -48 100 -167 -185 -204 32 -285 -60 -130 -111 170 141 -13 133 -43 -96
3100 -96 52 81 -317 119 181 -254 -175 -284 150 31 123 116 238 29 -146 -318 49 174 -66 -128 -27 -126 284
3123 284 -103 88 101 123 -25 -53 237 31 98 274 -25 48 -12 -259 -75 -44 17 59 33 -272 198 44 -35 271
3147 271 122 114 22 -202 110 -16 -20 22 -200 60 -45 -174 285 -106 -13 -25 53 -121 339 95 65 -75 -120 -266
3171 -266 246 30 -127 -46 191 -81 -42 -48 42 102 -5 -34 -142 38 126 -62 119 92 51 47 55 85 61 61 -8 1 -188
3198 -188 -278 143 72 -129 -1 72 49 -70 -178 -298 51 134 327 -70 -103 -20 -32 43 90 -9 178 162 -102 -127
3222 -127 24 28 107 194 -177 23 25 325 45 167 136 -87 3 -221 -15 63 148 195 -14 45 -57 90 -60 19
3246 19 46 89 -168 -60 132 160 86 -42 57 45 47 55 174 276 -79 -33 38 330 -188 -71 -136 -36 -218 -437 119
3271 119 -184 89 -72 2 76 158 -71 -198 -89 -58 50 137 280 -7 66 41 -17 276 -316 -4 89 -181 -247
3294 -247 264 1 340 228 179 51 105 326 175 196 -126 113 -154 64 -208 -41 -76 44 81 -103 -82 136
3316 136 -269 7 -19 116 139 -51 303 -241 -403 172 -34 -173 72 245 -25 -252 -147 -113 -10 -89 121
3337 121 145 -66 73 2 -115 -118 89 41 134 164 -89 121 65 -32 -17 -65 154 149 338 204 -67 -20 175 16 -132
3362 -132 -154 -108 116 -101 -10 14 -5 3 -49 -98 462 -52 212 -34 74 -7 -189 63 51 -312 156 -320 58 -59
3386 -59 -319 113 250 178 -344 86 -80 131 -137 -119 -141 -16 -8 -33 -269 -139 -46 12 306 153 109 -225 18
3409 18 -131 71 35 -43 36 16 117 -88 129 14 206 41 123 -9 178 -151 -72 -42 -60 264 -67 0 -104
3432 -104 7 85 -151 -84 217 -13 328 -57 31 63 -167 -9 -15 -139 47 -226 -123 11 3 -58 -123 49 172
3455 172 45 -57 -106 201 219 -304 -10 95 393 36 -49 -146 148 185 -63 190 -215 119 279 -39 -163 133
3477 133 -127 -38 4 140 -378 77 -81 -71 -153 39 124 -20 16 -83 -166 -40 24 -93 107 -2 -36 44 14 -455
3501 -455 -85 202 -17 24 311 -25 172 -107 -149 34 148 -88 0 49 129 -118 -118 8 -161 47 8 19 102
3524 102 237 239 -84 -142 111 -338 122 128 70 141 53 -166 -46 21 -177 95 -225 -39 45 330 49 -304 244
3547 244 83 233 15 -118 -479 -103 79 -229 113 117 -39 212 87 215 31 296 19 -90 -128 -67 -192
3568 -192 -116 185 69 -151 196 71 -66 -96 -28 193 -66 -215 -76 100 -186 50 248 96 164 -116 84
3589 84 116 16 -31 112 -161 -250 -47 -7 90 -63 94 115 274 397 98 212 91 75 63 151 -50 -105 156 -25
3613 -25 213 278 120 -187 -238 78 164 8 -148 175 44 252 146 -348 -21 27 -33 111 5 -92 -6 -42 130
3636 130 34 -29 -105 170 192 -121 -163 -94 -287 119 -20 109 -107 287 41 -168 -91 3 85 -191 201 -51 -46 132
3660 132 -219 -63 -120 -12 17 15 -88 172 -107 -31 -299 -101 -43 10 -87 70 61 -48 -55 -19 -104 -120 155 116 -125
3685 -125 -55 -153 112 29 -323 74 66 121 -68 85 57 81 -139 70 125 62 -237 107 -78 -43 -77 8 9 16 -31 58
3711 58 -113 -45 245 27 81 -137 86 79 6 -62 -131 16 109 63 -15 -83 -283 90 -88 57 74 -126 -9 52 44
3736 44 -96 285 82 113 -250 80 -140 98 369 -20 -275 254 -169 -133 53 -63 263 -5 153 -364 158
3757 158 49 -89 -35 -36 215 -78 -13 -94 233 288 -208 173 -44 177 53 2 -142 29 174 -128 147 118 48
3780 48 -149 237 120 197 132 36 226 -8 126 -20 76 223 -233 157 169 74 -7 253 -10 300 135 -51 17
3803 17 88 49 199 81 34 -64 -301 -126 79 -93 -120 10 -144 -116 -234 261 -50 -57 -104 -130 -52 -168 -215 186
3827 186 86 -58 269 -244 -169 -108 140 198 44 67 106 -130 -91 -42 70 140 178 67 -97 -67 48 133 -120 -160
3851 -160 282 -20 153 104 74 -176 173 90 21 -256 -303 -142 3 -160 15 -62 176 56 49 135 6 -338 107
3874 107 -51 4 41 -64 149 -4 91 36 20 -91 17 -57 10 34 2 333 -114 23 -90 -174 18 113 78 123
3898 123 290 16 127 134 -161 -30 -118 97 110 55 -6 -18 20 -239 -72 -123 190 -56 129 185 200 21 10 -293
3922 -293 98 161 -49 181 -205 -16 38 -86 -250 -159 -60 -47 28 -93 81 193 -183 157 246 -27 -121 -11 -89
3945 -89 29 -251 -102 61 292 -350 -88 -110 241 -87 57 128 10 -67 -131 156 -19 122 313 -72 139 -74
3967 -74 -87 216 174 -32 175 36 158 -101 -108 20 154 42 26 -201 -69 -21 -27 70 -75 -17 188 131 150 -302
3991 -302 -151 80 -119 335 -245 -12 -57 45 -276 -135 85 -26 -69 -19 -10 94 78 1 132 -274 203 60
4013 60 151 56 -116 30 -253 -86 152 -9 40 16 23 -108 80 247 -86 -127 186 -4 54 22 -164 -81 -324 15
4037 15 -90 109 252 259 62 212 -110 -9 -46 -2 -208 -225 -11 -66 139 -32 -49 117 150 -208 41 -104 13
4060 13 -244 -144 4 118 53 -59 221 39 -212 36 118 32 87 22 -33 -67 139 50 120 -29 -18 39 -33 314
4084 314 379 -137 -68 152 -91 -59 263 68 227 77 -8 -27 56 260 -75 261 -75 59 -12 -46 321 157 -352
4107 -352 -70 34 -129 -195 30 -17 -12 -79 187 -86 -185 -107 426 13 160 87 -287 104 34 34 94 -214 -60 14
4131 14 -21 85 -62 142 53 127 -26 130 127 98 -53 348 153 -54 115 -43 30 -234 -77 -27 98 -12 84
4154 84 30 -101 -316 -71 -382 -45 11 -120 -71 70 96 86 -188 171 27 -86 -104 204 235 -139 82 125 -92
4177 -92 -89 253 3 -63 35 156 156 -16 177 4 -124 217 -214 -104 60 184 157 -137 -283 19 -39 -22 -12 -173
4201 -173 17 126 -105 -3 -187 -140 -136 -54 6 -124 275 68 131 43 7 159 152 -82 -272 92 20 -226 -100 -162
4225 -162 -41 276 39 -86 177 -21 275 -73 36 95 -54 235 -83 48 -247 131 -23 10 -251 24 -75
4246 -75 39 -257 -63 -30 -61 -144 169 -18 26 77 85 190 145 -73 61 172 69 -60 -79 92 -122 87 -159
4269 -159 101 -103 70 -77 -163 218 11 -120 71 168 -52 199 -120 -234 157 224 -178 -77 109 83 -116
4290 -116 110 -189 -98 -199 159 -45 -69 -255 363 224 -172 81 219 -106 78 193 93 -198 -261 217 -139
4311 -139 72 72 -65 -24 174 23 183 116 254 -19 -246 292 -3 159 77 125 -163 -86 -13 138 -227 33 163
4334 163 43 144 51 69 56 142 -166 -2 -223 281 -191 -82 4 -224 415 32 41 54 -31 220 46 -201 24
4357 24 -184 -216 -56 -77 -16 -71 -197 142 188 -427 40 16 173 83 -10 106 -153 197 -14 -237 -293 55 -222
4380 -222 -214 -11 -238 -160 147 -26 13 174 302 233 -8 98 20 -74 60 -137 54 47 -97 93 -144 -55 -31 62
4404 62 131 199 291 13 254 49 142 -161 -186 -34 41 -35 -273 -92 144 125 -250 -219 46 -364 -276 -67 16 37
4428 37 -215 54 49 109 211 -41 105 112 12 -41 152 297 161 -53 -54 12 -5 77 61 -108 -176 -124 -83 -67 66 -84
4454 -84 -39 196 57 133 -166 216 87 -66 119 -160 1 -157 -183 -309 51 0 20 -354 98 43 -98 182
4476 182 254 64 182 -173 -182 196 149 146 114 156 51 54 -82 155 -365 -174 71 -77 29 -190 -34 -41 70 138
4500 138 134 78 -224 64 -103 -45 -129 -26 142 -105 -23 102 -159 -141 -105 232 222 -56 81 27 218 -41 242
4523 242 60 -108 107 -40 -14 -45 90 -125 181 -210 122 37 -199 93 56 -87 74 -197 -3 78 31 47
4545 47 374 270 121 329 115 168 40 -10 1 162 0 -16 -219 38 152 -56 -79 43 -5 241 44 231
4567 231 -65 -138 110 -115 -118 -130 168 21 -16 -44 89 -17 -75 -152 68 -59 -37 -76 -31 -62 212 -5 -10 -196 -77
4592 -77 -33 -50 81 121 85 -223 -36 189 -88 0 -142 -88 -84 -194 47 199 -2 -30 -18 205 45 -62 -96 -111
4616 -111 -48 67 94 26 158 152 147 68 24 106 2 -57 8 -154 69 181 -7 -130 83 -122 104 137 222 146 58
4641 58 225 -187 -90 -282 -264 -281 -11 -109 33 -149 105 -26 -70 228 -18 326 191 -55 22 233 4 95 -1
4664 -1 144 -102 -62 -256 -220 111 38 -114 -246 17 -157 316 -43 77 50 47 -173 -236 61 -78 -88 27 88 141
4688 141 -63 141 -60 79 207 0 27 -33 -149 -191 118 121 -108 76 300 61 -50 -58 86 -167 -69 21 98
4711 98 -47 -67 87 177 136 100 -74 -54 376 -63 299 44 315 216 -190 96 140 65 -252 -35 -214 105 1
4734 1 -148 92 92 87 371 -159 -144 -32 -163 99 14 90 8 40 -134 69 66 -45 -178 32 -33 22 -76 22 -361 -210
4760 -210 -226 91 -130 -44 -246 16 -250 51 188 -147 -39 221 90 15 22 99 -245 -163 100 -160 77 -31
4782 -31 -122 103 23 -10 167 153 231 249 22 -162 -86 -11 -4 -199 144 -147 174 -103 -41 -8 -18 -78 -57 31 83 168
4808 168 -129 -13 80 67 15 -124 233 128 -174 102 -40 49 -49 32 -1 -203 -230 93 -161 84 208 -2 -74
4831 -74 -59 212 421 -26 -45 313 142 -102 30 -142 34 136 -89 -5 -171 -143 175 -204 -232 -339 -195 -170
4853 -170 38 47 13 177 67 -56 -134 -54 -63 142 -66 133 80 -88 -173 -317 96 -60 -204 -42 -54 -147 226 152
4877 152 240 -148 179 56 -203 -38 -292 225 -66 -61 51 23 32 -64 17 -146 18 76 -285 84 -351 48 111
4900 111 -42 -232 225 367 217 -110 1 -201 -206 76 191 -72 -194 -271 -258 -42 155 187 192 -88 -100 -157 84
4923 84 -27 -62 85 167 33 -342 157 -233 -149 -148 141 76 203 -32 -134 33 74 -171 -343 77 38 7 -166
4946 -166 -57 293 332 -109 -78 115 -62 -203 -13 18 40 -5 35 -127 -13 174 -44 221 -127 -155 -238 -2 -3
4969 -3 121 108 -78 -78 198 -2 78 69 -34 116 -64 244 -198 166 21 64 -28 -153 -24 85 144 1 394 199
4993 199 53 -118 413 262 116 -151 59 -181 94 25 27 -44 -400 -31 -10 179 -142 108 -112 -197 -72 120
5015 120 9 285 102 -80 371 163 98 136 27 42 2 -148 211 -174 -84 -69 75 85 -159 -174 111 30 86
5038 86 -40 -144 88 -11 42 -57 -35 160 134 -44 -296 -225 -142 -242 184 275 37 -116 -7 20 55 -265 -105 -25
5062 -25 10 202 -22 15 -142 345 94 99 144 -333 13 -220 165 -285 99 68 -140 -1 -327 82 202 199 153
5085 153 70 97 -144 -89 -112 -16 341 152 51 -142 -177 -185 189 -61 -146 -262 172 -163 -169 86 36 -52 254 4
5109 4 -78 274 -91 98 -194 -267 -225 -221 -73 63 77 -42 -41 -7 -61 102 -101 14 -38 157 148 50 -3 -191 -204 -197 -99
5136 -99 -81 83 -65 -230 -88 86 -227 197 -231 -36 181 -207 -2 169 -31 4 80 109 5 130 -72 125
5158 125 -116 33 -197 -182 -33 62 29 34 94 -210 -190 182 -24 280 -120 59 56 -112 96 175 34 -191 12
5181 12 -29 -170 -89 -176 171 145 -42 4 -170 -125 13 -140 -4 55 227 298 9 254 -13 -197 -38 -75 -92 -210
5205 -210 -232 -108 -13 -174 -62 -16 -57 61 -49 -13 104 100 161 67 58 239 -48 -13 314 -44 -93 63 195 122 30
5230 30 115 65 285 -4 80 43 111 -15 3 185 181 -2 -165 207 477 216 -106 -145 45 184 -150 -116 106 -51
5254 -51 90 178 -37 -62 -195 279 -45 -178 98 116 265 122 49 -125 -401 72 -145 270 -2 239 -72 140
5276 140 -190 -15 -83 191 110 -106 32 71 -41 40 -134 16 -93 37 -153 -38 -10 -21 -74 2 -80 -113 -79 7
5300 7 242 74 17 -128 118 175 35 78 141 94 37 -156 67 26 0 192 -128 -25 8 -188 -168 -66 14 302
5324 302 164 -12 -90 3 -217 -128 -130 247 -185 156 -30 -182 -4 175 -310 -136 -78 -33 -276 173 -106 35
5346 35 -21 81 -182 -10 -150 -143 25 238 -56 103 190 -216 -78 -149 -182 222 278 61 93 -244 -138 191 -141
5369 -141 -349 -15 -52 -322 198 341 205 290 71 197 83 -9 -35 -149 -79 113 -207 -2 -342 252 60 327
5391 327 117 57 -63 -3 93 15 76 37 146 164 121 169 -32 -9 -95 61 127 -4 -210 14 261 -2 -63 -90 419
5416 419 89 18 44 -266 371 36 -87 -116 -93 93 -85 74 -316 123 -126 -151 -126 -5 -125 154 -268 31
5438 31 51 48 -35 56 111 -186 114 -90 -34 68 173 -71 61 122 188 85 -147 -149 379 169 -76 -99 -139 136 70
5463 70 -312 205 -24 78 -13 117 -66 98 184 -71 -22 -16 19 146 6 -36 -226 -169 -119 -264 174 95 -176 207
5487 207 137 -205 -78 -270 -202 283 137 181 -110 120 29 -220 88 -90 67 -19 49 11 162 108 -75 -113 75
5510 75 -60 256 47 16 -121 196 -83 78 -57 -7 84 185 -170 -165 -103 -60 -107 82 13 -38 88 168 94 52 -101
5535 -101 155 184 -133 -162 -248 -27 -93 -61 -9 72 -273 66 -172 -145 -123 -107 95 -4 76 -74 128 -27 -65 -39 19
5560 19 -169 -14 105 -310 -54 77 -82 -13 -69 -278 88 114 -133 202 139 -107 8 -98 79 144 86 50 170
5583 170 -78 -202 -382 260 148 78 -220 -243 206 117 14 10 294 136 -140 104 78 -310 -157 -33 190 228
5605 228 37 -187 -375 -183 -65 285 -52 -23 117 268 -1 50 18 4 -112 -44 -169 168 101 90 -50 -184
5627 -184 -159 37 195 -110 95 49 -126 -246 -188 -25 15 -159 -7 84 -7 60 -97 -120 -152 -120 -285 178 0
5650 0 -181 54 139 -3 -50 159 -127 197 126 -199 163 60 134 109 173 -95 -14 -36 4 106 28 -206 70 -97
5674 -97 231 -147 -244 50 -112 -92 119 -190 -119 37 105 9 173 151 112 -41 102 -103 -87 57 -71 -123 -77 196
5698 196 -35 -95 -31 -76 -18 196 -44 49 291 196 -215 -146 47 -17 32 -14 -87 -187 -142 94 -94 -8 37 -42 -1
5723 -1 -82 -144 -59 84 107 135 92 8 88 195 350 138 10 190 -67 137 -65 162 -199 -175 -54 -42 34 107 -116
5748 -116 41 -117 -19 28 389 -190 -1 -24 146 145 53 -196 -148 -276 -16 -162 -247 191 145 -112 94 -232 -449
5771 -449 -80 -115 177 -132 57 -187 3 185 67 10 73 -2 169 -58 105 60 -17 -129 -248 22 141 -284
5793 -284 -68 80 -80 210 115 -56 -33 -46 -45 -4 -108 -23 -82 -161 -135 -34 143 -66 -151 -115 13 125 169 -206
5817 -206 215 -191 20 98 -124 237 82 -57 -96 43 86 -18 153 -152 -11 140 -80 -285 -268 -77 -197
5838 -197 248 -94 184 235 254 31 5 -187 92 -133 159 -45 -16 94 -8 -271 81 -28 169 160 -229 -216
5860 -216 71 -117 -272 12 -147 36 73 -108 295 -79 30 -94 -70 -12 -108 9 -190 -132 131 -75 -239 -10
5882 -10 -153 110 195 35 177 -118 -247 1 62 75 1 180 -34 -251 -314 268 33 -91 150 43 223 -13
5904 -13 85 50 85 -319 41 -47 -122 209 -44 -138 114 12 -121 118 126 -71 -153 -146 259 -58 -110 29 -19 -23 -129
5929 -129 -74 23 155 170 120 65 -19 -171 -362 -28 65 55 47 178 -37 -355 -91 -364 43 -67 59 227 164 -195
5953 -195 181 314 65 49 -126 81 105 -185 -297 149 -75 -114 64 -65 -55 -148 10 -116 -31 388 -16 80
5975 80 43 -101 76 -96 15 147 -140 87 125 50 -116 -153 13 -111 -164 272 5 -179 -27 36 -117 -70 181
5998 181 141 130 329 185 256 27 -222 -27 -175 -82 -89 -98 23 9 -95 94 67 -143 -18 32 41 -110 -122 -311 -52
6023 -52 240 -193 58 -166 92 169 -35 -106 222 -24 -164 -287 52 203 -278 33 108 -196 48 91 239 176
6045 176 126 100 58 115 -54 -95 -197 -92 -78 -326 -97 -309 -236 346 118 -118 -208 -87 -43 -53 23 -19 -260 -225
6069 -225 6 46 277 53 -34 72 83 -68 -66 -124 -174 89 -73 -182 55 242 -150 156 -77 144 14 339
6091 339 62 -221 -21 -191 40 -47 -52 -165 -110 -68 -12 -56 -91 -136 152 66 -75 13 187 28 164 200 -29 63
6115 63 37 -76 38 -209 71 148 -46 -151 -216 121 -11 -81 -319 -109 66 -33 101 25 273 190 213 13 197
6138 197 255 185 168 -77 -207 80 92 -36 49 190 -110 -301 -58 124 174 175 117 22 7 169 13 -114 -339 48
6162 48 -240 177 -88 -17 7 46 -52 48 -77 -133 -45 -292 44 11 -165 122 332 -91 -51 199 131 -61 54
6185 54 69 63 13 90 -131 14 102 -66 224 -162 280 -23 -66 160 -334 228 238 16 -219 205 -108 175 4
6208 4 -60 47 -98 129 6 -296 31 -15 63 -20 -151 -15 397 -300 217 -37 -116 9 196 -20 -3 211 52
6231 52 -15 -152 153 -16 -61 -75 -9 -95 212 -14 -60 105 -209 32 136 -87 37 206 -44 30 252 -136 -322
6254 -322 186 -23 -148 8 -30 -186 99 64 -315 -76 -19 104 -56 27 86 19 -41 98 -22 -116 -80 372 179
6277 179 51 -211 -42 -168 -379 -98 -33 100 96 -51 34 15 39 -236 67 -156 -36 107 -42 322 -74 -126
6299 -126 68 -115 -158 -109 -310 -48 -73 -219 42 298 84 64 209 101 102 -176 -75 152 106 95 -109 -61 221
6322 221 62 -164 50 -172 -177 -300 173 -211 -274 122 263 247 -192 -46 -68 182 133 204 -129 -24 215 -345
6344 -345 -9 -139 -56 -41 -141 -38 -57 -19 193 31 -120 175 -57 -23 -209 160 77 55 -70 -122 -60 88 -103
6367 -103 -191 -207 74 -56 13 -39 148 -12 -140 157 -104 -209 -24 250 70 73 -197 -20 149 -21 -79 106
6389 106 122 -51 -153 -137 -78 -57 -65 36 59 -152 -127 77 198 -32 98 136 -12 60 61 52 -57 -102 82 -39 -139
6414 -139 178 47 65 83 -248 192 -263 8 149 33 -219 -72 -138 53 21 197 -27 274 116 -68 64
6435 64 -18 -176 227 22 123 -126 -80 71 -69 138 -52 33 14 -64 63 147 -179 131 -161 -68 -400 110 115
6458 115 -50 135 -177 -37 -26 101 -227 -5 -284 28 120 11 264 17 106 29 39 168 -8 339 -167 -169
6480 -169 183 -206 -201 -38 99 -70 -148 -50 -236 199 6 -65 -153 211 -6 -288 131 59 -122 19 154 -188
6502 -188 -116 -115 204 -130 -41 -319 -380 -14 -100 117 230 177 -15 47 203 185 161 -2 34 -168 308 -40 -5 -51
6526 -51 80 -155 -18 -6 406 -178 58 119 -183 -43 314 86 180 145 142 142 -5 -49 47 31 47 254 87 -200
6550 -200 48 360 126 -57 -47 -8 -37 -58 220 -30 -311 11 248 96 10 -29 -285 -216 -44 -102 -136 -65 23 58
6574 58 -191 -104 34 -233 110 10 58 163 80 -209 -42 -48 246 1 -450 -68 52 -142 34 -88 18 44
6596 44 -79 109 -144 -171 -393 174 -138 -116 -259 -48 228 13 -36 -114 14 31 -59 68 107 -358 -35 -76 -109
6619 -109 -70 -182 -77 98 -59 -122 189 -235 -63 53 175 106 -9 56 51 -68 -214 -61 -224 72 -25 96
6641 96 20 45 116 122 100 84 -30 -17 40 11 34 3 -50 -83 0 -75 -94 97 293 -235 -60 -13 167 117 143 163 -60
6668 -60 133 180 -21 -117 114 -12 -170 39 -27 89 -105 -38 -86 18 -10 -89 112 26 -228 22 -47 -48 187 206
6692 206 165 287 54 -35 52 -222 195 225 -38 -192 -342 32 -15 48 129 30 -71 -133 -292 27 138 -39 117
6715 117 249 221 0 139 -253 -244 -165 -111 8 -130 38 -1 -27 52 -262 9 -266 -20 -25 71 179 24 159 53
6739 53 -95 178 234 -92 8 37 -12 -27 -172 41 109 -70 110 145 238 -121 18 -285 -239 106 -5 58 221
6762 221 93 190 251 -108 -36 209 47 -158 -264 95 12 -223 5 47 55 -172 90 -23 225 336 -65 121
6784 121 182 11 -166 -151 70 -86 -188 -36 -14 -17 -53 -65 177 -46 -73 -159 90 143 346 84 -83 75 157 153
6808 153 40 142 15 9 110 -9 57 168 -112 31 -210 146 -51 -38 -129 161 113 131 294 150 -30 180
6830 180 41 -25 121 17 75 112 30 40 156 -129 -182 161 150 -38 246 24 223 205 -216 -35 206 -110 82
6853 82 -57 158 127 50 -199 135 -147 -27 -16 241 -46 -184 -23 -59 190 232 -115 127 231 16 147 -106
6875 -106 174 -124 127 -94 -116 -42 -208 -20 -125 -26 29 -156 133 -86 -82 -130 44 -27 -217 88 19 -76 186
6898 186 -251 294 164 209 -211 -126 57 -93 -174 -187 -185 238 -200 -45 329 -141 -58 135 -102 6 62 265 198
6921 198 -143 -198 -70 -121 -43 -181 24 -13 -37 -66 -5 247 -18 -96 6 39 -196 -73 20 -40 12 79 -198 -62
6945 -62 -207 -3 109 89 -211 112 130 -33 -246 -103 -18 54 -20 -90 -201 -180 -117 -198 18 -152 -66 -73 -111 98 101
6970 101 163 -17 25 -281 49 -184 52 83 -5 -266 -35 -7 -109 -109 326 -10 -136 30 -46 39 -49 -47 -169 109
6994 109 -82 201 52 -78 78 57 165 64 -99 158 -171 101 -28 -92 -106 -11 -82 56 119 -280 218 35
7016 35 -289 133 -269 149 -58 120 -45 -41 -52 -24 206 160 -84 100 -51 -149 -14 19 161 -54 -52 129 40 1
7040 1 -134 84 253 -182 67 -371 -63 251 -210 106 1 -42 144 -315 -203 62 118 -2 -133 19 -218
7061 -218 -288 -69 -94 -7 71 84 -59 45 -44 119 -6 227 -5 4 126 137 140 110 102 -77 -101 -196 -136 276 -94 -119
7087 -119 58 217 -192 212 -196 5 -90 -183 -121 37 343 105 -77 211 152 -172 -35 -71 -71 155 22 185
7109 185 -237 -35 311 -244 -193 -15 297 217 -107 -62 100 -147 53 182 -263 -184 13 -140 -103 98 97 -186
7131 -186 -96 71 68 -139 -29 -72 134 112 51 169 -1 117 179 -200 199 182 -44 -261 78 -33 114 -28 -35
7154 -35 -163 106 12 139 66 -17 -185 -165 128 128 -121 -14 -74 -172 -27 31 -191 -115 -231 -245 101 -34 -97 -54 134
7179 134 -166 -95 9 106 320 70 -27 95 -34 11 -113 -96 -110 215 93 -48 -112 91 13 -92 -385 -206 -48
7202 -48 33 12 305 89 -69 54 -96 -146 -84 58 24 9 -67 10 -143 -171 41 77 -127 108 71 178 21 -120
7226 -120 -126 4 16 51 -111 -40 -294 112 -98 45 -117 -195 -247 -88 -251 -7 -8 -134 156 -457 90 -172 -115
7249 -115 147 55 199 80 -158 -88 -110 118 263 -158 37 -164 97 -1 13 -135 -182 289 -270 127 -238 -164
7271 -164 -101 90 -58 40 36 -100 26 142 302 -61 -52 120 -58 -96 -25 50 -91 142 64 -86 130 96 217 68
7295 68 -100 40 31 -251 8 46 84 194 -85 -311 56 -194 -153 79 92 -151 2 288 -48 60 -71 28 -26
7318 -26 -63 10 31 152 330 199 -240 189 2 -118 72 -105 190 -221 139 -114 -133 -45 400 -5 -162 -162 -147
7341 -147 -61 41 -10 -60 140 -43 13 -124 231 6 -29 92 -173 355 -184 42 46 104 26 -16 61 -46 -39 -32 151
7366 151 62 88 94 -10 -117 -223 -10 -34 -52 225 -24 174 335 -86 2 82 29 -85 -65 24 -90 17 74 -185
7390 -185 -6 151 180 -85 -230 -21 142 -249 -100 133 140 -59 -47 -190 113 50 -53 -54 24 215 -110 160 -20
7413 -20 -157 12 -481 -242 48 -33 -72 -171 130 -91 18 -64 -95 46 92 -41 102 210 27 89 228 37 78
7436 78 -157 -42 46 -227 29 127 -24 65 -218 30 62 -141 261 133 276 -201 181 126 -1 -81 17 150 -102
7459 -102 103 93 -38 68 77 -88 21 16 116 77 86 -44 89 -44 -120 -66 117 146 151 -51 -161 108 165 93 -360
7484 -360 124 -123 97 122 -120 323 -10 -107 -45 280 157 163 0 111 141 332 -157 -33 -93 -5 41 19 -119
7507 -119 40 -18 -60 67 -169 -2 -79 -13 147 177 -212 139 -145 -118 -54 113 89 -194 -49 150 183 67 257
7530 257 -86 144 -27 -264 -136 237 -50 -190 7 -69 -140 43 -147 -146 -140 -80 126 64 170 -51 -50 -72 99 12
7554 12 -307 160 77 -172 202 -113 -19 -156 -277 181 50 73 40 -18 97 -33 -50 -77 26 -310 44 155 -8
7577 -8 -273 -82 -272 232 -22 99 99 72 -28 12 116 87 249 214 172 -148 1 -66 112 69 113 -202 191 -192
7601 -192 59 161 86 326 -187 30 46 138 3 94 257 -73 -1 -324 -98 -3 104 200 -118 184 2 210
7623 210 129 -82 5 -12 -48 -216 119 -49 -35 243 76 221 -207 -67 130 0 89 -26 -2 -68 45 -113 309
7646 309 69 -176 19 29 -161 -229 123 113 -119 -133 157 242 183 -8 -36 206 -88 -174 -17 146 -47 -175 -187
7669 -187 80 343 -72 25 180 90 -25 91 -176 -33 121 26 -278 -176 -67 -102 -140 191 114 -63 177 -197
7691 -197 -125 57 26 19 -69 -161 142 -62 -38 147 81 19 -72 -156 209 125 -78 -188 -145 5 14 60 35 -131 -263 2
7717 2 64 -493 -28 -26 -81 60 -133 -6 63 -203 169 -105 -407 -18 -64 -100 69 -14 -48 101 22 -51 245 52
7741 52 176 82 184 94 34 16 61 49 131 340 296 -85 -191 236 176 -254 3 -124 164 227 234 -321 133 -59
7765 -59 -120 111 104 106 -53 -46 93 22 -47 -162 129 32 -105 -253 -153 95 -62 175 139 145 191 -125 -158 369 198
7790 198 -133 -66 -96 1 81 36 155 53 203 104 -117 -94 -207 53 93 188 -116 93 -71 -150 -239 -99 -88 -126
7814 -126 -59 135 235 133 69 3 -209 -44 -72 60 -138 56 -172 -317 -162 27 289 -118 -61 53 10 182
7836 182 32 -18 -86 -176 3 16 -53 11 -151 -54 48 -32 -65 131 -105 207 -209 -143 105 -18 0 -35 -31 -51 13
7861 13 63 -96 -58 214 33 -77 -35 85 87 30 -47 -109 -65 -73 -23 141 14 173 1 -6 73 169 179 135 -20 355
7887 355 96 -1 -16 -22 83 5 50 -23 63 29 -54 174 -141 10 52 -208 -33 207 54 -46 -19 20 -460 -72
7911 -72 -31 -192 -6 -99 17 -22 13 8 41 75 -316 -98 223 11 -16 -75 -251 -117 -280 -13 94 50 -158 192
7935 192 176 -60 375 183 -140 124 272 130 69 113 -90 65 -132 -134 121 141 -17 107 20 -126 -74 -50 6
7958 6 -158 253 -259 -117 268 144 -155 -206 116 171 -37 103 -159 53 -17 105 237 72 69 -98 -106 181 -230
7981 -230 -60 -162 -195 -101 317 -219 -41 79 126 -46 -78 -15 -35 -193 -220 200 -169 285 -145 30 -129 -144 121
8004 121 48 58 108 141 36 -22 8 -236 -98 157 -27 -30 -1 237 119 -388 30 206 -84 -194 126 114 -107
8027 -107 -69 25 -21 137 81 215 -216 47 238 136 60 -26 -110 -113 214 -217 35 -1 146 232 -82 -59 99 187
8051 187 17 20 -9 26 -82 -74 -163 -83 93 -112 182 -162 -197 -160 27 96 -88 91 -196 -242 52 166 -109 4
8075 4 -37 -96 72 167 -37 278 -138 203 133 25 88 -59 209 -120 -27 -270 -35 -252 71 -94 -99 -124 151 -70
8099 -70 -145 109 -96 -27 95 57 307 263 -107 -228 175 -8 -76 163 201 19 122 -306 82 -159 93 129 -132
8122 -132 -17 -34 88 -29 166 -13 -38 110 66 -4 -107 -27 169 47 91 -22 74 3 116 -217 277 -122 81
8145 81 -12 151 -67 -64 139 -139 -162 -221 172 -108 -56 -150 37 131 85 -19 156 42 -64 304 65 56 -152 251
8169 251 345 -8 17 -242 11 120 50 19 -178 119 -113 143 140 257 -1 -224 -153 -98 -218 -83 -11 -84
8191h4
$$ Imaginary data points
##PAGE= N=2
##DATA TABLE= (X++(I..I)), XYDATA
0 0 0 0 0 0 0 0 0 0 0 0 0 0 -8 8 -8 8 -16 16 -16 24 -24 32 -40 40 -48 56 -67 80 -88 104 -118 133 -152 169
34 169 -192 216 -241 267 -299 333 -371 411 -453 501 -555 611 -674 739 -814 895 -984 1085
52 1085 -1195 1317 -1456 1614 -1794 2000 -2243 2534 -2882 3317 -3872 4608 -5629 7142 -9613
67 -9613 14320 -26399 127068 161867 -150871 -122089 64238 103433 -19567 -19638 2213 -9372
79 -9372 -28118 30331 51377 -17457 -70902 -31667 58950 66926 -24282 -50318 4105 43915 -1837
92 -1837 -11821 17684 3351 -22577 -1338 20858 -29778 -42024 23496 21887 -36379 -36651 25487
105 25487 7953 -43195 -13663 27380 7993 -18958 16194 29161 -11967 -20548 11832 35614
117 35614 -1205 -32169 -2959 32157 9903 -40052 -14348 31870 4862 -41498 -11395 42751
129 42751 3957 -38807 1007 44656 15275 -25334 3328 26786 7354 -8401 2405 7183
141 7183 -5627 2977 7513 -8009 -19983 -8158 13262 -1119 -24847 -19305 13012 22012 -4396
154 -4396 -9682 4630 3521 -7636 13688 30999 -11269 -36860 5894 46558 8158 -44071 -24670
167 -24670 13670 15643 -5757 -13028 -15302 -16968 4266 25753 15729 -20247 -24852 17396 37279
180 37279 6462 -27844 -7693 27060 19880 -5031 -8817 -1472 -10650 -9564 8326 5409 -16460
193 -16460 -18164 7986 12281 -5715 -9169 1547 8317 4315 6718 5819 -1554 -581 8717 12813 -1333
208 -1333 -9792 -450 6193 -6109 -20026 -6300 8637 691 -11776 -6885 4708 720 -3949 1208
222 1208 5097 2714 2808 10771 8584 515 -2025 2240 4464 -2431 -4157 -3157 -5320 -7921 -2353 4124
238 4124 -3715 -12137 -4547 9525 4970 -8803 -1533 11033 10120 1988 4212 7552 -26 -1968 4997
253 4997 3065 -8612 -9499 2762 3448 -6258 -12003 -3507 3753 -3269 -7608 -730 6992 1926 -1114
268 -1114 8294 12653 363 -5987 7931 13273 -3895 -12129 -128 9016 -2275 -11818 -5269 -25
282 -25 -3823 -6777 -2931 -916 -1947 -690 5054 8683 2503 -933 5355 9290 3882 -3901 -562 5275
298 5275 1354 -4719 -2439 -554 -5149 -6989 -4683 -1939 -2902 -5034 -1015 3219 4856 2752 454
313 454 3604 7525 4297 -416 2152 4453 1958 -1081 -1458 -258 -3289 -6879 -5019 -2914 -3698 -4715
329 -4715 -3867 937 3741 177 -650 4992 5950 2194 837 4899 6167 926 -650 3195 1179 -4824
345 -4824 -4752 -1960 -3435 -6805 -6564 -569 1507 -2731 -3319 1317 5661 3020 -884 2681 7369 4442
361 4442 1224 3853 4692 -456 -2918 -820 -113 -6002 -7623 -2802 -1366 -3304 -4119 -1632 587 437
377 437 -328 1546 4066 3509 2523 4127 6592 4600 -972 -194 3354 -848 -5934 -3919 -1065 -3990
393 -3990 -5317 -2388 -886 -3555 -3051 1450 2046 951 1125 2439 5919 6777 3857 373 1855 3719
409 3719 648 -3146 -2091 -1939 -5648 -3803 568 -2224 -6953 -4156 991 635 -2239 -22 3871 4522
425 4522 3898 4129 4413 3507 1657 -749 -186 2028 726 -4144 -5526 -2680 -2004 -3283 -2665 -2076 -4605
442 -4605 -3990 1990 5167 1182 -1473 3656 8884 6525 1598 -967 -915 589 2948 3048 -1010 -6126
458 -6126 -6016 -1876 -727 -3564 -6353 -3958 1342 3862 177 -1977 1490 4983 3302 3540 7816 4797
474 4797 -4300 -4045 3766 4476 -2192 -3938 -477 -2984 -6991 -4806 -2408 -3764 -2862 1668 4110 3745
490 3745 521 -3081 720 8116 7936 -244 48 6843 2592 -7055 -2949 3355 -1879 -5989 -1359 -1171
506 -1171 -7672 -6944 1107 3388 -163 -419 1481 4191 6237 1053 -4684 2126 11894 6374 -4183
521 -4183 -1987 2058 -3041 -5985 -489 -731 -7085 -4866 696 -384 -1992 -1184 -312 660 3898 4163
537 4163 1135 3108 5816 712 -1499 5375 5065 -4714 -5756 315 -732 -3599 -2429 -4020 -7529
552 -7529 -3301 4944 3052 -2835 -2312 -223 2334 7425 5615 -1695 848 7883 4585 -3342 -1973
567 -1973 -633 -5079 -2857 5056 -645 -10262 -5080 1121 -3061 -2963 4376 3681 -2184 325 4933 2375
583 2375 1637 5240 2554 1417 5643 1381 -9227 -5070 3647 -814 -5647 1563 1726 -9938 -8701
598 -8701 4087 2559 -4612 2068 7731 2403 281 2558 543 266 6893 6419 -2924 -2868 2351 -3650
614 -3650 -8219 333 2324 -5311 -3418 2245 -3941 -9202 566 7456 1666 647 6394 3576 -1573
629 -1573 1962 3016 -742 1946 5011 -699 -4973 -630 -1416 -8022 -3534 3940 -1411 -6312 132
644 132 2775 -3113 -1327 6536 5808 386 1594 4358 1767 1019 2230 -149 -1012 1450 -154 -4216
660 -4216 -3832 -2854 -4745 -2905 2058 -161 -5146 -462 6147 2376 -2118 2433 5436 2057 796 3444
676 3444 3114 -263 -1674 -1083 -591 -1520 -3902 -5006 -2008 432 -2535 -4297 -26 1933 -100 545
692 545 3442 3382 523 1208 3929 3275 1074 639 922 432 -1692 -3532 -2997 -1850 -2221 -3042 -1725 -33
710 -33 -1384 -2517 284 3040 1684 -49 2580 5405 2772 143 897 2950 1902 -958 -2389 -1090
726 -1090 -994 -3846 -3838 -1248 -734 -2398 -2161 579 795 -780 -384 3340 4324 2094 1610 3414 2858 224
744 224 -1085 844 658 -1976 -3095 -1190 -1295 -3425 -3824 -1047 366 -1402 -2064 622 2475 1625 925
761 925 2312 4620 2733 479 1380 1948 -36 -1995 -1387 303 -1369 -3951 -2928 -977 -1832 -2873
777 -2873 -1687 423 837 335 1385 3181 2767 1951 1995 2352 2330 193 -628 1192 467 -2657 -2912 -1105
795 -1105 -1009 -3584 -3737 -1296 -126 -1491 -860 1333 2317 1243 948 2364 3535 1282 415 1927 2133
812 2133 103 -1853 -933 27 -2046 -3926 -2346 -1116 -2154 -2626 -772 1075 475 -24 2196 3261
828 3261 1881 1205 2185 2762 1686 -140 126 1433 -632 -3137 -2502 -1091 -1715 -3637 -2801 -306 -308 -1477
846 -1477 10 1794 1789 779 1167 3132 2806 806 630 2222 1453 -838 -1505 -954 -832 -2679 -3272 -1614
864 -1614 -802 -2090 -2146 -104 1513 284 -885 1993 3564 1790 672 2141 3111 1270 -781 68
880 68 839 -1045 -2743 -1927 -939 -1720 -3433 -2316 345 -186 -1967 -613 2204 2285 460 972 3492 3265
898 3265 923 629 2049 719 -1699 -1879 42 -610 -2996 -3384 -1356 -229 -1951 -2054 -78 1620
914 1620 -237 -463 2655 3304 1119 506 2706 3244 442 -694 82 77 -1284 -1826 -1520 -1477 -2087 -2686 -2096
933 -2096 -41 -445 -2030 -687 2919 2695 281 961 3068 2213 332 1283 1526 -425 -1507 -275 -281
950 -281 -1658 -2536 -2098 -2153 -742 -766 -2075 -978 1605 705 -483 1958 3860 1608 140 2735 2848
967 2848 -601 -1045 1133 454 -1670 -1587 -951 -1709 -2951 -2227 -1471 -476 460 -166 -63 1571 1675 122
985 122 1061 3550 2883 142 354 1857 124 -2677 -912 929 -1132 -2953 -1912 -1279 -2620 -2792 -67
1002 -67 2058 1377 146 541 1138 1635 595 1036 2515 2710 678 -890 -702 -957 -1888 -2445 -180 348
1020 348 -2246 -3368 -1116 -100 -1498 -750 2733 3109 -32 -130 1674 1585 1073 1895 1948 1025 74 -1109
1038 -1109 -2008 -2077 -1292 -1511 -1748 425 12 -3603 -2552 1578 1751 -570 1287 3634 1989 -331 1659
1055 1659 2379 187 153 1399 121 -1345 -1499 -2483 -2403 -785 -461 -2313 -1483 663 -393 -2081 1231
1072 1231 3760 461 -329 2981 3060 -67 17 1968 282 -1485 -488 -98 -1630 -1694 -1359 -2013 -869 -128
1090 -128 -1830 -1620 1736 1897 -621 528 3675 1552 -1020 1473 3495 474 -571 603 6 -2181
1106 -2181 -2079 -1039 -1187 -867 -627 -1977 -1957 179 -576 -1925 2036 3687 215 -497 2718 1905 -1144
1123 -1144 245 3072 1229 -1554 -434 -552 -2861 -1710 -922 -1238 -481 77 -1350 -1885 568 1400 -423
1140 -423 937 4267 1984 -1266 743 2569 -502 -810 1901 1119 -2054 -2039 -809 -2154 -2324 -243
1156 -243 -571 -994 391 283 -1748 366 2550 933 353 2820 2995 -628 -922 2006 742 -2067 -249
1173 -249 595 -1677 -2740 -1366 -1162 -1633 -458 110 -296 456 1274 -84 211 2621 2281 -230 906
1190 906 2489 445 -1889 -122 1107 -1491 -2397 -361 -393 -2006 -1628 -574 62 -144 346 542 770
1207 770 1499 919 342 1859 2414 214 -208 1272 602 -1655 -1396 -50 -636 -2289 -1529 -148 -454 -1121
1225 -1121 -485 317 766 563 757 1410 1935 1154 556 1281 1405 61 -909 61 432 -1161 -1710 -895 -470
1244 -470 -1250 -1409 -461 304 -452 -493 856 1290 1171 832 1216 1903 960 -41 420 544 -212 -1238 -999
1263 -999 -408 -817 -1896 -1428 -463 -823 -955 -347 848 612 36 756 1870 1592 729 570 893 899 -382
1282 -382 -740 50 -78 -1239 -1368 -997 -551 -1433 -1684 -246 523 -172 -353 907 1504 840 371 1310 1980
1301 1980 449 -67 220 732 -360 -1248 -1086 -215 -928 -1938 -1556 -340 -518 -1130 -298 878 1001 30
1319 30 798 1912 1247 383 324 1363 1180 -168 -567 117 -415 -1508 -1363 -837 -124 -1534 -1644 -21 524
1338 524 -400 -447 949 1580 629 601 1287 1607 305 276 489 341 -207 -1219 -822 -382 -1447 -1499 -821 -302
1358 -302 -285 -474 -177 738 474 343 614 1576 973 128 633 1328 609 -589 -387 95 -404 -1222 -1172 -705
1378 -705 -804 -1009 -1116 138 161 -43 346 717 1487 1162 334 909 1400 334 -463 724 491 -710 -1201
1397 -1201 -339 -335 -1384 -1653 -372 -276 -1163 -411 491 876 453 489 1067 1427 1189 425 334 1175 310 -700
1417 -700 -559 223 -418 -1933 -980 -162 -784 -1721 -402 452 -89 -166 476 858 931 758 691 1112 1116 304 -45
1438 -45 260 346 -970 -1470 -265 -342 -1232 -1172 -84 -363 -760 -330 633 953 431 671 820 965 527 234
1458 234 481 674 192 -101 -459 -50 -799 -1547 -674 170 -789 -1352 -197 402 -360 97 741 843 726 782
1478 782 801 615 866 267 -136 317 401 -1044 -1091 -201 -12 -1672 -1176 -226 -287 -871 -163 670 419 319 853
1499 853 826 782 804 517 562 672 431 -902 -799 129 -700 -1448 -664 150 -910 -1531 2 555 -279 -263 1062
1520 1062 1241 465 373 527 798 458 770 112 77 -49 -1077 -1320 -696 -258 -992 -837 368 -171 -1099 -623
1540 -623 680 904 640 922 1242 703 -246 195 653 215 44 -86 45 -809 -1318 -1359 -462 161 -206 -322
1560 -322 106 198 -226 -192 615 1273 757 524 559 753 -144 -415 224 1115 -297 -1107 -440 -266 -1169 -1139 -135
1581 -135 63 -255 -107 -22 74 226 482 702 969 1563 525 -207 273 615 -612 -1020 249 -203 -1440
1600 -1440 -1176 -175 -383 -1156 -335 370 -64 -159 314 706 372 1018 719 376 826 903 -360 -448 444 -488
1620 -488 -1172 -586 212 -693 -1325 -113 494 -637 -298 673 389 202 664 904 1006 296 588 -8 5 956
1640 956 -61 -952 -102 169 -1315 -1375 -264 -425 -1071 -122 914 323 -475 395 741 473 729 996 624
1659 624 520 550 -381 -306 190 221 -988 -671 210 -1044 -1498 -154 395 -567 -146 781 400 -14 354 902
1679 902 769 488 710 426 -32 82 -270 -747 -49 40 -916 -823 33 -278 -1092 -140 764 314 -357 670
1699 670 889 438 266 831 787 438 282 -134 -326 -190 -346 -971 -584 114 -662 -841 -329 408 -321 -564
1719 -564 831 1116 77 210 717 746 219 433 721 191 -8 -507 -677 -546 -362 -877 -824 -187 -241 -702
1739 -702 -226 595 479 -254 679 884 471 -37 511 718 104 28 -92 -243 -213 -453 -614 -189 -363 -806 -829
1760 -829 -262 399 -106 -142 914 596 210 275 429 785 217 224 354 193 -183 -596 -359 -314 -874 -666 -537
1781 -537 -36 -336 -714 -196 500 261 225 455 883 616 -43 615 758 8 -211 -307 238 -210 -791 -516 -116
1802 -116 -493 -850 -342 -2 35 -355 246 394 375 282 108 735 479 25 124 230 410 -310 -625 -274 -288 -457
1824 -457 -705 -216 -254 -255 -452 147 578 188 227 388 474 425 196 438 454 119 -234 -126 -111 -280 -733 -482 -250
1847 -250 -576 -719 -238 -6 121 37 191 494 374 207 314 787 160 446 29 162 153 -509 -647 51 -361
1868 -361 -783 -636 -261 -67 -486 -383 104 464 282 -13 343 736 493 324 461 535 -46 -1 -370 -73 -299
1889 -299 -748 -367 -18 -510 -641 -190 177 -67 -232 221 434 97 -5 336 749 377 -68 225 336 39
1909 39 -84 -235 -87 -113 -439 -545 -127 -66 -270 -47 488 443 287 173 561 762 -84 182 504 173 -239
1930 -239 -171 70 -332 -244 -474 -260 -264 -191 -398 -237 294 301 -556 205 952 265 -8 741 712 74 -156 334 402
1953 402 -488 -49 -192 -333 -410 -137 -263 -210 197 151 -264 244 427 -277 140 637 641 112 -21 799 86 -421
1975 -421 -197 166 -399 -395 -499 -340 -450 -118 -165 -127 228 147 -117 23 673 532 158 563 736 -315 39
1996 39 161 234 -373 -318 115 -504 -458 -448 -437 -61 168 3 -170 265 358 127 -276 685 820 -34 249 381
2018 381 106 -407 -122 285 -232 -440 -243 -226 4 -281 -154 13 50 -75 17 249 868 492 7 411 712
2039 712 201 -219 420 -234 -242 -281 -72 -176 -498 -724 -167 -12 249 -218 16 274 355 59 318 967 444
2060 444 113 251 313 147 -434 -52 44 -478 -440 -405 -489 -244 -97 16 86 126 199 -82 286 562 213 66 864
2083 864 559 76 -64 185 80 -359 -258 175 -212 -465 -384 -200 -127 22 195 461 538 76 -181 58 442
2104 442 283 10 265 314 170 -401 -513 -396 -344 -157 -177 22 -270 -216 -460 163 222 -16 265 495 374 -13
2126 -13 -131 667 455 -147 309 145 -239 -336 -81 -474 -411 -294 -44 -110 -152 -9 -309 286 504 108 -63 370
2148 370 712 -283 29 793 140 -59 -327 175 -108 -524 -318 -256 -184 -360 -362 -36 116 425 225 -116 608
2169 608 213 -9 23 523 455 -116 386 291 -387 -549 3 -306 -184 -165 -129 -374 22 120 -148 40 635 126
2191 126 191 464 485 -113 -359 192 245 194 -522 -116 -169 -244 -475 46 -94 -205 -220 -39 -130 93 379 184 392
2214 392 360 107 395 378 -3 -266 69 39 -311 -565 -514 -127 -11 -439 -157 -161 -302 -149 18 176 533 274
2236 274 230 539 342 139 -126 271 256 -379 -215 -129 -126 -368 -287 -224 -352 -300 -156 448 23 498 94 314 598
2259 598 353 79 163 295 -61 95 3 153 -211 -428 73 -111 -392 -450 -250 -31 66 -137 4 498 305
2280 305 15 182 373 355 186 -27 91 156 -30 -560 -139 -79 -78 -253 -48 156 -328 34 260 240 11 83
2302 83 418 459 195 84 307 242 -25 -268 -110 -243 26 -342 -272 -8 -226 -328 -69 177 -2 -80 155 449
2324 449 49 -84 343 432 84 -465 178 291 -8 -239 -174 39 -26 -303 -236 -35 -273 11 -179 413 194
2345 194 131 128 323 269 209 78 439 445 -221 55 -196 109 -384 29 26 -64 -235 -286 -106 -157 93 -142 250 53
2369 53 -16 113 96 257 256 -1 -100 131 -162 -257 20 -39 -330 -415 -327 -19 126 -415 349 220 354 87 150 391
2393 391 155 -68 440 104 146 -28 -46 111 -158 -325 -426 -90 -135 -197 -124 313 1 -152 -81 111 41 199
2415 199 152 -127 388 274 -91 96 347 -177 -638 -268 191 -255 -46 -428 -4 -294 -315 -41 269 418 -106
2436 -106 173 59 67 119 242 80 111 52 -194 40 -281 -58 -77 -103 78 -491 -51 -132 185 -45 -161 279 301
2459 301 178 197 -45 292 189 100 -139 -151 -100 -299 -102 -58 -259 -330 -12 -49 56 -46 306 296 -183 269 163
2482 163 118 306 61 60 112 -80 -133 -62 65 -69 -550 -163 -200 -177 42 -11 249 -145 61 234 88 138 188 331
2506 331 118 282 243 -269 -260 415 -143 -362 -299 -322 -212 -601 -62 32 -116 -312 188 301 -127 322 120 118 30
2529 30 294 83 251 336 135 -220 -58 -130 -196 -469 30 -83 -387 -403 206 -8 -204 90 -80 238 204 -2
2551 -2 79 344 41 156 -22 -4 53 -145 -100 256 -247 -494 143 47 -231 -119 154 155 39 125 183 114 239 3
2575 3 275 239 -115 -258 12 -41 -201 -299 -187 -46 22 -186 -398 153 -61 -58 158 -7 191 48 102 33 97 272
2599 272 139 -229 -194 -138 -207 13 46 -143 -112 -99 -14 19 -40 566 113 27 85 82 297 291 47 157 310 -86 -209
2624 -209 97 -68 -76 -97 -268 8 -57 -178 -17 -27 111 42 380 270 372 237 94 -78 121 54 -317 129
2646 129 -31 -23 -136 -147 -448 -235 -271 -26 -95 -88 -85 175 52 61 -260 142 -111 80 8 120 92 54 90 271 8
2671 8 -401 -190 -96 -136 -271 -85 201 -24 9 226 70 163 -98 41 -5 94 -87 -359 38 301 -90 -140 43
2694 43 49 -141 -311 103 -43 223 -274 58 249 37 -112 142 246 -33 41 8 -11 -18 31 74 -12 -84 -122 -161 -84
2719 -84 -98 4 113 69 199 -151 -149 184 2 170 12 160 -245 47 142 -210 24 -50 -52 -155 -124 12 -308
2742 -308 13 -13 -253 -172 -32 118 187 -143 193 266 185 115 -147 184 7 -204 150 63 -160 -26 -22 -442 -251
2765 -251 -92 2 120 18 56 -125 255 64 -41 -185 337 170 225 30 -80 59 -106 1 -336 -266 76
2786 76 -294 -73 19 -148 -155 56 28 6 200 271 -47 90 -158 151 43 -204 -40 40 -214 -204 -147 -412 -139
2809 -139 -82 -56 10 -95 253 180 284 338 171 -4 64 264 34 26 -94 -34 73 -127 -34 100 -45 11 -116 211
2833 211 122 -126 67 127 -232 71 27 20 109 143 -85 125 -50 -19 -5 39 161 -192 -11 -111 16 60 -238 -133
2857 -133 125 184 126 8 -126 17 103 48 -160 202 -83 -99 17 377 -136 -129 132 -116 58 -12 -53 -139 138
2880 138 110 178 115 205 157 153 262 -23 -131 316 -135 -8 -96 -194 94 -214 -72 26 248 79 -117 -46 -257 -77
2904 -77 38 -15 9 86 61 13 196 74 -200 -82 -22 -72 -15 -202 -36 -166 -92 8 41 234 216 -57 -34 -197
2928 -197 127 99 174 300 47 -35 -54 -73 -117 101 -21 -147 -342 -49 205 -156 -38 56 -261 296 143 -129
2950 -129 44 212 130 -49 226 -167 29 53 -232 -108 89 157 -256 -106 -61 -183 -338 64 45 10 -43 50 -165
2973 -165 79 -157 -188 17 119 6 -18 167 -186 -11 -62 -99 -41 -204 -111 26 -82 -95 -81 173 -79 -115 308
2996 308 41 -247 -48 57 250 -73 -96 101 104 136 -185 -100 -247 -83 4 -203 -40 74 128 -171 138 36
3018 36 181 -83 273 82 65 152 58 160 -37 159 68 -32 -96 23 -53 -82 150 -211 -173 219 -97 168 194
3041 194 -152 64 -97 130 288 15 74 323 -169 40 -53 112 57 104 44 82 177 78 -128 90 188 -167 -208
3064 -208 72 -34 121 -283 191 133 -47 -100 -80 81 45 -248 40 82 87 143 54 44 91 249 159 42 160 242
3088 242 78 -20 -324 -102 -161 -109 -188 -4 -33 90 107 73 10 -137 -156 114 48 113 -45 136 58 136 -112 169
3112 169 9 293 25 3 143 -67 -87 10 213 -47 258 -106 88 91 153 -67 10 215 22 -166 28 -32 129
3135 129 -97 35 -70 -119 -125 292 -116 -58 36 -119 -46 32 -72 0 302 -108 102 -254 -25 -45 81 -94 -136
3158 -136 -86 5 -12 -28 229 -5 -109 -107 -314 -493 81 -109 41 -6 -10 -76 52 84 -6 -151 98 14 241 158 278
3183 278 97 89 50 77 53 -138 98 155 -60 -113 -103 -161 96 19 -38 -309 107 -14 -163 -82 -116 36 42 -165 81
3208 81 -146 279 141 -64 128 41 33 -209 169 -16 -148 152 -99 -222 -17 62 80 125 -133 -47 -143 -9 378
3231 378 388 -13 112 -74 109 40 -74 54 180 219 260 120 -204 -5 36 -131 -86 22 -51 181 -35 48 -49
3254 -49 214 -20 225 -191 20 88 144 16 72 108 -157 -72 -95 -89 -155 -157 83 -115 -282 -122 -83 19 16 34 -98
3279 -98 37 109 150 71 212 189 158 128 -123 -13 -73 -169 -39 127 -150 65 -303 70 -56 118 169 -18 -44 -6
3303 -6 72 -32 138 61 -36 59 -84 -91 53 5 47 -174 -150 -84 194 1 -33 -261 166 103 17 -58 170 36 149
3328 149 -49 -181 -69 36 -178 209 46 -138 -30 206 -90 -142 253 -26 -92 171 -88 104 13 -112 77
3349 77 230 150 -79 183 266 -146 -58 197 -130 -175 -41 273 -75 -91 59 116 -232 37 73 207 -94 -398 153
3372 153 -12 -207 238 -26 124 -41 41 -7 -52 -31 -276 -44 301 -49 253 15 288 -226 139 162 -219 120
3394 120 -30 -65 -141 -54 60 72 29 16 147 -56 -56 41 150 150 -113 96 -74 -153 -74 183 -42 22 -72 -194 195
3419 195 3 -111 -157 -46 -46 -38 110 -4 -52 99 -190 -139 37 74 77 1 18 -115 -69 272 143 -58 -87 157 71
3444 71 -80 -164 -168 -282 -219 25 3 -47 119 312 89 46 75 98 -45 85 -163 90 96 -181 -76 -125 -41 116 -280
3469 -280 85 -83 -162 -22 -258 30 -19 45 85 -9 132 31 107 -208 185 76 -252 13 272 -25 -17 186 -22
3492 -22 27 50 27 146 27 -148 185 218 -18 -138 -224 -212 46 -8 -54 -27 166 -104 -181 186 211 -12 -64 -366
3516 -366 -104 77 -97 283 34 245 -7 133 113 89 -162 267 118 -38 256 -107 -8 -129 25 -54 86
3537 86 -112 296 108 -86 84 41 -25 157 -122 247 175 -33 -8 -35 25 95 -119 136 50 -222 71 10 -100
3560 -100 -99 14 -302 -278 -46 -186 -49 79 231 80 -101 133 186 -158 39 101 -175 17 -70 -259 -6 153
3582 153 1 74 90 49 160 37 -29 116 126 -77 50 1 -32 89 24 -219 -205 -11 0 -136 -65 26 -171 21
3606 21 -66 81 -192 33 37 156 -39 76 -157 -19 78 -248 -194 114 36 15 -80 -163 -65 11 -77 -204 128 -113
3630 -113 -77 -73 118 206 -131 27 122 79 66 80 -27 356 -162 80 -125 292 -22 -134 -26 202 -236 17 31
3653 31 -47 -2 235 21 -55 211 136 -78 -23 -183 119 23 206 108 -19 60 91 8 -62 85 11 -56 -95 91 -50
3678 -50 195 110 -243 -34 248 -7 -2 -293 77 25 -8 64 72 -91 -33 -116 84 133 21 99 -173 125 172 -25 69
3703 69 -11 -213 194 21 -156 30 -165 -169 -131 -60 -188 -5 125 99 63 67 179 325 -149 -164 -103 31 262 -73
3727 -73 -116 107 31 -96 -119 -3 3 32 77 -43 226 157 42 95 -20 -71 -120 -108 106 -44 65 -21 66 48 102 153
3753 153 -12 270 -70 86 -68 143 -296 60 -180 -100 115 253 -35 116 296 218 191 -66 5 184 61
3774 61 12 28 64 -202 107 18 -86 89 -160 -199 37 -169 33 -224 -252 105 -104 -37 157 132 -86 -41 -109 106
3798 106 157 69 69 19 -200 53 242 -177 -105 -10 -198 -198 -44 108 -38 -26 -14 38 33 393 -43 -262 121 -56 162
3823 162 29 -165 -55 -14 -100 -92 110 -405 27 273 26 5 252 -125 -271 -66 -83 64 -14 122 82 105 109 63
3847 63 -88 -92 108 52 -222 179 -60 180 95 -86 256 187 120 -115 -34 -16 10 -64 -103 -8 23 79 -116 190 -85
3872 -85 58 264 136 -70 -395 -17 -196 35 87 267 204 -24 -40 -29 -58 103 114 112 110 235 78 -148 -287 -112
3896 -112 -224 -16 -188 -301 143 -11 -17 147 -74 99 -102 -114 65 -230 -45 41 171 -151 141 -118 -235
3917 -235 -99 -37 90 -121 -20 -105 -58 -243 227 -202 -167 -74 121 158 -90 156 -5 59 51 37 75 109 42 -205
3941 -205 -159 -55 18 114 156 147 -146 -29 204 74 179 189 -40 -20 83 -78 127 47 -62 136 95 268 -96
3964 -96 205 99 68 -27 77 87 -41 -158 0 38 -118 71 -7 -21 -38 100 22 -164 223 163 -127 122 -15
3987 -15 -336 26 96 -232 -139 331 -108 -62 111 97 182 38 180 119 252 -71 -180 295 265 -146 255 -173 16
4010 16 46 -166 209 201 50 -50 29 54 265 -94 126 70 -50 -140 14 162 -208 -274 -158 62 53 107 103 -222 90
4035 90 271 -72 55 -146 -71 14 78 -154 -35 28 -11 70 -355 -40 144 -146 -55 -93 -180 -33 7 19 -30 -123 158
4060 158 105 203 77 62 190 -224 -141 50 -115 64 127 -75 -279 44 -286 129 -2 -156 45 127 -55 152
4082 152 -28 56 193 138 128 39 -85 120 -262 -12 10 -12 -30 -61 -204 -70 84 207 38 -233 -15 -176 4
4105 4 147 225 21 -71 -59 8 -185 -72 -82 -66 350 -59 29 -8 51 23 -117 -64 143 -84 -29 262 -144 392 -54
4130 -54 69 100 -1 -51 25 297 -189 165 -66 49 -153 -26 123 -82 17 -40 -58 -33 -120 72 -113 -144 159
4153 159 -201 18 -60 -93 -55 21 -59 71 101 -171 -61 -127 -135 -162 67 -142 25 48 247 46 -152 203 165 111
4177 111 154 124 4 -220 -144 -130 -146 -114 -146 -131 -85 125 89 -175 154 197 -14 120 -25 65 33 13 71 77 94 -184
4203 -184 66 58 54 191 235 -207 198 22 111 203 52 -113 285 253 182 143 -207 -105 74 -186 9 21 -87 -258
4227 -258 -22 273 15 -44 -147 -161 77 361 -130 267 -59 -44 -41 -208 61 124 -72 82 60 -44 96 207
4249 207 171 -70 -173 -63 -223 -223 75 -181 4 180 -3 -71 -32 234 314 -178 -121 13 -20 -241 216 -26 -63
4272 -63 -47 -38 33 -66 -254 197 216 360 40 -131 4 85 -11 -20 -105 -104 134 -59 101 -127 -151 -27 80 -18 -180
4297 -180 -86 -62 26 -158 65 -39 -108 -152 236 216 106 45 -142 5 84 -41 -156 -252 123 -44 -175 -166 -181 -206
4321 -206 -62 13 -89 -64 -63 66 0 -291 31 253 114 -69 47 -17 49 315 362 -65 -183 -25 -258 9 86
4344 86 -292 -168 -125 53 206 62 304 11 143 163 -96 11 -226 182 -150 -23 -113 -183 -103 71 -193 -126
4366 -126 121 35 -140 3 168 226 -104 -20 -311 23 99 176 123 -216 -158 -116 312 -159 -253 -48 -285 245 220
4389 220 -396 -115 70 134 -9 200 -94 268 -161 52 -25 8 -111 -58 -172 -154 -282 -51 -104 17 59 71 -123
4412 -123 -345 -30 -262 86 -23 -212 -146 41 -146 69 4 -129 -130 -88 124 -37 -5 -53 78 -70 -201 -167 37
4435 37 -11 258 -58 17 225 -78 226 -95 -200 -59 -86 -28 -182 -143 8 -178 -147 -314 -124 -314 64 43 138
4458 138 -42 -145 68 90 125 107 0 20 15 92 -5 76 -97 -20 260 62 -370 27 -62 182 -264 -70 -57 272
4482 272 244 -40 57 221 121 -223 259 -26 -52 162 -176 182 -210 -149 78 23 -86 68 216 -104 161 37
4504 37 -104 79 96 121 -96 33 101 221 272 63 44 -14 60 304 287 37 -87 100 -126 -278 -288 38 -17 -1
4528 -1 23 -33 -16 -78 133 45 -162 -49 -222 -161 -40 -75 -113 -37 -303 74 -277 99 14 -49 186 -70 -29 -27 53 4
4554 4 -34 110 -31 118 -222 36 81 123 131 161 -89 111 -70 196 107 -63 292 71 -21 58 227 70 -125 186
4578 186 -31 150 -145 -317 -15 -20 67 -123 -12 -148 88 -194 136 379 -4 -315 6 -184 -70 110 132
4599 132 202 -357 -139 107 2 -41 56 177 119 121 -18 -268 -46 -97 231 252 -54 -81 124 -82 -9 75 135 99
4623 99 -107 -37 85 203 -7 -159 -231 221 146 -29 13 -8 326 99 255 32 -189 136 219 -152 -31 56 -173
4646 -173 28 -92 -164 228 -58 -98 -22 -215 142 -234 -114 181 32 54 77 96 312 54 -35 -11 -101 86 -42
4669 -42 -75 255 95 -111 10 -60 -43 -168 -194 -37 -23 37 -53 142 182 152 50 345 -178 -84 21 -11 -37 -120 -220
4694 -220 -207 -3 6 -202 -269 150 349 -44 319 188 -177 -35 59 74 24 -54 183 -273 -16 -113 -175 -139 -17 -79
4718 -79 -69 126 -58 -166 136 128 -107 -141 -51 25 -113 32 294 73 -96 -206 255 218 -233 -298 163 81 -55
4741 -55 -51 85 -134 110 -53 -157 75 115 -115 -74 176 -180 -13 -86 193 -104 53 -72 285 153 -31 10
4763 10 -113 107 -99 99 27 -66 288 -148 88 143 -58 155 34 172 -143 152 57 -215 9 -172 -89 135
4785 135 -77 105 93 11 140 -247 -47 56 34 115 -57 315 94 31 -42 325 -108 85 134 209 144 -36 -13
4808 -13 -48 -166 111 135 -183 -197 -136 179 -39 316 -188 -18 27 151 -190 -52 -33 -57 -166 239 -257 -102 111
4831 111 -220 -21 -46 132 14 34 -5 140 211 427 -213 154 -32 33 -240 11 -149 -54 -1 -132 152 179 86
4854 86 46 -95 -19 114 -119 -74 362 280 84 21 324 -16 -3 -84 -184 -147 -90 -98 53 -45 32 2 -133 -176 94
4879 94 87 10 205 -150 170 -220 196 69 -62 12 35 -181 -315 36 239 -112 -1 -543 157 266 -63 198
4901 198 -8 141 17 12 8 259 167 -103 137 27 -356 -97 52 168 141 29 25 -31 -99 75 44 -31 -53 85
4925 85 137 -11 -60 165 -4 26 -89 -31 -134 -145 287 122 -238 -63 -20 174 89 -62 14 67 -16 -97 -7 -128
4949 -128 -35 -47 170 75 25 156 73 43 -143 69 16 38 -95 217 -2 -74 26 45 -189 -119 -47 34 -364 -61
4973 -61 -244 -108 36 107 -251 158 10 393 196 -107 -39 -148 -155 -230 -7 113 -31 -16 29 300 -35 -13 265
4996 265 69 256 -63 280 49 -155 244 -13 103 -151 68 -334 2 -81 11 -71 68 -197 -18 58 -127
5017 -127 -189 175 -115 -105 -206 152 -31 -84 -106 -79 -97 -151 -23 177 -143 -74 -72 -32 -109 43 -127 -62 -77 15 0
5042 0 -122 -92 45 41 -50 213 79 160 40 125 38 45 -282 108 -102 -214 -124 394 -104 120 -148 106 158 -112
5066 -112 89 45 -165 70 -52 -180 -32 -263 -13 -66 38 80 -140 20 41 42 -107 242 265 224 -181 178 -209
5089 -209 -273 301 57 138 101 114 -363 135 -11 -119 36 -49 -77 -59 -88 147 -80 -66 96 50 -51 -3 112 -81
5113 -81 32 -39 124 243 71 207 -39 -127 17 -73 -115 -60 -112 23 -79 15 -33 -121 -162 104 7 -40 43 33 278
5138 278 45 331 93 243 -23 -66 53 279 -173 33 445 180 -82 83 222 272 -192 -210 -224 -11 -75 65
5160 65 -360 -185 -100 307 -15 -36 -112 34 178 63 83 10 39 -113 127 77 -129 -162 -96 -18 212 -218 -150 -92
5184 -92 186 152 19 13 -206 31 125 -141 -9 11 -10 -203 49 -82 88 -32 76 44 3 -97 74 -71 -134
5207 -134 -47 -56 41 -130 -34 -42 129 -204 -179 -61 -94 34 -134 -276 -93 101 -86 -49 -130 -84 -125 -104 -4 53 5
5232 5 -188 24 -209 -111 34 -147 44 60 -195 -73 109 73 -284 58 112 255 76 170 190 14 222 -38 -142
5255 -142 14 -90 -36 11 -125 177 87 178 -158 -138 155 59 -39 25 -82 78 355 -127 49 28 -158 74 59
5278 59 -57 -239 -147 134 34 -46 -19 -4 -99 -174 13 154 -112 83 -55 -93 -27 188 -63 58 7 92 -91 -329
5302 -329 -12 -50 196 65 -328 -192 -118 225 142 107 172 -99 -111 158 -302 119 -241 -27 -123 136 13 164
5324 164 -7 24 -86 93 121 25 -107 -210 -104 -108 28 26 -104 44 622 -43 83 -120 100 -168 -15 102
5346 102 -207 21 104 -153 52 -46 -31 -1 217 -41 -210 99 -24 99 -77 294 -61 253 -49 143 277
5367 277 177 49 -252 -60 -247 54 209 -333 125 97 136 -216 -31 69 241 5 -157 -204 -40 24 -390
5388 -390 54 -48 -61 38 53 -67 50 -289 246 -51 340 -71 -35 -41 201 195 63 63 26 48 -208 26 -37 5 209
5413 209 -437 -197 -190 16 -42 -237 -94 -61 284 277 45 -96 203 80 -303 5 159 -196 -223 13 109 176 -17
5436 -17 -231 -40 165 18 249 297 89 317 -69 94 0 -2 168 2 87 13 -86 142 73 22 74 264 97 59
5460 59 318 -96 50 -55 -103 -188 -22 164 -123 -93 50 108 -1 30 282 -313 144 194 145 -97 76 -215 3
5483 3 -61 408 257 -186 177 -105 191 -65 248 40 -52 -398 93 -26 173 15 7 -13 130 26 99 31 -173
5506 -173 -23 -20 66 136 269 271 9 196 -49 -229 174 -53 -41 158 39 -113 -143 -77 325 71 8 -158 -26
5529 -26 -87 -353 142 140 -139 328 120 73 344 76 -39 51 24 -418 193 -43 134 203 62 -83 47 -223 -61
5552 -61 101 198 43 -267 138 188 73 -220 2 53 187 270 76 98 89 60 -364 85 -19 49 -97 -186 -159 264
5576 264 59 -13 150 -194 -29 -156 37 163 -117 51 303 -29 -242 -171 -130 -29 -155 -222 -83 -159 186 105
5598 105 72 336 -28 -197 61 15 -128 -132 32 79 142 88 100 -23 -54 55 -4 61 -203 142 -112 47 42 206
5622 206 207 136 48 -30 139 3 5 245 -88 -143 -249 -192 -94 -133 -101 -214 -291 -84 -17 -151 131 9 124 25 -57
5647 -57 101 120 136 126 5 145 -183 129 -194 53 -29 41 -258 -98 -134 66 172 28 -273 -94 146 44
5669 44 19 -70 68 -365 47 -141 -102 149 -9 -220 -65 -63 -57 102 -126 -163 -210 21 0 53 -2 363 244 71
5693 71 61 337 -139 54 -77 63 -187 45 -101 -42 -41 -209 25 14 -112 -85 25 327 97 73 -68 289 -64
5716 -64 -25 63 62 -11 -206 9 -126 92 -168 -133 -129 -340 -66 12 203 -75 38 27 -92 160 125 -114 -14 -114
5740 -114 28 118 -87 -142 88 37 121 178 -30 50 -69 -17 155 144 38 9 -31 43 255 -64 -78 26 100 -175
5764 -175 -244 288 -68 -62 -291 -42 10 265 393 -202 -179 74 272 -59 162 160 157 32 200 205 -33 -34 116 -53
5788 -53 -80 -164 144 -96 -3 -43 -19 29 -162 26 -202 47 -142 -190 100 -101 -124 87 -127 -5 -268 186 -80
5811 -80 -259 6 -85 110 -208 -52 -194 6 -46 -24 75 175 -51 103 52 162 30 -117 -36 145 79 -102 166
5834 166 -166 62 -12 -101 261 -155 42 79 -114 114 128 172 -112 239 71 -18 -45 -44 20 -273 18 -38 -6 162
5858 162 223 42 2 81 93 20 47 -145 -9 89 -124 -66 57 46 -31 -33 -360 -377 187 -47 11 -24 -125 8 79
5883 79 140 38 102 126 -79 -90 -161 -66 -52 -75 149 -196 -152 178 -72 235 7 -222 -323 -241 226 -74 106 19
5907 19 -306 79 11 -65 270 104 4 13 31 -15 77 131 364 -125 25 27 56 -128 2 -192 -35 -58 2 -90 122
5932 122 88 -171 87 -42 -195 57 -209 46 365 -34 6 9 102 -333 165 -164 -238 18 -120 -221 171 70
5954 70 219 -17 -235 -124 -14 -90 -8 104 7 -96 -62 251 137 -15 69 111 -107 36 24 -328 200 220 69
5977 69 14 125 -71 31 42 195 148 40 -104 -123 33 8 -78 -5 213 -139 55 64 -8 54 136 -115 59 60 -6
6002 -6 20 -5 33 341 -60 21 -12 -120 279 -73 129 225 -12 7 127 -23 106 99 33 114 138 107 166 -28 0 127
6028 127 -36 162 145 101 228 106 -50 -10 77 -54 144 -233 -20 94 -227 214 46 13 -50 88 285 28
6050 28 34 -63 -25 124 -299 47 175 -196 -163 -41 -148 38 16 81 -147 1 33 -203 9 147 -61 173 -161
6073 -161 -104 273 192 211 40 191 -34 116 159 8 -119 98 -48 28 15 -174 -135 71 -58 259 190 307 79
6096 79 12 79 18 21 -282 -65 218 -216 104 -333 -109 -124 -125 -49 -132 144 109 302 -9 105 -109 213 -24 148
6120 148 -71 -172 10 71 -147 58 169 66 -197 41 -126 52 129 -119 101 -84 -94 263 243 -241 349
6141 349 202 -66 135 131 -62 167 64 -287 31 35 -182 354 136 -4 -94 -86 152 -8 -36 -28 -74 97 -16 -120
6165 -120 -14 -112 195 107 -87 -39 -44 108 -31 12 -42 -218 70 313 -72 -54 -111 71 -87 -26 74 21 179 -33
6189 -33 -141 19 -223 92 -213 -68 -276 -139 -173 -108 196 136 124 -57 19 -91 -91 -166 159 -380 215 66 -260
6212 -260 126 109 153 39 -259 -191 160 41 94 -9 73 -96 -95 174 -107 -29 84 -35 -141 76 126 -325 264
6235 264 92 62 -257 -319 9 -17 24 54 240 5 -142 -76 170 145 106 86 288 -103 -102 -75 134 -159 56 105
6259 105 -263 -154 189 -38 42 135 237 79 242 41 158 103 212 170 219 -57 130 123 249 -2 -83 57 -127
6282 -127 -71 -32 -145 -54 44 -222 87 -55 169 -108 173 273 -59 69 195 71 -91 -174 114 -149 -115 -82
6304 -82 -225 -140 -145 -419 -235 5 93 186 230 2 54 157 -1 44 -22 -43 77 334 225 -115 2 -98 -147 -101
6328 -101 151 -232 -139 -140 -29 -248 94 -191 42 125 -113 70 21 121 -122 -45 -94 -215 -70 -48 -11 -107 111
6351 111 -61 60 72 -295 173 32 1 298 123 80 -13 152 106 -237 -32 223 -48 -76 277 -85 209 -35
6373 -35 -107 91 20 168 138 73 -48 280 121 -117 161 346 79 -339 -5 -99 135 -192 -440 -18 -203 -20
6395 -20 -188 221 74 144 -281 -52 100 -59 188 0 48 78 257 132 55 157 141 -28 -179 -48 206 10
6417 10 -95 -75 -159 -133 -104 268 21 228 159 -242 -68 30 -31 335 169 -40 221 113 -155 2 -183 196 -125
6440 -125 46 -1 239 -74 19 -61 -143 -25 16 -34 -114 52 -76 300 341 -77 138 -179 84 54 -138 -159 -176 -4
6464 -4 -83 -69 -111 -152 -103 -68 136 -25 -79 -8 -143 -99 158 -266 204 -31 -191 33 -165 -216 80 12 -258 -25
6488 -25 -149 24 54 -47 212 -167 57 -85 11 43 -122 91 79 103 130 -141 -78 -31 47 -130 157 17 -186
6511 -186 28 -46 -179 119 7 9 187 112 118 278 28 130 18 142 -15 -79 -97 20 116 22 -80 -46 -42 98
6535 98 -35 52 53 15 -135 -189 20 -47 205 94 24 -204 67 88 -142 120 -110 -149 -280 -4 -106 19 114 100
6559 100 84 120 91 229 -128 62 -143 345 -108 163 124 -32 17 -54 133 91 -1 -22 33 -40 -293 500 69 -8
6583 -8 186 119 255 80 313 -6 1 140 195 -193 -223 -141 32 -132 -305 242 -22 -15 35 57 94 102 206 25 23 -244
6609 -244 -55 -131 208 -215 -8 -380 -35 -203 253 -25 -21 -135 -127 -96 -149 -53 -193 13 166 194 -29 -101 -258
6632 -258 -125 -95 119 -183 -113 133 -83 114 -75 57 -137 -110 206 -16 -161 -126 52 169 10 17 50 -273
6654 -273 252 128 33 125 220 -204 -222 -322 105 -84 97 70 -6 142 -121 93 211 166 -154 111 -110 66
6676 66 151 78 239 -145 -46 262 -15 -247 -29 -191 101 108 -267 -72 -134 58 55 72 107 27 -79 -31 -27 186 -186
6701 -186 55 -111 112 -122 170 -158 -112 -17 -93 159 -240 -233 -199 139 13 9 1 -53 -235 235 -34 -11 15 -89
6725 -89 194 -113 -10 -76 -165 -95 193 -137 104 284 203 168 217 180 -20 36 70 -4 89 80 -1 -97 27 -404 27
6750 27 102 7 319 14 69 44 -134 -62 -102 59 -253 -147 -60 -233 109 88 170 155 213 286 50 178 -55 150
6774 150 -126 68 39 -228 -207 -9 170 177 206 -86 230 104 78 189 -184 -102 -16 -225 -33 -51 15 -305 -31
6797 -31 -174 -219 70 108 -122 -123 69 76 54 197 -55 189 -25 269 92 55 72 -211 -128 -15 -226 -156 58 277
6821 277 160 138 213 -191 -8 -252 106 -132 285 91 -97 75 -149 98 15 -107 210 -217 -97 -165 -104 11
6843 11 326 -246 23 55 -65 -92 313 -120 -26 -317 -6 83 -122 43 23 -44 137 -17 -124 62 226 -17
6865 -17 -96 -61 11 31 -42 -135 -139 175 -107 209 197 102 -251 -92 -111 -74 46 53 192 335 78 74 -123 222 118 94
6891 94 8 101 -64 216 -27 26 63 -4 -52 -150 108 -142 291 114 88 196 -121 -263 -291 -98 -193 -133 66 -47
6915 -47 78 -10 39 -231 36 94 61 210 -23 66 42 -155 -88 -187 72 -182 51 -31 29 -169 106 168 -115 -65
6939 -65 138 117 259 -173 -45 230 34 26 1 -192 -80 188 -142 171 -7 -210 -99 -165 -129 -281 -96 301
6961 301 96 -163 43 -62 89 -98 43 -33 -161 169 80 -42 297 -176 6 -153 -60 -38 15 135 -146 139
6983 139 69 -183 40 -86 84 182 -210 24 221 23 86 -166 -51 17 -84 229 -259 -131 -7 133 -40
7004 -40 58 89 194 -167 -6 -31 80 20 114 31 -94 58 -78 -204 266 -8 12 165 66 3 54 -160 -151 103
7028 103 23 35 -83 241 280 -133 10 197 185 179 154 -130 88 55 207 33 -39 -108 156 189 39 328 -4 51
7052 51 94 244 -258 168 149 -11 91 135 -30 193 -25 -54 -47 -139 -167 -247 -41 -127 151 22 160 296 -228 54
7076 54 246 34 105 131 -129 231 278 126 -371 -272 -117 -57 104 47 -86 36 101 -42 61 -12 77 176 -3 117
7100 117 161 145 322 -173 -291 -115 18 26 193 -69 -58 -13 -202 -195 245 -195 -17 -370 85 166 -18 150 -169
7123 -169 79 36 -43 -390 -29 -114 -2 69 29 -391 158 14 -187 -147 10 5 114 106 93 116 -23 107 12 202
7147 202 -191 4 -5 -58 -110 -19 -46 106 -262 -22 -61 6 -56 141 -174 236 229 199 -115 23 -68 1 151 18 -105
7172 -105 -175 85 22 -33 -261 172 308 202 -209 -58 84 -152 -122 90 -122 -106 -111 259 316 362 -177 93 63
7195 63 -274 99 135 -172 -244 -70 -128 31 -12 58 -85 -157 -37 -19 -90 137 103 -253 -128 133 -97 114 -139
7218 -139 -59 19 21 -24 80 73 -81 -27 -125 184 -212 108 -99 -282 147 -8 122 155 -52 66 153 85 -3 238
7242 238 192 -164 -19 -1 -59 38 -12 -191 105 86 130 -61 42 124 -107 -1 -83 81 16 145 6 242 49
7265 49 -124 -36 38 -169 22 24 -166 194 88 -138 250 96 68 201 -134 58 196 -274 145 -178 -99 209
7287 209 38 -212 179 7 59 -15 257 -10 -15 -64 59 -16 -198 -111 -168 99 -135 -96 85 -90 -111 -115 68 -289
7311 -289 -188 141 -157 -116 -138 -26 268 28 -216 -82 -52 7 -163 200 -20 -194 -441 111 12 95 -32 253
7333 253 128 -45 7 198 -89 -23 77 -51 170 61 375 202 407 -18 -6 -98 -142 -37 -98 52 85 -45
7355 -45 46 -124 142 34 104 154 -190 43 -96 -12 39 -69 -15 84 144 9 125 154 65 -65 -143 73 2 -37 20
7380 20 -158 102 55 -68 153 131 -146 27 374 -116 -155 127 156 -43 150 188 -22 167 -73 -87 134 -69
7402 -69 -282 103 -19 306 -152 208 -22 12 -36 198 146 119 -50 -143 3 46 71 -70 254 -214 -107 -11 90
7425 90 10 88 -16 96 74 -9 23 180 85 96 36 -110 45 -6 164 162 -106 192 193 68 87 140 -62 -292 61
7450 61 46 -95 -225 89 186 58 107 -96 -197 -211 55 225 17 1 -185 -12 29 174 71 -68 179 39
7472 39 16 -5 -59 348 -126 -80 219 161 37 309 -121 -302 -201 -172 -217 153 58 167 -21 -71 -82 -91 -2 -33 129
7497 129 -122 -31 55 -48 121 126 34 148 -102 -298 -35 -18 -125 -167 -49 46 129 -186 190 58 -54 -128 218
7520 218 -296 43 25 -7 122 -271 101 86 -51 15 0 -67 -207 -31 -288 -116 -309 23 -100 -101 122 125 53 -21
7544 -21 -226 -91 127 -24 -98 29 171 -39 -184 98 166 30 -248 54 -69 -131 -117 -227 19 -73 -75 -342 112
7567 112 -181 22 126 -54 213 338 197 -25 95 24 15 -163 -187 -192 -95 47 119 -99 -90 -22 -30 80 -55 -168
7591 -168 64 -27 325 55 -107 3 362 100 -66 110 -291 66 88 -187 -58 -1 73 153 -71 62 33 -90
7613 -90 122 -23 -369 231 -64 14 -7 0 60 179 94 -127 -19 29 -77 205 -26 -154 -18 -163 -67 -100 -80 -75
7637 -75 -29 -95 168 -128 -69 -53 128 -188 110 -122 46 95 70 104 83 48 148 -168 249 -6 -128 50 35 136
7661 136 -58 247 141 67 -39 109 -91 106 69 -189 208 229 -98 73 -134 266 78 34 -99 -190 47 33
7683 33 -308 -68 93 13 -109 511 9 -120 -294 -391 -16 -119 110 -141 50 -151 62 100 -209 -49 60
7704 60 -60 96 30 2 88 75 39 90 138 -153 169 263 90 114 -126 -70 214 39 -424 -97 -359 -69 22 -2
7728 -2 205 64 84 99 21 96 -116 -155 -112 -64 -133 -258 -125 -107 95 77 29 37 26 198 80 75 34 -105 55 -227
7754 -227 -114 105 138 5 -103 -108 -407 62 70 269 -168 -69 -57 -46 -17 30 248 -82 40 -306 32 311 124
7777 124 -71 111 -51 37 -127 17 66 -123 37 -111 204 -361 -169 2 129 192 239 34 -330 20 -5 47
7799 47 90 303 30 71 -157 -56 -93 -62 34 -72 -165 33 -111 -141 -2 -232 226 180 -99 -43 157 -58 44
7822 44 -75 81 29 56 -104 37 130 10 96 -20 85 140 -172 -316 -193 170 139 -171 -90 -86 31 -154 -53
7845 -53 -168 -20 -140 -107 -23 165 161 81 -63 -173 -62 -104 48 9 -15 -40 -58 30 -184 -363 -15 -118 -241 -82
7869 -82 52 43 -72 156 93 -122 -14 -47 137 238 211 -6 -98 123 -18 -125 170 -11 -50 -141 -36 51 156
7892 156 121 -196 65 39 -108 133 -176 294 -22 -243 -9 263 -60 -9 -4 216 355 127 201 -123 -295 -16
7914 -16 365 -205 -57 -23 -220 143 -33 23 -9 -99 -14 -51 -111 143 30 -212 -59 -93 -5 100 36 139 -119 -78
7938 -78 -144 -109 272 106 -131 19 -167 -108 63 -86 -38 473 -46 6 71 -183 -28 43 45 12 -95 -206 -278 130
7962 130 -71 369 -26 137 182 -184 -11 111 136 -32 270 -62 146 -200 -36 81 81 -64 -117 -12 48 -125
7984 -125 11 -274 274 118 116 395 98 27 -18 145 -59 -58 111 121 162 39 -177 82 -64 -109 -45 226 46
8007 46 42 100 58 225 90 91 99 -115 132 -265 167 75 131 99 132 22 -309 123 149 158 122 -178 -146 48 -109 -184
8033 -184 210 203 -17 -21 -117 70 365 -118 -13 -49 212 -154 198 -11 102 -212 -64 -112 -22 -127 -40 -23 116
8056 116 109 -43 71 147 -31 -80 65 95 141 49 10 -131 183 195 270 -382 56 -154 -101 6 5 -92 225 117 228
8081 228 -258 -100 -104 356 45 -86 -86 -148 10 53 -128 -45 33 128 -165 116 20 43 100 -219 -29 -194 -32 -148
8105 -148 -137 -52 -11 -183 16 -201 -131 151 -102 91 163 -39 -162 147 -138 13 -53 145 -66 -1 -110 78
8127 78 111 -18 -143 15 -232 124 -19 80 35 -125 -124 25 289 66 100 -85 -291 -1 -10 -258 5 -25 -190
8150 -190 45 -132 11 143 25 143 -20 -95 183 -74 50 1 62 121 117 107 -61 199 175 22 11 84 -53
8173 -53 211 88 -1 330 143 48 19 -153 197 -163 267 -1 -24 -53 -238 140 -124 185
8191A85
##END NTUPLES=NMR FID
##END=
