##TITLE=1H_Pr NCO-2
 CDCl3, 8 sc, 
 6.07.2021
##JCAMPDX= 6.0         $$ Bruker NMR JCAMP-DX V2.0
##DATA TYPE= NMR FID
##DATA CLASS= NTUPLES
##ORIGIN= UXNMR, Bruker Analytische Messtechnik GmbH
##OWNER= root
$$ XWIN-NMR		Version 3.5
$$ Tue Jul  6 12:07:37 2021 Russian Standard Time (UT+4h)  she@DPX200
##.OBSERVE FREQUENCY= 200.131506
##.OBSERVE NUCLEUS= ^1H
##.DELAY= (6, 6)
##.ACQUISITION MODE= SIMULTANEOUS
##.ACQUISITION SCHEME= undefined
##.AVERAGES= 8
##.DIGITISER RES= 18
##SPECTROMETER/DATA SYSTEM= spect
##.PULSE SEQUENCE= zg30
##.SOLVENT NAME= CDCl3
##.SHIFT REFERENCE= (INTERNAL, CDCl3, 0, 15.7039)
##AUDIT TRAIL= $$ (NUMBER, WHEN, WHO, WHERE, WHAT)
$$ ##TITLE= Audit trail, XWIN-NMR		Version 3.5
$$ ##JCAMPDX= 5.01
$$ ##ORIGIN= Bruker BioSpin GmbH
$$ ##OWNER= she
$$ F:/spectra/data/she/nmr/H-F/1/audita.txt
$$ ##AUDIT TRAIL=  $$ (NUMBER, WHEN, WHO, WHERE, WHAT)
(   1,<2021-07-06 12:06:12.76 +0400>,<she>,<DPX200>,
      <created by zg, POWCHK disabled, PULCHK disabled
       configuration hash MD5:
       00 E9 B6 7A A2 85 ED C7 34 08 36 98 17 FE 4E 26
       data hash MD5: 16K
       43 E9 54 A9 A9 E2 50 A4 00 00 66 01 1E D1 C0 3F>)
$$ ##END=
$$ 
$$ hash MD5
$$ 37 3C A3 85 3D 3B 2E E9 C5 47 27 81 30 B8 0B CA
##$RELAX= 
##$RELAX= 
##$RELAX= 
##$RELAX= 
##$RELAX= 
##$RELAX= 
$$ Bruker specific parameters
$$ --------------------------
##$DU= <F:/spectra>
##$EXPNO= 1
##$NAME= <H-F>
##$PROCNO= 1
##$TYPE= <nmr>
##$USER= <she>
##$AMP= (0..31)
100 100 100 100 100 100 100 100 100 100 100 100 100 100 100 100 100 100 
100 100 100 100 100 100 100 100 100 100 100 100 100 100 
##$AQSEQ= 0
##$AQ_mod= 1
##$AUNM= <au_zg>
##$AUTOPOS= <>
##$BF1= 200.13
##$BF2= 200.13
##$BF3= 200.13
##$BF4= 200.13
##$BF5= 200.13
##$BF6= 200.13
##$BF7= 200.13
##$BF8= 200.13
##$BYTORDA= 1
##$CFDGTYP= 0
##$CFRGTYP= 5
##$CHEMSTR= <none>
##$CNST= (0..31)
1 1 145 1 1 1 1 1 1 1 1 1 1 1 1 1 1 1 1 1 1 1 1 1 1 1 1 1 1 1 1 1 
##$CPDPRG= <>
##$CPDPRG1= <>
##$CPDPRG2= <>
##$CPDPRG3= <>
##$CPDPRG4= <mlev>
##$CPDPRG5= <mlev>
##$CPDPRG6= <mlev>
##$CPDPRG7= <mlev>
##$CPDPRG8= <mlev>
##$CPDPRGB= <>
##$CPDPRGT= <>
##$D= (0..31)
0 1.2 0 0 0 0 0 0 0 0.06 0 0.03 0 0 0 0 0.0002 0 0 0 0 0 0 0 0 0 0 0 0 
0 0 0 
##$DATE= 1625558772
##$DBL= (0..7)
120 120 120 120 120 120 120 120 
##$DBP= (0..7)
150 150 150 150 150 150 150 150 
##$DBP07= 0
##$DBPNAM0= <>
##$DBPNAM1= <>
##$DBPNAM2= <>
##$DBPNAM3= <>
##$DBPNAM4= <>
##$DBPNAM5= <>
##$DBPNAM6= <>
##$DBPNAM7= <>
##$DBPOAL= (0..7)
0.5 0.5 0.5 0.5 0.5 0.5 0.5 0.5 
##$DBPOFFS= (0..7)
0 0 0 0 0 0 0 0 
##$DE= 6
##$DECBNUC= <off>
##$DECIM= 32
##$DECNUC= <off>
##$DECSTAT= 4
##$DIGMOD= 1
##$DIGTYP= 9
##$DL= (0..7)
0 120 120 120 120 120 120 120 
##$DP= (0..7)
150 150 150 150 150 150 150 150 
##$DP07= 0
##$DPNAME0= <>
##$DPNAME1= <>
##$DPNAME2= <>
##$DPNAME3= <>
##$DPNAME4= <>
##$DPNAME5= <>
##$DPNAME6= <>
##$DPNAME7= <>
##$DPOAL= (0..7)
0.5 0.5 0.5 0.5 0.5 0.5 0.5 0.5 
##$DPOFFS= (0..7)
0 0 0 0 0 0 0 0 
##$DQDMODE= 0
##$DR= 18
##$DS= 0
##$DSLIST= <SSSSSSSSSSSSSSS>
$$ [...]
##$SUBNAM2= <"">
##$SUBNAM3= <"">
##$SUBNAM4= <"">
##$SUBNAM5= <"">
##$SUBNAM6= <"">
##$SUBNAM7= <"">
##$SUBNAM8= <"">
##$SUBNAM9= <"">
##$SW= 20.0188882624521
##$SWIBOX= (0..15)
0 0 2 0 0 0 0 0 0 0 0 0 0 0 0 0 
##$SW_h= 4006.41025641026
##$TD= 16384
##$TD0= 1
##$TE= 0
##$TE2= 300
##$TE3= 300
##$TEG= 300
##$TL= (0..7)
0 120 120 120 120 120 120 120 
##$TP= (0..7)
150 150 150 150 150 150 150 150 
##$TP07= 0
##$TPNAME0= <>
##$TPNAME1= <>
##$TPNAME2= <>
##$TPNAME3= <>
##$TPNAME4= <>
##$TPNAME5= <>
##$TPNAME6= <>
##$TPNAME7= <>
##$TPOAL= (0..7)
0.5 0.5 0.5 0.5 0.5 0.5 0.5 0.5 
##$TPOFFS= (0..7)
0 0 0 0 0 0 0 0 
##$TUNHIN= 0
##$TUNHOUT= 0
##$TUNXOUT= 0
##$USERA1= <user>
##$USERA2= <user>
##$USERA3= <user>
##$USERA4= <user>
##$USERA5= <user>
##$V9= 5
##$VALIST= <valist>
##$VCLIST= <CCCCCCCCCCCCCCC>
##$VD= 0
##$VDLIST= <DDDDDDDDDDDDDDD>
##$VPLIST= <PPPPPPPPPPPPPPP>
##$VTLIST= <TTTTTTTTTTTTTTT>
##$WBST= 1024
##$WBSW= 4
##$XGAIN= (0..3)
0 0 0 0 
##$XL= 0
##$YL= 0
##$YMAX_a= 170365
##$YMIN_a= -279985
##$ZGOPTNS= <>
##$ZL1= 120
##$ZL2= 120
##$ZL3= 120
##$ZL4= 120
##$ABSF1= 10
##$ABSF2= 0
##$ABSG= 5
##$ABSL= 3
##$ALPHA= 0
##$AQORDER= 0
##$ASSFAC= 0
##$ASSFACI= 0
##$ASSFACX= 0
##$ASSWID= 0
##$AUNMP= <proc_1d>
##$AZFE= 0.1
##$AZFW= 0.1
##$BCFW= 1
##$BC_mod= 2
##$BYTORDP= 1
##$COROFFS= 0
##$CY= 11.3945322036743
##$DATMOD= 1
##$DC= 2
##$DFILT= <>
##$DTYPP= 0
##$F1P= 15.9154993809931
##$F2P= -4.1035820241983
##$FCOR= 0.5
##$FTSIZE= 0
##$FT_mod= 4
##$GAMMA= 1
##$GB= 0.15
##$INTBC= 1
##$INTSCL= 1
##$ISEN= 128
##$LB= 0.24
##$LEV0= 0
##$LPBIN= 0
##$MAXI= 10000
##$MC2= 0
##$MEAN= 0
##$ME_mod= 0
##$MI= 1.114404
##$NCOEF= 0
##$NC_proc= 0
##$NLEV= 6
##$NOISF1= 3.799351
##$NOISF2= 2.8
##$NSP= 1
##$NTH_PI= 0
##$NZP= 0
##$OFFSET= 15.70392
##$PC= 1
##$PHC0= -11913.36
##$PHC1= 10.80099
##$PH_mod= 1
##$PKNL= yes
##$PPARMOD= 0
##$PSCAL= 0
##$PSIGN= 0
##$REVERSE= no
##$SF= 200.130013532006
##$SI= 16384
##$SIGF1= 3
##$SIGF2= 2
##$SINO= 400
##$SIOLD= 16384
##$SREGLST= <1H.CDCl3>
##$SSB= 0
##$STSI= 0
##$STSR= 0
##$SW_p= 3612.71676300578
##$SYMM= 0
##$S_DEV= 0
##$TDeff= 0
##$TDoff= 0
##$TI= <>
##$TILT= no
##$TM1= 0
##$TM2= 0
##$TOPLEV= 0
##$USERP1= <user>
##$USERP2= <user>
##$USERP3= <user>
##$USERP4= <user>
##$USERP5= <user>
##$WDW= 1
##$XDIM= 8192
##$YMAX_p= 0
##$YMIN_p= 0
$$ End of Bruker specific parameters
$$ ---------------------------------
##NTUPLES= NMR FID
##VAR_NAME=  TIME,          FID/REAL,        FID/IMAG
##SYMBOL=    X,             R,               I
##VAR_TYPE=  INDEPENDENT,   DEPENDENT,       DEPENDENT
##VAR_FORM=  AFFN,          ASDF,            ASDF
##VAR_DIM=   8192,          8192,            8192
##UNITS=     SECONDS,       ARBITRARY UNITS, ARBITRARY UNITS
##FACTOR=    0.0002496,     1,               1
##FIRST=     0,             0,               0
##LAST=      2.0444736,     0,               0
##MIN=       0,             -279985,         0
##MAX=       2.0444736,     170365,          0
$$ Real data points
##PAGE= N=1
##DATA TABLE= (X++(R..R)), XYDATA
0 0 0 0 0 0 0 0 0 0 0 0 0 8 -8 8 -8 16 -16 24 -24 32 -40 48 -56 64 -72 88 -102 117 -135 152 -176 200 -229
33 -229 258 -293 329 -369 414 -463 516 -576 640 -710 784 -869 958 -1060 1167 -1287 1417
50 1417 -1561 1721 -1897 2090 -2310 2557 -2837 3157 -3530 3969 -4492 5133 -5936 6978 -8387
65 -8387 10408 -13578 19265 -32651 132475 -33681 -248170 126906 168980 -65679 -124463
76 -124463 37173 27183 -5736 -9722 -36213 -26106 71725 61815 -45667 -64831 53033 97516
88 97516 -27016 -86488 29788 30694 -31704 -20064 -16590 -28170 13912 12570 -58059 -38696 59878
101 59878 24531 -80819 -27893 55873 -7051 -60054 -3425 25728 -46790 -40028 33366 -17378
113 -17378 -49083 28124 -1790 -64724 21872 48024 -56335 -48750 59390 21210 -89830 -12485
125 -12485 83365 -8585 -88286 3445 82238 -12386 -72023 33594 57462 -45414 -20259 52065
137 52065 -737 -26644 22198 23646 -22642 -1846 44360 6069 -18274 15780 22415 8404
149 8404 12898 7316 -6248 12547 36567 1695 -32683 28441 50117 -23089 -17357 38499 24784
162 24784 -9605 1872 18670 -270 256 26757 3666 -29118 3597 35153 4647 -31189
174 -31189 -1168 31448 -4716 -14110 8089 -11085 -386 27886 -19199 -50658 13190 50431
186 50431 -23011 -69802 9390 50630 -20126 -49815 -1590 26275 -6344 -32552 -11630 242
198 242 -693 -1275 -26208 -27062 12446 10114 -21321 -23783 -895 11630 -8924 -16173 -4126 -3087
212 -3087 2815 -3747 -20293 -7942 15677 7122 -26024 -16705 29576 13385 -29818 -1473 24833
225 24833 2671 -12122 -815 15940 7627 -5110 -156 3971 12091 12566 -3894 -192 16774
238 16774 15397 -889 -4369 20069 19783 -10703 -317 20507 8946 -98 5175 10413 6189 4327
252 4327 13441 5266 -2760 13493 11358 -4039 -1146 9735 10126 -6016 -4890 8658 2900 875
266 875 679 -7395 3508 8868 -7020 -9553 842 6886 -6224 -17634 455 5499 -10182 -11638
280 -11638 -4306 319 -6417 -10036 -1817 -6700 -9948 -1109 -7965 -12088 -4259 -5328 -7268 -10269 -7146
295 -7146 -1275 -7776 -6005 -3459 -8878 -1664 -159 -8203 -7452 -1870 2421 -7218 -10469 5962 2712
310 2712 -8841 -678 3858 2353 -14 -1738 4981 3311 733 4404 770 3764 6468 1084 3232
325 3232 5959 7488 6465 1120 8578 9937 2109 7223 8409 3389 6770 6312 6287 4500 3690 10572
341 10572 4613 786 9206 7407 3934 2978 3263 7055 2343 1406 3239 -288 2964 3371 -3611 1464
357 1464 2994 -477 -888 -2976 1589 421 -6036 -1335 -2067 -5207 -3250 -4638 -3595 -5101 -6279 -2006
373 -2006 -6491 -6805 -1517 -6409 -6447 -4543 -6642 -4199 -6710 -6612 -4426 -7722 -4139 -4471 -7799 -2354 -3470
390 -3470 -5735 -3553 -3758 -585 -3603 -6766 -162 -1579 -3292 -1372 -3367 1043 1278 -2221 1553 780
406 780 2265 4006 -1244 1819 4987 2660 2649 585 3966 6253 2349 4797 4539 3385 8362 4645
422 4645 2524 6641 5586 6714 3644 2173 7780 5323 3906 4853 2727 6546 5421 2181 5015
437 5015 3114 3914 4867 512 2634 2928 583 2618 -118 -53 1199 -465 2339 -1669 -3719 2352
453 2352 -707 -4066 -2937 -2910 -498 -3592 -6320 -3114 -3619 -2358 -4251 -8221 -2417 -1732 -5615 -4862
469 -4862 -6394 -3493 -2083 -8283 -6793 -3759 -2647 -3621 -8482 -4228 -972 -4331 -2712 -4796 -4709 1288
485 1288 -2853 -4950 -1959 -1186 245 -2747 -2908 910 214 2345 186 -3586 3649 3803 -20 2638
501 2638 1370 1528 3040 4093 4372 384 2494 8048 2832 2533 4181 5101 9088 2447 -1625 6958
517 6958 9280 4927 265 1351 7725 5812 3726 2506 290 7927 7312 -2617 219 6512 5958 1280
533 1280 -4791 343 6309 3576 -2424 -6155 2604 6453 -4478 -4220 1159 -737 -293 -4019 -5516
548 -5516 -712 810 -3053 -8770 -5831 2581 -3145 -6865 -4160 -5015 -1808 -3007 -7244 -3069 -2136 -5794
564 -5794 -5952 -4023 -2027 -5238 -3751 -862 -7716 -4857 2926 -2805 -4884 -2835 -2216 -308 -1457 -2512
580 -2512 -1561 -470 1394 -2657 -1464 4307 -232 36 3078 -2130 1466 6964 2297 -2548 614 7951
596 7951 4788 -1500 3155 4896 3575 4990 715 2998 8787 4059 810 2888 5628 6346 2937
611 2937 1656 1814 3714 8150 1837 -1418 6308 3786 330 3211 2372 1959 1737 1198 415 -1428 2628
628 2628 2527 -2216 -559 -2490 -1034 4329 -1474 -5965 -1270 578 -1467 -4459 -3056 -967 -4099
643 -4099 -2835 -3556 -5753 -716 -861 -5898 -5982 -4337 187 -655 -8455 -6804 -823 -37 -4785 -7799 -727
660 -727 282 -5842 -4011 -2364 -280 1346 -4696 -5812 64 2241 -337 -4601 -1960 2628 -561
675 -561 -340 189 228 3871 354 -2226 2980 4018 2830 976 -344 3472 4007 3174 2693 1239 4560
692 4560 3864 1589 4658 3785 2811 4489 1369 2398 5653 4082 1792 939 4319 4075 71 4234
708 4234 4053 -552 2007 3032 2119 2100 13 1004 1293 -270 605 -472 938 611 -3325 -230 242
725 242 -1364 -97 -3018 -3254 -346 -2180 -2656 -2520 -2820 -2227 -3990 -1950 -2242 -4841 -1234 -2543 -6409
742 -6409 -2327 -1707 -3563 -3571 -4208 -2723 -3095 -2373 -1990 -4955 -2004 -230 -4045 -1999 -617 -1975 -887
759 -887 -2067 -1501 329 -981 -260 -741 -730 1067 430 1411 776 -858 3192 2546 -905 2189 2987 1929
777 1929 1622 1254 3351 2701 2665 3414 810 3625 5281 813 2659 4396 2481 2757 2152 3601 3211
794 3211 1476 3088 2233 2007 3842 901 1258 2464 1009 2012 1180 -29 1517 713 -126 161 -330
811 -330 1243 -1047 -1303 686 -1855 -413 -87 -3366 -1172 -517 -2683 -2611 -2716 -1315 -2626 -4378 -1397
828 -1397 -2523 -3462 -1827 -3489 -2849 -1892 -3334 -2355 -2736 -2599 -1606 -3815 -2447 -1554 -2823 -1234 -2225
845 -2225 -2108 -675 -2257 -1011 -797 -2191 184 -346 -1465 -203 -575 720 139 -981 2010 706
861 706 231 1768 774 2006 2073 794 2443 1634 1874 3216 934 2809 3251 1664 3051 2307 2831 3411
879 3411 1562 2954 2869 1252 3557 1913 1666 2932 1888 2291 1434 879 3073 1005 585 2078 301
896 301 1365 728 -452 962 127 -455 346 -1422 224 -404 -2239 -335 -1328 -1401 -1034 -2773 -1042 -1797
914 -1797 -3048 -1421 -2721 -2638 -1486 -2952 -2041 -2433 -2970 -1238 -3154 -2672 -1457 -3249 -1982 -2233 -2749
931 -2749 -1354 -2640 -1939 -1159 -2278 -707 -1181 -2231 -448 -1387 -906 -344 -1253 431 -446 -655 978
948 978 -213 341 1132 396 1650 968 728 2352 1047 1598 2289 920 2594 2041 1228 2787 1895 2698
966 2698 2688 1168 2759 2365 1937 3121 1679 2106 2775 1642 2286 1579 1498 2773 795 1285 1674 527
984 527 1820 818 -61 1294 100 612 213 -1111 908 -450 -944 -184 -1330 -212 -603 -2093 -638
1001 -638 -1450 -1796 -1176 -2623 -1984 -1389 -2403 -1855 -2703 -2261 -1179 -3346 -2063 -1646 -2823 -1299 -2461
1018 -2461 -2961 -1361 -2245 -1651 -2260 -2351 -504 -1933 -1682 -551 -2272 -821 -528 -1798 -129 -72 -238 191
1036 191 -627 464 685 339 1446 -345 604 2046 146 1139 1906 788 2231 1616 1148 1978 1758 2956
1054 2956 1523 1194 3348 1906 2199 2358 701 2650 2669 1336 1790 1780 2142 1886 507 2072 1579 1012
1072 1012 2312 -18 628 2010 216 530 565 213 1064 -318 -59 -152 -833 503 -887 -1357 372 -1476
1090 -1476 -1298 -277 -2033 -1181 -825 -1855 -1894 -2855 -1156 -1500 -2817 -1126 -2320 -2619 -439 -2423 -2360
1107 -2360 -1136 -2498 -2030 -1692 -1640 -976 -2062 -1070 -1988 -2073 599 -686 -2051 -401 -1051 -683 236 -704
1125 -704 125 -267 -197 379 -364 1481 1441 -243 974 393 921 2829 1072 662 1933 1592 1654 1520 2190
1144 2190 2487 936 1660 1830 1407 3441 1802 894 2181 1067 2162 2402 1200 1361 1037 1473 1910
1161 1910 466 1937 1460 -773 1201 783 602 1476 -227 -483 -71 -22 769 -352 -530 -463 -1690 -21
1179 -21 -475 -1566 -57 -1428 -2245 -778 -1386 -956 -1078 -2234 -1842 -2163 -1104 -1082 -2895 -1342 -1922 -2616
1197 -2616 -671 -1696 -1855 -693 -1799 -1833 -1278 -1018 -638 -2058 -791 -627 -1520 309 -279 -1462 258
1214 258 -107 -569 298 20 76 213 502 922 -32 1307 1274 -403 1739 1727 412 1859 1307 943 1923
1233 1923 1474 1814 1238 1482 2197 851 1792 2365 443 2197 1819 591 2242 1605 1260 1169 718 1560
1251 1560 838 1044 1224 -314 726 1325 -348 973 501 -379 245 -342 74 -284 -532 -72 -1306 -777
1269 -777 199 -1452 -718 -41 -1915 -982 -615 -1811 -772 -1537 -1480 -1602 -1854 -649 -1661 -1981 -1100 -2515
1287 -2515 -1241 -549 -1986 -964 -1210 -1853 -1218 -1108 -840 -1238 -1566 -248 -1540 -507 431 -1067 -628
1304 -628 489 -834 -2 142 140 259 -234 606 540 160 1434 331 707 1676 535 1345 1690 892 1767
1323 1767 1155 1179 1832 1314 1881 969 881 2083 1354 1069 2072 927 1564 1743 1109 1419 1279 1160 1166 596
1343 596 1441 617 198 1317 -46 177 868 10 214 279 -145 280 -599 -133 86 -1158 -34 -850 -1397
1362 -1397 -183 -1243 -1464 -776 -1915 -1121 -973 -1748 -1048 -1629 -1295 -1299 -1773 -1401 -1378 -2013 -552 -1549 -1439
1381 -1439 -807 -1796 -1026 -1013 -1823 -375 -1273 -753 -653 -1535 -263 -381 -765 409 -328 -364 484 -326 272
1400 272 370 118 1110 239 654 1261 479 1231 816 663 1731 888 655 1453 892 1607 1343 1397 1737 1005
1420 1005 1449 1610 994 1789 1647 717 1462 1338 1039 1341 601 1393 619 578 1276 91 609 874 228 507
1440 507 195 -170 240 -469 31 -195 -787 24 -607 -777 -415 -1237 -728 -690 -1396 -627 -1006 -1628 -593 -1399
1460 -1399 -1058 -831 -1681 -599 -1272 -1336 -893 -1853 -906 -1214 -1458 -733 -1100 -1526 -762 -1514 -705 -791 -1310 -372
1480 -372 -726 -766 -13 -759 135 -163 -368 433 193 20 604 -253 551 639 343 846 311 547 1188 70
1500 70 985 1215 596 1651 755 930 1448 691 1415 1375 909 1562 1041 989 1704 625 1212 1362 745 1382
1520 1382 632 895 1231 494 866 683 124 756 -54 195 636 -413 583 64 -582 396 -322 -521 -270
1539 -270 -937 -230 -676 -1114 -108 -1247 -960 -692 -1273 -723 -1332 -1364 -568 -1263 -1141 -994 -1676 -878 -1395 -1294
1559 -1294 -653 -1395 -1034 -636 -1449 -475 -776 -834 -373 -1202 -616 -494 -907 -93 -349 -736 151 -411 -20 379
1579 379 -305 242 62 121 751 -98 681 1048 175 1139 643 588 1301 630 665 1285 896 1540 1174 896 1443
1600 1443 804 1354 1356 562 1295 648 923 1344 323 945 1135 755 753 618 640 1024 331 298 240 -3 641 132
1622 132 34 429 -302 -16 -112 -390 135 -508 -677 -404 -1293 -164 -490 -1398 -529 -1266 -1124 -338 -1236 -1055
1642 -1055 -693 -1198 -948 -1408 -1104 -622 -1277 -891 -941 -1388 -481 -923 -1066 -467 -1181 -611 -491 -951 -238 -897
1662 -897 -282 -270 -475 237 -189 -874 658 -35 -124 732 48 622 586 652 663 348 896 1167 172 900 1259
1683 1259 651 1523 818 709 1060 1064 1197 998 921 1136 796 1332 1144 486 1159 677 352 1379 830 349
1703 349 991 456 545 416 500 520 -47 304 455 -600 253 155 -730 144 -348 -549 -105 -422 -486 -715 -587
1724 -587 -349 -1411 -559 -538 -1391 -742 -602 -1512 -712 -978 -959 -1138 -819 -521 -1110 -762 -505 -1616 -347 -405
1744 -405 -1345 -245 -799 -1068 -609 -762 -246 -301 -555 127 -644 -235 216 -537 -319 323 -314 474 631 161
1764 161 570 232 528 483 668 973 318 342 1182 478 900 1372 270 963 959 988 1049 953 1142 631 845 1372
1786 1372 637 623 1138 425 566 794 548 750 1151 519 580 286 731 595 -54 556 -476 -219 415 -174
1806 -174 -278 -85 -779 -288 -347 -348 -419 -886 -678 -712 -1008 -201 -926 -868 -555 -1275 -802 -718 -1164 -946 -1004 -1259 -735
1829 -735 -1073 -598 -1016 -979 -213 -926 -700 -61 -851 -549 -511 -597 -326 -713 -92 5 -534 -197 -144 -261 329 -529
1851 -529 -11 597 124 163 430 265 577 501 532 752 164 1109 697 609 1531 543 759 1139 783 1187 1051
1872 1051 726 1061 685 635 649 495 1181 749 661 874 229 412 662 89 333 185 422 446 447 128 294 -234
1894 -234 356 26 -314 270 -439 -168 -244 -619 -451 -672 -814 -368 -853 -639 -997 -1096 -294 -784 -631 -161 -757
1915 -757 -981 -544 -1077 -644 -815 -801 -706 -1190 -423 -475 -1084 -368 -438 -893 -196 -566 -534 -312 -558 -3 -462 -374
1937 -374 -115 -384 61 -11 -515 510 101 -41 613 178 601 406 611 886 283 556 770 267 841 1010
1957 1010 439 1188 756 728 843 676 705 898 533 935 505 651 1078 216 916 442 270 655 472 432 439
1978 439 -60 447 317 -74 220 -82 -134 130 -473 226 -40 -654 -132 -500 -46 -402 -642 2 -364 -728
1998 -728 -313 -775 -735 -470 -878 -590 -507 -914 -695 -835 -743 -361 -952 -466 -780 -659 -317 -713 -385 -482 -745
2019 -745 -348 -344 -567 -208 -167 -184 -235 -308 -427 -176 -320 108 -268 37 483 -26 561 346 236 550 53 653
2041 653 558 -13 809 429 295 840 485 311 1016 303 951 595 689 987 421 700 633 418 944 598 446
2062 446 967 463 252 374 342 689 460 296 346 -163 246 128 -313 514 -171 -254 126 -79 -179 63 -372
2083 -372 -42 -304 -416 -390 -768 -213 -616 -799 -564 -858 -601 -447 -849 -630 -375 -813 -760 -602 -443 -382 -896
2104 -896 -377 -619 -468 -393 -403 -706 -388 -825 -523 125 -550 -67 -174 -238 149 -327 -19 183 189 391 193 50
2126 50 293 136 413 379 276 728 112 232 233 90 628 623 360 914 495 526 750 708 732 722 465 866 434
2149 434 793 800 89 744 544 183 784 160 -50 542 -25 580 222 95 416 186 221 393 -338 301 -43
2170 -43 -486 26 -406 -422 60 -1039 -732 -368 -766 -495 -400 -589 -293 -1009 -212 -513 -736 -261 -822 -800 -472
2191 -472 -640 -821 -673 -371 -279 -1036 -316 -493 -541 -205 -336 -536 -249 -233 -83 -245 -90 68 -271 43 287
2212 287 -307 108 94 6 409 167 -11 251 437 379 439 551 465 270 522 892 485 571 337 267 881 617
2234 617 453 615 567 609 362 422 640 372 349 771 305 394 499 310 319 451 111 12 91 525 214 -28 223
2257 223 -379 -263 -16 -226 79 -313 -350 -300 -309 -167 -429 -857 -228 -274 -503 -234 -646 -490 -442 -708 -442 -302
2279 -302 -758 -362 -670 -465 -445 -834 -248 -367 -561 -281 -485 -372 -114 -330 -207 -546 -359 -24 -123 -347 185
2300 185 -283 199 104 79 395 -214 -31 359 -42 251 421 372 357 282 577 437 302 692 674 109 401 389
2322 389 434 763 286 797 403 340 766 617 440 673 274 394 224 339 426 378 374 352 20 330 128 62 252
2345 252 73 69 -155 -14 327 -49 -149 50 -395 -273 175 -164 -159 -544 -643 -217 -316 -598 -412 -473 -444 -654 -746
2368 -746 -256 -667 -509 -348 -820 -309 -316 -416 -428 -471 -408 -422 -591 -12 -412 -422 -196 -153 -191 143 -298 106 -197
2391 -197 -432 -81 -100 206 31 110 389 129 -35 450 2 232 325 357 438 306 61 286 288 763 623 302
2413 302 609 399 241 500 365 345 250 435 401 391 427 506 -10 561 355 42 310 -11 92 346 230 206
2435 206 283 208 350 -82 -102 -41 -488 -118 -65 -386 -96 -383 -391 -197 -612 -208 -446 -783 -252 -623 -415 -50
2457 -50 -674 -176 -369 -646 -310 -530 -490 -165 -397 -279 -424 -509 31 -614 -236 -72 -304 -110 -152 -655 168
2478 168 -195 -162 37 -358 264 -56 -257 166 -82 22 369 -17 310 232 138 373 32 199 148 286 300 412
2500 412 179 484 345 642 642 263 442 215 178 179 52 449 404 127 490 265 220 452 26 346 524 105
2522 105 254 67 -53 105 -154 126 237 -221 109 -80 -62 -36 -380 81 -124 -418 -9 -553 -256 -107 -366
2543 -366 -482 -218 -656 -22 -639 -341 -196 -556 -490 -574 -444 -229 -545 -419 -327 -703 -220 -109 -554 -216 -150
2564 -150 -172 79 -322 -90 -104 -282 -130 -309 -121 278 -160 288 48 228 593 41 306 292 135 133 244 71
2586 71 489 454 377 185 178 560 506 173 809 598 229 465 92 525 320 266 298 542 756 410 53 277 361
2609 361 -1 405 107 292 168 -217 112 282 20 240 107 -11 83 -135 -339 -293 -302 -86 -11 -150 210 -483
2631 -483 -244 -90 -533 -169 -387 -313 -330 -281 -276 -337 -366 -337 -445 -277 -381 -592 -229 -371 -396 -98 -346 -343 -171 -463
2655 -463 -188 -355 -390 -146 -118 -297 68 -64 36 37 7 119 -225 379 73 -126 449 329 138 149 66 31 180
2678 180 409 298 244 246 667 175 616 530 33 190 460 224 439 241 297 218 111 291 530 236 306 -121
2700 -121 235 201 -7 215 -64 54 87 -28 226 -134 -261 122 -241 -170 -12 -270 -97 -14 -406 23 -364
2721 -364 -297 -85 -308 -199 -352 -636 -267 -595 -410 -168 -581 -451 -88 -457 -86 -259 -345 -132 -607 -283 -120
2742 -120 -357 -321 -434 -97 47 -401 -131 116 56 256 -170 22 129 -97 277 83 -14 208 38 243 151
2763 151 251 -11 333 151 576 304 452 245 234 373 432 240 335 61 329 244 -90 418 126 206 337 117
2785 117 274 479 249 532 191 112 230 534 131 158 208 391 47 -40 -123 -263 -112 153 -281 32 -632 -214
2807 -214 -163 -220 -134 21 -253 -66 -422 -417 -91 -361 -169 -210 -266 -425 -361 -355 -246 -442 -432 -170 -579 -181 -380 -166
2831 -166 -52 -492 -331 -491 -412 -224 -187 -449 9 -462 -47 144 168 75 -141 -32 183 139 -289 -71 -35 395
2853 395 68 147 377 211 53 290 149 226 162 12 296 254 431 317 187 661 231 397 752 199 203 336
2875 336 129 251 347 248 355 -52 325 398 -60 -80 233 171 376 -102 -159 93 -175 4 102 -180 -210 -124 84
2898 84 -14 -326 -322 -350 -290 -151 -297 -274 99 -247 -201 -410 -190 -602 -630 -10 -144 -400 -267 -325 -478 -547 -424 -213
2922 -213 -32 -247 -136 -306 -246 -200 -555 -174 144 -363 187 -9 -112 209 0 -54 102 85 41 -135 126 281
2944 281 -26 268 311 117 116 -188 135 203 108 4 287 126 446 -121 319 379 325 250 116 94 235 -23 367
2967 367 200 118 294 551 291 -45 -64 333 423 -63 4 158 -66 260 25 41 65 -90 41 -152 -296 98
2989 98 -133 -294 -72 -282 -52 -145 -149 -609 -115 -65 -201 -371 -338 -320 -279 -452 -352 -375 -83 -25 18 -101 -400 -293
3013 -293 -493 -56 -52 -386 -129 -260 -304 78 -117 105 136 -168 39 -171 75 -74 -63 -268 150 202 187 16
3035 16 220 533 24 522 374 142 435 358 230 339 100 276 120 98 441 343 195 494 -12 328 397 -38
3057 -38 203 197 -47 168 199 439 249 245 42 -12 100 393 -78 165 171 -63 -35 -26 -333 46 -282 90 -85 -41
3081 -41 -149 -244 -78 -230 -149 -278 -336 -216 -86 -249 -75 -329 -536 -418 -180 -524 -182 -251 -420 -45 -635 -81
3103 -81 -90 -443 -66 -154 -280 -80 -276 -41 -119 -80 35 -91 2 -188 -82 40 -50 -49 -39 162 205 341 274 267 174
3128 174 -42 134 123 389 415 14 196 458 251 346 184 48 500 211 521 376 229 147 263 177 219 265
3150 265 206 218 62 329 -54 303 28 -54 183 -163 -97 241 -49 -10 68 -324 -39 167 -218 -17 -60 -98 -54
3173 -54 -467 -252 -93 -247 -481 -388 -491 -20 -162 -261 -261 -322 -278 -60 -135 -99 -374 -299 -515 -92 -135 -191 -218 -85
3197 -85 -131 -180 -38 -411 16 -178 -35 -167 -296 184 -34 8 -220 -74 -16 -143 -77 226 -3 0 176 -68 284
3220 284 185 316 325 77 340 27 139 278 202 253 446 276 147 285 231 438 257 83 388 280 70 99
3242 99 145 157 357 435 139 301 -170 59 -80 135 -298 -253 211 174 -66 -204 -75 -187 -82 -349 38 -203
3264 -203 -186 46 -43 -93 -408 -496 -45 -104 -200 -398 -301 -367 39 -481 -222 -179 -129 -137 -249 234 -429 -224 -331 -278
3288 -278 -160 37 -9 -163 91 -233 -123 114 -154 86 -303 53 5 121 -165 80 45 131 97 239 160 176
3310 176 124 331 75 405 195 283 360 -20 278 357 108 307 199 8 15 -7 258 154 39 371 -65 421
3332 421 93 60 498 52 225 69 -151 30 -188 -200 119 -70 155 126 -134 -157 14 -203 -35 -261 129
3353 129 -109 -109 91 -386 -156 -187 -270 -123 -83 -97 -486 -331 -485 -227 -700 -147 -116 -405 -224 -468 -365 -19
3375 -19 -418 -48 -297 -247 -56 -247 -113 -76 -140 -82 -121 -215 39 -118 -111 -120 -10 -208 222 217 165 87 80 152 -240 254
3401 254 -26 22 426 192 336 459 -3 337 378 401 449 -16 343 398 -6 185 270 82 286 315 151 191 -104
3424 -104 172 209 77 280 193 291 189 31 144 366 -303 61 -184 -455 157 41 -39 127 9 35 -323 -152
3446 -152 111 -61 -294 -147 -223 -270 4 -120 -100 -303 -319 -345 -238 -139 -157 -291 -103 28 -484 -200 -174 -177 -29
3469 -29 -237 19 -325 -203 -4 21 -33 -20 -7 83 -36 -185 -118 151 179 112 301 190 -123 228 -127 4 75
3492 75 68 22 115 135 264 231 252 261 221 194 303 46 314 393 180 398 129 94 216 123 379 188 277 153 -52
3517 -52 238 138 52 159 74 134 -69 -113 -45 122 -157 103 -245 -155 -20 -294 -273 -260 -214 -87 -145 -41 28 -261
3541 -261 -220 -134 -471 -204 170 -71 -408 -205 -321 46 -125 -286 -104 -144 -216 -160 -412 -219 -69 -254 -36 -339
3563 -339 61 -141 75 -231 -220 103 -163 409 92 -114 9 90 306 7 30 -79 288 166 179 73 233
3584 233 124 -156 289 415 -73 432 294 62 150 207 226 126 108 79 60 180 151 193 211 487 -171 212 16
3607 16 111 138 -16 40 -48 150 -90 239 -162 -54 -58 -145 -64 -172 118 -278 -152 -336 -199 -22 -50 -11 -191 -124
3631 -124 -132 -243 -134 39 -335 -349 97 -524 -444 -85 -139 -130 -158 -384 -176 -238 -108 -80 -276 -155 62 -56 -217
3654 -217 -24 -218 142 -252 75 -118 -283 -230 -104 157 187 -72 17 112 -115 397 62 126 196 -339 75 -39
3676 -39 32 329 288 208 155 60 274 163 304 214 369 310 332 230 102 198 21 542 143 -4 368 -61 71
3699 71 -104 -161 177 -10 172 252 -34 71 77 -42 -85 -6 -140 -21 -172 -168 -331 -300 -284 -288 -267 66 -240 -185 -154
3724 -154 -231 -46 -548 -254 -41 -364 -322 -41 -427 109 -423 -244 -203 -216 41 20 -108 233 -293 -188 -98 -335
3746 -335 -126 -175 -101 172 -201 -111 156 -210 152 -167 -158 234 164 -21 104 -8 293 270 -15 75 92 -95 438
3769 438 66 108 93 447 313 205 163 183 38 362 28 -36 408 91 62 161 234 116 378 117 471 48 119
3792 119 74 82 27 37 -99 40 -30 176 -192 -72 26 56 -46 100 -363 -210 -67 -387 -175 -205 -343 -109 -416
3815 -416 -211 -184 -335 -112 -159 -252 -65 -344 -165 -23 -365 -128 -271 -340 -116 -267 -227 -71 -364 71 -40 -34
3837 -34 53 -263 -153 298 -247 26 149 29 -26 -26 -218 298 22 233 18 274 233 216 175 38 -222 175 396
3860 396 340 178 -95 215 663 69 226 180 265 101 129 523 319 -121 317 191 191 504 -38 17 320 343 101
3883 101 24 -77 70 -401 141 154 -200 242 53 -197 -3 -189 -28 126 -34 58 -169 -46 -146 -487 -145
3904 -145 61 -192 -140 -139 -175 -197 -145 -279 -288 -268 57 -144 13 -280 -103 125 196 -57 -200 -226 -163 -7 -182 32
3928 32 -264 -293 -249 -9 84 -3 27 57 357 79 -25 -112 132 55 -353 -6 159 113 399 325 82 224 11 545
3952 545 538 185 385 -51 353 576 89 90 279 135 241 134 116 125 -157 173 222 115 356 284 27 140 -76
3975 -76 193 14 29 72 20 -140 -115 93 52 -98 -162 187 -215 -45 -363 -123 -82 -223 -134 -157 -242 -54 55 -259
3999 -259 -2 163 -288 -113 -326 -180 -161 -106 -21 -321 -103 138 -190 -185 -66 -205 -23 38 -107 -271 -110 10
4021 10 -94 -473 -263 -87 33 59 22 78 82 -142 43 -104 146 193 -103 379 -7 -55 334 -135 415 249 189
4044 189 191 329 -86 282 190 185 285 281 625 22 145 101 341 204 143 53 178 192 188 164 114 119 -213 24 -122 -84
4070 -84 -92 -36 -152 54 17 -15 -17 -166 -268 29 -158 -158 51 -99 -29 -56 -140 -212 -311 -322 -445 -233 -185 -233 68 -322
4096 -322 -243 -384 -125 -401 -287 17 -388 -34 -191 -247 -177 71 -316 -62 -182 -57 -461 -39 85 66 407
4117 407 -196 51 58 -9 65 41 -29 245 18 -181 444 -216 275 295 -35 465 141 15 227 256 237 301 43
4140 43 345 233 209 216 70 274 176 85 -24 49 -9 163 155 175 193 -74 340 -282 -34 -18 -286 -61 28 52 131
4165 131 -130 -133 -247 -178 -92 -29 -380 -309 -177 -129 127 -95 83 -103 -596 4 -271 -259 -130 -312 -63 -383 128
4188 128 102 -323 -98 -81 -188 -61 -26 -262 -21 9 -133 -36 -105 -140 5 -86 -269 -38 -71 169 -63 356 114
4211 114 226 85 4 269 33 175 167 196 227 321 -90 208 12 70 162 180 166 43 -39 53 227 108 -39 535
4235 535 -134 63 181 262 278 13 -144 180 -99 141 11 25 69 -149 -34 -134 -231 -172 9 -113 -4 -149
4257 -149 -66 -160 -194 183 -237 -95 -315 64 -183 -101 -295 -305 21 60 56 -146 -206 -267 -334 -34 -250 -244 -52 -289
4281 -289 105 30 -241 332 -147 -34 -321 -30 -7 -378 11 94 -216 7 46 157 126 53 -89 285 102 282
4303 282 65 156 219 -81 188 264 152 205 190 387 229 94 -12 284 -48 -152 273 265 97 582 111 253
4325 253 113 385 37 -85 287 145 36 32 183 -58 224 -112 -95 -126 -100 -54 -155 120 48 -245 -90 -221
4347 -221 114 103 -201 85 -35 -176 -55 -264 -211 -48 -483 221 -98 -244 2 -173 -142 -170 -276 -76 -195
4368 -195 -127 -295 -213 -258 212 53 34 -183 -200 -119 -162 -252 2 -34 175 -61 -83 51 -282 138 92 -5 51 34 156
4393 156 194 70 277 319 46 120 142 129 191 214 159 380 282 384 254 278 206 2 297 298 -49 491 9 60 206
4418 206 -40 208 110 1 344 380 254 270 -14 152 142 -421 59 55 45 138 209 -204 45 -288 -68 -140 -400
4441 -400 -89 -150 44 -27 -123 -1 -220 -345 -128 -25 -280 -211 -264 -179 -413 -262 -182 -523 -110 -316 -268 -20 -333
4464 -333 -136 -108 -268 113 -138 -61 353 -5 -34 36 -70 251 -7 -122 68 25 -24 264 80 -122 314 -191
4486 -191 11 67 176 -84 167 -118 118 292 331 -30 190 183 158 427 299 273 220 126 195 177 -130 68 29 288
4510 288 20 50 209 312 -155 -56 -134 109 130 197 108 48 -391 20 -154 -126 9 30 -171 106 -97 -71 -29 -204
4534 -204 -12 220 -278 -84 -118 54 -162 -332 -127 64 -180 -110 71 -245 -215 -196 -258 -101 -184 13 -335 99
4556 99 -86 -122 -50 -5 -161 -148 -91 -62 -124 12 158 -85 124 -43 122 448 45 8 270 -63 218 7 -25
4579 -25 230 87 224 375 178 293 403 83 198 74 119 308 319 308 422 95 60 -254 252 395 76 8
4601 8 -69 77 367 72 27 178 90 273 219 86 256 -186 123 -132 25 -132 68 -464 253 36 -105 67
4623 67 38 -32 -41 -230 -204 118 -316 -14 -5 -220 -112 -326 -177 -178 -299 -149 -181 -170 183 -308 -264 -250 -292 115 -174
4648 -174 85 -93 73 -206 1 -83 -33 -367 142 -138 -41 326 145 112 33 -110 -9 117 96 132 -130 255
4670 255 253 208 332 143 12 182 -53 379 112 62 297 177 142 -19 189 114 275 -34 245 172 23 90 9
4693 9 104 292 -135 164 162 68 232 -77 -157 147 -39 139 -72 -91 238 -101 -119 -169 -484 180 -106 -206 -80
4716 -80 -260 -158 110 -186 -21 -146 -142 -231 -291 29 -322 -128 -39 -235 14 -332 -204 -254 64 180 -265 -304 -59
4739 -59 -308 23 -175 -46 -119 19 -110 -86 59 -183 -15 83 -87 -190 -52 -174 146 -99 151 34 61 227
4761 227 222 115 159 83 -9 377 -89 -23 113 269 230 168 29 201 200 3 57 132 325 -36 372 -141 162 222
4785 222 210 -3 198 -285 -53 226 -311 137 15 -67 -28 -42 -108 -95 -243 152 -175 -349 45 -342 -369 -65
4807 -65 -188 -196 -260 -16 -314 -269 29 -181 -309 -263 -83 -147 -400 -197 -189 -105 -191 -149 -159 -108 -46 -138 -152 -7 -187 149
4833 149 -76 26 -89 -261 24 100 -156 111 231 32 246 72 -11 -38 -160 267 -17 99 110 25 151 154
4855 154 -47 267 -42 148 194 15 -47 26 272 201 325 32 -65 240 -22 43 -42 144 -1 -47 80 -54 -93
4878 -93 19 254 284 -142 -33 -178 17 200 131 -48 -193 -260 -76 36 -118 -104 -157 -156 -129 -143 -84 -252 -416 -10
4902 -10 -373 -207 68 -293 -100 -218 -191 155 -249 -222 -132 -345 -37 -237 -232 -13 -281 -72 -343 -266 -209 -82 204
4925 204 -29 22 116 -172 -66 61 74 45 206 -42 -199 107 97 145 258 76 45 23 335 38 90 57 136 9
4949 9 227 124 147 488 23 53 144 -172 160 89 32 218 93 115 176 -1 81 100 -206 303 124 192 249 -251
4973 -251 241 -6 -46 163 -381 49 -227 -260 72 -106 -368 -319 -120 -9 -229 9 -133 -204 -124 70 -407 -299
4995 -299 -57 -50 -149 -374 -347 -179 -97 4 67 -153 42 -234 -136 -191 -176 -179 -185 -283 -149 -61 93 -249 -227 132 189 325
5021 325 -51 -57 82 124 -54 -94 -102 408 70 358 -63 258 71 -63 51 72 403 169 156 415 219 -4 269
5044 269 159 266 13 128 350 1 184 166 149 -60 39 113 66 138 120 194 -83 16 -60 167 -32 -343 391
5067 391 -274 78 86 -240 -256 28 -204 -272 101 -146 -193 -386 143 230 -454 -315 -20 36 -162 -364 -13 -23 -110
5090 -110 -435 -483 -371 -59 -107 -246 50 -279 6 -208 -176 -88 -236 174 -209 -19 45 -192 -126 15 -232 31
5112 31 174 184 145 -241 40 102 -79 -93 252 -56 453 59 168 210 -28 218 437 159 -5 192 71 252
5134 252 202 271 -19 73 129 182 194 89 -87 69 109 247 82 75 180 -89 -217 120 4 48 -424 -3 -60 -151
5158 -151 -221 -204 -131 -37 148 -162 -33 -206 -128 -217 146 -191 -147 19 -188 -218 -23 -232 -223 -314 -348 -74 -129 302
5182 302 -310 -324 -234 -38 -79 58 -213 -350 20 34 -22 -192 -207 26 301 -218 158 -22 165 -121 292 -28
5204 -28 27 213 -202 257 153 195 228 -236 242 90 296 -137 49 -214 95 156 56 51 227 184 73 -74 175
5227 175 56 -139 29 103 143 -144 273 55 -201 60 69 35 -10 30 91 -120 5 -154 -103 -210 -22 -91 16
5250 16 -83 -133 3 -52 83 -118 -338 -116 -151 -65 48 -217 -243 -322 -62 -263 -244 -258 -24 -339 -375 138 -105 -142
5274 -142 32 -62 -80 50 -156 41 -210 -14 138 -166 165 14 -122 17 -219 -156 255 84 185 -173 -236
5295 -236 105 -97 200 67 -60 274 228 159 -266 -164 -10 306 70 123 70 194 142 68 -10 298 -115 231
5317 231 -27 83 67 93 -177 -65 -122 73 -126 75 51 77 82 130 -300 50 87 179 16 -19 5 -326 -42 -5
5341 -5 -98 -247 -48 -179 -110 -343 -228 -91 -284 -193 -350 -136 -226 -128 -313 99 -266 -161 -123 -46 183 -188 -512
5364 -512 -81 -120 -130 -260 -121 -109 132 24 -148 -132 -52 -119 -137 -12 181 141 255 66 -120 363 -11 153 -10
5387 -10 83 -24 54 255 229 222 105 281 -349 -60 -183 160 170 313 -70 174 22 62 -69 26 89 -290 195
5410 195 -284 197 101 -61 104 100 -40 260 332 103 -185 37 197 147 -38 186 132 205 -130 88 -137 -26
5432 -26 -54 -4 -86 -76 75 -239 -19 82 -7 -190 141 -187 -129 -240 -266 -201 -190 -23 -20 -152 47 -59 -58 -150 -307
5457 -307 -100 -143 -40 -220 118 221 3 -235 -105 201 -83 -87 77 136 -130 64 -19 -59 92 163 -40 38 8
5480 8 146 294 168 -125 268 227 122 105 -119 248 253 19 113 232 354 236 53 -23 -1 228 -18 115 156
5503 156 -3 54 195 -98 108 -18 -107 -45 -18 -31 151 92 115 139 -46 72 -189 -119 -95 -180 -36 181 9 -275
5527 -275 28 -296 -149 -100 -39 -376 -289 -170 -61 -195 -10 -227 -156 -184 -127 -142 10 -207 -286 16 234 121 -397
5550 -397 -163 -228 -99 -16 -283 5 126 253 -43 -330 136 73 188 81 160 34 5 -45 194 -4 298 175
5572 175 283 -142 113 122 -154 239 76 -132 46 -318 58 297 374 104 117 179 106 65 303 182 233 136 54
5595 54 88 204 286 135 263 109 -12 36 113 63 -78 -73 -115 1 14 -50 -501 190 -35 -76 -55 -149 -132 -139 -109 -232
5621 -232 23 -117 239 -111 25 153 -222 97 42 -184 -182 -171 -22 -23 -138 107 113 27 -61 52 147 -133 -172 65
5645 65 -217 152 -89 -2 -8 -147 79 24 -55 14 -28 -65 113 84 139 -110 345 423 16 -213 41 -70 213 148
5669 148 -141 102 -116 237 110 208 -130 104 105 -63 -78 40 22 109 79 9 192 177 121 -35 8 177 79 185
5693 185 186 -235 -244 89 21 -119 83 -211 -53 -97 -237 -56 64 -163 -81 25 -242 128 -274 300 -114 -233
5715 -233 -50 186 -115 9 -27 -118 -338 -194 19 13 -227 -231 -148 -180 -188 -48 -142 154 7 82 -124 92 29 10 164
5740 164 54 -89 44 169 36 133 9 187 -68 244 -162 71 -45 -247 -96 -40 154 -98 19 170 306
5761 306 90 51 -268 26 36 246 99 21 238 -46 -24 269 71 -369 92 245 77 -50 -26 -68 124 -41
5783 -41 33 185 292 126 82 -104 -134 -66 -108 42 49 -79 -306 -16 -236 -98 79 72 -172 -166 28 -109 -278 -130
5807 -130 -230 -156 -405 -63 -144 -98 14 -13 -208 2 -104 149 -13 -308 181 -86 -215 -328 -101 72 -45
5828 -45 8 -3 41 189 186 -94 30 88 -33 -90 -27 143 144 173 114 365 -52 -30 32 30 6 54 -104 233 -302 329
5854 329 230 225 131 115 -94 388 -25 -301 271 -174 172 -43 -23 -58 77 108 -169 206 134 -41 -94 -7 -12 -358
5878 -358 -6 -86 -144 -63 200 -272 84 -39 31 -168 133 -33 -159 -223 -139 -27 -48 -134 -15 -205 -222 125 -40
5901 -40 96 -243 126 -150 98 -179 45 4 -88 100 -171 -42 -236 32 41 -368 -10 16 17 -27 37 -254 -240 -255
5925 -255 172 220 -88 96 -94 15 74 58 149 73 115 -168 277 90 187 -61 123 219 235 93 195 353 240
5948 240 220 -133 113 106 160 -9 -29 212 87 186 -73 -87 -90 -108 -106 -134 27 -25 138 106 89 -64 -23 -121 136 -10
5974 -10 -149 -87 198 3 9 -83 -144 -121 118 -267 -78 -12 34 101 -29 15 -224 -98 -309 -48 -242 -286 -105 -138
5998 -138 141 53 -49 52 74 46 -217 82 186 100 -70 -252 374 -11 -142 95 -36 71 60 157 28 61
6020 61 184 -76 -38 -168 334 -87 -6 -75 73 -13 -71 167 103 -18 83 -86 7 111 95 184 249 65 41 179
6044 179 -53 -76 -226 -15 0 86 68 124 70 121 70 74 61 -186 5 -106 23 -7 -76 14 -109 -23 -91 -336 0
6069 0 277 -35 -88 -134 -146 -218 40 2 -276 -210 -171 115 -111 -229 -40 -212 -274 -213 73 -180 176 -55 -149 -204
6093 -204 225 44 -262 -99 302 113 -318 -18 166 172 40 111 -146 30 51 15 65 10 -41 -147 20 31 49
6116 49 348 -63 33 105 -120 -71 -70 275 -24 72 143 73 95 -59 375 -72 -169 -120 -70 148 259 -5 143 41
6140 41 -13 -274 66 -35 -37 -238 259 237 9 -45 -79 -52 -20 37 -15 169 -40 -385 4 134 19 -286 -202 68
6164 68 -402 23 -189 -89 -26 -49 -2 -90 -147 17 -126 23 -35 -172 -38 91 -449 -35 90 47 99 151 74 -119
6188 -119 106 -34 76 198 6 38 -112 -152 -127 1 -56 -62 109 -56 250 -75 -25 220 160 285 -69 -120 115
6211 115 30 161 122 159 352 157 280 -30 207 45 192 90 -145 147 286 -51 -103 40 -32 92 -39 165
6233 165 -50 52 -214 -44 -8 -94 107 55 311 -119 188 283 186 -65 158 200 -49 -94 36 75 96 -172 -40
6256 -40 -81 -31 -79 -32 -33 -250 17 -260 -111 -238 -105 -70 -111 46 -18 24 -105 -221 93 108 15 211 101 251
6280 251 68 -235 75 -207 103 66 306 -34 46 -80 -59 107 148 176 38 263 100 -19 79 120 2 -155
6302 -155 152 162 -127 133 18 244 -63 -57 78 -59 23 24 207 0 14 31 -56 213 219 46 18 -144 -126 -204 104
6327 104 -302 -207 -175 153 -155 -213 7 92 -47 -194 9 -104 21 -195 83 -136 -304 -11 115 68 -261 -70
6349 -70 -128 -54 125 -79 -25 82 10 -317 37 -189 -54 -29 -75 129 -443 -19 132 -17 45 -217 -215 134 -19
6372 -19 -146 -196 -24 -91 69 295 -65 243 435 81 -12 -13 256 288 182 -57 25 252 -94 -51 -39 175 221 124
6396 124 -32 80 -26 229 143 144 24 189 69 -105 -32 -85 -93 34 100 -308 105 245 -141 -86 -67 125 -48
6419 -48 122 16 -214 43 -52 -270 88 -94 26 -149 -63 -123 -164 -4 -14 41 -321 -35 -277 -227 -225 -293 -227 171
6443 171 101 -122 -27 101 13 -228 77 104 -121 -112 -23 62 203 31 -160 122 39 32 130 167 -17 68 176 -215 37
6468 37 -144 68 -4 -149 -117 119 269 347 51 42 -29 52 50 271 -39 119 165 130 61 294 90 94 115 95 54 332
6494 332 281 37 44 2 232 -101 -11 -45 -61 154 55 144 34 -25 -223 59 -29 26 -55 136 -44 -169 -118 229 -172
6519 -172 -99 -57 -237 -41 -210 -286 57 -29 -8 -167 -180 -122 -154 -25 -52 142 -117 364 -254 -87 160 -43 -61
6542 -61 -208 -83 127 -4 146 -238 125 35 234 69 -383 132 -51 24 84 14 172 29 170 116 37 39 203
6565 203 102 -153 -113 -60 258 15 117 -24 -11 30 -101 110 10 -111 125 -10 -74 1 217 142 68 100 -52
6588 -52 -161 -42 169 5 -27 48 -196 -115 28 -123 -15 223 27 -204 161 -164 -222 -75 54 110 -64 73
6610 73 -75 86 -150 -97 -86 -104 -129 -10 -204 -16 -75 -94 -223 -13 118 -15 21 -114 -222 122 92 -53 -168
6633 -168 34 -13 -100 102 -77 134 -215 189 -125 -189 48 119 -294 -58 128 40 179 129 272 -23 11 57 5
6656 5 -64 202 -35 -15 228 -128 33 -103 104 272 260 80 -52 311 -54 -128 25 241 -114 50 75 101 67
6679 67 -180 185 98 -47 8 153 -126 123 -10 -60 -47 29 -64 46 -275 46 115 259 -152 -72 -6 -275 -86
6702 -86 -205 0 -5 -199 30 -11 -20 74 -235 -72 -175 -62 16 127 162 -179 91 82 -2 82 -84 0 11 -98 -40
6727 -40 83 -11 82 167 -94 -29 -148 24 -185 -326 -65 154 195 -102 -140 -42 -69 -153 -203 -74 54 34 -5 -83 86
6752 86 253 3 -42 93 -155 93 123 37 31 108 -30 234 -92 -169 -154 89 50 -162 -105 -58 35 -325 -100 31
6776 31 75 -278 -60 -260 -287 -171 19 43 -227 -73 -59 -40 76 -167 -133 -169 190 53 178 90 59 -140 -117 -46
6800 -46 -136 -46 -200 69 -74 85 -49 -23 -175 -176 146 -36 -24 -183 119 -9 -67 -29 26 116 -37 37 -62 -272
6824 -272 -64 147 25 173 1 -120 35 134 118 13 0 50 -175 -84 11 211 205 129 163 -30 -25 -34 -8 -144 -72
6849 -72 -27 -112 152 -180 54 77 54 -189 -63 99 34 219 -78 -10 -92 229 132 -14 -222 -169 13 165 98 -93
6873 -93 133 -71 -126 -20 29 57 -136 -25 108 -248 59 52 -98 4 46 -153 8 64 -50 -96 -240 -61 19
6896 19 296 -205 -201 -180 277 8 183 78 146 -88 -127 -37 117 180 -199 -145 292 102 221 -73 -133 -104 -114 -114 -19
6921 -19 49 -185 -44 207 41 128 -34 203 -40 174 -48 82 -115 -114 -194 133 -30 -116 -41 75 123 74 48 -63
6945 -63 -104 -313 104 -71 -71 -18 -191 -84 153 -112 -7 -61 -231 -245 -36 -52 -138 -211 202 -54 43 -223 154 7
6969 7 -47 72 150 0 -121 -103 38 5 71 106 -20 114 -258 36 -208 41 -11 -158 125 -8 19 -125 -118 177
6993 177 175 -140 -94 139 -14 -63 114 60 198 175 153 16 -269 103 -85 91 31 -229 154 -31 -107 54 97
7016 97 77 115 -38 4 52 143 117 -65 -214 -114 167 -106 246 173 -323 200 220 7 -184 96 198 23 -136
7039 -136 -101 162 -363 -206 -121 -224 324 107 -155 175 -207 -59 117 4 -20 119 82 338 -195 -144 19 -153
7061 -153 83 -427 -149 30 0 -80 23 46 36 -10 117 -115 262 -135 116 22 77 215 -186 -17 -315 -97
7083 -97 218 171 32 128 -206 59 37 155 16 -170 281 -103 -231 122 253 -29 193 47 -28 130 -94 -105
7105 -105 -133 105 -138 226 -55 254 -147 -209 -25 -49 189 -72 53 107 19 -156 -69 -148 229 12 -122 -20
7127 -20 -180 96 108 132 165 -30 -137 126 120 -10 117 93 -33 -28 75 -28 -120 134 -54 227 -61 26 133 1
7151 1 -5 -83 171 -192 184 -29 295 -29 -160 102 -51 94 -136 -295 43 -172 -209 -161 108 -15 314 -160
7173 -160 202 79 -55 4 84 266 105 29 97 98 27 46 -30 182 149 64 183 -64 112 -53 -164 272 -162 22
7197 22 70 -69 37 -430 201 92 -4 -145 145 -59 -1 82 -66 93 -33 -84 243 192 -192 -51 -35 93 241
7220 241 100 215 -12 -90 114 39 278 126 -191 182 -130 60 -104 -88 7 105 253 -190 49 -378 111 59
7242 59 76 49 -11 63 -98 -68 -35 -142 -25 169 190 -185 -30 -253 -111 -256 266 95 138 -145 -53 -153 -14
7265 -14 60 -12 176 -81 95 12 266 22 104 -145 184 37 275 53 259 79 106 22 245 -108 -142 121 39
7288 39 -58 -124 35 -88 14 146 55 48 103 -126 201 126 -29 1 170 60 -165 -27 140 -16 71 -107 73
7311 73 212 69 126 126 -171 137 -130 -56 -92 -10 -107 49 59 159 139 22 -66 49 66 -20 -36 -221 157 -61 -270
7336 -270 49 -247 226 20 12 106 -87 131 49 -151 134 -131 33 -242 -199 -65 144 -332 -172 117 -238 -77
7358 -77 -164 -142 30 281 -111 -98 -36 -55 11 161 270 114 -205 131 207 111 -58 304 183 101 56 234 -6 23
7382 23 51 121 -101 4 16 -70 69 -168 -131 -170 102 -42 -21 107 4 -105 295 -170 -90 57 214 104 -109
7405 -109 52 44 -4 8 -25 35 307 -8 132 -135 -224 130 109 -378 286 73 -59 -106 45 135 270 146 -102
7428 -102 98 -69 -15 -154 7 -211 215 -158 -164 -31 -81 -264 57 199 15 85 -189 -67 70 2 46 86 141
7451 141 160 137 -75 -127 191 -294 -75 -155 116 81 145 -201 -60 4 -76 -32 -157 -34 34 67 130 9 -308 24
7475 24 -41 156 26 -109 113 -287 -105 -20 -193 -165 -27 -136 -31 -9 -14 125 -126 -80 -183 -82 -37 26 149
7498 149 -183 -86 1 -128 -156 -72 192 52 39 76 -234 -7 162 69 139 -143 -139 -389 -135 -61 56 19 -184 -56
7522 -56 -252 198 -141 -28 64 -61 16 122 -27 -322 309 36 -151 -45 179 -161 -93 56 51 93 -28 123
7544 123 -228 298 -85 230 -22 208 45 6 -57 151 -84 -115 254 83 -27 188 -318 -9 -253 120 -67
7565 -67 90 -57 -238 293 -73 -84 -23 -184 11 -31 -71 -58 153 -108 117 7 -36 53 -13 -23 91 -179 -222 18
7589 18 -308 0 42 109 -123 -47 80 256 -57 -213 -106 45 7 -112 -158 127 -13 58 -145 35 134 -10 -174
7612 -174 -170 242 150 -63 -5 55 -147 -17 -6 -110 124 -30 98 -5 -213 226 17 192 79 43 96 58 31
7635 31 176 31 103 -146 70 -20 99 212 -24 -67 212 -27 -10 100 -73 -416 -265 -117 86 -271 -134 -118
7657 -118 -99 111 -34 -113 -282 165 -69 -64 117 177 38 129 -302 -118 176 -97 -109 -8 -126 24 -76 133
7679 133 -221 239 -142 -16 286 -36 -56 85 -15 53 -18 -249 -7 -75 -118 185 -265 -105 109 121 -12 -60
7701 -60 157 -179 -178 -58 -126 -12 -140 112 19 -289 387 -232 -29 98 300 -349 -84 127 130 -6 51 -85 133
7724 133 121 169 58 79 66 112 118 3 -133 108 170 -381 -105 -89 -211 94 125 -53 -67 254 -11 159 -80 -38
7748 -38 20 -203 177 282 -4 -82 150 -285 -166 39 98 53 -202 -78 -133 23 -171 -63 -116 -49 23 -250 42
7771 42 142 -317 32 177 120 246 41 -237 -159 -110 -176 343 34 -13 -53 -77 22 -54 -151 -28 -142 253 -80 71
7795 71 -99 -84 37 219 -105 -172 40 52 -113 -12 -55 109 -26 -134 135 61 -55 -122 -205 33 -80 130 24
7818 24 -441 288 -211 -24 69 18 292 -74 -33 -123 -144 9 -280 -109 -192 -139 228 -151 -169 -71 104 225 79
7841 79 -22 74 10 60 -142 173 16 18 -23 250 128 -11 -122 -84 -71 128 9 75 86 187 -120 245 -118 125
7865 125 -45 125 131 237 51 -95 -27 202 -164 24 220 -33 40 -9 -92 156 224 -141 232 38 -21 130 -49
7888 -49 71 -198 -70 133 -145 123 -167 -47 200 271 60 -48 -52 -27 11 -22 -89 -39 -32 -12 69 4 63 43 47 38 -93
7915 -93 -20 4 11 56 22 -42 39 136 60 86 -82 -158 -102 193 -208 88 -35 10 -108 205 -210 -103 274 -39 209
7940 209 -15 2 -83 25 -35 192 -261 -201 58 -50 -6 74 -18 -120 -200 216 57 -6 -20 32 183 -67 72 387
7964 387 17 -17 -94 176 81 -144 139 44 -232 84 -252 -99 42 -124 -38 -120 70 292 61 -42 34 422
7986 422 32 -112 -248 13 124 265 126 -117 411 -138 -82 -167 -61 2 -30 -185 -215 -82 -93 -112 -233 148
8008 148 -32 -42 216 276 24 -65 92 250 -33 -198 233 -187 74 173 -168 -330 86 101 -45 62 222 16
8030 16 78 -20 64 272 -198 116 210 -365 -319 55 -145 -103 29 99 -196 -55 115 33 -300 -49 238 194 -153
8053 -153 102 90 -355 45 153 155 -81 -3 38 19 -60 139 73 111 -155 -188 -146 150 64 75 -18 103 -374 -140 -324
8078 -324 -232 10 47 240 -7 -27 50 79 161 -175 -75 80 216 189 66 152 -107 -165 5 -36 -104 197 359 -134
8102 -134 86 105 -80 -10 -105 -34 -206 323 34 139 -59 -167 12 -145 -74 -102 20 113 60 115 -111 -20 115
8125 115 -54 -213 26 43 24 65 145 -234 83 267 78 8 272 179 -192 -138 -129 -191 10 -208 204 -55 189
8148 189 -34 -18 54 177 -121 6 -37 19 -38 -109 -204 -354 94 -159 -220 89 236 76 184 92 -45 15 -115
8171 -115 -127 83 -58 -27 63 40 -23 122 -35 56 33 134 234 61 -53 -104 73 46 -113 74
8191G4
$$ Imaginary data points
##PAGE= N=2
##DATA TABLE= (X++(I..I)), XYDATA
0 0 0 0 0 0 0 0 0 0 0 0 0 0 0 -8 8 -8 8 -8 15 -16 16 -24 24 -32 35 -40 48 -56 64 -72 83 -95 107 -121 137
35 137 -154 171 -194 216 -241 266 -294 325 -362 398 -441 486 -536 592 -652 717 -791 870 -962
54 -962 1064 -1179 1311 -1463 1643 -1856 2115 -2436 2849 -3400 4169 -5331 7266 -11080 21373
69 21373 -105640 -279985 64900 170365 -87019 -177297 26776 85772 -31822 -43748 8983
80 8983 -29270 37841 58866 -75587 -88003 57721 66536 -70204 -87271 12868 30756 -24193
92 -24193 -41371 -17923 -1160 7301 -4861 -27222 -34777 36465 45368 -75267 -42726 82552
104 82552 10217 -75026 13697 44586 -37474 -22541 41201 -1906 -34481 30062 14931 -33942
116 -33942 23197 50189 -20443 -35061 57281 54064 -60788 -20650 102486 15556 -92513 22314
128 22314 96418 -10650 -63262 37134 68631 -25845 -20777 50056 23782 -22709 11631 37708
140 37708 -11694 -16615 40468 15689 -37587 12257 32242 -11036 3358 8873 -12707 8017
152 8017 28724 -11232 -36765 17979 33002 -29671 -33430 19476 14825 -23600 -21339 8957 1814
165 1814 -20847 7628 2424 -40948 -6104 30440 -14084 -44623 -7787 18219 -11973 -27735
177 -27735 -5152 -7704 -7132 10930 -17600 -40358 6637 41548 -19944 -71138 8111 59589 -24455
190 -24455 -59077 9732 31660 -5709 -25766 -6527 15008 8846 -1282 -13852 -10096 19298
202 19298 15716 -12937 -16818 9897 25074 -1256 -12404 11504 12592 7680 11637 -5612 1883
215 1883 28409 12740 -15840 -3894 33590 19266 -21817 151 32981 12493 -10245 3883
227 3883 23904 12228 -6244 5090 10053 6944 11117 -4531 -6142 16703 10472 -8161 -5360
240 -5360 13247 13833 -11716 -8760 14551 4557 -10789 -5681 3271 -1401 -9809 291 -2126 -14478
254 -14478 1890 4671 -15789 -9815 3397 -1530 -11959 -13199 -1053 -3346 -11579 -8850 -11285 -4328
268 -4328 410 -12369 -13814 -2799 3645 -6806 -19494 -1901 7919 -12243 -12885 -613 -820 -4614
282 -4614 -8361 -2143 778 -4819 1546 663 -5146 2151 4086 536 -2471 -26 6524 471 -440 6770
298 6770 813 4563 10402 397 2447 10279 9521 3050 -726 11450 12438 -1946 3500 11220 7112
313 7112 3799 3681 9645 8466 2998 7863 5262 4533 9846 2522 1191 6591 4213 3004 185 3088
329 3088 6794 -1013 464 4819 -208 903 792 -490 -1777 -3555 1807 -1800 -9389 -608 -91 -6826
345 -6826 -4167 -4446 -2063 -3565 -7916 -3518 -4891 -5461 -3583 -9815 -6884 -2858 -7041 -7294 -7329 -3912
361 -3912 -3216 -9601 -4486 -1381 -7053 -4468 -4407 -5446 -3326 -5505 -2244 -3242 -6198 204 -1269 -3927
377 -3927 386 -932 194 88 -668 2980 -430 1056 3303 -1344 3581 5298 205 3214 4263 5256
393 5256 5291 1591 6617 7787 2760 4894 4541 6189 6907 2207 5205 6402 5152 8002 3254 3748
409 3748 8799 4665 3711 3988 4093 6691 1868 1239 4017 1232 4260 2834 -1758 2437 2815 1572
425 1572 -270 -2629 1934 217 -3688 -1056 -3029 -1858 -949 -5793 -3027 -2261 -4355 -1833 -5547 -5016
441 -5016 -2246 -5065 -4140 -5046 -6684 -4050 -5940 -4060 -4751 -8372 -2448 -2859 -8085 -4059 -3376 -2845 -3629
458 -3629 -7249 -2979 -1741 -2887 -2630 -6152 -1917 1335 -3774 -2021 -893 260 2555 -2282 -1436 3527
474 3527 2548 1270 -1789 627 6219 2181 1576 2536 1545 6950 4852 603 5130 5541 5159 3540 2435
491 2435 6615 5328 4521 4719 648 6168 8621 1944 3958 4888 2969 4998 4613 3892 1385 1336 6035
508 6035 1803 -1024 2717 2561 3811 -274 -5107 3353 6147 -954 -5128 -3521 2769 640 -4414
523 -4414 -3568 -4077 -553 935 -8588 -6170 2152 -1026 -5784 -9130 -4468 2219 -2392 -8546 -9418 -2557
539 -2557 2691 -7781 -9616 -925 -2391 -4152 -4668 -5959 -1122 22 -4556 -7686 -4333 3752 -780
554 -780 -7528 -2144 -906 -203 725 -3757 -311 2686 -1380 -935 1909 3310 1017 -401 3847 -250
570 -250 35 8417 3643 -1539 3309 4658 4986 4449 2482 3709 4324 5003 2800 1822 7296 4053 754
587 754 5769 2188 2826 9023 3537 -2043 2544 8299 5283 -2835 1345 5529 1308 1666 -123 -318
603 -318 5693 351 -3628 134 2357 2007 -1569 -3597 -1882 -444 1912 -2607 -7559 -312 141 -5882
619 -5882 -2509 -1451 -3669 -3244 -3654 -3955 -4734 -2342 -1348 -6661 -5461 -3546 -4432 186 -3614 -9185 -2346
636 -2346 259 -2735 -4994 -3648 -564 -3011 -3501 -1194 -3582 63 1037 -4546 -2824 591 2833 2213
652 2213 -4236 -2663 4695 3804 -691 -2790 3081 5900 -1107 -410 4258 3994 4554 550 -1099 6137
668 6137 7550 3402 -399 2237 7176 3885 1739 3860 3287 5104 3155 -237 5193 5957 2509 1727
684 1727 682 3962 4824 1812 1313 273 2274 2830 -1003 1486 1892 -922 789 -807 -1405 2262
700 2262 466 -2919 -2910 -633 351 -3950 -1960 123 -5206 -3294 -527 -2929 -2996 -3884 -3489 -2206 -3541
717 -3541 -3103 -3132 -3151 -2409 -5464 -3767 -908 -3710 -2932 -3265 -4312 -819 -1714 -3297 -2167 -2334 -1593 -1935
735 -1935 -1467 -149 -2718 -444 634 -3306 439 2291 -426 -358 97 1152 2071 1041 1746 41 1067
752 1067 4386 702 1067 4032 2047 2694 3042 2325 4595 3151 2871 2944 2271 4026 3227 2749 3120 1099
770 1099 3736 4981 136 2467 4238 1359 1732 1503 3023 2107 562 1633 33 1075 3107 -1317
786 -1317 -1024 2066 -547 -917 -486 -476 143 -2324 -1244 -1028 -2052 -563 -2362 -3564 -956 -2680 -2411
803 -2411 -2014 -4020 -1987 -2240 -3370 -2379 -3187 -1983 -3119 -4147 -1887 -2686 -2888 -1226 -4238 -2479 -669
820 -669 -2991 -2490 -1675 -1261 -1570 -3039 -716 316 -2346 -311 -763 -723 1042 -321 251 764 144 1493
838 1493 468 632 2431 585 1380 1904 1291 3024 1884 1756 3223 1498 2988 3397 1581 3016 2781
855 2781 2707 2836 1300 3517 3320 1057 2796 2590 2181 3303 1204 1766 2325 1184 2201 671 960
872 960 2324 -295 773 1072 -106 861 -571 -535 419 -1442 -289 -750 -1970 -357 -1602 -1658 -1390 -2782
890 -2782 -1037 -1670 -3314 -1211 -2573 -2648 -1741 -3324 -1950 -2058 -3056 -2182 -2950 -2401 -1511 -3872 -2046 -1732
908 -1732 -2898 -1978 -2640 -1653 -868 -2731 -1070 -1245 -1941 -56 -1446 -810 72 -853 601 26 -658 1150
926 1150 145 416 1277 453 1764 1377 693 2214 922 1851 2559 1003 2486 2367 1381 2911 1980 2372
944 2372 2698 1514 3186 2063 1637 3252 1765 1952 2701 1309 2628 1921 1379 2359 1043 1646 1918
961 1918 291 1754 723 202 1171 -363 339 721 -766 311 -339 -956 -3 -1064 -948 -1251 -1865 -529
979 -529 -1841 -2457 -811 -2554 -1674 -1526 -3343 -1598 -2184 -2509 -1532 -2897 -1698 -1700 -3218 -1991 -2156 -2127
997 -2127 -1253 -3165 -1914 -957 -2295 -1239 -1945 -1842 -257 -1261 -1030 -919 -1190 618 -1087 -865 937
1014 937 -323 273 534 -535 1160 1513 801 981 464 2156 1524 619 2598 1409 1426 2623 1242 2041
1032 2041 2788 2013 2467 1875 2183 2686 1749 2490 1455 1209 3063 1546 1340 2771 1205 1836 1744 580
1050 580 1500 1265 1388 686 -500 1462 805 -489 636 -629 -428 1120 -1193 -983 -208 -776 -688 -1746
1068 -1746 -1122 -827 -1895 -736 -1978 -2680 -392 -1940 -2582 -1852 -2545 -1736 -1850 -2615 -1824 -2113 -1549 -1764
1086 -1764 -2996 -863 -1644 -2688 -598 -1805 -1929 -568 -1623 -1514 -1346 -904 34 -1511 -464 223 -1115
1103 -1115 819 193 -1064 964 82 120 1427 688 1195 746 787 1006 593 2470 2341 11 1959 2017
1121 2017 1257 2467 1467 1699 2238 1329 1977 1598 2391 2554 316 1329 2135 1072 2816 1327 183
1138 183 1752 1366 963 1017 856 1588 -83 57 1168 417 930 256 -1450 334 17 -655 261 -1099
1156 -1099 -1039 -933 -1298 -322 -1672 -1208 -878 -2891 -1400 -960 -2083 -945 -1921 -2706 -1368 -1784 -1170 -1707
1174 -1707 -2399 -1694 -2016 -1276 -562 -2597 -993 -1124 -2600 -605 -524 -1076 -796 -1409 -916 -529 -230 667 -1105
1193 -1105 -546 571 -828 557 719 -257 1346 738 147 1087 1142 1570 833 840 2101 1012 1850 2570 361
1212 361 1818 2368 1089 2264 2064 1406 1887 1422 2041 1433 1714 2343 234 1410 2252 -16 1468 1675
1230 1675 247 1456 1078 651 671 118 1007 -169 -198 905 -1022 -579 326 -1168 -211 83 -1221 -791
1248 -791 -1004 -658 -853 -1392 -812 -2092 -1883 -396 -2239 -1530 -607 -2105 -1563 -1013 -1540 -1232 -1679 -1474 -1967
1267 -1967 -1814 -70 -1614 -2051 -404 -1976 -1408 -107 -1411 -619 -639 -756 -652 -535 235 -86 -714 311
1285 311 -347 -274 1373 -12 323 671 79 1239 1028 1209 1273 387 1402 1401 829 2347 1444 940 2194
1304 2194 1258 1711 2435 1363 1790 1382 1418 1731 949 1864 1164 332 1726 1018 876 1854 631 744 776
1323 776 546 897 215 568 207 -452 593 264 -639 375 -744 -848 286 -837 -649 -659 -1200 -614 -1410
1342 -1410 -756 -542 -1877 -831 -1244 -2131 -553 -1448 -1659 -1075 -1980 -1207 -1243 -1594 -759 -1851 -1226 -909 -1797
1361 -1797 -679 -955 -1296 -643 -1037 -914 -423 -1241 -286 -284 -624 249 -504 93 180 -660 767 480 -142 1110
1381 1110 516 727 1194 448 1095 977 813 1697 652 1011 1678 646 1691 1268 940 1693 836 1121 1666
1400 1666 865 1697 1409 1023 1562 781 1066 1173 418 1401 976 423 1267 291 483 595 -45 536 -202 -49
1420 -49 631 -554 63 45 -1185 -390 -366 -533 -393 -746 -868 -647 -1394 -266 -1190 -1308 -711 -1904 -1061 -1143
1440 -1143 -1483 -866 -1579 -1667 -720 -1462 -1179 -1112 -1645 -832 -1556 -1144 -408 -1277 -854 -704 -1338 -145 -588 -1090
1460 -1090 45 -703 -44 183 -577 519 -228 64 534 239 543 590 261 1041 675 687 1447 582 1334 1127
1480 1127 714 1477 699 1034 1599 804 1693 1332 903 1796 1391 837 1633 761 1405 1241 747 1407 713 729
1500 729 1195 388 917 880 197 743 123 341 639 -520 275 -361 -800 -65 -625 -237 -63 -1086 -469 -769
1520 -769 -949 -526 -875 -1070 -745 -1427 -825 -1284 -1584 -1123 -1454 -1032 -586 -1829 -922 -1133 -1412 -574 -1330 -1234
1540 -1234 -880 -1298 -791 -757 -1193 -340 -969 -520 -119 -944 -121 -491 -279 167 -243 -184 271 -542 558 360
1560 360 266 942 203 535 1273 432 1180 724 684 1474 498 1183 1483 675 1404 1131 896 1470 993 886 1200
1581 1200 688 1474 1160 692 1389 571 1127 1019 244 1054 327 266 775 -82 566 560 -85 364 -169 -393 331
1602 331 -642 -22 -215 -717 142 -687 -668 -206 -1100 -655 -861 -1138 -514 -1110 -1021 -603 -1458 -764 -884 -1652 -654
1623 -654 -1030 -1317 -806 -1076 -1246 -788 -1435 -855 -1014 -693 -436 -1189 -824 -681 -1257 -48 -529 -813 -337 -557
1643 -557 33 127 -388 506 -297 104 584 -121 922 641 294 953 630 596 1317 813 932 850 851 1208 769
1664 769 1036 1334 464 1195 1334 615 1308 1024 725 1143 740 1267 897 847 1215 432 952 1246 164 489
1684 489 328 -30 730 407 129 212 160 88 14 -325 198 -761 -304 -125 -928 -379 -589 -891 -463 -498 -882 -577
1706 -577 -909 -737 -1021 -1109 -355 -1414 -1024 -581 -1712 -996 -818 -1450 -770 -822 -892 -895 -1105 -609 -886 -729 -59
1727 -59 -1023 -553 305 -813 -341 100 -554 -156 107 439 -147 -80 592 -417 392 996 113 369 978 398
1747 398 984 1273 650 1017 854 1088 626 1010 1644 545 717 1493 657 871 1598 746 822 783 887 921 719
1768 719 1002 483 -34 985 572 414 877 -8 209 665 0 181 -140 -154 -46 -504 114 -393 -837 79
1788 79 -431 -869 99 -559 -619 -619 -900 -457 -854 -541 -523 -1408 -668 -1077 -1135 -667 -1191 -1254 -693 -1320 -843 -761 -988
1811 -988 -673 -1101 -883 -297 -997 -295 -644 -730 98 -308 -315 303 -561 -315 -144 -378 287 -312 185 447 -319
1832 -319 423 568 461 639 265 456 922 454 1113 882 537 1009 660 978 889 468 998 915 590 1261 910
1853 910 831 1065 558 1032 807 480 686 542 934 618 241 1008 252 17 655 283 147 462 -296 131
1873 131 -297 -368 -164 -547 -71 -211 -697 -358 -386 -828 -452 -881 -901 -460 -765 -676 -569 -616 -647 -1135 -626 -639
1895 -639 -1196 -417 -1058 -1083 -396 -774 -720 -669 -758 -534 -1021 -578 -331 -752 -489 -278 -797 268 40 -100 207
1916 207 -445 69 -39 -35 478 34 -46 468 78 637 706 396 791 738 418 877 650 1108 774 586 938 548
1938 548 776 807 559 1013 863 810 999 632 501 774 441 577 546 339 648 207 518 412 96 537 238
1959 238 -10 444 256 113 -12 -497 -230 -404 -296 -20 -304 -562 -98 -637 -479 -325 -872 -472 -679 -605
1979 -605 -408 -969 -558 -696 -900 -630 -1060 -825 -332 -996 -198 -542 -727 -393 -643 -519 -334 -810 -134 -389
1999 -389 -655 -169 -700 -203 -246 -431 34 206 -109 247 -163 128 426 137 386 550 203 536 538 567 565 438
2021 438 978 690 322 948 594 844 834 612 686 761 564 898 741 561 688 702 763 471 417 893 516 362
2043 362 501 266 464 465 128 559 36 -76 200 -343 222 -10 -400 107 -457 -133 -73 -619 -335 -567 -451
2064 -451 -273 -716 -291 -411 -682 -535 -680 -732 -590 -1116 -566 -485 -1100 -552 -709 -940 -260 -951 -512 -184 -736
2085 -736 -447 -541 -661 -312 -631 -362 -209 -698 -199 -81 76 -74 -37 291 197 -2 468 -165 276 410 42
2106 42 229 392 264 747 618 648 529 299 767 649 197 1043 741 581 757 355 819 642 669 929 324
2127 324 426 703 262 587 594 190 713 247 388 254 -100 353 84 -311 413 -199 -41 28 -261 0 -317
2148 -317 -370 -63 -371 -390 -344 -335 -302 -140 -481 -414 -767 -460 -509 -821 -673 -482 -597 -397 -876 -583 -363 -1070 -283
2171 -283 -356 -1137 -257 -349 -659 -267 -475 -510 -628 -193 -91 -710 71 94 -365 -26 -81 87 65 150 324 241 26
2194 26 570 60 124 442 -16 517 702 94 627 373 358 489 662 521 666 470 703 261 559 754 245
2215 245 580 709 202 510 717 442 271 157 598 462 115 583 135 50 306 -147 79 65 -184 123 37
2236 37 -202 -33 -278 -213 -332 -452 -96 -488 -657 -120 -306 -500 -393 -663 -436 -355 -898 -581 -936 -540 -438
2257 -438 -406 -351 -468 -750 -544 -811 -512 22 -323 -328 -683 -542 -114 -570 -115 4 -761 100 74 -136 71 -82
2279 -82 -40 149 -167 348 -27 391 390 130 548 414 -14 728 115 365 369 415 413 330 326 705 397 348 906 121
2303 121 632 500 153 526 723 413 677 350 402 418 96 597 248 266 427 115 292 283 -137 228 -200 -104
2325 -104 120 -51 229 -211 -341 -234 -340 -237 -267 -759 -44 -403 -590 -53 -703 -338 -52 -664 -564 -423
2345 -423 -570 -411 -496 -239 -563 -543 -369 -599 -652 -222 -699 -218 -317 -287 -257 -57 -264 -176 -290 -196 -119 -260 153
2368 153 87 -220 282 125 117 327 192 89 153 24 446 16 338 236 -216 572 389 516 594 149 447 547
2390 547 571 811 363 622 573 168 774 571 120 959 382 191 262 162 472 512 211 397 98 140 275 -77
2412 -77 354 240 -325 187 -29 33 188 -224 -30 -209 -437 -55 -210 -265 -392 -509 -336 -464 -399 -287 -555
2433 -555 -389 -589 -655 -287 -712 -593 -279 -395 -588 -302 -781 -352 -268 -545 -83 -612 -166 22 -397 -84 -522
2454 -522 -272 -153 -313 55 27 -231 96 52 52 301 208 168 272 141 159 288 267 472 195 400 402 347 641 533
2478 533 409 395 304 393 657 263 787 116 204 866 75 402 584 130 179 485 25 337 171 208 147 -99
2500 -99 198 167 138 339 -46 -172 283 -73 193 -280 -450 303 -589 -120 -86 -198 -79 -342 -483 -254 -373
2521 -373 -541 -480 -495 -271 -280 -505 -251 -442 -448 -373 -570 -442 -284 -433 -115 -441 -95 -288 -678 164 -226 -282 2
2544 2 -163 175 27 -295 184 -84 -189 123 140 172 -247 47 134 111 258 437 318 404 491 244 320 144 100
2567 100 432 154 389 437 80 856 476 374 763 247 449 516 -11 404 658 132 358 366 388 219 -18 589
2589 589 -56 167 411 178 280 267 186 87 -34 -82 168 -253 51 -344 -337 -369 -300 -241 -143 -396 -296 -312 -525 130
2613 130 -525 -143 -272 -710 -245 -372 -509 -145 -451 -118 -479 -404 -385 -246 -142 5 -241 -265 -47 -459 165
2634 165 -452 -473 -102 -206 1 228 -145 98 47 -24 94 -130 211 37 -124 165 -145 341 341 34 138 343
2656 343 212 374 399 177 184 302 328 202 65 450 305 404 491 286 372 453 145 401 278 67 388 77 422
2679 422 77 -118 289 227 16 308 111 286 -37 -292 26 -269 -66 111 -230 -253 -345 -287 -32 -159 -441
2700 -441 -155 -465 -99 -335 -518 62 -492 -256 -289 -358 -300 -381 -316 51 -523 -411 -44 -447 -130 75 -380 -237
2722 -237 -401 -351 -349 -56 -64 213 -255 76 -188 -181 349 -273 78 192 106 0 162 175 209 19 383 297 285 351
2746 351 0 -27 576 261 524 498 255 322 192 566 396 129 327 339 309 462 140 5 269 16 595 232
2768 232 30 280 98 382 277 -121 154 117 -231 76 131 59 184 -401 -46 -225 -160 27 -351 -155 -51
2789 -51 -509 -177 114 -437 58 -556 -389 -471 -642 -171 -270 -349 -144 -684 -401 48 -419 -308 -396 -462 -41 -169
2811 -169 -440 195 -503 -71 -81 -320 -57 -499 28 -129 -27 247 30 -50 73 28 94 198 -148 108 160 76
2833 76 274 218 111 276 58 198 215 534 218 269 473 672 235 371 489 251 401 112 340 127 209 340
2855 340 158 164 179 26 206 225 -103 56 87 144 408 184 4 -91 -26 225 -184 -96 -85 30 -172 -287 -372 46
2879 46 -361 -393 -200 -264 -264 -267 -530 -189 -409 -478 24 -265 -568 -223 -253 -363 -337 -130 -269 -500 -121 -230 -347
2902 -347 -35 -139 -309 117 -171 -176 -63 -168 -79 -152 249 88 -7 45 237 98 127 -291 75 434 209 204 -40
2925 -40 451 506 174 156 463 63 407 211 167 248 633 259 314 253 508 76 135 618 88 13 535 -197 264
2948 264 205 77 166 108 61 149 257 220 235 49 44 18 -433 -20 -176 -190 -189 -200 -229 -218 -89 -330 -360 -248 -298 -268
2974 -268 175 -616 -168 -165 -325 -5 -203 -245 -499 -480 -174 -386 -631 -55 -252 -244 -338 -243 -382 -2 -307 -431 -37
2997 -37 -235 -266 -120 56 217 -345 -8 132 -164 41 122 124 284 -105 154 57 280 506 3 269 286 235 583
3020 583 347 -15 468 33 245 352 281 329 381 291 366 116 321 366 -106 404 358 293 257 130 284 207 -106
3043 -106 154 -54 86 350 -92 -22 -118 -111 121 -155 -149 301 -101 -130 246 -186 -67 -30 -312 154 -233 -100 -142
3066 -142 -168 -339 -299 -296 36 -246 -340 -197 -329 -5 -483 -132 -24 -435 -296 -369 -434 228 -150 43 -143 -219 -54
3089 -54 -176 -55 22 -515 -145 -163 28 23 87 -278 388 -88 -241 -162 338 341 165 167 -38 75 93 574 -136 166
3113 166 569 5 315 312 260 212 178 243 487 -31 279 373 266 454 -107 253 417 278 296 319 93 213 25
3136 25 72 141 85 -225 -283 -10 159 -324 129 -193 -136 23 -281 70 15 -348 -44 -199 -507 142 -391 -220
3158 -220 -203 -477 -195 -341 -222 -34 -361 -179 -247 -396 -172 -77 -148 -84 -88 -229 209 -150 129 -74 -312 -195
3180 -195 -127 42 -265 65 -73 -209 -94 10 35 3 -140 -224 129 -41 155 105 76 146 463 382 253 192 18
3203 18 511 239 322 456 -213 404 75 89 69 11 547 814 242 13 301 208 450 321 175 345 97 -43
3225 -43 134 46 80 -60 151 228 53 348 65 166 -55 -137 -191 -24 20 -66 -267 -64 -199 -54 -185 -341 -369
3248 -369 -174 -434 -198 -219 -501 -336 -288 -174 -250 -386 -160 -433 -382 48 -167 -43 -123 -12 -205 -240 -366 -281
3270 -281 -174 -357 -29 6 72 117 -129 123 48 96 540 -60 184 200 -107 82 180 183 183 338 53 103 8 348
3294 348 248 52 190 269 166 115 -60 40 98 169 375 5 350 169 83 297 173 251 199 22 111 173 -63
3317 -63 111 -33 107 67 125 260 160 31 -62 -120 -169 253 -333 -32 58 -490 -152 -217 -89 26 -174 -165 -295
3340 -295 -387 -378 -206 -126 -87 -350 -212 -117 -312 -118 -77 -56 -19 -188 59 -74 -237 86 -261 -204 79 -162 24
3363 24 -225 -81 -164 251 -6 57 -188 105 130 -146 405 328 44 -90 43 351 6 349 -71 183 291 149
3385 149 57 442 268 77 458 288 125 446 -23 106 121 188 437 418 0 194 154 220 60 -189 316 -188
3407 -188 130 458 36 275 -29 45 254 53 66 -147 -254 72 -328 -570 -126 -125 -158 -266 -305 -174 -101 127
3429 127 -7 -279 -442 -181 -360 -22 -204 -397 -370 -257 -73 -197 -418 -176 -424 -468 184 -59 -224 214 -423
3450 -423 -85 -128 -377 290 59 -88 267 -37 130 114 -184 165 -214 -206 322 -197 246 93 224 440 177
3471 177 135 178 21 204 249 -140 418 184 198 315 254 235 321 85 -95 86 91 337 429 120 170 -42 191 -36
3495 -36 -105 234 -4 174 -18 111 7 -60 330 178 -199 108 -62 105 133 -56 -237 52 23 95 -54 -201
3517 -201 -17 -345 -341 -402 -260 -350 -686 -36 -94 -360 -187 -92 -292 -76 -109 -236 -254 -580 -269 116 -455 261 -123
3540 -123 -104 203 -6 155 -219 -101 -42 -110 175 3 163 287 -14 -330 192 -41 337 364 101 224 408
3561 408 232 259 115 106 341 414 130 402 141 403 18 -23 326 -128 286 284 51 482 -98 306 346 -17 166
3584 166 55 -309 429 67 315 122 -94 11 -83 62 18 35 -64 -265 -222 283 -42 -103 14 -158 -13 -7 15
3607 15 -102 -111 -266 -61 -157 27 -159 -619 -49 -101 -173 1 -135 -565 -57 -238 -229 -58 -294 -127 -100 -28 -48 -262
3631 -262 -162 82 -264 -20 -292 58 81 -55 45 -120 392 268 59 194 250 200 150 429 179 294 37
3652 37 144 -6 98 227 246 50 376 142 172 177 119 306 205 211 42 101 463 54 257 -74 54 206 240
3675 240 97 193 162 -192 87 -45 114 232 -434 121 189 -22 120 21 -139 148 -253 9 41 -336 -16 -320
3697 -320 -263 74 -323 -177 -355 -377 -129 -157 -304 -103 -605 -216 -17 -474 -13 -79 -393 -15 -126 -39 151 -213
3719 -213 11 -124 -189 104 -227 -198 -82 -189 78 16 135 93 -109 66 168 -23 34 91 43 104 236 325 463
3742 463 -3 183 294 168 34 272 339 487 253 186 133 305 540 178 122 86 42 235 -89 130 117 182 243
3765 243 185 298 233 52 245 243 141 16 -58 90 100 -110 -309 350 66 52 -176 -373 -87 -131 -40 -410 -42
3788 -42 -213 -67 -251 -142 -333 75 -269 -248 -114 -168 -198 -338 -41 -224 -180 -116 -113 -185 -309 -151 -211 -128 -186 -168
3812 -168 -109 -371 -229 -35 -365 -76 21 185 -53 -38 -159 206 -33 -31 298 107 -17 303 502 219 42 404
3834 404 173 -4 416 407 438 222 224 120 112 540 233 231 31 301 -15 -66 277 92 142 155 55 312 99 360
3858 360 176 217 -103 181 91 39 230 -37 -199 -235 230 209 -68 -4 -5 198 -208 -223 71 -105 -384 -101 -196
3881 -196 -251 -343 -390 19 -342 17 -320 -247 -349 -149 -259 -125 -214 -182 -184 -165 -302 -13 -23 -215 -37 -270 -157
3904 -157 -402 -187 -61 -64 -205 -242 -239 43 -122 137 66 33 157 -84 231 68 179 195 186 223 359 147 203 356
3928 356 217 343 173 180 605 109 311 531 272 184 243 85 433 91 -41 255 -35 77 219 93 293
3949 293 -120 107 146 17 -55 85 4 -158 -77 38 124 -161 -290 -107 -147 -166 -104 -283 -133 -392 102 -196 -65
3972 -65 -129 -309 -185 -241 -384 78 -263 -301 -207 -368 -72 23 -335 -329 -152 -284 -189 -142 -28 -247 -302 116 -49 -176
3996 -176 65 -110 -147 54 72 106 117 250 163 -93 290 188 49 162 212 102 172 -91 -14 282 161 72 139
4019 139 237 381 66 228 212 175 187 249 304 300 -162 21 216 287 249 46 265 107 46 -106 204 166 83 287
4043 287 317 240 183 130 -47 155 275 155 -97 120 -170 141 -243 -169 79 53 -265 74 -272 -330 -83 -263
4065 -263 16 -401 -297 14 -396 -282 -24 -545 102 -225 -423 142 -47 56 -329 -264 -316 -357 -59 -282 -169
4086 -169 140 -34 164 232 34 -158 -219 -76 -166 -107 -106 -10 109 -60 -11 -17 78 189 77 301 82 178 180 136 193
4111 193 130 399 198 113 437 212 179 222 -86 120 151 193 257 59 183 57 65 -29 233 117 -9 349 -71
4134 -71 -113 -143 -117 6 -194 58 -340 -259 181 -84 -201 162 -298 9 42 -131 -262 24 -104 64 -308 -48
4156 -48 -422 -121 8 -326 -135 -265 -165 -263 92 -302 -78 -157 -234 -81 -310 -150 -173 -56 2 82 67 -39 -213
4179 -213 91 -151 -99 305 -86 -138 353 -59 109 76 117 239 141 31 137 134 210 59 193 174 33 62 223
4202 223 45 177 216 28 387 80 121 417 255 91 30 172 300 -95 275 43 72 170 -73 166 -2 55
4224 55 -89 79 -146 -90 64 -23 264 8 85 -7 -35 64 -241 108 93 -112 -259 67 -221 -35 -204 -147 -102
4247 -102 -439 4 -63 -559 -17 -190 -344 -117 -436 -259 -14 -107 -273 82 -363 -170 -273 -74 19 -492 64
4268 64 223 -194 -95 -242 66 -32 -129 -62 32 29 80 -3 -5 76 199 -74 -30 366 338 50 57 283 240 84 67 365
4294 365 370 128 298 422 -168 199 -5 222 294 46 176 368 -99 69 -39 -54 56 -21 237 142 105 219
4316 219 -76 -195 56 -184 -4 -171 -173 -75 -282 -242 -107 -28 -26 -207 23 -316 -376 -199 -96 -264 -378 -81 -326
4339 -326 -13 -164 60 -22 -329 -159 -283 -150 89 -257 -149 -279 -199 30 -347 -38 -82 -62 -18 94 -146 -96
4361 -96 -501 -186 162 11 -114 141 37 -103 -19 -137 145 -55 91 382 15 52 94 163 88 287 134 208
4383 208 135 217 104 257 306 187 109 -32 -46 309 104 219 113 135 242 302 64 91 219 32 222 329 -62
4406 -62 100 -323 30 -124 31 -2 -4 45 -72 -186 -170 -10 -152 26 -210 -269 -256 -142 292 -205 -160 -168 -310 -281
4430 -281 -239 -29 -492 -129 -153 74 -226 -451 -266 -69 -84 -274 -355 -170 -77 6 -72 -337 -34 36 6 -30 4 169
4454 169 145 -168 298 284 205 -52 138 48 -298 -15 176 155 -55 353 34 95 -61 83 499 187 257 139
4476 139 295 -60 161 157 87 228 84 262 25 211 342 -118 31 -108 -12 194 -73 282 247 52 69 -138
4498 -138 24 122 -194 181 74 -208 -92 -29 -20 -183 -101 20 -178 -234 -231 33 59 -204 -284 -207 -376 -102 -66 -206
4522 -206 -243 -300 -242 168 -198 -309 -126 -282 -286 102 4 -36 -105 30 -52 -146 -153 -129 -289 -36 -40 -85 65 -8 -154 130
4548 130 -11 17 477 -90 -163 8 -4 148 24 378 249 188 177 149 44 400 -273 154 49 34 407 -110
4570 -110 316 -209 61 390 52 77 227 78 189 257 294 95 326 433 29 57 -170 321 -74 108 62 -230
4592 -230 -31 -179 89 27 -270 -211 -27 -1 -72 -455 -19 -4 -448 -161 -235 103 -153 -420 -174 -127 -145 -211 -83
4615 -83 30 -29 -375 60 53 -232 -262 -208 118 -332 -98 129 -193 -190 19 103 -13 89 -200 -34 100 -248 -137
4638 -137 -12 -17 316 -6 129 40 -215 191 -27 11 396 174 261 35 -26 383 115 438 316 -84 91 160
4660 160 202 501 393 9 337 -108 293 51 -141 175 71 -22 46 -8 29 267 -357 -29 -70 -15 159 -236
4682 -236 44 -61 -241 26 -23 -81 132 -397 30 165 -101 149 -514 -365 -397 -246 -84 32 -25 -269 -191 -9
4704 -9 -21 -273 -50 -164 -293 -92 -193 -219 -61 -217 -82 -49 -69 88 -48 -62 -117 -157 274 -75 23 122 60 36
4728 36 -70 -1 12 174 20 -33 43 -255 37 90 87 276 199 75 198 354 380 -145 356 208 24 398 340 83
4752 83 154 250 336 40 161 -14 0 316 118 32 38 99 -35 162 336 46 272 100 -5 220 -241 -33 -99
4775 -99 -77 11 -182 -179 -150 -54 117 -183 -5 -136 -53 -315 -262 -229 15 -340 -230 -74 120 -114 -26 -99 -178 -65
4799 -65 -250 -140 -427 2 -278 -296 20 -79 -44 75 -48 -86 5 -109 -33 -166 -203 209 8 52 -72 21 -90
4822 -90 117 16 21 40 125 191 -55 315 166 399 129 290 264 260 34 335 104 306 112 232 -24 8 169
4845 169 -27 169 -152 116 -109 204 -186 118 190 111 119 68 78 -55 -97 -127 36 -52 -140 -43 -55 -23 -197 -145 -75
4870 -75 -593 128 -168 57 16 -356 -73 -38 -148 25 -245 -141 2 -246 -61 -33 -454 -12 -229 -334 -277 20
4892 20 -93 -45 -185 -72 -319 8 183 -64 -282 -59 -17 216 81 57 7 131 163 44 -213 274 145 33
4914 33 68 -1 64 -50 22 36 217 4 325 116 144 183 -91 445 120 -299 -57 -24 72 28 103 44 46 339 167
4939 167 158 46 -61 -58 45 57 260 211 67 23 69 92 76 -91 -204 -72 116 50 -52 32 109 -67 -244 188
4963 188 -228 -285 41 -142 -108 -27 -189 37 -200 -232 13 -326 -18 -206 -357 -1 -420 -46 -91 -181 -51 -222
4985 -222 -87 198 63 57 35 -162 -150 140 -112 -36 -122 107 17 150 84 -119 -117 59 -12 165 172 -23 274 140
5009 140 18 336 256 296 63 191 326 129 275 218 52 335 -60 152 141 114 251 256 289 406 94 60 40
5032 40 34 170 195 -148 48 60 73 -73 -134 -80 0 272 -37 -128 -91 193 -241 98 19 -441 -18 -100 -8 -14 -148
5057 -148 -283 -3 -371 -454 75 -366 -196 -49 -204 -91 -317 -279 80 -312 -131 -372 -167 126 -92 -165 53
5078 53 -76 -79 -11 154 49 -49 26 37 21 104 131 67 27 -136 57 123 171 125 -229 95 -108 -11 -55 -95 16 87
5104 87 345 -32 302 258 268 -29 169 422 -105 182 -117 -88 359 -82 -36 83 118 -47 -51 -168 229 119 -19
5127 -19 6 -108 -56 -189 -170 23 -125 -109 50 -205 -169 -158 283 -149 19 -177 -160 -166 -1 -51 89 -72 -163 -60
5151 -60 76 -181 54 -93 -82 -272 -319 -95 -174 -231 -38 -161 -159 -81 -167 -170 -1 73 -116 188 39 -16 35 4 146
5176 146 -97 145 118 -134 -31 -352 20 -79 102 69 77 -40 113 206 170 217 102 77 -204 -50 221 -187 179
5199 179 214 313 424 292 -61 270 -17 129 116 80 510 -135 -37 127 287 -99 31 43 -146 75 -199 106
5221 106 -8 330 115 -295 70 -178 -1 92 -35 -216 -74 -122 -181 -1 -152 -123 -362 120 -71 -297 -206 -147
5243 -147 -218 0 -330 -211 -78 -115 65 -195 -142 -159 -407 157 -171 -383 162 -159 27 -47 136 33 69 -90
5265 -90 98 -187 -159 262 -161 158 72 120 -50 373 213 -94 338 33 44 166 27 123 209 268 26 126 35
5288 35 -28 143 18 209 172 143 48 176 60 148 286 9 308 53 264 118 45 -133 125 96 -102 60 180
5311 180 149 -141 -204 144 -73 -246 -27 60 -22 -390 -5 -211 -296 -327 -77 -116 144 82 39 -188 -23 -219 11
5334 11 -257 -81 -357 -9 -10 -321 143 -235 99 -181 -222 -91 31 -147 74 -263 -181 -269 -231 251 -124 132
5356 132 -203 -172 174 -86 -97 337 182 106 314 68 44 -232 371 454 -12 -237 105 17 144 -27 -54 272
5378 272 -23 166 240 330 -78 297 181 150 132 138 214 -125 6 90 184 -40 7 96 -169 160 278 179 195 -160
5402 -160 -206 -260 17 -99 222 -235 -262 -159 -122 -164 -10 75 -51 -91 -361 -62 -281 -20 -288 -46 -278 -126
5424 -126 -97 -74 -161 -119 -119 -4 -63 62 -39 -182 -85 172 135 -165 -48 -231 -9 163 -167 -133 92 -58 88
5447 88 185 96 -51 94 2 -4 -113 -76 -70 -18 140 29 120 17 14 26 132 308 434 -193 248 61 -153 80 31
5472 31 235 -238 -173 394 295 -15 46 1 312 -104 219 173 -52 -210 74 -107 -69 -14 -86 161 -109 36 -15
5495 -15 -169 -66 336 -137 -22 -122 -131 -12 -269 -6 -51 -123 26 253 -139 101 -29 155 48 -92 105 -376
5517 -376 181 30 -170 15 -176 -240 -40 -143 -129 148 -361 29 24 -223 -54 -26 -124 6 7 -169 278 121 416
5540 416 -45 83 -58 -76 4 24 161 227 230 -100 202 341 256 190 -66 89 94 197 81 352 -52 -131 59 171
5564 171 255 -93 45 281 57 -152 125 74 -176 -34 21 -48 196 195 51 -185 83 -73 36 -57 -65 -153 -94 -105
5588 -105 -18 -39 202 115 -83 -58 -191 -241 -141 219 185 -268 -184 -231 -301 -43 -105 -136 -106 -62 133 -211 -332 -6
5612 -6 -4 -267 -190 -153 -213 117 225 335 -348 -147 -94 -22 -112 108 -198 269 -120 -127 202 -138 270 133 -110 255
5636 255 221 131 180 76 272 75 -136 26 170 135 -195 403 221 146 233 422 169 203 215 58 -16 213 137
5659 137 -27 -10 -134 112 -74 -6 -237 158 37 -58 557 -9 44 -270 -59 -214 216 161 68 -26 -356 -152
5681 -152 -77 122 138 -74 81 -327 -286 -162 -251 -201 124 -217 106 -36 -109 -75 -129 37 -289 -341 -9 -48 -206
5704 -206 70 -24 132 -94 -174 276 -105 -10 -85 -35 -113 -117 -8 50 -25 -84 153 36 230 -115 -12 -49 131 -22
5728 -22 118 147 -8 -80 271 -66 -68 149 -117 -9 99 176 -172 144 31 2 16 68 7 94 -146 187 -84 -6
5752 -6 349 79 91 151 -313 -23 -115 123 80 -99 -57 -1 229 -253 -106 -302 -32 -14 136 -185 -173 59 -294
5775 -294 -60 142 -417 118 -80 -17 -399 -107 88 -80 87 69 -171 24 -81 -330 -314 37 -133 -100 -96 169
5797 169 191 -98 -198 -263 12 -347 309 -37 34 47 -77 -2 173 -82 147 -157 76 -6 377 -149 181 300
5819 300 -143 -240 -208 140 89 36 221 157 150 181 132 74 88 124 98 50 14 99 291 -24 81 155 172 -33 101 98 183
5846 183 14 18 95 -21 -210 12 -17 14 -170 -91 123 -236 225 -89 -141 191 -183 61 9 -258 -86 14 -71
5869 -71 -77 -19 -107 -126 -390 -28 74 -196 -37 -175 49 86 -382 -42 38 -37 -83 -286 -234 -179 -255 -12 217 -142
5893 -142 -85 -12 168 25 141 -44 16 -68 248 171 269 302 83 171 287 347 -142 -127 -120 237 4 -89 77 56 93
5918 93 -23 95 84 7 78 130 148 -68 142 140 -88 115 246 -169 117 146 96 -10 37 -4 161 107 389 39
5942 39 265 -13 -22 126 -69 -73 -221 -79 75 -101 3 -115 -14 -81 -201 -122 -198 -8 16 -166 -56 -145 -67 -95
5966 -95 -43 12 -25 -119 -5 2 -215 -84 158 64 19 -86 105 -61 31 -54 -20 111 -51 77 -6 -110 -72 19 -134
5991 -134 70 -1 2 -299 94 323 -127 68 162 -120 -71 6 88 87 194 68 -4 257 6 136 191 52 -48 91
6015 91 91 -27 100 -1 41 329 -124 79 350 326 -189 98 95 165 -146 -143 -52 -73 186 96 43 -65 217 27 45
6040 45 -49 -194 13 -3 -41 -76 4 -247 -100 -271 -315 -45 -170 120 -255 -33 -395 -384 -49 -69 -57 38 -319 -325
6064 -325 19 127 72 154 46 46 106 316 61 89 43 -70 11 -111 15 138 -141 208 12 -90 -63 122 84
6087 84 -96 -58 41 -58 20 -24 38 -3 270 -46 124 52 169 -148 87 138 102 -50 286 106 32 278 38 142
6111 142 103 103 -91 -142 16 8 -182 50 18 -74 -26 -45 -124 67 63 17 -72 -139 -37 -173 -276 -319 -153 -4 -252 -476
6137 -476 -213 -1 -199 -224 -158 -367 -195 195 -97 139 -7 -94 -220 -240 104 -105 -206 -48 -314 -147 138
6158 138 -321 49 -168 -58 5 150 -47 170 -18 -116 112 -212 34 -59 234 167 -8 274 54 362 121
6179 121 112 274 364 92 172 -268 315 97 -103 -99 -7 -19 144 124 351 285 98 227 91 55 -47 55 -37 22
6203 22 -273 2 281 -52 11 -72 -107 132 -69 170 24 351 86 -331 -203 -98 75 -148 192 -170 42
6224 42 -129 44 167 -201 -123 73 -6 46 -53 -122 -105 -51 225 42 -220 52 -347 -52 -214 -143 -246 -110 33
6247 33 -222 -248 176 -91 -266 105 -26 252 161 201 39 -76 -230 97 -123 -132 -32 -3 146 143 -272 219 -23
6270 -23 -209 -112 -140 -167 3 -108 256 -9 295 -118 -75 16 293 85 -74 284 92 178 65 156 56 220 -29
6293 -29 35 -94 355 -34 -52 -124 141 71 -134 -188 21 -38 129 -185 192 276 -384 -135 -40 -47 -300 -25 -143 -72
6317 -72 -242 -26 163 -28 -110 -153 -62 -154 10 -80 -330 167 427 -56 -90 -130 -162 -201 -27 -161 -53 -31 -150 -69
6341 -69 -10 -2 13 24 -80 486 34 80 128 -65 36 76 98 428 145 8 152 -61 78 130 222 -156 -25 -30 -144
6366 -144 85 106 155 -141 -68 12 336 74 47 146 83 131 1 11 112 132 -120 162 62 270 205 87 113 143
6390 143 -39 236 225 176 -100 -227 -267 108 -195 270 176 -93 -140 -202 61 -104 -216 -164 -80 -157 -78 -181 -86 -125
6414 -125 106 -185 -19 -20 -24 -139 -105 232 -306 -145 -73 -7 -65 -244 93 -88 109 -207 -175 -93 -125 67 22 181
6438 181 -6 186 79 -19 -228 174 119 -49 144 -9 -147 262 -78 13 93 -22 168 -92 -101 143 -98 -74
6460 -74 -111 243 234 -54 261 50 177 14 229 80 -36 -110 83 -175 97 -245 -69 25 145 -204 -181 -4
6482 -4 -41 35 -164 80 40 66 -21 -138 31 40 -329 -93 -43 4 14 -347 80 178 94 -43 -37 29 -171 61 -133 -169
6508 -169 -96 -421 -53 331 154 -137 -188 35 -57 -176 154 21 55 -53 359 155 -9 -13 -50 200 42 -15 8
6531 8 -89 -7 178 -67 126 124 0 205 221 16 173 -198 65 45 69 52 33 134 287 1 96 -41 -83 -50 -165
6556 -165 127 -175 -100 247 -67 142 -175 -231 95 -156 -93 -103 64 -90 160 -359 -145 -231 -32 -111 -148 -166 -239
6579 -239 329 -27 -335 130 173 -140 -23 89 -84 -9 -113 203 98 -77 -158 -77 -67 262 93 -40 -86 -7
6601 -7 -93 -104 113 173 -17 15 105 53 -26 -62 -119 -273 20 -97 154 -92 -90 51 228 -300 -39 41 -207 43 -156
6626 -156 -104 -306 255 -124 71 83 50 320 1 31 -27 69 227 96 -91 223 24 -250 -127 29 -111 51
6648 51 192 -191 -35 228 155 80 8 156 -187 -34 -105 123 168 288 -129 109 94 -135 -41 -14 -40 272 -239
6671 -239 140 -297 -156 -4 124 -309 85 -59 -21 -15 -26 -14 -64 -17 -166 40 -158 -88 -234 -123 105 -172 239
6694 239 -38 8 137 57 51 186 56 208 141 -76 160 133 -55 424 222 -49 184 117 98 -132 107 165 -183
6717 -183 158 161 148 212 317 178 -8 72 -57 -208 -40 51 -79 141 114 132 95 -8 70 45 -38 198 10 116
6741 116 -133 126 -68 -62 -58 -182 162 -72 -119 -46 290 -171 -201 -196 52 -290 188 -128 -210 -140 -147 122 -88 -230
6765 -230 -236 -152 68 -123 -178 5 166 -76 -27 24 -109 53 86 -152 253 175 -4 108 -94 -100 63 167 4
6788 4 167 -137 360 25 6 -5 -33 40 229 106 -118 25 -220 -9 120 279 320 58 44 136 112 42 50 92 -119
6813 -119 243 121 221 -52 -100 69 338 15 40 68 -95 -150 -187 241 -76 -47 117 28 -121 -82 -29 -23 204 -357
6837 -357 -198 -148 -1 115 -25 3 -45 -231 13 129 -87 14 -34 -152 -99 -58 135 335 34 195 -124 -122 180
6860 180 -194 -43 136 -8 97 -54 127 214 -168 -189 -51 -105 87 18 -86 23 34 -22 -109 -4 -8 -64 72
6883 72 -116 56 196 -43 -44 -69 -38 84 166 67 182 -45 16 -400 103 61 43 190 91 -28 177 162 74 -43
6907 -43 73 68 239 -203 190 188 -42 202 -130 78 98 44 -22 45 109 26 -78 151 -144 -65 29 190 196 69 212
6932 212 135 66 43 -111 58 315 -273 316 -81 -64 -16 -46 -158 -23 -88 -43 -71 -89 -116 128 41 -157 -62 -209
6956 -209 -83 151 173 -131 63 -157 -10 -112 -47 -71 84 101 8 246 127 106 -173 -107 186 57 83 -28 -66
6979 -66 119 -17 4 -125 -141 -135 -23 -48 -16 -208 123 106 64 -29 -7 253 -123 166 -29 -96 185 -164 47 241
7003 241 -21 -174 20 25 26 48 -208 282 -32 -187 -12 58 284 51 -102 8 21 267 141 -61 -224 115
7025 115 112 2 -261 -12 -6 -106 -92 134 -274 -103 -61 -127 139 48 86 -58 -17 -162 -62 -314 -2 -75 158 -198
7049 -198 310 6 70 77 -137 20 75 35 -49 87 4 -156 243 130 306 -85 -220 208 -183 -130 -20 44 -15
7072 -15 255 273 22 178 296 49 -164 180 84 207 93 -4 242 84 -60 -59 167 176 -55 -28 -84 78 -120
7095 -120 -147 101 -107 54 74 -63 -141 -101 230 117 -25 -146 179 -169 20 63 30 86 -6 224 -44 135 154
7118 154 27 59 -127 -41 -110 -131 -52 -150 -24 -216 -16 113 71 -98 99 118 189 -124 -1 -101 49 -99 136
7141 136 -51 -106 82 89 40 189 154 -55 -9 -185 -45 -197 -79 -118 -78 -32 217 -194 -113 -320 -16 61 146 -349
7165 -349 222 48 346 106 255 -69 -52 130 -186 98 219 201 38 -25 -23 -70 66 68 67 84 367 216 15 160
7189 160 14 48 13 2 77 104 159 -44 -52 -4 9 69 -101 80 -26 166 -102 -306 -27 -192 -310 257 -177 14
7213 14 -342 -1 -19 -44 163 -209 -3 -53 -147 -30 -2 117 203 -140 -13 38 -204 -99 21 -41 -63 -157 273 -155
7237 -155 -138 -219 53 55 185 152 -106 185 173 -127 -199 -89 69 -200 185 -40 163 96 170 -91 -40 -124 234 -22
7261 -22 237 78 95 112 -155 185 179 -47 -34 169 33 -81 123 33 173 -88 -177 15 -149 19 -49 202 313
7284 313 43 30 49 -87 -9 -119 -76 -114 5 -105 160 70 115 -31 206 248 168 -200 274 30 24 64 -47 -196
7308 -196 10 -211 122 65 150 -33 -178 51 124 -221 18 31 3 -130 15 -116 304 -260 138 -104 -122 -63
7330 -63 -148 139 125 150 80 191 -150 64 -76 -145 -39 45 195 90 -8 47 230 -22 -141 189 33 -82 57
7353 57 -22 16 -154 -80 -117 121 3 94 35 -74 129 222 136 214 -69 71 -37 -73 86 92 -175 -208 76 -31 -151
7378 -151 108 59 -315 -49 148 126 -46 -39 -89 -1 -18 112 -29 36 -121 132 99 276 -188 122 -110 -72 96
7401 96 63 110 -149 181 -205 100 156 21 -29 183 102 -133 -152 -321 -111 -34 -80 -122 -208 -106 -158 -129 -24 267
7425 267 -83 -66 14 -142 168 -214 224 154 -51 108 -193 74 -78 346 60 -62 156 -140 191 19 312
7446 312 92 -3 -86 -10 -75 -24 -46 26 233 -116 -166 -39 55 24 261 -49 58 3 -97 -17 -94 11 129 -61
7470 -61 364 65 -350 -186 -28 -87 -133 71 -158 108 57 45 130 199 -25 80 8 -119 215 -31 -131 220 31
7493 31 2 -193 84 86 -90 66 39 -297 74 -64 131 244 36 180 27 29 -158 207 86 113 28 225 67
7516 67 55 -141 -122 -205 165 221 57 184 126 77 171 -324 40 -63 -62 139 -109 -100 159 51 121 -177 -96 -322 -130
7541 -130 -112 -200 273 -105 78 161 -296 158 49 -31 99 -12 -208 23 80 -21 -48 -198 115 -44 92 -42
7563 -42 92 137 -4 -188 102 44 314 -123 -70 320 99 -61 -94 95 58 62 -129 -115 -177 22 -11 -41 48 111 -239
7588 -239 -75 44 -123 89 22 -143 -130 -151 -10 -257 186 -50 56 -11 56 232 12 -129 93 -174 -134 103
7610 103 107 106 54 -68 165 23 -134 27 319 82 -157 85 -106 -112 -61 -4 43 168 216 118 -66 -352 274 100
7634 100 1 74 -182 118 -52 76 170 62 -248 19 -169 53 -218 -22 55 103 185 -55 88 36 241 -17
7656 -17 -42 -194 -67 -148 318 -35 -272 -26 -72 57 -54 -1 46 -71 -86 -355 22 49 37 -118 -287 165 -181
7679 -181 -16 -14 -22 -139 -129 -273 -67 -18 201 -186 -36 -75 295 -10 203 -136 -274 1 -112 128 -244 106
7701 106 256 -142 26 34 -75 -148 13 -45 144 -81 -57 -214 -116 219 -102 -135 125 -347 -34 73 72 108 -51
7724 -51 -231 -117 -29 25 105 174 -82 -50 35 -175 -306 -158 62 62 -28 -47 -139 -192 130 -136 162 -121 236 229 62
7749 62 -116 -150 28 -38 290 -214 -181 85 55 -72 121 185 117 55 -50 -136 -51 -10 23 -47 -11 -184 -57 -54 -68 -116
7775 -116 -189 2 -60 35 -143 -29 54 70 31 -144 19 42 169 -239 -20 -56 50 70 -32 -125 -114 103 -27 152
7799 152 8 -75 191 256 152 -22 -161 -3 102 211 -215 -91 -12 -106 -218 -246 16 19 175 -215 -138 96 97
7822 97 82 66 -292 7 -8 -128 155 -23 -84 104 -49 -6 -63 -16 -195 -125 -218 -41 -71 -123 201 113 165 60 104
7847 104 62 -138 -102 124 -2 208 160 97 -311 41 128 -75 47 358 -46 -4 259 -100 -5 -136 -116 -55 170
7870 170 -181 190 122 -35 41 -42 10 -4 109 270 29 -112 277 34 -210 -128 53 73 -239 -20 -110 111 -146
7893 -146 -118 -39 7 -175 -7 159 107 115 -37 -49 -95 141 -35 72 403 -131 -136 181 47 44 50 271 127 110 58
7918 58 305 14 64 110 -92 -251 26 40 109 15 -127 97 -86 117 -40 118 -92 4 -159 -35 -66 107 -90
7941 -90 -149 34 -119 83 77 -49 -82 148 222 213 -89 -2 233 160 9 -129 205 -83 -7 152 203 -8 152 157 -49
7966 -49 145 200 -14 66 45 -133 59 254 -183 50 56 109 -39 -279 182 51 -83 -160 107 -56 -144 -222 -100
7989 -100 51 -12 -302 -42 -164 -75 96 -7 -153 -139 166 68 -211 213 27 93 -132 -74 -10 118 -377 156
8011 156 145 -173 -10 -129 104 -13 -159 133 -116 104 -292 -125 8 -24 130 136 208 184 23 -70 226 -33
8033 -33 15 -63 63 -105 -77 -283 -56 -157 48 -70 40 32 -120 202 -126 54 -227 -47 26 -42 -49 173 -35
8056 -35 41 149 -330 49 -288 -1 -120 -43 52 95 -108 -55 -1 134 101 -120 602 293 -19 186 32 -16 2
8079 2 -208 -59 -26 55 40 19 243 8 -110 -161 -122 -41 -25 -13 156 147 -145 -203 38 -278 -10 -286 -245 -236 18 250
8105 250 254 29 -194 -316 -166 21 -6 147 144 21 3 145 -65 -47 62 58 141 375 244 123 67 -256 21 88
8129 88 -83 114 -22 -199 -103 152 -222 -14 -22 41 -41 147 27 -92 0 -7 -1 -154 246 -91 215 96 97 11 -50
8154 -50 113 -48 -89 221 157 53 286 90 83 -240 -257 -170 223 -100 83 -35 -191 -50 -126 5 13 260 95
8177 95 -8 226 -91 -3 85 -173 179 -97 35 -144 52 -129 180 -165
8191a65
##END NTUPLES=NMR FID
##END=
